##TITLE=AC1476_ZJAMBMO302_8100948_ds12Kev9lv
##JCAMPDX= 6.0         $$ Bruker NMR JCAMP-DX V2.0
##DATA TYPE= NMR SPECTRUM
##DATA CLASS= NTUPLES
##ORIGIN= BRUKER
##OWNER= Administrator
$$ 1.72 TOPSPIN		Version 2.1
$$ 2013-07-31 16:19:36.562 -0700  Administrator@X
$$ Compression mode = diff/dup
##.OBSERVE FREQUENCY= 400.02188249412
##.OBSERVE NUCLEUS= ^1H
##.ACQUISITION MODE= SIMULTANEOUS (DQD)
##.ACQUISITION SCHEME= undefined
##.AVERAGES= 8
##.DIGITISER RES= 22
##SPECTROMETER/DATA SYSTEM= spect
##.PULSE SEQUENCE= zg30
##.SOLVENT NAME= COFFEE_meoh
##.SHIFT REFERENCE= INTERNAL, COFFEE_meoh, 1, 14.98509
##AUDIT TRAIL= $$ (NUMBER, WHEN, WHO, WHERE, PROCESS, VERSION, WHAT)
$$ ##TITLE= Audit trail, TOPSPIN		Version 2.1
$$ ##JCAMPDX= 5.01
$$ ##ORIGIN= Bruker BioSpin GmbH
$$ ##OWNER= Administrator
$$ $$ E:\/data/COFFEE/nmr/AC1476_ZJAMBMO302_8100948_ds12Kev9lv/10/pdata/1/auditp.txt
$$ ##AUDIT TRAIL=  $$ (NUMBER, WHEN, WHO, WHERE, PROCESS, VERSION, WHAT)
(   1,<2013-07-31 16:19:30.108 -0700>,<Administrator>,<X>,<go>,<TOPSPIN 2.1>,
      <created by zg
	started at 2013-07-31 16:18:23.280 -0700,
	POWCHK enabled, PULCHK disabled,
       configuration hash MD5:
       C8 4E 4E 5D D3 5C D8 9E 9F 52 82 E0 59 8A DE 15
       data hash MD5: 64K
       1A AC 12 9D 7B 2C 36 86 C3 0F 45 BC 29 42 89 69>)
(   2,<2013-07-31 16:19:32.968 -0700>,<Administrator>,<X>,<proc1d>,<TOPSPIN 2.1>,
      <Start of raw data processing
       efp LB = 0 FT_mod = 6 PKNL = 1 PHC0 = 0 PHC1 = 0 SI = 32K 
       data hash MD5: 32K
       98 8D 3A D9 8B 9A 2E F1 7E 7B EA D2 C5 A4 B3 AF>)
(   3,<2013-07-31 16:19:33.265 -0700>,<Administrator>,<X>,<proc1d>,<TOPSPIN 2.1>,
      <pk PHC0 = 99.09119 PHC1 = 0 
       data hash MD5: 32K
       0D FF 66 7C 16 7A 95 2E 34 A9 10 DB 69 8A AA 0C>)
(   4,<2013-07-31 16:19:33.358 -0700>,<Administrator>,<X>,<proc1d>,<TOPSPIN 2.1>,
      <abs ABSG = 1 
       data hash MD5: 32K
       09 F7 05 FB 94 3B EF 1E CD A8 2F B9 FD 61 48 22>)
(   5,<2013-07-31 16:19:33.421 -0700>,<Administrator>,<X>,<proc1d>,<TOPSPIN 2.1>,
      <abs ABSG = 2 
       data hash MD5: 32K
       2B 24 3B D8 F0 1E B6 41 F9 45 C4 32 87 1F 77 6C>)
(   6,<2013-07-31 16:19:33.468 -0700>,<Administrator>,<X>,<proc1d>,<TOPSPIN 2.1>,
      <abs ABSG = 3 
       data hash MD5: 32K
       31 F6 F3 C2 7A A0 B0 14 32 D1 19 D1 AF 22 44 FF>)
(   7,<2013-07-31 16:19:33.530 -0700>,<Administrator>,<X>,<proc1d>,<TOPSPIN 2.1>,
      <abs ABSG = 4 
       data hash MD5: 32K
       43 F4 37 76 3D 26 5E 6B 5B 11 30 2B 5D 43 B6 B0>)
(   8,<2013-07-31 16:19:33.577 -0700>,<Administrator>,<X>,<proc1d>,<TOPSPIN 2.1>,
      <abs ABSG = 5 
       data hash MD5: 32K
       B0 2D C0 CA C8 FB 91 F4 D7 A3 91 29 44 E8 1D 68>)
$$ ##END=
$$ 
$$ $$ hash MD5
$$ $$ 6E AC 08 74 1A C1 A9 CF 5B F5 74 B9 4C 99 7B BA
##$RELAX= 
##$RELAX= 
##$RELAX= 
##$RELAX= 
##$RELAX= 
##$RELAX= 
##$RELAX= 
$$ Bruker specific parameters
$$ --------------------------
##$DU= <E:\>
##$EXPNO= 10
##$NAME= <AC1476_ZJAMBMO302_8100948_ds12Kev9lv>
$$ [...]
##$TP= (0..7)
150 150 150 150 150 150 150 150
##$TP07= 0
##$TPNAME0= <>
##$TPNAME1= <>
##$TPNAME2= <>
##$TPNAME3= <>
##$TPNAME4= <>
##$TPNAME5= <>
##$TPNAME6= <>
##$TPNAME7= <>
##$TPOAL= (0..7)
0.5 0.5 0.5 0.5 0.5 0.5 0.5 0.5
##$TPOFFS= (0..7)
0 0 0 0 0 0 0 0
##$TUNHIN= 0
##$TUNHOUT= 0
##$TUNXOUT= 0
##$USERA1= <user>
##$USERA2= <user>
##$USERA3= <user>
##$USERA4= <user>
##$USERA5= <user>
##$V9= 5
##$VALIST= <valist>
##$VCLIST= <CCCCCCCCCCCCCCC>
##$VD= 0
##$VDLIST= <DDDDDDDDDDDDDDD>
##$VPLIST= <PPPPPPPPPPPPPPP>
##$VTLIST= <TTTTTTTTTTTTTTT>
##$WBST= 2048
##$WBSW= 25
##$XGAIN= (0..3)
0 0 0 0
##$XL= 0
##$YL= 0
##$YMAX_a= 664060
##$YMIN_a= -563440
##$ZGOPTNS= <>
##$ZL1= 120
##$ZL2= 120
##$ZL3= 120
##$ZL4= 120
##$ABSF1= 14.98509
##$ABSF2= -5.573092
##$ABSG= 5
##$ABSL= 3
##$ALPHA= 0
##$AQORDER= 0
##$ASSFAC= 0
##$ASSFACI= 0
##$ASSFACX= 0
##$ASSWID= 0
##$AUNMP= <proc_prof1d_extract_pilot.lims>
##$AXLEFT= 0
##$AXNAME= <>
##$AXNUC= <1H>
##$AXRIGHT= 0
##$AXTYPE= 0
##$AXUNIT= <>
##$AZFE= 0.1
##$AZFW= 0.1
##$BCFW= 0
##$BC_mod= 0
##$BYTORDP= 0
##$COROFFS= 0
##$CY= 15
##$DATMOD= 1
##$DC= 0
##$DFILT= <>
##$DTYPP= 0
##$F1P= 0
##$F2P= 0
##$FCOR= 0.5
##$FTSIZE= 32768
##$FT_mod= 6
##$GAMMA= 0
##$GB= 0
##$INTBC= 1
##$INTSCL= 1
##$ISEN= 128
##$LB= 0
##$LEV0= 0
##$LPBIN= 0
##$MAXI= 10000
##$MC2= 0
##$MEAN= 0
##$ME_mod= 0
##$MI= 0
##$NCOEF= 0
##$NC_proc= -8
##$NLEV= 6
##$NOISF1= 0
##$NOISF2= 0
##$NSP= 0
##$NTH_PI= 0
##$NZP= 0
##$OFFSET= 14.98509
##$PC= 1
##$PHC0= 99.09119
##$PHC1= 0
##$PH_mod= 1
##$PKNL= yes
##$PPARMOD= 0
##$PPDIAG= 0
##$PPIPTYP= 0
##$PPMPNUM= 2147483647
##$PPRESOL= 1
##$PSCAL= 4
##$PSIGN= 0
##$PYNMP= <proc.py>
##$REVERSE= no
##$SF= 400.02
##$SI= 32768
##$SIGF1= 0
##$SIGF2= 0
##$SINO= 400
##$SIOLD= 32768
##$SPECTYP= <>
##$SREGLST= <1H.CDCl3>
##$SSB= 0
##$STSI= 32768
##$STSR= 0
##$SW_p= 8223.68421052631
##$SYMM= 0
##$S_DEV= 0
##$TDeff= 65536
##$TDoff= 0
##$TI= <>
##$TILT= no
##$TM1= 0
##$TM2= 0
##$TOPLEV= 0
##$USERP1= <user>
##$USERP2= <user>
##$USERP3= <user>
##$USERP4= <user>
##$USERP5= <user>
##$WDW= 1
##$XDIM= 32768
##$YMAX_p= 458271514
##$YMIN_p= -785487
##$CURPLOT= <Network HP LaserJet P1505>
##$CURPRIN= <$Network HP LaserJet P1505>
##$DFORMAT= <normdp>
##$LAYOUT= <+/1D_H.xwp>
##$LFORMAT= <normlp>
##$PFORMAT= <normpl>
##$SURQMSG= 1
$$ End of Bruker specific parameters
$$ ---------------------------------
##NTUPLES= NMR SPECTRUM
##VAR_NAME=  FREQUENCY,     SPECTRUM/REAL,   SPECTRUM/IMAG
##SYMBOL=    X,             R,               I
##VAR_TYPE=  INDEPENDENT,   DEPENDENT,       DEPENDENT
##VAR_FORM=  AFFN,          ASDF,            ASDF
##VAR_DIM=   32768,         32768,           32768
##UNITS=     HZ,            ARBITRARY UNITS, ARBITRARY UNITS
##FACTOR=    0.250966925370066, 1,           1
##FIRST=     8223.43324360094, -82063,       6780
##LAST=      0,             -145351,         -67546
##MIN=       0,             -785487,         0
##MAX=       8223.43324360094, 458271514,    0
$$ Real data points
##PAGE= N=1
##DATA TABLE= (X++(R..R)), XYDATA
$$ [...]
19532B11f5402A7390J7176h5279a3438l9121E1516b91819J32316j59819i2008
19520B03536a99199J4279c2616k10242B92314c1445B17356c403k52456H816J1642
19509B0458L60942a43757b7109A32809a25738j92381a8298j109B0209h0096A80911
19497G9373D458i5767r2561k3740M1829j85556J26214M9180B2098f1591F6872
19485g639A86207d6299k43671O0846h978k80468R7209k28122C3933b15108A07063
19473B09340g3736K1020j3019B11661c819F4732j7431c6847h315p617A7022g6394
19460I1980a14086F3366J5360j4875a22140p165j13903N8623d6249a5872G9647
19448b17836F4830b10655r1950f7677o6217Q349a1252E1015a23021d350r4749
$$ plain form
19532 211 -65402 17390 34566 -85279 -13438 -52559 51516 -291819 -159503 -319322 -92008
19520 203536 -199199 -184920 -32616 -242858 292314 -31445 217356 -3403 -255859 8816 20458
19509 20458 381400 -143757 -27109 132809 -125738 -318119 -18298 -19407 20209 -80096 180911
19497 79373 4458 -95767 -188328 -212068 -170239 -355795 -229581 -180401 22098 -61591 66872
19485 -7639 186207 -46299 -289970 -229124 -8978 -289446 -192237 -420359 33933 -215108 107063
19473 209340 -73736 -52716 -65735 211661 -3819 64732 47301 -36847 -8315 -15932 17022 -76394
19460 91980 -114086 63366 78726 63851 -122140 -129305 -243208 -184585 -46249 -15872 79647
19448 -217836 64830 -210655 -302605 -67677 -133894 -125545 -11252 51015 -123021 -4350 -99099
19437i9099k54550I4260J8082e24850A86051E3138M4157b80380A72065A8660b4853
19425c10908a40794n3582A6899J22702a01477d8535k27734A10334a13395n9833
19415a73228j9567e485C95262G5901d92150a31212f4362K321a1402A25007a72955
19403I6537a01550a1922l06989J57477j38148a01480j02093D1574d55520J36243
19393c19277J57151A78708e78752f4130k29777E2419a68142A29449b033I9531
19382B05327a664D4794h2938D674J31572a92666B54327b06558j51926b7502a116
19370A15784E1122i7131j01577g765B65537b04487l5589k1288C3715a06080j54845
19359b60925B39806b0416n5382E8285a10833j01128H1357p760M8670e565n9310
$$ plain form
19437 -99099 -353649 94260 112342 -524850 186051 53138 97295 -280380 172065 18660 -24853
19425 -310908 -140794 -194376 16899 139601 -101477 -48535 -276269 110334 -113395 -173228
19415 -173228 -192795 -5485 395262 75901 -492150 -131212 -64362 -62041 -11402 125007 -172955
19403 96537 -101550 -11922 -318911 -161434 -299582 -101480 -203573 41574 -455520 -319277
19393 -319277 -162126 178708 -578752 -64130 -293907 52419 -168142 129449 -2033 99531
19382 205327 -1664 44794 -82938 4674 136246 -192666 254327 -206558 -358484 -27502 -1116
19370 115784 51122 -97131 -198708 -7765 265537 -204487 -240076 -261364 33715 -106080 -260925
19359 -260925 239806 -20416 -75798 58285 -110833 -211961 81357 73597 122267 -5565 -64875
19348f4875p1976A47234a79701M0199A94032c848j29344F6995f5473B13118a10924
19336d95B6310b70445b7979j54738O5928A1003e2114D0876a93620k9620C5101
19324h0705k40370a09707j64483G1089a40176m9654Q5161b8938k15584a09228
19313f6386A25369g7342j30775g0387j83109j3486D6879L686a26948B158a12066
19301a87109A14132e9352p1193j79020a51499A89226P0501k2004G3228a42029
19290b08262m8163N1235b7494m77516A08790c2117A94413I5037a9470l87719a93289
19278D1141c3456k18147q2553F9878a06498O087A4908a42837E626L9464b30269
19266a81415H8942f000B8098N0057L8984A823b6685p9828B7966c11444c2621a5016
$$ plain form
19348 -64875 -136851 147234 -179701 -139502 194032 -3848 -133192 66995 -65473 213118 -110924
19336 -495 26310 -270445 -27979 -182717 -116789 11003 -52114 40876 -193620 -223240 35101
19324 -80705 -321075 -109707 -274190 71089 -140176 -189830 -104669 -28938 -244522 -109228
19313 -66386 125369 -77342 -208117 -70387 -253496 -266982 46879 50565 -126948 2158 -112066
19301 -187109 114132 -59352 -130545 -309565 -151499 189226 259727 237723 73228 -142029
19290 -208262 -256425 -205190 -27494 -505010 108790 -32117 194413 95037 -19470 -407189 -193289
19278 41141 -33456 -251603 -334156 69878 -106498 -100411 14908 -142837 5626 45090 -230269
19266 -181415 88942 -6000 28098 78155 117139 1823 -26685 -106513 27966 -311444 -32621 -15016
19253c2030k7258j16536h2367l8550B63435j20101D4367a79351B80224E4809J86219
19242B41028C411O6262a28043o9974e8005D3067M8914L1470b20677r955A5254
19230d0081p8988M1279k1168C34726b06758C81675b15616R0552A6213h3543o2965
19219a46508b103A40803b41433D0064Q5396b12637j70756f4932P253l3063o419
19208i7161K0922C37918g2853l0267K0465j51867B34217a61416N4126n6247D0757
19196I3502d2585F5539c8255G1124a2130m21573A67604a12585p4196l94977a50067
19184c75171a19034M8763k2558j98748h502j9783j15995o0393A09359a77874o9930
19173b47804e1892k12408b4473r2759L6975D8283b13862E1785c67243h4618i223
$$ plain form
19253 -32030 -59288 -175824 -82367 -120917 263435 143334 44367 -179351 280224 54809 241028
19242 241028 3411 69673 -128043 -198017 -58005 43067 91981 123451 -220677 -230632 15254
19230 -40081 -119069 -77790 -98958 334726 -206758 381675 -215616 -125064 16213 -83543 -146508
19219 -146508 -2103 140803 -241433 40064 125460 -212637 -383393 -64932 -57679 -90742 -97161
19208 -97161 -76239 337918 -72853 -103120 -82655 -234522 234217 -161416 -107290 -163537 40757
19196 93502 -42585 65539 -38255 71124 -12130 -433703 167604 -112585 -186781 -581758 -150067
19184 -375171 -119034 -70271 -92829 -291577 -8502 -28285 -144280 -204673 109359 -177874 -247804
19173 -247804 -51892 -264300 -24473 -117232 -80257 48283 -213862 51785 -367243 -84618 -9223
19161a50063M5383d7561j50666A61574A6881c11052D6636C679N3298c41831G6003
19149f7125j53308N5498j53589B35797c94536h9437q5088M6122B0971a60500k20727
19138c81227A8883K2292b08133A44111h4508C5664b33056d9553B9717N5049a34020
19126d7011A67544c1065j73013F3795a87608A5497K4339g1606l35981J73125A59773
19114F76b6186j53921Q3863r811k08385A87495l1177a62321j09665a19476k07780
19103c27256A80512i4008j02349r35g850j60853A09357P1844b94562f8106n0785
19092a18891k8680C4515c16290g1695k74770a61182J4746O2485b44m99010a71719
19080c72193A50200C4094J39696c35162A25747E6549d47590G6055l3145J08348
$$ plain form
19161 -150063 -104680 -47561 -198227 161574 16881 -311052 46636 3679 56977 -341831 76003
19149 -67125 -220433 -164935 -318524 235797 -394536 -89437 -174525 -128403 20971 -160500 -381227
19138 -381227 18883 41175 -208133 144111 -84508 35664 -233056 -49553 29717 84766 -134020
19126 -47011 167544 -31065 -204078 63795 -187608 15497 39836 -71606 -407587 -234462 159773
19114 676 -26186 -180107 -96244 -106055 -314440 187495 156318 -162321 -271986 -119476 -327256
19103 -327256 180512 -94008 -196357 -197292 -7850 -168703 109357 181201 -294562 -68106 -118891
19092 -118891 -147571 34515 -316290 -71695 -346465 -161182 -146436 -83951 -244 -499254 -171719
19080 -372193 150200 34094 173790 -335162 125747 56549 -447590 76055 42910 151258
19070A51258b44385K4676H1713j9058m285a58531E8913b48657j36656a02806b8384
19058D1316a26010j58910M4838J2644i2150A47234B0255g9483I257c61210i8483
19046b50655d5929q7308l51747A00956g3386k02710F2555h2875B00865g1183o4819
19035a36002B98745m2764K09965B3395f3796A935K16605H2116L0097n674m7122
19024E9417K25663a5969F5142M2625Q480f3808C6252a16782A42214M9719a03813
19012f8654C30244E818b27425N8712P2497A89886b03282B35479b33042C1557J10314
19001A41871c06755a07943L4594A11568a27253I6568c05027A98664b2617k12244
18991b34861A1527J65278d4937A25857c70115A84895a0055j47173D40259b9489
$$ plain form
19070 151258 -244385 -219709 81713 62655 58370 -158531 58913 -248657 -385313 -102806 -28384
19058 41316 -126010 -284920 -240082 -227438 -92150 147234 20255 -79483 9257 -361210 -98483
19046 -250655 -45929 -133237 -484984 100956 -73386 -276096 62555 -82875 200865 -71183 -136002
19035 -136002 298745 255981 465946 23395 -63796 1935 218540 82116 112213 106539 59417
19024 59417 285080 -15969 65142 107767 116247 -63808 36252 -116782 142214 191933 -103813
19012 -68654 330244 5818 -227425 -168713 -96216 189886 -203282 235479 -233042 31557 141871
19001 141871 -306755 -107943 -73349 111568 -127253 96568 -305027 198664 -22617 -234861
18991 -234861 11527 176805 -44937 125857 -370115 184895 -10055 -157228 440259 -29489
18980B7067a12935c955j24l1063j58434k7473C18801a53462O7207p5613g2557
18968a86658h13k42613J18818p068m1592e5524k28570R486A49840a82550B27233
18956H9535M4246k3425j5511K65403A46984b94236d2829h791E0589a14992H7614
18944A6628R7731r631q387d25175g2608A4362J25211L1881a39824m4416j16703
18933c00943J06075a1943m93330e1993j30358j13339A56117J99141h9611k39011
18923c28622d4680j47128p7106n3154a25020A446a57262A76849C6341d2840l13946
18912c56786A83434B4989D80a48282H6709a38327d1995J6442A45836b27820o8338
18901b96158I083a04678B09786c32541Q5233j73656a62482N0705A98378h708k89665
$$ plain form
18980 27067 -112935 -3955 -4079 -35142 -193576 -221049 318801 -153462 -86255 -161868 -72557
18968 -186658 -813 -243426 -124608 -131676 -173268 -55524 -284094 -274608 149840 -182550 227233
18956 89535 133781 110356 94845 360248 146984 -294236 -42829 -8791 50589 -114992 87614
18944 16628 114359 104728 96341 -425175 -72608 14362 139573 171454 -139824 -184240 -300943
18933 -300943 -194868 -11943 -505273 -51993 -182351 -295690 156117 355258 -89611 -328622
18923 -328622 -44680 -191808 -268914 -322068 -125020 1446 -157262 176849 36341 -42840 -356786
18912 -356786 183434 24989 480 -148282 86709 -138327 -41995 -25553 145836 -227820 -296158
18901 -296158 9083 -104678 209786 -332541 -247308 -420964 -162482 -111777 198378 -8708 -298373
18890b98373B9831a806k36916r338n1882H787f0179D8391c22667I0560R7755a58694
18877d04441a96941Q9903D5998L2293g5329c0441G6221b54579i4761K4809o3304
18866a33256a8814l0808j53971r7630f6060o0419F972b36643H4450M0002A7382
18854A28724i0875A53511C9413J86726p1496K54649j95705p984Q7234R1555b15888
18842a36516j81017A4998e3943A26750J46930c42719a08667j93253C79879A33404
18831i3173A11901a51986p8419C55246D80a84394A06i5834M0466n4929A34502
18819A49463B8835i4198b3183j59006A9816J57670a46402e8953b2803B00394a94813
18807A74053M99133f2995j5484j248A34163a52170o7451A08886b92789I5311N881
$$ plain form
18890 -298373 29831 -1806 -238722 -248060 -299942 8787 -60179 48391 -322667 90560 188315 -158694
18877 -404441 -196941 -107038 45998 78291 -75329 -30441 76221 -254579 -94761 -69952 -133256
18866 -133256 -18814 -49622 -203593 -301223 -66060 -126479 6972 -236643 84450 124452 17382
18854 128724 -90875 153511 39413 226139 154643 409292 213587 205603 292837 384392 -215888
18842 -136516 -317533 14998 -53943 126750 273680 -342719 -108667 -301920 379879 133404
18831 -93173 111901 -151986 -230405 355246 480 -184394 106 -95834 -55368 -110297 134502
18819 149463 28835 -94198 -23183 -182189 19816 177486 -146402 -58953 -22803 200394 -194813
18807 174053 673186 -62995 -78479 -79727 134163 -152170 -219621 108886 -292789 95311 101192
18796A01192e0645A73346E4036a05580a50m2470C06984j47605F6340c78507a06154
18784a49356o0177b1867q6309j80932a7781d29k35532G5061j7053c5045k98997
18773c34042h2910A15317g184k59123C50031F2190e1532C5769b4597p8847M8792
18762e4652o1914m4950K1101K5284J249j31734A46664B0449a56322A96329c93249
18750b193I2544a93962l86925i6349A67122N6812a05929G1685O7122b61859B75752
18738A79350b13231B40396a12555a142k94576D2625J83119a16748A78068c40053
18727g4892j82018F840a15385j01929j44190J25492p2739a29578k23258A05769
18716d0730r0977q2814C06000j52260a0013m4709G4482b49494C35902b66011N5285
$$ plain form
18796 101192 -50645 173346 54036 -105580 -150 -42620 306984 159379 66340 -378507 -106154
18784 -149356 -209533 -21867 -108176 -289108 -17781 -429 -235961 75061 58008 -35045 -334042
18773 -334042 -82910 115317 -7184 -266307 350031 62190 -51532 35769 -24597 -103444 -54652
18762 -54652 -116566 -161516 -140415 -115131 -113882 -245616 146664 20449 -156322 196329 -393249
18750 -2193 92544 -193962 -580887 -96349 167122 223934 -105929 71685 138807 -261859 275752
18738 179350 -213231 240396 -112555 -1142 -295718 42625 225744 -116748 178068 -340053
18727 -74892 -256910 6840 -115385 -217314 -361504 -236012 -308751 -129578 -352836 105769
18716 -40730 -131707 -214521 306000 153740 -10013 -54722 74482 -249494 335902 -266011 -210726
18705b10726b9675k08304m4084r2228H532a35767A95018f945k64186J14641B60917
18693g2522c1534r14A2751e6035k48055K4669H0327J52011c43522E8791a24849
18681a81395A47133c50729a1849F8549J46568c7534C4210a18575r3379l0377B89188
18669a18715j52772a00897l52141f6620A27434c81006C72759c79563O7420h0566
18658B67008b00659A14829a10533B31728A11397a14727A3346a03481B01801r2133
18648A09668b22444J03334K9183j64670g6618q1230f0785B0789a4170A05380b09637
18636A19073a07566A21412a68126A77959C3888a21532e8394n06085a49716F6055
18625B19211i0003k36239f8769A60128F3642K0035h4865j21235c396I3453a12955
$$ plain form
18705 -210726 -29675 -237979 -282063 -374291 8532 -135767 195018 -6945 -271131 -156490 260917
18693 -72522 -31534 -32448 12751 -56035 -304090 -279421 80327 232338 -343522 58791 -124849
18681 -181395 147133 -350729 -11849 68549 215117 -37534 34210 -118575 -211954 -242331 289188
18669 -118715 -271487 -100897 -453038 -66620 127434 -381006 372759 -379563 -312143 -80566
18658 267008 -200659 114829 -110533 231728 111397 -114727 13346 -103481 201801 109668
18648 109668 -222444 -119110 -89927 -254597 -76618 -157848 -60785 20789 -14170 105380 -209637
18636 119073 -107566 121412 -168126 177959 33888 -121532 -58394 -564479 -149716 66055
18625 219211 -90003 -326242 -68769 160128 63642 83677 -84865 -206100 -3396 93453 -112955
18613A4017b24269A96460D7761c26299a14723l9096O7392A41624a42212k74940
18603d17152J62013h4547C0162c427j58828B05419F7011f5922l06816F7148b23876
18591H1786a08255i062B4831D646a16634k25228p8906F5457J4443h3170n884A43838
18578b26685i0968D3628B1577r195h3404n0083M4629i818n3107o1820k97241J69485
18566b52501a04098d7305j09222B23514H1886c25770B46013H0976P2141B2054
18555g8094j78428B00070b62459B04357a91821g3646C07277G7540a55273D1908
18544g5029F2014M4912b78890F8903R9487k5567a41518k09888g8981o0250D276
18532b132A38013F173a14972l33318A41388c5501l99353D6865a27618e8458C319
$$ plain form
18613 14017 -224269 196460 47761 -326299 -114723 -153819 -86427 141624 -142212 -417152
18603 -417152 -255139 -84547 30162 -3427 -162255 205419 67011 -65922 -372738 67148 -223876
18591 81786 -108255 -9062 24831 4646 -116634 -341862 -420768 65457 79900 -83170 -89054 143838
18578 -226685 -90968 43628 21577 12382 -83404 -133487 -88858 -9818 -62925 -124745 -421986 -252501
18566 -252501 -104098 -47305 -156527 223514 81886 -325770 246013 80976 153117 22054
18555 -78094 -256522 200070 -262459 204357 -191821 -73646 307277 77540 -155273 41908
18544 -75029 62014 106926 -278890 68903 168390 142823 -141518 -351406 -78981 -139231 4276
18532 -2132 138013 6173 -114972 -448290 141388 -35501 -434854 46865 -127618 -58458 3319
18520B26630b5181A39915b30066e5653j91519c6738B25643g4069b342G3001c9531
18508b827B7020L36539a38427l3303J6857j23126D7275a22047k81347a49767I2176
18496a30320j10287g1136B2496f4322D3994q336a45118j29867R9536f9270B0616
18484e4202q3056D0197e8085M40D1071h4994C0169a04269o0908G2810b27388b9859
18471a89415f7474A36142E6301a16772j175j75438A64662c66737d4879m2500k22785
18460c10164J42835O5453A75605P4871H3926M2166c343o9648p2076d5261j87384
18449b32645E6289e0153A49740a17939K7529M863L0333o3498q3952a01201E07437
18437c7317A03025b21411a4026j06425d3609k05761h1285r7878f2035E1731a93610
$$ plain form
18520 226630 -25181 139915 -230066 -55653 -247172 -36738 225643 -74069 -2342 73001 -39531
18508 -2827 27020 363559 -138427 -171730 -154873 -277999 47275 -122047 -403394 -149767 92176
18496 -130320 -240607 -71136 22496 -64322 43994 35658 -145118 -274985 -175449 -69270 20616
18484 -54202 -137258 40197 -58085 -57645 41071 -84994 30169 -104269 -165177 72810 -227388 -29859
18471 -189415 -67474 136142 56301 -116772 -117947 -293385 164662 -366737 -44879 -87379 -310164
18460 -310164 -167329 -101876 175605 250476 83926 126092 -3343 -72991 -145067 -45261 -232645
18449 -232645 56289 -50153 149740 -117939 -90410 -85547 -55214 -118712 -202664 -101201 507437
18437 -37317 103025 -221411 -14026 -120451 -43609 -249370 -81285 -179163 -62035 51731 -193610
18425a4341j18020N0279P830B80553d4026j19884B43326c22641A97141H1090b2249
18413C5126d0473l0873a9461D5719a37147A3206K4862K21939D6962L12558E95
18401B1213N7746a36764D45664b18572C24485c72077J38138L8744k91870B5583
18390b03308B9502M45086a49464g0690k74664a7235K031k02696L6838G4973a05124
18378b72771J18123E5114b03226B4558M5580a60972C21911E6048Q235b35214k05140
18367d40354B5894J3956K84806A19344c63245E08100A81363K23091L7235j94272
18357B47417q2627a87552A55451b00579F1947d3134p9626j30885K1587a13933
18346B8836b09642P5242j04883f5892n4186j36847G039a71744A31443c95640f9605
$$ plain form
18425 -14341 -132361 -82082 -74252 280553 -44026 -163910 243326 -322641 197141 81090 -22249
18413 35126 -40473 -71346 -19461 45719 -137147 13206 38068 260007 46962 359520 595
18401 21213 78959 -136764 445664 -218572 324485 -372077 -233939 -195195 -487065 25583
18390 -203308 29502 474588 -149464 -70690 -345354 -17235 -15204 -217900 -181062 74973 -105124
18378 -272771 -154648 55114 -203226 24558 70138 -160972 321911 56048 64283 -235214 -440354
18367 -440354 25894 39850 324656 119344 -363245 508100 181363 404454 441689 247417
18357 247417 164790 -187552 155451 -200579 61947 -43134 -122760 -253645 -232058 -113933
18346 28836 -209642 -134400 -239283 -65892 -120078 -256925 7039 -171744 131443 -395640 -69605
18334a01143k8133k62140a44179g0056A47341b60291M9315b0389k20924o2832
18324c04145J40639M1884k7509A4206d7813A5173e8813l8923b3459o664B70442
18312a66479m2045l23519a80383m474O163e0157j02709r734C3547a25809N1809
18301g4000B8161r297P6595c19631B09464l3901e8820C8875J04680a62460K9958
18290a32502A87513a02558A82238a36901f6388A13285D550b4474j80545B1653
18279B02603O5589a34228F1110a43715m9897C6104A6083l382J74489e0411A81250
18267b54815b2393A19529a03673A36370f1025a4657A6362c38705B41450b17912
18256A14398a50131A672h6437A66511J0271c06631a28808K0944I149h6891m4251
$$ plain form
18334 -101143 -129276 -391416 -144179 -70056 147341 -260291 -210976 -20389 -241313 -304145
18324 -304145 -163506 -121622 -149131 14206 -47813 15173 -58813 -97736 -23459 -30123 270442
18312 -166479 -208524 -532043 -180383 -184857 -178694 -50157 -152866 -162600 33547 -125809 -74000
18301 -74000 28161 18864 95459 -319631 209464 175563 -58820 38875 143555 -162460 -132502
18290 -132502 187513 -102558 182238 -136901 -66388 113285 4550 -24474 -205019 21653
18279 202603 268192 -134228 61110 -143715 -193612 36104 16083 12701 187190 -50411 181250
18267 -254815 -22393 119529 -103673 136370 -61025 -14657 16362 -338705 241450 -217912
18256 114398 -150131 1672 -86437 166511 176782 -306631 -128808 -107864 9149 -86891 -131142
18245a31142o2713n9413h7224k01744d2930k34117Q5907A1905b9392k4485J8562
18234c5315j93083a06508k10276a35522c4794B03401b49041J15297E1747f1455
18223a07541D00821F0485J03317a69905B939a12027q3063A81432c5473J0093C15698
18211b7082l18461a48717C41949H0542e319r4137E538M31202d3372n3101I7755
18199c74765A76794a69778I0296J45581p2301b59557B6376b15728J4487b1485
18188b07929C0717b31465b3076j96450D14424A04411k185a62948A26564n8544
18178F8020e06730A39949n2759f9303f503p9742B52723b25411L0324A19367m8856
18167G0511a91901g959l53358e0712F8369L86441c30505Q9181A28436O9274F0164
$$ plain form
18245 -131142 -193855 -253268 -87224 -288968 -42930 -277047 -191140 11905 -29392 -53877 -35315
18234 -35315 -228398 -106508 -316784 -135522 -34794 203401 -249041 -133744 51747 -61455
18223 -107541 400821 60485 163802 -169905 2939 -112027 -195090 181432 -35473 -25380 315698
18211 -27082 -345543 -148717 341949 80542 -5319 -99456 5538 436740 -43372 -96473 97755
18199 -374765 176794 -169778 90296 235877 163576 -259557 26376 -215728 -201241 -21485
18188 -207929 30717 -231465 -23076 -219526 414424 104411 102226 -162948 126564 68020
18178 68020 -506730 139949 87190 -69303 -6503 -86245 252723 -225411 -195087 119367 70511
18167 70511 -191901 -7959 -361317 -50712 68369 454810 -330505 -241324 128436 197710 60164
18155b19975b3846l26118a21354H5383a48372C37241a94799B9238J52152c78657
18144b10581i6136a5342k48028A86932f9724r1658O6438j29661F7411j7406J4592
18133F4597c8667A59490O18J63606F9874a92770h4127k65157R5817B50010a02226
18121B36664b05341B97120a17026C00507j47218k91b28526D126J57955p9167l1839
18110E1075j9998m544c07888a3472j3302k33599B5633J45750a02443A911J444
18099C355b92444N9084A01494a30939q2216R8730j65000A67021f521F4746d19815
18087A05942K29557B8320K82631c21990P8344A19782L9687C8810L7162d365j21189
18076a25554j88835a03550q3150e840F5422d50820K09356g6983o9539e0566C03494
$$ plain form
18155 -219975 -23846 -349964 -121354 85383 -148372 337241 -194799 29238 181390 -378657
18144 -210581 -96136 -15342 -263370 186932 -69724 -161382 -94944 -224605 67411 50005 64597
18133 64597 -38667 159490 160108 323714 69874 -192770 -84127 -349284 -253467 250010 -102226
18121 236664 -205341 297120 -117026 300507 153289 152998 -228526 4126 162081 82914 51075
18110 51075 31077 26533 -307888 -13472 -26774 -260373 25633 171383 -102443 1911 3355
18099 3355 -292444 -233360 101494 -130939 -213155 -114425 -279425 167021 -6521 64746 -419815
18087 105942 335499 28320 310951 -321990 -243646 119782 159469 38810 75972 -4365 -125554
18076 -125554 -314389 -103550 -186700 -5840 65422 -450820 -241464 -76983 -146522 -50566 303494
18064B6845J08538a05832M9602l00307A33102a52214K4982B8622P7497b82189
18053A23705b16095d5400a6505A12657b43005e4390B47637b33873E0514A7248
18042D9082K14966B3947K10705c4710o0970o0761M145m7339C8649O8295c15521
18030C8478J77110b71355J03473B9858e4428b2042A87710a64767c3290j1368n7437
18019a02095r8724L5069a1107k05132I4818l3517g8135m450j2439l1871O904D37023
18006A31450a90795c0417A10651c65290A88149a16524I567J7373a81615B79136
17995H1756a09420A27507a09651B34397B5707b0989m7424b0332m7642A30439a59698
17983B29174G3189a65831o0801i3588J7731i939O66p9565j90808L6346B46630
$$ plain form
18064 26845 135383 -105832 -56230 -356537 133102 -152214 -127232 28622 106119 -282189
18053 123705 -216095 -45400 -16505 112657 -243005 -54390 247637 -233873 50514 17248
18042 49082 264048 23947 234652 -34710 -95680 -156441 -152296 -199635 38649 106944 -315521
18030 38478 215588 -271355 -167882 29858 -54428 -22042 187710 -164767 -33290 -44658 -102095
18019 -102095 -200819 -165750 -11107 -216239 94818 61301 -78135 -82585 -95024 -126895 -119991 437023
18006 131450 -190795 -30417 110651 -365290 188149 -116524 9567 26940 -181615 279136
17995 81756 -109420 127507 -109651 234397 25707 -20989 -68413 -20332 -67974 130439 -159698
17983 229174 73189 -165831 -226632 -93588 -75857 -9939 -9273 -88838 -279646 -243300 246630
17971C91436a45394E1642a66581e1364m2634H8170d7553r0803j12802A70129b5220
17959b23558Q2409A67234K4447d0700k03492D9453a0760B18985r8684a16195j53678
17948b69873a1766j9598k52599R6987I1585m3036a36080j30102d6562A11629a12154
17936B88100A39891J33913N9626i5404A47193d31878E8131b07447K9936A42111
17925B87906b09158A17026d30881f750B3886J3344b1032E5852r784h5775k6164
17914a11939D2887J35850L16629a90377h1941j86298G9913K63499a0776r461o1659
17903h1896C3789O0897b50803a19041o3113H1734a81904A17420f4878j5381k71884
17892c52143J59880B2842J15192a04841F312J75744o3783b63707Q6960f0709A74679
$$ plain form
17971 391436 -145394 51642 -166581 -51364 -93998 88170 -47553 -138356 -251158 170129 -25220
17959 -223558 -141149 167234 191681 -40700 -244192 49453 -10760 218985 120301 -116195 -269873
17948 -269873 -11766 -31364 -283963 -186976 91585 48549 -136080 -266182 -46562 111629 -112154
17936 288100 139891 273804 333430 -95404 147193 -431878 58131 -207447 -177511 142111
17925 287906 -209158 117026 -430881 -6750 23886 37230 -21032 55852 46068 -85775 -111939
17914 -111939 42887 178737 495366 -190377 -81941 -268239 79913 343412 -10776 -20237 -81896
17903 -81896 33789 94686 -250803 -119041 -182154 81734 -181904 117420 -64878 -80259 -352143
17892 -352143 -192263 22842 138034 -104841 6312 182056 118273 -263707 -176747 -60709 174679
17880a91586B47886f7446m62062a83793A38232n9437g6049n3445C22296e1412
17869a00839m09182C7360a52563O1282H3790q665g2327l8841I7375b96493A03175
17857a89428A5299a31182n8678j41949A12261J40144J34201a4903A05170h5681
17846a53843K0243d2770B34518f9976g756j14184k69107a03236D63614I0678B1350
17834A6103K57710a24194A41460a66257k42954B5817M7131c38994C66353c5870
17823b93143A93799b46402G4329J61193J72247c98577i7984H2712g2328B07667
17812a26528A57115b1946E5023a36573C3748J07579J34409Q6137j4061c7736E989
17800B57730d04207A90899I531b08442r8153i6501M6607k99929J35855A86322
$$ plain form
17880 -191586 247886 -67446 -529508 -183793 138232 78795 -76049 -129494 322296 -51412
17869 -100839 -510021 37360 -152563 -91281 83790 75125 -72327 -111168 97375 -296493 103175
17857 -189428 15299 -131182 -189860 -331809 112261 252405 386606 -14903 105170 -85681
17846 -153843 -133600 -42770 234518 -69976 -7756 -121940 -391047 -103236 463614 90678 21350
17834 16103 273813 -124194 141460 -166257 -409211 25817 72948 -338994 366353 -35870
17823 -293143 193799 -246402 74329 235522 407769 -398577 -97984 82712 -72328 207667
17812 -126528 157115 -21946 55023 -136573 33748 141327 275736 361873 347812 -37736 5989
17800 257730 -404207 190899 9531 -208442 -306595 -96501 -49894 -349823 -213968 186322
17789b38410c7020A24784J071c5559r0787A34742C2787O6713e3965A25867J70359
17778B96226h2960J9072I0312b57120o3414A24687f3897A28704c34344E0718O7484
17767A18202c45817J69963b5597A56690F0784b60309l4125j0042J42310M0202
17757a21964B19750a61476b2063C23045A09151J8579a1295A55291J98258E0446
17746A21832B6190b2209k65198H9012J68436a04509E3372f262j40840F0727J15703
17735A76430a35615K3505B32522a49096K0118j67135J5415A67518Q615d9156j88169
17724b37325d3245k2325B19462b09605A45673a06554j5760k8076d9374B5224c55045
17712A04691M6403e7072j26055A80172J35381A11673a90976b2567C20434H8070
$$ plain form
17789 -238410 -37020 124784 125855 -35559 -126346 134742 32787 99500 -53965 125867 296226
17778 296226 -82960 -63888 90312 -257120 -320534 124687 -63897 128704 -334344 50718 118202
17767 118202 -345817 -175854 -25597 156690 60784 -260309 -294434 -304476 -162166 -121964
17757 -121964 219750 -161476 -22063 323045 109151 127730 -11295 155291 353549 50446
17746 121832 26190 -22209 -287407 89012 257448 -104509 53372 -6262 -147102 60727 176430
17735 176430 -135615 -112110 232522 -149096 -128978 -296113 -280698 167518 176133 -49156 -237325
17724 -237325 -43245 -65570 219462 -209605 145673 -106554 -122314 -150390 -49374 25224 -355045
17712 104691 151094 -57072 -183127 180172 315553 111673 -190976 -22567 320434 88070
17701a2680j41956c4419B5833a34823j90533A79094n6842E9211J11398b4011k13679
17690b37690B78594b2883I7186J70836b96985c6904B02271a56131f6255H467J26717
17679A35184J8662a25521j2369d6034m0750D104a57510A30564h2897p1579A59519
17667A69203c2294B1523J29387n9334a8070F55140a87778O5304N0832l8764H6584
17655A602a72568l2427A2095J59508L1898r6302a1330H2421i9927A62066d036
17643A17581C3549a55493B41454f038D05878j09618a35368B40162a97609F2718
17632a1439B9406a63763K5438A1180N0155k6306a51476K0857L7180A70555q0558
17621H9997j1725a8673j72894i1130B8571b27080g4839A47217c1828m0428l2958
$$ plain form
17701 -12680 -154636 -34419 25833 -134823 -325356 179094 122252 59211 170609 -24011 -237690
17690 -237690 278594 -22883 97186 268022 -296985 -36904 202271 -156131 -66255 8467 135184
17679 135184 153846 -125521 -137890 -46034 -86784 4104 -157510 130564 -82897 -154476 159519
17667 169203 -32294 21523 150910 91576 -18070 655140 -187778 -122474 -71642 -110406 86584
17655 1602 -172568 -204995 12095 171603 203501 107199 -11330 82421 -99927 162066 -4036
17643 117581 33549 -155493 241454 -6038 405878 296260 -135368 240162 -197609 62718
17632 -11439 29406 -163763 -138325 11180 61335 35029 -151476 -130619 -93439 170555 89997
17621 89997 78272 -18673 -191567 -91130 28571 -227080 -74839 147217 -31828 -72256 -105214
17610a05214A01632k5540c94488a76702A7041K43299H3057J61244a62781C28796
17599E7818P7335i070A44720K55847a41892O5010A73927Q3297H657a30161n7715
17588a87876Q9073M3856j57247B58540a50311q523e3391B85340D9917P119b44186
17576B21126g3151i712C9504c7268A11014a52563M9550A89968e2098j35006A21584
17564a39830L2521H2354c3923j11569B50175H7049a5548E8993a01765G4006J6906
17553I0912C3701a70017C4537a14164B50907J9871I5652a76048a5874A39369B671
17541A07120a8758F3626i8644F4338N9336i2534p3867A42251A3812L27814A07383
17529C41528A45001K8944c6674B36789A16856I153b13459e7594C91165j33356
$$ plain form
17610 -105214 101632 76092 -394488 -176702 17041 260340 83057 244301 -162781 328796
17599 57818 135153 -9070 144720 400567 -141892 -76882 173927 257224 8657 -130161 -187876
17588 -187876 -98803 -54947 -212194 258540 -150311 -158834 -53391 285340 49917 57036 -244186
17576 221126 -73151 -9712 39504 -37268 111014 -152563 -103013 189968 -52098 -187104 121584
17564 -139830 -107309 82354 -33923 -145492 250175 87049 -15548 58993 -101765 74006 90912
17553 90912 33701 -170017 34537 -114164 250907 270778 95652 -176048 -15874 139369 2671
17541 107120 -18758 63626 -98644 64338 123674 -92534 -166401 142251 13812 341626 107383
17529 341528 145001 173945 -36674 236789 116856 9153 -213459 -57594 391165 257809
17519B57809n0806O3386e0944B46036F0463a15554B10366a84690L8533D9626J2572
17508F2198J39726a78102A99149D3876j4654f654H1795J89822k5547C1480L18131
17497C49611B7122e3731A07773p137J90424p0440B1063b5982j64067D2033J41687
17486A83720a51628j56935A00701A1524N345b1325B62988F6477j5385J76845F2999
17474B78828e5613C42630j40443o7470l8858i8099o1014b1566D63951A00050N22
17463A00572a16674A10862N7786Q5943G5372O3262J10960E7827P3715J95669G28
17451A45097N2398K19570k9782A45671D9324P948J40175K42892k15975a02659
17440B06176P4327J7901J42848A42877J85337K00923o6881j69563j12839N030
$$ plain form
17519 257809 207003 270389 -50944 246036 60463 -115554 210366 -184690 -146157 49626 62198
17508 62198 201924 -178102 199149 43876 29222 -6654 81795 271617 246070 31480 349611
17497 349611 27122 -53731 107773 100636 291060 220620 21063 -25982 -190049 42033 183720
17486 183720 -151628 -308563 100701 11524 16869 -21325 262988 66477 51092 227937 62999
17474 278828 -55613 342630 202187 134717 95859 -98099 -159113 -21566 463951 100050 100572
17463 100572 -116674 110862 168648 254591 75372 138634 249594 57827 131542 327211 728
17451 145097 197495 417065 387283 145671 49324 57272 197447 440339 224364 -102659
17440 206176 280503 298404 441252 142877 328214 529137 462256 292693 179854 184884
17430A84884j0992p6523J62085a32945E74406B5453e2998A51217r949Q8462K53440
17419D83170C8434J78744A01291M99540O9963l04013A21276J01411L66149A63335
17408D98093a20656B18152J41028A15022B8246M3043L8839R0166h3055A04821
17397B98840M8190j13105B0720J32595J74954A04017k7329f5632J6077n7548A48774
17385B35579o7975K69209B0722c7304C15764a9071B28673a4634A06582a40400
17374H8311i5106A18579k3590J83372Q2369a77525A34146J49024H3847M3793a19577
17362D04028N4038A66433J35780a90249B17258e9290a6342A13973N4407F679g4128
17350G7283J07290J18256e4821A44233J3800Q0242M64833A15144J14950o2655
$$ plain form
17430 184884 173892 97369 259454 -132945 574406 25453 -52998 151217 141268 229730 483170
17419 483170 38434 217178 101291 600831 670794 366781 121276 222687 588836 163335
17408 498093 -120656 218152 359180 115022 28246 71289 110128 200294 -83055 104821
17397 298840 347030 233925 20720 153315 328269 104017 76688 -65632 -49555 -107103 148774
17385 235579 167604 436813 20722 -37304 315764 -19071 228673 -14634 106582 -140400
17374 88311 -95106 118579 94989 278361 360730 -177525 134146 283170 83847 127640 -119577
17362 404028 458066 166433 302213 -190249 217258 -59290 -16342 113973 168380 6679 -74128
17350 77283 184573 302829 -54821 144233 158033 238275 703108 115144 230094 167439
17340A67439J29545a09726D63965b16579B92858M5527j49259k2285M02930F7317
17329f8795C43125A01787J21383C1853M8667a0679B2752L80108r9348a68866C39053
17317A8184J97070m0808O0040a85737D39389A24056K14649A35907M202E3593M340
17306E7933b0153B28477C6713a01398a8675A00388K16171A04894C6435K3172K17106
17295B76713J0825l4680r9538n1081k7888P7929l8942D4999L28064e9384B22683
17283D43781m2334j81146J5161J55969B2722J23382K85742A40185C5810M25559
17273D61369e681A16190B6845P1981K64073j19625I1323a2870m5306Q890A96598
17261A95716E9345K40490B4030K61273c9120D20518I2838g1907C7882J75074J52835
$$ plain form
17340 167439 296984 -109726 463965 -216579 292858 338385 189126 166841 569771 67317
17329 -68795 343125 101787 223170 31853 80520 -10679 22752 402860 303512 -168866 339053
17317 18184 215254 174446 234486 -185737 439389 124056 338705 135907 140109 53593 57933
17306 57933 -20153 228477 36713 -101398 -18675 100388 316559 104894 36435 59607 276713
17295 276713 287538 252858 153320 102239 74351 152280 113338 44999 373063 -59384 222683
17283 443781 401447 220301 235462 391431 22722 146104 431846 140185 35810 461369
17273 461369 -5681 116190 26845 98826 362899 243274 91323 -12870 -58176 -49286 196598
17261 195716 59345 299835 24030 285303 -39120 420518 92838 -71907 37882 212956 365791
17250C65791j26065j01473o5335h0916A13201R629j5817a47952A47338K4492M934
17239A76764l0430b3126A08288a7968C19851J27758j54275D5997K34350j5916
17229B64431q1176L17646A50924J15334r2602K56071o8170A56822g8083B7752
17218C11295o1913k658J11466O0921C2940J08633K62392A34304Q9905a7986A40188
17206A1181O1799M18325l2247K165m2236j32791m8836A17607j665K4218n5998
17195H4162J14710Q9401K9979A13761J32568A07027N7414o5747J16155J95990
17185D10839A15205L5105p3729J89401j16907L07870k09882O2078j05918p5449
17175A27774K06054j33973P5332K21009B09401A02589J17533J47655c0721A74153
$$ plain form
17250 365791 239726 138253 72918 -80916 113201 122830 107013 -147952 147338 171830 176764
17239 176764 146334 -23126 108288 -17968 319851 447609 293334 45997 280347 264431
17229 264431 183255 500901 150924 266258 173656 429727 361557 156822 -78083 27752
17218 311295 249382 246724 358190 419111 32940 141573 403965 134304 224209 -17986 140188
17206 11181 72980 491305 459058 461223 418987 286196 237360 117607 115942 140160 84162
17195 84162 198872 288273 318252 113761 246329 107027 164441 98694 214849 410839
17185 410839 115205 150310 76581 265982 149075 456945 247063 309141 203223 127774
17175 127774 333828 199855 275187 496196 209401 102589 220122 367777 -30721 174153
17164B6674K54609j33066J74758j54327L1696m2610R7896J99833C796K61011J26661
17153C91468J05171j61200o5438N282m1309D0877K65036K45399R3320C09411A42059
17141B96500a65308A82273M07512k48472q4388L47968d3194A10282M35883j09581
17131D36584k4348I8465L4818R2418J54448k2097M87041C52726J3630M2007O6539
17120D74902P4880j00036K45100o6472B27978k2437L16360j46770j21127k1536
17110B32468J05398J46996J00717j80344K84173j03172j8112B35416K61036j11767
17100C84685J30315J8578k54283K25729J1141j29563L26505l07354j66679J26728
17090C65802K22133j82880L05773j2753j691C05092K23408k63859M1366O9005
$$ plain form
17164 26674 281283 148217 322975 168648 200344 157734 255630 455463 3796 264807 391468
17153 391468 496639 335439 270001 275283 233974 40877 305913 551312 644632 309411 142059
17141 296500 -165308 182273 589785 341313 256925 604893 -43194 110282 546165 436584
17131 436584 412236 98465 133283 225701 380149 358052 845093 352726 366356 408363 474902
17120 474902 549782 449746 694846 628374 227978 205541 521901 375131 254004 232468
17110 232468 337866 484862 585579 405235 689408 586236 568124 235416 496452 384685
17100 384685 515000 533578 279295 505024 516165 386602 713107 405753 239074 365802
17090 365802 587935 405055 710828 698075 696384 305092 528500 264641 306007 375012
17080C75012P4214J03516J26308k7861o6661j90811j06156N80047C23869L36149
17070F60018B18283J54210M91327l76535o8053J77401j36972K27242C10938J87197
17060D98135K9M2999L4608j31826B01599L41722q0175J11290j46954J81762M3254
17049F52498q8831k1207R1730q4261K73888C48235L59893k38877J49739r4132
17039E24858J61783J79077N7091B33373N30532k55763L18562o6342j88768r4419
17029D77175L7845K3444p2647K32642l199j45780n8570o7319M91770p5209r2853
17018G47299O793J19647l36013J40326J26365J16962l23185K91754j77580R3808
17008H06176K47016D64813N06878m5005J3681l05711L58879m34208L57959k54721
$$ plain form
17080 375012 449226 552742 679050 651189 584528 393717 287561 867608 323869 660018
17070 660018 218283 372493 863820 487285 419232 596633 459661 686903 310938 498135
17060 498135 498164 541163 575771 443945 201599 543321 463146 574436 427482 609244 652498
17049 652498 563667 542460 634190 549929 823817 348235 708128 469251 618990 524858
17039 524858 686641 865718 922809 233373 763905 508142 826704 760362 571594 477175
17029 477175 515020 538464 465817 698459 695260 549480 490910 423591 915361 840152 747299
17018 747299 754092 873739 537726 678052 804417 921379 598194 889948 712368 806176
17008 806176 1053192 464813 971691 926686 940367 634656 993535 559327 917286 662565
16998F62565K95469m31405J30632J75985J78035q065j90695J97781p3447N480
16988I42335k3471n2207k33668L40578q956o0733L26654k34493j50566K53735
16978A099208R0125k08587J47718j62381J34600l0224m3257j94347n0823N70285
16968A352317l78220J00343J05564K28225j87299k91307J71109o5722R1177k8318
16958A097869J63961m8069j51817L73476m74115M02137r6202M629k42804O0028
16948A089093K86018j31896N8140k94294J37647N05289k52468l6487J94315r5883
16938A459474J55756j95362j03338m5352L95523j78595p4206J99488k81650K16169
16928A547907N785j3044N9664j65476J93847o429k85768N62410o7781k02295K27449
$$ plain form
16998 662565 958034 526629 657261 833246 1011281 1003216 812521 1010302 936855 942335
16988 942335 918864 866657 632989 973567 964611 903878 1230532 996039 845473 1099208
16978 1099208 1189333 980746 1128464 966083 1100683 1070459 1027202 832855 782032 1352317
16968 1352317 974097 1074440 1180004 1408229 1220930 929623 1100732 1035010 1126187 1097869
16958 1097869 1261830 1213761 1061944 1435420 961305 1363442 1267240 1271869 1029065 1089093
16948 1089093 1375111 1243215 1301355 1007061 1144708 1649997 1397529 1361042 1555357 1459474
16938 1459474 1615230 1419868 1316530 1271178 1666701 1488106 1413900 1613388 1331738 1547907
16928 1547907 1553692 1540648 1600312 1434836 1628683 1622254 1336486 1898896 1831115 1628820 1856269
16917A856269m7827j14827K78895j29900K57001n50235N55651n30402M83838k16490
16907A841973J72206J57321j05150j44853K92634l27278K23953j14947K90897
16898B286756k85273K23010M4409R0763k03641m5084J9862R1836M3942m4174J15594
16887B338000J56473o3117K08259n2022L7012K06035n6992k77678P925M04506
16877B908401k57907j79537M63727L8079k9398K3270q7565K31077J23862l58933
16867B875076k78351O63711K69368m59446P8713K28686k31157L53006M3758J20401
16857C663765l67406N72137l37832J82995J67959K03488k32012J76181R6699k08911
16847C917063j73681N84318N0137j49514J75568J26806R5832k21814K21963M4066
$$ plain form
16917 1856269 1808442 1693615 1972510 1842610 2099611 1549376 2105027 1574625 2058463 1841973
16907 1841973 2014179 2171500 2066350 1921497 2214131 1886853 2110806 1995859 2286756
16898 2286756 2001483 2224493 2268902 2359665 2156024 2110940 2130802 2222638 2266580 2222406 2338000
16887 2338000 2494473 2431356 2639615 2587593 2624605 2830640 2773648 2495970 2503895 2908401
16877 2908401 2650494 2470957 2934684 2972763 2943365 2966635 2879070 3110147 3234009 2875076
16867 2875076 2596725 3260436 3529804 3070358 3149071 3377757 3146600 3499606 3543364 3663765
16857 3663765 3296359 3868496 3530664 3713659 3881618 4085106 3853094 4029275 4125974 3917063
16847 3917063 3743382 4327700 4377837 4228323 4403891 4530697 4626529 4404715 4626678 4670744
16837D670744J15986J70224N60662m28905J1126J5448J03616M6041K89700p8178
16827E476464m8124N91087J38918O4274j37373M58630q7328L66313k8786J74723
16817F968798K60850l11273K78264K03106J25894L76343j31812M36700Q3817J91047
16807H481734J3194L76616K07655J31780L23726J06651J23340O03830K29414L15645
16797A0913585J1035J77144N81411j69067M83920L33342M22708M51236M06345
16788A3611659N29184K85864K30933N60897j1545J043155J46662K57033O29495
16779A7283337K83771J000026K63869R63917Q31618K17454P35748O27256Q48938
16770B3055934Q86525Q59660R19234R24428J096748Q55932J179235J016615R22974
$$ plain form
16837 4670744 4786730 4956954 5517616 5088711 5099837 5115285 5218901 5264942 5554642 5476464
16827 5476464 5428340 6019427 6158345 6222619 6085246 6543876 6456548 6822861 6794075 6968798
16817 6968798 7229648 6918375 7196639 7399745 7525639 7901982 7770170 8206870 8290687 8481734
16807 8481734 8494928 8871544 9079199 9210979 9534705 9641356 9764696 10368526 10597940 10913585
16797 10913585 10924620 11101764 11683175 11514108 11998028 12331370 12754078 13205314 13611659
16788 13611659 14140843 14426707 14657640 15218537 15206992 16250147 16396809 16653842 17283337
16779 17283337 17567108 18567134 18831003 19794920 20626538 20843992 21579740 22206996 23055934
16770 23055934 23942459 24802119 25721353 26645781 27742529 28598461 29777696 30794311 31717285
16761C1717285J911575J207842J175372J708329J186303J954009J522665J900370
16753D4283750K353351J669333K427291K840510K122653K276413K840726K879155
16745F3693182L196231L157835L603905L311494M001583M097846M211904M465248
16737I3739228M127948M844762M781694N211799N129413M652433N090059N355483
16729A32932819M331052M647960M427731L863691L904029K887894K313587J737484
16721A61046247J164972L75137n65966r34663j857284k347200k907184l598259
16713A50375800m062731m538816m598408n077511n004298n018006n254141m806821
16705A12015068n084207n032439m725175m486112m302210m409426l942720l805180
$$ plain form
16761 31717285 33628860 34836702 36012074 37720403 38906706 40860715 42383380 44283750
16753 44283750 46637101 48306434 50733725 53574235 55696888 57973301 60814027 63693182
16745 63693182 66889413 70047248 73651153 76962647 80964230 85062076 89273980 93739228
16737 93739228 97867176 102711938 107493632 112705431 117834844 122487277 127577336 132932819
16729 132932819 137263871 141911831 146339562 150203253 154107282 156995176 159308763 161046247
16721 161046247 162211219 162586356 162020390 161085727 159228443 156881243 153974059 150375800
16713 150375800 146313069 141774253 137175845 132098334 127094036 122076030 116821889 112015068
16705 112015068 106930861 101898422 97173247 92687135 88384925 83975499 80032779 76227599
16697G6227599l674098l512851l125111k756173l277651k697129k451124k629641
16689E2103821k208720k367186k160274j781695j808242j672618j445099j794086
16681C6865901j496448j129901j588280j335188j190277r42685q94834j386795
16673B6901493p53418q45649j054473q27841p63879r33855m93848o86702m95567
16664B0046261p70655p25238m04089p51270l58851m07746l57887n49657o06442
16655A5114426m96696k72031o89537O8425n68419m05881r2370p73455l53244p2955
16645A1458263n88461J22044l81799l59587j13641j26397l58799k76506m13999
16636H961118J5009j46476o3641k78983m40938J09142k31713p1044k26200k61111
$$ plain form
16697 76227599 72553501 69040650 65915539 63159366 59881715 57184586 54733462 52103821
16689 52103821 49895101 47527915 45367641 43585946 41777704 40105086 38659987 36865901
16681 36865901 35369453 34239552 32651272 31316084 30125807 29183122 28288288 26901493
16673 26901493 26148075 25302426 24247953 23420112 22656233 21722378 21228530 20541828 20046261
16664 20046261 19275606 18550368 18146279 17395009 17036158 16628412 16270525 15720868 15114426
16655 15114426 14617730 14345699 13656162 13724587 13156168 12750287 12657917 11884462 11531218 11458263
16645 11458263 10869802 10991846 10610047 10250460 10136819 10010422 9651623 9375117 8961118
16636 8961118 8976127 8829651 8766010 8487027 8046089 8155231 7923518 7852474 7626274 7365163
16626G365163o1497k50383k20842P325L9021j80831j36853k59387o6236k79206
16616E956274N0630J5670k90882J9814j41116m1509m98604M08745n53070N28312
16606E454264l80934k21762q7140K13761k19016k24279k27078k5904R8701r3872
16596D286741l17354K64807K06769l19598J06370k17577m22542M14344k08524
16587C793436K78824m78047J22131k7841l01218K8319q209P5757j82676j16709
16577C183767K02810o1365p7989j64302m3129o7423K24087l69522J33567l28990
16567B631511L7098j65753L09127r7812k59701J8907K45968k69306N8611j95945
16557B312705M06871k44802j89833L31243k96103J09245k05094J81731p1489n463
$$ plain form
16626 7365163 7303666 7053283 6832441 6839766 6878787 6697956 6561103 6301716 6235480 5956274
16616 5956274 6006904 6022574 5731692 5751506 5610390 5568881 5070277 5479022 4925952 5454264
16606 5454264 5073330 4851568 4764428 4978189 4759173 4534894 4307816 4281912 4380613 4286741
16596 4286741 3969387 4234194 4440963 4121365 4227735 4010158 3587616 4001960 3793436
16587 3793436 4072260 3594213 3716344 3688503 3387285 3415604 3407395 3483152 3300476 3183767
16577 3183767 3386577 3325212 3247223 3082921 3039792 2972369 3196456 2826934 2960501 2631511
16567 2631511 2668609 2502856 2811983 2714171 2454470 2473377 2719345 2450039 2508650 2312705
16557 2312705 2719576 2474774 2284941 2616184 2320081 2429326 2224232 2405963 2334474 2329011
16547B329011p8324k36033L96125l41659n0882K35540j6731k92716L1202k37617
16537A737916N05899m01952J0609N9075R305Q9625j05461j83074q8218J22476
16527A756200o4504K41678j61773J00228k31923K31360k24450J70419l74539j7980
16517A424716K9928J05129j07629P6226M6268j14117K11427K6596j10558r2752
16507A495234N4019p5968l7163j6169J02387l37467J53372l51079O98062m7786
16497A637442l96148J32991j01533j89975K06663K44724J1676l75814L9565l4442
16487A175149J33747j20758j6695m1301J58408N8832n15123J27913J85689j75605
16477I70256L29966q7009m9191m93521N21523j65897K02985J12792k73762O1025
$$ plain form
16547 2329011 2250687 2014654 2410779 2069120 2018238 2253778 2237047 1944331 1975533 1737916
16537 1737916 2243815 1841863 1852472 1911547 1920852 2010477 1905016 1721942 1633724 1756200
16527 1756200 1691696 1933374 1771601 1871829 1639906 1871266 1646816 1817235 1442696 1424716
16517 1424716 1454644 1559773 1452144 1528370 1574638 1460521 1671948 1698544 1587986 1495234
16507 1495234 1549253 1473285 1436122 1419953 1522340 1184873 1338245 987166 1685228 1637442
16497 1637442 1241294 1374285 1272752 1082777 1289440 1534164 1545840 1170026 1209591 1175149
16487 1175149 1308896 1188138 1171443 1130142 1288550 1347382 832259 960172 1145861 970256
16477 970256 1300222 1213213 1164022 670501 1192024 1026127 1229112 1341904 1068142 1129167
16467A129167k71619J6884P5312k65194N04708j79575J51324j75073p464j6200
16457I62270n7238J02130j66351K09162M9909k39099J51009Q5791m44488N86367
16447A239462n03793j64406J96697Q9492K50786r3024j68127j37080L9459K32074
16437I81540m38169J73171K12828L0245j77122K46446k88453J59516k96919l8121
16427E64962J83902j85965j98761M01333K19041C77827K79624M6134j38650J66490
16417G31425O8510C88613O66952j5303l90634J15368j38185k30759R3109L00000
16407G89161p9604k90758J55729J67607J79818C66813K07764J8632m1389O7065
16397F18885j60689j33908N70524j28933j04581Q6233M3560E5695N04104o3027
$$ plain form
16467 1129167 857548 874432 949744 684550 1189258 1009683 1161007 985934 978470 962270
16457 962270 905032 1007162 840811 1049973 1099882 860783 1011792 1097583 653095 1239462
16447 1239462 735669 571263 767960 857452 1108238 1015214 847087 710007 749466 981540
16437 981540 543371 716542 929370 959615 782493 1028939 740486 900002 603083 564962
16427 564962 748864 562899 364138 765471 984512 377827 657451 703585 564935 731425
16417 731425 799935 388613 1055565 1040262 649628 764996 626811 396052 489161 789161
16407 789161 709557 418799 574528 742135 921953 366813 574577 593209 551820 618885
16397 618885 458196 324288 894812 765879 661298 747531 791091 55695 559799 496772
16387D96772L38101j85568j209k46206K4744j6266R2476K18036l54264J45681
16377E12297K2970M0190Q1940k38175q404j00611N01837C49919K70873j05953
16367E14839j28729L52001j3467k38286L5316P465O0191o238j47258J8819G2107
16355E67426J57917A36407M18106L869B53214K00785M37764C08001L9790A27704
16344B2543N56203G6739M95450k24164J9316j58104E4451J98416K46902k45166
16334B54603k6255A13178J48418K30756K6799D4966K67300A49336L38513K82355
16324G70204A93123K21526o8046P4724A81309M38251B60402J72652j74955K56364
16314E14463n0926j5354j43195N1268A65397J14815L09301K8648k83961j14264
$$ plain form
16387 496772 834873 649305 648096 401890 426634 410368 502844 720880 366616 512297
16377 512297 535267 575457 657397 419222 410818 310207 812044 349919 620792 514839
16367 514839 386110 738111 724644 486358 521674 529139 589330 583092 435834 454653 72107
16355 567426 725343 136407 554513 558382 253214 453999 891763 308001 347791 127704
16344 22543 578746 76739 572189 348025 367341 209237 54451 252867 499769 254603
16334 254603 228348 113178 261596 492352 519151 44966 312266 149336 487849 770204
16324 770204 193123 414649 346603 421327 181309 619560 260402 433054 258099 514463
16314 514463 463537 448183 304988 356256 165397 280212 589513 618161 334200 219936
16304B19936N7175J34430j4804j12703j03374J80211n8791L9708L1257A26319
16293C09262J61974A75213n7043L99280j20073A71319J94158q0542q7971N5767
16283B52731K41467j51097f0169A24001M14378A88750J47431J30569n5631l5618
16273C75501e2013B03336o522H978M03173A84148n2529j6284K55621J86682R4064
16262F51702B38781p8093N2076a86889D10661j1992K02177B75576K49509B52465
16251A34788o7017L05768o1940K80603k17689r0445G2288M34257j29246O3435
16241D40734j50225p620J24549b4752A64098M7990N2458j17427Q2457K3445J56740
16230D09761A25586K67008j90850Q2810J65122j50564H0153A5574K88286A33648
$$ plain form
16304 219936 277111 411541 396737 284034 180660 360871 302080 341788 373045 126319
16293 309262 471236 175213 118170 517450 397377 171319 365477 284935 196964 252731
16283 252731 494198 343101 -60169 124001 538379 188750 336181 466750 411119 375501
16273 375501 -52013 203336 196814 8978 412151 184148 131619 115335 370956 557638 651702
16262 651702 238781 160688 212764 -186889 410661 398669 600846 275576 525085 252465
16251 134788 67771 373539 311599 592202 374513 284068 72288 506545 377299 440734
16241 440734 290509 282889 407438 -24752 164098 212088 264546 147119 229576 253021 409761
16230 409761 125586 392594 201744 284554 449676 299112 80153 15574 303860 133648
16219A26649f2240G3518a27600G5941L28318A58984E8464K54685R6924K7946j99169
16208B38850D2570b55598f0212C37240n1073a46038A83475C9715J69679K73594
16198D82988b75291I1303J94623A30834D7183J27697K05081b9171k1098B06460
16187B10723J46196A24959J27975A06103K13442K29569k45139G2958L1838b7145
16176I8596b13325D6376K26216A11927g1696A15990b242B11021J53250k4224o7010
16165B73037A4513K02257O4172c7207B3438K60082R682E1476L7783D0554d9059
16153A38003J18895Q8528a08270C21051c92398A81118a20279B97440C4779K13406
16143B48185I5468a6895A19037L71220A69768m0288E5048a69062A30624C0133
$$ plain form
16219 126649 -62240 73518 -127600 75941 404259 158984 58464 313149 410073 438019 238850
16208 238850 42570 -255598 -60212 337240 286167 -146038 183475 39715 209394 482988
16198 482988 -275291 91303 285926 130834 47183 174880 379961 -29171 -50269 206460
16187 210723 356919 124959 252934 106103 319545 549114 303975 72958 104796 -27145
16176 98596 -213325 46376 272592 111927 -71696 115990 -2242 211021 364271 340047 273037
16165 273037 14513 216770 280942 -37207 23438 283520 293202 51476 89259 40554 -49059
16153 138003 256898 345426 -108270 321051 -392398 181118 -120279 297440 34779 248185
16143 248185 95468 -16895 119037 490257 169768 129480 55048 -169062 130624 30133
16132B15049H6028c4952H6325K94356j32705b7089j04072j8966A25645a64839
16121g929B39609i1700B83184j09015A0901A105d7459b1246A79561f3305J1868
16110e1437l40515A06078k5914a49585g4246E0635c519E62683r1940r755j76224
16099B84764j03379n9433l3580a6543j14066I2328b13672A12910J0809O955b5448
16087A87212N4850a64131A23654a92547E196c20002A85772d7588B9264O5210l8613
16076E5861o683A125J15192j4561g4956E128a02056B2813i9641j44670o711A68857
16063b33289D66260a13C02190f9205l8880n5727b548m8104j58310C33168c14297
16051C18709R6972A34416b4058j79227A06139a54612A92298A2376a36068B41104
$$ plain form
16132 215049 86028 -34952 86325 380681 247976 -27089 -131161 -150127 125645 -164839
16121 -7929 239609 -91700 283184 174169 10901 1105 -47459 -21246 179561 -63305 -51437
16110 -51437 -391952 106078 80164 -149585 -74246 50635 -3519 562683 470743 460988 284764
16099 284764 181385 121952 88372 -16543 -130609 92328 -213672 112910 123719 130674 -25448
16087 187212 242062 -164131 123654 -192547 5196 -320002 185772 -47588 29264 94474 55861
16076 55861 49178 1125 116317 101756 -74956 5128 -102056 22813 -99641 -244311 -251022 168857
16063 -233289 466260 -113 302190 -69205 -108085 -163812 -2548 -50652 -208962 333168 -314297
16051 318709 415681 134416 -24058 -203285 106139 -154612 192298 12376 -136068 241104
16040a08778A68237A978O5796R971a80472D1762P6892O8080k7880B0182d5477
16028A66616G0504M7749J31000A8643a26448d9308o7250e7905A19734d2708F0257
16016g8969A78243d6098A92398a49008A76908A5413b07385F6671a5423I7319h4967
16004A99330K7944H3232b41367A56994K79183j29735d5816C0193J24198A2431
15993a31648k01592A05473i8850A212i4415H6503a52568j4834D35354F1082h5700
15981A17756L32511A13974n5017i1760A82572p3852k0315k9682b07403d4137A12380
15969H1093F41f4039j43919D0852J31036G2105J25297g4878A75680a32422C3998
15957A40347l4006R1827L4235a17046k8468C81915g7718C5698c61148g5032B06586
$$ plain form
16040 -108778 168237 1978 67774 77745 -180472 41762 118654 186734 158854 20182 -45477
16028 166616 70504 118253 249253 18643 -126448 -49308 -116558 -57905 119734 -42708 60257
16016 -78969 178243 -46098 192398 -149008 176908 15413 -207385 66671 -15423 97319 -84967
16004 199330 227274 83232 -241367 156994 436177 306442 -45816 30193 154391 12431
15993 -131648 -333240 105473 -98850 1212 -94415 86503 -152568 -167402 435354 61082 -85700
15981 117756 450267 113974 58957 -91760 182572 108720 88405 58723 -207403 -44137 112380
15969 81093 641 -64039 -207958 40852 171888 72105 197402 -74878 175680 -132422 33998
15957 140347 106341 198168 232403 -117046 -145514 381915 -77718 35698 -361148 -75032 206586
15945B51408B8615b21860n4563a8308A07493e5587a4635o3107p5317e4760k12446
15934b67206J06172b6346C45259f8896B6450L52172b08307O3575B02776h1131
15923A22509Q4771i151j31316F1169j9161c93709a35986K3302A29289P1744o408
15912A94625m9667a8128l5481j8797C06891j26576d390A81490e8906o7872A10324
15900C67113p3288a01963L2082j99725f7752b8202E0462k0274R8834a50478j71727
15889c22205A04460a41680a8873C7391a68178j8069b1728j80220h3766G5244B8302
15877a09991A2031M8908b20297D1378P1523m8239K8672J84416b25995A34893a89706
15865a1450j53725O3789I895d5614j66240A0085b62496A99383a82865m3010b7448
$$ plain form
15945 251408 28615 -221860 -276423 -18308 107493 -55587 -14635 -77742 -153059 -54760 -267206
15934 -267206 -161034 -26346 345259 -68896 26450 378622 -208307 -144732 202776 -81131
15923 122509 207280 -9151 -140467 61169 42008 -393709 -135986 -112684 129289 201033 194625
15912 194625 144958 -18128 -53609 -72406 306891 180315 -4390 181490 -58906 -126778 110324
15900 367113 293825 -101963 -69881 -269606 -67752 -28202 50462 30188 129022 -150478 -322205
15889 -322205 104460 -141680 -18873 37391 -168178 -186247 -21728 -201948 -83766 75244 28302
15877 -109991 12031 60939 -220297 41378 112901 64662 93334 277750 -225995 134893 -189706
15865 -11450 -165175 -101386 9895 -45614 -211854 10085 -262496 199383 -182865 -225875 -27448
15853i7047B4278a18975c8601j64943A68061a69756E0002B4234J23614b01530
15842a18103L875A90356b37031C4305c29930f1317j0316m22802A06694a13494
15831c6760m3299j75629A92147a76638K5367A96589q7634a66206A07466a92331
15820F5775C1620c34644c8584j16878N9628A66566H0653b69862h8282j20261P2719
15809a35824O2039E019J81133o2050K10907b21247a00771A820e5901B07186J04443
15798C11629A55538D0667Q7837m6208J8298a72958f0878B16097c6157k9951q2066
15787a48174b0423n1443L2525k19067A4097f9774j02643b2981i431m9226o1947
15776a20604N6598P304I849a14498N4069B8561R0250J78319a88238A28191b26860
$$ plain form
15853 -97047 24278 -118975 -38601 -203544 168061 -169756 50002 24234 147848 -201530
15842 -118103 -114228 190356 -237031 34305 -329930 -61317 -71633 -494435 106694 -113494
15831 -36760 -80059 -255688 192147 -176638 -151271 196589 108955 -166206 107466 -192331
15820 65775 31620 -334644 -38584 -155462 -95834 166566 80653 -269862 -88282 -208543 -135824
15809 -135824 -73785 5019 186152 124102 335009 -221247 -100771 1820 -55901 207186 311629
15798 311629 155538 40667 128504 82296 100594 -172958 -60878 216097 -36157 -66108 -148174
15787 -148174 -20423 -71866 -39341 -258408 14097 -69774 -172417 -22981 -9431 -58657 -120604
15776 -120604 -64006 -56702 9849 -114498 -60429 28561 118811 297130 -188238 128191 -226860
15764B3394b12206f5411C9552J67540b92917J33920C1322J40746o5657D0470A743
15752B47004i1978B15703E0890Q6620K80277e3141K4693H7368K52211G2437M7724
15741A20161J94040a86779C46283A58135a53538A45249e7185B2034h8784j46321
15731b35105A03439J00071I6854P9739b01513A61866b8399k61839e6728j51588
15721b08316G8872L9561b94284b250B10986b21129K8867h0487B92390A36674a37265
15709b16801n6724A34738J5396b02272C0035d1667A4269i679C3088i7249B15296
15697B04515a02593E3970g5712D2689Q8966a11245A32029E1324a94238n44k44027
15686d38809J34580e6160o3111A04941f3342j68158a7935A87882A0168J35026
$$ plain form
15764 23394 -212206 -65411 39552 207092 -292917 -158997 31322 172068 106411 40470 1743
15752 247004 -91978 215703 50890 137510 417787 -53141 -28448 87368 339579 72437 120161
15741 120161 314201 -186779 346283 158135 -153538 145249 -57185 22034 -88784 -235105
15731 -235105 103439 203510 96854 176593 -201513 161866 -28399 -290238 -56728 -208316
15721 -208316 78872 118433 -294284 -2250 210986 -221129 -192262 -80487 292390 136674 -137265
15709 -216801 -273525 134738 150134 -202272 30035 -41667 14269 -9679 33088 -97249 215296
15697 204515 -102593 53970 -75712 42689 131655 -111245 132029 51324 -194238 -194782 -438809
15686 -438809 -304229 -56160 -119271 104941 -63342 -231500 -17935 187882 10168 145194
15676A45194a9873B63936C4492a4655j6703E9876Q1756k4512c2663j1037B47350
15664a69270e8813A81463p6292j1474O2154F3034g1733E7410J95353d1099p3667
15653a14766A47966f7172j28414c6670M370k00764I596N7481G80J22738c42826
15641a33040q4556C40901B5165J95815r4474f665l17928C23502d6987A80972A9685
15629c84922l9367A14283L7141g9956B17613a09725A64170a01499o9326C7627
15618a34916K2826A06852c75734m0163A10477J74783d12537b8983D6766o098b84818
15606A20040a70470B06842f8938A44722M7053R979q9968b56186f1772C2679L18254
15595C50933b11942j9793B43312b26841B8452a8615D5036k0615g2725A05592A1764
$$ plain form
15676 145194 -19873 263936 34492 -14655 -31358 59876 141632 117120 -32663 -43700 247350
15664 -169270 -58813 181463 105171 93697 155851 63034 -71733 57410 252763 -41099 -114766
15653 -114766 147966 -67172 -195586 -36670 -32300 -233064 9596 67077 780 123518 -342826
15641 -133040 -217596 340901 25165 220980 126506 -6665 -324593 323502 -46987 180972 19685
15629 -384922 -424289 114283 151424 -79956 217613 -109725 164170 -101499 -170825 37627
15618 -134916 -112090 106852 -375734 -415897 110477 285260 -412537 -28983 46766 40668 -284818
15606 120040 -170470 206842 -68938 144722 191775 201754 111786 -256186 -61772 32679 350933
15595 350933 -211942 -231735 243312 -226841 28452 -18615 45036 24421 -72725 105592 11764
15583A96900a65731p5481A72905b06246P386c2269H8578e1820j98613J12937A2337
15571F6071c2615r7823J2544k14376A21168b14165C9508a32064j9665j73586B93186
15559c96103Q1883D7691O4147c405k40501A69219b9512A5776a30156A66853l3672
15548A33181l7392a45230d2330A71112d1490J2294k06728a05547B64117a19755
15537D2404d69587f5057i837J138A29130Q6609b59379A64036G0450a23772n0114
15526a73886l2150B62152B5201J35718g4115b2060N592C9217L51316F8660d12352
15514b07094b0151l0411A74728g3274C18764B8320J69699h320m7832k15876I0863
15502a70647g5299A18691c474j17792l262k34542A53296h2048A60583a87443M4330
$$ plain form
15583 196900 -165731 -241212 172905 -206246 -198860 -32269 88578 -51820 -250433 -137496 12337
15571 66071 -32615 -130438 -117894 -332270 121168 -214165 39508 -132064 -151729 -325315 293186
15559 -396103 -314220 47691 111838 -3405 -243906 169219 -29512 15776 -130156 166853 133181
15548 133181 95789 -145230 -42330 171112 -41490 -29196 -235924 -105547 264117 -119755
15537 42404 -469587 -65057 -9837 -8699 129130 215739 -259379 164036 70450 -123772 -173886
15526 -173886 -206036 262152 25201 160919 -74115 -22060 -16468 39217 390533 68660 -412352
15514 -207094 -20151 -50562 174728 -73274 318764 28320 198019 -8320 -56152 -272028 90863
15502 -170647 -75299 118691 -3474 -121266 -124528 -359070 153296 -82048 160583 -187443 -143113
15491a43113C00459a52685H2777d63044b14503d2803A50665b42242A71931n6279
15481A15652L9141A6523k933i0473e159l4657j38894G1385b49684k0569A12511
15469i9022j77886h4025k14370g1193G66a79087A11954K34185j10409i5190A08364
15457B51511B1882J12123L5538a00348I8182a18850A53379d6235F3283B6474J77218
15446B03692m2590J29914a52599n1980K0375M5870A54563C3738L67816a67223
15435A02830l9921K21057r5750b69414B23999B6956b46755E4478J60954a55603
15424B94137B5813c3947A82781c2538m33084e0307j27174m467E267R0020I433
15412H5889J45029a4004j48892b0530j69615B00966a48978A9830L38620B5003
$$ plain form
15491 -143113 300459 -152685 82777 -463044 -214503 -42803 150665 -242242 171931 115652
15481 115652 154793 16523 13590 -90473 -5159 -39816 -178710 71385 -249684 -270253 112511
15469 -99022 -276908 -84025 -298395 -71193 766 -179087 111954 346139 235730 -95190 108364
15457 251511 21882 134005 169543 -100348 98182 -118850 153379 -46235 63283 26474 203692
15446 203692 161102 291016 -152599 -204579 -184204 -138334 154563 33738 401554 -167223
15435 102830 62909 283966 188216 -269414 223999 26956 -246755 54478 215432 -155603
15424 294137 25813 -33947 182781 -32538 -465622 -50307 -177481 -181948 5267 95287 9433
15412 85889 230918 -14004 -162896 -20530 -190145 200966 -148978 19830 358450 25003
15401A64322a11297J1444m8446a6661o7825j5249J4492D8834a6517k32810N3833
15390a95494p6863H9276A1163J01338J1080J9835c34389f0689q103o4506B26974
15378g7446A00748b28119F3879K64112j43179b85793J25217P0591n4356g63A28965
15366A584P2477a29226L124A25275C3369a70220q762g0230G778O4036J10209a4138
15353a04504L1197j42660D23044a78617L9008B8355Q5754O0122p0525d6773A171
15341C7244d5231F9482J03385n1972J51995A22524O4720b05768r0331J01137j49094
15330c44056E37047k64672d8412j44109P4688A60904a62960j82809C75898a26153
15319H7748a53641k24632e1528j95783A85037b21351C22491a60976D4864N5954
$$ plain form
15401 164322 -111297 -99853 -148299 -16661 -84486 -99735 -85243 48834 -16517 -249327 -195494
15390 -195494 -272357 89276 11163 112501 123581 143416 -334389 -60689 -68792 -133298 226974
15378 -77446 100748 -228119 63879 327991 184812 -285793 -160576 -89985 -144341 -763 128965
15366 1584 74061 -129226 -126102 125275 33369 -170220 -178982 -70230 7778 71814 182023 -14138
15353 -104504 -73307 -215967 423044 -178617 -139609 28355 114109 174231 103706 -46773 1171
15341 37244 -45231 69482 172867 120895 272890 122524 187244 -205768 -296099 -194962 -344056
15330 -344056 537047 272375 -48412 -192521 -117833 160904 -162960 -345769 375898 -126153
15319 87748 -153641 -378273 -51528 -247311 185037 -221351 322491 -160976 44864 100818
15309A00818K61438a10175C9673L79815A08853n0515M5786c56329E4203r815K7413
15298G1801A1588a2771C78315a65957A00552D2087c0645j41670B12229B4740g1015
15286A60800F2864b86422A66262b6682C25260J61761I4284a68660j16905i6916
15275B29418j1809a24473A16509C2135Q3972R410D814a54617f5415D06773A57548
15263E4966j1286a2254B35150m0426h54l1595k19101d5011A85162a19623L9042
15252h0581a1272G8438b7016B75347L88820N44304L32858j5752R2894l61446k55126
15241A001899m98613A19170l4517a38034b029A27789a90750A8222L05466b171
15230f1490L581A35055R7687a09035J2136H0588C7859c32207A62482b4948l9021
$$ plain form
15309 100818 362256 -110175 39673 419488 108853 58338 104124 -356329 54203 44388 71801
15298 71801 11588 -12771 378315 -165957 100552 42087 -30645 -172315 212229 24740 -71015
15286 160800 62864 -286422 166262 -26682 325260 487021 94284 -168660 -285565 -96916
15275 229418 217609 -124473 116509 32135 116107 125517 4814 -154617 -65415 406773 157548
15263 54966 43680 -12254 235150 194724 -854 -32449 -251550 -45011 185162 -119623 -80581
15252 -80581 -11272 78438 -27016 275347 664167 1208471 1541329 1525577 1618471 1257025 1001899
15241 1001899 503286 119170 84653 -138034 -2029 127789 -190750 18222 323688 -2171
15230 -61490 -57909 135055 232742 -109035 -96899 80588 37859 -332207 162482 -24948 -63969
15219f3969F0057a06992B4647N4380b44958K8008B81894c8669E253g4378B49283
15207A17882E0929K37384a22570A91276a69276h2660B7034g7425E5052c7706o0107
15196i7813A96295g5427r033A33901c92984a39411A27301K02009j17941n5270
15186A56099D5031J07173L5029o1719a22296d7708A00481J4263L8353c586E36654
15174A50381O6804J68599j7608a14000A04897B3306M3793K09010m3580O7563I4886
15162B01239C8747J54103g9419B0503g5406B59581e8830B1564b51724C49127a52691
15150e7736A30815j3313d5052C401c24686A38144C6916K48169j20229f120A69528
15138C48175R364j56409K806d3804j03938e3500j1280B71104b38352B84703K66500
$$ plain form
15219 -63969 60057 -106992 24647 79027 -244958 -216950 281894 -38669 5253 -74378 249283
15207 117882 50929 288313 -122570 191276 -169276 -82660 27034 -77425 55052 -37706 -97813
15196 -97813 196295 -75427 -84460 133901 -392984 -139411 127301 329310 211369 156099
15186 156099 45031 152204 187233 125514 -122296 -47708 100481 114744 153097 -3586 536654
15174 150381 217185 385784 368176 -114000 104897 23306 67099 276109 232529 300092 94886
15162 201239 38747 192850 -79419 20503 -75406 259581 -58830 21564 -251724 349127 -152691
15150 -57736 130815 117502 -45052 3401 -324686 138144 36916 285085 164856 -6120 169528
15138 348175 357539 201130 203936 -43804 -147742 -53500 -64780 271104 -238352 284703 551203
15127E51203A37642o3182K39559P4790G0529B0604M1806K75863j15043C5710J76216
15116B11926l5972L3343N0874a49414B44530f3538b6169C826Q035M73530D0017
15104C10420j14743c7089m6763j21248a2023j01646A50108l434N9188A593i0871
15092e1235n1116G6017J50569j9729O9568J6411a26966F4608l1645L75359b67643
15080a95757B49187n5430f9131K1432A44336a57589A17656e660I1902J98579H1748
15068B22927E9778O3182K1307d076r6023K8262a1061C14619a29884D69478i0157
15056C33137A56296c0330B53031l6930J29585A37687K44059Q897B5937L27385
15046C53322A75464J03163b51098h4785E42624B30584R5000A21228J76380J49158
$$ plain form
15127 551203 137642 74460 314019 388809 70529 20604 62410 338273 223230 35710 211926
15116 211926 175954 209297 260171 -149414 244530 -63538 -26169 3826 11861 485391 40017
15104 310420 195677 -37089 -83852 -205100 -12023 -113669 150108 146674 205862 1593 -90871
15092 -51235 -102351 76017 226586 206857 276425 292836 -126966 64608 32963 408322 -267643
15080 -195757 249187 193757 -69131 -47699 144336 -157589 117656 -5660 91902 290481 81748
15068 222927 59778 122960 144267 -4076 -100099 -71837 -11061 314619 -129884 469478 -90157
15056 333137 156296 -30330 253031 216101 345686 137687 381746 390643 25937 353322
15046 353322 175464 278627 -251098 -84785 542624 230584 325584 121228 297608 446766
15036D46766B00039p0951a6016j61151A95743q5047K44044A14804a63286A57517
15025D61039A59725o4193K8134J00315L2669R7572E3238K11897k6353k2503H5934
15013E07167B53429j08337o4617C2078L04630A18562J26828I4550j5559J95539
15003B74530J19305g3821A19017J53983a6499D91471B2309L23850j6468A14419
14992D87593C5910K39716b8940A69045m4661J6650Q5133q2497k7709K98784A32596
14980a2267A45696n3314L30782j31320m2961d2317A24791K01969J53690A98661
14969D10652L2257A48942L98098A57354J13936J59228j47439l8033j12047J41622
14959B74621H2482L95516E4557L55950J4468Q1417A53092K30495k7330B7504M83523
$$ plain form
15036 446766 200039 129088 -16016 -177167 195743 110696 354740 114804 -163286 157517
15025 461039 159725 95532 123666 223981 256650 354222 53238 265135 238782 216279 85934
15013 507167 253429 145092 80475 32078 336708 118562 245390 94550 78991 274530
15003 274530 393835 -73821 119017 273000 -16499 491471 22309 346159 329691 114419
14992 487593 35910 275626 -28940 169045 124384 141034 226167 143670 115961 414745 132596
14980 -12267 145696 92382 423164 291844 248883 -42317 124791 326760 480450 198661
14969 410652 442909 148942 547040 157354 271290 430518 283079 245046 132999 274621
14959 274621 82482 477998 54557 410507 424975 506392 153092 383587 356257 27504 511027
14948E11027A62404E0629O3319L53228P5655p6402j03373K03760Q00q6355j93090
14937B88171J08299Q5820k33035A08193K90565I1203K67607J7924k4441A31012
14926B44729P580L609O1496C6197L32027J13746k39501p6998p963R7674K0594
14915B75776P9353l4942n2931J38074j04996I6018J60434N0433a82707B60124
14904B16340j00022P2797q6878M53603A24957L32524R7188k50789c0081C07473
14893D88708B09529r8843B4744K34587J93599q2760l4510r986L8788j43102J61034
14882C82394p8611K13090k04159J50343M7444J45316k2140k09436k03095J01175
14872C22321r1769R1763J97095n3903j47022J74702j94802k1002J16959n1585
$$ plain form
14948 511027 162404 50629 113948 467176 542831 466429 363056 566816 567616 481261 288171
14937 288171 396470 482290 249255 108193 398758 91203 358810 376734 352293 131012
14926 244729 252309 255918 317414 36197 368224 481970 242469 165471 157508 255182 275776
14915 275776 355129 320187 267256 405330 300334 96018 256452 306885 -182707 260124
14904 216340 116318 189115 102237 555840 124957 457481 554669 303880 -30081 307473
14893 488708 209529 110686 24744 259331 452930 370170 335660 325674 364462 221360 382394
14882 382394 303783 516873 312714 463057 510501 655817 633677 424241 221146 322321
14872 322321 230552 322315 519410 465507 318485 493187 298385 277383 394342 342757
14862C42757J86479A05030L48755j00485K60003k65011O7153N164f1834C13526
14851A95168M63951B49675K77793R8946k07679Q815k1712j85480J18937K88190
14841F27485a6541D09893j16959n3835J1970N6390p9604K35132j01224j16346
14831B45417K60215k31035J36984K7083m801j04693L47906k61300r0423J07791
14821D33144N2469n5752A93129M98770l32113j57696K41872L85496A40007L90240
14811E30247j658R9398J02837N5629k90069J13933k09360J56538o9539K04885
14801F92841C23641j34233O21197k89043J44963j25285j82408L86874A54734J17432
14791B72166l9342L77205k10771J02044j21061J91866A72852J99421O27419l31512
$$ plain form
14862 342757 529236 105030 453785 353300 613303 348292 415445 420609 -61834 313526
14851 195168 659119 249675 527468 626414 418735 427550 405838 220358 339295 627485
14841 627485 -16541 409893 292934 239099 251069 307459 227855 462987 361763 245417
14831 245417 505632 274597 411581 438664 433863 329170 677076 415776 325353 433144
14821 433144 485613 429861 193129 691899 359786 202090 443962 829458 140007 530247
14811 530247 528589 627987 730824 786453 496384 610317 400957 557495 487956 692841
14801 692841 323641 189408 810605 521562 666525 541240 358832 745706 154734 272166
14791 272166 232824 610029 399258 501302 380241 572107 172852 372273 999692 668180
14781F68180B35893K38473K9861j44222M67947l78936L07258l3354k06871J61653
14771F77702K2914l06371J22212L1740j43934K60160K15151C07870J18776B12681
14760C97795L07615n9717k33924J67059R2227j45361K45273J1053r1534j31141
14750E59345K77932j59836k14597K27629l1377J42097k75096L03555J04823k09633
14740G24842J45898j70741N3437j9790k3304m5329O8062B54343N36284B88878
14729A129986m96433N6726p197K62993k73902C00854L57757K58852j01504k02194
14719F13765N0905J55326j63342J64515r2943J66353J10361q6219L0367j42962
14709H06126q9264N8629j92430L75621j79281J73759k92166J11914J93580o6591
$$ plain form
14781 668180 235893 474366 504227 360005 827952 449016 756274 722920 516049 677702
14771 677702 700616 394245 516457 548197 404263 664423 879574 307870 426646 212681
14760 397795 705410 645693 411769 578828 671055 525694 770967 782020 690486 559345
14750 559345 837277 677441 462844 690473 659096 801193 526097 829652 934475 724842
14740 724842 870740 699999 753436 733646 710342 665013 733075 254343 790627 288878
14729 1129986 633553 690279 683082 946075 672173 300854 658611 917463 815959 613765
14719 613765 664670 819996 656654 821169 728226 894579 1004940 918721 949088 806126
14709 806126 716862 775491 583061 958682 779401 953160 660994 772908 966488 899897
14699H99897j40975K80880l10303k8838K58556L04276l7717q5790l98122P9107
14689H20971k1944R2632K52848l93593J41229J94790j87978p3372l109M8807M9283
14678I20564j56592J20459j12007r3896J85820o1245L12926k02340M7248L49616
14668A310553k07557j84010M04234m40348j43059J14867K20422K2980l9079K08964
14658A267967j72783k04791R6126J9333L4237L83418l62330M07654P9122n98424
14648I49529L46291j94151R7518K02034J05007m9530n2328k86046J25402J09395
14638A353121k64679K7733J61959o1109J75196l67070J86998l4364J84197K73815
14628A635797k37839L604j36995j68060K99532J82463L7791q0619l04859K65807
$$ plain form
14699 899897 758922 1039802 729499 700661 959217 1263493 1225776 1139986 741864 820971
14689 820971 799027 891659 1144507 750914 892143 1086933 898955 825583 822474 871281 920564
14678 920564 763972 884431 772424 678528 864348 803103 1116029 913689 960937 1310553
14668 1310553 1102996 918986 1323220 882872 739813 854680 1075102 1098082 1059003 1267967
14658 1267967 1095184 890393 986519 1005852 1040089 1423507 1061177 1468831 1547953 949529
14648 949529 1295820 1101669 1199187 1401221 1506228 1456698 1404370 1118324 1243726 1353121
14638 1353121 1088442 1116175 1278134 1217025 1392221 1025151 1212149 1177785 1361982 1635797
14628 1635797 1397958 1401562 1264567 1096507 1396039 1578502 1616293 1535674 1230815 1496622
14618A496622J92389m26375L28656n06497K48305K10058j9612j08428J97416n7157
14608A555377J32769o07052N97617q528l53509M31705j3645l92214K45954J73007
14598A761481l90638j41651M65851k8702O1957p8569J72754l66891N13935m8814
14588A920713m76199L89748J15422m5149J4401k91030N30891l20845j28251L95035
14578B104736j72636m4083J29828j28999K34008R046M75028m03893N2671k71611
14568A984095J49381M90155o52686N23748k20929L59436k93719K58606K29060
14559B827147J34140l6008k01067M10067K08338J24461L34507N28430L49379J092477
14549E771871K022843M299616R611013J5491574K040847j4522742j2147424m611882
$$ plain form
14618 1496622 1689011 1262636 1591292 1084795 1333100 1543158 1523546 1415118 1612534 1555377
14608 1555377 1688146 1081094 1678711 1670183 1316674 1748379 1734734 1342520 1588474 1761481
14598 1761481 1370843 1229192 1695043 1666341 1728298 1649729 1822483 1455592 1969527 1920713
14588 1920713 1444514 1834262 1949684 1904535 1918936 1627906 2158797 1837952 1709701 2104736
14578 2104736 1932100 1888017 2017845 1888846 2122854 2131900 2606928 2203035 2255706 1984095
14568 1984095 2133476 2623631 1970945 2494693 2273764 2633200 2339481 2598087 2827147
14559 2827147 2961287 2925279 2724212 3134279 3342617 3467078 3801585 4330015 4679394 5771871
14549 5771871 7794714 12094330 21705343 37196917 39237764 24715022 12567598 7955716
14541G955716l092666j597138r29783k31519j54888j92119M80120l43206J86719
14532B081236P0250J00383k22847K18577k02349J38926J55830J81055l9998j69196
14522B311867J88944k22034J03078J89003j27374K95239k58469J49697J70185
14513B800136l43188M33819m99715O81028j64273J00414j62795J62132j70916
14504B836642K47741k56494O3012M21578k70375K62469n4353j29458J76954j39721
14494C157995L71992J30620k29709R9716p0496m2519K18548k56733O2259L11988
14484C753661J38839O035K9654M2653l3184r4123j61442K58726J46950J6886k17980
14473C886675O86670m26279L78313l7721m9908k03137K84310j23223J67536P3127
$$ plain form
14541 7955716 4863050 3265912 2336129 2104610 1949722 1757603 2237723 1894517 2081236
14532 2081236 2151486 2251869 2029022 2247599 2045250 2184176 2340006 2521061 2481063 2311867
14522 2311867 2500811 2278777 2381855 2570858 2443484 2738723 2480254 2629951 2800136
14513 2800136 2456948 2890767 2391052 3072080 2907807 3008221 2845426 3007558 2836642
14504 2836642 3084383 2827889 2890901 3312479 3042104 3304573 3250220 3120762 3297716 3157995
14494 3157995 3529987 3660607 3430898 3530614 3460118 3417599 3636147 3379414 3441673 3753661
14484 3753661 3892500 3898535 3928189 3970842 3937658 3843535 3682093 3940819 4087769 4104655 3886675
14473 3886675 4573345 4147066 4525379 4487658 4437750 4234613 4518923 4395700 4563236 4636363
14463D636363L28897n0414o1903q3687J72131J08428j69423K41475J87611l82374
14453D927104L67770R2351K4956L23993R8982j00686K65346k08729j19376L97172
14443F068883k72174Q5596K28793J4785K56754l4585Q7791j20144N73568l80036
14433F509231J6856N34606r3264J16456J96686k71624J63755J98542M3771J66407
14423G581422Q0639K03406k76648L93759K0419N27344l66377J0851L86156L08888
14413H869859J9870L04529j53891L3026L91015J53267J34317L62829j39837K30316
14403A0205300J21150J67807L09241J67380j95111L73516j7442M17974l7494K96749
14393A1809070J54457R4198M18743m1414K30418K87107K95688J08336K59806N20623
$$ plain form
14463 4636363 4965260 4914846 4852943 4769256 4941387 5049815 4880392 5121867 5309478 4927104
14453 4927104 5294874 5387225 5412181 5736174 5835156 5734470 5999816 5791087 5671711 6068883
14443 6068883 5796709 5882305 6111098 6125883 6382637 6348052 6435843 6315699 6889267 6509231
14433 6509231 6526087 7060693 6967429 7083885 7280571 7008947 7172702 7371244 7415015 7581422
14423 7581422 7662061 7865467 7588819 7982578 8002997 8530341 8163964 8174815 8560971 8869859
14413 8869859 8889729 9194258 9040367 9073393 9464408 9617675 9751992 10114821 9974984 10205300
14403 10205300 10326450 10494257 10803498 10970878 10775767 11149283 11131841 11549815 11512321 11809070
14393 11809070 11963527 12057725 12476468 12435054 12665472 12952579 13248267 13356603 13616409 14137032
14383A4137032L95589J16290J6886N4446M26934L50231M56898L14571J97804K74667
14373A6741348L20942N79399J33855J33677N96169P86719k37761N11133L07921
14364A9873402M96481N64248M60930L67845K23362O09362Q01749Q1726Q88215
14355B4367320K74100P92143P99967O69900N80427O29071M62436R19051N03626
14346B9998041M68097J090619O91642J068071N84765J288452Q42450Q70455J088641
14337C7991233J068917Q95435J378570J352232J106799J304325J276332J390802
14329D7764645J480580J608717J884879J697060J800656J721204J806532J930779
14321F1695052K335241J979228K771443K225352K696211K685497L045453L440067
$$ plain form
14383 14137032 14532621 14648911 14665797 14720243 15147177 15497408 15954306 16268877 16466681 16741348
14373 16741348 17062290 17641689 17775544 17909221 18505390 19292109 19054348 19565481 19873402
14364 19873402 20369883 20934131 21395061 21762906 21986268 22595630 23397379 23479105 24367320
14355 24367320 24641420 25433563 26233530 26903430 27483857 28112928 28575364 29494415 29998041
14346 29998041 30466138 31556757 32248399 33316470 33901235 35189687 36032137 36902592 37991233
14337 37991233 39060150 39955585 41334155 42686387 43793186 45097511 46373843 47764645
14329 47764645 49245225 50853942 52738821 54435881 56236537 57957741 59764273 61695052
14321 61695052 64030293 66009521 68780964 71006316 73702527 76388024 79433477 82873544
14313H2873544K698266L366033L857570M064800L755267M522492M152605N071002
14305A14361579M505369N601439N626142N953039O039834P102267P123286P374677
14297A63687632P872873Q172794R007458R466037R871274J0237338J1082041J1521136
14289B40918583J1914761J2534018J3144949J3507679J4389868J3885893J4592209
14282C34887960J4819470J4401572J4704443J4142128J3817468J2722181J1704597
14275D31199819J0669732R014618N654848J732497k64667k686612J90512r74966
14267D54535781k348266l558667o444744r299163j1423547j2811533j3514001
14260C95135860j4888214j5339529j5609496j5173064j5510366j5049759j4680180
$$ plain form
14313 82873544 85571810 88937843 92795413 96860213 100615480 105137972 109290577 114361579
14305 114361579 118866948 124468387 130094529 136047568 142087402 149189669 156312955 163687632
14297 163687632 171560505 179733299 188740757 198206794 208078068 218315406 229397447 240918583
14289 240918583 252833344 265367362 278512311 292019990 306409858 320295751 334887960
14282 334887960 349707430 364109002 378813445 392955573 406773041 419495222 431199819
14275 431199819 441869551 450884169 456539017 458271514 458006847 455320235 455510747 454535781
14267 454535781 452187515 448628848 442184104 432884941 421461394 408649861 395135860
14260 395135860 380247646 364908117 349298621 334125557 318615191 303565432 288885252
14253B88885252j3348628j2693477j2673983j2464164j1670708j1037716j0692179
14246B04304397r868504r034337q857494q032554p985988p373180p044796o655814
14238A39451730n936151n491286n539502n166085n109711m564817m344629l971453
14230I9328096l912104l838811l692050l432640l154589k709566k752331l277505
14222G2558500k557348k294623j979914k221065j895556k524431j809714j632089
14214E5643760j712181j266230j697184k067768j284647j655700p49999j185082
14206D4024969j036547j661575j301085j187167o37681q84177j117503q94376
14198C5304858r94992j005281m59380j105785p76869n61136r83559o11417o52243
$$ plain form
14253 288885252 275536624 262843147 250169164 237705000 226034292 214996576 204304397
14246 204304397 194435893 185401556 176544062 168511508 160525520 153152340 146107544 139451730
14238 139451730 133515579 128024293 122484791 117318706 112208995 107644178 103299549 99328096
14230 99328096 95415992 91577181 87885131 84452491 81297902 78588336 75836005 72558500
14222 72558500 70001152 67706529 65726615 63505550 61609994 59085563 57275849 55643760
14214 55643760 53931579 52665349 50968165 48900397 47615750 45960050 45210051 44024969
14206 44024969 42988422 41326847 40025762 38838595 38200914 37316737 36199234 35304858
14198 35304858 34309866 33304585 32845205 31739420 30962551 30401415 29417856 28806439 28154196
14189B8154196r82798m45404o82865l84506n30897q25062r25953k74521r6472
14180B3005718n05038o34558p32534j75412p22324k63715l87219k45682j67294
14171A9171942m66688m70412q11841K23041o56650j7913j56872q12040o9669l64442
14161A5568456q0780m96175j28078j67843o23257l07648O7027j01604l93631k02296
14151A3134171o3902k91515k11100k01169j12159L2747q00246K74349m15476q1213
14141A1264487l80673q4209j73416k24016Q5844k00841m18114K49942m49841K64487
14131I933650m85210P9485l59250m00395L13126k32824l6368j39009j40674k35694
14121H296837M5727j77544j50217j194l4835n42149L70734m94130J482j58467
$$ plain form
14189 28154196 27171398 26725994 26043129 25658623 25127726 24302664 23376711 23102190 23005718
14180 23005718 22500680 21866122 21133588 20958176 20235852 19972137 19584918 19339236 19171942
14171 19171942 18705254 18234842 17423001 17646042 16989392 16971479 16814607 16002567 15932898 15568456
14161 15568456 15487676 14991501 14863423 14695580 14072323 13764675 13831702 13730098 13336467 13134171
14151 13134171 13070269 12778754 12567654 12366485 12254326 12287073 11486827 11761176 11345700 11264487
14141 11264487 10883814 10799605 10626189 10402173 10488017 10287176 9869062 10119004 9669163 9933650
14131 9933650 9448440 9527925 9168675 8768280 9081406 8848582 8812214 8673205 8532531 8296837
14121 8296837 8342564 8165020 8014803 8013609 7978774 7436625 7807359 7313229 7314711 7156244
14111G156244L06065r5846k20845j02887O179l75345o8659j04415J65545P6408
14101F742444o27107O232J74242K26947m77154l7441K722k37138K24940k40790
14091E757897k51571L0238P6419m6753q3769k86166K73424j1771m66281J41598
14081E133265k29684O6537j61593K85353k44501k08336K86489J52235l4024o00696
14071D445045J91616K9187J25827l27536K53808j62189j72694K8028j08362m2132
14061D260598l51408K39299j79198M58992k77250j8939k68855P786l47200M68468
14051C992293l22913P6584o4662p0841o7050n9060P8184J50346l38464J07339
14041C481756Q4847J07596j83490j51163P6765k7191k01274K61409k75232J44789
$$ plain form
14111 7156244 7462309 7366463 7145618 7042731 7048910 6673565 6604906 6500491 6666036 6742444
14101 6742444 6115337 6121569 6295811 6522758 6045604 6008163 6010885 5773747 5998687 5757897
14091 5757897 5506326 5536564 5612983 5566230 5482461 5196295 5469719 5457948 4991667 5133265
14081 5133265 4903581 4970118 4808525 5093878 4849377 4641041 4927530 5079765 5045741 4445045
14071 4445045 4636661 4665848 4791675 4464139 4717947 4555758 4383064 4411092 4302730 4260598
14061 4260598 3909190 4148489 3969291 4428283 4151033 4132094 3863239 3871025 3523825 3992293
14051 3992293 3669380 3745964 3681302 3610461 3543411 3484351 3562535 3712881 3374417 3481756
14041 3481756 3566603 3674199 3490709 3339546 3416311 3389120 3187846 3449255 3174023 3318812
14031C318812j89790L94925k71215j55587M5909r0515q4340k11164j63167J81002
14021B774870R7254r0574K69868l55642j01338K28286l92485J73129l6913m434
14011B562021m347J78102m2464J2476j5211m92638K37844J37939p16K11847n30374
14000B254479J26092k98578J85557l4434p6314K98452j93520K98530K446J49391
13990B712101j70907J399279K806855P525300J7512858P801683r151294j3942696
13982A6493179o617038l389674j283674q96012l56157m16589k53919J17587m22514
13973B975189l12451L09713k52188k04062P1992l6556J73565n27106M59205o69636
13963A987665J82820K55090J52520p47755L83106Q7825J93089j07485m65692J64151
$$ plain form
14031 3318812 3129022 3523947 3252732 3097145 3143054 3052539 2968199 2757035 2593868 2774870
14021 2774870 2872124 2781550 3051418 2695776 2594438 2822724 2430239 2603368 2566455 2562021
14011 2562021 2557674 2735776 2693312 2705788 2690577 2197939 2435783 2573722 2573006 2784853 2254479
14000 2254479 2380571 2081993 2267550 2233116 2156802 2455254 2261734 2560264 2562710 2712101
13990 2712101 2541194 3940473 6747328 14272628 31785486 39587169 30435875 16493179
13982 16493179 9876141 6486467 5202793 4306781 3950624 3534035 3280116 3397703 2975189
13973 2975189 2662738 2972451 2720263 2516201 2588193 2551637 2725202 2198096 2657301 1987665
13963 1987665 2170485 2425575 2578095 1830340 2213446 2301271 2494360 2386875 1921183 2085334
13953B085334K42692J3529k48359K60104k57074l71028M64136l13388L30909k36520
13943A970335N637R3187l89404J85108j59092K12277k37512R6153L33076l04293
13933A805472j02593K025R1075k13536K12641j81627N8941J59284l31548J38092
13923A638226J45874j45925L5331j29613L5044K63988k91016J13095m5454N457
13913A625007K5331J54912l43686M9229J28156l87522L08647R475l12270J43608
13903A400887L66539l03231l9905j35923L40916l21631K28591j63984j97280M38354
13893A613333m97339J63850k42765P15678l58574k05782O3290j7908m9234M05570
13883A590119m58860K31640j36958K03187l38888J78829r6833J66604k71102K86101
$$ plain form
13953 2085334 2328026 2341555 2093196 2353300 2096226 1725198 2189334 1875946 2206855 1970335
13943 1970335 1975972 2069159 1679755 1864863 1705771 1918048 1680536 1776689 2109765 1805472
13933 1805472 1702879 1704904 1795979 1582443 1795084 1613457 1672398 1831682 1500134 1638226
13923 1638226 1784100 1638175 1673506 1543893 1578937 1842925 1551909 1665004 1619550 1625007
13913 1625007 1650338 1805250 1461564 1510793 1638949 1251427 1560074 1569549 1257279 1400887
13903 1400887 1767426 1464195 1424290 1288367 1629283 1307652 1536243 1372259 1174979 1613333
13893 1613333 1115994 1279844 1037079 1752757 1394183 1188401 1251691 1233783 1184549 1590119
13883 1590119 1131259 1362899 1225941 1429128 1090240 1269069 1172236 1338840 1067738 1353839
13873A353839j85926l50180J23123m3359L69843L0191N877k31720p1835K33349
13863A233202O7848j59917l8429L8406K16076k36490p8967K86503k48845R5427
13853A174814j10181J8147O5724M0007j39627j47366K48437k44939K90836l1011
13843A164841k57368l3594K34107q6855J13495k21234K41163l97091M69256l57962
13833H68758l7047J12900M7400K4703K5447l11849J07384N0929J91719N5271J04482
13822A240097n24857K46858j89519N25202k52759K05296O2124k44191J177J0572
13812A080000l48773q7020K58132k71639O7302n7375L61291D55920M73826N8736
13802I88482q6557O7092j29624k01685L4858k50893O20542P5859l87350j04612
$$ plain form
13873 1353839 1167913 817733 940856 897497 1267340 1297531 1303408 1071688 999853 1233202
13863 1233202 1301050 1141133 1102704 1141110 1357186 1120696 1041729 1328232 1079387 1174814
13853 1174814 1064633 1082780 1148504 1188511 1048884 901518 1149955 905016 1195852 1164841
13843 1164841 907473 873879 1107986 1021131 1134626 913392 1154555 757464 1226720 868758
13833 868758 831711 944611 992011 1016714 1042161 730312 837696 888625 1080344 1135615 1240097
13822 1240097 715240 962098 772579 1297781 1045022 1250318 1312442 1068251 1069428 1080000
13812 1080000 731227 644207 902339 630700 698002 640627 1001918 455920 929746 988482
13802 988482 901925 969017 839393 637708 672566 421673 1042215 1118074 730724 626112
13792F26112J47496R6021l5619J18432R09K0747J69572O3040k39799r5993j46856
13781G24062j5657P2523n9852j93488J19853J51316J63098j77440M0911l88343
13771D36983K75637P2629k13314M04897j50148j46301J06312P5574l96409N95084
13761A060944D94746R0097J96240O8371m3854p1147J59190l17860J59340Q8175
13751H23298j69530J94200j35082n1595J79924n1626P4435k88656J89554k50343
13741E14579o4600L32025k92671J50839P1638K1419j87593J36737p7382j3902
13731E91089J0855q7475K93504k29235p0484M0896J14315j12749J86867j7978
13721G19605N1646j13014l6082l0674B59713J19878R116P8529L47875k05209k21390
$$ plain form
13792 626112 773608 869629 834010 952442 953351 974098 1143670 1206710 966911 870918 724062
13781 724062 708405 780928 721076 527588 647441 798757 961855 784415 825326 436983
13771 436983 712620 785249 571935 976832 826684 680383 786695 862269 465860 1060944
13761 1060944 494746 584843 781083 849454 805600 734453 893643 575783 735123 823298
13751 823298 653768 847968 712886 661291 841215 789589 864024 575368 764922 514579
13741 514579 449979 782004 489333 640172 711810 733229 545636 682373 604991 591089
13731 591089 601944 514469 807973 578738 508254 549150 663465 550716 737583 719605
13721 719605 771251 658237 622155 591481 259713 379591 388707 467236 815111 609902 388512
13710C88512J67126J01181N1586o2112Q2354r9485N9904K16945l41529J99528
13700G64010k52062J65844J39251j32467k06167m7767j23139M10047l13926j33206
13690B70418L39049k02810M43285J6344l01907j70370J98913J50319l26158L38222
13680G55305k78185B13346K23202M04578k50493J97425l20685R5964M3291j74120
13670D32508J77190A69973K15203K67768C21438K42728k3616r1047B08613M08694
13660F17307j19791A02136L38849N4523K1072J95511k44172j49192J76972k24058
13650B71641J63133N3552J24850j57249B12137J90597O1346j18142L39534k5259
13640F60213j01479J12337A68113O07978C57341J23614k36241P8290l2921J08662
$$ plain form
13710 388512 555638 656819 708405 646293 728647 629162 689066 906011 564482 764010
13700 764010 511948 677792 817043 684576 478409 430642 307503 717550 403624 270418
13690 270418 609467 406657 849942 866286 564379 394009 592922 743241 417083 755305
13680 755305 477120 213346 436548 841126 590633 788058 467373 563337 606628 432508
13670 432508 609698 169973 385176 652944 321438 564166 540550 449503 208613 617307
13660 617307 497516 102136 440985 495508 516580 712091 467919 318727 495699 271641
13650 271641 434774 488326 613176 455927 212137 402734 464080 345938 685472 660213
13640 660213 558734 671071 168113 776091 357341 480955 244714 323004 290083 398745
13630C98745q2962K16496L08617C10960K0715A61949K33372J12784J65904C15457
13619E78368q2544j43624M3800Q8398k32294M4796R3636K04722p6928B34952J78767
13608D13719l5550K16294j93917A86367K34395l9080q7586A17647L42084B08367
13597E10361N7985D9926J42969M85555k34766r9729J27314J31637k36386J23367
13587D89887J52477B37464K2194J03053j0166K71693B52477J11147L3727A73159
13576D75797K9254k18651k5214J57203F2474L24073o5309b4266D04916j69037
13566B35879m4980j1561K3532k827L8791L5471N3835q3410H6716K07903J67760
13555D62379A83646K95643j74388j08132H5842K93271J66234o5424B08835l2110
$$ plain form
13630 398745 315783 532279 840896 310960 331675 161949 395321 508105 674009 315457
13619 578368 495824 352200 396000 484398 252104 296900 390536 595258 518330 234952 413719
13608 413719 378169 594463 400546 186367 420762 381682 294096 117647 459731 208367
13597 510361 568346 49926 192895 678450 443684 343955 471269 602906 366520 489887
13587 489887 642364 237464 259658 362711 352545 624238 252477 363624 397351 173159
13576 475797 505051 286400 261186 418389 62474 386547 321238 -24266 404916 235879
13566 235879 190899 179338 202870 200043 238834 274305 328140 244730 86716 294619 462379
13555 462379 183646 479289 304901 196769 85842 379113 545347 479923 208835 176725
13545A76725L5550C6713L91040A87746L48813m4757j20898j07144r5446K56171
13535D24485A85187K91783a96753C91885e6943A1219K14865I7452C2157K671M68601
13524E03429j38560m5694b30427C06076o9164K24783j24958k1987J86113k16837
13514B84026Q0357A46162l328K16169J32789A22181J31444P1909K2932L6823A30438
13502D128J97193N50350l05814I6447O5724P3820L05171A60823L28469H6017k0522
13491F5495L45664j00288L03149f0735J7705A49158J6960J54897q3336k1148G5047
13479B96810K39642k44339p3432B2484M0544J45983R4792j12431K80945j93140
13469B79177K87979A33557J99942N7740K48088k97061n6809L3314n7738q2504
$$ plain form
13545 176725 212275 36713 427753 187746 536559 491802 370904 263760 168314 424485
13535 424485 185187 476970 -196753 391885 -56943 11219 226084 97452 32157 34828 503429
13524 503429 364869 319175 -230427 306076 236912 461695 336737 314750 500863 284026
13514 284026 364383 146162 142834 359003 491792 122181 253625 325534 348466 385289 130438
13502 4128 201321 751671 445857 96447 162171 235991 541162 160823 489292 86017 65495
13491 65495 411159 310871 614020 -60735 -43030 149158 166118 321015 237679 216531 75047
13479 296810 536452 292113 218681 22484 63028 209011 303803 191372 472317 279177
13469 279177 567156 133557 333499 391239 639327 342266 285457 318771 261033 178529
13459A78529J72160j19944D9940K06427A12663O8669R046j6750M75227G7038a61994
13447A17183O1354K31605A90182k0464K64725D3661R1344P2080J93652j52620
13437B48117J37872A43381k8172K30358A56366R7453J03651i3079A12559J23571
13427B36130L57198k69812k712j40116c19B40972j08933o5891A59J96091h6836
13415C01472p8675L78714B40894j15137L201L0138P2959F5643J62485D4085J68351
13404B12436J12336j23337M962k7357M0638m5861o4700Q9266I1707N4125K35179
13393C81011Q3261B29137J45134M3505H3338j1798L80553o5548b20527C30531
13382B88855A39574K28598j74679o5911C7430N70515B84983J43562l6444j53353
$$ plain form
13459 178529 350689 230745 49940 256367 112663 181332 190378 173628 648855 77038 -161994
13447 117183 178537 410142 190182 169718 434443 43661 135005 207085 400737 248117
13437 248117 385989 143381 115209 345567 156366 253819 357470 -93079 112559 236130
13427 236130 593328 323516 320804 180688 -319 240972 132039 66148 159 196250 -86836
13415 301472 222797 601511 240894 125757 128958 159096 232055 65643 228128 44085 212436
13404 212436 324772 201435 206397 179040 219678 173817 109117 198383 91707 145832 381011
13393 381011 464272 229137 374271 417776 83338 71540 452093 386545 -220527 330531
13382 288855 139574 368172 193493 127582 37430 607945 284983 428545 392101 238748
13372B38748Q3701j16813A01876K64490f0932C5980L63385B8836J82187p0749
13362A40274K24384I8352d2673I3180K10102L7454m0577E8958K71691q2586o0909
13351A87154K08745j30612j6733n3120K13168A77164K68894M104A82562J41565
13341C24127L93875C17934K8517l7965L08434A79418J00890j16720c7310B10708
13330A43998Q6789H7376N1790m7213J16203D6161J57994K01457A98921a39819
13319D53992H6821J8939C0490a90146O5075D75489B25736b1419A62356l6791L93999
13308E19564A34024K10631a52516A11556L39382l7062F0453K10006k6641L7695
13298B81513j01140e8907B44473B416Q8152i4786B28546I7159M0890K47958A52502
$$ plain form
13372 238748 322449 205636 101876 366366 -60932 35980 399365 28836 211023 140274
13362 140274 364658 98352 -42673 93180 303282 340736 300159 58958 330649 248063 187154
13351 187154 395899 265287 248554 195434 408602 177164 446058 450162 182562 324127
13341 324127 718002 317934 346451 308486 616920 179418 280308 163588 -37310 210708
13330 143998 230787 87376 139166 91953 208156 46161 204155 405612 198921 -139819
13319 453992 86821 105760 30490 -190146 -125071 475489 225736 -21419 162356 125565 519564
13308 519564 134024 344655 -152516 111556 450938 413876 60453 270459 243818 281513
13298 281513 180373 -58907 244473 2416 90568 -94786 228546 97159 138049 386007 152502
13286D6124a43918C11565E1094J81906F0384a91847A54401F1157j0170J41017
13276A92004m1900b24806A62527K11571e5541H9771J87708d4600F9055A1903a68280
13264D16468g6179D39346k03199L971J631N9096R9455j37942N9236c2592A588
13252B19844K04795J04774a17140l6463e9906A50490J40625P68A26155b1121B43489
13240A25600K77317A73065K18124j62129r7000N4311J36072G7801g0359F2360
13229B64057b17701b8062C97916j84245a18388C29230a92624H4953c09325B53939
13218A71000G9775K07938K13743A45134M7903b245A20627i4946A20935P2438b5492
13206A37080a1770I6058L0932J48875J4082p1510n0336p6526j2778J41227b3380
$$ plain form
13286 46124 -143918 311565 51094 233000 60384 -191847 154401 61157 50987 192004
13276 192004 150104 -224806 162527 374098 -55541 89771 277479 -44600 69055 11903 -168280
13264 416468 -76179 439346 236147 240118 241749 300845 400300 262358 321594 -32592 1588
13252 219844 424639 529413 -117140 -153603 -59906 150490 291115 291883 126155 -21121 243489
13240 125600 402917 173065 391189 229060 132060 186371 322443 77801 -70359 62360
13229 264057 -217701 -28062 397916 213671 -118388 329230 -192624 84953 -309325 253939
13218 171000 79775 287713 501456 145134 193037 -2245 120627 -94946 120935 193373 -25492
13206 137080 -11770 96058 126990 275865 289947 218437 168101 91575 78797 220024 -23380
13194B33305J03116j08716I1341m1910a13844C452J15738b1119A16059A8781K53461
13183B72242r3273d5305D85252H0338a13173D27926d2127B72047O2740H2981l5175
13172D7806L66152l5317B2276O8013j6384O110K23084e1060A32358L93333G5157
13160D9059K51547D2687L30254a05704B53423k0280M6160r1633Q0107E9696a73132
13148C02985A50389B3052c10906C24612A6023L89829b47854B76840b48535B17822
13137D4691M2756i8027A01670j5657j7471J15249E3917J91478I1029H519a7833
13125b10030G9400b17333G4433c06550H8068L03997A6785c66j13579k73768B75486
13113D8534a57071A36740B9639d2105G6161c46969D4691P4070l4000L80Q8376
$$ plain form
13194 233305 336421 227705 91341 49431 -113844 3452 119190 -21119 116059 18781 272242
13183 272242 178969 -45305 485252 80338 -113173 427926 -42127 272047 334787 82981 47806
13172 47806 413958 378641 22276 90289 73905 80015 303099 -51060 132358 525691 75157
13160 49059 300606 42687 372941 -105704 253423 233143 279303 187670 267777 59696 -173132
13148 302985 150389 23052 -310906 324612 16023 405852 -247854 276840 -248535 217822
13137 44691 87447 -98027 101670 86013 68542 183791 53917 245395 91029 8519 -17833
13125 -210030 79400 -217333 74433 -306550 88068 392065 16785 -366 -113945 -387713 275486
13113 48534 -157071 136740 29639 -42105 76161 -346969 44691 118761 84761 85141 173517
13102A73517M271q5720b6539B47902b01178A94078n9093c00923A56045J54680
13092C10725j03790b2396B8764P081M91912a62755B62552i9425F0847e2369j64992
13081b17361A01585O8717b8914j73747M7633c0055l883l2666D3153O1959E1112
13069B71305q2326b23506L7065A37870J00375h055I9030J34014O2145a2199A11167
13057C00554C1942L0601N7840Q0874H8695a94993B41650k1916f1385A54204o7826
13046H6378K04908J8082A06529J21894k2527r2713i8343A32124C5893J7491K2095
13035G5479J23554J33723F7536b33911e9894C7023J96318d2315B07400C2850b02946
13023B23863q8975o249J35519J07817A40937q995i0333C33245D5018K23533J70526
$$ plain form
13102 173517 177788 92068 -26539 247902 -201178 194078 134985 -300923 156045 310725
13092 310725 206935 -22396 28764 35845 527757 -162755 262552 -99425 60847 -52369 -217361
13081 -217361 101585 170302 -28914 -202661 -155028 -30055 -33938 -66604 43153 105112 51112
13069 271305 188979 -223506 -186441 137870 238245 -8055 99030 233044 295189 -12199 111167
13057 300554 31942 62543 120383 201257 88695 -194993 241650 219734 -61385 154204 86378
13046 86378 291286 309368 106529 228423 205896 113183 -98343 132124 35893 53384 75479
13035 75479 199033 332756 67536 -233911 -59894 37023 233341 -42315 207400 32850 -202946
13023 223863 134888 128639 264158 371975 140937 131942 -90333 333245 45018 268551 439077
13012D39077d9094A92745r3079K8051J9937K98497D4062K32928J0230j05355L78103
13001E59968A2129a25474G7576J46401k8359M1233N7400D0339J68755b22619e705
12989F941J63463F2432h3685A32041k0175B0550e0399F6691a328B94725p520d0837
12976A82900a13874B92863A04777M30289a19420k29428f3165B39056a17297I7874
12965E2361K9896i9703m2549B32547a07888e3443Q451D7461J60988I4523a87943
12953B26438A11891b44668i5065o9109A91733a61965b3287l06118A46600K34603
12943C81203A86299H4534f9932A68351a10920d0348C46912H0436J75401K2817
12933B78654A22840R667c340C34150A09593a90552E1423J56642a39718A46317
$$ plain form
13012 439077 -49094 192745 99666 127717 147654 446151 44062 276990 287220 181865 559968
13001 559968 12129 -125474 77576 223977 195618 236851 294251 40339 209094 -222619 -5705
12989 6941 170404 62432 -83685 132041 111866 20550 -50399 66691 -1328 294725 287205 -40837
12976 182900 -113874 292863 104777 535066 -119420 -348848 -63165 239056 -117297 97874
12965 52361 82257 -99703 -142252 232547 -107888 -53443 -44992 47461 208449 94523 -187943
12953 226438 111891 -244668 -95065 -164174 191733 -161965 -23287 -329405 146600 381203
12943 381203 186299 84534 -69932 168351 -110920 -40348 346912 80436 255837 278654
12933 278654 122840 132507 -3340 334150 109593 -190552 51423 208065 -139718 146317
12922H0270c674o7449D6422c07182E9977B5626Q7835l9287e5666A07159c18297
12910G0851A5939c9137j04040J668P0745A10337h0953B43635f3064l4377D4735
12898H7864J0030A3368a08785A71683E6456a31452a0231j27039B16087H3304D110
12886D15161C8496N3758a94029C3447L91002a8967m39351E2295R5781K61736j66967
12875B42845c42934c187j25169b0778B65861G7383k0027D693J52067e3006B60822
12863e3412A42292d7210A46829L5870a89652B62616F1575K43834E3493k0182J32347
12852A65658M2764o1564M3057d1999L776A78375o0685f9153p9565a979A31254
12840B11944b8151j04486q264A29149K66492q3863f9956k31791D7097a46808A5737
$$ plain form
12922 80270 -3674 -71123 46422 -307182 59977 25626 113461 74174 -55666 107159 -318297
12910 70851 15939 -39137 -143177 -141509 -70764 110337 -80953 243635 -63064 -97441 44735
12898 87864 97894 13368 -108785 171683 56456 -131452 -10231 -137270 216087 83304 4110
12886 415161 38496 92254 -194029 33447 424449 -18967 -458318 52295 148076 409812 242845
12875 242845 -342934 -3187 -128356 -20778 265861 77383 57356 4693 156760 -53006 260822
12863 -53412 142292 -47210 146829 182699 -189652 262616 61575 305409 53493 33311 165658
12852 165658 208422 146858 189915 -41999 -38223 178375 117690 -69153 -148718 -1979 131254
12840 211944 -28151 -132637 -140901 129149 395641 311778 -69956 -301747 47097 -146808 15737
12828A04253d6805E3512R6984c11231C92512A94788A4063d412C52915h8050l421
12817i1471I2086j2555J88420H1373c44361G3279f4481l413L0327g44A05937m7368
12805E8569r187J44317l3062m1484d5445d159k02458I7753J58015b88705B06760
12793A03992J52881b41620c1382K074a2004B8950c0372B36309a40365H2512a29787
12781a30317q7219b4344B16039l6578E9777b67867j46507d1462j3142E6810a98495
12769a20500F2016d8390n8562a4806B43688K77497b7571D033L88483i4601E7494
12757a4146I3803a16595A13648f1864B44509F5738b7400A8217a60957I8142Q900
12746A07042a46607E9182c04178A40305b42512d7513D77448A18210P6995k4368
$$ plain form
12828 104253 -46805 53512 150496 -311231 392512 194788 14063 -4412 352915 -88050 -91471
12817 -91471 92086 79531 267951 81373 -344361 73279 -64481 -67894 -37567 -744 105937 58569
12805 58569 49382 193699 160637 119153 -45445 -4159 -206617 97753 255768 -288705 206760
12793 103992 256873 -241620 -31382 -29308 -12004 28950 -30372 236309 -140365 82512 -129787
12781 -130317 -217536 -24344 216039 179461 59777 -267867 -414374 -41462 -54604 56810 -198495
12769 -120500 62016 -48390 -106952 -14806 243688 521185 -27571 4033 392516 -94601 57494
12757 -14146 93803 -116595 113648 -61864 244509 65738 -27400 18217 -160957 98142 107042
12746 107042 -146607 59182 -304178 140305 -242512 -47513 477448 118210 195205 170837
12736A70837l2810K3315M8115I3484h9676A73621p9017f1654C2652a68684B7150
12724a58359A2741n124h0350F417a30317G0567d2128F8826N3869h2516C03179
12712A05041J78819M867k8126r815K31114k0380j61366H0537K46970m3627L0251
12701C14131A22310Q2228r6951O2538i8024M6944k04787A89804d3866B83572o4859
12690B18713a8812C8809a85123A95171f520B2486K49381a28785B05795O825I7244
12678D11640A5638a23405B65639g074C51909A47346J20503C6316a2876A09311
12667B343g8619B67750q7542A7376K62531a52A96943J46208j66784A4065J0427
12656B4492Q6669J81609A0768L64351A25667c24593A9372L644M50256b35585F9404
$$ plain form
12736 170837 138027 161342 209457 93484 -89676 173621 94604 -61654 32652 -168684 27150
12724 -158359 12741 7617 -80350 6417 -130317 70567 -42128 68826 122695 -82516 303179
12712 105041 283860 288727 260601 250786 481900 461520 300154 80537 327507 283880 314131
12701 314131 122310 204538 107587 170125 -98024 -51080 -255867 189804 -43866 283572 218713
12690 218713 -18812 38809 -185123 195171 -6520 22486 271867 -128785 205795 212620 97244
12678 411640 15638 -123405 265639 -7074 351909 147346 267849 36316 -12876 109311
12667 2343 -78619 267750 180208 17376 279907 -152 196943 343151 176367 14065 24492
12656 24492 111161 292770 10768 375119 125667 -324593 19372 23016 473272 -235585 69404
12644F9985L55726j43640a94081C5065K08736C6416L6493A2842b00145B31275
12633B67261a86227j6045b8490C11236o6309C2547J42983O9951a35503q8775c0
12621G7550J55932c30278A26597k8660L22721a51315D531K27379i9297d8678A58931
12609a6552p0697C89155c8546p0771B17880m2722b22165k3399o9170A22096B0901
12597B63615b33594a618B57007a34971H8751b97440a29164A31465K41096A5541
12586E3385f8690D8398A1804J77290N9479i7702C75709p3137e6802A2963K37966
12575B50929q7501L06229G4629g127j94996F2998L23554A32777J57059a5706B8372
12563b04564N1555C12767B8535C655L36330j46795H9878a2522A50524a61085C78107
$$ plain form
12644 69985 425711 282071 -194081 35065 243801 36416 72909 12842 -200145 231275
12633 267261 -186227 -202272 -28490 311236 244927 32547 175530 245481 -135503 -224278 -30
12621 77550 233482 -330278 126597 97937 420658 -151315 4531 231910 -99297 -48678 158931
12609 -16552 -87249 389155 -38546 -109317 217880 175158 -222165 -245564 -314734 122096 20901
12597 263615 -233594 -1618 257007 -134971 88751 -297440 -129164 131465 372561 15541
12586 53385 -68690 48398 11804 189094 248573 -97702 375709 302572 -56802 12963 250929
12575 250929 163428 469657 74629 -7127 -202123 62998 386552 132777 289836 -15706 28372
12563 -204564 -153009 312767 28535 3655 339985 193190 89878 -12522 150524 -161085 378107
12551E313b95671P9285J9017b9253r9556N7625A96302i2889A21188a89446A00463
12539A2836a35648A23769J70322a23368M0979n4081B17520a07009B6352Q8704
12529A15056f2758B85673c1719A32994B6501K8158e1179k21314G763J87893q3317
12518A12339J40262A19417e7392C66706d1314M14B34127J78080o6067G8275d415
12506A73015G6198a26708A3517K80267D5778Q3410b7050B69990I3465o719K3777
12495A10523K49889c15219A27536C4216K08754a26912A07074f4805q2001C68446
12484b6060H6080a27647b2779D64570F4979a18887C2163e708A03158a2187B16879
12472f7724k4184l49116C14286I4865A6929N8668g3038I3992R6607a48939b0681
$$ plain form
12551 5313 -295671 -216386 -197369 -29253 -128809 -71184 196302 -92889 121188 -189446 100463
12539 12836 -135648 123769 294091 -123368 -82389 -136470 217520 -107009 26352 115056
12529 115056 -62758 285673 -31719 132994 26501 54659 -51179 -272493 7763 195656 112339
12518 112339 252601 119417 -57392 366706 -41314 -40900 234127 412207 346140 78275 -4415
12506 173015 76198 -126708 13517 293784 45778 129188 -27050 269990 93465 86746 110523
12495 110523 360412 -315219 127536 34216 242970 -126912 107074 -64805 -146806 368446
12484 -26060 86080 -127647 -22779 464570 64979 -118887 32163 -5708 103158 -12187 216879
12472 -67724 -91908 -441024 314286 94865 16929 75597 -73038 93992 190599 -148939 -20681
12460E4539L74775b77177k3296A5897a47924l4749A07490e9136m9967h105k5220
12449c3325E2054g5235A35588L10379a55750L5678B20529c7993E3839a04448q9180
12438a93628C56629i5641q3537N6903C76295E4226Q2291o7994J51535a58163n3927
12427b12090C21677c9535j3798A25901b41327E6678K78202f781j24127A53381
12416C2850J45416A3245O1178a65146h2328D2713h3592H1720h7192J0483j21733
12405a98442d3691J7628B20469D9339K552M6038K6233a75614E6152f1089k7155
12394h8244B3530c06427f9296N098n2035L7195A44095c01247A80511k0938a18750
12382C05599r8092c9551I1467J04457C4503a52125F3978a3028D76L3195L97589
$$ plain form
12460 54539 429314 -277177 -300473 15897 -147924 -182673 107490 -59136 -109103 -8105 -33325
12449 -33325 52054 -75235 135588 445967 -155750 -120072 220529 -37993 53839 -104448 -193628
12438 -193628 356629 -95641 -179178 -122275 376295 54226 136517 68523 220058 -158163 -212090
12427 -212090 321677 -39535 -53333 125901 -241327 56678 334880 -6781 -130908 153381
12416 32850 178266 13245 74423 -165146 -82328 42713 -83592 81720 -87192 -76709 -198442
12405 -198442 -43691 -26063 220469 49339 51891 97929 124162 -175614 56152 -61089 -88244
12394 -88244 23530 -306427 -69296 -64198 -116233 -79038 144095 -301247 180511 159573 -118750
12382 305599 207507 -39551 91467 195924 34503 -152125 63978 -13028 476 33671 431260
12371D31260a4341B9172M4828a05571A60965a64134d6917G5437K976J03092l6272
12360A45233b93574A91986g4770B45310l2314R1986B0148a1876p6939M4349j3471
12349e7937B12934J37443B8880K68262h6107C7869O4104b13744c6670A12342B6086
12337b94259B44521b51681A1959P1195k3802B353J02962k7112e3291F9988L46304
12326D16292a89307g5148A99097M3497a20941C85441e8753p8810o0390A91038
12315i1135A1209b07357f4531C83887a17784A68909F9013B1873a61045A78786
12304D331a40564A19153P1148c35930i8547J582B59857a58822o6772B18231D3354
12292a60476j10974B40415a10114A60780n518a37283A25101j3469J695a71926
$$ plain form
12371 431260 -14341 29172 74000 -105571 160965 -164134 -46917 75437 78413 181505 145233
12360 145233 -293574 191986 -74770 245310 212996 304982 20148 -11876 -88815 -44466 -57937
12349 -57937 212934 350377 28880 297142 -86107 37869 101973 -213744 -36670 112342 26086
12337 -294259 244521 -251681 11959 83154 59352 2353 105315 78203 -53291 69988 416292
12326 416292 -189307 -75148 199097 242594 -120941 385441 -58753 -137563 -197953 191038
12315 -91135 11209 -207357 -64531 383887 -117784 168909 69013 21873 -161045 178786
12304 4331 -140564 119153 190301 -335930 -98547 -96965 259857 -158822 -225594 218231 43354
12292 -160476 -271450 240415 -110114 160780 155262 -137283 125101 111632 113327 -171926
12281D06427j73972I4177a9720k99713f2647j19092e8549B16919M2545r1989a88690
12269A33281K79621c12845A10912J98922f0859o5843J0270E17766A77080j6394
12259A60686l6813R7895A05004b60888h2345C36436k0940j25072E6201O7253b59689
12247a2614B62561J47327b09488B42152p8555a77504C6153R499b4972j07492B09908
12235A99148d0373A078h1823k13655D769b2520A7508K76395E8199J92258M9226
12224B99683L8739L23118O1195B93992J0729r8043J53857H6962J267P338b47362
12212A12592K16584a671A59297k0645j1544J13251J03851q1543J9061P9673P2743
12201D34144b5529F6621K8193J27402G2901J58515D4931Q9504J18509F1895K54385
$$ plain form
12281 406427 232455 94177 -19720 -319433 -62647 -181739 -58549 216919 259464 167475 -188690
12269 133281 412902 -312845 110912 309834 -60859 -126702 -116432 517766 177080 160686
12259 160686 123873 221768 105004 -260888 -82345 336436 315496 190424 56201 123454 -259689
12247 -12614 262561 409888 -209488 242152 163597 -177504 36153 45652 -24972 -132464 209908
12235 199148 -40373 1078 -81823 -295478 4769 -22520 17508 293903 58199 250457 299683
12224 299683 338422 661540 722735 293992 304721 206678 360535 86962 88229 95567 -247362
12212 112592 329176 -1671 159297 138652 127108 240359 344210 262667 281728 361401 434144
12201 434144 -25529 66621 94814 222216 72901 231416 44931 134435 252944 61895 316280
12190C16280n2895d986j87687D25978j80625m3387N7231A21784a93113g2141j17289
12179a89430A7549a54993B96270C0910c4364B27825b2973E36407b2817A25075
12168B3577J02729L3313M2815N8312J43154A77856G583b253A25641k8121f8223
12156B93781A32272J78979i8515A30330a21079B5446K38857E2485J43607a26039
12145i92C60898H1408A1074P7783a19150I1422J06575a20908B05725A01523L55510
12134D57033g6927A18098L9567F5221J57310j05114a30086E6914J50636R2380
12124B99930b49489b945j4770j3676J1263j73520B19520d571D17f8955l1247B7235
12111A43402K08228D775K47162D0985c67A26848J4110b16829N8897A59719R0650
$$ plain form
12190 316280 263385 -4986 -192673 425978 245353 201966 259197 121784 -193113 -72141 -189430
12179 -189430 17549 -154993 296270 30910 -34364 227825 -22973 536407 -22817 125075
12168 23577 126306 159619 202434 260746 403900 177856 7583 -2253 125641 97520 -68223
12156 293781 132272 311251 -98515 130330 -121079 25446 264303 52485 196092 -126039
12145 -992 360898 81408 11074 88857 -119150 91422 197997 -120908 205725 101523 457033
12134 457033 -76927 118098 157665 65221 222531 117417 -130086 56914 207550 299930
12124 299930 -249489 -2945 -17715 -31391 -20128 -193648 219520 -4571 417 -68955 -100202 27235
12111 143402 351630 4775 251937 40985 -367 126848 140958 -216829 -157932 159719 250369
12100B50369c4473j82513A08851b19403D1029a8067l6138A49673f9991a1432j18453
12089a29885A45174p0156J68853r1923c30869A95326a57963B29175f706k51836
12079b58542J26250F20635b0934A14328b548E9913J59811C1342b38904A07956
12068c37509d6687F7734f5904B54493f60F465K01234H2303a07860A05255a21471
12056D08517k9728R05812M82446o25753D63375a20585A94816a02593B0323K18546
12046B38869a2026j10581F8426b616l5883n02473A9363e2938j54406l2303A61254
12034b76635B37121o0708f8808B29985F8512i2456B52519d9414B8398L6894E710
12022H3793a89961e4026C31520A63791n1825J8666e1020E8697K10374A09375i8370
$$ plain form
12100 250369 -34473 -216986 108851 -219403 41029 -18067 -54205 149673 -69991 -11432 -129885
12089 -129885 145174 75018 243871 151948 -330869 195326 -157963 229175 -6706 -258542
12079 -258542 -132292 620635 -20934 114328 -2548 59913 219724 31342 -238904 107956
12068 -337509 -46687 67734 -65904 254493 -660 6465 207699 82303 -107860 105255 -121471
12056 408517 378789 1284601 1767047 1141294 463375 -120585 194816 -102593 20323 238869
12046 238869 -12026 -122607 68426 -2616 -38499 -540972 19363 -52938 -207344 -239647 161254
12034 -276635 237121 176413 -68808 229985 68512 -92456 252519 -49414 28398 65292 5710
12022 83793 -189961 -54026 331520 163791 111966 130632 -51020 58697 269071 109375 -98370
12010A21830A8823J10848n6326l2771j8100a26892e5638n2783I0818K62635b51325
11998A7339Q1751J8370d14004C31197A42838b08536A42582G224P3007b26477A44539
11986E4979K00080i2364A75240A2247d0653C4423K23439a70746p40m8187N3971
11975a65702j00972a01026B47600b01326g7642j51252L7880I594b88435e5512
11964C44726K8938d7628B09749b4724E00481d7567A54093G2431J36460a85919
11953b44635G1166c0418l7679k74268a08450M0122F1103h0725c4979p6843G2081
11941d580H7316b02010A16232a37576A49880A1523a31034B27761H3553b62723
11930A56459R4107j09496J7283F7037P209L24110A61630L060L7588a92576m9654
$$ plain form
12010 121830 18823 129671 73345 40574 22474 -126892 -55638 -108421 90818 353453 -251325
11998 17339 99090 117460 -414004 331197 142838 -208536 142582 7224 80231 -226477 144539
11986 54979 255059 -92364 175240 12247 -40653 34423 257862 -170746 -171486 -219673 -165702
11975 -165702 -266674 -101026 247600 -201326 -77642 -228894 -191014 9594 -288435 -55512
11964 344726 373664 -47628 209749 -24724 500481 -47567 154093 72431 208891 -185919
11953 -244635 71166 -30418 -68097 -342365 -108450 -68328 61103 -80725 -34979 -111822 72081
11941 -4580 87316 -202010 116232 -137576 149880 11523 -131034 227761 83553 -262723
11930 156459 250566 141070 158353 67037 74246 398356 161630 164690 202278 -192576 -242230
11919b42230M8409A12678a14746A11999Q6821K29507a16301d3416k20269d4596
11908h0776F751J93818e0286A88880b97969a20223b4154D8538b46266F3973N9365
11897A23338J8564F6376a90814G693K13841b83357B7300P8006B8400K45696f5888
11885b08067A08340a86646I5655P0935F4062b7549a0610J96m1081E054M4127a25123
11872i1899j14461E1608b4513A42780a60922A68602d71847I1518a13696I1548
11861i943k38772J14259A78329G2896e5980j6321l2954F6082k77e5059D9027j8929
11849C0098N2884a78183I8322P4833e6178k7789j89516C25462e20516a31123B19091
11837A32200g9109G9943L3946c24453D2396b18474E2833d1747j96549B03593a03052
$$ plain form
11919 -242230 -193821 112678 -114746 111999 198820 428327 -116301 -43416 -263685 -44596
11908 -80776 6751 200569 -50286 188880 -297969 -120223 -24154 48538 -246266 63973 123338
11897 123338 141902 66376 -190814 7693 221534 -283357 27300 105306 28400 274096 -65888
11885 -208067 108340 -186646 95655 166590 64062 -27549 -10610 -10414 -51495 5054 49181 -125123
11872 -91899 -206360 51608 -24513 142780 -160922 168602 -471847 91518 -113696 91548
11861 -9943 -248715 -134456 178329 72896 -55980 -72301 -105255 66082 65805 -55059 49027 30098
11849 30098 82982 -178183 98322 173155 -56178 -83967 -273483 325462 -520516 -131123 219091
11837 132200 -79109 79943 113889 -324453 42396 -218474 52833 -41747 -238296 203593 -103052
11825H8320a471A30722o188f2050A85084e775A59300b28755A13014B9191N067
11814C4258a79711A44088a74988j46200B39029c2904D5750i4618j31825A52456
11803b49293f1253D17881j04473b49177g4101K8941J3807A686b42539N9389A03303
11791b34398C24649D9647L31607c2295n1549A98684J04162f5620p3874B86046
11780g9667C2710h8531b0720D8495b9448j66281e009E3784b19639B44387f2275
11768b94298a01292J1997A21294K37544h2201A89943J54482G342b42340i4716
11757C1324r612L62184a22188b3895A1345i1807C2710a14492M2643K4452A22026
11745B10357c5207j48821Q9230A30849P0438C4016b20438A21807D8227d7850A4838
$$ plain form
11825 88320 -1471 130722 124534 -62050 185084 -5775 159300 -228755 113014 29191 34258
11814 34258 -179711 144088 -174988 -321188 239029 -32904 45750 -94618 -226443 152456
11803 -249293 -61253 417881 313408 -249177 -74101 -45160 -31353 1686 -242539 -183150 103303
11791 -234398 324649 49647 381254 -32295 -83844 198684 302846 -65620 -139494 286046
11780 -79667 32710 -88531 -20720 48495 -29448 -195729 -5009 53784 -219639 244387 -62275
11768 -294298 -101292 -89295 121294 358838 -82201 189943 344425 7342 -242340 -94716
11757 31324 21712 383896 -122188 -23895 11345 -91807 32710 -114492 -71849 -47397 122026
11745 210357 -35207 -184028 -94798 130849 201287 34016 -220438 121807 48227 -47850 14838
11733A1458M52672C2128N7571b32180A32427b04897d6581l54059H195b3910A39545
11721A06005J02161a08222K8172k2729B50213e7620a2898j07573C3445J1671c18586
11709B70809n9518K8923a19177G3568R2840a65247a437B50612J4931M0710j18611
11698A87642p0794f8126A19470j1608J70066j18285b0518I5024a22101A73115
11687e1231o0698n962B82848D0110K38269A34904c2779j49892g511j12121C61936
11675B49187e9672p2044o2964F1075j6278K76421j52452M5679i5172D1189c45567
11663A44477o7280M7186a2141C955a43940D2672J37651a19481H3343B5146b8744
11651C12234j07593b05190M0465j09253H1778D0817J08070K7392a53153b8838
$$ plain form
11733 11458 464130 32128 89699 -232180 132427 -204897 -46581 -400640 8195 -23910 139545
11721 106005 208166 -108222 -80050 -102779 250213 -57620 -12898 -120471 33445 45116 -318586
11709 270809 211291 240214 -119177 73568 166408 -165247 -1437 250612 265543 306253 187642
11698 187642 116848 -68126 119470 107862 277928 159643 -20518 95024 -122101 173115
11687 -51231 -111929 -117891 282848 40110 278379 134904 -32779 -182671 -7511 -119632 361936
11675 249187 -59672 -131716 -194680 61075 44797 321218 168766 214445 -95172 41189 -345567
11663 144477 77197 124383 -12141 3955 -143940 42672 180323 -119481 83343 25146 -28744
11651 312234 204641 -205190 -164725 -273978 81778 40817 148887 176279 -153153 -28838
11640B2930R1536a914K46A50234h1551K57A1079i9847I0645a15769d3294C3473
11627B2227L7673J51555P3995Q0098A58249E2226J38474I4248k2146J21209n1818
11616A41493e2454j3816A5641J00917i9675C56120q1354E5539J23520L7805j9763
11605A97101E0987J84843i6647D6313J10886K17561j22466b669l2989F9788M13926
11594D83714a0634C07001p7767b8200j2082C3514b61359I7783L79957A02042g1007
11582C0158a42982C11439b7176B7001L21295b80822D45764E4049K33989j2155
11572B75883D3028A332J02590K65344A5087K98771a01516A31430P5580b5438A82789
11560A00610a1866A75958K1822r6379J33700h9839F2594J94211A25681B9997J36340
$$ plain form
11640 22930 114466 -1914 -1668 150234 -81551 -81294 11079 -99847 90645 -115769 -43294 33473
11627 22227 59900 211455 285450 365548 158249 52226 190700 94248 72102 193311 141493
11616 141493 -52454 -66270 15641 116558 -99675 356120 274766 55539 179059 216864 197101
11605 197101 50987 235830 -96647 46313 157199 374760 252294 -2669 -35658 69788 483714
11594 483714 -10634 307001 229234 -28200 -40282 33514 -261359 97783 477740 102042 -71007
11582 30158 -142982 311439 -27176 27001 348296 -280822 445764 54049 288038 275883
11572 275883 43028 1332 103922 369266 15087 313858 -101516 131430 207010 -25438 182789
11560 100610 -11866 175958 197780 101401 235101 -89839 62594 256805 125681 29997 166337
11549A66337n631k71O9861j08904l3884K74585a498I2892C6588L30999C4596C5
11536A01695N8202C1547P2360a8757D3740J29503e533m3278C99905f4210D49976
11524A39011f6928D90457a28172e1457E4207b80892E5780b2836A86664I512K6039
11513C5551O6779P2269M3991D1673K43154J29905a31957C34708a70554B28808
11502A84054a48565A8590J61109D1015L1738j1314P3468J99442a97779A43582
11491A40090m7929J53179K32235k38742a19404c7086B99326I1860j721J317k9085
11480F2371L15395H2005k7025K20955b31808B52300p9435a01674B86573O2879
11470C49452J13188B05369Q3520n9311F4558N96256H3582K26733F8948M1527J90833
$$ plain form
11549 166337 160706 160435 230296 121392 87508 362093 -1498 92892 36588 367587 34596 35
11536 101695 159897 31547 103907 -18757 43740 173243 -5533 -48811 399905 -64210 449976
11524 139011 -66928 490457 -128172 -51457 54207 -280892 55780 -22836 186664 9512 35551
11513 35551 102330 174599 218590 41673 284827 414732 -131957 334708 -170554 228808
11502 184054 -148565 18590 179699 41015 72753 61439 134907 334349 -197779 143582
11491 140090 92161 245340 477575 238833 -119404 -37086 299326 91860 90139 91456 62371
11480 62371 377766 82005 54980 275935 -231808 252300 172865 -101674 286573 349452
11470 349452 462640 205369 288889 229578 64558 660814 83582 310315 68948 110475 301308
11459C01308h5372A57688C4709K63059K6011C2003R3646K42679a17657D49702
11448i7376H1897J30182p0945o5945J50861a6069A30770C7317K24629j22571J80292
11437C19667D270f3920F9819Q3098J02804q3772k8045O6083a46084B99967A31048
11425A42814P215a59695A6571L2932h0587p8295e1927D22187b76220G4549B064
11413A70295E5318a21805r775G546a0095D9089b47808C18881C8349a58459p8871
11402b37330A73238I231J01991i1309D21810A56329k6834d4541A74470b2018j21410
11391a43428O071I8562L0537K21322d41692F5549P7591b02442B45062j11086d912
11379b87457g3477C0820K06821k486D3513K816K35369c57891B0999M0761f3211
$$ plain form
11459 301308 -85372 157688 34709 297768 323779 32003 125649 368328 -117657 449702
11448 -97376 81897 212079 141134 75189 226050 -16069 130770 37317 261946 139375 319667
11437 319667 4270 -63920 69819 152917 255721 171949 143904 209987 -146084 299967 131048
11425 142814 150029 -159695 16571 49503 -80587 -158882 -51927 422187 -276220 74549 2064
11413 170295 55318 -121805 -131580 7546 -10095 49089 -247808 318881 38349 -158459 -237330
11402 -237330 173238 9231 111222 -91309 421810 156329 129495 -44541 174470 -22018 -143428
11391 -143428 -137357 98562 129099 350421 -441692 65549 143140 -202442 245062 133976 -4912
11379 -287457 -73477 30820 237641 235155 43513 46329 281698 -357891 20999 61760 -63211
11367C0310K27346b85444d9391B56251A13224J47508b04340B78866h8896B4402
11356c27866C2443i6561d4230B16592J27034A16617N1061i645A90333B9237a49872
11344A44538M1728A9112J01541A0341f7222c2007l27385i508q4074E7882b5080
11332h7027A51970l619c0728a827A24987d4578l51711a03104J2207H3270j0388
11321G2882k5447O7148a27026M7806I144K36123F8169b15377B1076i9498C92223
11309I8302B3755J78344a7678j92678I5756a6948A83682B4458J5811e7489k37185
11298b94674J27256g6247A97674H8191K495a89200H1713a3559D21457b8036l10344
11287c38380J10568R7690k4012b8201E476c00786r9038A06707a85559j49554C32259
$$ plain form
11367 30310 257656 -285444 -49391 256251 113224 260732 -204340 278866 -88896 24402
11356 -327866 32443 -96561 -44230 216592 343626 116617 167678 -9645 190333 29237 -149872
11344 144538 186266 19112 120653 10341 -67222 -32007 -359392 -9508 -93582 57882 -25080
11332 -87027 151970 148351 -30728 -1827 124987 -44578 -396289 -103104 -90897 83270 72882
11321 72882 47435 114583 -127026 -79220 9144 245267 68169 -215377 21076 -99498 392223
11309 98302 23755 202099 -17678 -210356 95756 -16948 183682 24458 40269 -57489 -294674
11298 -294674 -167418 -76247 197674 88191 90686 -189200 81713 -13559 421457 -28036 -338380
11287 -338380 -227812 -130122 -154134 -28201 5476 -300786 -399824 106707 -185559 -335113 332259
11275a48875c6918j76546A72838A4689c14087k6405f1481B32875I2984c16303
11264B17847o3490o5597b86149P8508A59689b37031B81156h3927A15023B7214
11253d41233A31976b8110E8406L14338i1931i397A08380L6605m9210g1847j5368
11242h7215A0336a33558P956k18520B7188O4240k1371a45833o5892D57103a00670
11230B89467D8172Q2086R9837a76491G2587P6084B0206b3638j10463e4797A31254
11218B9837a14081Q779J1447C8453g2767H8889d0145A05009a89142C0376K32923
11207B63299g9808L2712l65952Q4586H7302l7166f8207B39775H7466L22734A29414
11195a25130A56786c24383f0697m3267A24932K18704b10692j3255b3842A0786
$$ plain form
11275 -148875 -36918 -213464 172838 14689 -314087 -340492 -61481 232875 92984 -316303
11264 217847 154357 88760 -286149 -207641 159689 -237031 281156 -83927 115023 27214
11253 -441233 131976 -28110 58406 372744 -91931 -9397 108380 144985 95775 -71847 -87215
11242 -87215 10336 -133558 -125602 -344122 27188 91428 70057 -145833 -211725 457103 -100670
11230 289467 48172 130258 230095 -176491 72587 148671 20206 -23638 -134101 -54797 131254
11218 29837 -114081 -105302 -93855 38453 -72767 88889 -40145 105009 -189142 30376 263299
11207 263299 -79808 -47096 -413048 -328462 87302 50136 -68207 239775 87466 410200 129414
11195 -125130 156786 -324383 -60697 -103964 124932 343636 -210692 -223947 -23842 10786
11184B02664C3751e8466E3686c72051a15149A49774d1416a2823l36778M4485B44314
11172H0149K0624e257m77391J33478A48649a97319K1505D36233h6046D19332a03258
11160b22816A36375b79737B11465g6510o1082I2741a26291A30633P7678b38978
11149f1905K9018o3467m6717M2630A1229L28288b09367H5137b1082j0721k60526
11138b92329E1693R180Q1464c9856r5235B68757k228P956j26251K45826A27028
11126a61581d1816B83160F8279b00922I0627b17679A74357B6981Q6225a6002j48153
11115a64155e5950B80135A02297k5820K93022b52812A14547J00504J0542C2699
11104f8819r576D4771L86902j91557D4342a65172B74329K53546A96400f1493E9511
$$ plain form
11184 202664 33751 -58466 53686 -372051 -115149 149774 -41416 -12823 -349601 -305116 244314
11172 80149 100773 -5257 -482648 -349170 148649 -197319 -175814 436233 -86046 419332 -103258
11160 -222816 136375 -279737 211465 -76510 -137592 92741 -126291 130633 208311 -238978
11149 -61905 -32887 -96354 -143071 -100441 11229 339517 -209367 85137 -21082 -31803 -292329
11138 -292329 51693 60873 142337 -39856 -135091 268757 266529 274485 148234 394060 127028
11126 -161581 -41816 283160 68279 -200922 90627 -217679 174357 26981 113206 -16002 -164155
11115 -164155 -55950 280135 102297 76477 369499 -252812 114547 215051 225593 32699
11104 -68819 -78395 44771 431673 240116 44342 -165172 274329 527875 196400 -61493 59511
11092B85470A04600m1846M522J50575K68814A59352n7307k3005J09706J2807K63230
11081D64783A74682n047a23110G9307M44938L3938p8754o7815j14732j6432A04488
11069A77180L33573B54669d9817C29025q5662N9850K70883m0541L4686L7926J80289
11058G86456q0795J25501k26829N6806j25841O1117j29451L65139k13352K28155
11048H46906J6764J78436k37896r1528K25003p4382L34786l89900K26626k152
11038A032663q1538r5708k2770L04276l06497M8119l01227J14967j37166P8776
11028F33895J78624J7298J25341J40756j39987l17293K75011L30901n43115M14428
11018A115859k81436J10768m8525j18760k7276K37471m8690J67177l48458j63070
$$ plain form
11092 285470 104600 62754 67276 217851 486665 159352 102045 79040 188746 201553 464783
11081 464783 174682 169635 -123110 79307 524245 558183 479429 411614 296882 280450 104488
11069 177180 510753 254669 -49817 329025 243363 303213 574096 533555 568241 606167 786456
11058 786456 705661 831162 604333 661139 535298 596415 466964 832103 618751 846906
11048 846906 863670 1042106 804210 712682 937685 863303 1198089 808189 1034815 1032663
11038 1032663 951125 855417 832647 1136923 830426 878545 577318 692285 555119 633895
11028 633895 812519 829817 955158 1095914 955927 638634 913645 1244546 701431 1115859
11018 1115859 834423 945191 896666 777906 750630 988101 939411 1106588 758130 595060
11008E95060j11329R8083R3979j7225k37724K06101L92257j54937l74677N88464
10998A078052k05951J20959n0929j42690K91308l05411K08984k39062L22948j98404
10988H79804n8082L18011J2223K48163k00146Q8750N1761j54008J9485L27015
10978A532976j31055K02298M86144J51672N46729O3763J62851Q3803M15420o4457
10968C450144K14646l1327j56627j41037k96216l57993p8407L9433p021l59259
10958B276336k48197L70290M51783k82149j13429m49740P9636m16396l48523O1133
10948A380744r5751l90667m23723K55328j54565k38610J82347j98144M9961B5967
10937C54586a70948B10823B6598K25636O9203m4021H3450R1292a38578B00898
$$ plain form
11008 595060 483731 581814 675793 658568 420844 626945 1019202 864265 489588 1078052
10998 1078052 872101 993060 942131 799441 1090749 785338 994322 755260 1078208 879804
10988 879804 821722 1139733 1151956 1400119 1199973 1288723 1340484 1186476 1205961 1532976
10978 1532976 1401921 1604219 2090363 2242035 2788764 2852527 3015378 3099181 3514601 3450144
10968 3450144 3664790 3633463 3476836 3335799 3039583 2681590 2603183 2642616 2635595 2276336
10958 2276336 2028139 2398429 2850212 2568063 2454634 2004894 2084530 1668134 1319611 1380744
10948 1380744 1284993 894326 470603 725931 571366 332756 515103 316959 366920 25967
10937 354586 -170948 210823 26598 252234 321437 277416 83450 174742 -138578 200898
10926A12921Q3358b4964B98589G6472J06880D567L16221j21241a04969K7878A54982
10914a29220A74978j6679B6685b94524B52864q9566H1314P9004B364c24362N4502
10903b69860f481A12664J1495a28371B00507J14872b56596A64549b18527C78412
10892h795F4908g9729k17236g4339B56402a62965j7615Q9976m17q6715C15591
10880a7439A35500J38435A01564J55041a10405a7457A89959a42087G3117Q7029
10870A60146b25348A15499b3506B15892A4829a27134B79431a42258O041A97198
10859E4345a3373F1746L3305J98834f0172A35523a17287A16323B6407J98903m5140
10848A80170G0366a04665k12025A53938h2468q0475D7767a63855D8387b40073
$$ plain form
10926 112921 196279 -24964 298589 76472 183352 4567 320788 199547 -104969 -77091 154982
10914 -129220 174978 158299 26685 -294524 252864 163298 81314 160318 2364 -324362 -269860
10903 -269860 -6481 112664 124159 -128371 200507 315379 -256596 164549 -218527 378412
10892 -8795 64908 -79729 -296965 -74339 256402 -162965 -180580 -90604 -91021 -177736 315591
10880 -17439 135500 273935 101564 256605 -110405 -17457 189959 -142087 73117 160146
10870 160146 -225348 115499 -23506 215892 14829 -127134 279431 -142258 -136217 197198
10859 54345 -13373 61746 95051 293885 -60172 135523 -117287 116323 26407 225310 180170
10848 180170 70366 -104665 -316690 153938 -82468 -162943 47767 -163855 48387 -240073
10837b22989e6750b2912k8974F19f6245A19937l3349K4745b23538a7261k05087
10826b22348i8015I7939i2996K1044B0429K06683b3667j31981P3340C92537c00698
10814H5482b85037a11366a8027q8033A69523a05060n1884p8702B29817o1960J90148
10803C58005d11116B69110a46689B5531A758a14332k67117G8407J20559B7001
10792b73889B9431c5471j68675E7871a90854a4714r265G4904l5071c354A15070
10780F7523B3728a08705D8197O4165J79894A13012a21843a1120j91455a032D60067
10768a45956l6801B62159a52711B74075a65311n3030N2657B5907F633b58740j60678
10757d19418C8428b29989A29290D3680a02900b2128k01995J08348o4703J1570
$$ plain form
10837 -222989 -56750 -22912 -51886 619 -66245 119937 86588 111333 -223538 -17261 -222348
10826 -222348 -98015 97939 -92996 -71952 20429 227112 -23667 -155648 -82308 392537 -300698
10814 85482 -285037 -111366 -18027 -106060 169523 -105060 -156944 -235646 229817 167857 358005
10803 358005 -411116 269110 -146689 25531 1758 -114332 -381449 78407 198966 27001
10792 -273889 29431 -35471 -204146 57871 -190854 -14714 -23979 74904 39833 -3354 115070
10780 67523 23728 -108705 48197 112362 292256 113012 -121843 -11120 -202575 -1032 460067
10768 -145956 -182757 262159 -152711 274075 -165311 -218341 -165684 25907 6633 -258740 -419418
10757 -419418 38428 -229989 129290 43680 -102900 -22128 -224123 -115775 -180478 -168908
10747a68908g9313A22751A4855Q3958B4935R7747e6650Q176j99453h7157j52516
10736b39673g4033K9926A0375J950a20689C8653J12811b28810I4041b5077l684
10725b8761j48364K6606k2765j74896a37107a5890k4833k4463q5335J5570l329
10714a38280E5896E720a14210K1477A12376k5635i3158o5162p4007C93203D5366
10702a84482d2440A68580h1611A99435a34112B0142d92476f0919b3766A05051
10691D2714a2456B39671f3746r9892A8118a1797k4109I3858K0964a77331j26149
10680c03480Q9555A05863a18458m2738p1505G5500J32512B5191R1114o401a2834
10668C54488c1307B20627O3828c07038e0673F3021J80783E5004i2575j3717J6109
$$ plain form
10747 -168908 -79313 122751 14855 98813 24935 122682 -56650 -48474 -247927 -87157 -239673
10736 -239673 -74033 -44107 10375 12325 -120689 38653 151464 -228810 94041 -25077 -28761
10725 -28761 -177125 -150519 -173284 -348180 -137107 -15890 -40723 -65186 -150521 -134951 -138280
10714 -138280 55896 5720 -114210 -92733 112376 86741 -93158 -158320 -232327 393203 45366
10702 -184482 -42440 168580 -81611 199435 -134112 20142 -492476 -60919 -23766 105051
10691 42714 -12456 239671 -63746 -163638 18118 -11797 -35906 93858 114822 -177331 -303480
10680 -303480 -213925 105863 -118458 -161196 -232701 75500 208012 25191 116305 109904 -12834
10668 354488 -31307 220627 284455 -307038 -50673 63021 243804 55004 -92575 -106292 -90183
10657i0183j15244A77807c598B22631f1462A19969O3856J54411a14692n9384c5543
10645g8287j36300L3969b4159H3680i1801o4911j3382d030E5472b29148i7285
10633b00427j42738J03643b5758o3185A09512J40573D0689c74190i5330n9513
10623a54843a9614A05202f6619C23444A9812c62719A14788a50484C1280L4204
10613F5484b65906J24441e225D4426j5485i4909l9364F2144d8555j3315k68868
10602c30738A21962b62306R4680J6250B0782M3764K26410b9555D1569a78758g19
10590d03931a12710I6920D2564c01263F9678a70413J0607k33006h5729c9990l02161
10579c42151D4919d7002B36972B1604J2984a31912F2606d5548A57055a06856D23
$$ plain form
10657 -90183 -205427 177807 -3598 222631 -61462 119969 183825 338236 -114692 -174076 -35543
10645 -78287 -214587 -180618 -24159 83680 -91801 -156712 -170094 -4030 55472 -229148 -97285
10633 -200427 -343165 -239522 -25758 -88943 109512 250085 40689 -374190 -95330 -154843
10623 -154843 -19614 105202 -66619 323444 19812 -362719 114788 -150484 31280 65484
10613 65484 -265906 -141465 -5225 44426 28941 -94909 -134273 62144 -48555 -61870 -330738
10602 -330738 121962 -262306 -167626 -151376 20782 64546 290956 -29555 41569 -178758 -719
10590 -403931 -112710 96920 42564 -301263 69678 -170413 -159806 -392812 -85729 -39990 -342151
10579 -342151 44919 -47002 236972 21604 34588 -131912 62606 -45548 157055 -106856 423
10567b1780r8391A95403b29305I1489b18734R0354M8006B07158i8392k57058i3998
10555f2080j53560k0357F1193g3983A83661a80666j04218h6119m8553a8547B51495
10543a14720L7988j5046j59017E1261c59692A93748a88861j59209g642A39176
10532B04442G8336a24514M2667e628j69099J4126j9888o6586D29228A00208a96777
10520b69367A85605c48222N3534J8412J17405B47800b72449A46496b22481a9071
10509b84199d6727j35574A03117A9321c138j05873j04491B97799A13454G318d6139
10497a61695B159c550B16994q5118n4358M836b08608f495A7054N4169R5121g9955
10484B2611g1490j5576c0995B58968M2376K69376L22390n4949l73752q622B02915
$$ plain form
10567 -21780 -120171 195403 -229305 91489 -218734 -128380 -80374 207158 -98392 -355450 -93998
10555 -62080 -215640 -235997 61193 -73983 183661 -180666 -284884 -86119 -134672 -18547 251495
10543 -114720 -76732 -91778 -250795 51261 -359692 193748 -188861 -348070 -7642 139176
10532 204442 78336 -124514 -81847 -5628 -174727 -160601 -180489 -247075 429228 100208 -196777
10520 -269367 185605 -348222 -294688 -276276 -158871 247800 -272449 146496 -222481 -19071
10509 -284199 -46727 -182301 103117 19321 -3138 -109011 -213502 297799 113454 7318 -46139
10497 -161695 2159 -3550 216994 131876 77518 82354 -208608 -6495 17054 71223 166344 -79955
10484 22611 -71490 -87066 -30995 258968 301344 570720 893110 838161 464409 455787 202915
10472c9551C23817a4892b503A38567b5614A47767J11470b99038A90110G7897H68
10460c3551a3899j80334j20879a7078A83093c43678A63495q254P7627C8587M07652
10449D46239I9038f2375A15285i880B54314h4818R276B01370J06497b22627b2668
10437C17507G3176J19167q1319g9782n7481j9281F8127a27454B312K29267R0547
10426C22126b2554l74542J85833q3903F1667R764A2472c0021B60853E3305e4989
10414A65124c67548A39629j0317b69227j35994H5769c53720B01239m1745E9711
10403d1109n4171A45309F421b53114B95891G3962a17480I0177M6502h6275A71941
10391b9013n8982B73183c06696B9638K05227r3302K41069A07581N330P6015K1438
$$ plain form
10472 -39551 323817 -14892 -2503 138567 -25614 147767 259237 -299038 190110 77897 868
10460 -33551 -13899 -194233 -315112 -17078 183093 -343678 163495 155241 232868 38587 446239
10449 446239 99038 -62375 115285 -9880 254314 -84818 -75542 201370 307867 -222627 -22668
10437 317507 73176 192343 111024 -79782 -137263 -156544 68127 -127454 2312 231579 322126
10426 322126 -22554 -397096 -211263 -295166 61667 71431 12472 -30021 260853 53305 -54989
10414 165124 -367548 139629 129312 -269227 -405221 85769 -353720 201239 159494 59711
10403 -41109 -95280 145309 6421 -253114 295891 73962 -117480 90177 136679 -86275 171941
10391 -29013 -87995 273183 -306696 29638 234865 141563 382632 107581 112911 188926 210364
10380B10364A9845J72970a37108G5899a48178C28050P3214a45337C04712H6836
10369F67747C32084A27115L11644J6465A78606P9203N9505J79169L4889k59012
10359B72360J50347n6690R0835d4027A71921J48976j43301K45700r0360J61241
10349D94177O44452l23202A53443L91908k44051J63046k22376L76837j92973K20093
10339F45927l00681A38434J88346j24761M7943p0455J38723B9909J45337J66132
10329C41378B0674J00429c2678H1587J12823a55380C43697F8066K22891N951K51292
10318E48200C2115J96772A07124L17108A15944L88587A72780j3604A7232M08917
10308D26149i3593B15373b35579E163N0032b71399c2922j38036O9664A28754c67554
$$ plain form
10380 210364 19845 192815 -137108 75899 -148178 328050 401264 -145337 304712 86836
10369 667747 332084 127115 438759 455224 178606 257809 317314 496483 531372 272360
10359 272360 422707 366017 456852 -44027 171921 320897 177596 423296 332936 494177
10349 494177 1138629 815427 153443 545351 301300 464346 241970 618807 425834 645927
10339 645927 345246 138434 326780 202019 249962 179507 318230 29909 175246 341378
10329 341378 20674 121103 -32678 81587 194410 -155380 343697 68066 290957 296908 548200
10318 548200 32115 228887 107124 424232 115944 504531 172780 159176 17232 426149
10308 426149 -93593 215373 -235579 5163 55195 -271399 -32922 -170958 -101294 128754 -367554
10296A83019O5766i8247A93681a42804H207K50695a84468A88344b19186A43719
10285g4975m38821A8835O1626M55b70846l27739a10340B28201b77012a00510l67122
10274d67632A29314a26285c8953B6181H753J33197c76518A01151a65169B42183
10263a2976o2322K4313k28762J36377E70200j01569A98834L20181j84231K3724
10253C58508n4207C7700J84868L2309M1607A46554g3911J4825I7163n028a85897
10241A82063c14145O9773A74247a04908H2065e9041H4109a05483O78M7880k93907
10230c50832a59613j05671L6910e4760j60993b8874C0769h0474A55568c9357J1186
10219b8171F5878b99130O363b5319n8343q1347M3350A1628a43026E7285b13143
$$ plain form
10296 183019 248785 -98247 193681 -142804 8207 258902 -184468 188344 -219186 143719
10285 -74975 -513796 18835 80461 80916 -270846 -598585 -110340 228201 -277012 -100510 -467632
10274 -467632 129314 -126285 -38953 26181 8753 141950 -376518 101151 -165169 242183
10263 -12976 -75298 -50985 -279747 -143370 570200 468631 198834 519015 334784 358508
10253 358508 304301 37700 222568 254877 296484 146554 -73911 -59086 97163 92135 -185897
10241 182063 -314145 -244372 174247 -104908 82065 -59041 84109 -105483 -104805 -56925 -350832
10230 -350832 -159613 -265284 -228374 -54760 -215753 -28874 30769 -80474 155568 -39357 -28171
10219 -28171 65878 -299130 -292767 -25319 -83662 -165009 -121659 11628 -143026 57285 -213143
10207a62924B00264d06046a21146B32532a05897k31295I9021a67789k8733j32779
10197c29301b0549j975B62182F954b26280A3383a19351l8865B6685j1601c0709
10185h9248j58089c3187f355j80103H279L7272K63373A00823e5942n39310a64939
10173A00144a20942A99875b18484h2875j29216A0679a87735A58841B7645D196
10162i1383K066p4010B72421a76672D3037b05112m0433G4024d5918j26392o8928
10151b41238Q5848E9152b15737p6073H0485J28738B0826J04994K36886f6329A24154
10139A51499P6674c49927a16673B25046b22582L4506a9375k2594A4241K13081
10129B27322i9849p8982K2758A33061a01382L6086k49392I9662g8546B59963d72664
$$ plain form
10207 -162924 200264 -406046 -121146 232532 -105897 -337192 99021 -167789 -196522 -329301
10197 -329301 -20549 -22524 262182 6954 -226280 13383 -119351 -158216 26685 15084 -30709
10185 -89248 -247337 -33187 -6355 -186458 8279 45551 308924 100823 -55942 -595252 -164939
10173 100144 -120942 199875 -218484 -82875 -212091 10679 -187735 158841 27645 4196
10162 -91383 -89317 -163327 272421 -176672 43037 -205112 -245545 74024 -45918 -172310 -241238
10151 -241238 -155390 59152 -215737 -291810 80485 209223 20826 125820 362706 -66329 124154
10139 151499 228173 -349927 -116673 225046 -222582 -188076 -19375 -41969 14241 227322
10129 227322 -99849 -178831 -156073 133061 -101382 -65296 -314688 99662 -78546 259963 -472664
10117f61366b05410B0309f1723A07734a7785j59403P9463B66055a06002A15645
10106D19231a88882h1126B75249I0396b15j92361f6314N41k97275D1655c49442
10094a98037i118B3945J02192n3924K30968c09394M8489a27800A26971K5936a60620
10082g9912j77162E2433a96290n0939P1955J360H7005a39404g634A7744a29074
10070B36819b16512p5944f4327F8110b3496I9867m1494E064J0427a45620g2545
10058A21147b94419a33625M2015k85464C5068J78255g664C8682b30869P1584j02982
10047b62267A04583R668g8073p1851C1049m820L1923a36318N6355c2162j00587
10036a32749K9839b7498l18363a28766A01114D9219b28492j6114A98103J01944
$$ plain form
10117 -661366 -205410 20309 -61723 107734 -17785 -177188 -97725 266055 -106002 115645
10106 419231 -188882 -81126 275249 90396 -215 -192576 -66314 -65773 -363048 41655 -349442
10094 -198037 -9118 23945 126137 72213 303181 -309394 -260905 -127800 126971 152907 -160620
10082 -79912 -257074 52433 -196290 -247229 -175274 -173914 87005 -139404 -7634 17744 -129074
10070 236819 -216512 -292456 -64327 68110 -23496 99867 58373 5064 15491 -145620 -72545
10058 121147 -294419 -133625 -91610 -377074 35068 213323 -7664 38682 -230869 -159285 -262267
10047 -262267 104583 114251 -78073 -149924 31049 26229 58152 -136318 -79963 -32162 -132749
10036 -132749 -102910 -27498 -345861 -128766 101114 49219 -228492 -244606 198103 300047
10026C00047D1050b74668j17188b1862k8720k00966l0159k528a00396H3247Q4990
10015A68237a3728A00582b10606A92440i599I1149c09707M4239a28451I474Q3283
10004I2757b75637A01980D2813h6011q3521I5293a69702l5488R7040A02938f5965
9992h153k08510P3320A28375b34744D1219J17551d7978j63833E2664b13816b4577
9980i6130d6875k65027J06723N378Q9991B3287a78428M4445B5441L0883o055R8695
9968A48964c58029D36597e4494q6386O5965D2528c8990I5675a08936I2200q468
9957H3732a30538H0634J5154f548k40338j5905a10312j31463A39119b1176m6775
9946f7951l72491d4882k33395A46161h7133E3087A4748L34207F2561L4188a92844
$$ plain form
10026 300047 41050 -274668 -391856 -21862 -50582 -251548 -281707 -284235 -100396 83247 168237
10015 168237 -13728 100582 -210606 192440 -9599 91149 -309707 -265468 -128451 9474 92757
10004 92757 -275637 101980 42813 -86011 -169532 95293 -169702 -205190 -108150 102938 -65965
9992 -8153 -216663 -143343 128375 -234744 41219 158770 -47978 -211811 52664 -213816 -24577
9980 -96130 -46875 -311902 -205179 -199801 -109810 23287 -178428 -133983 25441 56324 50269 148964
9968 148964 -358029 436597 -54494 -140880 -74915 42528 -38990 95675 -108936 92200 83732
9957 83732 -130538 80634 95788 -6548 -246886 -262791 -110312 -241775 139119 -21176 -67951
9946 -67951 -440442 -44882 -278277 146161 -87133 53087 14748 348955 62561 96749 -192844
9934b20809B15782e8997b711k30180A80869a86294j43775R1736f6636j67150G147
9922a54063A23985C124J22894c64984a9070o8216q4583j47382C8032d3882B3491
9910c3429j25130b9900j32770O0009B752a43913E2852J04849A5279N3352a18167
9898a34472E7536c82726H9887c11650E7210A5712a56318M4820L0336A35927b507
9886e9225A9796d7393l7332H7726c05009B50230A22305b73684D4188O608b20655
9874d13383c6543A24023f7044j21218o8011A16939a31593A6217d00459i9619l30548
9863d30167h889j41905k07069A25115A1401a83504k3363a6314j4023k2771j66123
9852b19231A42419d36026F9414J69816a04758j19757g793F137J65250c845l53229
$$ plain form
9934 -220809 215782 -58997 -2711 -232891 180869 -186294 -330069 -238333 -66636 -233786 7147
9922 -154063 123985 3124 126018 -364984 -19070 -87286 -171869 -319251 38032 -43882 23491
9910 -33429 -158559 -29900 -162670 -102661 2752 -143913 52852 157701 15279 68631 -118167
9898 -134472 57536 -382726 89887 -311650 57210 15712 -156318 -111498 -81162 135927 -2507
9886 -59225 19796 -47393 -84725 87726 -305009 250230 122305 -273684 44188 50796 -220655
9874 -413383 -36543 124023 -67044 -188262 -256273 116939 -131593 16217 -400459 -99619 -430167
9863 -430167 -8889 -150794 -357863 125115 11401 -183504 -206867 -16314 -30337 -53108 -219231
9852 -219231 142419 -436026 69414 239230 -104758 -224515 -7793 6137 171387 -3845 -357074
9841c57074J64243C0221a37580M6529L8306F0042d82439B12551c31j71809g0931
9829F8736c49243j6752g9063p5580c2258A28234D8609F678a86822L4326j18575
9818b71071A1557a55566A47219b37983A23185a73511C14635A6064c74263C2126
9807G8016K9036b95035h4665c573j05377A15530f4548r0683I0308c37822a68715
9795G3851N39g9907e013E1054J991b68491q219B0548f9116c3862A49521J13865
9783B63386a91049o0982B19176f4802A17404m2356J36914b22275F5705h885j81616
9772a90501A94417E6884J50765b37843R9242L5087b246C06572C2898c05871b830
9760D6288b34533A39198e3058m31596A19797A236d4423B00992b11431H8704A0843
$$ plain form
9841 -357074 -192831 30221 -137580 -91051 -52745 60042 -482439 212551 -331 -172140 -70931
9829 68736 -349243 -365995 -79063 -154643 -32258 128234 48609 6678 -186822 -152496 -271071
9818 -271071 11557 -155566 147219 -237983 123185 -173511 314635 16064 -374263 32126
9807 78016 107052 -295035 -84665 -3573 -108950 115530 -64548 -155231 90308 -337822 -168715
9795 73851 74390 -79907 -5013 51054 53045 -268491 -276710 20548 -69116 -33862 149521 263386
9783 263386 -191049 -252031 219176 -64802 117404 75048 211962 -222275 65705 -8885 -190501
9772 -190501 194417 56884 207649 -237843 -138601 -103514 -2246 306572 32898 -305871 -2830
9760 46288 -234533 139198 -53058 -484654 119797 1236 -44423 200992 -211431 88704 10843
9748D15008a72526d9660l4865j27825A16561L3468i7635M4953m3718G8121a20196
9736A38267d07956a63098k26890a12866K5037G7460a72790j00203d400k78965
9726b83365l2047B5178h180k72057A93096A0216b082C23744H8591j4299a40883
9714a14950A01656a52143n5491g6278k4640j23793B97928E8101J15693C958d2279
9702a82316j3317H9284e9505E3925b73346L3796O9726j5095I3052a46398O3296
9691h3102L0505l09263A37216L6497G0533J97211f3828l93643A50384c70609J61242
9680b09367j70d6823p6153D8476L56869j98883c63491A48012a79307h2711k55554
9669c38265F4937J8049e7868k11176J18963j38979k11493d2539A8030c98495d7347
$$ plain form
9748 415008 -172526 -49660 -84525 -212350 116561 150029 -97635 -52682 -96400 78121 -120196
9736 138267 -407956 -163098 -389988 -112866 -87829 77460 -172790 -272993 -4400 -283365
9726 -283365 -315412 25178 -8180 -280237 193096 10216 -2082 323744 88591 74292 -140883
9714 -114950 101656 -152143 -207634 -76278 -100918 -224711 297928 58101 173794 3958 -42279
9702 -182316 -195633 89284 -59505 53925 -273346 -239550 -169824 -184919 93052 -146398 -83102
9691 -83102 -52597 -361860 137216 173713 70533 267744 -63828 -457471 150384 -370609 -209367
9680 -209367 -209537 -46823 -122976 48476 405345 206462 -363491 148012 -179307 -82711 -338265
9669 -338265 64937 82986 -57868 -269044 -150081 -289060 -500553 -42539 18030 -398495 -47347
9657a56791A08727j0574M5068M6297b12659O0297l7226A05620g2523L5037G344
9645g3601k22507a0097r6610A54868a86646c0885l65192i2907q4283l01030a2429
9633b27172a9826l56566A12716b24852B98024G8165J31913e5251A05983k4927
9623H1056b52950j9955l3118a48370j00464B9979J71941B8523c20966k9057L9553
9612c10470R2882i3899A14496E6195b50983A92603b18809o2188r7849n034o6528
9601d50408A81626p0077d15284i8467p617k11468a20933e4600j19096B61575A25534
9589a86058C274P4479b45602O9533D4148i7324a4604l88506Q1931f8312k48837
9578c17149A73461b01859k18641J06624I7926a76339N5371k84219a79809A2885
$$ plain form
9657 -156791 108727 98153 143221 189518 -212659 -152362 -189588 105620 -72523 -37486 7344
9645 -73601 -296108 -10097 -106707 154868 -186646 -30885 -396077 -92907 -177190 -478220 -12429
9633 -227172 -19826 -376392 112716 -224852 298024 78165 210078 -55251 105983 81056
9623 81056 -252950 -272905 -306023 -148370 -248834 29979 201920 28523 -320966 -350023 -310470
9612 -310470 -217588 -93899 114496 56195 -250983 192603 -218809 -280997 -378846 -383880 -450408
9601 -450408 181626 111549 -415284 -98467 -106084 -317552 -120933 -54600 -173696 261575 125534
9589 -186058 3274 77753 -245602 -176069 44148 -97324 -14604 -403110 -321179 -68312 -317149
9578 -317149 173461 -201859 -420500 -313876 97926 -176339 -120968 -405187 -179809 12885
9567d3454C00503b96321C5509f564j57145A90655a48378M2787j92952J1456b6192
9555a2980m0732j19928A20011J10675i2368G6975c02713B94499b55040j0633a1418
9543A85003a87004d4680G9003b04404E6068a95393A15599b73707F8876b73884
9532c23348f3298j39813a5547l51045a62892j18982c8118h332B20922a70359j81071
9521c51430H3054b00254j785c753j1833n9209l0553a5628k36011b8531j60580
9510a89111d5879l6365j92372K1519D4601e439A4037a19756j87709g8655L3128
9499d5527H0693P8476c4971A21178c54388A11612e63955a44322G8658c04598G2603
9487A27041m6199J26829G8299A1875a06312k13020B27131a75307f2123j31823
$$ plain form
9567 -43454 300503 -296321 35509 -6564 -163709 190655 -148378 -105591 -298543 -287087 -26192
9555 -12980 -53712 -173640 120011 230686 -92368 76975 -302713 294499 -255040 -265673 -11418
9543 185003 -187004 -44680 79003 -204404 56068 -195393 115599 -273707 68876 -273884
9532 -323348 -63298 -203111 -15547 -366592 -162892 -281874 -38118 -8332 220922 -170359 -351430
9521 -351430 83054 -200254 -202039 -3753 -15586 -74795 -105348 -15628 -251639 -28531 -189111
9510 -189111 -45879 -82244 -274616 -253097 44601 -5439 14037 -119756 -307465 -78655 -45527
9499 -45527 80693 159169 -34971 121178 -354388 111612 -563955 -144322 78658 -304598 72603
9487 127041 80842 207671 78299 11875 -106312 -319332 227131 -175307 -62123 -193946
9477a93946j21009a8581B60734A11603J93973A9988c6812j16384N2106k02240
9467c03330h3021k2626r4433C9305b52656B37025C992L8959C849b27507a00467
9455D4769b74996N120A80878M5419F0327g7254F028b61682A93801d3582j10807
9444a54389m5738A07335J49074c294B9259g887l94241b5563j80889e1040A46901
9432a13469j88744B67404a6133r2233I1030f7811B2046b38158N0824k1331B7080
9420A61523b81774B40486A11024b96121k6373J47992g8693C69a82300n5267C65096
9408A90106f6159B43195F3506b17436F9005h0614j82561A257a85403k62706a17437
9396A58989J1931F6960c17209h8858j65117A03444b4345A16607o124a42349e5174
$$ plain form
9477 -193946 -314955 -18581 260734 111603 305576 19988 -36812 -153196 -101090 -303330
9467 -303330 -83021 -105647 -200080 39305 -252656 237025 3992 42951 3849 -227507 -100467
9455 44769 -274996 -269876 180878 226297 60327 -77254 6028 -261682 193801 -43582 -154389
9444 -154389 -200127 107335 256409 -3294 29259 -7887 -402128 -25563 -206452 -51040 146901
9432 -113469 -302213 267404 -16133 -108366 91030 -67811 22046 -238158 -187334 -208665 27080
9420 161523 -281774 240486 111024 -296121 -322494 -174502 -78693 369 -182300 -237567 365096
9408 190106 -66159 243195 63506 -217436 69005 -80614 -263175 1257 -185403 -448109 -117437
9396 158989 170920 66960 -317209 -88858 -253975 103444 -24345 116607 110483 -142349 -55174
9384A55351c4539j17523j41716H8O1859b01688j21419f9358l5508a4730k25660
9373b40390B04304c4222j80302j15741E975a06874O061m7653A36300c9173h751
9361a77157M2183A70675b56095B2477d06507E9813g6948j33499H440a30926k6334
9350a57260k25245a32491B55944B4990K63035a39119j55310h8613q6032B9172
9339F1319c1786B17251a88305j6673q339a8484A29614j4712p194d2882q3598k32431
9327c58911A01223d6739k93277B5962d04046K3040H650b61394A46656b46526k1721
9316b68247O8928k3128B1989d8349j55233A3158K51040H0701a32446K7472H5933
9304i710l16933a62887m9322F9146a10702q8163a9875o2859j31785g4008E346
$$ plain form
9384 155351 -34539 -152062 -293778 88 61947 -201688 -323107 -69358 -104866 -14730 -240390
9373 -240390 204304 -34222 -214524 -330265 5975 -106874 -100813 -148466 136300 -39173 -8751
9361 -177157 -134974 170675 -256095 22477 -406507 59813 -76948 -210447 8440 -130926 -157260
9350 -157260 -382505 -132491 255944 24990 288025 -139119 -294429 -88613 -174645 29172
9339 61319 -31786 217251 -188305 -204978 -213317 -18484 129614 114902 107708 -42882 -126480 -358911
9327 -358911 101223 -46739 -340016 25962 -404046 -381006 8650 -261394 146656 -246526 -268247
9316 -268247 -199319 -222447 21989 -48349 -203582 13158 264198 80701 -132446 -104974 85933
9304 -9710 -326643 -162887 -212209 69146 -110702 -198865 -19875 -82734 -214519 -74008 5346
9292g1198j71701A45635b78826h5487I2898a90630B79477j01745D2625H493a20491
9280d33112A40137a969H390a99732h3407b6321F8983R9246a29964A21179f4766
9268c79077g9539l44389F9272h5201r0223L7877N7314B81733c9250A55664J27032
9257B82696G8274c79994a15895a0634j57233A36165g5218r9658j64121J54619
9247a84378j85795A49112a57260G1424J93102c34145b0157k01542g6970A48315
9236c4311R760j16037B36420a44977D9391c6404B76871d98l30469E7558a43128
9224G512c45235i5074C08635d62627f6133B26485F8858L3844e91870b76541H7590
9212F3634n597g9690q673A1608c4950j18229B5027a86101g6959A12419g6190j32812
$$ plain form
9292 -71198 -242899 145635 -278826 -85487 92898 -190630 279477 177732 42625 8493 -120491
9280 -433112 140137 -1969 8390 -199732 -83407 -26321 68983 168229 -129964 121179 -64766
9268 -379077 -79539 -423928 69272 -85201 -175424 -137547 -80233 281733 -39250 155664 282696
9257 282696 78274 -379994 -115895 -10634 -167867 136165 -75218 -174876 -338997 -184378
9247 -184378 -370173 149112 -157260 71424 264526 -334145 -20157 -221699 -76970 148315
9236 -34311 -24551 -140588 236420 -144977 49391 -36404 276871 -498 -330967 57558 -143128
9224 7512 -345235 -95074 308635 -462627 -66133 226485 68858 102702 -591870 -276541 87590
9212 63634 58037 -79690 -88363 11608 -34950 -153179 25027 -186101 -76959 112419 -76190 -209002
9200b09002k80180M6376J46159A16896g3387r7207A45935a09370m01193e5652
9189A06849a59870m1091L2803C36723A62702i5602p0173q9700f9869k54995K0450
9178c04414A88513f1696o433m9683j76663d2505l733A64289c98383L9021d9472
9166F3491J62439a6710C5709L31c0629C91213a38359b1555l2553G5644b19780
9154A54389a81674P0104E3512J7038b6440A66113q2430J38066a54589f9399r53
9143g0352B79815o5798a10092j2757j6108A54401a36356d4844A08149O6931N9014
9132B34094a20668l3214n5411G1774j9003a38556b7558k10860B25953c56178B3342
9120C40977a10417k07906f0496A36649P7362c05714d1971l82069g5993j76116
$$ plain form
9200 -209002 -489182 -442806 -296647 116896 -73387 -170594 145935 -109370 -510563 -55652
9189 106849 -159870 -200961 -168158 336723 162702 -95602 -165775 -255475 -69869 -324864 -304414
9178 -304414 188513 -61696 -68129 -117812 -294475 -42505 -46238 164289 -398383 -359362 -49472
9166 63491 225930 -16710 35709 36040 -30629 391213 -138359 -21555 -54108 75644 -219780
9154 154389 -181674 -111570 53512 70550 -26440 166113 83683 221749 -154589 -69399 -70352
9143 -70352 279815 214017 -110092 -122849 -138957 154401 -136356 -44844 108149 175080 234094
9132 234094 -120668 -153882 -209293 71774 52771 -138556 -27558 -238418 225953 -356178 23342
9120 340977 -110417 -318323 -60496 136649 214011 -305714 -41971 -424040 -75993 -252109
9110b52109K4805h2059E7952P6721h4403m28742A9739a59586e134l00279b1242
9098A6115c24828N9252L6546D4074e7923J3547j27628j36153i0754J5780j64694
9087b39668A21826a7031k08722H9275a09054r1442k14767I5457K56383c47292
9076A8234c93688a2019k08992A30710l9730f6458j945k5281k20265a39320k9252
9065a68572A20908L1857b38504r7502a46364K4675A65730i5755q461b1646j68889
9054a90535g3421r6805k44547R0755Q7236k98858g5337A81341l4119b57306K8864
9043b28442j51597A06957a44693B37978a48718N5636A7630a73653C12035a24363
9032a77917E6084b06819Q7779n8000B02294b4574n1187j74288l1938r8386F83
$$ plain form
9110 -252109 -227304 -82059 57952 134673 -84403 -513145 19739 -159586 -5134 -305413 -21242
9098 16115 -324828 -265576 -229030 44074 -57923 -44376 -172004 -308157 -90754 -74974 -239668
9087 -239668 121826 -17031 -225753 89275 -109054 -200496 -415263 95457 351840 -347292
9076 18234 -393688 -12019 -221011 130710 90980 -66458 -68403 -93684 -313949 -139320 -168572
9065 -168572 120908 152765 -238504 -336006 -146364 -121689 165730 -95755 -104216 -21646 -190535
9054 -190535 -73421 -170226 -414773 -324018 -236782 -535640 -75337 181341 147222 -257306 -228442
9043 -228442 -380039 106957 -144693 237978 -148718 -93082 17630 -173653 312035 -124363
9032 -177917 56084 -206819 -119040 -177040 202294 -24574 -75761 -250049 -281987 -380373 683
9020a05730A05720a34429D9075a49088l14668a36564A9635g4221A47654H167K52721
9009B60888h8294m1159M8113j87748D9136K2063b93585b1788q0853j11395p1496
8998b85532f5288j70161i4595j05122A88365b76A97221H1919i1439C11278b3094
8986i5287j92418a39215O6531k52619a44057b000F3897j9784a21307B36641a46128
8974A53163N1926b31860A42968a02685r8136k02644O047J51209N1241H25K22782
8963B23607J29300j02538a07611k3034o2475l02398a05592A1570O8637c56235
8952d40458N6736h2918A8998Q4139g9863B9751a57762k64158a04061a1837j25261
8941a37098M2301I006a6432k06337f0979l35217A94041R7184j30246J90576b095
$$ plain form
9020 -105730 105720 -134429 49075 -149088 -463756 -136564 19635 -74221 147654 8167 260888
9009 260888 -88294 -129453 -81340 -269088 49136 71199 -293585 -21788 -102641 -214036 -285532
8998 -285532 -65288 -235449 -94595 -199717 188365 -276 197221 81919 -91439 311278 -23094
8986 -95287 -287705 -139215 -72684 -325303 -144057 -2000 63897 44113 -121307 236641 -146128
8974 153163 205089 -231860 142968 -102685 -200821 -403465 -397418 -246209 -194968 825 223607
8963 223607 352907 250369 -107611 -130645 -193120 -495518 -105592 11570 80207 -356235
8952 -440458 -383722 -82918 18998 103137 -79863 29751 -157762 -421920 -104061 -11837 -137098
8941 -137098 -94797 9006 -16432 -222769 -60979 -396196 194041 291225 160979 351555 -2095
8929a94459I6247b72530C04936k1619K01960K39545J222118L510671P496900r63539
8919A1990972D679993A955501G11987B65051J28443j48755n0759d6243J6225I0463
8908h9199B56217K69033h0578G4932M0883K3928K61679e9356G5464K4373b03101
8896A22826n5658a42366d2684C03026e04601e0615H9314b46254A07761a31549
8885B34710b663j2920n9807j53961L8972A74771p7134M264B3116a56718B1340
$$ plain form
8929 -194459 96247 -272530 304936 283317 485277 724822 1946940 5457611 12954511 11990972
8919 11990972 4679993 1955501 711987 265051 393494 244739 193980 -46243 -30018 90463
8908 -89199 256217 525250 -80578 74932 115815 139743 401422 -59356 75464 99837 -203101
8896 122826 67168 -142366 -42684 303026 -504601 -50615 89314 -246254 107761 -131549
8885 234710 -2663 -15583 -75390 -229351 -190379 174771 97637 101901 23116 -156718 21340
$$ [...]
##END NTUPLES=NMR SPECTRUM
##END=
