##TITLE=AC1476_ZJAMBMO302_8100948_ds12Kev9lv
##JCAMPDX= 6.0         $$ Bruker NMR JCAMP-DX V2.0
##DATA TYPE= NMR SPECTRUM
##DATA CLASS= NTUPLES
##ORIGIN= BRUKER
##OWNER= Administrator
$$ 1.72 TOPSPIN		Version 2.1
$$ 2013-07-31 16:32:34.530 -0700  Administrator@X
$$ Compression mode = diff/dup
##.OBSERVE FREQUENCY= 400.02188249412
##.OBSERVE NUCLEUS= ^1H
##.ACQUISITION MODE= SIMULTANEOUS (DQD)
##.ACQUISITION SCHEME= undefined
##.AVERAGES= 64
##.DIGITISER RES= 22
##SPECTROMETER/DATA SYSTEM= spect
##.PULSE SEQUENCE= noesygpps1d.comp
##.SOLVENT NAME= COFFEE_meoh
##.SHIFT REFERENCE= INTERNAL, COFFEE_meoh, 1, 14.96146
##AUDIT TRAIL= $$ (NUMBER, WHEN, WHO, WHERE, PROCESS, VERSION, WHAT)
$$ ##TITLE= Audit trail, TOPSPIN		Version 2.1
$$ ##JCAMPDX= 5.01
$$ ##ORIGIN= Bruker BioSpin GmbH
$$ ##OWNER= Administrator
$$ $$ E:\/data/COFFEE/nmr/AC1476_ZJAMBMO302_8100948_ds12Kev9lv/12/pdata/1/auditp.txt
$$ ##AUDIT TRAIL=  $$ (NUMBER, WHEN, WHO, WHERE, PROCESS, VERSION, WHAT)
(   1,<2013-07-31 16:32:29.671 -0700>,<Administrator>,<X>,<go>,<TOPSPIN 2.1>,
      <created by zg
	started at 2013-07-31 16:21:00.280 -0700,
	POWCHK enabled, PULCHK disabled,
       configuration hash MD5:
       C8 4E 4E 5D D3 5C D8 9E 9F 52 82 E0 59 8A DE 15
       data hash MD5: 64K
       10 5C 8A F7 C3 20 83 7A 48 17 64 10 CE E4 79 FC>)
(   2,<2013-07-31 16:32:32.624 -0700>,<Administrator>,<X>,<proc1d>,<TOPSPIN 2.1>,
      <Start of raw data processing
       efp LB = 0.3 FT_mod = 6 PKNL = 1 PHC0 = 0 PHC1 = 0 SI = 128K 
       data hash MD5: 128K
       FD 6E F1 4F 19 B9 93 36 32 87 10 69 A3 CB 07 0B>)
(   3,<2013-07-31 16:32:33.562 -0700>,<Administrator>,<X>,<proc1d>,<TOPSPIN 2.1>,
      <pk PHC0 = -79.24438 PHC1 = 0 
       data hash MD5: 128K
       05 D8 E2 65 9F F5 F2 BD 4D AC 2A B5 3B 1A 57 80>)
(   4,<2013-07-31 16:32:33.999 -0700>,<Administrator>,<X>,<proc1d>,<TOPSPIN 2.1>,
      <abs ABSG = 1 
       data hash MD5: 128K
       82 A6 8E 98 ED CB 2B E5 4D 4F E6 90 34 1E A6 3C>)
(   5,<2013-07-31 16:32:34.108 -0700>,<Administrator>,<X>,<proc1d>,<TOPSPIN 2.1>,
      <abs ABSG = 2 
       data hash MD5: 128K
       E4 B9 F8 B0 E1 99 4F CC FB 11 59 F6 5A DD A1 E7>)
(   6,<2013-07-31 16:32:34.202 -0700>,<Administrator>,<X>,<proc1d>,<TOPSPIN 2.1>,
      <abs ABSG = 3 
       data hash MD5: 128K
       31 CF 6A 54 D1 F5 02 00 5E 58 23 34 E0 7B C5 38>)
(   7,<2013-07-31 16:32:34.280 -0700>,<Administrator>,<X>,<proc1d>,<TOPSPIN 2.1>,
      <abs ABSG = 4 
       data hash MD5: 128K
       10 34 16 E8 60 FF 1C 5A B5 F3 FE AC 5B F3 00 0B>)
(   8,<2013-07-31 16:32:34.358 -0700>,<Administrator>,<X>,<proc1d>,<TOPSPIN 2.1>,
      <abs ABSG = 5 
       data hash MD5: 128K
       E2 3C 24 BA 2B 1A 29 CE 33 24 51 52 75 B6 9B 11>)
$$ ##END=
$$ 
$$ $$ hash MD5
$$ $$ F2 09 82 F2 04 81 3C 18 70 81 E3 5B 4B DC 4A 43
##$RELAX= 
##$RELAX= 
##$RELAX= 
##$RELAX= 
##$RELAX= 
##$RELAX= 
##$RELAX= 
##$RELAX= 
$$ Bruker specific parameters
$$ --------------------------
##$DU= <E:\>
##$EXPNO= 12
$$ [...]
##$TP07= 0
##$TPNAME0= <>
##$TPNAME1= <>
##$TPNAME2= <>
##$TPNAME3= <>
##$TPNAME4= <>
##$TPNAME5= <>
##$TPNAME6= <>
##$TPNAME7= <>
##$TPOAL= (0..7)
0.5 0.5 0.5 0.5 0.5 0.5 0.5 0.5
##$TPOFFS= (0..7)
0 0 0 0 0 0 0 0
##$TUNHIN= 0
##$TUNHOUT= 0
##$TUNXOUT= 0
##$USERA1= <user>
##$USERA2= <user>
##$USERA3= <user>
##$USERA4= <user>
##$USERA5= <user>
##$V9= 5
##$VALIST= <valist>
##$VCLIST= <CCCCCCCCCCCCCCC>
##$VD= 0
##$VDLIST= <DDDDDDDDDDDDDDD>
##$VPLIST= <PPPPPPPPPPPPPPP>
##$VTLIST= <TTTTTTTTTTTTTTT>
##$WBST= 2048
##$WBSW= 25
##$XGAIN= (0..3)
0 0 0 0
##$XL= 0
##$YL= 0
##$YMAX_a= 7373344
##$YMIN_a= -15736219
##$ZGOPTNS= <>
##$ZL1= 120
##$ZL2= 120
##$ZL3= 120
##$ZL4= 120
##$ABSF1= 14.96146
##$ABSF2= -5.596722
##$ABSG= 5
##$ABSL= 3
##$ALPHA= 0
##$AQORDER= 0
##$ASSFAC= 0
##$ASSFACI= 0
##$ASSFACX= 0
##$ASSWID= 0
##$AUNMP= <proc_prof1d_extract.lims>
##$AXLEFT= 0
##$AXNAME= <>
##$AXNUC= <1H>
##$AXRIGHT= 0
##$AXTYPE= 0
##$AXUNIT= <>
##$AZFE= 0.1
##$AZFW= 0.1
##$BCFW= 0
##$BC_mod= 0
##$BYTORDP= 0
##$COROFFS= 0
##$CY= 15
##$DATMOD= 1
##$DC= 0
##$DFILT= <>
##$DTYPP= 0
##$F1P= 0
##$F2P= 0
##$FCOR= 0.5
##$FTSIZE= 131072
##$FT_mod= 6
##$GAMMA= 0
##$GB= 0
##$INTBC= 1
##$INTSCL= 1
##$ISEN= 128
##$LB= 0.3
##$LEV0= 0
##$LPBIN= 0
##$MAXI= 10000
##$MC2= 0
##$MEAN= 0
##$ME_mod= 0
##$MI= 0
##$NCOEF= 0
##$NC_proc= -2
##$NLEV= 6
##$NOISF1= 0
##$NOISF2= 0
##$NSP= 0
##$NTH_PI= 0
##$NZP= 0
##$OFFSET= 14.96146
##$PC= 1
##$PHC0= -79.24438
##$PHC1= 0
##$PH_mod= 1
##$PKNL= yes
##$PPARMOD= 0
##$PPDIAG= 0
##$PPIPTYP= 0
##$PPMPNUM= 2147483647
##$PPRESOL= 1
##$PSCAL= 4
##$PSIGN= 0
##$PYNMP= <proc.py>
##$REVERSE= no
##$SF= 400.02000945194
##$SI= 131072
##$SIGF1= 0
##$SIGF2= 0
##$SINO= 400
##$SIOLD= 131072
##$SPECTYP= <>
##$SREGLST= <1H.CDCl3>
##$SSB= 0
##$STSI= 131072
##$STSR= 0
##$SW_p= 8223.68421052631
##$SYMM= 0
##$S_DEV= 0
##$TDeff= 65536
##$TDoff= 0
##$TI= <>
##$TILT= no
##$TM1= 0
##$TM2= 0
##$TOPLEV= 0
##$USERP1= <user>
##$USERP2= <user>
##$USERP3= <user>
##$USERP4= <user>
##$USERP5= <user>
##$WDW= 1
##$XDIM= 131072
##$YMAX_p= 391362132
##$YMIN_p= -13010
##$CURPLOT= <Network HP LaserJet P1505>
##$CURPRIN= <$Network HP LaserJet P1505>
##$DFORMAT= <normdp>
##$LAYOUT= <+/1D_H.xwp>
##$LFORMAT= <normlp>
##$PFORMAT= <normpl>
##$SURQMSG= 1
$$ End of Bruker specific parameters
$$ ---------------------------------
##NTUPLES= NMR SPECTRUM
##VAR_NAME=  FREQUENCY,     SPECTRUM/REAL,   SPECTRUM/IMAG
##SYMBOL=    X,             R,               I
##VAR_TYPE=  INDEPENDENT,   DEPENDENT,       DEPENDENT
##VAR_FORM=  AFFN,          ASDF,            ASDF
##VAR_DIM=   131072,        131072,          131072
##UNITS=     HZ,            ARBITRARY UNITS, ARBITRARY UNITS
##FACTOR=    0.0627417313425164, 1,          1
##FIRST=     8223.62146879497, -459,         -82607
##LAST=      0,             2702,            -83219
##MIN=       0,             -13010,          0
##MAX=       8223.62146879497, 391362132,    0
$$ Real data points
##PAGE= N=1
##DATA TABLE= (X++(R..R)), XYDATA
$$ [...]
63797D49514j3087j2104j1055j0299r613q553p173o053n633n767n916n677n071
63784C43513m366l694k966k222j811j983k403k483k133j856k037k524k922l019
63770C07094k781k346k000j909j780j290p80r52j766k417k506k517k653k235r44
63755B78218J88P6p32q73l12k60j026j373m47Q94J384J091J051J680K416K636
63739B84611K311J824J589J807K348K894L292L589L668L303K661K387K880L853
63725C23017M756N341N652N826O102O601O957O638N781N158N007M550L121J185
63711C95692l29j164j583j615j237r70j413k287k733k478k018j629j025j06O74
63696C75779J009J257J838K520K638J899P40k6O8O68Q67J54r86j677j683j538
$$ y = [449514, 436427, 424323, 413268, 402969, 393356, 384803, 377630, 371577, 365944, 360177, 354261, 348584, 343513, 339147, 335453, 332487, 330265, 328454, 326471, 324068, 321585, 319452, 317596, 315559, 313035, 310113, 307094, 304313, 301967, 299967, 298058, 296278, 294988, 294208, 293256, 291490, 289073, 286567, 284050, 281397, 279162, 278218, 278406, 278482, 277750, 276877, 276565, 276305, 275279, 273906, 273459, 274353, 275737, 276828, 277879, 279559, 281975, 284611, 286922, 288746, 290335, 292142, 294490, 297384, 300676, 304265, 307933, 311236, 313897, 316284, 319164, 323017, 327773, 333114, 338766, 344592, 350694, 357295, 364252, 370890, 376671, 381829, 386836, 391386, 394507, 395692, 395363, 394199, 392616, 391001, 389764, 388794, 387381, 385094, 382361, 379883, 377865, 376236, 375211, 375105, 375779, 376788, 378045, 379883, 382403, 385041, 386940, 387680, 387654, 387722, 388390, 389257, 389411, 388425, 386748, 385065, 383527]
63680C83527j757k301k729k554j541N4J525K380K784L130L376L282L003K862K742
63665C97783K314J760J548J562J189K96o23j380k324l498m361m696m965n447n668
63650C73490n208m393l743l329l043k911k626j569J57J374J258N22L81Q71J149
63635C52380J062J375K483L858M809N157N115N095N640O821P880Q046P718Q064
63621D25503R449J0977J1754J1914J2221J3220J5011J7191J8865J9344J9127J9578
63609F04154K1307K3422K4698K4857K4142K2372J9216J5189J1444Q506N817K778
63597H07902k36k310l159l487m165n317o436p199p809q552r368j0144j1089j2445
63583G16186j4009j5362j6407j7179j7240j5932j3343j0511q360o829n284l476
$$ y = [383527, 381770, 379469, 376740, 374186, 372645, 372699, 374224, 376604, 379388, 382518, 385894, 389176, 392179, 395041, 397783, 400097, 401857, 403405, 404967, 406156, 406452, 405829, 404449, 402125, 398627, 394266, 389570, 384605, 379158, 373490, 368282, 363889, 360146, 356817, 353774, 350863, 348237, 346668, 346825, 348199, 349457, 349979, 350360, 351231, 352380, 353442, 354817, 357300, 361158, 365967, 371124, 376239, 381334, 386974, 393795, 401675, 409721, 417439, 425503, 434952, 445929, 457683, 469597, 481818, 495038, 510049, 527240, 546105, 565449, 584576, 604154, 625461, 648883, 673581, 698438, 722580, 744952, 764168, 779357, 790801, 799307, 805124, 807902, 807666, 805356, 802197, 798710, 794545, 789228, 782792, 775593, 767784, 759232, 749864, 739720, 728631, 716186, 702177, 686815, 670408, 653229, 635989, 620057, 606714, 596203, 587843, 581014, 575730, 572254]
63571E72254j770o52j66K38J243K783L819L542K629K573L669M635M609M527N711
63556F09644P930R920J1412J3440J6697K0648K4509K8247L2206L6269L9693M1408
63544H92023M0416L6371K9879K1922J3070L795m624j0507j3415j4524j4890j4171
63532I65345j1844q941p368p707q782r503j0192j1730j4210j7017j9760k2432
63520H15859k4810k6295k6506k5722k4682k3969k3585k3027k1826k0072j8299
63509E57066j6815j5374j3632j1674r875q417p278o553o389o574o529n905m901
63496D37150l910l101k454j995j752j635j544j488j416j090k86R19K184L175L730
63481D26487L953M258N056O189O913O747O118N746N556M754L016J026l39r72j388
$$ y = [572254, 570484, 569832, 569666, 569904, 571147, 573930, 577749, 581291, 583920, 586493, 590162, 594797, 599406, 603933, 609644, 617574, 627494, 638906, 652346, 669043, 689691, 714200, 742447, 774653, 810922, 850615, 892023, 932439, 968810, 998689, 1020611, 1033681, 1037476, 1032852, 1022345, 1008930, 994406, 979516, 965345, 953501, 944560, 937192, 929485, 920703, 911200, 901008, 889278, 875068, 858051, 838291, 815859, 791049, 764754, 738248, 712526, 687844, 663875, 640290, 617263, 595437, 575365, 557066, 540251, 524877, 511245, 499571, 489696, 481279, 474001, 467448, 461059, 454485, 447956, 442051, 437150, 433240, 430139, 427685, 425690, 423938, 422303, 420759, 419271, 417855, 416765, 416479, 417398, 419582, 422757, 426487, 430440, 434698, 439754, 445943, 452856, 459603, 465721, 471467, 477023, 481777, 484793, 485819, 485480, 484508, 483120]
63466D83120k030k993m243n617o751p237o965o173n254m530m009l285j927j05
63452D22001J438K283K880L901N252O274O780P346Q518J0272J2345J4658J7103
63439E21051J9447K1824K5009K9617L5061L9730M2153M1751L8574L2881K5151
63428H72249J6226P194p67o520r480j0147r687q602o189j731M092R601J3699J6464
63414H86402J8199J8744J7918J5922J3001R252N191J813m63k368m571o442o932
63401I65666o449o673q431j0721j2298j3381j5141j8083k1517k4333k5832k6020
63389G76787k5527k5059k4606k3442k1183j8558j6601j5361j3963j1875r530p570
63377E63512n987m325k417n45J050K512M102N762P167Q278R510J1130J2725J3710
$$ y = [483120, 481090, 478097, 473854, 468237, 461486, 454249, 447284, 441111, 435857, 431327, 427318, 424033, 422106, 422001, 423439, 425722, 428602, 432503, 437755, 444029, 450809, 458155, 466673, 476945, 489290, 503948, 521051, 540498, 562322, 587331, 616948, 652009, 691739, 733892, 775643, 814217, 847098, 872249, 888475, 895669, 894902, 888382, 878902, 868755, 859068, 850466, 844277, 842546, 846638, 856239, 869938, 886402, 904601, 923345, 941263, 957185, 970186, 979438, 984629, 986442, 985979, 983611, 979040, 972598, 965666, 959217, 952544, 944113, 933392, 921094, 907713, 892572, 874489, 852972, 828639, 802807, 776787, 751260, 726201, 701595, 678153, 656970, 638412, 621811, 606450, 592487, 580612, 571082, 563512, 557525, 553200, 550783, 550238, 551288, 553800, 557902, 563664, 570831, 579109, 588619, 599749, 612474, 626184]
63363F26184J4327J5572J7914K0597K2556K3683K4762K6311K7898K8574K7696
63352H76074K5427K2594J9974J7478J4287R924N000O24k645m902o293o842o798
63339I63902o666o830p470q776j0903j3654j6549j9211k1448k2931k3237k2212
63327G84015k0118j7302j3961j0181o024j671K310M937N401L647J65m604j0268
63314G16346j6056k0913k4152k5671k5583k4121k1858j9507j7258j4780j2022
63303D94425r602q111p378o750n858m806l846l190l019l366l943m224l917l241
63289D23174k747k704k795k552k093j992k346k463j856j075r72j472j773j572
63275C94762j320j220q32J00J082J463J189O52K79L70R45J547J641J337J290J745
$$ y = [626184, 640511, 656083, 673997, 694594, 717150, 740833, 765595, 791906, 819804, 848378, 876074, 901501, 924095, 944069, 961547, 975834, 985758, 990758, 991382, 988737, 983835, 977542, 970700, 963902, 957236, 950406, 942936, 934160, 923257, 909603, 893054, 873843, 852395, 829464, 806227, 784015, 763897, 746595, 732634, 722453, 716429, 714758, 717068, 722005, 727406, 731053, 731218, 726614, 716346, 700290, 679377, 655225, 629554, 603971, 579850, 557992, 538485, 521227, 506447, 494425, 484823, 476712, 469334, 462584, 456726, 451920, 448074, 444884, 441865, 438499, 434556, 430332, 426415, 423174, 420427, 417723, 414928, 412376, 410283, 408291, 405945, 403482, 401626, 400551, 399579, 398107, 396334, 394762, 393442, 392222, 391390, 391490, 392572, 394035, 395224, 395876, 396155, 396525, 397470, 399017, 400658, 401995, 403285, 405030]
63259D05030K255K481K658L021L348L436L489L707L994M363N058N904O219N872
63245D60835N740O563P897Q866R417J0050J0769J1155J1297J1798J2979J4671
63233E82037J6732J9052K1196K2715K3787K5051K6783K8715L0464L1723L2187
63222H60442L1869L1356L1199L1241L1087L1011L1600L2687L3415L3361L2860
63211A212128L2200L1196K9625K7324K3811J8586J1993N126j405p901j4679k1397
63199A346607k7594l3140l7799m0935m2133m1646l9902l7064l3394k9501k5801
63188I57698k2125j8205j4100r877n369o53L731P526J1183J5101J8778K1373K2827
63175I87888K3833K4930K6117K7256K8294K9070K9323K8946K8106K7149K6448
$$ y = [405030, 407285, 409766, 412424, 415445, 418793, 422229, 425718, 429425, 433419, 437782, 442840, 448744, 454963, 460835, 466575, 473138, 481035, 489901, 499318, 509368, 520137, 531292, 542589, 554387, 567366, 582037, 598769, 617821, 639017, 661732, 685519, 710570, 737353, 766068, 796532, 828255, 860442, 892311, 923667, 954866, 986107, 1017194, 1048205, 1079805, 1112492, 1145907, 1179268, 1212128, 1244328, 1275524, 1305149, 1332473, 1356284, 1374870, 1386863, 1391989, 1390584, 1382683, 1368004, 1346607, 1319013, 1285873, 1248074, 1207139, 1165006, 1123360, 1083458, 1046394, 1013000, 983499, 957698, 935573, 917368, 903268, 893391, 888022, 887369, 891100, 898626, 909809, 924910, 943688, 965061, 987888, 1011721, 1036651, 1062768, 1090024, 1118318, 1147388, 1176711, 1205657, 1233763, 1260912, 1287360]
63164A287360K6011K5072K2516J8011J2442O875J446m424j1006j8012k4967l1295
63152A310029l6290l9632m1827m3559m4706m4545m2904m0536l8224l6076l3854
63141H67876l1511k9082k6370k3161j9652j6430j3936j2112j0594r196q039p135
63129F60658o086m519k687j209k24O34J417J672J391J397K222L240L617L523L586
63114F68632L672L227K508K260K298J653L29l86J58R11O59k81q56r15j118j624
63098F81127j959j969k015k188k135j732j342j184j018n20L76J564K783L560L571
63083F76919L113K804K761K608K331K521L523M826N742O253O745P231P420P416
63069G42213P813R005J0715J2335J3435J3960J4223J4866J6471J8953K1500K3446
$$ y = [1287360, 1313371, 1338443, 1360959, 1378970, 1391412, 1398287, 1399733, 1395309, 1384303, 1366291, 1341324, 1310029, 1273739, 1234107, 1192280, 1148721, 1104015, 1059470, 1016566, 976030, 937806, 901730, 867876, 836365, 807283, 780913, 757752, 738100, 721670, 707734, 695622, 685028, 675832, 667793, 660658, 654572, 650053, 647366, 646157, 645933, 646567, 647984, 649656, 651047, 652444, 654666, 657906, 661523, 665046, 668632, 672304, 675531, 678039, 680299, 682597, 684250, 684579, 684193, 684351, 685262, 685921, 685640, 684784, 683869, 682751, 681127, 679168, 677199, 675184, 672996, 670861, 669129, 667787, 666603, 665585, 665065, 665441, 667005, 669788, 673348, 676919, 680032, 682836, 685597, 688205, 690536, 693057, 696580, 701406, 707148, 713401, 720146, 727377, 734797, 742213, 750026, 759031, 769746, 782081, 795516, 809476, 823699, 838565, 855036, 873989, 895489, 918935]
63057I18935K5095K7404L0751L4314L6936L8503M0168M3095M7230N1544N5276
63046A349251N8581O1914O5229O8064P0177P1739P2954P3781P4104P3929P3408
63035B113131P2766P2234P1932P1802P1790P1878P1691P0298O6796O1101N3735
63024B869154M4836L3948K0931O586q044k2542l6897n0763o3443p4351q3084q9249
63012B547082r2699r3744r2694q9337q3489p5836o7567n9201n0378m0864l1043
63001A770230k1335j1879l009M692J1229J7405K3747K9766L4810L9052M2964M6315
62989A983987M8529M9835N1155N2816N4031N3959N2681N0849M8619M5273L9917
62978B531651L2389K3426J3861L779p234j9139l1226m2966n4412o5324p4603q1239
$$ y = [918935, 944030, 971434, 1002185, 1036499, 1073435, 1111938, 1152106, 1195201, 1242431, 1293975, 1349251, 1407832, 1469746, 1534975, 1603039, 1673216, 1744955, 1817909, 1891690, 1965794, 2039723, 2113131, 2185897, 2258131, 2330063, 2401865, 2473655, 2545533, 2617224, 2687522, 2754318, 2815419, 2869154, 2913990, 2947938, 2968869, 2975455, 2967411, 2944869, 2907972, 2857209, 2793766, 2719415, 2636331, 2547082, 2454383, 2360639, 2267945, 2178608, 2095119, 2019283, 1951716, 1892515, 1842137, 1801273, 1770230, 1748895, 1737016, 1734007, 1738699, 1749928, 1767333, 1791080, 1820846, 1855656, 1894708, 1937672, 1983987, 2032516, 2082351, 2133506, 2186322, 2240353, 2294312, 2346993, 2397842, 2446461, 2491734, 2531651, 2564040, 2587466, 2601327, 2605106, 2597872, 2578733, 2547507, 2504541, 2450129, 2384805, 2310202, 2228963]
62966B228963q5433q8041q9242q8594q6202q2893p9214p5077p0552o6190o2258
62955A355267n8374n4233n0119m6406m3056l9978l7320l5031l2648k9990k7572
62944I00540k5847k4421k2554k0151j7714j5593j3832j2566j1949j1720j1332
62933G12861j0612r830r156q433p636p033o702o210n152l806k946l002l590l979
62919F24774l814l299k802k515k476k653k882k927k798k825l130l296k870k113
62905E84374j722j871j960j486o65n9Om85j293j828j489m54L36L72K63P22J337
62888E74098J104l0r92j026n64l42k88K01J188J971J957J450J233J581J909J556
62872E85006O20k85r06j460j871j630p95m63j502l178l837k910j461o87n98n04
$$ y = [2228963, 2143530, 2055489, 1966247, 1877653, 1791451, 1708558, 1629344, 1554267, 1483715, 1417525, 1355267, 1296893, 1242660, 1192541, 1146135, 1103079, 1063101, 1025781, 990750, 958102, 928112, 900540, 874693, 850272, 827718, 807567, 789853, 774260, 760428, 747862, 735913, 724193, 712861, 702249, 692419, 683263, 674830, 667194, 660161, 653459, 647249, 642097, 638291, 635345, 632343, 628753, 624774, 620960, 617661, 614859, 612344, 609868, 607215, 604333, 601406, 598608, 595783, 592653, 589357, 586487, 584374, 582652, 580781, 578821, 577335, 576670, 576611, 576617, 576132, 574839, 573011, 571522, 571068, 571404, 571776, 572039, 572761, 574098, 575202, 575172, 574180, 573154, 572590, 572248, 571960, 572161, 573349, 575320, 577277, 578727, 579960, 581541, 583450, 585006, 585626, 585341, 584435, 582975, 581104, 579474, 578679, 578216, 576714, 573536, 569699, 566789, 565328, 564641, 564043, 563539]
62856E63539j68M0j34m32l47L51J352K004J957J589J526J739J544O48k31k07N70
62839E75340J008L16j130k245k269j291L5J115J731J916J718J231O95L85L57M97
62823E79409P90J363K171K852L061K813K470K413K800L498M195M626M751M683
62809F21895M495M279M299M898O053P272P991Q083P837P638P726Q161Q908R834
62795G19369J0733J1445J2121J3328J5605J8776K1940K4386K6384K8799L2114
62784I35000L6204M0871M6106N1788N7555O3133O8510P3800P9245Q5209R1748
62773A629169R8189J03736J08395J12588J15783J16420J13568J07776R9781Q9249
62763B694654P5620N9448M1816K2914K453j8651l8309n5194o9679q2577r3770
$$ y = [563539, 563371, 563411, 563277, 562845, 562498, 562849, 564201, 566205, 568162, 569751, 571277, 573016, 574560, 575208, 574977, 574770, 575340, 576348, 576664, 575534, 573289, 571020, 569729, 569764, 570879, 572610, 574526, 576244, 577475, 578170, 578555, 578912, 579409, 580199, 581562, 583733, 586585, 589646, 592459, 594929, 597342, 600142, 603640, 607835, 612461, 617212, 621895, 626390, 630669, 634968, 639866, 645919, 653191, 661182, 669265, 677102, 684740, 692466, 700627, 709535, 719369, 730102, 741547, 753668, 766996, 782601, 801377, 823317, 847703, 874087, 902886, 935000, 971204, 1012075, 1058181, 1109969, 1167524, 1230657, 1299167, 1372967, 1452212, 1537421, 1629169, 1727358, 1831094, 1939489, 2052077, 2167860, 2284280, 2397848, 2505624, 2605405, 2694654, 2770274, 2829722, 2871538, 2894452, 2896905, 2878254, 2839945, 2784751, 2715072, 2632495, 2538725]
62752B538725j02564j08587j11825j12340j10512j07143j02943r8150r2869q7312
62742A504480q1437p4865o7648o0601n4389m8767m3277l8291l4569l2010k9581
62731I39045k6533k3008j9460j6072j2969j0443q635p280o007m722l581k661j791
62718G95883n95J191L330N136O251P176Q713J0953J3240J5137J6943J9171K1979
62705I24508K5251K8784L2231L5266L8114M1625M6497N2595N9153O5430P1084
62694A420538P6275Q1551Q7179R2436R6031R7452R7330R6027R2578Q5813P5952
62683B399162O4156N0752L5053J7096j520j9046l5035m9868o3478p5245q4754
62672B237273r1975r6794r9016r8860r6997r4041r0219q5595q0298p4520o8488
$$ y = [2538725, 2436161, 2327574, 2215749, 2103409, 1992897, 1885754, 1782811, 1684661, 1591792, 1504480, 1423043, 1348178, 1280530, 1219929, 1165540, 1116773, 1073496, 1035205, 1000636, 968626, 939045, 912512, 889504, 870044, 853972, 841003, 830560, 821925, 814645, 808638, 803916, 800335, 797674, 795883, 795288, 796479, 799809, 804945, 811196, 818372, 827085, 838038, 851278, 866415, 883358, 902529, 924508, 949759, 978543, 1010774, 1046040, 1084154, 1125779, 1172276, 1224871, 1284024, 1349454, 1420538, 1496813, 1578364, 1665543, 1757979, 1854010, 1951462, 2048792, 2144819, 2237397, 2323210, 2399162, 2463318, 2514070, 2549123, 2566219, 2564699, 2545653, 2510618, 2460750, 2397272, 2322027, 2237273, 2145298, 2048504, 1949488, 1850628, 1753631, 1659590, 1569371, 1483776, 1403478, 1328958, 1260470]
62661A260470o2510n6897n1736m6893m2265l7982l4303l1305k8690k6003k3188
62650H18698k0832j9538j9068j8455j7055j5106j3121j1219r395q015p440p362
62638F52092p100o474n885n519n110m596m357m497m397l460k062j275j653k624
62624E93083l140k718j828j293j386j540j034J31J273J822J817J556J252J156
62610E89151J643K736L878M567N075O058P558Q954R903J0854J2415J4613J7078
62597F94483J9613K2294K5194K8383L2008L6050M0078M3607M6649M9526N2187
62586A090072N4139N5146N5465N5077N3119M8699M1973L3887K4960J5013M166
62575A531716o644j6516k5396l3542m0599m5856m9184n1125n2111n2171n1362
$$ y = [1260470, 1197960, 1141063, 1089327, 1042434, 1000169, 962187, 927884, 896579, 867889, 841886, 818698, 797866, 778328, 759260, 740805, 723750, 708644, 695523, 684304, 674909, 666894, 659454, 652092, 644992, 638518, 632633, 627114, 622004, 617408, 613051, 608554, 604157, 600697, 598635, 597360, 595707, 593083, 589943, 587225, 585397, 584104, 582718, 581178, 580144, 580275, 581548, 583370, 585187, 586743, 587995, 589151, 590794, 593530, 597408, 601975, 607050, 613108, 620666, 629620, 639523, 650377, 662792, 677405, 694483, 714096, 736390, 761584, 789967, 821975, 858025, 898103, 941710, 988359, 1037885, 1090072, 1144211, 1199357, 1254822, 1309899, 1363018, 1411717, 1453690, 1487577, 1512537, 1527550, 1531716, 1525072, 1508556, 1483160, 1449618, 1409019, 1363163, 1313979, 1262854, 1210743, 1158572, 1107210]
62564A107210m9936m7924m5115m1656l8185l5116l2160k8911k5551k2580k0112
62553G19964j7844j5596j3486j1618r999q732p914p308o444n172l900l073k560
62540F06318j841p75J01K08k84o03l85j38l80p47m13P15J914K738L550M726N998
62523F20702P087Q381J0397J2926J5400J7842K0786K4377K8138L1658L4929L8102
62511H70725M1408M5198M9466N3364N5939N7313N8361N9144N8585N5998N1978
62500A457479M7221M1337L3719K4897J6153Q164R20n371j0276j3964j7065j9537
62488A563677k0535j9659j7618j5388j3379j1736j0809j0786j1328j2080j3301
62477A407058j5469j8569k2199k6210l0714l5512m0004m3644m6218m7659m7927
$$ y = [1107210, 1057274, 1009350, 964235, 922579, 884394, 849278, 817118, 788207, 762656, 740076, 719964, 702120, 686524, 673038, 661420, 651421, 642689, 634775, 627467, 621023, 615851, 611951, 608878, 606318, 604477, 603702, 603803, 604011, 603727, 603124, 602739, 602601, 602221, 601474, 601061, 601776, 603690, 606428, 609978, 614704, 620702, 627789, 636170, 646567, 659493, 674893, 692735, 713521, 737898, 766036, 797694, 832623, 870725, 912133, 957331, 1006797, 1060161, 1116100, 1173413, 1231774, 1290918, 1349503, 1405501, 1457479, 1504700, 1546037, 1579756, 1604653, 1620806, 1628970, 1629890, 1624519, 1614243, 1600279, 1583214, 1563677, 1543142, 1523483, 1505865, 1490477, 1477098, 1465362, 1454553, 1443767, 1432439, 1420359, 1407058, 1391589, 1373020, 1350821, 1324611, 1293897, 1258385, 1218381, 1174737, 1128519, 1080860, 1032933]
62466A032933m7206m5895m4301m2454m0283l7750l4718l0963k6534k2067j8482
62455F42280j6195j4713j3075j0805q335o403n189m261l267k308j510o80L17J186
62441E57042J636J980K797M020M920N008M466L541K169N08p39j160j435k559m389
62426E77805n738n994n846o104o485o216n426n036n460o046o036n418m617l820
62412D99563l084k695k927l488l633k958j809q78n21n44m00L40J646K980L809
62397D85401M126M390M959N655N968N531M461L353K951L629N038O427P270P554
62383E56713P530P410P324P361P473P494P287O830O111N171M234L628L485L737
62369F41788M400N555P011Q349R531J1051J3216J5658J7989K0559K3983K8050
$$ y = [1032933, 985727, 939832, 895531, 853077, 812794, 775044, 740326, 709363, 682829, 660762, 642280, 626085, 611372, 598297, 587492, 579157, 572754, 567565, 563304, 560037, 557729, 556219, 555539, 555856, 557042, 558678, 560658, 563455, 567475, 572395, 577403, 581869, 585410, 587579, 588087, 587348, 586188, 584753, 582194, 577805, 572067, 566073, 560227, 554123, 547638, 541422, 535996, 530960, 525500, 519454, 513418, 508000, 503383, 499563, 496479, 493784, 490857, 487369, 483736, 480778, 478969, 478091, 477570, 477026, 476626, 476966, 478612, 481592, 485401, 489527, 493917, 498876, 504531, 510499, 516030, 520491, 523844, 526795, 530424, 535462, 541889, 549159, 556713, 564243, 571653, 578977, 586338, 593811, 601305, 608592, 615422, 621533, 626704, 630938, 634566, 638051, 641788, 646188, 651743, 658754, 667103, 676634, 687685, 700901, 716559, 734548, 755107, 779090, 807140]
62357H07140L1830L4858L7601M0520M3264M5156M6106M6563M6688M5938M3528
62346A269192L9177L3406K7217K1351J5884J0492N076j98n325j0508j5657k0277
62334A369830k4104k7490l0811l3698l5383l5739l5575l5733l6182l6106l4857
62323A004152l2717l0646k9290k8345k7116k5557k4316k3654k2880k1276j9152
62312G19203j7395j6153j4728j2747j0776r481q711p824o576n211l876k497j176
62299F02052k97j1P3M30R68J169Q59N63Q79J701K296K116J254J46q79j631j958
62282F09730j891j725j734j910k106k248k176j595m42P94J536J801K144K953M205
62267F07336N782P695R875J2065J4018J5686J7300J9420K2689K7104L1727L5611
$$ y = [807140, 838970, 873828, 911429, 951949, 995213, 1040369, 1086475, 1133038, 1179726, 1225664, 1269192, 1308369, 1341775, 1368992, 1390343, 1406227, 1416719, 1421795, 1421597, 1416272, 1405764, 1390107, 1369830, 1345726, 1318236, 1287425, 1253727, 1218344, 1182605, 1147030, 1111297, 1075115, 1039009, 1004152, 971435, 940789, 911499, 883154, 856038, 830481, 806165, 782511, 759631, 738355, 719203, 701808, 685655, 670927, 658180, 647404, 637923, 629212, 621388, 614812, 609601, 605725, 603228, 602052, 601755, 601744, 601817, 602247, 603215, 604384, 605243, 605806, 606685, 608386, 610682, 612798, 614052, 614198, 613319, 611688, 609730, 607839, 606114, 604380, 602470, 600364, 598116, 595940, 594345, 593903, 594697, 596233, 598034, 600178, 603131, 607336, 613118, 620813, 630688, 642753, 656771, 672457, 689757, 709177, 731866, 758970, 790697, 826308]
62255H26308L8872M2259M5773M8450M9666M9761M9039M6936M2879L7347L1313
62244A308603K4987J7963J0371L083l368r425j5820k2599k9064l4386l8224m0910
62232A171211m3025m4648m5176m4194m2201m0079l7959l5261l1865k8548k5996
62221G52259k3897k1435j8379j5252j2652j0771r566r025r085r375r217q131o404
62208E89070m977m493m525m095k855j437n12k2N44J404K464L666M996O191O810
62193E92229O741O401O344O752P351P844Q269Q885R727J0489J0932J1187J1355
62180G04506J1069R881Q071O558N768N064L630J715N39J109L356O361R228J1837
62166G88692J4814J8663K2879K6289K8452L0216L2410L4397L4676L2778K9740
$$ y = [826308, 865180, 907439, 953212, 1001662, 1051328, 1101089, 1150128, 1197064, 1239943, 1277290, 1308603, 1333590, 1351553, 1361924, 1365007, 1361639, 1352214, 1336394, 1313795, 1284731, 1250345, 1212121, 1171211, 1128186, 1083538, 1038362, 994168, 951967, 911888, 873929, 838668, 806803, 778255, 752259, 728362, 706927, 688548, 673296, 660644, 649873, 640307, 631282, 622197, 612822, 603605, 595474, 589070, 584093, 579600, 575075, 570980, 568125, 566688, 566176, 566154, 566698, 568102, 570566, 574232, 579228, 585419, 592229, 598970, 605371, 611715, 618467, 625818, 633662, 641931, 650816, 660543, 671032, 681964, 693151, 704506, 715575, 725456, 733527, 740085, 745853, 750917, 754547, 756262, 756801, 757910, 761266, 767627, 776855, 788692, 803506, 822169, 845048, 871337, 899789, 930005, 962415, 996812, 1031488, 1064266, 1094006]
62155A094006K6521K2837J8064J2630P666L559l36m458q335j1470j4230j7294
62143A129160k0421k2577k3301k3287k3299k3022k1480j8334j4313j0463p351
62132I21312m990k998p90J972M915P291Q925J0561J3028J6355J9837K2698K4459
62119A042575K5060K4973K4888K4983K4686K3492K1692J9855J7899J5257J1807
62108A277167P976M005k52m663q592j1553j3588j4724j4605j3024j0489p832n514
62095A184312l585k056q63K75J616L042M242N122N774O205O398O530O825P329
62081A231166Q046R114J0537J1902J2850J3729J5190J7132J8537J8672J8017J7666
62069A402558J7986J8230J7374J5180J2399J0155R096R041R318R368Q978Q120
$$ y = [1094006, 1120527, 1143364, 1161428, 1174058, 1181724, 1185283, 1184947, 1180489, 1172154, 1160684, 1146454, 1129160, 1108739, 1086162, 1062861, 1039574, 1016275, 993253, 971773, 953439, 939126, 928663, 921312, 916322, 913324, 912534, 914506, 919421, 926712, 935637, 946198, 959226, 975581, 995418, 1018116, 1042575, 1067635, 1092608, 1117496, 1142479, 1167165, 1190657, 1212349, 1232204, 1250103, 1265360, 1277167, 1285143, 1289148, 1288896, 1284233, 1275641, 1264088, 1250500, 1235776, 1221171, 1208147, 1197658, 1189826, 1184312, 1180727, 1178671, 1177808, 1178083, 1179699, 1182741, 1186983, 1192105, 1197879, 1204084, 1210482, 1217012, 1223837, 1231166, 1239212, 1248326, 1258863, 1270765, 1283615, 1297344, 1312534, 1329666, 1348203, 1366875, 1384892, 1402558, 1420544, 1438774, 1456148, 1471328, 1483727, 1493882, 1502978, 1512019, 1521337, 1530705, 1539683, 1547803]
62057A547803O870N449M130K945J672K36j114k195l268m868p273j0339j3730j7168
62043A509150k0518k3829k7313l1120l5052l8555m1068m2389m2751m2577m2132
62032A121846m1386m0141l8273l5792l2812k9533k6274k3310k0692j8390j6601
62021G98642j5619j5304j4971j4066j2728j1482j0613j0093r990j0362j0792j0455
62009F52167q903o551m183k181l97J351K916M012M652N293O419P784Q300O957
61995F77636M006R13j007j750k282l382n054o870q417r394r707r664r910j0840
61981F04278j2077j2697j2057j0407q652p548p159p027o649n761m424l037k169
61968E04614k088k495k893l117l189k859j821l70P15J207J666K374K752K448K271
$$ y = [1547803, 1554673, 1560122, 1564252, 1567197, 1568869, 1569105, 1567991, 1565796, 1562528, 1557660, 1550387, 1540048, 1526318, 1509150, 1488632, 1464803, 1437490, 1406370, 1371318, 1332763, 1291695, 1249306, 1206555, 1163978, 1121846, 1080460, 1040319, 1002046, 966254, 933442, 903909, 877635, 854325, 833633, 815243, 798642, 783023, 767719, 752748, 738682, 725954, 714472, 703859, 693766, 683776, 673414, 662622, 652167, 643264, 636713, 632530, 630349, 629952, 631303, 634219, 638231, 642883, 648176, 654595, 662379, 670679, 677636, 681642, 682555, 681548, 679798, 677516, 674134, 669080, 662210, 653793, 644399, 634692, 625028, 615118, 604278, 592201, 579504, 567447, 557040, 548388, 540840, 533681, 526654, 520005, 514244, 509820, 506783, 504614, 502526, 500031, 497138, 494021, 490832, 487973, 486152, 485782, 486497, 487704, 489370, 491744, 494496, 496944, 499215]
61953D99215L255N065O483P265Q414J0365J2080J2527J2313J2979J5158J8115
61941F23234K0891K3207K5317K7444K9484L1021L1678L1588L1315L1099L0572
61930I36850K9429K7924K6274K4053K0804J6990J3521J0543P366L656r4l331o004
61917A107981q144r547j0073r778q444n672j744K192N350Q223J1686J5550J8652
61904A116232K0110J9859J8070J4866J0757O639K934r30n710j1227j6359k0212
61892A155029k2892k4979k6527k6971k6098k4614k3430k2672k1896k1052k0606
61881H93292k0609k0421j9689j8926j8619j8300j7210j5493j3934j2712j1259
61870G06120r321p375n768m179k236p1K075M324O779R123J1021J2694J4699J7283
$$ y = [499215, 502470, 507535, 514018, 521283, 529697, 540062, 552142, 564669, 576982, 589961, 605119, 623234, 644125, 667332, 692649, 720093, 749577, 780598, 812276, 843864, 875179, 906278, 936850, 966279, 994203, 1020477, 1044530, 1065334, 1082324, 1095845, 1106388, 1113754, 1117410, 1117316, 1113985, 1107981, 1099837, 1090290, 1080217, 1070439, 1061995, 1056323, 1054579, 1056771, 1062121, 1070344, 1082030, 1097580, 1116232, 1136342, 1156201, 1174271, 1189137, 1199894, 1206533, 1209467, 1208537, 1202827, 1191600, 1175241, 1155029, 1132137, 1107158, 1080631, 1053660, 1027562, 1002948, 979518, 956846, 934950, 913898, 893292, 872683, 852262, 832573, 813647, 795028, 776728, 759518, 744025, 730091, 717379, 706120, 696799, 689424, 683656, 679477, 677241, 677170, 679245, 683569, 690348, 699471, 710492, 723186, 737885, 755168]
61856G55168K0321K3668K7281L1054L4856L8571M2039M5063M7691N0144N2252
61845A168108N3246N2494N0217M7053M3125L8109L1969K5114J7820J0155K687
61834A540097l499p781j0604j2584j3424j2272q977m453J76M352P908J0615J2158
61821A501712J2317J0948P962L428k397r273j6930k4750l1782l7420m1878m5638
61809A326299m8566n0059m9963m8827m7123m4767m1701l8388l5255l2048k8354
61798H61248k4532k1409j9132j6997j4547j2150j0229q614p080n986n781o147
61786G08644o233n608m573l614l029k982l447m029m225l960l565l227k812k207
61772F55133j529q60q5Q64J838K647L194L413L375L446M074N233O353O906O821
$$ y = [755168, 775489, 799157, 826438, 857492, 892348, 930919, 972958, 1018021, 1065712, 1115856, 1168108, 1221354, 1273848, 1324065, 1371118, 1414243, 1452352, 1484321, 1509435, 1527255, 1537410, 1540097, 1536598, 1528817, 1518213, 1505629, 1492205, 1479933, 1470956, 1466503, 1466679, 1471031, 1478939, 1489554, 1501712, 1514029, 1524977, 1532939, 1536367, 1533970, 1524697, 1507767, 1483017, 1451235, 1413815, 1371937, 1326299, 1277733, 1227674, 1177711, 1128884, 1081761, 1036994, 995293, 956905, 921650, 889602, 861248, 836716, 815307, 796175, 779178, 764631, 752481, 742252, 733638, 726558, 720572, 714791, 708644, 702411, 696803, 692230, 688616, 685587, 682605, 679158, 675129, 670904, 666944, 663379, 660152, 657340, 655133, 653604, 652744, 652659, 653523, 655361, 658008, 661202, 664615, 667990, 671436, 675510, 680743, 687096, 694002, 700823]
61757G00823O295N496M561L609K580J346J11o60r30j301k252l515m573n445o429
61742F99716p265p277o320n064m157l525k720j590l62O53J249J396J333J408J730
61727F69205K128K534L154M071M909N177M824M194L580L085K828K967L389L603
61713G19648L109J925O35j14k87n42j481k800l543l322k916l241m067m258l338
61698F95408k103j544j730k052k195k333k611k893l050l133l298l712m477n355
61684F54922n693n011l673k640k515l085l831m438m684m305l314k257j758j888
61670F05830k156k058j529r62r39j725k874l502l198k474k092k118j991j394o40
61655E76178j72oJ81O89J513K298K556K191J797K107L093L974M231M250M656N293
$$ y = [700823, 707118, 712614, 717175, 720784, 723364, 724710, 724821, 724161, 723231, 721930, 719678, 716163, 711590, 706145, 699716, 692451, 685174, 678854, 673790, 669633, 666108, 663388, 661798, 661436, 662089, 663338, 664734, 666067, 667475, 669205, 671333, 673867, 677021, 681092, 686001, 691178, 696002, 700196, 703776, 706861, 709689, 712656, 716045, 719648, 722757, 724682, 725317, 725203, 724916, 724374, 722893, 720093, 716550, 713228, 710312, 707071, 703004, 698746, 695408, 693305, 691761, 690031, 687979, 685784, 683451, 680840, 677947, 674897, 671764, 668466, 664754, 660277, 654922, 649229, 644218, 640545, 637905, 635390, 632305, 628474, 624036, 619352, 615047, 611733, 609476, 607718, 605830, 603674, 601616, 600087, 599125, 598186, 596461, 593587, 590085, 586887, 584413, 582321, 580203, 578212, 576818, 576178, 576006, 576000, 576181, 576870, 578383, 580681, 583237, 585428, 587225, 589332, 592425, 596399, 600630, 604880, 609536, 614829]
61639F14829N300M232K650J474R83O55p6j250k552l766m775n277m960m113l620
61624E99734l980m571m340l073j611p36l83p1K80L44j2m90q04j143k034l739n773
61607E67598p255p784p793p895q083p916p299o675o399o376o413o502o610o548
61593D68050o242n858n525n175m812m564m393m045l514l132l024k856k435k129
61579D10346k296k687k831k711k596k444k016j463j288j680k307k672k478j724
61565C79153p87k12q5J50Q66J538J422P12K63K42k4p53j161o49J33J81l71l92
61547C80226O66J983K409J821J135J106J493J581J246J171J913L161M131M439
61533D08481M245L764L045K248J665J366J044K97j007k567l745l994l461k961
$$ y = [614829, 620129, 624361, 627011, 628485, 629468, 630123, 630047, 628797, 626245, 622479, 617704, 612427, 607467, 603354, 599734, 595754, 591183, 586843, 583770, 582159, 581423, 581040, 580969, 581249, 581593, 581581, 581091, 580287, 579144, 577110, 573371, 567598, 560343, 552559, 544766, 536871, 528788, 520872, 513573, 506898, 500499, 494123, 487710, 481208, 474598, 468050, 461808, 455950, 450425, 445250, 440438, 435874, 431481, 427436, 423922, 420790, 417766, 414910, 412475, 410346, 408050, 405363, 402532, 399821, 397225, 394781, 392765, 391302, 390014, 388334, 386027, 383355, 380877, 379153, 378366, 378154, 378069, 378219, 379085, 380623, 382045, 382757, 383020, 383262, 383238, 382485, 381324, 380675, 380808, 380989, 380618, 380226, 380892, 382875, 385284, 387105, 388240, 389346, 390839, 392420, 393666, 394837, 396750, 399911, 404042, 408481, 412726, 416490, 419535, 421783, 423448, 424814, 425858, 426155, 425148, 422581, 418836, 414842, 411381, 408420]
61519D08420l073l473l501l111k732k478k115j684j496j416r25K1P61P84K56m09
61503C83829r51j104o88j27j87q59j215o87J37M65M35O14J002J141Q97N23J90
61486C83415kJ49O45J030R00M24pl17n21n02m26q50j752k052r82N38R13N3n37
61467C80119J39J403J987J468L32o64r35m78k5k54q16p60K7O49N70L44O08J200
61449C84914J714K175K558K336J220l9l03O79K185L388L921L835L543L583M027
61434D19736M329M131L882M157M679M646L877L008K541K321K020J617J236R31
61420D63111P87R73J450J841J736J007j48j299j968k038j954k261k937l455l544
61405D51301l528l741m002l890l356k734k323k171k208k342k373k062j356n26
$$ y = [408420, 405347, 401874, 398373, 395262, 392530, 390052, 387937, 386253, 384757, 383341, 382416, 382437, 383198, 383982, 384238, 383829, 382878, 381774, 381086, 380959, 380772, 379913, 378698, 378011, 378148, 378613, 379048, 379662, 380664, 381805, 382702, 383225, 383415, 383413, 383562, 384207, 385237, 386137, 386561, 386554, 386237, 385716, 385214, 384788, 383938, 382186, 380134, 379152, 379690, 380603, 380656, 380119, 380258, 381661, 383648, 385116, 385448, 384784, 383849, 383371, 383346, 383092, 382276, 381516, 381543, 382192, 382762, 383106, 383714, 384914, 386628, 388803, 391361, 393697, 394917, 394878, 394575, 395254, 397439, 400827, 404748, 408583, 412126, 415709, 419736, 424065, 428196, 432078, 436235, 440914, 445560, 449437, 452445, 454986, 457307, 459327, 460944, 462180, 463111, 463898, 464871, 466321, 468162, 469898, 470905, 470757, 469458, 467490, 465452, 463498, 461237, 458300, 454845, 451301, 447773, 444032, 440030, 436140, 432784, 430050, 427727, 425556, 423348, 421006, 418633, 416571, 415215, 414689]
61391D14689L6J30q7k10P3O64J086R51M29J23M21J104J676K008K401L073L824
61374D32391M288M346M106L723L385L281L357L204K519J558Q99P79J025J527K378
61359D72766L435M305M875N540O556P589Q215Q612R323J0457J1635J2609J3480
61346E79397J4206J4353J3535J1913J0001Q146O383M668L043J541J87r00j544
61333F64929j823k244l304m848o063o318n860n378n055m514l678l083l058k995
61319F06708k091n26O16O64J13l1P22K169L852N375O502P349Q316R660J1089J2130
61303F72617J2698J3071J3249J2756J1236Q927O323L614P43k157m726o719q047
61290G33585q555q160p286o736o911p431p676p354o403m739k579o68L69P23J047
$$ y = [414689, 414725, 414855, 414768, 414558, 414631, 415295, 416381, 417332, 417761, 417884, 418305, 419409, 421085, 423093, 425494, 428567, 432391, 436679, 441025, 445131, 448854, 452239, 455520, 458877, 462081, 464600, 466158, 467057, 467836, 468861, 470388, 472766, 476201, 480506, 485381, 490921, 497477, 505066, 513281, 521893, 531216, 541673, 553308, 565917, 579397, 593603, 607956, 621491, 633404, 643405, 651551, 657934, 662602, 665645, 667186, 667373, 666473, 664929, 663106, 660862, 657558, 652710, 646647, 640329, 634469, 629091, 624036, 619522, 615844, 612761, 609703, 606708, 604617, 604091, 604707, 605371, 605484, 605453, 606175, 608344, 612196, 617571, 624073, 631422, 639738, 649398, 660487, 672617, 685315, 698386, 711635, 724391, 735627, 744554, 750877, 754491, 755234, 753077, 748351, 741632, 733585, 725030, 716870, 709584, 702848, 695937, 688506, 680830, 673476, 667073, 662334, 659755, 659087, 659456, 660179, 661226]
61275F61226J604K246L083M474O283P802Q577Q832Q893Q756Q542Q802R906J1519
61261G60545J3086J4530J6026J7429J8355J8597J8039J6363J3407R709O164L059
61249I25309q9l641p167r851j1300j1802j1852j1646j1039j0012q954q225p506
61236H12225o093m037k433k139k604k536j458K8J362K492L327L585L554M123N539
61221H14935O732O589N517M900N155N286M474L390L229L956M277L383K046J637
61207H75506K451L610M383N056O288Q199J0377J2509J4544J6546J8681K1288K4402
61194A023840K7329K9082K9327K8565K7399K5958K4050K1559J8504J5011J1392
61183A282016Q038N105K387m04l338o167q398r687j0427j1759j4467j7944k0762
$$ y = [661226, 662830, 665076, 668159, 672633, 678916, 686718, 695295, 704127, 713020, 721776, 730318, 739120, 749026, 760545, 773631, 788161, 804187, 821616, 839971, 858568, 876607, 892970, 906377, 916086, 922250, 925309, 925220, 921579, 914412, 904561, 893261, 881459, 869607, 857961, 846922, 836910, 827956, 819731, 812225, 806132, 802095, 799662, 797523, 794919, 792383, 790925, 790953, 792315, 794807, 798134, 801719, 805273, 809396, 814935, 821667, 828256, 833773, 838673, 843828, 849114, 853588, 856978, 860207, 864163, 868440, 871823, 873869, 875506, 877957, 881567, 885950, 891006, 897294, 905493, 915870, 928379, 942923, 959469, 978150, 999438, 1023840, 1051169, 1080251, 1109578, 1138143, 1165542, 1191500, 1215550, 1237109, 1255613, 1270624, 1282016, 1290054, 1295159, 1297546, 1297142, 1293804, 1287637, 1279239, 1269552, 1259125, 1247366, 1232899, 1214955, 1194193]
61170A194193k2237k2889k3382k3775k4022k4376k4857k4850k3890k2399k1018
61159I36498j9638j7682j5083j2402j0050p997o014l795j095J740L744M414M495
61146H57135M856M940L475N58k167l707m755o092p160p081o064m668k566P50M494
61131H31948P208Q749J0376J2834J5586J8150K0970K4386K7651K9802L0921L1843
61119A070424L3003L4145L4878L4983L4431L3468L2499L1535L0111K7979K5490
61108A422946K2929J9963J6327J2497R067N797K011k329o778j1378j6540k1980
61096A452532k6749l0491l3782l6937l9291m0204l9989l9335l8339l6765l4796
61085A055854l2888l1138k9352k7512k5684k3704k1431j9138j7169j5399j3509
$$ y = [1194193, 1171956, 1149067, 1125685, 1101910, 1077888, 1053512, 1028655, 1003805, 979915, 957516, 936498, 916860, 899178, 884095, 871693, 861643, 853646, 847632, 843837, 842742, 844482, 848226, 852640, 857135, 861991, 866931, 870406, 870964, 868797, 865090, 860335, 854243, 847083, 840002, 833938, 829270, 826704, 827454, 831948, 839156, 847905, 858281, 871115, 886701, 904851, 925821, 950207, 977858, 1007660, 1038581, 1070424, 1103427, 1137572, 1172450, 1207433, 1241864, 1275332, 1307831, 1339366, 1369477, 1397456, 1422946, 1445875, 1465838, 1482165, 1494662, 1503729, 1509526, 1511537, 1509208, 1502430, 1491052, 1474512, 1452532, 1425783, 1395292, 1361510, 1324573, 1285282, 1245078, 1205089, 1165754, 1127415, 1090650, 1055854, 1022966, 991828, 962476, 934964, 909280, 885576, 864145, 845007, 827838, 812439, 798930]
61074G98930j1615j0078q766p173n253l544k340j259Q1J446K416L125M166N815
61060G65951P691R167R948J0271J0660J1520J2870J4422J5905J7366J9118K1305
61048I26194K3551K5210K6096K6771K7824K9029K9593K9263K8701K8513K8405
61037A229150K7701K6437K5394K5040K4923K4244K2837K1385K0710K0988K1717
61026A490526K2483K3498K5159K7274K9226L0898L2900L5726L9125M2563M5912
61015A845290M9502N3926O0048O8567P9285R1306J04299J18965J35884J54832
61005B761904J76044K01442K33751K74894L26195L89362M66157N57748O65972
60996F053469P94938R49864J134675J351511J599010J863434K107634K274413
$$ y = [798930, 787315, 777237, 768471, 761298, 756045, 752501, 750161, 748902, 748983, 750429, 752845, 755970, 760136, 765951, 773642, 782809, 792757, 803028, 813688, 825208, 838078, 852500, 868405, 885771, 904889, 926194, 949745, 974955, 1001051, 1027822, 1055646, 1084675, 1114268, 1143531, 1172232, 1200745, 1229150, 1256851, 1283288, 1308682, 1333722, 1358645, 1382889, 1405726, 1427111, 1447821, 1468809, 1490526, 1513009, 1536507, 1561666, 1588940, 1618166, 1649064, 1681964, 1717690, 1756815, 1799378, 1845290, 1894792, 1948718, 2008766, 2077333, 2156618, 2247924, 2352223, 2471188, 2607072, 2761904, 2937948, 3139390, 3373141, 3648035, 3974230, 4363592, 4829749, 5387497, 6053469, 6848407, 7798271, 8932946, 10284457, 11883467, 13746901, 15854535, 18128948]
60988A8128948K311091K197417J951822J614224J228739Q42962N11846K83727
60980B9070776J70630J32487R6792r57j90895m71461q23916j217189j604828j930700
60970B3230739k147579k234277k198237k066272j873303j653389j432808j226715
60962H398159j041213q78021p37194o17595n17431m34987l68237l14299k70418
60953C218764k35105k07225j84577j64685j46804j31670j19257j08237r7717q8179
60943A735308q0189p3527o8042o4175o1855n9855n7089n3875n1105m8736m5891
60932A070969m2188l8148l4529l1765k9880k8400k6529k3924k1171j9104j7750
60921G57581j6356j4388j2073r974q405p350o654o111n506m727l842l027k392
$$ y = [18128948, 20440039, 22637456, 24589278, 26203502, 27432241, 28275203, 28787049, 29070776, 29241406, 29373893, 29470685, 29469728, 29278833, 28807372, 27983456, 26766267, 25161439, 23230739, 21083160, 18848883, 16650646, 14584374, 12711071, 11057682, 9624874, 8398159, 7356946, 6478925, 5741731, 5124136, 4606705, 4171718, 3803481, 3489182, 3218764, 2983659, 2776434, 2591857, 2427172, 2280368, 2148698, 2029441, 1921204, 1823487, 1735308, 1655119, 1581592, 1513550, 1449375, 1387520, 1327665, 1270576, 1216701, 1165596, 1116860, 1070969, 1028781, 990633, 956104, 924339, 894459, 866059, 839530, 815606, 794435, 775331, 757581, 741225, 726837, 714764, 704790, 696385, 689035, 682381, 676270, 670764, 666037, 662195, 659168, 656776]
60908F56776j827j071q4P35Q46J56r32j994k932l727m176m056l480k903k762l091
60892F25478l503l544l217l036l457m305m959n032m685m350m364m856n625o132
60878E64413n876m990m208m140m584m782m230l180k278j894j859j875j913j938
60864E16666j484k7K153L999M857N132N490N924O104O234O816P791Q602Q920Q735
60849E95912P892O304M600L765L970M405M346L856L209K327J080l41j697k923
60835F36705l943m643n139n639n905n435m359l527l414l624l739m034m813n691
60821E72800o086o087o158o272n965n102m105l461l420l973m843n515n623n301
60807E00889m928m671m360l707k552j159k41l33j033j368j037o92q22j017q01
$$ y = [656776, 654949, 653878, 653794, 654529, 655375, 655531, 654599, 652605, 649673, 645946, 641770, 637714, 634234, 631331, 628569, 625478, 621975, 618431, 615214, 612178, 608721, 604416, 599457, 594425, 589740, 585390, 581026, 576170, 570545, 564413, 558537, 553547, 549339, 545199, 540615, 535833, 531603, 528423, 526145, 524251, 522392, 520517, 518604, 516666, 515182, 515155, 517308, 521307, 526164, 531296, 536786, 542710, 548814, 555048, 561864, 569655, 578257, 587177, 595912, 603804, 610108, 614708, 618473, 622443, 626848, 631194, 635050, 638259, 640586, 641666, 641325, 639628, 636705, 632762, 628119, 622980, 617341, 611436, 606001, 601642, 598115, 594701, 591077, 587338, 583304, 578491, 572800, 566714, 560627, 554469, 548197, 542232, 537130, 533025, 529564, 526144, 522171, 517328, 511813, 506190, 500889, 495961, 491290, 486930, 483223, 480671, 479512, 479271, 478938, 477905, 476537, 475500, 474808, 473986, 472969, 472168]
60792D72168m08j51M05J733L244L784L192K489K499K986L298L272L222L440L963
60777E09136M635N223N523N429M937M327M191M911N953O237N448M451M094M207
60763E78702M264M363M824N344N414N203N164N086M413L256K187J264K24n36l32
60748F28840M22M37n99j549j631j611k573m407o189p387p988p948p264o227n101
60733E69225l828k476j480j024o40O3P83J134J440K251L472M593N524O515P522
60718E93074Q267Q846R600J0515J1292J1939J2663J3276J3353J3085J3237J4033
60706G33180J4648J4259J3189J2585J3065J4090J4670J4381J3569J2726J1934
60695H82296J1022J0045R217Q445P290N566L649J945M10j130k478l404m254n610
$$ y = [472168, 471760, 471609, 472014, 473747, 476991, 480775, 483967, 486456, 488955, 491941, 495239, 498511, 501733, 505173, 509136, 513771, 518994, 524517, 529946, 534883, 539210, 543401, 548312, 554265, 560502, 565950, 570401, 574495, 578702, 582966, 587329, 592153, 597497, 602911, 608114, 613278, 618364, 622777, 626033, 628220, 629484, 629708, 629172, 628840, 629262, 629699, 629100, 627551, 625920, 624309, 621736, 617329, 611140, 603753, 595765, 587817, 580553, 574326, 569225, 565397, 562921, 561441, 560417, 559777, 559840, 560623, 561757, 563197, 565448, 568920, 573513, 579037, 585552, 593074, 601341, 610187, 619787, 630302, 641594, 653533, 666196, 679472, 692825, 705910, 719147, 733180, 747828, 762087, 775276, 787861, 800926, 815016, 829686, 844067, 857636, 870362, 882296, 893318, 903363, 912580, 921025, 928315, 933881, 937530, 939475, 939885, 938755, 936277, 932873, 928619, 923009]
60681I23009p365q692r133r247r887j1119j2256j2742j2681j2521j2510j2597
60669G92259j2606j2373j1837j1180j0751j0686j0627j0138r413r134r484r692
60657F64338r062q031p539p535o969n345l461k286j815j522j324j418j581j405
60643F05045j041j051j614k343k822k862k376j550j020j234j715j545n77M01Q19
60628E84515R64J228J371R23p6j162j994k463k526k340k370l006m072m968n277
60613E58747n055m634m286m036l731l377l316l774m263l880k439r24m06q09j269
60598E12548j452j787k413k674k043j013m05k27J83R36J341J026O35R03J550J670
60582E08778J005J69l17n48o99o32l07m8j9J70R18K049L145M156N204O140O757
$$ y = [923009, 915644, 906952, 897819, 888572, 878685, 867566, 855310, 842568, 829887, 817366, 804856, 792259, 779653, 767280, 755443, 744263, 733512, 722826, 712199, 702061, 692648, 683514, 674030, 664338, 655276, 647245, 639706, 632171, 625202, 619857, 616396, 614110, 612295, 610773, 609449, 608031, 606450, 605045, 604004, 602953, 601339, 598996, 596174, 593312, 590936, 589386, 588366, 587132, 585417, 583872, 583295, 583696, 584515, 585479, 586707, 588078, 589001, 588925, 587763, 585769, 583306, 580780, 578440, 576070, 573064, 568992, 564024, 558747, 553692, 549058, 544772, 540736, 537005, 533628, 530312, 526538, 522275, 518395, 515956, 515032, 514626, 513817, 512548, 511096, 509309, 506896, 504222, 502179, 501166, 500761, 500534, 500717, 501653, 502994, 504020, 504655, 505558, 507108, 508778, 509783, 509952, 509635, 509087, 508388, 507756, 507449, 507401, 507382, 507552, 508470, 510519, 513664, 517820, 523024, 529164, 535921]
60565E35921P323Q288R642J0999J2214J3393J4416J5075J5525J5929J5668J3744
60553F88137J0142O078K616k64k898n020o196o565o477n886m702l342k218r51
60539F62454J066L642O086Q424J1315J4722J7589J9193J9921K0328K0057J8433
60527H23230J5542J1994Q012L558q10m087n975p180q269q842q294o936n747n153
60513H01043m658l684k306r86N0R03J705K509L379M359N368O277P095Q016R363
60498H38433J1518J4706J8760K3237K7916L3003L8622M4404M9811N4646N8842
60487A213898O1873O2985O1931N9029N4275M7046L6973K4755J1664j492j4582
60476A618355k7498l9698n0371n8836o4788o8328o9669o8879o6053o1761n6892
$$ y = [535921, 543244, 551532, 561174, 572173, 584387, 597780, 612196, 627271, 642796, 658725, 674393, 688137, 698279, 704357, 706973, 706709, 703811, 698791, 692595, 686030, 679553, 673667, 668965, 665623, 663405, 662454, 663520, 667162, 673248, 681672, 692987, 707709, 725298, 744491, 764412, 784740, 804797, 823230, 838772, 850766, 858778, 862336, 861526, 857439, 851464, 844284, 836015, 827173, 818879, 811943, 806196, 801043, 796385, 792701, 790395, 789409, 789459, 790362, 792067, 794576, 797955, 802314, 807682, 813959, 821054, 829070, 838433, 849951, 864657, 883417, 906654, 934570, 967573, 1006195, 1050599, 1100410, 1155056, 1213898, 1275771, 1338756, 1400687, 1459716, 1513991, 1561037, 1598010, 1622765, 1634429, 1632937, 1618355, 1590857, 1551159, 1500788, 1441952, 1377164, 1308836, 1239167, 1170288, 1104235, 1042474, 985582]
60465I85582n1890m6565m0975l6000l2450k9914k7234k3989k0829j8333j6287
60454F41116j4342j2698j1601j0722r533q137p072o513o128n694n348n060m451
60441E33817l384k425k256k777l205l070k678k427k131j366k94L65J98m25q65
60426E07077q92p23o74r65j584k125k052j345o98o70q89n46M40J274J364J028
60410D98020Q89J006J029R19J017J402J660J420Q79M54K04j01l71j28P94J842
60394E10935K437K721L189L725L716L089K586K658K773K329J684J658K289K783
60380E48572K563J832J125Q42J141J799K218K080J856K123K509K057O69o28j041
60365E69717q96q07o81j95L83M76N2l51l11J45P40J086R26N58P31J763K982L509
$$ y = [985582, 933692, 887127, 846152, 810152, 777702, 747788, 720554, 696565, 675736, 657403, 641116, 626774, 614076, 602475, 591753, 582220, 574083, 567011, 560498, 554370, 548676, 543328, 538268, 533817, 530433, 528008, 525752, 522975, 519770, 516700, 514022, 511595, 509464, 508098, 507804, 508169, 508367, 507942, 507077, 506185, 505462, 504788, 503823, 502239, 500114, 498062, 496717, 496019, 495349, 494460, 493914, 494354, 495628, 496992, 498020, 498909, 499915, 500944, 501863, 502880, 504282, 505942, 507362, 508241, 508695, 508899, 508798, 508427, 508299, 509093, 510935, 513372, 516093, 519282, 523007, 526723, 529812, 532398, 535056, 537829, 540158, 541842, 543500, 545789, 548572, 551135, 552967, 554092, 554934, 556075, 557874, 560092, 562172, 564028, 566151, 568660, 570717, 571386, 570758, 569717, 568821, 568014, 567333, 567138, 567521, 567997, 568049, 567698, 567387, 567532, 568272, 569358, 570284, 570842, 571573, 573336, 576318, 579827]
60347E79827L342L228L586M077M199L899L571L700M543N820O815O934O111M561
60333F44213K512L15j533k960m437o166p468p671p150o774o556n807m461l309
60319E82748k733k197j345o18m06l25pJ91o0k42L35J524K784M255O330Q522R821
60302F08577J0293J1273J3597J6519J8777J9966K0265J9539J7510J4542J1408
60291G82266Q263M560O5m531q234j0658j2147j3238j4141j4616j4236j2967j1475
60278F78911j0620j0546j0597j0202r523q987q581q001p272o763o603o491o126
60265E68599n476m620l681k937k649k620k343j693j106r20q81o31l11k43l05j08
60249E38075L21N24K51j87l00J29R67J807K135J728R65N13O31J038J428J743J930
$$ y = [579827, 583169, 586397, 589983, 594060, 598259, 602158, 605729, 609429, 613972, 619792, 626607, 633541, 639652, 644213, 646725, 647040, 645507, 642547, 638110, 631944, 624476, 616805, 609655, 602881, 596325, 590518, 586057, 582748, 580015, 577818, 576473, 575855, 575449, 575124, 575117, 575308, 575248, 575006, 575341, 576865, 579649, 583904, 590234, 598756, 608577, 618870, 630143, 643740, 660259, 679036, 699002, 719267, 738806, 756316, 770858, 782266, 790529, 795089, 795154, 790623, 782389, 771731, 759584, 746346, 732205, 717589, 703353, 690386, 678911, 668291, 657745, 647148, 636946, 627423, 618436, 609855, 601854, 594582, 587819, 581216, 574725, 568599, 563123, 558503, 554822, 551885, 549236, 546616, 544273, 542580, 541474, 540554, 539673, 539042, 538731, 538488, 538183, 538075, 538396, 538920, 539171, 538984, 538684, 538813, 539780, 541587, 543722, 545450, 546415, 546928, 547559, 548597, 550025, 551768, 553698]
60232E53698J823J583J824K946M448N355N253M644M262M414N058O106P316Q085
60218F16815P929P172O794P257P894P814P114O673O815O877O256N291M709M633
60204G10043M637M504M369M242L834K900J485j07j378j879j726j712k496l802
60190G22914m866n406n640n505m662l320k341k213k469k416j940j328p62l66k46
60175F79434k30J06P19R35M42n7K46J085J510J215O98K45l46r26p88K28J068O42
60157F86226o63j321n11J023K016K118J876J760J711J653J816K327K801K805K521
60142G08158K579L266M211M906N191N162M959M776M863N289N837O286O612O789
60128G78884O576N689M101K041j74k168l610m377m600m447l982l291k663k476
$$ y = [553698, 555521, 557104, 558928, 561874, 566322, 571677, 576930, 581574, 585836, 590250, 595308, 601414, 608730, 616815, 624744, 631916, 638710, 645967, 653861, 661675, 668789, 675462, 682277, 689154, 695410, 700701, 705410, 710043, 714680, 719184, 723553, 727795, 731629, 734529, 736014, 735907, 734529, 732650, 730924, 729212, 726716, 722914, 718048, 712642, 707002, 701497, 696835, 693515, 691174, 688961, 686492, 684076, 682136, 680808, 680046, 679680, 679434, 679204, 679310, 680029, 680964, 681406, 681349, 681595, 682680, 684190, 685405, 686103, 686348, 686002, 685076, 684288, 684516, 685584, 686226, 685563, 684242, 683731, 684754, 686770, 688888, 690764, 692524, 694235, 695888, 697704, 700031, 702832, 705637, 708158, 710737, 714003, 718214, 723120, 728311, 733473, 738432, 743208, 748071, 753360, 759197, 765483, 772095, 778884, 785460, 791149, 795250, 797291, 797117, 794949, 791339, 786962, 782362, 777915, 773933, 770642, 767979, 765503]
60114G65503k985m106n294n734n029l721k818k696k851k751k474k222j758p70
60100G20294M67J334J650J831K271K908L398L485L232K974L025L341L632L899
60086G57741M467N333N850N450M396L401K691J951J039K14l97j068k070l329m642
60071G81027n974p381q760r864j0470j0592j0436j0125r459q203o588n202m339
60058F73634l776l394l446l878l925l006j602n68J12J091K351L047K769K151J931
60043F63491K113K354K543K540J945O75n84j033p62o17j218k442l781m849n568
60028F54807o100o640p093p064o337n327m741m804n026m886m550m663n424o136
60014E76016n901m596k929j594p15j52J29K11L35N53O21N01O48J268J799J644
$$ y = [765503, 762518, 758412, 753118, 747384, 742355, 738634, 735816, 733120, 730269, 727518, 725044, 722822, 721064, 720294, 720761, 722095, 723745, 725576, 727847, 730755, 734153, 737638, 740870, 743844, 746869, 750210, 753842, 757741, 762208, 767541, 773391, 778841, 783237, 786638, 789329, 791280, 792319, 792533, 792136, 791068, 788998, 785669, 781027, 775053, 767672, 758912, 749048, 738578, 727986, 717550, 707425, 697966, 689763, 683175, 677973, 673634, 669858, 666464, 663018, 659140, 655215, 652209, 650607, 650039, 650151, 651242, 653593, 656640, 659409, 661560, 663491, 665604, 667958, 670501, 673041, 674986, 675661, 675077, 674044, 673282, 672665, 671447, 669005, 665224, 660375, 654807, 648707, 642067, 634974, 627910, 621573, 616246, 611505, 606701, 601675, 596789, 592239, 587576, 582152, 576016, 570115, 565519, 562590, 560996, 560281, 560129, 560258, 560469, 560804, 561357, 561978, 562479, 563127, 564395, 566194, 567838]
59998E67838J217J461K487L486L947M207M617M973N129N383N831N881N038L723
59984F25218K748K197J398n7j724k869l276l402l751m255m333l664k671k031j837
59969E97691j655j326j120j112r33l40M38J183J993K866L407L314K814K281J835
59954F11336J513J515J792J820J168J02q07j422k008k676l271l658l762l462k837
59939E95343k420k765l731m466m223l083j855j298j388j453j073n98m54k96M90
59924E66730J623K186K073K188K875L269K883K750L994O068P466P719P419O832
59910F26075N776M682M349M461L661J557m61r25m8P85O27l90j461j706q45L90
59894F46527R47P93R67K034L251L791L984M639N666O309O406O525O906P121O909
$$ y = [567838, 569055, 570516, 573003, 576489, 580436, 584643, 589260, 594233, 599362, 604745, 610576, 616457, 621495, 625218, 627966, 630163, 631561, 631504, 629780, 626911, 623635, 620233, 616482, 612227, 607894, 604230, 601559, 599528, 597691, 596036, 594710, 593590, 592478, 591545, 591205, 591643, 592826, 594819, 597685, 601092, 604406, 607220, 609501, 611336, 612849, 614364, 616156, 617976, 619144, 619246, 618439, 617017, 615009, 612333, 609062, 605404, 601642, 598180, 595343, 592923, 590158, 586427, 581961, 577738, 574655, 572800, 571502, 570114, 568661, 567588, 566990, 566536, 566240, 566730, 568353, 570539, 572612, 574800, 577675, 580944, 583827, 586577, 590571, 596639, 604105, 611824, 619243, 626075, 631851, 636533, 640882, 645343, 649004, 650561, 650100, 649175, 649127, 649912, 650539, 650149, 648688, 646982, 646137, 646527, 647474, 648267, 649234, 651268, 654519, 658310, 662294, 666933, 672599, 678908, 685314, 691839, 698745, 705866, 712775]
59879G12775O590O374N868M704L279K345K020J622N11j196k855m022m734n207
59865G28074n516n655n671n620n523n436n445n467n218m580l823l279k962k713
59851F61166k508k360k117j575o85N67K233M042N413O222P195Q806J0174R990
59837G06563Q425P047O685O505N572M306L623L482L128K280J174k12k125m401
59823G52052o596q679j0904j3052j4461j4841j4488j3675j2349j0542q633p052
59811F16780o019n571n521n413m870l939k869j712n83l4n10j526k089j998k001
59796E72125k509k932k640j852j149o48k63k07o32j088j039o27l26p8M85J108
59780E57728J046K35m74m57o8J95N36J350K278K537K019J471J500J977K463K821
$$ y = [712775, 719365, 725739, 731607, 736311, 739590, 741935, 743955, 745577, 746088, 744892, 742037, 738015, 733281, 728074, 722558, 716903, 711232, 705612, 700089, 694653, 689208, 683741, 678523, 673943, 670120, 666841, 663879, 661166, 658658, 656298, 654181, 652606, 651921, 652488, 654721, 658763, 664176, 670398, 677593, 686399, 696573, 706563, 714988, 722035, 728720, 735225, 740797, 745103, 748726, 752208, 755336, 757616, 758790, 758578, 756453, 752052, 745456, 736777, 725873, 712821, 698360, 683519, 669031, 655356, 643007, 632465, 623832, 616780, 610761, 605190, 599669, 594256, 589386, 585447, 582578, 580866, 580283, 580249, 579739, 578213, 576124, 574126, 572125, 569616, 566684, 564044, 562192, 561043, 560395, 560132, 559925, 559293, 558205, 557166, 556539, 556213, 556135, 556620, 557728, 558774, 559009, 558535, 558078, 558010, 558205, 558741, 560091, 562369, 564906, 566925, 568396, 569896, 571873, 574336, 577157]
59764E77157L121L352L540L948M878O209P358P716P094N890M908M854N683O484
59750F52192O259M965L551K921L012L079K642J857J111O39N77R28J342J301P98
59735F87174M75P30J080R31O30J053K185K939K655J985J855K241K532K608K727
59720G13800K755K390K019K469L735M798M919M461M146M122M170M310M699N287
59706G68080N977O786P560P850P493O929O619O415O012N592N473N414M975M379
59692H55554M326M832M914L647J199j355k950l253k760k361k533l042l546m263
59678H48409n563p085p848p369o175n131m736n119o103o981o828n490l920l146
59664G66915l102k889j875k20J513K783L264L071K806L073L788M253L957L086
$$ y = [577157, 580278, 583630, 587170, 591118, 595996, 602205, 609563, 617279, 624373, 630263, 635171, 640025, 645708, 652192, 658451, 663416, 666967, 669888, 672900, 675979, 678621, 680478, 681589, 682228, 682805, 683733, 685075, 686376, 687174, 687649, 688379, 689459, 690390, 691020, 692073, 694258, 697197, 699852, 701837, 703692, 705933, 708465, 711073, 713800, 716555, 718945, 720964, 723433, 727168, 731966, 736885, 741346, 745492, 749614, 753784, 758094, 762793, 768080, 774057, 780843, 788403, 796253, 803746, 810675, 817294, 823709, 829721, 835313, 840786, 846200, 851175, 855554, 859880, 864712, 869626, 873273, 874472, 873117, 870167, 866914, 864154, 861793, 859260, 856218, 852672, 848409, 842846, 835761, 827913, 820544, 814369, 809238, 804502, 799383, 793280, 786299, 779471, 773981, 770061, 766915, 763813, 760924, 759049, 758829, 760342, 763125, 766389, 769460, 772266, 775339, 779127, 783380, 787337, 790423]
59650G90423K081R36o94k774m564n406n611o174p482q748r031q437p844p633p305
59635G11737o365n000l732k862k491k658l199l681l765l488l143l099l649m682
59621F59923n453n226m188l206k619j968j179j100k186l415l457k448j631j467
59607F20380j263o83l86p96j188p25K57P43M47qq9R5L04O04J120J707K118K357
59589F24994K616K934L049K692J919J026R6j125k712m148m785m715m692n074n283
59574F06792m667l581l093l685m654m900m015k552j384r55r94r13m86n9M5P8M68
59557E71445J046J214R15Q83J560K352K402J780J307J499K259L470N168P056Q512
59542F12868R358J0078J1179J2794J5121J8407K2056K4389K4105K1680J8662J5879
$$ y = [790423, 792504, 793440, 792746, 789972, 785408, 780002, 774391, 768217, 760735, 751987, 742956, 734519, 726675, 719042, 711737, 705372, 700372, 696640, 693778, 691287, 688629, 685430, 681749, 677984, 674496, 671353, 668254, 664605, 659923, 654470, 649244, 645056, 641850, 639231, 637263, 636084, 634984, 632798, 629383, 625926, 623478, 621847, 620380, 619117, 618434, 618048, 617252, 616064, 615339, 615596, 616339, 616786, 616778, 616689, 616784, 617088, 617692, 618812, 620519, 622637, 624994, 627610, 630544, 633593, 636285, 638204, 639230, 639326, 638201, 635489, 631341, 626556, 621841, 617149, 612075, 606792, 602125, 598544, 595451, 591766, 587112, 582212, 578197, 575645, 574261, 573306, 572312, 571399, 570913, 570854, 570899, 570977, 571445, 572491, 573705, 574620, 575503, 577063, 579415, 581817, 583597, 584904, 586403, 588662, 592132, 597300, 604356, 612868, 622226, 632304, 643483, 656277, 671398, 689805, 711861, 736250, 760355, 782035, 800697, 816576]
59530H16576J3044R951P155N330M551M443M574M541M064L194K102O55j371l725
59516H75084n877p847j0215j3032j5382j6417j6310j5757j4994j3867j2458j1052
59504G21876r638q063o554n585n130m574l452j899l07J126K310L034L136K859
59490F89139K810L419M382M855M433L878M378O059P689Q271Q384R327J1260J3068
59476G81352J4116J5172J7096J9242J9896J8160J4763J1038P664M538J494j250
59464I23281l225l973l238j124J897N261Q641J1942J5011J7546J9323K0375K0852
59451A032569K0834K0328J9344J7920J6159J4333J2642J0771P892L449k121p635
59439A166485j2141j5499j8051j9982k1045k0874j9532j7738j6355j5640j5185
$$ y = [816576, 829620, 839571, 846726, 852056, 856607, 861050, 865624, 870165, 874229, 877423, 879525, 880180, 878809, 875084, 869207, 861360, 851145, 838113, 822731, 806314, 790004, 774247, 759253, 745386, 732928, 721876, 712238, 704175, 697621, 692036, 686906, 682332, 678880, 676981, 676674, 677800, 680110, 683144, 686280, 689139, 691949, 695368, 699750, 704605, 709038, 712916, 717294, 723353, 731042, 739313, 747697, 757024, 768284, 781352, 795468, 810640, 827736, 846978, 866874, 885034, 899797, 910835, 918499, 923037, 924531, 923281, 920056, 916083, 912845, 911721, 913618, 918879, 927520, 939462, 954473, 972019, 991342, 1011717, 1032569, 1053403, 1073731, 1093075, 1110995, 1127154, 1141487, 1154129, 1164900, 1172792, 1176241, 1174120, 1166485, 1154344, 1138845, 1120794, 1100812, 1079767, 1058893, 1039361, 1021623, 1005268, 989628, 974443]
59428I74443j4582j3808j2852j1429r317o631l427M65M792Q573J1022J2471J3739
59415I53459J5034J6187J7391J8662J8835J6408J1439N472n78p114j4174k0343
59403A030678k4035k4773k2624j7641j0774m365m77O70j91k950p665j3327j8423
59390H84103k2383k5208k6200k4585k1233j8182j6225j4295j1514q526o274m655
59378F84823l148j885j222q98m12K55Q71J532K346K978L118L189L951N477P070
59363G08045Q135Q735R275J0030J1075J2403J3937J5604J7489J9845K2804K6004
59351H83381K8593K9863K9939K9696K9838L0200L0094K8990K6671K3140J8820
59340A189225J4570J0834O923J814m276r808j3667j6340j9033k2147k5071k7104
$$ y = [974443, 959861, 946053, 933201, 921772, 912455, 905824, 902397, 902862, 907654, 916227, 927249, 939720, 953459, 968493, 984680, 1002071, 1020733, 1039568, 1055976, 1067415, 1072887, 1072309, 1065195, 1051021, 1030678, 1006643, 981870, 959246, 941605, 930831, 926466, 925989, 926659, 926468, 923518, 915853, 902526, 884103, 861720, 836512, 810312, 785727, 764494, 746312, 730087, 715792, 704278, 695752, 689478, 684823, 681675, 679790, 678568, 677670, 677258, 677513, 678384, 679916, 682262, 685240, 688358, 691547, 695498, 700975, 708045, 716180, 724915, 734190, 744220, 755295, 767698, 781635, 797239, 814728, 834573, 857377, 883381, 911974, 941837, 971776, 1001472, 1031310, 1061510, 1091604, 1120594, 1147265, 1170405, 1189225, 1203795, 1214629, 1221552, 1223366, 1219090, 1209282, 1195615, 1179275, 1160242, 1138095, 1113024, 1085920]
59328A085920k7989k7709k6392k4525k2850k1768k0951j9754j7988j6166j4855
59317H44973j3960j2861j1240r473q118p317o848o462n962n174m159l164k160
59304G48075q24P13J602J391R88J813M114O854R168J1105J2958J4729J6529J8725
59290H47940K1168K2829K2684K0724J7709J4244J0401O134J797j736l549l454
59278I76891k201o44J176L660O595R092J0679J1663J2305J2196J0946Q924O886
59265A068168N151L463J403j314m657q095j0962j3143j5153j7264j8980j9726
59253I68891j9638j9224j8545j7246j5289j3171j1341r687p739n258k501L0K009
59240H31291L451M516N290N791N973N655M623K996J189o30k704n113p437r360
$$ y = [1085920, 1057931, 1030222, 1003830, 979305, 956455, 934687, 913736, 893982, 875994, 859828, 844973, 831013, 818152, 806912, 797439, 789321, 782004, 775156, 768694, 762732, 757558, 753399, 750235, 748075, 747251, 747964, 749566, 750957, 751945, 753758, 757872, 764726, 773894, 784999, 797957, 812686, 829215, 847940, 869108, 891937, 914621, 935345, 953054, 967298, 977699, 983833, 985630, 983894, 980345, 976891, 974690, 974046, 975222, 978882, 985477, 994569, 1005248, 1016911, 1029216, 1041412, 1052358, 1061282, 1068168, 1073319, 1076782, 1078185, 1076871, 1072214, 1064119, 1053157, 1040014, 1024861, 1007597, 988617, 968891, 949253, 930029, 911484, 894238, 878949, 865778, 854437, 844750, 837011, 831753, 829252, 829282, 831291, 834742, 839258, 844548, 850339, 856312, 861967, 866590, 869586, 870775, 870145, 867441, 862328, 854891, 845531]
59226H45531j1164j3135j4906j5977j6409j6379j5527j3654j1562j0140r035p353
59214F90290n434m443m377l970k758j632r37J87J905K834K198J392K030L594M475
59199F85354M441M546N215N904O319O651O858O819O987P800Q760R096R050R354
59185G83154R776R450Q417P594P255O823O221O072O444O648O572O997Q112Q900
59171H88435Q621P891P643P827P908P887Q045Q065P275N542L393J298p37k951
59157I66142n482q164j0579j2386j3571j4205j4141j3421j2717j2752j3236j3061
59145H22427j1702r786q148o983o222n930n850n173l468j556p60j370k228j941
59131G51310j87K078L565L844L707M281N825P625Q971R883J0781J1833J2890J3747
$$ y = [845531, 834367, 821232, 806326, 790349, 773940, 757561, 742034, 728380, 716818, 706678, 697643, 690290, 684856, 680413, 676036, 672066, 669308, 667676, 666739, 666926, 668831, 671665, 673863, 675255, 677285, 680879, 685354, 689795, 694341, 699556, 705460, 711779, 718430, 725288, 732107, 739094, 746894, 755654, 764750, 773800, 783154, 792930, 802380, 810797, 818391, 825646, 832469, 838690, 844762, 851206, 857854, 864426, 871423, 879535, 888435, 897056, 904947, 912590, 920417, 928325, 936212, 944257, 952322, 959597, 965139, 968532, 969830, 969093, 966142, 960660, 952496, 941917, 929531, 915960, 901755, 887614, 874193, 861476, 848724, 835488, 822427, 810725, 800939, 792791, 785808, 779586, 773656, 767806, 762633, 759165, 757609, 756849, 755479, 753251, 751310, 751123, 753201, 756766, 760610, 764317, 768598, 774423, 782048, 791019, 800902, 811683, 823516, 836406, 850153]
59117H50153J4362J4933J5853J7273J8693J9255J8602J7193J5747J4613J3671
59106A030348J2465J0496P761N022K987J303j013m058o751q284r118j0065j1049
59093A020044j1424j1000j0111r011p848o947o522o258n823n597o288p869r522
59080I15824j0620j1204j1465j1400j1127j1002j1109j1037j0489r777r412r423
59068G87759r385q974q244p440o816o540o590o729o733o613o480o234n623m643
59054F90715l682l203l347l827m113l705k551j272p30j108j587j234j21P96R25
59039F61956P48J146K323L619M245M019L495L528M574O290P902R001R829J0785
59025G33460J1944J3156J4243J4898J4695J3613J2279J1327J0611R410P324M727
$$ y = [850153, 864515, 879448, 895301, 912574, 931267, 950522, 969124, 986317, 1002064, 1016677, 1030348, 1042813, 1053309, 1061070, 1066092, 1069079, 1070382, 1069369, 1065311, 1058560, 1050276, 1041158, 1031093, 1020044, 1008620, 997620, 987509, 978498, 970650, 963703, 957181, 950923, 945100, 939503, 933215, 925346, 915824, 905204, 894000, 882535, 871135, 860008, 849006, 837897, 826860, 816371, 806594, 797182, 787759, 778374, 769400, 761156, 753716, 746900, 740360, 733770, 727041, 720308, 713695, 707215, 700981, 695358, 690715, 687033, 683830, 680483, 676656, 672543, 668838, 666287, 665015, 664285, 663177, 661590, 660356, 660235, 661031, 661956, 662704, 663850, 666173, 669792, 674037, 678056, 681551, 685079, 689653, 695943, 703845, 712846, 722675, 733460, 745404, 758560, 772803, 787701, 802396, 816009, 828288, 839615, 850226, 859636, 866960, 871687]
59013H71687K351P29p7m18o67q43o40K9R07J938L437N366O880P242O869O755P013
58996I18558O793N637M057K576J042o89k162l006l771n261p293q779r051q519
58982H90132p946p493o788n520l742j715K33J851L212M792O974R500J1692J3302
58968I08484J4705J6074J6909J6846J6528J6857J7552J7291J5396J2538R565O427
58956A085172K745j329n407r418j3212j6216j8091j9331k0480k1147k0599j8973
58944I23714j7041j5066j2715j0009p473n341l414j695m81J73L67j91j861m165
58930H44802n999o908p387p889q261q353q385q417q170p514o693n840m882l930
58916G46174l135k172o78Q61J641J982L126N250O950P250P076P932J0066J2682
$$ y = [871687, 874038, 874767, 874690, 874272, 873605, 872762, 872122, 872151, 873058, 874996, 878433, 883799, 890679, 897921, 904790, 911545, 918558, 925351, 930988, 935045, 937621, 938663, 937974, 935812, 932806, 929035, 923774, 916481, 907702, 898651, 890132, 882186, 874693, 867905, 862385, 858643, 856928, 857161, 859012, 862224, 867016, 873990, 883490, 895182, 908484, 923189, 939263, 956172, 973018, 989546, 1006403, 1023955, 1041246, 1056642, 1069180, 1078745, 1085172, 1087917, 1086588, 1081181, 1071763, 1058551, 1042335, 1024244, 1004913, 984433, 963286, 942687, 923714, 906673, 891607, 878892, 868883, 861410, 856069, 852655, 850960, 850479, 850652, 851019, 850828, 848967, 844802, 838803, 831895, 824508, 816619, 808358, 800005, 791620, 783203, 775033, 767519, 760826, 754986, 750104, 746174, 743039, 740867, 740189, 741050, 742691, 744673, 747799, 753049, 759999, 767249, 774325, 782257, 792323, 805005]
58902H05005J5217J7441J9046K0050K1072K2388K3240K2922K2082K1991K2925
58891A033379K4165K5165K5798K5768K4902K3769K2989K1932J9234J4720R772
58880A271593N532J688k541p164j1711j6030k0049k3148k4573k4399k3571k2864
58868A102763k2201k1046j9222j7142j5373j4147j3335j2776j2448j2300j2157
58857I30616j1855j1375j0762j0106r666r695j0013j0054r579r098r233r887j0370
58844G98923j0292r909r593r348q957q378p783p296o797n992m709l139j729p94
58830G04207k88R9O59J448K217K538K225J668J553K172L137L783L762L247K717
58815G35144K465K249J563M77k16l1L37j38j296j948j528p73n25p79j264k154
$$ y = [805005, 820222, 837663, 856709, 876759, 897831, 920219, 943459, 966381, 988463, 1010454, 1033379, 1057544, 1082709, 1108507, 1134275, 1159177, 1182946, 1205935, 1227867, 1247101, 1261821, 1271593, 1277125, 1278813, 1276272, 1269108, 1257397, 1241367, 1221318, 1198170, 1173597, 1149198, 1125627, 1102763, 1080562, 1059516, 1040294, 1023152, 1007779, 993632, 980297, 967521, 955073, 942773, 930616, 918761, 907386, 896624, 886518, 876852, 867157, 857144, 847090, 837511, 828413, 819180, 809293, 798923, 788631, 778722, 769129, 759781, 750824, 742446, 734663, 727367, 720570, 714578, 709869, 706730, 705001, 704207, 703919, 704018, 704677, 706125, 708342, 710880, 713105, 714773, 716326, 718498, 721635, 725418, 729180, 732427, 735144, 737609, 739858, 741421, 741898, 741682, 741651, 741988, 741850, 740554, 738606, 737078, 736305, 735780, 735001, 733737, 731583]
58799G31583l495m580m639l873l159k930k856k430j433M6J653K958L866M671N518
58784G20900O210O746P564Q811R852R989R342Q473P424N802L646J548q9j438k827
58769H01953m354n989p720r455j0921j1684j1332r854p842o053m696l511k551
58756G05991k296k722k969k370j293l76M97J775L243M303N073O336Q384J0561
58742G34137J2077J2761J2910J2852J2819J2883J2962J2956J2891J2742J2248
58731H74238J1196R721Q092O449M883L530K287P24j267l042l856l760l417l216
58717I02562l017k706k505k590k760k585j920j296j665l446n916q000r545j1169
58703H43442j2899j3951j4119j4297j5007j5462j4966j4270j4375j4648j3575
$$ y = [731583, 728088, 723508, 718869, 714996, 711837, 708907, 706051, 703621, 702188, 702234, 703887, 706845, 710711, 715382, 720900, 727110, 733856, 741420, 750231, 760083, 770072, 779414, 787887, 795311, 801113, 804759, 806307, 806218, 804780, 801953, 797599, 791610, 783890, 774435, 763514, 751830, 740498, 730644, 722802, 716749, 712053, 708542, 705991, 703695, 700973, 698004, 695634, 694341, 693965, 694462, 696237, 699480, 703783, 708856, 715192, 723576, 734137, 746214, 758975, 771885, 784737, 797556, 810439, 823401, 836357, 849248, 861990, 874238, 885434, 895155, 903247, 909696, 914579, 918109, 920396, 921120, 919853, 916811, 912955, 909195, 905778, 902562, 899545, 896839, 894334, 891744, 888984, 886399, 884479, 883183, 881518, 878072, 872156, 864156, 854611, 843442, 830543, 816592, 802473, 788176, 773169, 757707, 742741, 728471, 714096, 699448, 685873]
58692F85873j1023q468o998o283n669n195n201n669o303o725o521n620m566l916
58678E97716l449k623j547p92l19N05J878L400M996P098R682J1950J3306J4015
58664F55816J4582J4957J4638J3161J0393O645K611j164m624p736r996j1022j1260
58651F87001j1363j1127r986q287p061o465n596m068k642j938j523p73J60Q02
58637F17134J058R61L85m69r19o22q9J19J13K08K36r4m91l25O88K334M219N936
58619F30382P236Q271R357J0360J0815J0796J1007J1660J1863J0726Q602O627
58607G47702N354M433L408K229J049m1r93j832k632l254l211k188o17N83R83J157
58591G52130K102M238P076R834J2118J3909J5121J5650J5794J6095J6435J5874
$$ y = [685873, 674850, 666382, 659384, 653101, 647432, 642237, 637036, 631367, 625064, 618339, 611818, 606198, 601632, 597716, 594267, 591644, 590097, 589305, 588986, 589491, 591369, 594769, 599765, 606863, 616545, 628495, 641801, 655816, 670398, 685355, 699993, 713154, 723547, 730192, 732803, 731639, 727015, 719279, 709283, 698261, 687001, 675638, 664511, 654525, 646238, 639177, 632712, 627116, 623048, 620406, 618468, 616945, 616172, 616332, 617134, 618192, 619153, 619538, 619069, 618150, 617528, 617439, 617558, 617671, 617879, 618115, 618021, 617530, 617205, 617893, 620227, 624446, 630382, 637618, 645889, 655246, 665606, 676421, 687217, 698224, 709884, 721747, 732473, 741075, 747702, 753056, 757489, 760897, 763126, 764175, 764134, 763141, 761309, 758677, 755423, 752212, 750024, 749407, 749990, 750973, 752130, 754232, 758470, 765546, 775380, 787498, 801407, 816528, 832178, 847972, 864067, 880502, 896376]
58579H96376J3814J0949Q507O810N316L753K556K163K633M004O405R584J2863
58566I85733J5783J8455K1056K3331K4782K5083K4264K2568K0165J6945J2831
58555A210996Q415M776K351M24j790m084n868p272q819j0441j1779j3115j4971
58542A148823j7012j8430j9315k0533k2174k3274k3248k2530k1533k0028j7972
58531I22774j5955j4355j2787j0852q694o529m337k370j218q98o06K35J275K017
58517H47700K575L220L751L835L592L469L747M350M830M641L813L140L148L151
58503H98962K220P48j60o29j967m417o455o849o113n226m212k847j717j423j444
58488H58471p45R91L436O272R100J1250J2552J3732J5344J6820J7218J6371J4597
$$ y = [896376, 910190, 921139, 929646, 936456, 941772, 945525, 948081, 950244, 952877, 956881, 963286, 972870, 985733, 1001516, 1019971, 1041027, 1064358, 1089140, 1114223, 1138487, 1161055, 1181220, 1198165, 1210996, 1219411, 1224187, 1226538, 1226962, 1225172, 1221088, 1215220, 1207948, 1199129, 1188688, 1176909, 1163794, 1148823, 1131811, 1113381, 1094066, 1073533, 1051359, 1028085, 1004837, 982307, 960774, 940746, 922774, 906819, 892464, 879677, 868825, 860131, 853602, 849265, 846895, 845677, 844779, 844173, 844408, 845683, 847700, 850275, 853495, 857246, 861081, 864673, 868142, 871889, 876239, 881069, 885710, 889523, 892663, 895811, 898962, 901182, 901930, 901770, 901141, 899174, 894757, 888302, 881453, 875340, 870114, 865902, 863055, 861338, 859915, 858471, 857726, 858717, 862153, 868425, 877525, 888775, 901327, 915059, 930403, 947223, 964441, 980812, 995409]
58475I95409J1848Q076L993N94k022m628p731j0950j3436j4525j4090j2549j0507
58462I29482q304o005l668j238J599M812P502Q780R032R339R675Q889O581L705
58448I80181R20k175n570q040q761q598q686q698p722n947m256k774j075O14J676
58433I11089K381L691N802P861R247J0305J1547J2747J3194J2583J1422J0372
58421A022241R310P378M246R09j415k765m026n297n894n837o016o685p156p201
58407I91792p438p828p296n505l670k801k394j712j016n11N38K372L572K828R49
58392I61880k31l38m21j038j740k181k491k639k453k151k022j698n12J578L859
58377I47402N492O012N629N260N684O535O871O836P660R693J1729J2795J3288
$$ y = [995409, 1007257, 1015333, 1019326, 1019920, 1017898, 1013270, 1005539, 994589, 981153, 966628, 952538, 939989, 929482, 921178, 915173, 911505, 910267, 911866, 916678, 924180, 932960, 941992, 951331, 961006, 969895, 976476, 980181, 981101, 978926, 973356, 965316, 956555, 947957, 939271, 930573, 922851, 916904, 912648, 909874, 908799, 909413, 911089, 913470, 917161, 922963, 930824, 940071, 950376, 961923, 974670, 987864, 1000447, 1011869, 1022241, 1031551, 1038929, 1043175, 1044084, 1042669, 1039904, 1035878, 1030581, 1024687, 1018850, 1012834, 1006149, 998993, 991792, 984354, 976526, 969230, 963725, 960055, 957254, 954860, 953148, 952132, 951621, 952159, 954531, 958103, 960931, 961880, 961649, 961311, 960890, 959852, 958112, 955931, 953440, 950801, 948348, 946197, 944175, 942477, 941965, 943543, 947402, 952894, 958906, 964535, 969795, 975479, 982014, 988885, 995721, 1003381, 1013074, 1024803, 1037598, 1050886]
58364A050886J3765J3916J3557J3323J3381J2746J0835Q557O852N336L470J817
58352A168441R72M22k81l60Q06K281K926L224M335O241Q164J0052J2205J4270
58338A233698J5773J6983J8117J8524J7773J6608J5767J4767J3004J0944R139
58327A401097P169M747K675J563Q58L46J072L350N474N995N849O483P495Q031
58313A462204Q926J1196J3675J4519J4110J4225J5228J6211J7054J8160J8927
58302A624435J8529J7617J7341J7410J6909J6125J5881J5973J6016J6617J7987
58291A810840J8755J8142J7826J9523K2187K3854K4696K5741K6262K5230K3982
58280B057038K4519K6281K7432K8237L0260L3410L6633M0346M5250M9912N2645
$$ y = [1050886, 1064651, 1078567, 1092124, 1105447, 1118828, 1131574, 1142409, 1150966, 1157818, 1163154, 1166624, 1168441, 1169413, 1169835, 1169554, 1169194, 1170000, 1172281, 1175207, 1178431, 1182766, 1189007, 1197171, 1207223, 1219428, 1233698, 1249471, 1266454, 1284571, 1303095, 1320868, 1337476, 1353243, 1368010, 1381014, 1391958, 1401097, 1408266, 1413013, 1415688, 1417251, 1418109, 1418455, 1419527, 1422877, 1428351, 1434346, 1440195, 1446678, 1454173, 1462204, 1471130, 1482326, 1496001, 1510520, 1524630, 1538855, 1554083, 1570294, 1587348, 1605508, 1624435, 1642964, 1660581, 1677922, 1695332, 1712241, 1728366, 1744247, 1760220, 1776236, 1792853, 1810840, 1829595, 1847737, 1865563, 1885086, 1907273, 1931127, 1955823, 1981564, 2007826, 2033056, 2057038, 2081557, 2107838, 2135270, 2163507, 2193767, 2227177, 2263810, 2304156, 2349406, 2399318, 2451963]
58269B451963N4545N7573O0824O2068O1822O2382O3825O4467O4319O4634O4907
58258C133329O3854O2477O2721O4089O4972O6090O8994P2585P5027P7678Q2981
58247C894797Q9816R5322R9900J05909J12769J18288J23512J31162J40352J48115
58237E059942J55079J64236J75177J85165J94962K07660K22613K36580K50169
58228F851583K66924K86735L06504L26600L50209L76999M04199M33051M67317
58219A0070121N06362N47068N91297O43677P03447P67083Q37413R20928J017763
58210A6605159J124558J245646J390543J562143J759756J992559K277286K624584
58202C0582234L042709L553586M189123M972498N920275P061255Q433423J0065051
$$ y = [2451963, 2506508, 2564081, 2624905, 2686973, 2748795, 2811177, 2875002, 2939469, 3003788, 3068422, 3133329, 3197183, 3259660, 3322381, 3386470, 3451442, 3517532, 3586526, 3659111, 3734138, 3811816, 3894797, 3984613, 4079935, 4179835, 4285744, 4398513, 4516801, 4640313, 4771475, 4911827, 5059942, 5215021, 5379257, 5554434, 5739599, 5934561, 6142221, 6364834, 6601414, 6851583, 7118507, 7405242, 7711746, 8038346, 8388555, 8765554, 9169753, 9602804, 10070121, 10576483, 11123551, 11714848, 12358525, 13061972, 13829055, 14666468, 15587396, 16605159, 17729717, 18975363, 20365906, 21928049, 23687805, 25680364, 27957650, 30582234, 33624943, 37178529, 41367652, 46340150, 52260425, 59321680, 67755103, 77820154]
58194G7820154J1983127J4239254J6899303K0002773K3536645K7379974L1144684
58187B23005914L4035682L5010004L3262548K8637121K1583177J2800237L027449
58180C91362132o880693j5899393k3043444k7684096k9693868k9387721k7394347
58173B31378570k4496009k1410958j8605832j6272888j4445888j3094908j2131427
58166A10920660j1403546j0745371j0038260r230271q325966p372617o436550
58159D7368079n569607m793810m113808l529812l034760k613179k252047j946396
58151A9514660j691120j475927j292345j137973j010071r01964q08887p30720
58143A0465653o66075o09839n58883n14223m75392m38554m02169l68755l39159
$$ y = [77820154, 89803281, 104042535, 120941838, 140944611, 164481256, 191861230, 223005914, 257041596, 292051600, 325314148, 353951269, 375534446, 388334683, 391362132, 384481439, 368582046, 345538602, 317854506, 288160638, 258772917, 231378570, 206882561, 185471603, 166865771, 150592883, 136146995, 123052087, 110920660, 99517114, 88771743, 78733483, 69503212, 61177246, 53804629, 47368079, 41798472, 37004662, 32890854, 29361042, 26326282, 23713103, 21461056, 19514660, 17823540, 16347613, 15055268, 13917295, 12907224, 12005260, 11196373, 10465653, 9799578, 9189739, 8630856, 8116633, 7641241, 7202687, 6800518, 6431763, 6092604]
58134F092604l10580k82064k56589k35869k18141k02564j90727j82302j74248
58125D039520j65851j59624j55708j50416j41992j33048j25552j17978j09310
58116B780041j01420r5454q9781q3321p7338p2451o7579o2982o0532n9763n7593
58105A951827n3245m9452m7488m5177m1374l8198l6884l5394l2314k9506k8608
58094A514187k8305k7274k6711k7618k8525k8091k7373k7400k7074k5517k4060
58083A216239k3901k4003k3224k2434k2768k3724k4491k5199k5595k4662k2761
58072I53477k1837k2245k1838j9575j7379j6765j6325j4539j2630j2275j2449
58061G65620j1108q453o398n836o301p241q069p973p032o573p307q240q360p981
$$ y = [6092604, 5782024, 5499960, 5243371, 5007502, 4789361, 4586797, 4396070, 4213768, 4039520, 3873669, 3714045, 3558337, 3407921, 3265929, 3132881, 3007329, 2889351, 2780041, 2678621, 2583167, 2493386, 2410065, 2332727, 2260276, 2192697, 2129715, 2069183, 2009420, 1951827, 1898582, 1849130, 1801642, 1756465, 1715091, 1676893, 1640009, 1604615, 1572301, 1542795, 1514187, 1485882, 1458608, 1431897, 1404279, 1375754, 1347663, 1320290, 1292890, 1265816, 1240299, 1216239, 1192338, 1168335, 1145111, 1122677, 1099909, 1076185, 1051694, 1026495, 1000900, 976238, 953477, 931640, 909395, 887557, 867982, 850603, 833838, 817513, 802974, 790344, 778069, 765620, 754512, 746059, 739661, 733825, 727524, 720283, 712214, 704241, 697209, 690636, 683329, 675089, 666729, 658748]
58047F58748p561o694n350m636n131n895o122o306o805o844o073n541n982o565
58033E73243o442o120o187o224o102o782q569j0035r913q782p747o792n652m933
58019D72963n044n199m671l924l470k795j529m61l03n08l10J60N61J021J409J266
58003D49166J109K213M353N522M778L679L691M099L842L564M203N032M884M057
57989E04192L375K573J240J97K56O82M28j09j30j68j126k431k874k580k528k777
57973D98220k699k464k774l533m047m184m287m334m174m054m055l678k801k210
57959D48926k363k594k383k304k731k871k240j838k451l071k517j462j133j087
57945D17881r9J584K782L516M719O341P601Q679J0382J2362J3436J3555J3772
$$ y = [658748, 651187, 644493, 639143, 634507, 629376, 623481, 617359, 611053, 604248, 597404, 591331, 585790, 579808, 573243, 566801, 560681, 554494, 548270, 542168, 535386, 526817, 516782, 506869, 498087, 490340, 483548, 477896, 472963, 467919, 462720, 458049, 454125, 450655, 447860, 446331, 445870, 445567, 445059, 444749, 444909, 445470, 446491, 447900, 449166, 450275, 452488, 456841, 462363, 467141, 470820, 474511, 478610, 482452, 486016, 490219, 495251, 500135, 504192, 507567, 510140, 511380, 511577, 511833, 512515, 512943, 512834, 512704, 512536, 511410, 508979, 506105, 503525, 500997, 498220, 495521, 493057, 490283, 486750, 482703, 478519, 474232, 469898, 465724, 461670, 457615, 453937, 451136, 448926, 446563, 443969, 441586, 439282, 436551, 433680, 431440, 429602, 427151, 424080, 421563, 420101, 418968, 417881, 417782, 419366, 422148, 425664, 430383, 436724, 444325, 453004, 463386, 475748, 489184, 502739, 516511]
57932E16511J4342J4366J3342J1658R524O708L384J20k872n521p328q151r069
57919E57014j1145j3621j4877j4776j4574j4674j4161j2614j0797r294p899o670
57907D11912o191o424o450n853n307n394n770n977o201o747p300p175n951l793
57893C27379j422K22P75P44P81R99J414K338L643M344L929L398L857M564L842
57878C60807J605n11j507k034k801l349l003k032j232r60j024j043o92Q0R28J562
57862C44794K121K824L568M386N698P504Q836Q996Q721R082R723R408Q052O712
57848D40425N733M387K513J086O67M72m49k038l715n238o556p453p788p671p159
57833D07216o253n232m423l653k554j399q65r33q06p7P96J299J474J520J468J468
$$ y = [516511, 530853, 545219, 558561, 570219, 579743, 586451, 589835, 589955, 587083, 581562, 574234, 566083, 557014, 545869, 532248, 517371, 502595, 488021, 473347, 459186, 446572, 435775, 426481, 418582, 411912, 405721, 399297, 392847, 386994, 381687, 376293, 370523, 364546, 358345, 351598, 344298, 337123, 331172, 327379, 325957, 326179, 326954, 327698, 328479, 329478, 330892, 333230, 336873, 341217, 345146, 348544, 352401, 356965, 360807, 362412, 361901, 360394, 358360, 355559, 352210, 349207, 347175, 345943, 344983, 343959, 342916, 342224, 342304, 343232, 344794, 346915, 349739, 353307, 357693, 363391, 370895, 379731, 388727, 397448, 406530, 416253, 425661, 433713, 440425, 446158, 450545, 453058, 454144, 454811, 455283, 454834, 452796, 449081, 443843, 437287, 429834, 422046, 414375, 407216, 400963, 395731, 391308, 387655, 385101, 383702, 382837, 381904, 381098, 381021, 381817, 383116, 384590, 386110, 387578, 389046]
57817C89046J760K204K345K003J372O06j73n68l58q3m73j332j868k028k605l951
57801C85897n482o595p251p527p444p366p768q359q230p059n481m197l443l340
57787B96355l817m009k858o31J143J658J813K689L993M786M972N193N665N873
57773C22825N330M132K867K144K008J761P16q94k272l251m388n789o782p057p288
57758C04062q033q759q675p927p229o719n903m601l264k324j684r39J20J222J785
57743B41132J479P51M24P36J019O05k95q82p77l95l36o32p69m07J69M74N42P92
57725B43630J210J278Q54N09O52R36J048J332K019K482K129J470J318J406Q93
57710B63166j42r18j357k014k787k961k582k372k284j559m51k88j324k026j322
$$ y = [389046, 390806, 393010, 395355, 397358, 398730, 399336, 399163, 398595, 398237, 398154, 397681, 396349, 394481, 392453, 389848, 385897, 380415, 373820, 366569, 359042, 351598, 344232, 336464, 328105, 319875, 312816, 307335, 303138, 299695, 296355, 292538, 288529, 285671, 285040, 286183, 287841, 289654, 292343, 296336, 301122, 306094, 311287, 316952, 322825, 328155, 332287, 335154, 337298, 339306, 341067, 341783, 340889, 338617, 335366, 330978, 325189, 318407, 311350, 304062, 296029, 287270, 278595, 270668, 263439, 256720, 250817, 246216, 242952, 240628, 238944, 238005, 238125, 239347, 241132, 242611, 243362, 243786, 244522, 245541, 246146, 245851, 244969, 244192, 243797, 243461, 242829, 242060, 241653, 241822, 242296, 242838, 243630, 244840, 246118, 246972, 247481, 248133, 249069, 250117, 251449, 253468, 255950, 258079, 259549, 260867, 262273, 263166, 263024, 262106, 260749, 258735, 255948, 252987, 250405, 248033, 245749, 244190, 243739, 243451, 242127, 240101, 238779]
57695B38779j92m2p04j118j027p79k41Q46J960K397K447K965M073N252O428P992
57679B69036R836J1514J3366J6588K1807K8294L4931M1558M9082N8546P0252Q3528
57667G08338R6882J08309J15435J15675J06770Q7812N9936K6081r889m4027p2902
57656A298420r4046j06240j09640j05749r7015q5959p4389o3308n3273m4484l6765
57645D27552k9993k4478k0546j7842j5546j3234j1040r100p411o166n562n279
57633B61355m756m028l574l401l018k397k075k143k010j495j203j455j680j484
57619B26636j425k046k827k885k210j502j142r99r53j011j072j091j261j617j744
57604B02851j273m63P2qo39j506k094j917j101l91k96n58o73o30q01j441k448
$$ y = [238779, 238587, 238545, 237841, 236723, 235696, 234917, 234676, 235522, 237482, 239879, 242326, 245291, 249364, 254616, 261044, 269036, 278872, 290386, 303752, 320340, 342147, 370441, 405372, 446930, 496012, 554558, 624810, 708338, 805220, 913529, 1028964, 1144639, 1251409, 1339221, 1399157, 1425238, 1415349, 1371322, 1298420, 1204374, 1098134, 988494, 882745, 785730, 699771, 625382, 562074, 508801, 464317, 427552, 397559, 373081, 352535, 334693, 319147, 305913, 294873, 285773, 278362, 272196, 266634, 261355, 256599, 252571, 248997, 245596, 242578, 240181, 238106, 235963, 233953, 232458, 231255, 229800, 228120, 226636, 225211, 223165, 220338, 217453, 215243, 213741, 212599, 211600, 210647, 209636, 208564, 207473, 206212, 204595, 202851, 201578, 201115, 201187, 201179, 200540, 199034, 196940, 195023, 193922, 193531, 193235, 192677, 192004, 191374, 190573, 189132, 186684]
57587A86684l320l355k387j419j741l274m476m240l123k274k021k036k197k519
57573A48302k795k931l194l579l507k686j720j298j318j412j623j894j651p41
57559A17953q0l97r24m59O96J165N81O2M81J381J836J532Q16K78M16J128J673
57542A28138J579J404J856K497K398J797J905K887L285J981k53j803k041j554
57528A44076j165j309j956k530k281j199j97j2k46j03M10O53N63P85J551K161
57512A39201K000J504J546K157K591K557K691L438M165L969K988K181J984J884
57498A74856J311L06q74k083l081l610l878m341m789m450l379k853l663m757m534
57483A30181l031j830j977k928l564l458k904k339j989j744j287o07k61p63j767
$$ y = [186684, 183364, 180009, 177622, 176203, 174462, 171188, 166712, 162472, 159349, 157075, 155054, 153018, 150821, 148302, 145507, 142576, 139382, 135803, 132296, 129610, 127890, 126592, 125274, 123862, 122239, 120345, 118694, 117953, 117873, 117476, 116552, 116093, 116789, 117954, 118535, 118597, 119078, 120459, 122295, 123827, 124643, 124921, 125337, 126465, 128138, 129717, 131121, 132977, 135474, 137872, 139669, 141574, 144461, 147746, 149727, 149474, 147671, 145630, 144076, 142911, 141602, 139646, 137116, 134835, 133636, 133439, 133427, 133181, 133078, 133488, 134141, 134704, 135489, 137040, 139201, 141201, 142705, 144251, 146408, 148999, 151556, 154247, 157685, 161850, 165819, 168807, 170988, 172972, 174856, 176167, 176473, 175599, 173516, 170435, 166825, 162947, 158606, 153817, 149367, 145988, 143135, 139472, 134715, 130181, 127150, 125320, 123343, 120415, 116851, 113393, 110489, 108150, 106161, 104417, 103130, 102523, 102262, 101499, 99732]
57468I9732k272j742o59P6R9j03K38J214J921J433J12o40j28Q17J122Q10N14K56
57450A02800k82q25q04l99l01n07l00N32J315J558J563J723J795J351M67l33n86
57433A08767k35L08M32Kl45NP12Q35J41n97o97m24m97j111j772j890j365p05n77
57414A00987j086j643j724j513j479j577j358o80J84J026J650J567M84q95j319
57399I2624n01M83O46K64K35P18J035O98k3n69o95m47J85J243K397K901K264R14
57381A04372j49l98j66j7j26m17p25p03p9O87O53l33j179r41QP47J138J492J536
57362A05400P81l54q20l33L65O59O33N51N32P89J436K021J954J433J192J327J183
57345A18749M99r6J2O79J279J294N57m93r34l54M09K96l64k95P12J402Q82k30
$$ y = [99732, 97460, 95718, 95059, 95135, 95234, 95131, 95369, 96583, 98504, 99937, 100049, 99409, 99281, 100098, 101220, 102030, 102544, 102800, 102518, 101693, 100889, 100490, 100189, 99682, 99382, 99914, 101229, 102787, 104350, 106073, 107868, 109219, 109686, 109353, 108767, 108532, 108840, 109272, 109274, 108929, 108934, 109646, 110481, 110622, 110025, 109328, 108904, 108407, 107296, 105524, 103634, 102269, 101564, 100987, 99901, 98258, 96534, 95021, 93542, 91965, 90607, 89927, 90111, 91137, 92787, 94354, 94838, 93943, 92624, 92123, 92606, 93252, 93516, 93751, 94469, 95504, 96202, 96179, 95610, 94915, 94468, 94653, 95896, 98293, 101194, 103458, 104372, 104223, 103825, 103659, 103642, 103516, 103099, 102374, 101671, 101592, 102279, 102932, 102599, 101420, 100479, 100487, 101234, 102372, 103864, 105400, 106181, 105827, 105007, 104674, 105039, 105698, 106331, 106882, 107414, 108203, 109639, 111660, 113614, 115047, 116239, 117566, 118749, 119248, 119152, 119164, 119843, 121122, 122416, 122973, 122480, 121546, 121192, 121601, 121897, 121533, 121238, 121950, 123352, 124234, 124004]
57327A24004r20j023q29l27L81P22L99rJ96Q63J327J339J162J062J143J441J836
57310A32767K076K032J734J161M19KK85P96P59L18L69J039J324O73j73m13l43
57293A44825n40o90j12J133K411L359L883L749K940K097J891K196K401K272J955
57278A73770J500R58O30O43N64J3o38p29k31L75Q76J407J909K228K595L401M527
57261A93798N428N895O207O487O422N796M967M563M812N320N500N235M946M949
57247B70325M946M537L994L881M012L566K464J725K041K843L405M099N663P769
57233C25270R312R919J0259J0950J1936J2982J3989J4749J5051J5211J6002J7852
57221D83482K0407K3041K5389K7327K8791K9768L0227K9933K8590K6311K3758
$$ y = [124004, 123084, 122061, 121232, 120905, 121286, 122008, 122407, 122398, 122594, 123457, 124784, 126123, 127285, 128347, 129490, 130931, 132767, 134843, 136875, 138609, 139770, 140189, 140191, 140476, 141272, 142031, 142349, 142718, 143757, 145081, 145754, 145581, 145168, 144825, 144285, 143595, 143483, 144616, 147027, 150386, 154269, 158018, 160958, 163055, 164946, 167142, 169543, 171815, 173770, 175270, 176228, 176858, 177501, 178065, 178078, 177440, 176711, 176480, 176855, 177731, 179138, 181047, 183275, 185870, 189271, 193798, 199226, 205121, 211328, 217815, 224237, 230033, 235000, 239563, 244375, 249695, 255195, 260430, 265376, 270325, 275271, 279808, 283802, 287683, 291695, 295261, 297725, 299450, 301491, 304334, 307739, 311838, 317501, 325270, 334582, 344501, 354760, 365710, 377646, 390628, 404617, 419366, 434417, 449628, 465630, 483482, 503889, 526930, 552319, 579646, 608437, 638205, 668432, 698365, 726955, 753266, 777024]
57210G77024K1649K0251J9426J9056J9278K0190K1524K2838K4124K5907K8466
57199A019733L1259L3604L5637L7973M0513M2358M3009M2916M2621M2107M1324
57188A453054M0630M0177L9604L8928L9146M1177M4560M7886N0245N1614N2103
57177A939124N1624N0239M8309M6205M4313M3151M3090M3958M5236M6587M7846
57166B449682M8737M8960M8536M7751M6811M5802M4778M3744M2683M1801M1471
57155B950756M1692M1863M1388M0282L8959L7686L6464L5268L4139L3185L2639
57144C364321L2729L3507L5006L7414M0713M4283M7526N0714N4452N8344O1146
57133C860155O2446O3131O3920O4503O4518O4194O3317O0799N6225N1122M7680
$$ y = [777024, 798673, 818924, 838350, 857406, 876684, 896874, 918398, 941236, 965360, 991267, 1019733, 1050992, 1084596, 1120233, 1158206, 1198719, 1241077, 1284086, 1327002, 1369623, 1411730, 1453054, 1493684, 1533861, 1573465, 1612393, 1651539, 1692716, 1737276, 1785162, 1835407, 1887021, 1939124, 1990748, 2040987, 2089296, 2135501, 2179814, 2222965, 2266055, 2310013, 2355249, 2401836, 2449682, 2498419, 2547379, 2595915, 2643666, 2690477, 2736279, 2781057, 2824801, 2867484, 2909285, 2950756, 2992448, 3034311, 3075699, 3115981, 3154940, 3192626, 3229090, 3264358, 3298497, 3331682, 3364321, 3397050, 3430557, 3465563, 3502977, 3543690, 3587973, 3635499, 3686213, 3740665, 3799009, 3860155, 3922601, 3985732, 4049652, 4114155, 4178673, 4242867, 4306184, 4366983, 4423208, 4474330, 4522010]
57122D522010M6864M8534N2620N9138O7597P7279Q7651R7746J05989J11695J16341
57111E393464J22651J33009J49267J72697K02778K36938K73164L12646L58984
57102G355598M15659M85605N72352O79729Q10492R66669J150826J365656J612214
57093A5414800J889405K194720K524632K874974L241295L616864L988304M333490
57085D0078484M622874M818612M872180M733961M379630L829935L136549K345346
57077G2817571J480280N65441l49076j196641j929596k538851l040029l448775
57069F2360324l770512m004314m148076m200944m165841m051063l868654l631966
57061C0518954l355567l055556k747402k443204k151630j879514j632075j411963
$$ y = [4522010, 4568874, 4617408, 4670028, 4729166, 4796763, 4874042, 4961693, 5059439, 5165428, 5277123, 5393464, 5516115, 5649124, 5798391, 5971088, 6173866, 6410804, 6683968, 6996614, 7355598, 7771257, 8256862, 8829214, 9508943, 10319435, 11286104, 12436930, 13802586, 15414800, 17304205, 19498925, 22023557, 24898531, 28139826, 31756690, 35744994, 40078484, 44701358, 49519970, 54392150, 59126111, 63505741, 67335676, 70472225, 72817571, 74297851, 74863292, 74514216, 73317575, 71387979, 68849128, 65809099, 62360324, 58589812, 54585498, 50437422, 46236478, 42070637, 38019574, 34150920, 30518954, 27163387, 24107831, 21360429, 18917225, 16765595, 14886081, 13254006, 11842043]
57053A1842043j219361j053209r11866p93010o93740o10954n41486m82327m31165
57044E104925l86539l47324l12378k80929k52747k27643k05160j85081j67646
57035B739478j52773j39583j27177j15504j04845r4883q4961p5072o5746n6926
57025A722008m7730l7511k6518j5131k848J1487K8371M6406O2028P0583O8696
57014A879841N6490L7368J5124q614l3776n9167q1348r6613j03429j02847r7138
57003A405891q8561p8899o9314o0448n2759m6612m1907l7992l4365l1145k8538
56992H35351k6235k3861k1700k0230j9156j7584j5145j2309r540o863m446l023
56980F55259l369n608r154j3040j6308j8480j9730k0303j9922j8257j5795j3490
$$ y = [11842043, 10622682, 9569473, 8657607, 7864597, 7170857, 6559903, 6018417, 5536090, 5104925, 4718386, 4371062, 4058684, 3777755, 3525008, 3297365, 3092205, 2907124, 2739478, 2586705, 2447122, 2319945, 2204441, 2099596, 2004713, 1919752, 1844680, 1778934, 1722008, 1674278, 1636767, 1610249, 1595118, 1592270, 1603757, 1632128, 1678534, 1740562, 1811145, 1879841, 1936331, 1973699, 1988823, 1980209, 1946433, 1887266, 1805918, 1709305, 1605876, 1503029, 1405891, 1317330, 1238431, 1169117, 1108669, 1055910, 1009298, 967391, 929399, 895034, 863889, 835351, 809116, 785255, 763555, 743325, 724169, 706585, 691440, 679131, 669591, 662728, 658282, 655259, 651890, 646282, 637128, 624088, 607780, 589300, 569570, 549267, 529345, 511088, 495293, 481803]
56968D81803j1504r067n808k510j15J517L425O388J0192J3793J6056J6657J6291
56955E37118J5654J4263J0898N201j683q185j3329j6714j8289j8502j8009j6906
56943D71517j4788j1740q571n819l236o09J873M436P991J2890J8065K2178K4932
56930E19119K6562K6591K4017J8478J0584J374p947j6141k2494k7105l0175l1399
56918D91464l0520k8031k4822k1452j8299j5766j3811j1759r292p104n905n305
56906B99398m512l497k620j674l66P11P85K69J97O31R28J398L179O227Q945J0310
56890C20309J1151J2667J4819J6890J8633J9953K0144J8427J4901J0271M933r53
56878D82145o751j1431j4314j5406j5062j3688j1649r129o055k359J788O167J0807
$$ y = [481803, 470299, 461232, 455424, 452914, 452799, 454316, 457741, 464129, 474321, 488114, 504170, 520827, 537118, 552772, 567035, 577933, 583134, 581451, 573266, 559937, 543223, 524934, 506432, 488423, 471517, 456729, 444989, 436418, 430599, 427363, 426754, 428627, 433063, 441054, 453944, 472009, 494187, 519119, 545681, 572272, 596289, 614767, 625351, 626725, 618778, 602637, 580143, 553038, 522863, 491464, 460944, 432913, 408091, 386639, 368340, 352574, 338763, 327004, 317712, 310608, 304703, 299398, 294886, 291389, 288769, 287095, 286729, 287440, 288225, 288494, 288691, 289322, 290250, 291648, 294827, 301054, 309999, 320309, 331460, 344127, 358946, 375836, 394469, 414422, 434566, 452993, 467894, 478165, 483098, 482145, 475394, 463963, 449649, 434243, 419181, 405493, 393844, 384715, 378660, 376301, 378089, 384256, 395063]
56865C95063J5877K1423K7304L3259L8933M3804M7065M7588M4290L6990K6838
56854G78434J5465L726q264j9832k9136l4308l4926l2107k7343k1619j5377q824
56842E65889k018N171J2873K0982K9254L7795M7200N7664O7824P4959P6732P2431
56830A066756O2422M7120K7208M479j8402l8974n5295o5729o9519o7732o2726
56819H29608n6237m8560l9646l0116k0769j1799l003N771J4808K4494L4501M3409
56807G42461M9631N2317N0937M4648L3031J7282j23j6959l1967m4214n2635n6587
56795G87822n6462n3399m8562m2763l6462k9903k3263j6752j0485m333J865P975
56783D75278J3629J8560K2521K4861K4576K1175J5350Q403J017p034j5824k4206
$$ y = [395063, 410940, 432363, 459667, 492926, 531859, 575663, 622728, 670316, 714606, 751596, 778434, 793899, 797625, 789361, 769529, 740393, 706085, 671159, 639052, 611709, 590090, 574713, 565889, 563871, 569042, 581915, 602897, 632151, 669946, 717146, 774810, 842634, 917593, 994325, 1066756, 1129178, 1176298, 1203506, 1207985, 1189583, 1150609, 1095314, 1029585, 960066, 892334, 829608, 773371, 724811, 685165, 655049, 634280, 622481, 619478, 625249, 640057, 664551, 699052, 742461, 792092, 844409, 895346, 939994, 973025, 990307, 990184, 973225, 941258, 897044, 844409, 787822, 731360, 677961, 629399, 586636, 550174, 520271, 497008, 480256, 469771, 465438, 467303, 475278, 488907, 507467, 529988, 554849, 579425, 600600, 615950, 624353, 625370, 618336, 602512, 578306]
56771E78306l0303l3123l3364l2402l0851k8455k5184k1782j8991j6672j4157
56760B93022j1313q778p169o414o076n961o037n973n267m013l074l131l744l843
56746B12229l073k193k036k538l055l205l009k484j636p79l53l82m45l55m83j181
56730A85022k069k235j243K89J233J078L32j82j58J70O50J322J998K223J857J314
56714A91601J004R31J082J729K833L552L009J455R5k78M2L88N01M49K32n4n0M22
56696B08943Q62M98o74j627j374k06N97L19l97n76k88l45q79j020k06R57J522
56679B06106J346Q99M28j48q00j329j636j619j098k05M29L37j68m16k32Q7L03
56662B02284L68K68J68M03R12J102Q15Q53J873L175L574L123K907L293L483K959
$$ y = [578306, 548003, 514880, 481516, 449114, 418263, 389808, 364624, 342842, 323851, 307179, 293022, 281709, 272931, 265762, 259348, 253272, 247311, 241274, 235301, 230034, 226021, 222947, 219816, 216072, 212229, 209156, 206963, 204927, 202389, 199334, 196129, 193120, 190636, 189000, 188221, 187868, 187486, 187041, 186686, 186203, 185022, 182953, 180718, 179475, 179764, 180997, 182075, 182407, 182225, 182067, 182237, 182887, 184209, 186207, 188430, 190287, 191601, 192605, 193536, 194618, 196347, 199180, 202732, 205741, 207196, 207291, 207013, 207055, 207443, 207944, 208393, 208625, 208571, 208521, 208943, 209805, 210303, 209629, 208002, 206628, 206422, 207019, 207338, 206941, 206365, 206077, 205732, 204853, 203833, 203627, 204584, 206106, 207452, 208351, 208779, 208631, 207831, 206502, 204866, 203247, 202149, 201944, 202373, 202710, 202542, 202126, 201894, 201981, 202284, 202652, 202920, 203088, 203491, 204403, 205505, 206320, 207173, 209046, 212221, 215795, 218918, 221825, 225118, 228601, 231560]
56646B31560K254K028K271K761L443L950L586K302J039N53M95J13o86j514k270
56631B51885l111l925m383m357l937l187k170j096k03L27L27k44j003j359j148
56616B22416p42m21n7M15O85N40K10m5l26o70o83m1Q17J104P23M16Q03J534J695
56597B28373R41m2l53KK15j34m81k22L15L92k9m25o82j088j452j126l3J102J697
56578B26970J799J498P29r4j23P61J602J655J342J384J687J791J856K369L205
56563B48431L782M016M424N282O276P035P560P994Q290Q214P602O597N701N339
56549C36543N325M965L898K569J674J315R44J2j458k841l403k979k147j673j821
56534C40923k401l244m228n048n451n637n918o088n717m912m198l734l364l302
$$ y = [231560, 233814, 235842, 238113, 240874, 244317, 248267, 251853, 254155, 255194, 255747, 256242, 256355, 255669, 254155, 251885, 248774, 244849, 240466, 236109, 232172, 228985, 226815, 225719, 225516, 225843, 226170, 225926, 224923, 223564, 222416, 221674, 221253, 221196, 221611, 222296, 222836, 223046, 223001, 222675, 222005, 221322, 221281, 222098, 223202, 223925, 224341, 225144, 226678, 228373, 229314, 229272, 228919, 228921, 229136, 229002, 228521, 228299, 228614, 229006, 228977, 228552, 227870, 226782, 225330, 224204, 224171, 225273, 226970, 228769, 230267, 230996, 230902, 230779, 231540, 233142, 234797, 236139, 237523, 239210, 241001, 242857, 245226, 248431, 252213, 256229, 260653, 265935, 272211, 279246, 286806, 294800, 303090, 311304, 318906, 325503, 331204, 336543, 341868, 346833, 350731, 353300, 354974, 356289, 357233, 357245, 355787, 352946, 349543, 346564, 344417, 342744, 340923, 338522, 335278, 331050, 326002, 320551, 314914, 308996, 302908, 297191, 292279, 288081, 284347, 280983, 277681]
56520B77681l844m444m128l040k466k938l417k896j858j372j594j960k153k125
56506B39446j750j173r55j210j254p45m39r95j715j542p40l83n97m48M49J340
56490B27289J500J093O87N64O25N39k6p77p13P29K519K863J285q06j790j482p99
56473B33300m13k32K7K45J04l14m25J39R68J357J269J286J662J917J579P62j24
56456B43107o76m93N04J575J739J114Q02J166J330P80L63Q41J550J482Q26L17
56440B56327j27q92j474j094j29L97L89M80N94R7q07j158q34o74r09p73J8O27
56422B50058M09j21j85J60L76K35j33m66l29N86J865K581K317J575J050R30R79
56405B61887Q36J84q21j375q21L79J099R83P86J136J710J814J349Q26P73J259
$$ y = [277681, 273837, 269393, 265265, 262225, 259759, 256821, 253404, 250508, 248650, 247278, 245684, 243724, 241571, 239446, 237696, 236523, 235568, 234358, 233104, 232359, 231920, 230925, 229210, 227668, 226928, 226545, 225948, 225500, 225949, 227289, 228789, 229882, 230569, 231133, 231758, 232297, 232271, 231494, 230781, 231510, 234029, 236892, 238177, 237371, 235581, 234099, 233300, 232887, 232655, 232682, 232927, 233031, 232717, 232292, 232431, 233399, 234756, 236025, 237311, 238973, 240890, 242469, 243231, 243107, 242431, 241938, 242442, 244017, 245756, 246870, 247672, 248838, 250168, 250948, 251311, 252152, 253702, 255184, 256010, 256327, 256200, 255308, 253834, 252740, 252611, 253008, 253397, 253877, 254471, 254568, 253761, 252603, 251769, 251095, 250186, 249413, 249431, 250058, 250467, 250346, 250161, 250321, 250697, 250932, 250799, 250333, 250004, 250590, 252455, 255036, 257353, 258928, 259978, 260908, 261887, 262723, 262907, 262086, 260711, 259890, 260269, 261368, 262351, 263137, 264273, 265983, 267797, 269146, 269972, 270745, 272004]
56389B72004J824J908J502J194J285J360J126J108J777K519K427J691J160Q41
56375B93726J05p71o49N94J563J257M25K69P13Q09L01q9K56J067J553J299O90
56358C03118M42O73P56L47M1N05J339J568J027M24J62k2k45k38L3K27K98N31Q75
56339C11861R17O16L67L30L71O50J464K498L089L277L691M272M132K955J618J034
56323C43142J136J396J571J632J516J359J421J575J430J056R72J322J719J903
56309C63150J924J649R62M74J084K674M157M922N325N591N364M734M559N205N786
56294D17560N364M159L044K477K430K761L224L540L838M473N255N508N086M686
56280D73405M855N432O110O849P534P966Q392R247J0228J0519J0146J0153J1202
$$ y = [272004, 273828, 275736, 277238, 278432, 279717, 281077, 282203, 283311, 285088, 287607, 290034, 291725, 292885, 293726, 293831, 293060, 292411, 293005, 294568, 295825, 296250, 296519, 297232, 298041, 298342, 298253, 298509, 299576, 301129, 302428, 303118, 303560, 304233, 304989, 305336, 305377, 305882, 307221, 308789, 309816, 310240, 310402, 310380, 310135, 309897, 309930, 310157, 310455, 310986, 311861, 312778, 313394, 313761, 314091, 314462, 315112, 316576, 319074, 322163, 325440, 329131, 333403, 337535, 340490, 342108, 343142, 344278, 345674, 347245, 348877, 350393, 351752, 353173, 354748, 356178, 357234, 358206, 359528, 361247, 363150, 365074, 366723, 367685, 368159, 369243, 371917, 376074, 380996, 386321, 391912, 397276, 402010, 406569, 411774, 417560, 422924, 427083, 430127, 432604, 435034, 437795, 441019, 444559, 448397, 452870, 458125, 463633, 468719, 473405, 478260, 483692, 489802, 496651, 504185, 512151, 520543, 529790, 540018, 550537, 560683, 570836, 582038]
56267E82038J2864J4601J6422J8258J9747K1064K3029K5921K9089L2141L5498
56256H30672L9398M3372M7262N1778N7458O4009P1120P8922Q7120R4632J00800
56245A566543J06022J10595J13920J15386J15129J13185J08860J01626R1751P9459
56235B622476O4479M7136K8850J0814o932k4427m0798n5152o7492p8014q6356
56224B414584r2406r6795r9770j00569r8815r5598r2219q8711q4511p9699p4695
56213A410796o9579o4578o0303n6663n2606m7812m3540m0692l8287l5061l1489
56202H70186k8740k6625k4133k1241j8637j6315j3926j1952j0986j0406r236p788
56190F70201p018o657n649m092l157l187l372l248l109k898k171j240j083j764
$$ y = [582038, 594902, 609503, 625925, 644183, 663930, 684994, 708023, 733944, 763033, 795174, 830672, 870070, 913442, 960704, 1012482, 1069940, 1133949, 1205069, 1283991, 1371111, 1465743, 1566543, 1672565, 1783160, 1897080, 2012466, 2127595, 2240780, 2349640, 2451266, 2543017, 2622476, 2686955, 2734091, 2762941, 2773755, 2766823, 2742396, 2701598, 2646446, 2578954, 2500940, 2414584, 2322178, 2225383, 2125613, 2025044, 1926229, 1830631, 1738412, 1649701, 1565190, 1485491, 1410796, 1341217, 1276639, 1216336, 1159673, 1107067, 1059255, 1015715, 975023, 936736, 901675, 870186, 841446, 814821, 790688, 769447, 750810, 734495, 720569, 708617, 697631, 687225, 677989, 670201, 663183, 656526, 650877, 646785, 643628, 640441, 637069, 633821, 630712, 627814, 625643, 624403, 623320, 621556]
56176F21556k108j283J91J332J775J734J538J503J809K403L232M415N862P098
56162F51057P832Q270Q555Q452Q095Q299R549J1283J2811J4203J5671J6907J7869
56149G98853J9395K2102K5321K8168L1004L4910M0208M6465N3515O1574P0793
56138A232308Q1338R3358J06224J18446J28833J36954J41979J42389J37726J29512
56128B449067J19457J07916R5093Q2420P1281O1400N1707M1836L1552K0032P237
56117C138998n120j5580k4921l4680m4911n5088o6035p8877r2908j06348j18356
56106B496174j28466j34940j35986j32117j25325j16386j04950r1775p8773o6993
56096A380463n6305m6857l9153l2919k7432k2584j8374j4053r289n245k932j409
$$ y = [621556, 619448, 618165, 618356, 619688, 621463, 623197, 624735, 626238, 628047, 630450, 633682, 638097, 643959, 651057, 658889, 667159, 675714, 684166, 692261, 700560, 710109, 721392, 734203, 748406, 764077, 780984, 798853, 818248, 840350, 865671, 893839, 924843, 959753, 999961, 1046426, 1099941, 1161515, 1232308, 1313646, 1407004, 1513228, 1631674, 1760507, 1897461, 2039440, 2181829, 2319555, 2449067, 2568524, 2676440, 2771533, 2853953, 2925234, 2986634, 3038341, 3080177, 3111729, 3131761, 3138998, 3133878, 3118298, 3093377, 3058697, 3013786, 2958698, 2892663, 2813786, 2720878, 2614530, 2496174, 2367708, 2232768, 2096782, 1964665, 1839340, 1722954, 1618004, 1526229, 1447456, 1380463, 1324158, 1277301, 1238148, 1205229, 1177797, 1155213, 1136839, 1122786, 1113497, 1108252, 1105320, 1103911]
56084A103911O08K534L306L806N498P695Q746R083J0419J2555J3791J4054J4805
56071A210811J6124J6686J6548J7137J8399J8570J7062J5099J3447J1814J0513
56060A382210J0274J0358R259P408O821P920R102R532J0038J1095J2177J3206
56048A499400J4586J5871J6411J6981J8582K0287K0673K0579K1723K3425K3876
56037A712394K3869K5698K8930L1044L2113L4768L9310M2909M4330M5600M8099
56026B109064N0591N2109N3435N4764N5032N4555N5184N7139N8679N9464O1119
56015B721135O3942O6425O8407P1408P5445P8950Q2133Q6747R2342R6643R9838
56004C603415J04417J10493J15737J20258J26809J35557J43494J49933J57673
$$ y = [1103911, 1104519, 1107053, 1110359, 1114165, 1119663, 1127358, 1136104, 1145187, 1155606, 1168161, 1181952, 1196006, 1210811, 1226935, 1243621, 1260169, 1277306, 1295705, 1314275, 1331337, 1346436, 1359883, 1371697, 1382210, 1392484, 1402842, 1412101, 1419509, 1426330, 1434250, 1443352, 1452884, 1462922, 1474017, 1486194, 1499400, 1513986, 1529857, 1546268, 1563249, 1581831, 1602118, 1622791, 1643370, 1665093, 1688518, 1712394, 1736263, 1761961, 1790891, 1821935, 1854048, 1888816, 1928126, 1971035, 2015365, 2060965, 2109064, 2159655, 2211764, 2265199, 2319963, 2374995, 2429550, 2484734, 2541873, 2600552, 2660016, 2721135, 2785077, 2851502, 2919909, 2991317, 3066762, 3145712, 3227845, 3314592, 3406934, 3503577, 3603415, 3707832, 3818325, 3934062, 4054320, 4181129, 4316686, 4460180, 4610113, 4767786]
55995D767786J67735J77807J87004J97295K09174K20919K32994K48063K65761
55986F674538K82935K99827L20210L44695L70190L96810M28443M65482N04172
55977A0087302N44495N91081O45127P03596P67903Q44442R34683J034373J144947
55968A7297949J275751J432532J614813J827953K086392K401875K781655L242928
55960C3961848L815390M524798N388603O432400P693542R203473J0987519J3089731
55952I5097304J5574624J8492705K1854893K5601321K9475488L2844692L4718883
55945B73659910L4124387L0586467K4296304J5881887O122871m113263j3832844
55938C66725719k2031928k7963854l1334985l2302530l1342341k9082784k6138474
$$ y = [4767786, 4935521, 5113328, 5300332, 5497627, 5706801, 5927720, 6160714, 6408777, 6674538, 6957473, 7257300, 7577510, 7922205, 8292395, 8689205, 9117648, 9583130, 10087302, 10631797, 11222878, 11868005, 12571601, 13339504, 14183946, 15118629, 16153002, 17297949, 18573700, 20006232, 21621045, 23448998, 25535390, 27937265, 30718920, 33961848, 37777238, 42302036, 47690639, 54123039, 61816581, 71020054, 82007573, 95097304, 110671928, 129164633, 151019526, 176620847, 206096335, 238941027, 273659910, 307784297, 338370764, 362667068, 378548955, 384671826, 380558563, 366725719, 344693791, 316729937, 285394952, 253092422, 221750081, 192667297, 166528823]
55931A66528823k2981004j9901374j7055265j4517566j2306719j0403734q780672
55924F0582489p414030o275212n326922m536652l883010l345010k897038k519071
55916B4385544k201588j936011j709537j513031j344684j201756j076748r65074
55908A2437115q68407p86630p13917o46244n85711n33919m87683m44739m07312
55899F962553l76421l48431l20676k95296k74224k55418k36996k20411k06648
55890D428032j93708j80496j68921j59733j50590j40436j31476j24496j16630
55881C061546j06308r6187q8580q1874p4099o6394o0356n5408n1204m9325n0280
55870B281531n1925n3023n5210n9335o3046o4117o3236o1491n8196n3209m8421
$$ y = [166528823, 143547819, 123646445, 106591180, 92073614, 79766895, 69363161, 60582489, 53168459, 46893247, 41566325, 37029673, 33146663, 29801653, 26904615, 24385544, 22183956, 20247945, 18538408, 17025377, 15680693, 14478937, 13402189, 12437115, 11568708, 10782078, 10068161, 9421917, 8836206, 8302287, 7814604, 7369865, 6962553, 6586132, 6237701, 5917025, 5621729, 5347505, 5092087, 4855091, 4634680, 4428032, 4234324, 4053828, 3884907, 3725174, 3574584, 3434148, 3302672, 3178176, 3061546, 2955238, 2859051, 2770471, 2688597, 2614498, 2548104, 2487748, 2432340, 2381136, 2331811, 2281531, 2229606, 2176583, 2121373, 2062038, 1998992, 1934875, 1871639, 1810148, 1751952, 1698743, 1650322]
55859A650322m4844m1036l6297l2470l0682k9342k7408k6532k7783k9226k9177
55848A295525k9033l0362l1846l1676l0620l0119k9581k8009k6268k5298k4067
55837I78646k1672j9495j8944j8843j7470j5493j4503j4184j3289j1990j1090
55826H01673j0128q408o752o271o587o931p722r355j0671j0514r552q917q212
55813F91653o619m647l119j629K79J674J711J395K088L331L776L291K516J368
55799F97068l78j998k866l767n689q193j0340j2148j3800j4495j3574j1831j0292
55786E87697q702o569m489l014j409R00K722K699J483P37Q28J175J904L448N336
55771E84746O939Q659J0685J1580R856O198K303j770p139j3454j8737k1700k2596
$$ y = [1650322, 1605478, 1564442, 1528145, 1495675, 1464993, 1435651, 1408243, 1381711, 1353928, 1324702, 1295525, 1266492, 1236130, 1204284, 1172608, 1141988, 1111869, 1082288, 1054279, 1028011, 1002713, 978646, 956974, 937479, 918535, 899692, 882222, 866729, 852226, 838042, 824753, 812763, 801673, 791545, 783137, 776385, 770114, 763527, 756596, 748874, 739519, 728848, 718334, 708782, 699865, 691653, 685034, 680387, 677268, 675639, 675918, 677592, 679303, 680698, 682786, 686117, 689893, 693184, 695700, 697068, 696690, 694692, 691826, 688059, 682370, 674177, 663837, 651689, 637889, 623394, 609820, 597989, 587697, 578995, 572426, 567937, 564923, 563514, 564414, 567136, 569835, 571318, 572055, 572883, 574058, 575962, 579410, 584746, 591685, 600344, 611029, 622609, 632465, 638663, 640966, 639196, 632057, 618603, 599866, 578166, 555570]
55758E55570k2002k0303j8238j6469j4594j1966r213p701p649q079q383q679q804
55745C93490q334p494o904o390n203l382j915j481j861k442k647k136j269j005
55731C41027j617k168j923j587k116l104l587l699m144m604m186l142k599k710
55717B99841k516j703j022q27m76M92J624K482L263M137M687M473L657K711J803
55702C22626O96r10k980m935o062o244o022n822n527m956m236l413k363j272n24
55687B68056J18J350K946L607K754J502J215J971L169M559N793N999M876L431
55673C11346K632K139J297M68K57K82p9n21o07q57j716k241j343L30J262J295
55657C13944J368J493P47q23j972k099j958k289l013l906n031o243p107p491p545
$$ y = [555570, 533568, 513265, 495027, 478558, 463964, 451998, 442785, 435084, 427435, 419356, 410973, 402294, 393490, 385156, 377662, 370758, 364368, 359165, 355783, 353868, 352387, 350526, 348084, 345437, 343301, 342032, 341027, 339410, 337242, 335319, 333732, 331616, 328512, 324925, 321226, 317082, 312478, 308292, 305150, 302551, 299841, 297325, 295622, 294600, 293773, 293297, 293789, 295413, 297895, 301158, 305295, 309982, 314455, 318112, 320823, 322626, 323322, 322412, 319432, 314497, 308435, 302191, 296169, 290347, 284820, 279864, 275628, 272215, 269852, 268580, 268056, 268174, 269524, 272470, 276077, 278831, 280333, 281548, 283519, 286688, 291247, 297040, 303039, 307915, 311346, 313978, 316117, 317414, 317882, 318139, 318421, 318342, 317821, 317214, 316357, 314641, 312400, 311057, 311387, 312649, 313944, 315312, 316805, 317552, 316729, 314757, 312658, 310700, 308411, 305398, 301492, 296461, 290218, 283111, 275620, 268075]
55642B68075p202o318n169m154l308k683k658l177l337k637j820j632j545r46
55628B21489o36j578k993l394k929k845l089k570j524j502k753l633l107k036
55614A86900j407r83m11k11q02j670k233k483k363j534k78M29K50j25k83o47j336
55597A70813j659j321j090j514j982j752j072n87l55j10J44L95Q59J421J480Q17
55581A64487N6k34k73m71o40l73K30O99P98O81P49J397K567L545L648L124K797
55564A82787K894K927K688K536K565K327J568N43n28j593k230j774l17J095J517
55549A97005Q16o26k210l061k526j044J64N05M74O68J041J271J178O25k84r00
55533A93096o32J51N40L40l8o99k099l695m178l348k586k887l621l770l291k603
$$ y = [268075, 260873, 254555, 249386, 245232, 241924, 239241, 236583, 233406, 230069, 227432, 225612, 223980, 222435, 221489, 220853, 219275, 216282, 212888, 209959, 207114, 204025, 201455, 199931, 198429, 195676, 192043, 188936, 186900, 185493, 184510, 184099, 183888, 183086, 181416, 179183, 176700, 174337, 172803, 172525, 172954, 173204, 173079, 172796, 172149, 170813, 169154, 167833, 166743, 165229, 163247, 161495, 160423, 159836, 159481, 159371, 159515, 159910, 160769, 162190, 163670, 164487, 164543, 164309, 164036, 163565, 162925, 162552, 162782, 163481, 164279, 164960, 165709, 167106, 169673, 173218, 176866, 179990, 182787, 185681, 188608, 191296, 193832, 196397, 198724, 200292, 200835, 200307, 198714, 196484, 194710, 194393, 195488, 197005, 197821, 197195, 194985, 191924, 189398, 188354, 188518, 189023, 189497, 190165, 191206, 192477, 193655, 194280, 193996, 193096, 192464, 192615, 193155, 193495, 193457, 192758, 190659, 186964, 182786, 179438, 176852, 173965, 170344, 166574, 163283, 160680]
55517A60680j756q56n26j129k123k781k988k946k703k391k181j762n80J044J911
55502A38913J462M24l95r48j239q80k5L92K5j97L87J043Q59J94j15r2j76j23M75
55483A39984J177J252Q04M01P5m12q03q37r65j632k232j875q26j55k19n06p36
55466A32495j086j388j175m92J64P62J663K628K814J963Q43K18J3k91q81j493
55450A36757j739j445q83n90o87o07J13J072J493J272R43Q10P07N18L53J69j66
55433A38090m68m09j60k53p40r79m71M68J122J149Q16N81O11O96O03N10Q64J690
55415A43720K400K493K203K124K385K620K542K204J740J231P31J74o54j759k656
55400A61498k801k311j895k038k500k691k365j881j747j938j778p25Q22J785J566
$$ y = [160680, 158924, 158068, 157542, 156413, 154290, 151509, 148521, 145575, 142872, 140481, 138300, 136538, 135958, 137002, 138913, 140375, 140799, 140404, 139456, 138217, 137337, 137312, 137704, 137729, 137532, 137919, 138962, 139821, 140015, 139900, 139808, 139632, 139509, 139984, 141161, 142413, 143217, 143618, 143693, 143281, 142478, 141641, 140676, 139044, 136812, 134937, 134111, 133956, 133737, 133231, 132495, 131409, 130021, 128846, 128354, 128518, 129280, 130943, 133571, 136385, 138348, 139191, 139409, 139422, 139131, 138250, 136757, 135018, 133573, 132690, 132100, 131413, 130806, 130919, 131991, 133484, 134756, 135699, 136509, 137216, 137734, 138087, 138256, 138090, 137622, 137213, 137053, 136800, 136060, 135081, 134610, 135078, 136200, 137349, 138165, 138746, 139357, 140053, 140656, 141166, 142030, 143720, 146120, 148613, 150816, 152940, 155325, 157945, 160487, 162691, 164431, 165662, 166393, 166567, 165913, 164154, 161498, 158697, 156386, 154491, 152453, 149953, 147262, 144897, 143016, 141269, 139331, 137553, 136828, 137650, 139435, 141001]
55385A41001O52m8j38J54M54N68N34M88M45K00l29p80p65m97n24q05p23j01M07
55366A40193K43l13o63o99o58o69p47r06r49o23j48j24n93q25m39p3m54j347k011
55347A28195k198k040j396j52J137J619J158M35M3pL6L7ll4n2j49l33l25J33P19
55327A26823P97L21n8pK3l58q16q80o47m86n39q42j373j640r91L29J189J130R69
55308A22944J272J325M79m73m48J95M02K34N40J227J432J208J526K425K642J465
55292A38395j41q67o36l15m20o82n30K31J136J436J027O47P99R28K64r31j731
55275A38610j828j542r22J61J148J114Q1q85j023n57o5P5m05j392k047j606n03
55258A28414J39J50L62J050J481J242R06R59J070Q53M05j96j069j779j483k73
$$ y = [141001, 141653, 141605, 141467, 141621, 142075, 142643, 143177, 143665, 144110, 144310, 143981, 143201, 142436, 141939, 141415, 140610, 139887, 139786, 140193, 140436, 140123, 139460, 138761, 138103, 137434, 136687, 135781, 134832, 134209, 134061, 133937, 133344, 132519, 132080, 132007, 131553, 130206, 128195, 125997, 123957, 122561, 122409, 123546, 125165, 126323, 126758, 126801, 126794, 126830, 126867, 126864, 126830, 126778, 126629, 126296, 125971, 126104, 126823, 127620, 127941, 127883, 127876, 127899, 127541, 126725, 125845, 125198, 124712, 124173, 123331, 121958, 120318, 119327, 119656, 120845, 121975, 122944, 124216, 125541, 126020, 125547, 125099, 125294, 125696, 125930, 126470, 127697, 129129, 130337, 131863, 134288, 136930, 138395, 138254, 137387, 136751, 136436, 136016, 135334, 134804, 135035, 136171, 137607, 138634, 139281, 140080, 141008, 141272, 140341, 138610, 136782, 135240, 134318, 134479, 135627, 136741, 136822, 135937, 134914, 134357, 134292, 134367, 133962, 132570, 130523, 128917, 128414, 128553, 128703, 129065, 130115, 131596, 132838, 133744, 134703, 135773, 136626, 137031, 136835, 135766, 133987, 132504, 132231]
55242A32231O49O44M72Q42J245J018N63M82L47m79j451j501o96q6j19l33m76q10
55224A32542j193r35Q9R91R72L61M4L37P65P73L04k36l81J0O25R81Q55M09l3k64
55204A37016k58j10O1J87K07J3m45r71j194r12l29J34K22kk98n22o22m28L01J349
55184A33399J807R48n98j312o10M27O30K46J69M09L46O1K26Q00J074R99J301K082
55166A42404K447J892J119R08J053R49N20On14r21q88l78K12O53J041J144M57
55149A52104q13j660j705j692k031j954r72j05m38j292j215k60K17k38o11j47
55133A37188P03J209J184O32m36j457j548o50K54M27J95J43K65K83J99P7j87m69
55115A38012l32K31N34J36m08k97M22J079J438J864K500K871K489J492N55K51
$$ y = [132231, 132880, 133524, 133996, 134838, 136083, 137101, 137664, 138146, 138493, 138014, 136563, 135062, 134366, 134280, 134161, 133828, 133352, 132542, 131349, 130414, 130503, 131494, 132466, 132827, 132871, 133208, 133973, 134746, 135050, 134814, 134433, 134443, 135068, 136049, 136904, 137313, 137280, 137016, 136758, 136648, 136709, 136896, 137103, 137116, 136671, 135700, 134506, 133594, 133265, 133399, 133621, 133619, 133321, 132799, 132177, 131749, 132050, 133399, 135206, 136154, 135556, 134244, 133634, 134061, 134691, 134937, 135106, 135515, 135861, 135922, 136148, 136948, 138022, 139021, 140322, 142404, 144851, 146743, 147862, 148770, 149823, 150772, 151292, 151298, 150784, 149863, 148975, 148597, 148809, 149462, 150503, 151647, 152104, 151291, 149631, 147926, 146234, 144203, 142249, 141277, 141172, 140734, 139442, 138227, 137967, 138184, 137946, 137335, 137188, 137891, 139100, 140284, 140916, 140480, 139023, 137475, 136825, 137079, 137506, 137701, 137844, 138109, 138392, 138591, 138668, 138481, 138012, 137680, 137911, 138445, 138581, 138173, 137876, 138298, 139377, 140815, 142679, 145179, 148050, 150539, 152031, 152586, 152837]
55099A52837N26P54M70m3j12L12N29J13m46n75n06p18q63j69J138J827J299L77
55081A56750P6K29N6n19q81q07o73o39l77K07O73P07N99O24N05j15r84j530j642
55062A52259j624j565j216n76p0Kj15qL97Q28R98Q23L85j18m43n15m52m12l83
55043A48195k52K9L81P19R90J092Q39K29l62m55q3J14l15r38r47k31M42M26j23
55024A49750o86j020j108q29j21P54J369J453R52R2m72j00R59J584J107J81k14
55007A53651j07k07o72r86r32p80n83k0Q63J543J758J774J711J288N06n1K3L76
54989A59155M70L22K64K88R1l27n12p9P92J458J429Q07N0n97j114j209m30R20
54971A61778J642J104K53L99J346J789J364J060J468J788J141m7o08n5J074J915
$$ y = [152837, 153363, 154117, 154587, 154544, 154432, 154744, 155273, 155386, 154940, 154365, 153859, 153141, 152278, 152109, 153247, 155074, 156373, 156750, 156826, 157055, 157111, 156592, 155711, 154904, 154231, 153592, 153215, 153422, 154095, 154802, 155401, 156025, 156530, 156415, 155431, 153901, 152259, 150635, 149070, 147854, 147278, 147208, 147210, 147095, 147087, 147484, 148312, 149310, 150133, 150518, 150400, 149957, 149442, 148990, 148578, 148195, 147943, 147972, 148353, 149072, 150062, 151154, 151993, 152222, 151860, 151405, 151322, 151436, 151121, 150183, 149236, 149005, 149447, 149873, 149750, 149064, 148044, 146936, 146107, 145986, 146740, 148109, 149562, 150514, 150606, 150134, 150034, 150993, 152577, 153684, 153865, 153651, 153544, 153337, 152665, 151679, 150747, 149967, 149384, 149364, 150227, 151770, 153528, 155302, 157013, 158301, 158807, 158756, 158779, 159155, 159625, 159947, 160211, 160499, 160590, 160263, 159751, 159672, 160464, 161922, 163351, 164158, 164208, 163611, 162497, 161288, 160858, 161778, 163420, 164524, 164777, 165176, 166522, 168311, 169675, 170735, 172203, 173991, 175132, 175085, 174477, 174422, 175496, 177411]
54955A77411J960J397R43J023J130N82k11k12N35P42j85j195j231p44o79p66l6
54938A80464J442K519K567K210K370L297M616N857O847P809Q999J0162J0710J0636
54924B60505J0681J1204J1447J0467Q385N982L483N37k802n847q032r405j0288
54911B86317j0845j1027j0607r431p889o812o611o691o168m862l282j896r19m92
54897A98785n65p55p84p93q52m49R39K984M757N726O079O290O767P750R105J0350
54881B55334J1199J1790J2036J1284R104O051L048L06k482n279p627r282j0290
54868B85192j0691j0679j0706j0770j0104q307o335n433n465n368m891m611m424
54855A87408l528k094j493k272l122k681j429q07j194j673j463p09L3L93K73k08
$$ y = [177411, 179371, 180768, 181711, 182734, 183864, 184446, 184235, 184023, 184558, 185300, 185115, 183920, 182689, 181945, 181266, 180500, 180464, 181906, 184425, 186992, 189202, 191572, 194869, 199485, 205342, 212189, 219998, 228997, 239159, 249869, 260505, 271186, 282390, 293837, 304304, 312689, 318671, 322154, 322691, 319889, 314042, 306010, 296605, 286317, 275472, 264445, 253838, 244407, 236518, 229706, 223095, 216404, 210236, 205374, 202092, 200196, 199277, 198785, 198220, 197465, 196681, 195888, 195036, 194587, 195526, 198510, 203267, 208993, 215072, 221362, 228129, 235879, 244984, 255334, 266533, 278323, 290359, 301643, 310747, 316798, 319846, 320152, 317670, 312391, 304764, 295482, 285192, 274501, 263822, 253116, 242346, 232242, 223935, 217600, 212167, 206702, 201334, 196443, 191832, 187408, 183880, 181786, 180293, 178021, 174899, 172218, 170789, 169982, 168788, 167115, 165652, 164943, 164976, 165369, 165642, 165434]
54839A65434p07q42n20j8K31J2l98m37R0P38J021R88R14P33L23RJ49L85Q0o25
54819A67560r45o24k10n5J20N24Q84R98J054J197J374J687K183K272J289k26q18
54802A78264j01N74O8r44j117l58L85O35P08Q24Q50P71O41K66l93o54K20J866
54784A82505L026L019K378J974K066K470L140M217N726P444R069J0396J1307J1648
54770B60385J1241J0240R342R195R470Q964O885L661L06k542m683o025o771p553
54756C02115q767r929j0213r409p996o461n157m522m762n357n496m993m254l405
54742B11394k192q02K5j5k54Q4R73J953K970M242N570O391O588O774P628R137
54726B60466J0640J1408J1109R898Q110N905L150j93l641o412q187r378j0433
$$ y = [165434, 164727, 163885, 163365, 163347, 163578, 163590, 163192, 162755, 162845, 163583, 164604, 165592, 166506, 167239, 167562, 167571, 167720, 168105, 168185, 167560, 166615, 165991, 165781, 165726, 165846, 166370, 167254, 168252, 169306, 170503, 171877, 173564, 175747, 178019, 179308, 179082, 178264, 178163, 178737, 178805, 177861, 176744, 176386, 176771, 177406, 178114, 178938, 179788, 180559, 181200, 181466, 181073, 180419, 180639, 182505, 185531, 188550, 190928, 192902, 194968, 197438, 200578, 204795, 210521, 217965, 227034, 237430, 248737, 260385, 271626, 281866, 291208, 300403, 309873, 318837, 325722, 329383, 329689, 327147, 322464, 316439, 309668, 302115, 293348, 283419, 273206, 263797, 255801, 249340, 244183, 239661, 234899, 229542, 224046, 219053, 214799, 211394, 209202, 208400, 208425, 208410, 208156, 208240, 209213, 211166, 214136, 218378, 223948, 230339, 236927, 243701, 251329, 260466, 271106, 282514, 293623, 303521, 311631, 317536, 320686, 320493, 316852, 310440, 302253, 292875, 282442]
54713B82442j1096j0752r365p703o552o094o135o399o401n565l951k533k159k525
54699A95212k638k136j515j218j245j569k150k461j812m25N57M97J3r9O8O4M8
54682A79191M24R57J065P55N17M40J93k60o00q53j382k042k029r32N46J237O58
54665A77885o69j754j882j083q9L56K14J3K5j8l04n47m36j38P0L16Q70J466J438
54646A75733N85n13j193j382j295q54J48J341J810J106j36q94q41l89J02O02R38
54629A74868P00j71j078j437j307j044p03k26J13l7m47n02j02J88L3j47J68P60
54611A69629R25L91m01q43p36k65K79O88Q85R35R41R24Q42P04N49L20p7m83m75
54592A74732J67J054J466J100L22l65q39j189j306r72l13J86K24O7J60N26O82
$$ y = [282442, 271346, 260594, 251229, 243526, 236974, 230880, 224745, 218346, 211945, 206380, 202429, 199896, 197737, 195212, 192574, 190438, 188923, 187705, 186460, 184891, 182741, 180280, 178468, 178043, 178600, 179097, 179110, 179011, 179079, 179143, 179191, 179615, 180572, 181637, 182392, 182909, 183349, 183542, 183282, 182682, 181829, 180447, 178405, 176376, 175444, 175990, 177227, 177885, 177216, 175462, 173580, 172497, 172408, 172764, 172978, 172991, 173016, 172998, 172694, 172147, 171711, 171573, 171643, 171959, 172829, 174295, 175733, 176318, 175805, 174612, 173230, 171935, 171081, 171229, 172570, 174380, 175486, 175350, 174456, 173615, 173226, 173328, 173930, 174868, 175568, 175397, 174319, 172882, 171575, 170531, 169828, 169602, 169715, 169678, 169231, 168729, 168627, 168815, 168848, 168701, 168869, 169629, 170554, 170945, 170544, 169701, 168965, 168700, 168979, 169667, 170552, 171487, 172428, 173352, 174194, 174898, 175447, 175767, 175690, 175207, 174732, 174899, 175953, 177419, 178519, 178841, 178476, 177637, 176448, 175142, 174170, 173857, 174043, 174267, 174334, 174494, 175020, 175702]
54575A75702K33o59j418j667j471j046m27M02J248J852K169K229J797P26m14o41
54559A78615K32J216J350P72J94j59m88o93n54m08p73j354j245k53P37R24N02
54542A78615J31J53N32J037J238Q20J71O5N54Q27M78J94O24J254J102J37o75n29
54524A86728N03J698K161J412l9r92q85m54o19j113r87j21N87M80j60p26r71r42
54506A85560p23m33j86K4J57Q3o3J82Q46J047O7j401j901j098p6K91K82M16N43
54487A83617M19M01Q60J423J464J026O15L78R9k18l09j34J00L20N68P03N77M07
54469A92316N30Q11P48J94m34o94n20n9N02Q59P32K67o6j27k18m49m45l1K66m9
54449A94133o12o95l53l38q46j158p62j34L8j39j20J02M0m00p84q80r13r81p05
$$ y = [175702, 175935, 175276, 173858, 172191, 170720, 169674, 169247, 169649, 170897, 172749, 174918, 177147, 178944, 179670, 179256, 178615, 178847, 180063, 181413, 182185, 182379, 182220, 181732, 181039, 180485, 180077, 179304, 177950, 176705, 176452, 177189, 178113, 178615, 178746, 178899, 179431, 180468, 181706, 182526, 182697, 182762, 183316, 184143, 184621, 184815, 185439, 186693, 187795, 187932, 187257, 186728, 187231, 188929, 191090, 192502, 192463, 191471, 190586, 190132, 189513, 188400, 187413, 187292, 187879, 188359, 188199, 187473, 186502, 185560, 184837, 184404, 184218, 184242, 184399, 184482, 184419, 184601, 185447, 186494, 186561, 185160, 183259, 182161, 182085, 182376, 182658, 183074, 183617, 184036, 184437, 185297, 186720, 188184, 189210, 189825, 190203, 190302, 190084, 189775, 189641, 189741, 190061, 190629, 191332, 191909, 192316, 192846, 193657, 194405, 194599, 194165, 193471, 192951, 192892, 193394, 194253, 194985, 195252, 195186, 195059, 194841, 194392, 193947, 193916, 194182, 194133, 193521, 192826, 192473, 192135, 191289, 190131, 189369, 189235, 189273, 189134, 189014, 189116, 189156, 188756, 187972, 187092, 186179, 185198, 184493]
54430A84493J56J121J398Q01L4nQ64J886K168J616R75Q01P90M11j23r9N86J220
54412A99093J247Q68N03K17m9j91j43l3J43N63J036R83L03k56r2L55L31m1l0M33
54392B05240P06N50N02Q76J140P82J77P4M79O26k3j176k141k504k242j552p35
54375B00779j48N3R7K90N34M43L0j09L91J032J029L60k25j89L48J039J675J997
54357B09426J780J216P19K66m73j268j342n85N2j41o44o33k40o7q0J34L58J1p35
54338B07754j073p58l62k87l25k98l44l79l3O25R52O81L35L70M69J47l98o02m04
54319B06070k26j83J44R72J785J807R16j54o74o88o46n02K88J722K894L060K580
54302B19165K273K235J998J558J425J707J905J774J671J815J788J060k45j508
$$ y = [184493, 184649, 185770, 187168, 187969, 188003, 187998, 188862, 190748, 192916, 194532, 195507, 196308, 197098, 197509, 197386, 197287, 197873, 199093, 200340, 201208, 201711, 201928, 201879, 201688, 201545, 201512, 201655, 202218, 203254, 204237, 204540, 204284, 204192, 204547, 204878, 204837, 204807, 205240, 205946, 206496, 206998, 207874, 209014, 209796, 209973, 210047, 210526, 211152, 211129, 209953, 207812, 205308, 203066, 201514, 200779, 200631, 200684, 200781, 201071, 201605, 202048, 202078, 201969, 202360, 203392, 204421, 204781, 204556, 204367, 204715, 205754, 207429, 209426, 211206, 212422, 213141, 213407, 212934, 211666, 210324, 209739, 209791, 209650, 209006, 208373, 208133, 208066, 207986, 208120, 208478, 208489, 207754, 206681, 205923, 205561, 205274, 204949, 204651, 204307, 203928, 203895, 204520, 205472, 206153, 206488, 206858, 207327, 207474, 207076, 206474, 206070, 205844, 205661, 205805, 206777, 208562, 210369, 211285, 211131, 210457, 209769, 209123, 208621, 208909, 210631, 213525, 216585, 219165, 221438, 223673, 225671, 227229, 228654, 230361, 232266, 234040, 235711, 237526, 239314, 240374, 240129, 238621]
54288B38621k260k538k704l003l214k901k074j319j043r87q32q02j087j244r55
54273B11658q68j581k229j458K80J002L9r49m63P94J364J238J326J604J312N64
54257B13633K95P41J105Q33J64n78j323j679j052L36J303J061J37m67n07m72o94
54240B12836r65r43n36K1K93l2p79j327j192m65L72R58J252J307J108O58J44j01
54222B12609K9K08m3p34j311j291q88o98q75r50n71o0Jm36q51q93q14r86j263
54203B00183j181p04l19k75j23N81J468J671R58Q5j26K69N30J36p12j378j377
54186A99686o81L25J156J473J296R58Q40R22P52J10m63k56M70O36j57r82r49m70
54168B04666l99n43j36N85N51l74j028o95m1J02m1N7J86o6l61r6N25P64M93L01
$$ y = [238621, 236361, 233823, 231119, 228116, 224902, 222001, 219927, 218608, 217565, 216578, 215746, 214944, 213857, 212613, 211658, 210790, 209209, 206980, 205522, 205802, 206804, 206843, 205894, 205431, 206225, 207589, 208827, 210153, 211757, 213069, 213633, 213928, 214669, 215774, 216607, 216771, 216193, 214870, 213191, 212139, 212475, 213778, 214839, 214976, 214509, 214002, 213530, 212836, 211871, 210928, 210392, 210413, 210706, 210674, 209895, 208568, 207376, 206911, 207283, 208241, 209493, 210800, 211908, 212566, 212710, 212609, 212638, 212846, 212803, 212069, 210758, 209467, 208579, 207881, 207006, 206056, 205485, 205425, 205426, 204990, 204139, 203246, 202432, 201446, 200183, 199002, 198298, 197979, 197704, 197581, 198162, 199630, 201301, 202259, 202344, 202218, 202487, 203017, 203153, 202441, 201063, 199686, 199005, 199330, 200486, 201959, 203255, 204213, 205053, 205975, 206727, 206837, 206374, 206118, 206588, 207224, 207067, 206085, 205136, 204666, 204267, 203724, 203588, 204173, 204724, 204350, 203322, 202627, 202586, 202688, 202647, 202704, 202890, 202824, 202463, 202367, 202892, 203656, 204149, 204450]
54148B04450N63J040J373J461J292Q94M53J56j19o14j193j369q56J09R74J305
54132B09919J046N38J69j2k58o52r24q02l06L89J100J601J771J812J926J814J009
54115B20140j78p69l84K78N36N24M83J12o52j002l40O25P89K09k70n25j072j781
54097B16723j880j302q36p81n57P5M42P4n47q25p87n65M2R22J363J084Q29J244
54079B14718J807J639Q87L50K34J59J62N71J069Q83J03k74J66O05L22j57L3P09
54061B23986R38M47r8j44J10K51K41K61L61N10P74J142J414J390J092P08M33M55
54043B34271Q62J543K280L014L744M246M243L954M035M696N307N292M961N039
54029B87487N611O164O448O653O754O341N249L877K773K217K221K529K533J807
$$ y = [204450, 205013, 206053, 207426, 208887, 210179, 211073, 211526, 211682, 211563, 210949, 209756, 208387, 207531, 207640, 208614, 209919, 210965, 211503, 211672, 211660, 211402, 210750, 209826, 209024, 208718, 209107, 210207, 211808, 213579, 215391, 217317, 219131, 220140, 219962, 219193, 218809, 219087, 219623, 220147, 220630, 220742, 220090, 219088, 218748, 219373, 220162, 220371, 220101, 219576, 218504, 216723, 214843, 213541, 212705, 211924, 211367, 211442, 211884, 211958, 211411, 210586, 209799, 209234, 209276, 210198, 211561, 212645, 213474, 214718, 216525, 218164, 219051, 219401, 219635, 219794, 219956, 220527, 221596, 222479, 222582, 222308, 222474, 223079, 223401, 223244, 223277, 223986, 224924, 225371, 225273, 225129, 225239, 225490, 225731, 225992, 226353, 226863, 227637, 228779, 230193, 231583, 232675, 233383, 233816, 234271, 235133, 236676, 238956, 241970, 245714, 249960, 254203, 258157, 262192, 266888, 272195, 277487, 282448, 287487, 293098, 299262, 305710, 312363, 319117, 325458, 330707, 334584, 337357, 339574, 341795, 344324, 346857, 348664]
54015C48664P51K43N01Q18N68j55j061k217l599m618m678l950l273l361m325n632
53999C14676o350n829m381k987k213j779j309q60m41K48J108J300L64q48j059
53984B89640j22R98J541J724K273L753O121Q550R989J0315J0634J1906J3707J4924
53970C85953J5172J4704J3364J0632O621K089k541p270j1635j4638j5844j5805
53958C80802j5200j4164j2711j1138r667q226o758n345l930k394j005j63K94Q95
53944B91290J577J721J313J224J968L029L900M989O739Q510R256Q934Q413Q174
53930C61037P908P388O953O850O656N691L836J690Pq65j044p44q7O88J039O12
53914D07615j03k7J364L436N108N872N891N498N016M785M912M974M378L011J330
$$ y = [348664, 349415, 349658, 350159, 350977, 351545, 351390, 350329, 348112, 344513, 339895, 335217, 331267, 327994, 324633, 320308, 314676, 308326, 302497, 298116, 295129, 292916, 291137, 289828, 288968, 288527, 288775, 289883, 291183, 291547, 290699, 289640, 289518, 290516, 292057, 293781, 296054, 299807, 305928, 314478, 324467, 334782, 345416, 357322, 371029, 385953, 401125, 415829, 429193, 439825, 446446, 448535, 445994, 438724, 427089, 412451, 396607, 380802, 365602, 351438, 338727, 327589, 317922, 309696, 302938, 297593, 293663, 291269, 290264, 290101, 290395, 291290, 292867, 294588, 295901, 297125, 299093, 302122, 306022, 311011, 317750, 326260, 335516, 344450, 352863, 361037, 368945, 376333, 383286, 390136, 396792, 402483, 406319, 408009, 408016, 407151, 406107, 405363, 405276, 405964, 407003, 407615, 407512, 407485, 408849, 412285, 417393, 423265, 429156, 434654, 439670, 444455, 449367, 454341, 458719, 461730, 463060]
53899D63060j94j382k121k238j795j316j379k045k873l526m122m909n812o559
53885D22789p129p717q287q433p877o884n967n426n260n308n272m849m073l436
53871C36871l355l672l928l899l685l397l138l120l455l890l996l630l019k471
53857B88216k156j983j605p91N4J28p63j862k438k587k595k157r50L98Q38K40
53841B69987n77r91j056r57q13r20j369j510o76O35J234R39P26J048J180O02o8
53824B67414j50L7n2j01N04J581K377K545K200J432L92l81l46M23J495K644L789
53807B85803M648M981N016N217N842P007Q913J1554J4406J6879J9044K1419K4077
53794D34806K6194K6540K4413K0159J4844R271L380l012r128j3551j5687j6248
$$ y = [463060, 462866, 461484, 459363, 457125, 455330, 454014, 452635, 450590, 447717, 444191, 440069, 435160, 429348, 422789, 415660, 407943, 399656, 391223, 383346, 376462, 370495, 365069, 359809, 354501, 349229, 344380, 340307, 336871, 333516, 329844, 325916, 322017, 318332, 314935, 311797, 308677, 305222, 301332, 297336, 293706, 290687, 288216, 286060, 284077, 282472, 281681, 281735, 281863, 281100, 279238, 276800, 274213, 271618, 269461, 268511, 268909, 269747, 269987, 269410, 268419, 267363, 266406, 265593, 264673, 263304, 261794, 261118, 261753, 262987, 263926, 264652, 265700, 266880, 267482, 267414, 267264, 267301, 267249, 267148, 267652, 269233, 271610, 274155, 276355, 277787, 278179, 277798, 277452, 277875, 279370, 282014, 285803, 290451, 295432, 300448, 305665, 311507, 318514, 327427, 338981, 353387, 370266, 389310, 410729, 434806, 461000, 487540, 511953, 532112, 546956, 556227, 559607, 556595, 547467, 533916, 518229, 501981]
53782E01981j6117j5439j4165j2693j1417j0202q902p935p681p765p503o802o013
53769C69347n281m623m403m959n913o369n924m980m076l334k585j825j329j337
53755C12409j588j390m12P74J481K009L158M676N257M384L065K208J349j69j743
53740C35468k372k311k645l626m550m978n100n029m683m210l739k956j735q73
53726B86661j177k062k174j247k21M01J045J837K113J619J059J010J116R72R53
53711B91905J561K565L365L813M157M516M729M492L490J770J27m29K35J237J789
53696C29322J941K116K434K744K911K875K737K844L321L602L013J861J186J352
53682C64259J659J570J464J788K215K151J573Q24P4n44p44m75j44j07k91n56r37
$$ y = [501981, 485864, 470425, 456260, 443567, 432150, 421948, 413046, 405111, 397430, 389665, 382162, 375360, 369347, 364066, 359443, 355040, 350081, 344168, 337799, 331875, 326895, 322819, 319485, 316900, 315075, 313746, 312409, 310821, 309431, 309019, 309793, 311274, 313283, 316441, 321117, 326374, 330758, 333823, 336031, 337380, 337211, 335468, 333096, 330785, 328140, 324514, 319964, 314986, 309886, 304857, 300174, 295964, 292225, 289269, 287534, 286661, 285484, 283422, 281248, 280001, 279780, 280181, 281226, 283063, 285176, 286795, 287854, 288864, 289980, 290952, 291905, 293466, 296031, 299396, 303209, 307366, 311882, 316611, 321103, 324593, 326363, 326490, 326061, 326296, 327533, 329322, 331263, 333379, 335813, 338557, 341468, 344343, 347080, 349924, 353245, 356847, 359860, 361721, 362907, 364259, 365918, 367488, 368952, 370740, 372955, 375106, 376679, 377503, 377577, 377033, 376289, 375814, 375670, 375563, 375272, 374716, 373779]
53665C73779j309j323j057j106j630j912j369m54jj47m52o97q93q74n33j85k01
53648C59636m86p29q32p29j84O71J146Q68M58N87Q68N35j90l21L42R12P08O3l13
53629C63010p5P06J611J955J517J109J711K970L434K521J307J058J747K600L231
53614C90412L627L585K999K375K399L088L899M416M452L847K745J913K080L002
53600D34839L766L961L953L992L784L215K838L114L656L707L157K593K406K326
53586D81307J925J224O55N07N73L11o00j835k635k557j946j512j510j563j318
53571D71026r54r21j321j804k005j956j953k140k285k013j230l09K22J15m44j059
53555D50969j364j138l64O98J613K028J794R56k09j164j371p93J16R88J902K922
$$ y = [373779, 372470, 371147, 370090, 368984, 367354, 365442, 364073, 363619, 363618, 363471, 363019, 362322, 361429, 360555, 360022, 359837, 359636, 359150, 358421, 357589, 356860, 356676, 357347, 358493, 359361, 359819, 360406, 361274, 361809, 361619, 361298, 361640, 362552, 363260, 363323, 363010, 362935, 363641, 365252, 367207, 368724, 369833, 371544, 374514, 377948, 380469, 381776, 382834, 384581, 387181, 390412, 394039, 397624, 400623, 402998, 405397, 408485, 412384, 416800, 421252, 425099, 427844, 429757, 431837, 434839, 438605, 442566, 446519, 450511, 454295, 457510, 460348, 463462, 467118, 470825, 473982, 476575, 478981, 481307, 483232, 484456, 485111, 485618, 486191, 486502, 485902, 484067, 481432, 478875, 476929, 475417, 473907, 472344, 471026, 470072, 469151, 467830, 466026, 464021, 462065, 460112, 457972, 455687, 453674, 452444, 452135, 452357, 452472, 452028, 450969, 449605, 448467, 448103, 448801, 450414, 452442, 454236, 455192, 454983, 453819, 452448, 451655, 451771, 452759, 454661, 457583]
53539D57583L554L171J941Q97Q89J754K718L400M037M892N792O388O650O910P497
53524E18073Q494R771J1111J2229J2952J3417J4015J4932J5893J6634J7395J8640
53512F83556K0272K1501K1761K1336K0889K0591K0167J9569J9212J9457K0150
53501I08461K0795K1013K0762K0345K0197K0533K1173K1792K2309K2891K3585
53490A143856K4189K4502K4529K4373K4140K3985K4096K4457K4737K4532K3752
53479A411148K2716K1827K1160K0409J9350J8342J8067J8669J9309J8927J7389
53468A627313J5588J4313J3421J2289J0708Q945P061M705J704j468m189o362q321
53455A695707j0156j1592j2555j3408j4430j5455j6237j6857j7424j7739j7759
$$ y = [457583, 461137, 464308, 466249, 467146, 468035, 469789, 472507, 475907, 479944, 484836, 490628, 497016, 503666, 510576, 518073, 526567, 536338, 547449, 559678, 572630, 586047, 600062, 614994, 630887, 647521, 664916, 683556, 703828, 725329, 747090, 768426, 789315, 809906, 830073, 849642, 868854, 888311, 908461, 929256, 950269, 971031, 991376, 1011573, 1032106, 1053279, 1075071, 1097380, 1120271, 1143856, 1168045, 1192547, 1217076, 1241449, 1265589, 1289574, 1313670, 1338127, 1362864, 1387396, 1411148, 1433864, 1455691, 1476851, 1497260, 1516610, 1534952, 1553019, 1571688, 1590997, 1609924, 1627313, 1642901, 1657214, 1670635, 1682924, 1693632, 1702577, 1709638, 1714343, 1716047, 1714579, 1710390, 1704028, 1695707, 1685551, 1673959, 1661404, 1647996, 1633566, 1618111, 1601874, 1585017, 1567593, 1549854, 1532095]
53444A532095j8057j9188k0748k1736k1827k1597k1408k0831j9507j7837j6422
53433A312937j5280j4048j2497j0575q354o341n277n181n076m144k715j549o78
53420A221222L44J490K416L287M690O807R265J1660J3673J4932J5491J6180J7662
53407A339119J9383K0316K0603K1477K3468K5781K7655K9332L1255L3196L4794
53396A626379L6331L8325M0825M3512M6214M8837N1184N3115N4676N5919N6920
53385B152237N8043N9645O1315O2001O1270N9915N8977N8590N8139N7107N5316
53374B802555N2728M9524M6147M2938L9926L7094L4523L1955K8727K4570K0015
53363C210702J5570J0803M862k317r868j6987k3568k9876l5933m1402m5843m9023
$$ y = [1532095, 1514038, 1494850, 1474102, 1452366, 1430539, 1408942, 1387534, 1366703, 1347196, 1329359, 1312937, 1297657, 1283609, 1271112, 1260537, 1252183, 1245842, 1240565, 1235384, 1230308, 1226164, 1223449, 1221900, 1221222, 1221566, 1223056, 1225472, 1228759, 1233449, 1240256, 1249521, 1261181, 1274854, 1289786, 1305277, 1321457, 1339119, 1358502, 1378818, 1399421, 1420898, 1444366, 1470147, 1497802, 1527134, 1558389, 1591585, 1626379, 1662710, 1701035, 1741860, 1785372, 1831586, 1880423, 1931607, 1984722, 2039398, 2095317, 2152237, 2210280, 2269925, 2331240, 2393241, 2454511, 2514426, 2573403, 2631993, 2690132, 2747239, 2802555, 2855283, 2904807, 2950954, 2993892, 3033818, 3070912, 3105435, 3137390, 3166117, 3190687, 3210702, 3226272, 3237075, 3241937, 3239620, 3229752, 3212765, 3189197, 3159321, 3123388, 3081986, 3036143, 2987120]
53351B987120n1089n2472n3587n4625n5498n5799n5009n3133n1049m9792m9425
53340B405642m9147m8531m8114m8483m9308m9669m9011m7487m5613m3849m2202
53329A884228m0171l7357l4200l1565k9557k7388k4677k2130k0537j9769j9333
53318A577544j9277j9802k0426k0376j9590j8681j8011j7389j6572j5572j4452
53307A377396j3240j2030j0835r488p890o178m421k543p23N71J337K388M348O799
53293A325491Q955J0826J2952J5325J7388J9006K0568K2130K3255K3884K4644
53282A524424K5925K7167K7504K6762K5491K4210K2998K1785K0749K0096J9568
53271A786679J8432J6222J3282J0280P470M779K392M82j508m424q082j1286j3552
$$ y = [2987120, 2936031, 2883559, 2829972, 2775347, 2719849, 2664050, 2609041, 2555908, 2504859, 2455067, 2405642, 2356495, 2307964, 2259850, 2211367, 2162059, 2112390, 2063379, 2015892, 1970279, 1926430, 1884228, 1844057, 1806700, 1772500, 1740935, 1711378, 1683990, 1659313, 1637183, 1616646, 1596877, 1577544, 1558267, 1538465, 1518039, 1497663, 1478073, 1459392, 1441381, 1423992, 1407420, 1391848, 1377396, 1364156, 1352126, 1341291, 1331803, 1323913, 1317735, 1313314, 1310771, 1310048, 1310619, 1311956, 1314344, 1318692, 1325491, 1334446, 1345272, 1358224, 1373549, 1390937, 1409943, 1430511, 1452641, 1475896, 1499780, 1524424, 1550349, 1577516, 1605020, 1631782, 1657273, 1681483, 1704481, 1726266, 1747015, 1767111, 1786679, 1805111, 1821333, 1834615, 1844895, 1852365, 1857144, 1859536, 1860018, 1858510, 1854086, 1846004, 1834718, 1821166]
53258A821166j5758j8629k1492k3373k4489k5706k7170k8450k9518l0594l1393
53247A544594l1538l1358l1300l0941k9673k8052k7278k7441k7461k6782k5996
53236A226774k5732k5951k6495k7268k7720k7250k6241k5708k5634k4846k2802
53225I41127k0452j8814j7760j6764j5886j5310j4723j3873j3166j3026j3219
53214G68134j3367j3523j3805j4012j4159j4783j6052j7151j7115j5906j4178
53203F04083j2469j1113j0396j0209j0007r618r518r872r956r260q426q316q648
53190D76275q543p957p594p597p413o846o314o049n883n826o028o081n269l671
53176C85204k234j527j203q90q41j185j340q16j04p8p67j329j163m73J78M24J89
$$ y = [1821166, 1805408, 1786779, 1765287, 1741914, 1717425, 1691719, 1664549, 1636099, 1606581, 1575987, 1544594, 1513056, 1481698, 1450398, 1419457, 1389784, 1361732, 1334454, 1307013, 1279552, 1252770, 1226774, 1201042, 1175091, 1148596, 1121328, 1093608, 1066358, 1040117, 1014409, 988775, 963929, 941127, 920675, 901861, 884101, 867337, 851451, 836141, 821418, 807545, 794379, 781353, 768134, 754767, 741244, 727439, 713427, 699268, 684485, 668433, 651282, 634167, 618261, 604083, 591614, 580501, 570105, 559896, 549889, 540271, 530753, 520881, 510925, 501665, 493239, 484923, 476275, 467732, 459775, 452181, 444584, 437171, 430325, 424011, 417962, 412079, 406253, 400225, 394144, 388875, 385204, 382970, 381443, 380240, 379350, 378509, 377324, 375984, 375168, 375064, 374986, 374219, 372890, 371727, 371254, 371432, 371856, 372045]
53159C72045l81r21j116j030r86j013p53j9Q14J189J010O45L47on67j168j448
53142C66642j215o08p4q7p12j381j426r50p37j172j647j507j090j163j547j224
53126C50102J33J462J591N93n22j094j231j272j338j396j387j212q51n10m96q75
53110C41697j389j749j918k038k094j819j164o73r73j828k207j653r99j182j822
53095C18189j822j045l78j91P1N94O31j52q22n10J60n6j131j807j343l48K37K15
53077C10492j6j42k08l93o77p17k09N36P23P9o40n95L7M23L43L68Q26J292J284
53058C12806R33O37M72L34L51P77J528K082J966J186K24l36j41P42J837K459K163
53041C30020J198L57J60L45L63K02K77O34P99N00J6l03m27l50L1N38O71K70k29
$$ y = [372045, 371664, 370743, 369627, 368597, 367611, 366598, 365845, 365826, 366640, 367829, 368839, 369484, 369831, 369825, 369258, 368090, 366642, 365427, 364819, 364745, 364658, 363946, 362565, 361139, 360189, 359452, 358280, 356633, 355126, 354036, 352873, 351326, 350102, 350235, 351697, 353288, 353881, 353359, 352265, 351034, 349762, 348424, 347028, 345641, 344429, 343578, 343068, 342572, 341697, 340308, 338559, 336641, 334603, 332509, 330690, 329526, 328853, 327880, 326052, 323845, 322192, 321193, 320011, 318189, 316367, 315322, 314944, 314753, 314824, 315418, 316049, 315897, 315075, 314565, 314725, 314669, 313538, 311731, 310388, 310040, 310277, 310492, 310476, 310334, 310126, 309733, 309056, 308339, 308130, 308666, 309389, 309468, 308828, 308233, 308270, 308693, 309036, 309404, 310230, 311522, 312806, 313739, 314376, 314848, 315182, 315533, 316310, 317838, 319920, 321886, 323072, 323296, 322960, 322819, 323561, 325398, 327857, 330020, 331218, 331575, 331735, 332080, 332443, 332645, 332922, 333556, 334355, 334855, 334871, 334568, 334141, 333791, 333822, 334360, 335031, 335301, 335072]
53022C35072m95p47j179j437j162n97j55J46L46J71l55m65L38J219R27l71j181
53005C30075p13K39O11M22L21M94N91L84K8j27K40J152K073K256J528M92j73l54
52987C39539k77q2J48J74q7k65J34J049J762J615P72R0K20R09J357J242J037J196
52969C50533J479J451J289J551K182K414J793Q28L34M38N59K39k82m02M8M63J24
52952C65041r04j793j938j547j127p93m67l23n35q05p47n05n02o55n11k3L77M98
52934C52741M99L75l8m62l68Q1j5j006k061k206j498p24l64l63n28o83o43m37
52916C42300m26q15j289j355r26k83K82N65M51P3k11k55l02n54q10p98n30j33
52898C34984M21J019J177N21n66j163p37L70J291J339N47l58n94j36K66K6o24
$$ y = [335072, 334577, 333830, 332651, 331214, 330052, 329455, 329300, 329446, 329792, 329963, 329608, 329143, 329481, 330700, 331627, 331256, 330075, 329362, 329601, 330212, 330634, 330955, 331449, 332040, 332424, 332452, 332325, 332565, 333717, 335790, 338046, 339574, 340066, 339893, 339539, 339262, 339180, 339328, 339502, 339415, 339150, 339284, 340333, 342095, 343710, 344482, 344572, 344792, 345701, 347058, 348300, 349337, 350533, 352012, 353463, 354752, 356303, 358485, 360899, 362692, 363520, 363854, 364292, 364851, 365090, 364808, 364406, 364454, 364917, 365041, 364137, 362344, 360406, 358859, 357732, 356939, 356472, 356149, 355614, 354809, 354062, 353557, 353055, 352400, 351889, 351866, 352243, 352741, 353240, 353615, 353577, 353115, 352747, 352828, 352813, 351807, 349746, 347540, 346042, 345318, 344954, 344591, 344063, 343380, 342737, 342300, 341874, 341059, 339770, 338415, 337489, 337206, 337488, 338053, 338504, 338577, 338366, 338111, 337809, 337255, 336445, 335647, 335117, 334984, 335405, 336424, 337601, 338122, 337556, 336393, 335656, 336026, 337317, 338656, 339203, 338845, 338251, 338115, 338381, 338407, 337783]
52881C37783r99p76j76L66N31K80j0J29O63J009P84K30l40j005j777k114j514
52864C33064l64L80K67l94j121j583j473p29J38M19P1k57j20K49L21k00j267k434
52846C24967k973k521j665j358j677j769j192o32q74j662k108j882j362r17o15
52831C01760n90j057j721j762p16P78J485R11j85o47k07L85M42J59K10P87J481
52814C01513J955K333K859L532M154M445M085K952J383j04j391k715l988m704
52800C16309m686m416m314m134l502k640k043j688j201n99k84l02j89L33R21J051
52784B88616N95p7m22j11O05J008O99J95L27J075J568J266O45M29O83R62J065
52767B99128J142J280J326J130P12K93J85N24R60R26L21l10m52j62K03M75O00
$$ y = [337783, 336784, 336008, 335832, 336198, 336729, 337009, 336999, 337128, 337791, 338800, 339584, 339814, 339474, 338469, 336692, 334578, 333064, 332700, 333080, 333347, 332953, 331832, 330249, 328776, 328047, 328185, 328604, 328675, 328418, 328298, 328547, 328868, 328668, 327401, 324967, 321994, 319473, 317808, 316450, 314773, 313004, 311812, 311180, 310306, 308644, 306536, 304654, 303292, 302375, 301760, 301170, 300113, 298392, 296630, 295914, 296692, 298177, 299088, 298903, 298256, 298049, 298434, 298876, 299035, 299245, 300032, 301513, 303468, 305801, 308660, 312192, 316346, 320791, 324876, 327828, 329211, 329107, 327716, 325001, 321013, 316309, 311623, 307207, 302893, 298759, 295257, 292617, 290574, 288886, 287685, 287086, 286802, 286500, 286311, 286644, 287565, 288616, 289211, 289134, 288712, 288601, 289206, 290214, 290913, 291108, 291435, 292510, 294078, 295344, 295989, 296418, 297101, 298063, 299128, 300270, 301550, 302876, 304006, 304718, 305011, 305196, 305720, 306680, 307606, 307927, 307617, 307165, 307003, 307206, 307681, 308281]
52750C08281M66J74J66N74Q06K98m75m87M11J177R46M1o07o41m38l98n01m83j77
52731C09133L35Q03J076J286J655K125K333K008J216J97p80j426j545j249q89
52716C16278o92o25o21o69o87n32k20J09M72R49J372J412J113Q81Q63P03J75l56
52698C19925m19m6M22Q40J214J418J306R94P14N30M71O81J152J537J485J026L78
52681C33628l38q23n27O21J699J724R52N45R61J455J338R74J080J626J969J765
52665C48649J265Q44O94R05J400J738J365K30r57j292n47N82J182J033O95O74
52649C58460P38K95p13j675k087k158k468l162l690l386k221r05j70n0ML37P69
52632C37918J124J594K268K671K347J621J193J093P07j23p55p95p78j339k157
$$ y = [308281, 308747, 308921, 309087, 309661, 310467, 310765, 310290, 309803, 310214, 311391, 312337, 312378, 311771, 311130, 310692, 310294, 309793, 309310, 309133, 309468, 310271, 311347, 312633, 314288, 316413, 318746, 320754, 321970, 322167, 321387, 319961, 318416, 317167, 316278, 315586, 314961, 314340, 313671, 312984, 312452, 312232, 312341, 312813, 313762, 315134, 316546, 317659, 318540, 319403, 320106, 320281, 319925, 319506, 319460, 319882, 320722, 321936, 323354, 324660, 325654, 326368, 326898, 327369, 328050, 329202, 330739, 332224, 333250, 333628, 333290, 332467, 331940, 332561, 334260, 335984, 336936, 337481, 338442, 339897, 341235, 342209, 343289, 344915, 346884, 348649, 349914, 350758, 351452, 352357, 353757, 355495, 356860, 357090, 356133, 354841, 354294, 354876, 356058, 357091, 357786, 358460, 359198, 359493, 358780, 357105, 355018, 352860, 350392, 347230, 343540, 340154, 337933, 337028, 336858, 336808, 336812, 337149, 337918, 339042, 340636, 342904, 345575, 347922, 349543, 350736, 351829, 352536, 352413, 351658, 350863, 350085, 348746, 346589]
52617C46589k380j839j267j284j632j623j050m00k11m18m41P3P98J121Q71L52
52601C37259j61o17q32m06P44K046K748K613K037J558J470J701J896J770J452
52586C55278J366J606J771J512J071R28J108J182Q58K54l86r01j065o26K99J063
52570C65318J032L29k47j41K82K00o18j496j668j172p08q24j439k027k068j426
52554C53327n66k23n77r79q48o21j150k287k838k099p23K99P92J081J135P88K97
52537C44808L1k13p57j147n08J104K468K508J361o3j004j129m23P70J828K282
52521C51916K102J503P80L92P33J650K436K596K316K029J873J805J877J981J725
52506C77714R40O5n21j226k648m344n002m045k453j647j989k719l004k639j925
$$ y = [346589, 344209, 342370, 341103, 339819, 338187, 336564, 335514, 335114, 334903, 334485, 334044, 334117, 334915, 336036, 336907, 337259, 337098, 336481, 335649, 335243, 335987, 338033, 340781, 343394, 345431, 346989, 348459, 350160, 352056, 353826, 355278, 356644, 358250, 360021, 361533, 362604, 363532, 364640, 365822, 366680, 366934, 366548, 365647, 364582, 363956, 364255, 365318, 366350, 366679, 366432, 366291, 366573, 366773, 366155, 364659, 362991, 361819, 361111, 360287, 358848, 356821, 354753, 353327, 352761, 352538, 351961, 350982, 350134, 349513, 348363, 346076, 343238, 341139, 340416, 340715, 341507, 342588, 343723, 344511, 344808, 344839, 344626, 343869, 342722, 342214, 343318, 345786, 348294, 349655, 349592, 348588, 347459, 347036, 347806, 349634, 351916, 354018, 355521, 356301, 356693, 357426, 359076, 361512, 364108, 366424, 368453, 370326, 372131, 374008, 375989, 377714, 378654, 378719, 378198, 376972, 374324, 369980, 364978, 360933, 358480, 356833, 354844, 352125, 349121, 346482, 344557]
52491C44557j211o18k1O92J300J449J196J022J153J253J006O83P05R62J005P54
52475C55887N46N34N44M89N48Q69J410K078K717L025K813K308J850J414Q26K35
52459C78093j45n88j440k221k082j244j041k066l219l209k273j551j388j235q50
52444C53541o09o95p98p98r22j164j068m14L93Q47R42J026J235J302R12K11k06
52427C53735o2Lr24k648l744l194j529J0Q98J306J344J132J212J961K800K916
52411C55216K512K517L209M052M759N515O236O645P140Q484J0405J1565J1239
52398D39494J0019Q512O413L411N2k938n425p370q385q449q377q710q770p598
52384D01879n362l170j793j196j036r65o36R4J065K131L173L780L533K909L027
$$ y = [344557, 343346, 342728, 342707, 343399, 344699, 346148, 347344, 348366, 349519, 350772, 351778, 352461, 353166, 354128, 355133, 355887, 356433, 356967, 357511, 358000, 358548, 359417, 360827, 362905, 365622, 368647, 371460, 373768, 375618, 377032, 377858, 378093, 377948, 377360, 375920, 373699, 371617, 370373, 369332, 367266, 364047, 360838, 358565, 357014, 355626, 354391, 353541, 352932, 352237, 351439, 350641, 349719, 348555, 347487, 347073, 347466, 348313, 349255, 350281, 351516, 352818, 353730, 353941, 353735, 353673, 353676, 352752, 350104, 346360, 343166, 341637, 341647, 342545, 343851, 345195, 346327, 347539, 349500, 352300, 355216, 357728, 360245, 363454, 367506, 372265, 377780, 384016, 390661, 397801, 406285, 416690, 428255, 439494, 449513, 458025, 464438, 467849, 467901, 464963, 459538, 452168, 443783, 435334, 426957, 418247, 409477, 401879, 396517, 393347, 391554, 390358, 389322, 388357, 387721, 387815, 388880, 391011, 394184, 397964, 401497, 404406, 407433]
52369D07433M028M558L587J929J078J200J304R22M83L05K23K10M14O13L65k05
52353D28447m69j11O59J548K296K511K111J731K083K982L639L754L653L507L209
52338D61550K901K891L105L224L414M166N471O802P845Q623R035R026R139J0069
52324E47261J1591J2725J3014J2844J2540J2032J1524J1553J2118J2547J2568
52313F82317J2737J3495J4575J5674J6954J8511K0022K1388K2934K4611K5715
52302H88933K5947K6062K6848K7938K8369K7850K6864K5797K4632K3280K1723
52291A174243J9915J7925J6083J4649J3514J2420J1229R863Q264O628N266M073
52279A314072K649J093L7m21j103k529m006m596m462m374m376l845k663j430n38
$$ y = [407433, 411461, 416019, 419606, 421535, 422613, 423813, 425117, 426039, 426522, 426827, 427050, 427260, 427674, 428287, 428652, 428447, 427978, 427867, 428526, 430074, 432370, 434881, 436992, 438723, 440806, 443788, 447427, 451181, 454834, 458341, 461550, 464451, 467342, 470447, 473671, 477085, 481251, 486722, 493524, 501369, 509992, 519027, 528053, 537192, 547261, 558852, 571577, 584591, 597435, 609975, 622007, 633531, 645084, 657202, 669749, 682317, 695054, 708549, 723124, 738798, 755752, 774263, 794285, 815673, 838607, 863218, 888933, 914880, 940942, 967790, 995728, 1024097, 1051947, 1078811, 1104608, 1129240, 1152520, 1174243, 1194158, 1212083, 1228166, 1242815, 1256329, 1268749, 1279978, 1289841, 1298105, 1304733, 1309999, 1314072, 1316721, 1317814, 1317851, 1317430, 1316327, 1313798, 1309792, 1305196, 1300734, 1296360, 1291984, 1288139, 1285476, 1284046, 1283508]
52264A283508J42P04J113J724L078N002O700P906R242J1045J2663J3416J3699
52251A369942J4401J5599J6599J7085J7394J7633J7290J6120J4770J4021J3729
52240A544583J3165J2190J1392J0960J0192Q496O363M762L819K788J296q4p11
52227A629211r21j736l665o086p781q088p490p115p645q753r639r868r562r071
52213A531791q767q862q997q243o168l682k208j942j760r22M4N47J138K689M899
52198A489557O513O910O698O740P228P899Q552R046R082Q332O787M823K870J144
52184A582181l66j645k595l227l769m404m971n258n483o081o999p648p690p459
52170A514586p394p428p231o666n759m573l399k753k734k793k451k028k060k342
$$ y = [1283508, 1283650, 1284354, 1285467, 1287191, 1290269, 1295271, 1301971, 1309877, 1319119, 1330164, 1342827, 1356243, 1369942, 1384343, 1399942, 1416541, 1433626, 1451020, 1468653, 1485943, 1502063, 1516833, 1530854, 1544583, 1557748, 1569938, 1581330, 1592290, 1602482, 1610978, 1617341, 1622103, 1625922, 1628710, 1630006, 1629922, 1629211, 1628290, 1626554, 1622889, 1616803, 1609022, 1600934, 1593444, 1586329, 1578684, 1569931, 1560292, 1550424, 1540862, 1531791, 1523024, 1514162, 1505165, 1496922, 1490754, 1487072, 1484864, 1482922, 1481162, 1480240, 1480284, 1480831, 1481969, 1484658, 1489557, 1496070, 1502980, 1509678, 1516418, 1523646, 1531545, 1540097, 1549143, 1558225, 1566557, 1573344, 1578167, 1581037, 1582181, 1581815, 1580170, 1577575, 1574348, 1570579, 1566175, 1561204, 1555946, 1550463, 1544382, 1537383, 1529735, 1522045, 1514586, 1507192, 1499764, 1492533, 1485867, 1480108, 1475535, 1472136, 1469383, 1466649, 1463856, 1461405, 1459377, 1457317, 1454975]
52156A454975k160j390p41p39j051r65k43P50J493J756J754J923K402K767K506
52141A463037J708R60N73L24Q2J59P42J365J420J072J131K038L381M555N453O277
52125A494277P041P644Q244R050R871J0324J0501J0904J1603J2063J2077J2266
52113A615865J3202J4477J5278J5576J6071J7223J8979K1321K4256K7237K9346
52102A828831L0327L0800L1165L0920K9443K6950K4314K2163K0535J9061J7273
$$ y = [1454975, 1452815, 1451425, 1450684, 1449945, 1448894, 1447929, 1447686, 1448436, 1449929, 1451685, 1453439, 1455362, 1457764, 1460531, 1463037, 1464745, 1465705, 1466278, 1466602, 1466684, 1466843, 1467585, 1468950, 1470370, 1471442, 1472573, 1474611, 1477992, 1482547, 1488000, 1494277, 1501318, 1508962, 1517206, 1526256, 1536127, 1546451, 1556952, 1567856, 1579459, 1591522, 1603599, 1615865, 1629067, 1643544, 1658822, 1674398, 1690469, 1707692, 1726671, 1747992, 1772248, 1799485, 1828831, 1859158, 1889958, 1921123, 1952043, 1981486, 2008436, 2032750, 2054913, 2075448, 2094509, 2111782]
$$ [...]
##END NTUPLES=NMR SPECTRUM
##END=
