##TITLE=AC1476_ZJAMBMO302_8100948_ds12Kev9lv
##JCAMPDX= 6.0         $$ Bruker NMR JCAMP-DX V2.0
##DATA TYPE= NMR SPECTRUM
##DATA CLASS= NTUPLES
##ORIGIN= BRUKER
##OWNER= Administrator
$$ 1.72 TOPSPIN		Version 2.1
$$ 2013-08-15 16:52:07.740 -0700  Administrator@X
$$ Compression mode = diff/dup
##.OBSERVE FREQUENCY= 400.02188249412
##.OBSERVE NUCLEUS= ^1H
##.ACQUISITION MODE= SIMULTANEOUS (DQD)
##.ACQUISITION SCHEME= undefined
##.AVERAGES= 8
##.DIGITISER RES= 22
##SPECTROMETER/DATA SYSTEM= spect
##.PULSE SEQUENCE= zg30
##.SOLVENT NAME= COFFEE_meoh
##.SHIFT REFERENCE= INTERNAL, COFFEE_meoh, 1, 14.98509
##AUDIT TRAIL= $$ (NUMBER, WHEN, WHO, WHERE, PROCESS, VERSION, WHAT)
$$ ##TITLE= Audit trail, TOPSPIN		Version 2.1
$$ ##JCAMPDX= 5.01
$$ ##ORIGIN= Bruker BioSpin GmbH
$$ ##OWNER= Administrator
$$ $$ E:\/data/COFFEE/nmr/AC1476_ZJAMBMO302_8100948_ds12Kev9lv/20/pdata/1/auditp.txt
$$ ##AUDIT TRAIL=  $$ (NUMBER, WHEN, WHO, WHERE, PROCESS, VERSION, WHAT)
(   1,<2013-08-15 16:52:01.318 -0700>,<Administrator>,<X>,<go>,<TOPSPIN 2.1>,
      <created by zg
	started at 2013-08-15 16:50:55.256 -0700,
	POWCHK enabled, PULCHK disabled,
       configuration hash MD5:
       C8 4E 4E 5D D3 5C D8 9E 9F 52 82 E0 59 8A DE 15
       data hash MD5: 64K
       9B 33 A3 74 23 E4 A5 C1 E2 99 12 4A 3C E5 AF 99>)
(   2,<2013-08-15 16:52:04.224 -0700>,<Administrator>,<X>,<proc1d>,<TOPSPIN 2.1>,
      <Start of raw data processing
       efp LB = 0 FT_mod = 6 PKNL = 1 PHC0 = 0 PHC1 = 0 SI = 32K 
       data hash MD5: 32K
       CF A8 F5 E5 47 EA B5 EC D3 04 F8 7F D1 52 00 C0>)
(   3,<2013-08-15 16:52:04.521 -0700>,<Administrator>,<X>,<proc1d>,<TOPSPIN 2.1>,
      <pk PHC0 = 97.45422 PHC1 = 0 
       data hash MD5: 32K
       BB D8 79 1F BF AE BC 25 72 E0 53 7E F9 C3 C2 7A>)
(   4,<2013-08-15 16:52:04.615 -0700>,<Administrator>,<X>,<proc1d>,<TOPSPIN 2.1>,
      <abs ABSG = 1 
       data hash MD5: 32K
       4A 1F 79 5E 19 2C E9 15 19 F3 DC 08 BC 8A 33 44>)
(   5,<2013-08-15 16:52:04.678 -0700>,<Administrator>,<X>,<proc1d>,<TOPSPIN 2.1>,
      <abs ABSG = 2 
       data hash MD5: 32K
       DB 16 F4 F5 70 E8 8C 40 1D 63 AE 15 87 B0 49 5F>)
(   6,<2013-08-15 16:52:04.771 -0700>,<Administrator>,<X>,<proc1d>,<TOPSPIN 2.1>,
      <abs ABSG = 3 
       data hash MD5: 32K
       CB 34 BF FD 45 DE 20 20 9F 60 0E 96 6B BB CC 4C>)
(   7,<2013-08-15 16:52:04.849 -0700>,<Administrator>,<X>,<proc1d>,<TOPSPIN 2.1>,
      <abs ABSG = 4 
       data hash MD5: 32K
       8F 3E 72 74 55 4D F6 CD F7 77 21 32 C1 8D 1D 52>)
(   8,<2013-08-15 16:52:04.912 -0700>,<Administrator>,<X>,<proc1d>,<TOPSPIN 2.1>,
      <abs ABSG = 5 
       data hash MD5: 32K
       6B 46 02 59 C4 AD 7D 0B A0 50 0C 75 03 F7 57 F3>)
$$ ##END=
$$ 
$$ $$ hash MD5
$$ $$ D8 75 BC B8 BB FF 77 64 33 C7 83 C9 7E C7 1D F4
##$RELAX= 
##$RELAX= 
##$RELAX= 
##$RELAX= 
##$RELAX= 
##$RELAX= 
##$RELAX= 
$$ Bruker specific parameters
$$ --------------------------
##$DU= <E:\>
##$EXPNO= 20
##$NAME= <AC1476_ZJAMBMO302_8100948_ds12Kev9lv>
$$ [...]
##$TP= (0..7)
150 150 150 150 150 150 150 150
##$TP07= 0
##$TPNAME0= <>
##$TPNAME1= <>
##$TPNAME2= <>
##$TPNAME3= <>
##$TPNAME4= <>
##$TPNAME5= <>
##$TPNAME6= <>
##$TPNAME7= <>
##$TPOAL= (0..7)
0.5 0.5 0.5 0.5 0.5 0.5 0.5 0.5
##$TPOFFS= (0..7)
0 0 0 0 0 0 0 0
##$TUNHIN= 0
##$TUNHOUT= 0
##$TUNXOUT= 0
##$USERA1= <user>
##$USERA2= <user>
##$USERA3= <user>
##$USERA4= <user>
##$USERA5= <user>
##$V9= 5
##$VALIST= <valist>
##$VCLIST= <CCCCCCCCCCCCCCC>
##$VD= 0
##$VDLIST= <DDDDDDDDDDDDDDD>
##$VPLIST= <PPPPPPPPPPPPPPP>
##$VTLIST= <TTTTTTTTTTTTTTT>
##$WBST= 1024
##$WBSW= 4
##$XGAIN= (0..3)
0 0 0 0
##$XL= 0
##$YL= 0
##$YMAX_a= 650083
##$YMIN_a= -552972
##$ZGOPTNS= <>
##$ZL1= 120
##$ZL2= 120
##$ZL3= 120
##$ZL4= 120
##$ABSF1= 14.98509
##$ABSF2= -5.573092
##$ABSG= 5
##$ABSL= 3
##$ALPHA= 0
##$AQORDER= 0
##$ASSFAC= 0
##$ASSFACI= 0
##$ASSFACX= 0
##$ASSWID= 0
##$AUNMP= <proc_prof1d_extract_pilot.lims>
##$AXLEFT= 0
##$AXNAME= <>
##$AXNUC= <1H>
##$AXRIGHT= 0
##$AXTYPE= 0
##$AXUNIT= <>
##$AZFE= 0.1
##$AZFW= 0.1
##$BCFW= 0
##$BC_mod= 0
##$BYTORDP= 0
##$COROFFS= 0
##$CY= 15
##$DATMOD= 1
##$DC= 0
##$DFILT= <>
##$DTYPP= 0
##$F1P= 0
##$F2P= 0
##$FCOR= 0.5
##$FTSIZE= 32768
##$FT_mod= 6
##$GAMMA= 0
##$GB= 0
##$INTBC= 1
##$INTSCL= 1
##$ISEN= 128
##$LB= 0
##$LEV0= 0
##$LPBIN= 0
##$MAXI= 10000
##$MC2= 0
##$MEAN= 0
##$ME_mod= 0
##$MI= 0
##$NCOEF= 0
##$NC_proc= -8
##$NLEV= 6
##$NOISF1= 0
##$NOISF2= 0
##$NSP= 0
##$NTH_PI= 0
##$NZP= 0
##$OFFSET= 14.98509
##$PC= 1
##$PHC0= 97.45422
##$PHC1= 0
##$PH_mod= 1
##$PKNL= yes
##$PPARMOD= 0
##$PPDIAG= 0
##$PPIPTYP= 0
##$PPMPNUM= 2147483647
##$PPRESOL= 1
##$PSCAL= 4
##$PSIGN= 0
##$PYNMP= <proc.py>
##$REVERSE= no
##$SF= 400.02
##$SI= 32768
##$SIGF1= 0
##$SIGF2= 0
##$SINO= 400
##$SIOLD= 32768
##$SPECTYP= <>
##$SREGLST= <1H.CDCl3>
##$SSB= 0
##$STSI= 32768
##$STSR= 0
##$SW_p= 8223.68421052631
##$SYMM= 0
##$S_DEV= 0
##$TDeff= 65536
##$TDoff= 0
##$TI= <>
##$TILT= no
##$TM1= 0
##$TM2= 0
##$TOPLEV= 0
##$USERP1= <user>
##$USERP2= <user>
##$USERP3= <user>
##$USERP4= <user>
##$USERP5= <user>
##$WDW= 1
##$XDIM= 32768
##$YMAX_p= 455483822
##$YMIN_p= -661921
##$CURPLOT= <Network HP LaserJet P1505>
##$CURPRIN= <$Network HP LaserJet P1505>
##$DFORMAT= <normdp>
##$LAYOUT= <+/1D_H.xwp>
##$LFORMAT= <normlp>
##$PFORMAT= <normpl>
##$SURQMSG= 1
$$ End of Bruker specific parameters
$$ ---------------------------------
##NTUPLES= NMR SPECTRUM
##VAR_NAME=  FREQUENCY,     SPECTRUM/REAL,   SPECTRUM/IMAG
##SYMBOL=    X,             R,               I
##VAR_TYPE=  INDEPENDENT,   DEPENDENT,       DEPENDENT
##VAR_FORM=  AFFN,          ASDF,            ASDF
##VAR_DIM=   32768,         32768,           32768
##UNITS=     HZ,            ARBITRARY UNITS, ARBITRARY UNITS
##FACTOR=    0.250966925370066, 1,           1
##FIRST=     8223.43324360094, -29270,       -49541
##LAST=      0,             105946,          178641
##MIN=       0,             -661921,         0
##MAX=       8223.43324360094, 455483822,    0
$$ Real data points
##PAGE= N=1
##DATA TABLE= (X++(R..R)), XYDATA
$$ [...]
19513A54587G1288b98214A09173R7887a73608K3144C9271P5346b25575L4329a7544
19501c4687o4910L849p8030c6577r1086M6485D06812a25633d4725A187J15507
19490A16694p566c19017J42017G5268a65089f0029B20196H7719Q7250g0183D7945
19478G5690c96283H5414b9454j55989b0151B51870G4149L69818d9759A30029c71883
19466A09308c10790g9461A54915i6400A61728a22358A60291a09163j35870c4990
19455a95428e854j5867k26656j51140D4510c16516d6394H9777B0837a21747p4927
19444a96674j2346M0622c6275j44821j50470P5434A27734c45641O2447A47639
19433b20884A3906b84369A27625o1533h0888k11670a2783o6822l7011h618j7562
$$ y = [154587, 71288, -298214, 109173, 207060, -173608, -150464, 39271, 114617, -225575, -191246, -17544, -34687, -99597, -95748, -173778, -36577, -127663, -81178, 406812, -125633, -44725, 1187, 116694, 109128, -319017, -177000, 75268, -165089, -60029, 220196, 87719, 174969, -70183, 47945, 75690, -396283, 85414, -29454, -185443, -20151, 251870, 74149, 443967, -49759, 130029, -371883, 109308, -310790, -79461, 154915, -96400, 161728, -122358, 160291, -109163, -245033, -34990, -195428, -5854, -21721, -248377, -399517, 44510, -316516, -46394, 89777, 20837, -121747, -196674, -209020, -168398, -36275, -181096, -331566, -256132, 127734, -345641, -283194, 147639, -220884, 13906, -284369, 127625, 66092, -80888, -292558, -12783, -79605, -116616, -8618, -26180]
19422b6180A22249h9127j0593A13828N8512M9772A9839a18450j96122D77600f9039
19410i4335J9810k68226e4365a1525q4904A27647j5591i2677d0502A59455k875
19399A56580a88155m2591R257f2238A16171a3428l24492A21990K3405a18419K5192
19388i3227p1064o3580a05103m6470k39556a75085K9259A42874b88891J02625
19378a86266F835O6390J10013a32787j76795g3833I9024K22730A991b26209g5739
19366d88411F8587Q5459a62848Q1209j93261a27017D28791b37646P0566h1866
19355c09192N8379b9338l18676j2240a04696j6819A55696a43129A48002b18755
19344G0952h3298G0804c20306B06074e28103a33520G1464g2397H0574b15058j14335
$$ y = [-26180, 122249, -89127, -99720, 113828, 172340, 222112, 19839, -118450, -314572, 477600, -69039, -94335, -74525, -342751, -54365, -11525, -96429, 127647, 112056, -92677, -40502, 159455, 156580, -188155, -230746, -221489, -62238, 116171, -13428, -337920, 121990, 145395, -118419, -93227, -164291, -227871, -105103, -151573, -391129, -175085, -145826, 142874, -288891, -186266, 6835, 73225, 183238, -132787, -309582, -73833, 99024, 321754, 1991, -226209, -75739, -488411, 68587, 154046, -162848, -81639, -274900, -127017, 428791, -237646, -167080, -81866, -309192, -250813, -29338, -348014, -360254, -104696, -121515, 155696, -143129, 148002, -218755, 70952, -83298, 70804, -320306, 206074, -528103, -133520, 71464, -72397, 80574, -215058, -329393]
19333c29393A63162a4943e463F1283J07462H0811f0100l51875a37301a4416l178
19322a7594k18083G0697a88712h8814K4310k52193a44678b9291q5942r7602Q4447
19311a28388j51197a20118P863j25495H6641a3615l7357m20419A93833b91235
19300a51473G5262C3065b65963G191e1019D3330j0933b88302E3388L88472A31628
19288A09011a88230c5165B47338b62133J12099F2298J59344a06234q7842J1860
19278a82216A56784a47912B5035C348b69649C7093a14916d948m66409a29843n7135
19267a86978p885k28671b00927M6904M0014J3809A96547a21372A48208a5957E015
19255A17987a75337P1718A28826E3759a44657j52075A49837E6317L1183k4283
$$ y = [-329393, 163162, -14943, -5463, 61283, 168745, 80811, -60100, -411975, -137301, -14416, -17594, -235677, 70697, -188712, -88814, -64504, -316697, -144678, -29291, -115233, -212835, -128388, -279585, -120118, -112255, -237750, 86641, -13615, -50972, -471391, 193833, -291235, -151473, 75262, 33065, -265963, 7191, -51019, 43330, 32397, -288302, 53388, 441860, 131628, 109011, -188230, -35165, 247338, -262133, -150034, 62298, 221642, -106234, -194076, -182216, 156784, -147912, 25035, 3348, -269649, 37093, -114916, -4948, -471357, -129843, -186978, -194863, -423534, -200927, -154023, -114009, -100200, 196547, -121372, 148208, -15957, 5015, 117987, -175337, -103619, 128826, 53759, -144657, -296732, 149837, 56317, 87500, 63217]
19245F3217a6216B47839b53034E138M9694b24282A07251J01499e0282j48662D5121
19233h5661A87809a65659a0087k07963M7191N8976j14982A57924a84866O2954
19223a21912N5800B17684e2139A10045K15369F5384k2941b41127G3428J08408
19213A81836f1796B55345a36869j68865j48069a89973P8982r5451l0467d4367
19202a8740H5515b75863h5423k43880a13028k6380A29908a72941f0269o1519R491
19191a12297E4883K3273a72472I9407M7950F4027L18429D6353J7309b16178f397
19179G9906A1360a42082j33401f1607D5801a18633e0319G5234a18039p2474j02284
19168b92797J00808H4989a76941k16898c9885A96863a29867j94663g4593b3827
$$ y = [63217, -16216, 247839, -253034, 5138, 54832, -224282, 107251, 208750, -50282, -198944, 45121, -85661, 187809, -165659, -10087, -218050, -170859, -111883, -226865, 157924, -184866, -121912, -66112, 217684, -52139, 110045, 325414, 65384, 42443, -241127, 73428, 181836, -61796, 255345, -136869, -305734, -453803, -189973, -110991, -206442, -236909, -44367, -18740, 85515, -275863, -85423, -329303, -113028, -139408, 129908, -172941, -60269, -121788, -112297, 54883, 78156, -172472, 99407, 147357, 64027, 382456, 46353, 63662, -216178, -6397, 79906, 11360, -142082, -275483, -61607, 45801, -118633, -50319, 75234, -118039, -190513, -292797, -191989, 84989, -176941, -393839, -39885, 196863, -129867, -324530, -74593, -23827]
19157a94089j77600A19048g7604n2571q8119D26435e9860J0971A14810H754i9743
19145b96177a24013N3841n9290o765j20317N7190o9806M948A69620b56684J06938
19134a49746j2844B23401a96437q3534D0827i1378m7231A43707E5121b14908D1087
19122C10170a69026A87149e5063B0335N7385b657A90467n1526c4691o1123K3861
19111g1953I2516a76769J8405A28703a28427a9716H2336f6482J3083j08603F1331
19099e01857a97213K9693B0168L3877L0859b39671R8201J42A11594c90975J81932
19088b09043K040C6906K890a9057c475r381p4241H7897b31822c6057D4253Q7953
19076A32206J00204b65869A11621B5192P291b51551i3717l2683k3725n5090B11967
$$ y = [-194089, -371689, 119048, -77604, -130175, -218294, 426435, -59860, -48889, 114810, 8754, -99743, -296177, -124013, -70172, -129462, -136227, -256544, -199354, -269160, -264212, 169620, -256684, -149746, -162590, 223401, -196437, -279971, 40827, -91378, -138609, 143707, 55121, -214908, 41087, 310170, -169026, 187149, -55063, 20335, 77720, -2657, 190467, 138941, -34691, -95814, -71953, 92516, -176769, -158364, 128703, -128427, -19716, 82336, -66482, -53399, -162002, 61331, -501857, -197213, -167520, 20168, 54045, 84904, -239671, -141470, -141328, 111594, -390975, -209043, -207003, 36906, 39796, -19057, -3475, -12856, -87097, 87897, -231822, -36057, 44253, 132206, 232410, -265869, 111621, 25192, 32483, -251551, -93717, -126400, -150125, -205215, 211967]
19064A48467B7248a47176k1861B2043J22864a6448m26080A71827d0718c313A45062
19052a52891j5999j33555b598A3930c79078e0025r7728H5657m0696b29315d7412
19040A92861f9419P287B08927j7997o8151e7963c497n60700I3573b7348C71382
19028a25463C1247N782r319a57911N5932j2831a087j72640f6293C5390d95663
19016D21432j11351p7454a53117j28337J21995F2969f4587e519k8045l0268I3537
19004C78499A08431b87571a23467A91158a54543M4581L4452l21130g87n3961j76907
18993b31655C07894b41032C93305a86422k12244E4041j1430h1879j1989G3328
18982G8601C8571J45324f2759k22639R6113B15805B9862I994M7445i0457j56312
$$ y = [148467, 27248, -147176, -169037, 22043, 144907, -16448, -442528, 171827, -40718, -3313, 145062, -152891, -168890, -302445, -2598, 13930, -379078, -50025, -147753, 85657, 44961, -229315, -47412, 192861, -69419, -62132, 208927, 190930, 122779, -57963, -3497, -564197, 93573, -27348, 371382, -125463, 31247, 37029, 27710, -157911, -101979, -114810, -1087, -173727, -66293, 35390, -495663, 421432, 310081, 232627, -153117, -281454, -159459, 62969, -64587, -5519, -33564, -63832, 93537, 378499, 108431, -287571, -123467, 191158, -154543, -109962, -75510, -396640, -787, -54748, -231655, 307894, -241032, 393305, -186422, -398666, 54041, 42611, -81879, -93868, 73328, 78601, 38571, 183895, -62759, -285398, -189285, 215805, 29862, 9994, 57439, -90457, -246769]
18971b46769B03041a53750D8457K47986d1783A37040c32492d449B73093b0316
18960E4677E227b44223J08387L6346j593B22010b04016Q9602l0740j29471L1416
18949b43209K4216i0644I2333O8351B5401g8692B11698B5331b84582F3036N9589
18938A22625b06869Q5238A27743f5600E0119g7384K9652j68015B15802n3008q0127
18927H2667c5438A04294J2039a38283b3943k65109a09146k4338c2175k4079I0110
18915B03070a99775B69466h6167a9815k66986B44488r7692K4657e3312r6628D4729
18903a4697B17432a22254E0130b73218B06018A2117h5363e938n6090A63189M6997
18892B10186d0052A12266a60353b4860k29103A58652g6110n8742n8899A7002b11337
$$ y = [-246769, 203041, -153750, 48457, 296443, -41783, 137040, -332492, -4449, 273093, -20316, 54677, 5227, -244223, -135836, -99490, -101083, 222010, -204016, -114414, -145154, -274625, -243209, -218993, -90644, 92333, 160684, 25401, -78692, 211698, 25331, -284582, 63036, 122625, -206869, -121631, 127743, -65600, 50119, -77384, -47732, -215747, 215802, 162794, 82667, -35438, 104294, 116333, -138283, -23943, -289052, -109146, -133484, -32175, -56254, 90110, 203070, -199775, 269466, -86167, -19815, -286801, 244488, 146796, 171453, -53312, -149940, 44729, -14697, 217432, -122254, 50130, -273218, 206018, 12117, -85363, -5938, -62028, 163189, 210186, -40052, 112266, -160353, -24860, -253963, 158652, -76110, -134852, -193751, 17002, -211337]
18880c33251E4868a53229d5983M652j34649A17792a8473A17776b42669k4171j21549
18869c88389D0372a23616n85d1419A56652i2319m4618c2733G5214a81487e3620
18857a20808N8773n0736e0355n0271J9842F1972a48386B35123b02747D2718J36636
18846A79354C3662c43152J55776h5674A95779a68181l16587a85656B8872b90284
18835C8237d5879m2520A15555e3651A13051a76243H1087a92691e7646H1986a40170
18823h1017A63720a72176C5792K07377b73714C70674A36467b40497P5970b9959
18812b12244n374B97389h5299E57179B07740p9996K0401L3536m2780j1990L13303
18801D40214a34022A25560b57863B2651b51029J20249K9261k8083j3714D2532
$$ y = [-333251, 54868, -153229, -45983, -41331, -175980, 117792, -18473, 117776, -242669, -266840, -388389, 40372, -123616, -124201, -41419, 156652, -92319, -136937, -32733, 75214, -181487, -53620, -120808, -62035, -112771, -50355, -100626, -80784, 61972, -148386, 235123, -202747, 42718, 179354, 33662, -343152, -187376, -85674, 195779, -168181, -484768, -185656, 28872, -290284, 38237, -45879, -88399, 115555, -53651, 113051, -176243, 81087, -192691, -57646, 81986, -140170, -81017, 163720, -172176, 35792, 243169, -273714, 370674, 136467, -240497, -164527, -29959, -212244, -217618, 297389, -85299, 557179, 207740, 127744, 148145, 181681, 138901, 126911, 440214, -134022, 125560, -257863, 22651, -251029, -130780, -101519, -129602, -143316, 42532]
18790G9602a5012B43068d0884m2790j25812a4747j81446g4575J7795O679C2492
18778G7238a56445a0786A11391a89808a1389j63422D9416b0385D5514K2757N7847
18767A26118A4701a84710A24465a55184e7762D673a65227B51585b53216A24002
18756e8480k0568j76244a1472A99378r4838b26907f5193k04396L8369L6137p6464
18745b71547i087p7708F6458O8961R2272a18386C11507F675J14035b46433h8819
18733a4410k5556n9440K4246c4276m8136K8699A48010b54258j4738A77824b78183
18721b5868G0900B0469a23080a7431A57597h9824A46827a89408C03665e1213k87673
18710c38886D2326a45762k09635R4761a0533B2921N3270a65038P772d7052j1181
$$ y = [79602, -15012, 243068, -40884, -83674, -209486, -14747, -196193, -74575, -56780, -50101, 32492, 77238, -156445, -10786, 111391, -189808, -11389, -174811, 49416, -20385, 45514, 68271, 126118, 14701, -184710, 124465, -155184, -57762, 4673, -165227, 251585, -253216, 124002, -58480, -79048, -255292, -11472, 199378, 104540, -226907, -65193, -269589, -231220, -195083, -271547, -9087, -86795, 66458, 135419, 227691, -118386, 311507, 6675, 120710, -246433, -88819, -14410, -39966, -99406, -75160, -34276, -82412, -53713, 148010, -254258, -268996, 177824, -278183, -25868, 70900, 20469, -123080, -17431, 157597, -89824, 146827, -189408, 303665, -51213, -338886, 42326, -145762, -355397, -260636, -10533, 22921, 76191, -165038, -157266, -47052, -58233]
18699e8233l4060m8455j86423A50066c15692a9837I5959a83831H3511c38719A21513
18687i296l63763J66595e0162a0838I7192N246a34055F6732C1975a87869e2796
18675a18106K6805K2464H0934g1964k48037J28422B88842d19453A79230e849l75502
18664c81351a9378B64845F4030A852J20270j6141P8404b794j00277l41k89473
18653c92885a02192B62356a51934A39850a88061j42974B15586d34842A45453a0329
18642a11022D1173Q33a76467d8199m8443k20579n8248B74528c36123K5301n9910
18631c70732B61959b65338B5624a34212o5773j05576A68001b09667g2202r5636
18621a67838b573F5598a47520a3259j48898A09822l8882O8305e4750r9583c0294
$$ y = [-58233, -92293, -140748, -327171, 150066, -315692, -19837, 95959, -183831, 83511, -338719, 121513, -9296, -373059, -206464, -50162, -10838, 97192, 102438, -134055, 66732, 31975, -187869, -52796, -118106, -91301, -68837, 80934, -71964, -320001, -191579, 288842, -419453, 179230, -5849, -381351, -19378, 264845, 64030, 1852, 122122, 105981, 184385, -2794, -103071, -103412, -392885, -102192, 262356, -151934, 139850, -188061, -331035, 215586, -434842, 145453, -10329, -111022, 41173, 42006, -176467, -48199, -96642, -317221, -375469, 274528, -336123, -310822, -370732, 261959, -265338, 25624, -134212, -199985, -305561, 168001, -209667, -72202, -167838, -2573, 65598, -147520, -13259, -162157, 109822, 70940, 139245, -54750, -154333, -30294]
18609a31750k46518A00991k5059h7498k49936A19206m3130J02292b65072P9465
18599a85607I1047M2041J20098h705F631c60775J65323r9039a28260E4233a49922
18587b86478A02359l2127e31847a53840a1999A16862a46069G8467g6994m5922
18577a22916N185k32515A89346J8789d44719e8531k35660e6092D8413J18165b01214
18565h204A4563Q4129c6994B62353a45288k46775O6609B11564p1373c18271a1794
18553i6493j06994B25455D9137K13268a4185j472G7717a94148m2105A2625a57266
18541a94359j75014E6644K9431a14391I2723a50347G6495a01471j27914i8984
18530a49181f3779H9534b33428P0170j5593A52265G5667j005K54207H4388N5191
$$ y = [-131750, -378268, 100991, 75932, -87498, -337434, 119206, 76076, 178368, -265072, -185607, 91047, 133088, 253186, -8705, 6631, -360775, -195452, -294491, -128260, 54233, -149922, -286478, 102359, 70232, -531847, -153840, -11999, 116862, -146069, 78467, -76994, -122916, -117731, -350246, 189346, 208135, -444719, -58531, -294191, -56092, 48413, 166578, -201214, -8204, 14563, 98692, -36994, 262353, -145288, -392063, -325454, 211564, 140191, -318271, -11794, -96493, -203487, 225455, 49137, 262405, -14185, -15657, 77717, -194148, -236253, 12625, -157266, -194359, -369373, 56644, 86075, -114391, 92723, -150347, 76495, -101471, -229385, -98984, -149181, -63779, 89534, -233428, -163258, -178851, 152265, 75667, 74662, 328869, 84388, 139579]
18519A39579c83235E2367d2475A14175b7486l32238A60531a26998e3147k55287
18509c08434g6131l7256k04270j3253l638a35631p624A0007J56563a28237a5968
18497a62962A13532b12957P0182A67753c46871B40577c71090I5244b08562K0214
18487a88348E2515L21721C4731d9391A35740P5300a9557B6022P4372g5685p0467
18476a46152p4020F4355c64270a3227C6959a25791l68472b0884m5704B46905J04337
18465C51242A29674g5082j19210j450C2115a37440M8034k33105l5805a3931l0595
18454d4526p8552B09328b47220a05352C7724K0399a2991j95365B7216K01315a91326
18442B10821j535a74978A57917P6749r0991b30442c6332k48762f9564f689j7449
$$ y = [139579, -383235, 52367, -42475, 114175, -27486, -359724, 160531, -126998, -53147, -308434, -76131, -113387, -317657, -330910, -334548, -135631, -143255, 10007, 166570, -128237, -15968, -162962, 113532, -212957, -142775, 167753, -346871, 240577, -371090, 95244, -208562, -188348, 52515, 374236, 34731, -49391, 135740, 211040, -19557, 26022, 100394, -75685, -146152, -220172, 64355, -364270, -13227, 36959, -125791, -494263, -20884, -66588, 246905, 351242, 129674, -75082, -194292, -195742, 32115, -137440, -89406, -322511, -358316, -13931, -44526, -123078, 209328, -247220, -105352, 37724, 58123, -12991, -208356, 27216, 228531, -191326, 210821, 209286, -174978, 157917, 234666, 143675, -230442, -36332, -285094, -69564, -6689, -24138]
18431b4138j1277j77383I8636D3661Q0577B6065a88100O9519j49707D0610b33144
18419a00599k21718A36671L2696c109B33808B2438a98314r8442C831J70792l012
18408A71611d9174k96083b0162I9115f8760B28323a32387j09785q9644D7364J27557
18397A74921o7801d1648l56691A38325A2921J10023K94576a74868A45718l8947
18387A06771J36943i4555E4915b40114C197P8953A8085O9727a48540I0797b78252
18375C5749e3098B69181a94685g591m04195R4383i5055A27715m715D8529e0420
18363a70911H3386a88890B58811a00851C1873L2839c15876J34371A86115a49590
18352c28138J59604A16920a79231F0688J26776d27177f3268k20479D4132b34778
$$ y = [-24138, -35415, -212798, 98636, 43661, 124238, 26065, -188100, -118581, -268288, 40610, -233144, -100599, -322317, 136671, 169367, -3109, 233808, 22438, -198314, -296756, 3831, 174623, 171611, -49174, -345257, -20162, 99115, -68760, 228323, -132387, -242172, -331816, 47364, 174921, 107120, -41648, -398339, 138325, 12921, 122944, 417520, -174868, 145718, 106771, 243714, -94555, 54915, -240114, 3197, 82150, 18085, 87812, -148540, 90797, -278252, 35749, -53098, 269181, -194685, -7591, -411786, -317403, -95055, 127715, 123000, 48529, -50420, -170911, 83386, -188890, 258811, -100851, 31873, 64712, -315876, -181505, 186115, -149590, -328138, -168534, 116920, -179231, 60688, 187464, -427177, -63268, -283747, 44132, -234778]
18341a45677C2115A3470a69481j06071d406k30316A9246d60726J72816J7813k01423
18330d71520g2218B29688c3774p5444A7776L7880j0653K5661a13078L7354A4694
18318A42775n6919g8238F9413a80932k9968d4973j02778f1157j6069A00765p816
18307I2949a21822A12529a46208L8646B40447c4440B03593a23314k14620N1075
18297b86859G9792b56922J12963K507o5189F6615h0465J973r668k99952A1202
18285b10031m6567D7073a39331A78974a97205I9029a08166B23384a66701A72437
18274b5202C2294a27060B48504a10724B7891j151K95677B2419d9841N690n1102
18263i5253c3368R594I5166k2950b7808D5505J04099l7637a80974o384j06463
$$ y = [-145677, 32115, 13470, -169481, -275552, -4406, -234722, 19246, -460726, -287910, -270097, -471520, -72218, 229688, -33774, -109218, 17776, 55656, 45003, 70664, -113078, -75724, 14694, 142775, 85856, -78238, 69413, -180932, -210900, -44973, -147751, -61157, -77226, 100765, 92949, -121822, 112529, -146208, -107562, 240447, -34440, 203593, -123314, -337934, -286859, 79792, -256922, -143959, -141452, -206641, 66615, -80465, -78492, -88160, -388112, 11202, -210031, -256598, 47073, -139331, 178974, -197205, 99029, -108166, 223384, -166701, 172437, -25202, 32294, -127060, 248504, -110724, 27891, 26740, 322417, 22419, -49841, -44151, -95253, -33368, -23774, 95166, 72216, -27808, 45505, 149604, 111967, -180974, -187358, -293821]
18252b93821g1711k3504r6790K0251M9692K2452B27271c88568a16758d9927B56860
18240C0401a76439d6908B03655B0577a99927O2935j32427B73208e1589j35267
18230a86856j72586M0125B23434a03378A2804a72344B6425a46672B34412F5100
18219A24438b10600A62810E0982a77814A54221b0743J422A94083a10972A13328
18208i4895A98174H0369a6791l28665A66062c40543B9039a19791n9320Q7104r2682
18197a84689A29511J18404c99561h5526j02858f4693j73475N5426k64794b02936
18186A09252K17d08E094M200K6754K52045j05787a25229d5341j09775H679h4124
18173a03998j08521B09201a56915N1815m6452O4193j12947B17160b96584J30891
$$ y = [-293821, -71711, -95215, -192005, -171754, -122062, -99610, 227271, -388568, -116758, -49927, 256860, 30401, -176439, -46908, 203655, 20577, -199927, -136992, -269419, 273208, -51589, -186856, -359442, -319317, 223434, -103378, 12804, -172344, 26425, -146672, 234412, 65100, 124438, -210600, 162810, 50982, -177814, 154221, -20743, -19321, 194083, -110972, 113328, -94895, 198174, 80369, -16791, -345456, 166062, -340543, 29039, -119791, -179111, -92007, -184689, 129511, 247915, -399561, -85526, -188384, -64693, -238168, -182742, -447536, -202936, 109252, 109469, -408, 5094, 9294, 36048, 288093, 182306, -125229, -45341, -155116, 8679, -84124, -103998, -212519, 209201, -156915, -105100, -151552, -87359, -200306, 217160, -296584, -165693]
18163a65693g4346l2811j3077r2185D8284c479l04776g3387k37797a47419F3189
18151a20776c6052A7507J91658D6407i2539B0650O2355l1957P726c22531A80368
18139b89229a08361A86453b1989j83074k23340h5514A16402A651h874r0660L1196
18128f8338A1013c9091j75774k19493a36502l81O2407q7844J7921d8449j56464
18117b04913e8686K171F4328a63696A27540E5696a76955O9618B87088i6923m5025
18106a41948k36594R6713l6400B5750K85784f7144o2246o5494C47310A42657m7798
18095I4859K5377D8055a07646J7894D01447A48647b51777A5069K13589r4932d91825
18083a89653C63581c18188j02917g7468B8700J58676a83363P8097k94491B73566
$$ y = [-165693, -74346, -107157, -120234, -212419, 48284, -3479, -308255, -73387, -311184, -147419, 63189, -120776, -36052, 17507, 209165, 46407, -92539, 20650, 83005, 51048, 58774, -322531, 180368, -289229, -108361, 186453, -21989, -205063, -428403, -85514, 116402, 1651, -8874, -99534, -68338, 11013, -39091, -214865, -434358, -136502, -136883, -74476, -162320, -144399, -48449, -204913, -58686, -56515, 64328, -163696, 127540, 55696, -176955, -107337, 287088, -96923, -141948, -378542, -281829, -318229, 25750, 311534, -67144, -129390, -194884, 347310, 142657, 94859, 120236, 48055, -107646, -89752, 401447, 148647, -251777, 15069, 228658, 133726, -491825, -189653, 363581, -318188, -421105, -77468, 28700, 187376, -183363, -105266, -399757, 273566]
18072H203M9327c3132D13659a5421B5257J07365C8836b69808A352a77694g2155
18060A01744A2037c30164A05575h6294c8868C08455c67614a56698r8550k0531
18050b75779R8705k7498b858C36508a73540j30855h6768j63201i1782d1786B35757
18038b14908J02965A14657K9743e7835A47224l7468a98419b1990A37621c45018
18027E5377a01205n1648c8471H1230a83043h226j46803P6990C37215j57696p7151
18016A02368d3919p4094A60062G3037a65799d492B08735l0287c38339a60343N3115
18005a07228A14268m75J32917a08507F6464O9956a14721B811a94730n6768q1751
17994c33249a54395P633H626b69758a2290G3893b1351k2507a2877A51796a31508
$$ y = [8203, 57530, -33132, 413659, -15421, 25257, 132622, 38836, -269808, 1352, -177694, -72155, 101744, 12037, -330164, 105575, -86294, -38868, 308455, -367614, -156698, -255248, -275779, -177074, -204572, -2858, 336508, -173540, -304395, -86768, -249969, -91782, -41786, 235757, -214908, -111943, 114657, 144400, -57835, 147224, 109756, -198419, -21990, 137621, -345018, 55377, -101205, -152853, -38471, 81230, -183043, -8226, -155029, -78039, 337215, 179519, 102368, -43919, -118013, 160062, 73037, -165799, -4492, 208735, 178448, -338339, -160343, -107228, 114268, 113793, 246710, -108507, 66464, 136420, -114721, 2811, -194730, -251498, -333249, -154395, -146762, 8626, -269758, -12290, 73893, -21351, -43858, -12877, 151796, -131508]
17982e6731k19792K137h4440B68935B1906e5772k5723B10910a4594k76981R1329
17971b00246N7657B14050B3903b2209m3073j8891o6669J2234C0293O5913a15477
17959a9386G63M15511A39803b0006H1201b67839h9740m4201O4039G7955b40008
17947d4384B39389G0431b56294h8722c3981j6978A57065M0438J14543E3204J19412
17936A72616c91950E6653j6913a73788d6243o4438A2715a50636P4441A02268l7256
17925F5012b64266e1672k06791A92707C8871n741f5752G8203b57336G645Q5205
17914I2850a33116F3949L08255G6733g8708G7350a61970a6634c309D44308I8671
17902a10479J6816K5208A50520k1529b2197n54j0858k43961a03676B16107c13782
$$ y = [-56731, -276523, -274386, -84440, 268935, 21906, -55772, -81495, 210910, -14594, -291575, -200246, -142589, 214050, 23903, -22209, -65282, -84173, -150842, -138608, 30293, 96206, -115477, -19386, 763, 416274, 139803, -20006, 81201, -267839, -89740, -133941, -69902, 77955, -240008, -44384, 239389, 70431, -256294, -88722, -33981, -50959, 157065, 197503, 312046, 53204, 172616, -391950, 56653, 39740, -173788, -46243, -110681, 12715, -150636, -76195, 102268, 65012, -264266, -51672, -258463, 192707, 38871, 33130, -65752, 78203, -257336, 7645, 92850, -133116, 63949, 372204, 76733, -78708, 77350, -161970, -16634, -3309, 444308, 98671, -110479, -93663, -68455, 150520, 128991, -22197, -22751, -33609, -277570, -103676, 216107, -313782]
17890a0417E8300j1500a49927J630A3845a12078K2053I4601B347d9935A61769
17878F9327C15i147k18077I7462a71022B22753a62273f3420f569a999l3041A40536
17865a83889m6047A06228c03344G4882J46130e5690p6756A25375a26478A0329
17854D9796J15167e8140A56109c2306D7821a14099A89076l78h1475k40964a50232
17842a17482j18003J7493d1875r5523A36091d9319Q277B7624F18a50817B26944
17830A30892J23783A03901m2781b0169l2734A01759k8653a84379A38816E9135
17819B15479i0838j09500A87175r1042h7999L4403j11450I6748i4086A08008h3804
17807c87310J60978A6279a98790N8396A69690a68449f2898H8679D2121K94957
$$ y = [-10417, 58300, 46800, -149927, -148297, 13845, -112078, -90025, 94601, 2347, -49935, 161769, 69327, 315, -9147, -227224, 97462, -171022, 222753, -162273, -63420, -6569, -1999, -35040, 140536, -183889, -229936, 106228, -303344, 74882, 221012, -55690, -132446, 125375, -126478, 10329, 49796, 164963, -58140, 156109, -32306, 47821, -114099, 189076, 188698, -81475, -322439, -150232, -117482, -235485, -217992, -41875, -137398, 136091, -49319, -41042, 27624, 618, -150817, 226944, 130892, 254675, 103901, 61120, -20169, -52903, 101759, 73106, -184379, 138816, 59135, 215479, -90838, -200338, 187175, 96133, -87999, -53596, -165046, 96748, -94086, 108008, -83804, -387310, -226332, 16279, -198790, -140394, 169690, -168449, -62898, 88679, 42121, 337078]
17797C37078E7303A7593J8968a37906A09999j6826J28339q4110b02486I0102k3841
17786F6261b66477a29281H6528C1402M616f8451n1674A88083e1255j38717j82892
17775c72864a47836A16573K13845F2151a85660g9569a6407j65325A7011K31990
17765B49001a14752d6261A64973G7552L6414a85578A41429d07813g5114j99511
17755b74625a3496B69434p1773k4452b3073j59743A18725J9122a78507D6466a38570
17743f3550k83149a49331B9067K51613b874G822h0323q9565h4105A07559E2259
17731C22021a39970n2815B78706j820q0996e2934D6192A4066M15607j46119I2998
17719B82791j15178L98984A06492i9412m968D960a06149I1832J13685p740R1677
$$ y = [337078, 57303, 17593, 36561, -137906, 109999, 93173, 221512, 137402, -202486, 90102, 66261, -266477, -129281, 86528, 31402, 36018, -68451, -120125, 188083, -51255, -189972, -372864, -147836, 116573, 330418, 62151, -185660, -79569, -16407, -181732, 17011, 249001, -114752, -46261, 164973, 77552, 113966, -185578, 141429, -407813, -75114, -274625, -13496, 269434, 197661, 173209, -23073, -182816, 118725, 137847, -178507, 46466, -138570, -63550, -346699, -149331, 29067, 280680, -2874, 7822, -80323, -169888, -84105, 107559, 52259, 322021, -139970, -192785, 278706, 276886, 195890, -52934, 46192, 14066, 429673, 283554, 92998, 282791, 167613, 566597, 106492, -99412, -104380, 4960, -106149, 91832, 205517, 197777, 289454]
17708B89454a01961B03962l8667c0632A61199e5462I642c77249c2159B49490b97716
17696A10397l7665b7721j91776M1123e8952n3393A11323B3824a31883A03278D6704
17684a38493F3395k3977J60307e6347F6329b29975E1617a9207l00290f5899k2239
17673h8138B69795a65026Q1256A4894d02451J31407k27479h2566b8057j21427
17663a49484f2254A8158L2417K9812c02990C82926j87676J06002a34489B00137
17652a25100N4391L699j42077D26333E3311J00756f2066B5218L82777b0160C4736
17640b8101E0206O2403b93424i9779A26703a34666r5622i4423B23948a45173A4191
17628A3549J80260a04901F0932P3901a6416j33649h203F9315K3064J34569r4721
$$ y = [289454, -101961, 203962, 165295, -30632, 161199, -55462, 9642, -377249, -32159, 249490, -297716, 110397, 72732, -27721, -219497, -178374, -58952, -112345, 111323, 23824, -131883, 103278, 46704, -138493, 63395, 39418, 199725, -56347, 66329, -229975, 51617, -19207, -319497, -65899, -88138, 269795, -165026, -83770, 14894, -402451, -271044, -498523, -82566, -28057, -149484, -62254, 18158, 50575, 80387, -302990, 382926, 195250, 301252, -134489, 200137, -125100, -70709, -67010, -209087, 426333, 53311, 154067, -62066, 25218, 407995, -20160, 34736, -28101, 50206, 112609, -293424, -99779, 126703, -134666, -230288, -94423, 223948, -145173, 14191, 13549, 193809, -104901, 60932, 134833, -16416, -150065, -8203, 69315, 92379, 226948, 132227]
17617A32227c2058A04427h8918m8150H887a11487i705A36353l307l7579J67177
17606B62644b14147m9926D06007B6232a90287A88840N0998j15461K6929F1391
17595B84615a63942O8457b2886A35022a64472p5123C1450N6638G500J35423h3112
17583b7960B71425a87340e5584J4205B1640b93077A61374g2375j78115I6246k4512
17572G1734J01235m3817a78355p7596D09065a39480f2297C41858a24566B56689
17561B3321K10753K02397b30785E7908J27398C541K50426l9642a6111A08693D1615
17549b80076f5779K585H1113e5969n042J0105B54454H3793a2464e191l10625b6253
17536B28025r8174d1873a6606A6935h8691B27752F3960N4509J63030e3137A1204
$$ y = [132227, -32058, 104427, -88918, -137068, 8887, -111487, -9705, 136353, 133046, 95467, 262644, -214147, -264073, 406007, 26232, -190287, 188840, 239838, 124377, 151306, 61391, 284615, -163942, -95485, -22886, 135022, -164472, -239595, 31450, 88088, 7500, 142923, -83112, -27960, 271425, -187340, -55584, -41379, 21640, -293077, 161374, -72375, -250490, 96246, 71734, 172969, 129152, -178355, -255951, 409065, -139480, -62297, 341858, -124566, 256689, 23321, 234074, 436471, -230785, 57908, 185306, 3541, 253967, 214325, -16111, 108693, 41615, -280076, -65779, -63194, 81113, -55969, -61011, -50906, 254454, 83793, -12464, -5191, -315816, -26253, 228025, 129851, -41873, -16606, 16935, -88691, 227752, 63960, 118469, 281499, -53137, 11204]
17524b3241j9199A09972I144Q7770b8226B38086a18444B11804i6415K4480q5359
17513a57294L906A50196J15673R6770j60425l4663b8156A2415J12935K01411A28083
17501C05902F7647K1071c19855J46639A24707j6946J46774o712g3648j40719E9778
17489g1967K5571C34791I8795c2877I2074k5229K05960H0239a24869A8746J7710
17478C6456K7845a18467B1885J16856n5150L06828A16182E2440J54688R4828k7428
17467B74528p9120J67684j04338g8679J8225A27442O8923J8716E9458L01022p2919
17456B87561A34626K2764N7941l5742M17269B32193Q3635G7232J47555K26268
17446D51055f5098A92004M4157J72434H0311K02086a88770E2000J13811J95398
$$ y = [-23241, -42440, 109972, 9144, 96914, -28226, 238086, -118444, 211804, -96415, -71935, -157294, -153388, 150196, 265869, 362639, 202214, 167551, -28156, 12415, 125350, 326761, 128083, 305902, 67647, 88718, -319855, -173216, 124707, 107761, 254535, 247823, -73648, -214367, 59778, -71967, -46396, 334791, 98795, -32877, 92074, 66845, 272805, 80239, -124869, 18746, 36456, 64301, -118467, 21885, 138741, 83591, 390419, 116182, 52440, 207128, 301956, 274528, 195408, 363092, 258754, -78679, -60454, 127442, 196365, 215081, 59458, 360480, 287561, 134626, 157390, 215331, 179589, 596858, 232193, 315828, 77232, 224787, 451055, -65098, 192004, 236161, 408595, 80311, 282397, -188770, 52000, 165811, 361209]
17436C61209A65870k2996O4428q6187J03981j02504O4398g6907A12507J15854
17426B28361E6748J63985m8732J6722R2343f9964B23269J5596J08841A00677P7082
17415A77759F8162R5831M16751a15171B59517p7140p4353J19775a27688N0312
17405g7376A14821i0765l6287B35158n9465E9527J21803n5085l6698M1509K68378
17394C99434n9169c4703A05290K72932A51177A4895K23607p0803f0932G27583
17383A65490q2493J12919O5521j778M1B7490a7270C2417J3273K7945J98930a49604
17370D07905A83510e2214D02625J31558C5563J66277k6239a26355B56504F7778
17359B95311A8675a73922C47903h6673C16977e0819B13690a66104c2522A7622
$$ y = [361209, 165870, 142874, 207302, 121115, 225096, 122592, 186990, -76907, 112507, 228361, 56748, 220733, 172001, 188723, 281066, -69964, 223269, 238865, 347706, 100677, 177759, 68162, 163993, 580744, -115171, 259517, 182377, 108024, 227799, -127688, -77376, 114821, -90765, -127052, 235158, 175693, 59527, 181330, 126245, 89547, 131056, 399434, 340265, -34703, 105290, 378222, 151177, 14895, 238502, 167699, -60932, 727583, 165490, 82997, 195916, 261437, 259659, 259700, 27490, -17270, 32417, 45690, 73635, 272565, -149604, 407905, 183510, -52214, 402625, 534183, 35563, 201840, 175601, -126355, 256504, 67778, 295311, 18675, -173922, 347903, -86673, 316977, -50819, 213690, -166104, -32522, 17622]
17348A06168M2144a08647M630A52646K13654K7692A62852O5678E4414Q7791J43407
17337B85612K16688E2154K2226L69552k05857e8837C22580L0975A57151e3705
17326B39019a59008A64138J74193i5628J4693j28866B02975K39341H5685f3951
17315c29945B87492J26324A25705C3104L37983A11800J38623F3260J35655g6718
17304f8437j12512A31715K27721o2047R463a69790A33058Q8233D2530J55837b4185
17292A29788a20845E7568J43634G1272K38709k8805a75076A38734J36464K69887
17282E45085B11802K5861j00546n2516J76286j6225H1288m09P9031l7701b37571
17270A45348R776E6445c1203A47123J12677I2170c1879A59668J25153J49640b2046
$$ y = [106168, 148312, -108647, -104017, 152646, 366300, 393992, 162852, 228530, 54414, 142205, 285612, 502300, 52154, 74380, 443932, 238075, -58837, 322580, 353555, 157151, -53705, 239019, -159008, 164138, 338331, -95628, -80935, -209801, 202975, 442316, 85685, -63951, -329945, 287492, 413816, 125705, 33104, 371087, 111800, 250423, 63260, 198915, -76718, -68437, -180949, 131715, 359436, 297389, 306852, -169790, 133058, 221291, 42530, 198367, -24185, 129788, -120845, 57568, 201202, 71272, 309981, 281176, -175076, 138734, 275198, 545085, 211802, 237663, 137117, 84601, 260887, 244662, 81288, 80879, 159910, 122209, -237571, 145348, 155124, 56445, -31203, 147123, 259800, 92170, -31879, 159668, 284821, 434461, -22046]
17258A18348A0538J0252J79005q1721J35594a75693g4062F5030K50753a1229B15560
17246B46180J55629A42908J82092P6582b8392B34552Q0687A41505P0413J12315
17236C24233p2923m6791J37335f2748B9579M26647p8262a4127A76805J0168n0678
17225A36295E5412k6873K20223a08155N3911C34784k294E4485N4470J2429K40234
17214C61618A10357L5636M0296K57061c5454C42228a21415B77205p9221L9866
17204B37850F0966K48237c6691C47232J5821j3718K2906K1988H8553K10323I3871
17192A47465J77383K62781A60328K13545A09418J48310j7893r3667B8217P22520
17182G50737b3306A62389L68952j02060a68641C92089A67058J94130j35073I6694
$$ y = [118348, 10538, 20790, 199795, 118074, 253668, -175693, -74062, 65030, 315783, -11229, 215560, 246180, 401809, 142908, 325000, 401582, -28392, 234552, 315239, 141505, 211918, 324233, 251310, 204519, 341854, -62748, 29579, 456226, 377964, -14127, 176805, 186973, 136295, 55412, 28539, 248762, -108155, -54244, 334784, 332490, 54485, 108955, 121384, 361618, 110357, 145993, 186289, 443350, -35454, 342228, -121415, 277205, 197984, 237850, 60966, 309203, -36691, 347232, 363053, 349335, 372241, 394229, 88553, 298876, 93871, 147465, 324848, 587629, 160328, 373873, 109418, 257728, 239835, 146168, 28217, 750737, -23306, 162389, 531341, 429281, -168641, 392089, 167058, 361188, 226115, 96694]
17171C54994m1800Q5326j43207j17398k2179l9724J42066K05959a352B1782K05629
17160B27411J06726P9655A25003J44703J6370p020d2529C58838J05925M3771n2684
17149D55850B18863A4553f0581B05432O5072J87599j57103J0310c2138C88627
17138A78528o5420L66317j12203n9183l4714J34405p1569K47080J24800B44280
17127G7284K50966j43790J44997J9257n5314j41962K18091J88396B5813L16027
17117C41840j31639K00948j48606O3711F3244N90122l00395J6146k9869j03291
17107B35957J67613j05395O8396J24915l0940M9421M7377B13939P3070j32396
17097A54613J22073A28105M76034k24167B8586L41689L3359o5454K16177P4436
$$ y = [354994, 313194, 398520, 255313, 137915, 115736, 76012, 218078, 424037, -1352, 21782, 227411, 334137, 413792, 125003, 269706, 286076, 279056, -42529, 358838, 464763, 508534, 455850, 218863, 14553, -60581, 205432, 270504, 458103, 301000, 311310, -32138, 388627, 178528, 113108, 479425, 367222, 308039, 273325, 407730, 336161, 583241, 708041, 244280, 77284, 328250, 184460, 329457, 348714, 293400, 151438, 369529, 557925, 25813, 341840, 210201, 411149, 262543, 326254, 63244, 653366, 352971, 369117, 339248, 235957, 403570, 298175, 366571, 491486, 460546, 509967, 557344, 213939, 287009, 154613, 276686, 128105, 604139, 379972, 28586, 370275, 403634, 338180, 554357, 628793]
17087F28793B03155L88902k9353k00634k3027J28993K51864C52223j35588N7205
17077B73840J47016L8024J20530j79069J13356k15371L50139k37986J19442J55100
17067F85021l00740J42298J7172L844j2890m3801j63372L01744j71871L9132m7570
17056D48967B18744N52493j35571Q0957j46898j05327J1128k13346A9041L60649
17046C79690j83196N14067k49804R1214l8647O900j63425K60162J03950k70879
17036D50032q9307M2884M38396D17529K23547k56688K72897J08230p1209R924
17026G04230q8340J3422o7074J29506j14479J65090J32845K683j49791L09740
17016A037832j34086l64926N33444D77320k31662L27090N17520k73099l13619
$$ y = [628793, 203155, 592057, 562704, 362070, 339043, 468036, 719900, 352223, 216635, 273840, 420856, 458880, 579410, 400341, 513697, 298326, 648465, 410479, 529921, 685021, 384281, 526579, 543751, 547595, 534705, 490904, 327532, 629276, 457405, 496537, 448967, 218744, 771237, 635666, 716623, 569725, 464398, 475526, 262180, 19041, 379690, 196494, 710561, 460757, 551971, 513324, 520224, 356799, 616961, 720911, 450032, 360725, 403609, 842005, 417529, 641076, 384388, 657285, 765515, 694306, 704230, 615890, 629312, 562238, 691744, 577265, 742355, 875200, 877883, 728092, 1037832, 903746, 538820, 1072264, 477320, 245658, 572748, 1090268, 817169, 503550]
17007E03550N0846j15693J84584J66169L0133k90873J83270l2471j25768L24845
16997H78592o3755n6870K69463m15914J93221K38671l14011J79673l92236L03236
16987H20070k18597K97134K7637Q189j46807N9097j22701O4616k3303J04522o2953
16976H06904l7942P0863o1642K40294k9537J89828l31964K25072k45169L7961
16966H64668J23332k87091K66720K11920k08064n9166j08695J77707q6080L41893
16956A237144k17537k48275J98961K71175J1878k20899J19291Q1734j69119J51195
16946A215548j08785J91528m06036K06346R9374j66655L32483j689j28108k41522
16936I92484J71320K84087o8957o5830Q1904j64504K84435K0882j77804L095L37943
$$ y = [503550, 554396, 438703, 623287, 789456, 819589, 528716, 711986, 679515, 553747, 878592, 814837, 757967, 1027430, 611516, 804737, 1043408, 729397, 909070, 516834, 820070, 601473, 898607, 926244, 934433, 787626, 846723, 724022, 788638, 765335, 869857, 806904, 768962, 839825, 778183, 1018477, 988940, 1178768, 846804, 1071876, 826707, 864668, 988000, 700909, 967629, 1179549, 971485, 912319, 803624, 981331, 895251, 1237144, 1019607, 771332, 970293, 1241468, 1253346, 1032447, 1151738, 1233472, 1064353, 1215548, 1106763, 1298291, 892255, 1098601, 1197975, 1031320, 1363803, 1362114, 1234006, 992484, 1163804, 1447891, 1378934, 1313104, 1395008, 1230504, 1514939, 1535821, 1358017, 1361112, 1699055]
16925A699055k45433J28433K0826j95582P7775J26424j52202n6011N38272l77572
16915A563985l44205o1859L15438K35340r1025l22455J68957L74774m23645K21979
16905A637284j6530L62986j59329K73119l45225j82796K61744K5431K2147L5915
16895A914746J08927K14758k26141j12146K45708J6316J23214k71416P3192k7695
16885B059463K65753n39372O55581O1463j00035K59613l02570K37813J08532j44974
16875B561267J41983l25687L56009l29684Q2596J53007O4804K5197j42836K04024
16865B790680J81289n2278N40008m52146K06188k10794N9583M3974K41058O1797
16855C409359m9719J89432P7580L2029j13691K26130q7834K43904k13800M01325
$$ y = [1699055, 1453622, 1582055, 1602881, 1407299, 1485074, 1611498, 1459296, 1403285, 1941557, 1563985, 1219780, 1157921, 1473359, 1708699, 1617674, 1295219, 1464176, 1838950, 1415305, 1637284, 1620754, 1983740, 1824411, 2097530, 1752305, 1569509, 1831253, 1856684, 1878831, 1914746, 2023673, 2238431, 2012290, 1900144, 2145852, 2162168, 2285382, 2013966, 2087158, 2059463, 2325216, 1785844, 2441425, 2502888, 2402853, 2662466, 2359896, 2597709, 2706241, 2561267, 2703250, 2377563, 2733572, 2403888, 2486484, 2639491, 2704295, 2729492, 2586656, 2790680, 2971969, 2919691, 3459699, 3007553, 3213741, 3002947, 3062530, 3106504, 3347562, 3409359, 3359640, 3549072, 3626652, 3658681, 3544990, 3771120, 3683286, 3927190, 3713390, 4114715]
16845D114715k05774L09088k58804K06695q3864Q3115j56933K13697K21113L1820
16835D474868L97615l22705L72959M5530j62865j31892L17971L85039J84505m22396
16825E138629M70405o4632N6807K32262o0230N14275J36111J57707o44879N91734
16815F528189j31068N44934M4203J69753J45585Q8394K06587K12445k682M00937
16805H207277p0979L14496K43655K17860J35938J83803L49624l1033K43176N69826
16795A0363643j13094P12526m3206L24668O22536L08337K66392J79063M65983
16786A3086848L54311O34561P4550N61180k49481J118047K90365N51618K01380
16777A6623379M25342J054510M84234Q20808M30653M83689R21598P04015N75734
$$ y = [4114715, 3908941, 4218029, 3959225, 4165920, 4082056, 4165171, 4008238, 4221935, 4443048, 4474868, 4872483, 4549778, 4922737, 4968267, 4805402, 4673510, 4991481, 5376520, 5561025, 5138629, 5609034, 5544402, 5601209, 5833471, 5773241, 6287516, 6423627, 6581334, 5936455, 6528189, 6397121, 6942055, 6986258, 7156011, 7301596, 7389990, 7596577, 7809022, 7806340, 8207277, 8136298, 8450794, 8694449, 8912309, 9048247, 9232050, 9581674, 9550641, 9793817, 10363643, 10250549, 10963075, 10919869, 11244537, 11867073, 12175410, 12441802, 12620865, 13086848, 13441159, 14075720, 14150270, 14711450, 14461969, 15580016, 15870381, 16421999, 16623379, 17048721, 18103231, 18587465, 19408273, 19838926, 20322615, 21244213, 21948228, 22523962]
16768B2523962R63799J362847N76723J230327R57924Q20863J046817J355400J103847
16759C1942509J675728J603116J257095J368713J872986J989861K132811J544387
16751D5387206K459680K165661K547570K530067K810731K611758L210863L429654
16743F7153190L489396M038316L717218M215107M832261M327397M796306M817425
16735A01386616N764639N586030N627343N858609N709264N940781N694862N704775
16727A47272919N366618M747917M590613L473157L384944K219816J384044M11459
16719A72851487j81378j771461j710173l393259l833092m221009m739341n403581
16711A47598193n356771o156295n853320n612469n819235o049964n403828n396091
$$ y = [22523962, 23487761, 24850608, 25427331, 26657658, 27615582, 28436445, 29483262, 30838662, 31942509, 33618237, 35221353, 36478448, 37847161, 39720147, 41710008, 43842819, 45387206, 47846886, 50012547, 52560117, 55090184, 57900915, 60512673, 63723536, 67153190, 70642586, 74680902, 78398120, 82613227, 87445488, 91772885, 96569191, 101386616, 107151255, 112737285, 118364628, 124223237, 129932501, 135873282, 141568144, 147272919, 152639537, 157387454, 161978067, 165451224, 168836168, 171055984, 172440028, 172851487, 172670109, 170898648, 169188475, 165795216, 161962124, 157741115, 153001774, 147598193, 142241422, 136085127, 130231807, 124619338, 118800103, 112750139, 107346311, 101950220]
16703A01950220n283571m943732m591913m582031m250302m163561l577163l451951
16695F7105996l598533l012676l077587k792054k517008k369494k430063k225089
16687D5083492j728207k199603j546324k018796j588929j467252j593885j197147
16679C1743349j583285p86300j014536j381395q61066j006898q38565q27655j158665
16670B2284984p53264n33292q13563p63821p10062l92698q08875p43750M8508
16661A6814167p57396o91243o79600r9849o02815l11802j63672o46095j64658
16652A2697037n04424k93623j37672o41376l36954N02k45384m66504q036n70638
16642I492928j02721j02819l6963j41346m43195k35607j71878m64617k3399n8910
$$ y = [101950220, 96666649, 91722917, 87131004, 82548973, 78298671, 74135110, 70557947, 67105996, 63507463, 60494787, 57417200, 54625146, 52108138, 49738644, 47308581, 45083492, 43355285, 41155682, 39609358, 37590562, 36001633, 34534381, 32940496, 31743349, 30160064, 29373764, 28359228, 26977833, 26116767, 25109869, 24271304, 23443649, 22284984, 21531720, 20998428, 20184865, 19421044, 18710982, 18318284, 17509409, 16765659, 16814167, 16056771, 15365528, 14685928, 14586079, 13983264, 13671462, 13507790, 12861695, 12697037, 12192613, 11898990, 11761318, 11119942, 10782988, 10783490, 10538106, 10071602, 10063566, 9492928, 9390207, 9287388, 9250425, 9109079, 8665884, 8430277, 8258399, 7793782, 7770383, 7711473]
16632G711473k14873k29600m18569J63681J01225n52775J81188m13463k86160
16623F042127M20471l65204k33010p9928j39086j41719n5486M679n9238l53226
16613E040380L32631m02661k08242N4283l6290l7234N070l12936k37150K58319
16603D456170k84508Q1809k13670j5202R3156m54k61827j33853P9376k37748J98531
16592C761780l0034j65930k21048k5268K13039l75920J96230k104k93689K15423
16582C272479k02611l22887L19720l7816n4800j16602J81971k58926J47568j77626
16572B750470Q5363M0377k66707N8014k18696J82774j17834n3458q9732N3979
16562B424550j51717J37168n09538N15202l00743o956r7225j53596M16283m0206
$$ y = [7711473, 7496600, 7267000, 6848431, 7012112, 7113337, 6560562, 6741750, 6328287, 6042127, 6462598, 6097394, 5864384, 5784456, 5645370, 5503651, 5448165, 5452844, 5393606, 5040380, 5373011, 4970350, 4762108, 4816391, 4780101, 4742867, 4747937, 4435001, 4197851, 4456170, 4171662, 4253471, 4039801, 4024599, 4117755, 4117301, 3855474, 3721621, 3800997, 3563249, 3761780, 3731746, 3565816, 3344768, 3319500, 3532539, 3156619, 3352849, 3350745, 3057056, 3272479, 3069868, 2746981, 3066701, 3028885, 2974085, 2857483, 3039454, 2780528, 2928096, 2750470, 2835833, 2876210, 2609503, 2667517, 2448821, 2631595, 2513761, 2460303, 2370571, 2424550, 2272833, 2410001, 1900463, 2415665, 2114922, 2107966, 2010741, 1857145, 2273428, 2233222]
16552B233222j37498m33425P16477m0200l14863j68255J87322m02130K36324l07462
16542A569512L22187K0405j01743j63160J99064k19710K19074j87607J4485K72971
16532A945478j01398j63511j6157J65366l45619n1793J07621J02864k14160J74380
16522A603071p7711j62622r7637J62649L12095k60930O2709j24110J95140n4419
16512A558235j64693M0554J80014m01487N7664K61701m28868M05641q7613N3997
16502A475145J22180n52094J31650J12101q8193j3783r5586J17489k09081M18966
16492A418794r4540l91636M801L37005o6511O4164Q8378p2035k33902j80405k2260
16481H51853P4663M20639l08425j53869J31644J86229N497R4386n7711l71349
$$ y = [2233222, 2095724, 1662299, 2378776, 2338576, 2023713, 1855458, 2042780, 1640650, 1876974, 1569512, 1891699, 1912104, 1810361, 1647201, 1846265, 1626555, 1845629, 1658022, 1672507, 1945478, 1844080, 1680569, 1664412, 1829778, 1484159, 1432366, 1539987, 1642851, 1428691, 1603071, 1525360, 1362738, 1265101, 1427750, 1739845, 1478915, 1541624, 1417514, 1612654, 1558235, 1393542, 1434096, 1614110, 1212623, 1270287, 1531988, 1103120, 1508761, 1421148, 1475145, 1597325, 1045231, 1176881, 1288982, 1200789, 1187006, 1091420, 1208909, 999828, 1418794, 1324254, 932618, 937419, 1274424, 1207913, 1272077, 1360455, 1288420, 1054518, 874113, 851853, 926516, 1347155, 1038730, 884861, 1016505, 1202734, 1208231, 1302617, 1244906, 873557]
16471H73557J15997J46546n13120O24694F23223K52442j3999J24442l8925m7363
16461H99820K71805k75264o8714k92269O1151M7468L14234m9753j34006k87920
16451D86552M13738j87554J98961k44442K44320M202m5276k14919J72584K57150
16441A085316m54738J25615j28222L64362m79716L23212j8540k20243K67000r3960
16431G70086j85395O8218K38459j41512k24910L96019r7875j58042p2795j6630
16421E75623J3368J76691m0919l05900J94577O4820K298K2576j78622J50015j81856
16410D92671p0537N0P6867J837J76244k96283K86718k35545k0194K77524k47622
16399D41730J29608Q6244l14493L33309j63697j9390k19532L32022B93890N42722
$$ y = [873557, 989554, 1136100, 622980, 1247674, 623223, 875665, 861666, 986108, 947183, 899820, 1171625, 896361, 827647, 535378, 596529, 643997, 958231, 908478, 774472, 486552, 900290, 712736, 911697, 667255, 911575, 915777, 870501, 655582, 828166, 1085316, 630578, 756193, 627971, 992333, 512617, 835829, 817289, 597046, 864046, 770086, 584691, 652909, 891368, 749856, 524946, 920965, 823090, 665048, 592253, 575623, 588991, 765682, 724763, 418863, 613440, 678260, 680558, 703134, 524512, 674527, 492671, 422134, 422184, 499051, 500888, 677132, 380849, 667567, 432022, 411828, 689352, 441730, 571338, 657582, 343089, 676398, 512701, 493311, 273779, 605801, 293890, 836612]
16389H36612j50217j56459K39429j25134M4601j83610J23044o2324B73083K73473
16379E46556B73002L3832J37467o9800j29768K52290o6537M9922Q0385J92135
16369G52928l36078p3231p9058l2767K32538K96769l02282J5083r841r67J15614
16358E78708A45991M73386j29929J88054B34274K25602A129M91677m4730j26400
16348C21676p3380L82263A69431N4636K19633n8892j12863o6548K28324P0116
16338E03837j77637J8594L65287k66295B05440J22439L9967J01087k33380j2984
16328B22569K85914j94847J53486m7513o4299J75128r7082j71589o0008J56387
16318C58146o6531r1349J12416D9592K84285J27913N7018A63589M09663k77182
$$ y = [836612, 686395, 529936, 769365, 644231, 688832, 505222, 628266, 565942, 273083, 546556, 273002, 306834, 444301, 374501, 244733, 497023, 430486, 480408, 560793, 752928, 416850, 343619, 264561, 231794, 464332, 761101, 458819, 473902, 464061, 463094, 578708, 145991, 619377, 489448, 677502, 234274, 459876, 1129, 492806, 448076, 321676, 248296, 630559, 169431, 224067, 443700, 384808, 271945, 205397, 433721, 503837, 326200, 344794, 710081, 443786, 205440, 327879, 367846, 468933, 235553, 222569, 508483, 313636, 467122, 419609, 355310, 530438, 433356, 261767, 201759, 358146, 291615, 200266, 312682, 49592, 333877, 461790, 518808, 163589, 573252, 296070]
16308B96070K34622Q082p0412B07591O9052R5785A27935J39258K52681K7058q6286
16297D60646o9213j91796o2686k6980K94904A43925M34020A0511J62145l0400
16287A42256K15744J29586j87827o2024B2606K46620K14631J24254B85633j6217
16277B69416a0005B92257I5554M06081A68683c48591F0342J69179J37019M15969
16267G82509A08592J8666M54756B81680r7477P8312J63766j15239Q2010A00666
16256F1328J48376K08143A56889C5957L59946j78203m3496p4776L49836k05657
16246B43607q3132J92644O5234B4002L17982B9564Q094L33993H5923J99919o3950
16235B21892a72203D14559l79b0236B84882J31093a83476C04930b87867C9987
$$ y = [296070, 530692, 538774, 468362, 207591, 276643, 372428, 127935, 267193, 519874, 546932, 460646, 391433, 199637, 136951, 109971, 404875, 143925, 577945, 10511, 172656, 142256, 358000, 487586, 299759, 237735, 22606, 269226, 483857, 608111, 285633, 269416, -10005, 292257, 95554, 501635, 168683, -348591, 60342, 229521, 366540, 782509, 108592, 127258, 582014, 281680, 184203, 262515, 426281, 311042, 393052, 100666, 61328, 209704, 417847, 156889, 35957, 395903, 217700, 174204, 99428, 449264, 243607, 160475, 353119, 418353, 24002, 341984, 29564, 37658, 371651, 85923, 285842, 221892, -172203, 414559, 414180, -20236, 284882, 415975, -183476, 304930, -287867, 39987]
16224A67748b751C49368A67090J21511r9132I2963B5560Q8513k94J52639I7389
16212C63922J24931f0570C78924j67515C2739c17465g6900D08237K73664B10102
16201E9349j0956L2869N1545J14652J39592A76281j7937a1076D41459a5949A06852
16189A16041K67804A20535E0563J07405o7626K05488A39475O8377B6785L52563
16179C79348C4047L28254E1525J11781R4631L172D6516K4398c7411B53718J11614
16168C65332G5753b460D9414N9024K30522K9636C3688A3585K28864H0009J50048
16157B30057j4211a17964A68197b29075B50137b6685A32535M3345N7836i1362
16146B25719N7573G9712K80034j59755b85606a194A34349c1048n0145o3693P60
$$ y = [167748, -2751, 349368, 167090, 288601, 189469, 92963, 25560, 114073, 113779, 266418, 97389, 363922, 488853, -60570, 378924, 211409, 32739, -317465, -76900, 408237, 681901, 210102, 59349, 48393, 81262, 132807, 247459, 387051, 176281, 158344, -11076, 441459, -15949, 106852, 116041, 383845, 120535, 50563, 157968, 90342, 295830, 139475, 207852, 26785, 379348, 34047, 362301, 51525, 163306, 257937, 261109, 46516, 70914, -37411, 253718, 365332, 75753, -2460, 49414, 108438, 338960, 368596, 33688, 13585, 242449, 80009, 230057, 215846, -117964, 168197, -229075, 250137, -26685, 132535, 175880, 233716, -91362, 225719, 283292, 79712, 359746, 199991, -285606, -1194, 134349, -31048, -81193, -144886, -144126]
16135a44126A26365Q2180R4361A6509J54231n7498k3418J05114a83463A61511
16124A19730k5729J5917a6861l40224a77106j90378B26533K98207G7027a53052
16113B10129I9774j8145B7953h5788L1337D4233a25911J6727B64278K8331A00327
16101C80717j05617I9654B1829J40662i7408c5704C28370h1396C09222o855d5657
16089D1417M21553j46390b74440A66454n0386N1938l9859a73880e9403G7564P7178
16078A54742L5626a43607A52560g8613B00215g7976A20753a3534A64996F3778
16067D1798a40377A72765a6618H4020d3159p5275A87629f3619I6103Q9270K16742
16056D02115C9434e466E13691d973A01892a33953A58450a328o240B8724K39770
$$ y = [-144126, 126365, 208545, 302906, 16509, 170740, 113242, 89824, 194938, -183463, 161511, 119730, 94001, 109918, -16861, -357085, -177106, -367484, 226533, 524740, 77027, -153052, 210129, 99774, 81629, 27953, -85788, -54451, 44233, -125911, -109184, 264278, 292609, 100327, 380717, 275100, 99654, 21829, 162491, -97408, -35704, 328370, -81396, 309222, 302367, -45657, 41417, 462970, 316580, -274440, 166454, 116068, 168006, 128147, -173880, -59403, 77564, 154742, 190368, -143607, 152560, -78613, 200215, -77976, 120753, -13534, 164996, 63778, 41798, -140377, 172765, -16618, 84020, -43159, -118434, 187629, -63619, 96103, 185373, 402115, 39434, -5466, 513691, -4973, 101892, -133953, 158450, -1328, -7568, 28724, 268494]
16045B68494G9714b62979A22080b6975A51638a18380M2510c2718A95724D9365
16034C0762q089K23575j5628o474a64179N2758A9474d6677C3175K2762k0211J6100
16022E1826a79600E8499i2714B34352H769a21297a4120A68391a24382A44341C4846
16010b7595C8395h7938K7582C22706c02687B78808c01486G9789e874B0748J87432
15999B08180a76269C4845J5048M4239L51423I3931f4754r2564b3605k97302B53179
15987A43310g084k14019H5337c6455B25688J19241A04877L03860d9970B46979
15976d2550B1147b1284B69749f7479j54471B40972J8645q6987M4415J5004g9502
15964a07289H1453d119j28528A45888b70133B21133J4633b33961M8461E2474i1426
$$ y = [268494, 79714, -262979, 122080, -26975, 151638, -118380, -75870, -32718, 195724, 49365, 30762, 22673, 246248, 230620, 224146, -164179, -111421, 19474, -46677, 33175, 55937, 35726, 51826, -179600, 58499, -92714, 234352, 8769, -121297, -14120, 168391, -124382, 144341, 34846, -27595, 38395, -87938, -60356, 322706, -302687, 278808, -301486, 79789, -5874, 20748, 208180, -176269, 34845, 49893, 94132, 445555, 93931, -64754, -157318, -23605, -320907, 253179, 143310, -7084, -221103, 85337, -36455, 225688, 344929, 104877, 408737, -49970, 246979, -42550, 21147, -21284, 269749, -67479, -221950, 240972, 259617, 172630, 217045, 232049, -79502, -107289, 81453, -4119, -132647, 145888, -270133, 221133, 235766, -233961, -185500, 52474, -91426]
15952G176O2893c33325a33265k20697J69872f2916p485p7013m2828j70434H2884
15940A34954c9962k4201L994j62065d9002k52953B0457a47894A29102O560C408
15928d13266I3350j2838h4171F5910d4004j35228N0405B28707H550b92940b5900
15916c42503j01257B5139L8650k542b15728a2555j25457A33402k9199J47853A07633
15904b8329j1227D32742j43564a08917B0556J48921a17667F5361F577J90465c66961
15892a60252A92038a14698l2623H4608B5169b96293J33624k4005j30800J11457
15882b06017g8726B45589B9603a52439A27084i4504j08149e2749D17105a31668
15871A46409f3102J3611A795c2714A81563a4015j41879B18359i779F4012a83280
$$ y = [7176, 70069, -333325, -133265, -353962, -184090, -62916, -70401, -147414, -190242, -360676, 82884, 134954, -39962, -64163, -60169, -222234, -49002, -301955, 20457, -147894, 129102, 135662, 3408, -413266, 93350, 80512, -84171, 65910, -44004, -179232, -128827, 228707, 8550, -292940, -25900, -342503, -443760, 25139, 63789, 61247, -215728, -12555, -138012, 133402, 104203, 252056, 107633, -28329, -39556, 432742, 289178, -108917, 20556, 169477, -117667, 65361, 6577, 197042, -366961, -160252, 192038, -114698, -147321, 84608, 25169, -296293, -162669, -186674, -317474, -206017, -78726, 245589, 29603, -152439, 127084, -94504, -202653, -52749, 417105, -131668, 146409, -63102, -49491, 1795, -32714, 181563, -14015, -155894, 218359, -9779, 64012, -183280]
15859a62508J5136M8323M1272j54579A16555a1709A69750J64846D6749a3050k18151
15848b31201A22129E6443N5198H089h18B72880p8100b28728A02129J61984a04105
15836A07014b86416B62337q6452J71900h3801D1086K07640J92697f3109l92254
15826d55363B80991A20594a97085K676D1564a39587G0812a34076j78543B40395
15815a11615L1882O319l00672j9549M1163e7849k1500A25619o0339R8610a86316
15803A52620l6200D9693b96259A92539d5146k49374e0609A57883J8575c0269k36432
15792b66701g856k93859F2342A0046a29821B30178A8143K92580L3305A41K224
15781B365a01795J4161m204R224j14622D1165b40631B0793f9519a3841r2762d992
$$ y = [-162508, -147372, -99049, -57777, -212356, 116555, -11709, 169750, 334596, 46749, -13050, -231201, 122129, 56443, 111641, 8089, -818, 272880, 194780, -228728, 102129, 264113, -104105, 107014, -286416, 262337, 175885, 347785, -83801, 41086, 248726, 441423, -63109, -455363, 280991, 120594, -197085, -194409, 41564, -139587, 70812, -134076, -312619, 240395, -111615, -79733, -73414, -374086, -393635, -352472, -57849, -79349, 125619, 65280, 163890, -186316, 152620, 116420, 49693, -296259, 192539, -45146, -294520, -50609, 157883, 176458, -30269, -266701, -7856, -301715, 62342, 10046, -129821, 230178, 18143, 310723, 344028, 141, 2365, -101795, -87634, -91838, -82614, -197236, 41165, -240631, 20793, -69519, -13841, -106603, -4992]
15768e01173B06394J19617B9740b99891B21862m1083d68179E501R0641C8249a1952
15756B89788a61652d305A11156m2065N8461d57097g7785a5880r975C5429f9279
15744A47511a10229I8093a27704C16821a74571G1099c7982n7809q3876m27085
15734f06752K92992i4627j07541r3639B8916c1655j87119A47621i4901A57641
15723b16007N1923d7349I577P4999a93885I3969c62785D8734b00991A14356B1708
15711a03931N00j2651K2092l5110e2311k5749B4578b28054C12887a34942L9737
15700i5205a1547n5255q6443f5591A46759M5853k0405d3953k63801B48583j09236
15689A39347Q6061f17569E3981b07678i9489k9961P011m5706j8950D7983a26117
$$ y = [-501173, 206394, 326011, 29740, -299891, 221862, 180779, -468179, 5501, 96142, 38249, -11952, 289788, -161652, -4305, 111156, 69091, 127552, -457097, -77785, -15880, -25855, 35429, -69279, 147511, -110229, 98093, -127704, 316821, -174571, 71099, -37982, -95791, -179667, -606752, -313760, -94627, -202168, -295807, 28916, -31655, -218774, 147621, -94901, 157641, -216007, -164084, -47349, 9577, 84576, -193885, 93969, -362785, 48734, -200991, 114356, 21708, -103931, -103431, -116082, -93990, -129100, -52311, -78060, 24578, -228054, 312887, -134942, -95205, -11547, -66802, -153245, -65591, 146759, 192612, 172207, -43953, -307754, 248583, 139347, 225408, -617569, 53981, -207678, -99489, -129450, -122439, -168145, -187095, 47983, -126117]
15677B1271L05417a47256c2827j30291a8673p2431L7072j34577A2051J53761c55938
15665b42174J15623f1092A6034J30197b70016B96166a04459d4209j05815j04358
15655b54382A59905b09188A78132P563G2926C5847a46967j25609a16618A97448
15644B14154a03962n577k30789J62713m7110A63382K4611r2516m2253b16547D2191
15632a11300l739C4436b984q7803k7853k10649h1713A8275i6175A57474C4575
15620A73661F5257b68704B8949i1725k35959A61798G9883a32655F7689a8476D9591
15608B41043b08969A9386l004b38118j93393A0306J31992b59703k53545K54493
15598b58755h8954A95084F563J80941r3121f0416k41426P3696c3002B26839b14246
$$ y = [21271, 326688, -147256, -32827, -163118, -18673, -91104, -54032, -188609, 12051, 165812, -355938, -242174, -126551, -61092, 16034, 146231, -270016, 296166, -104459, -44209, -150024, -254382, 159905, -209188, 178132, 185695, 72926, 35847, -146967, -272576, -116618, 197448, 214154, -103962, -109539, -340328, -177615, -224725, 163382, 187993, 95477, 53224, -216547, 42191, -111300, -115039, 34436, -2984, -90787, -118640, -329289, -81713, 18275, -96175, 157474, 34575, 173661, 65257, -268704, 28949, -91725, -327684, 161798, 79883, -132655, 67689, -18476, 49591, 241043, -208969, 19386, 16382, -238118, -431511, 10306, 142298, -259703, -513248, -258755, -88954, 195084, 6563, 187504, 94383, -60416, -301842, -228146, -33002, 226839, -214246]
15586F6562b03566C28966j24181a06992C23945I2851l994a44746I7378a41491
15575G3544a66724O1237n1026C01081a9796J78h406j44460I551N6872a70970a1806
15562A70351a3700m178k04468j0825F9003A7109K89541A21008E3219F144a94030
15550b06085A32498b09467f2358A56589p8000J42064G4972C2636O8030C7890f0246
15538B14487a66638F450i0255A40376a1878b220p5415A83123a11519B6328N7010
15527H3338c90677A07511b81923P2046e6832l26192A60923b39597H2235J73339
15517B55574e2663B37523B8962K92896F5924J6142N867c1476H7728q079N1784
15506A31433a55217k06379H0322a37951a1816B34261d0464k63809B14919B1124
$$ y = [66562, -203566, 328966, 204785, -106992, 323945, 92851, 88857, -144746, 97378, -141491, 73544, -166724, -105487, -156513, 301081, -19796, -19618, -8406, -152866, 9551, 66423, -170970, -11806, 170351, -13700, -17878, -222346, -233171, 69003, 17109, 306650, 121008, 53219, 6144, -194030, -206085, 132498, -209467, -62358, 156589, 78589, 220653, 74972, 32636, 100666, 37890, -60246, 214487, -166638, 6450, -90255, 140376, -11878, -2220, -77635, 183123, -111519, 26328, 83338, -390677, 107511, -281923, -209877, -56832, -383024, 160923, -239597, 82235, 255574, -52663, 237523, 28962, 321858, 65924, 82066, 87933, -31476, 87728, 79649, 131433, -155217, -361596, 80322, -137951, -11816, 234261, -40464, -304273, 214919, 21124]
15495A45045b22948A47530l8274a86081F0505e0078o6992q635k19050E1069j1659
15484C9410h1429j20801A42896c37931G6218B3541J6424i1385j11974r2071g2794
15472c7602j54624e117p3954l22439a85336j1771Q1201l4270l46002h7839l1579
15461a19418A49010Q3976J40865j79630h893A7217b28799C5356h0895b1529d573
15449d4685k92529a24634A22414f3668a60E6567K02264k3653C4791J52114b4641
15437h0681B57190a9185C0891a50820B12768a42050p5052B0726K63720b61311
15426d6000j14532D1411K0109J74429D0970i0163K3219B49065c2881n7249o914
15415i7044j93129C9722a06488A75630G4926c4563j17954F7798b46518E9675h9997
$$ y = [145045, -222948, 147530, 109256, -186081, 60505, -50078, -117070, -125705, -344755, 51069, 39410, -81429, -202230, 142896, -337931, 76218, 23541, 39965, -91385, -203359, -295430, -72794, -37602, -192226, -5117, -79071, -401510, -185336, -197107, -115906, -150176, -496178, -87839, -119418, 149010, 232986, 373851, 194221, -8893, 17217, -228799, 35356, -80895, -21529, -4573, -44685, -337214, -124634, 122414, -63668, -160, 56567, 258831, 235178, 34791, 186905, -24641, -80681, 257190, -19185, 30891, -150820, 212768, -142050, -217102, 20726, 284446, -261311, -46000, -160532, 41411, 61520, 235949, 40970, -90163, -66944, 249065, -32881, -90130, -97044, -290173, 39722, -106488, 175630, 74926, -34563, -152517, 67798, -246518, 59675, -89997]
15403f1268q8782E7043J80934C1686P3784C8340a86562j8761C2692N0896a20302
15391b72863A17893E2868c18390D727a04490H1377a20519E0512J46211N7412a36354
15379B3905J11984a50990a0814k1192j70304H3807J33947b90281a8265A81073
15368C374L07821H108a51358M3917C07501e2412p144q8251N8910j49058f2546
15356d7216B76993a30752R096c2433j65496c7171B1204b37578J15136G1851P7940
15345A49791F7219a26580E04429k03781i5168o6818A28611b7480E02629g2074
15334g5979A83977l6679a7173C10892A10844h1252p839A22037j477J36490C8726
15322A09179l8472K30199f0603p4936A97734b19469A57508d24897a35660B28049
$$ y = [-61268, -150050, 57043, 237977, 31686, 105470, 38340, -186562, -205323, 32692, 83588, -120302, -272863, 117893, 52868, -318390, 4727, -104490, 81377, -120519, 50512, 196723, 254135, -136354, 23905, 135889, -150990, -10814, -32006, -202310, 83807, 217754, -290281, -18265, 181073, 3374, 311195, 8108, -151358, -107441, 307501, -52412, -59556, -147807, -88897, -237955, -62546, -47216, 276993, -130752, -121656, -32433, -197929, -37171, 21204, -237578, -122442, 71851, 149791, 67219, -126580, 504429, 300648, -95168, -161986, 128611, -27480, 502629, -72074, -75979, 183977, 147298, -17173, 310892, 110844, -81252, -89091, 122037, 120560, 257050, 38726, 109179, 70707, 300906, -60603, -135539, 197734, -219469, 157508, -424897, -135660, 228049]
15311a42753I1426j5421b0775B31761i2073a3046F8320b6040A09071J28502b49796
15299h2254Q444A40854n6462a0138o2910q4168p6240F2884a55107B146J11509
15288A13655a65500A00895h4475C32469B493K70932j17535D0697L67568I4045
15277g290A52935J42897d35072J96387g7374h703D979J39512A9896d0668j97348
15266b38016e8480B1502J105J10677k2798a53871A8005P339a2931A21598J13057
15255B34655b35059F5896b26601A29563D4867J70066L80860P50070L3517k43673
15245A135707M41627G42688k78652e0323A62438a23419D7834j3665F966N3942
15235F0908a1553I9984N5917j4866J4739a49040H4625a54571k44014e6259I2876
$$ y = [-142753, 91426, 76005, -20775, 231761, -92073, -13046, 68320, -26040, 109071, 237573, -249796, -82254, -73810, 140854, 84392, -10138, -73048, -157216, -233456, 62884, -155107, 2146, 113655, -165500, 100895, -84475, 332469, 2493, 273425, 155890, 40697, 408265, 94045, -7290, 152935, 295832, -435072, -238685, -77374, -8703, 4979, 144491, 19896, -40668, -238016, -58480, 21502, 22607, 133284, 110486, -153871, 18005, 25344, -12931, 121598, 234655, -235059, 65896, -226601, 129563, 44867, 214933, 595793, 1345863, 1379380, 1135707, 1577334, 742688, 464036, -50323, 162438, -123419, 47834, 34169, 6966, 60908, -11553, 99984, 155901, 141035, 155774, -149040, 84625, -154571, -398585, -56259, 92876]
15223b34698J16576B30319a67159E5895K07317f5738p7793B76705A15994H470
15212a9259n6030p86m6881F378K89729b49709A77003q3248O4108a7556k05099
15201b22655R7234M3863l6936b1573E7231J2346a27487C20522E4758L06335B0489
15189A73721L8726d9679H5692i3149b6894d42A18397a53450A71876C0802r96M9597
15177G9403b0712E5379K2333N4543h5462E1660L90284E6894f062k12803B5669
15165A66368F9412c25159E6867h5169E582K37151q4103m0388k2986a91031A03855
15153A39914J5839l5907R2215p205h7536I3268a75588A99340I3527f4620A26046
15141C4620a5712a980A49680R8985c9761C56530f9432C24844H0939K76930q6577
$$ y = [-234698, -118122, 230319, -167159, 55895, 263212, -65738, -143531, 276705, 115994, 8470, -19259, -75289, -76075, -122956, 6378, 296107, -249709, 177003, 93755, 157863, -17556, -222655, -125421, -81558, -118494, -21573, 57231, 69577, -127487, 320522, 54758, 361093, 20489, 173721, 212447, -49679, 85692, -93149, -26894, -442, 118397, -153450, 171876, 30802, 29806, 79403, -20712, 55379, 77712, 132255, -85462, 51660, 441944, 56894, -6062, -218865, 25669, 166368, 69412, -325159, 56867, -85169, 5582, 242733, 158630, 118242, 95256, -191031, 103855, 139914, 155753, 119846, 212061, 204856, -87536, 93268, -175588, 199340, 93527, -64620, 126046, 34620, -15712, -1980, 149680, 248665, -39761, 356530, -69432, 324844, 80939, 357869, 271292]
15130B71292n3532j7893b1964I9953a28196F70K02032L1176A14868K53676a09308
15118A58149a48369a8567B37420K06392A42117d7657r780A76203Q9320g2450A30957
15106I4351j146m2048a54916B72611A30166j0704e9125I8565K9900b64041K75
15095b63766h415A85869C5266a7325p610l66322A28988d153D7736K85675A50245
15083A46543K23303a9821C27144b74313A91476p750A8838a76682F3260K9760L53372
15072D46392D0724M12055G4150J80437A26778K3676a46994C67959B5193Q7883
15062A13076c3065o7034A35409J78362k3163A37001J23863k1102J0463j05909
15052A44316H718K66663Q839a61083g0394n1385C46719j61072a1316B91073a02861
$$ y = [271292, 217760, 199867, -21964, 99953, -128196, 670, 202702, 233878, 114868, 368544, -109308, 158149, -148369, -18567, 237420, 443812, 142117, -47657, -57437, 176203, 265523, -72450, 130957, 94351, 93205, 51157, -154916, 272611, 130166, 119462, -59125, 98565, 128465, -264041, -263766, -8415, 185869, 35266, -17325, -24935, -391257, 128988, -4153, 47736, 333411, 150245, 146543, 369846, -19821, 327144, -274313, 191476, 183726, 18838, -176682, 63260, 93020, 446392, 40724, 452779, 74150, 254587, 126778, 150454, -146994, 367959, 25193, 113076, -33065, -100099, 135409, 313771, 290608, 137001, 260864, 239762, 250225, 144316, 8718, 275381, 284220, -161083, -70394, -121779, 346719, 185647, -11316, 291073, -102861]
15040B32837J52195i7067B74628R7797a13761A17485a44577I5093K3011k9277
15030H8827R546L42030j01216j54684K2337K61648e4437B2552J59594b0978j48850
15019a69828C59335A44979h3989A83498e7931H9686a09561C25653n4773J9042
15009B89922j28921o6595b49285A1655J63899E5160O3619D1066A2852J96243m846
14998B04249K34147A62083N4988O7590K08200j70634j59608K61430j43581H2059
14987E5521J40519F2433L52797A36874M530J08686R8578a41006D76437p0116A90522
14975a53176A83292J18656e7321C00984C8651K74302R794L00909I7332L56842
14965D54174d0978B1639L1872K75314A18641J46394K4274M4112A55604O8171G2386
$$ y = [232837, 385032, -97067, 274628, 372425, -113761, 117485, -144577, 95093, 118104, 88827, 98373, 440403, 339187, 184503, 206840, 468488, -54437, 22552, 182146, -20978, -169828, 359335, 144979, -83989, 183498, -57931, 89686, -109561, 325653, 270880, 289922, 161001, 94406, -249285, 11655, 175554, 55160, 118779, 41066, 12852, 209095, 204249, 438396, 162083, 217071, 284661, 492861, 322227, 162619, 424049, 280468, 82059, 55521, 196040, 62433, 415230, 136874, 141404, 250090, 348668, -141006, 476437, 406321, 190522, -153176, 183292, 301948, -57321, 300984, 38651, 312953, 322747, 623656, 97332, 454174, -40978, 21639, 53511, 328825, 118641, 265035, 289309, 333421, 155604, 223775, 72386]
14953F2826L69250H7252M21402A61764g692B01950k0718J11574h6803B73272H4633
14941D44294A41259J55488J30899A95365I2912L85608j69082I1688K70771A26385
14930A77672h8464A84872P3945j18333q484L7951K41872A15333K09178n6734r132
14919B58645L06381j74327K62299D9919L01182K32641A13765A4484J96745J95897
14909D07126A40867M83L29310n1730H7737a61186B53484B8283O25421A50883J55030
14898C05913c8893A15135K0731K12538j36814K05939N9335A78040K15301j65936
14888B27405K53878r7283P2668B25309M9732L11819A85843J24924M14807C30969
14877E73317o4909j5098b6030C59259A61689P5010J30070O8811L4926j14768J611
$$ y = [62826, 432076, 87252, 508654, 161764, -7692, 201950, 181232, 292806, -86803, 273272, 84633, 444294, 141259, 296747, 427646, 195365, 92912, 478520, 309438, 91688, 362459, 126385, 177672, -88464, 184872, 258817, 140484, 132000, 169951, 411823, 115333, 324511, 267777, 258645, 565026, 390699, 652998, 49919, 351101, 583742, 113765, 14484, 211229, 407126, 140867, 141350, 470660, 418930, 87737, -161186, 253484, 28283, 653704, 150883, 305913, -38893, 115135, 135866, 348404, 211590, 417529, 476864, 178040, 393341, 227405, 481283, 384000, 456668, 225309, 275041, 586860, 185843, 310767, 725574, 330969, 573317, 508408, 493310, -26030, 359259, 161689, 236699, 366769, 435580, 470506, 355738, 357349]
14866C57349l9666P3132r6137K18216k03776R0210r7438P2304J04728k02766Q945
14855B85101A23497L6596C7815L86217J99990j16090k0708o0257j3649c8107E19339
14843A28488K62561J40282j21813m5275p636p983L51350n3412J75815d0580D15542
14831C99588J5060J91263j42875A83857J39354P9985A95091J07043Q5438j7205
14821C70367L8729K01180I29P29185k34677P6120B20780L16356Q7853j37221k09687
14810B78081M1070O3265L8591n5808M9638P3065j92945J85136J1962k0231L4771
14799E06595B05357J34346L90097A25123M69602j47792L7410m477q9914J33774
14789E23726r5221O7315B39340K47113q8125Q8643k378j2603L13916k15525K3484
$$ y = [357349, 317683, 390815, 294678, 512894, 309118, 399328, 301890, 374194, 478922, 276156, 285101, 123497, 160093, 37815, 424032, 624022, 507932, 487224, 426967, 413318, -38107, 519339, 128488, 391049, 531331, 409518, 364243, 356607, 348624, 699974, 646562, 822377, -40580, 415542, 399588, 414648, 605911, 463036, 183857, 323211, 403196, 195091, 302134, 387572, 370367, 409096, 610276, 929, 730114, 495437, 571557, 220780, 537136, 624989, 487768, 278081, 319151, 382416, 421007, 365199, 414837, 487902, 294957, 480093, 492055, 471824, 506595, 205357, 339703, 729800, 125123, 594725, 446933, 484343, 479866, 389952, 523726, 428505, 495820, 239340, 486453, 398328, 486971, 484593, 471990, 785906, 570381, 593865]
14778E93865j44540L54502k86703J4540M8757J27326m6204O5501P291m8261O4924
14767G50998M5728j01045J64679j82217r7181j08828P5789R3668j53430R3372
14757E81533m5290J20467l9734K43375k15349O7332j18100j74346q8755L33483
14747F64616J58503l10530L66837J10135k84180l04545k52Q5289K27866M3350
14737G57089J02252k15532M608j14898J62565l46953L79743J27753j98063K22170
14727H80734Q1572j91221n0070k40345K98774j92218M94510r6119k60721j34411
14717E90485J36367q0285o7445L62807k81432m676K30474m9124k27120J97935
14707H07986J83583o2694k84488m2635N87645m04963J91790j56138m0091Q8158
$$ y = [593865, 449325, 803827, 517124, 531664, 580421, 707747, 661543, 727044, 734335, 686074, 750998, 796726, 695681, 860360, 678143, 580962, 472134, 547923, 641591, 488161, 581533, 536243, 656710, 616976, 860351, 645002, 712334, 594234, 419888, 331133, 664616, 823119, 512589, 879426, 989561, 705381, 400836, 400584, 485873, 713739, 757089, 859341, 643809, 648417, 533519, 696084, 349131, 728874, 856627, 658564, 880734, 962306, 771085, 721015, 480670, 779444, 587226, 1081736, 985617, 724896, 590485, 726852, 646567, 579122, 941929, 660497, 655821, 886295, 837171, 610051, 807986, 991569, 928875, 644387, 601752, 1189397, 784434, 976224, 820086, 779995, 868153]
14697H68153n0428k93405O39935l60705n2852K08329j23186J57947j36144j36959
14687G20685M04943N0062l69053j09241K24698K76653j24977L3874q6807L6953
14677A057790J28436j01931o1318j38321O4123K11348j76878q6566K34915J94718
14667A326316m53297K30789Q2840k99804K73578l46007L4430M46770p6690m34263
14657G84662J70046K20673j85703J82049P4352j02997L24799l57012j39208M87662
14647A459323l41595o7962p8396K10720Q1690l96283J37106L98777j67523j14668
14637A121189n6137j61305M15402j62389K31919j14868K11276k27063k89581J56303
14627A124746J89248n2455L77564l07240O1681O481O5780l7611p6490k23699N6224
$$ y = [868153, 817725, 524320, 1164255, 803550, 750698, 959027, 835841, 993788, 857644, 720685, 1125628, 1175690, 806637, 697396, 922094, 1198747, 1073770, 1107644, 1020837, 1057790, 1186226, 1084295, 1022977, 884656, 948779, 1160127, 983249, 896683, 1131598, 1326316, 873019, 1103808, 1186648, 886844, 1160422, 814415, 848845, 1295615, 1218925, 784662, 954708, 1175381, 989678, 1171727, 1246079, 1143082, 1467881, 1110869, 971661, 1459323, 1117728, 1049766, 971370, 1182090, 1263780, 867497, 1004603, 1403380, 1235857, 1121189, 1065052, 903747, 1319149, 1156760, 1388679, 1273811, 1485087, 1258024, 968443, 1124746, 1313994, 1261539, 1639103, 1331863, 1393544, 1400025, 1465805, 1428194, 1351704, 1128005, 1184229]
14616A184229M34314k18503K74291j36712j85169o8409K49981j30831K46455j52833
14606A496813k17539L0570P2558K4351M6694K40383k52758J40761k68226L77424
14596A691031M8627k994j44449K53252o6784m06778M38762l5881O5209j90458
14586A649537j43300L53715J91545k92553L13817n27652R3724M92761l80201o8982
14576A682411L09586q9513R5381R6254J07216J51507K01569n24119P4455K90363
14566B395110l25781N07735k06675J28985J4857o089R7847J43073K06220l30L6803
14555B991755m5197M00389L96362O80004L08045J030696J471335L579804Q382722
14546A9195915J7334159R151138k1915099A0525219m810816k058981p69912n06782
$$ y = [1184229, 1618543, 1400040, 1674331, 1537619, 1352450, 1284041, 1534022, 1403191, 1649646, 1496813, 1279274, 1309844, 1382402, 1406753, 1453447, 1693830, 1441072, 1581833, 1313607, 1691031, 1739658, 1736664, 1592215, 1845467, 1778683, 1371905, 1810667, 1774786, 1839995, 1649537, 1506237, 1859952, 2051497, 1758944, 2072761, 1545109, 1638833, 2131594, 1751393, 1682411, 1991997, 1902484, 1997865, 2094119, 2201335, 2352842, 2554411, 2030292, 2104747, 2395110, 2069329, 2577064, 2370389, 2499374, 2514231, 2508142, 2605989, 2749062, 2955282, 2954952, 2991755, 2946558, 3346947, 3743309, 4423313, 4731358, 5762054, 7233389, 10813193, 19195915, 36530074, 45681212, 23766113, 10525219, 5714403, 3655422, 2885510, 2378728]
14538B378728k11385O6054m03704L87124l78361M29415l30464K38523J30051j69894
14528B136087N5575l019K6736J59865L8749j72412L72892J05019l39251K38284
14518B618525j11169M81802m67928K16446J99196k66903j27566J19600J64032
14509B826035K09583k98313M13917j40656L2924l285J01228j39674j60386P9406
14499B920779J29952K63302n266m10706M38733j39340K38389l52452L17742q312
14489C392821K73117j88916K3584k56079M17175k21731L76435J47615M4790k18583
14479C790228q9560K05801M4901L15366m00550L23168M6124m1752l2759k28099
14469C932868N38410j86591k5386J11429J38060J44616K16741j59056O8730M54327
$$ y = [2378728, 2167343, 2233397, 1829693, 2216817, 1838456, 2267871, 1937407, 2175930, 2305981, 2136087, 2191662, 2188643, 2215379, 2375244, 2413993, 2241581, 2614473, 2719492, 2380241, 2618525, 2507356, 2989158, 2521230, 2737676, 2936872, 2669969, 2542403, 2662003, 2826035, 3035618, 2737305, 3151222, 3010566, 3043490, 3040205, 3141433, 3001759, 2841373, 2920779, 3050731, 3314033, 3308767, 2898061, 3336794, 3197454, 3435843, 3083391, 3401133, 3392821, 3665938, 3477022, 3500606, 3244527, 3661702, 3439971, 3816406, 3964021, 4008811, 3790228, 3700668, 3906469, 3951370, 4266736, 3866186, 4189354, 4235478, 4193726, 4160967, 3932868, 4471278, 4284687, 4259301, 4370730, 4508790, 4653406, 4870147, 4711091, 4779821, 5234148]
14459E234148n88541K78911j90621L5964J03255N94150l56956K77467M6109j78819
14449E255067O1184L46060J4349K92448l11133K05052J91668m63459N28270j63716
14439E955790N27829j40691J95037p4027K63342p8374k52653M55308R6275k94580
14429F653256N34733j92597K57609Q5903k00097L63765J02673k85077L68528K87639
14419G976335K8951P5153L05017J13769J12143K87708M0410k52827K61395M0630
14409H988684J87638L93103J65168J16594k84681L52869M39084J17240J06951
14400A0582650j86529O34250l5781K97114J77112K47364J36942k05520J02291
14391A1749893L87454K00302M05022M07101N3892J22491Q7389N39353K38588j4322
$$ y = [5234148, 4645607, 4924518, 4733897, 4769861, 4873116, 5467266, 5110310, 5387777, 5433886, 5255067, 5316251, 5662311, 5676660, 5969108, 5657975, 5863027, 6054695, 5591236, 6119506, 5955790, 6483619, 6342928, 6537965, 6463938, 6727280, 6648906, 6396253, 6851561, 6947836, 6653256, 7187989, 6995392, 7253001, 7338904, 7138807, 7502572, 7605245, 7320168, 7688696, 7976335, 8005286, 8080439, 8385456, 8499225, 8611368, 8899076, 8939486, 8686659, 8948054, 8988684, 9176322, 9569425, 9734593, 9851187, 9566506, 9919375, 10358459, 10475699, 10582650, 10396121, 11030371, 10994590, 11291704, 11468816, 11716180, 11853122, 11647602, 11749893, 12137347, 12337649, 12742671, 13149772, 13203664, 13326155, 13413544, 13952897, 14191485, 14177163]
14381A4177163K31338Q06376J24216l03570Q78907K82496N1419J07203O44720
14372A7000268M12531J17246O19836J36201O22957J62902O30307L34763K6725
14363B0063736O84831O14467p6359R60359K17236O61362P34568J68186N83425
14354B4611811P57180N63854O48379K95194J193173M20768O38578M92853J229029
14345C0850819N08092P87733J168601O62171J177028N85917J016177R85058Q85243
14336C8626839J123818J223830J334858J229157J487390J113121J441997J243505
14328D8824515J732885J263344J880860J670204J966740J907235K392266J464593
14320F3102642K512378K372634K398351K350617L115758K773921L302671K857975
$$ y = [14177163, 14408501, 15214877, 15339093, 15035523, 15914430, 16196926, 16248345, 16355548, 17000268, 17412799, 17530045, 18149881, 18286082, 18909039, 19071941, 19702248, 20037011, 20063736, 20748567, 21363034, 21286675, 22247034, 22464270, 23125632, 23860200, 24028386, 24611811, 25368991, 25932845, 26581224, 26876418, 28069591, 28490359, 29128937, 29621790, 30850819, 31358911, 32146644, 33315245, 33977416, 35154444, 35740361, 36756538, 37741596, 38626839, 39750657, 40974487, 42309345, 43538502, 45025892, 46139013, 47581010, 48824515, 50557400, 51820744, 53701604, 55371808, 57338548, 59245783, 61638049, 63102642, 65615020, 67987654, 70386005, 72736622, 75852380, 78626301, 81928972, 84786947]
14312H4786947L132514L670412L894887L810173M375476M534119M527380M994414
14304A17726322N098066N431630N962878O451445O192949P161330P081145P972348
14296A69078113P927522Q880532Q987181R957428J0113127J0894510J1689728
14289B37528141J1620933J2486213J2939423J3090509J3986606J4210831J4367421
14282C30230077J4549435J4609227J4753538J4081665J3732252J2997071J2166182
14275D27119447J0631784Q780873N630617K299364M26334N95403j293119l224560
14267D50966143n126575n320488o677524q946724j0867659j2595939j3777360
14260C87653874j4120472j4776172j5179901j5377437j5115862j4135831j3658691
$$ y = [84786947, 87919461, 91589873, 95484760, 99294933, 103670409, 108204528, 112731908, 117726322, 122824388, 128256018, 134218896, 140670341, 146863290, 154024620, 161105765, 169078113, 177005635, 185886167, 194873348, 204830776, 214943903, 225838413, 237528141, 249149074, 261635287, 274574710, 287665219, 301651825, 315862656, 330230077, 344779512, 359388739, 374142277, 388223942, 401956194, 414953265, 427119447, 437751231, 446532104, 452162721, 454462085, 454888419, 455483822, 454190703, 450966143, 445839568, 440519080, 433841556, 424894832, 414027173, 401431234, 387653874, 373533402, 358757230, 343577329, 328199892, 313084030, 298948199, 285289508]
14253B85289508j3960942j3298939j2637809j1726896j1475768j1083184r922774
14246B01183196j0064107r117977q300656p859635p887531p376534p102492o365954
14238A37108310n741539n330729n484676m976656n324695m583658m239020l488204
14230I7939133l851793l953086l550402l350935l004118l193242k787509k627295
14222G1620753k595420k179222k081402k132011k201493k027821k097057j715787
14214E4590540j915209o83048k038223j829108j377047j486676r69932j084050
14206D3207247o35181j834190j483993j017191r94377p03145p56468j049779p79241
14197C3953682j351814p50479q20328o08338r24667m02075r44928n49733o64693
$$ y = [285289508, 271328566, 258029627, 245391818, 233664922, 222189154, 211105970, 201183196, 191119089, 182001112, 173700456, 165840821, 157953290, 150576756, 143474264, 137108310, 131366771, 126036042, 120551366, 115574710, 110250015, 105666357, 101427337, 97939133, 94087340, 90134254, 86583852, 83232917, 80228799, 77035557, 74248048, 71620753, 69025333, 66846111, 64764709, 62632698, 60431205, 58403384, 56306327, 54590540, 52675331, 51992283, 49954060, 48124952, 46747905, 45261229, 44291297, 43207247, 42572066, 40737876, 39253883, 38236692, 37242315, 36539170, 35782702, 34732923, 33953682, 32601868, 31851389, 31031061, 30422723, 29498056, 29095981, 28151053, 27601320, 26936627]
14188B6936627p81025n59976m21809q07613o99617l55604m75725n59498n37182
14179B1738578k12134q66107j84378j25818n75610m76266m07733j77230n76845
14170A8136457l78198n36271j07685k42866j50423k94509o39042k22647k19955
14161A5344861j15027l20925k83384j01708k49041l41317M8463p29050J07879
14152A3360751m73409K2361l19281m96292K07265n68132R85j92000k16168l2823
14142A1293257k11365q1949l07263j24258j058m23176J2711l53938j2975k00023
14132I589963p4284J20173n8527m02510r9636k81985j41548N7975r5562m73853
14122H140206K73512j80972K89552j072526L68466l59289J94640N3446k38775
$$ y = [26936627, 26155602, 25595626, 25173817, 24366204, 23666587, 23310983, 22835258, 22275760, 21738578, 21526444, 20660337, 20475959, 20350141, 19774531, 19298265, 18890532, 18713302, 18136457, 17758259, 17221988, 17114303, 16871437, 16721014, 16426505, 15787463, 15564816, 15344861, 15229834, 14908909, 14625525, 14523817, 14274776, 13933459, 13981922, 13252872, 13360751, 12887342, 12909703, 12590422, 12094130, 12301395, 11733263, 11734248, 11542248, 11326080, 11293257, 11081892, 10999943, 10692680, 10568422, 10567364, 10144188, 10156899, 9802961, 9789986, 9589963, 9515679, 9635852, 9577325, 9174815, 9075179, 8793194, 8651646, 8709621, 8614059, 8140206, 8413718, 8232746, 8522298, 7449772, 7818238, 7458949, 7653589, 7707035, 7468260]
14113G468260k12242M3373p0154l18603J51207O471k25616J74364k91371J18833
14103F844522l40493j23793M6727q9661R3857L9939l88424L20171o08780q9748
14093E704317K46144j56817r8149K11889l67076N4300o9281j52826K1117k98624
14083E094994K63482n42995N05345m40326L08445j88451N0493J69889n41712L18465
14073D997629k22845j27871l54980J03838R9916J64683l85084J24077k72963L48640
14063D475040k38118k7455k93928q5987L01115L6689j04259r3569j90021J67615
14053C947122l78830L50416r9252K61302n72624J21487j01747N41320o70931K11659
14043C609922k69119M4505j11291L85233r8610k19439R4054k40405K48201j68442
$$ y = [7468260, 7256018, 7299391, 7229237, 6910634, 7061841, 7068312, 6842696, 7017060, 6725689, 6844522, 6504029, 6380236, 6426963, 6337302, 6431159, 6471098, 6082674, 6402845, 5794065, 5704317, 5950461, 5793644, 5695495, 5907384, 5540308, 5594608, 5525327, 5372501, 5393618, 5094994, 5358476, 4815481, 5320826, 4880500, 5188945, 5000494, 5050987, 5220876, 4679164, 4997629, 4774784, 4646913, 4291933, 4395771, 4495687, 4660370, 4275286, 4399363, 4126400, 4475040, 4236922, 4209467, 3915539, 3829552, 4130667, 4167356, 4063097, 3969528, 3779507, 3947122, 3568292, 3918708, 3819456, 4080758, 3508134, 3629621, 3527874, 4069194, 3398263, 3609922, 3340803, 3385308, 3274017, 3659250, 3560640, 3341201, 3435255, 3194850, 3443051, 3274609]
14033C274609P0683J22111l08584k19904K42164n7776J58142j79325j1119l65138
14023B725863L69708m9083l87160j25513Q0762J6302L33903l99216J12779j054
14013B677291k83543K49000j98900k23584J78979J39720O1127j98005K09054m48509
14003B162630M05345L18664o06627O1730k99256k7582N47158m79325J52716k25432
13993B010021J65969j22938K94874J40947J424179J746367O376019J6638518J7897028
13984D6570984j8751849j2631868n412863l107430j538628o06420l04054l59007
13976C858865m29724k36088m3527n32122M27734m1709Q6260l38333l09854l9116
13966B402386J98412k23655K48184j32699j48675k0442k40663L17926o87882O44630
$$ y = [3274609, 3345292, 3467403, 3158819, 2938915, 3181079, 3123303, 3281445, 3102120, 3091001, 2725863, 3095571, 3046488, 2659328, 2533815, 2614577, 2630879, 2964782, 2565566, 2678345, 2677291, 2393748, 2642748, 2443848, 2220264, 2399243, 2538963, 2600090, 2402085, 2611139, 2162630, 2567975, 2886639, 2280012, 2341742, 2042486, 2014904, 2562062, 2082737, 2235453, 2010021, 2175990, 2053052, 2347926, 2488873, 3913052, 5659419, 12035438, 28673956, 46570984, 27819135, 15187267, 9774404, 6666974, 5128346, 4521926, 4217872, 3858865, 3429141, 3193053, 3149526, 2617404, 3045138, 3003429, 3089689, 2751356, 2441502, 2402386, 2600798, 2377143, 2625327, 2492628, 2343953, 2323511, 2082848, 2400774, 1712892, 2357522]
13956B357522l5841k34397M1755o1793K51484k73446k28682J40756J62641l25579
13946A794420L16469m29980L53323J3243l44174j27114J58332J40645J19654q0609
13936A914209m35827M07043L9393m54151N21275j76871k99946o528K24352J7694
13926A750643Q6K06190j15147o3459j16743L77876n19800k33671L02553r8639
13916A489889K10416j18987L46183o07043K57597l00472M55946k63189J5642J55840
13906A641822k93752N6569P0961P8086j99911J55474Q5682j20148k27256K63246
13896A510773j36975r8844j61838M6841K47118k18009L29032j44772K9004k63285
13886A139045k83388O76706n45255P3026J89837j09120M3628M2713K64651k69900
$$ y = [2357522, 2321681, 2087284, 2129039, 2067246, 2318730, 2045284, 1816602, 1957358, 2119999, 1794420, 2110889, 1680909, 2034232, 2047475, 1703301, 1576187, 1734519, 1875164, 1994818, 1914209, 1478382, 1885425, 1924818, 1470667, 1991942, 1815071, 1515125, 1508597, 1732949, 1750643, 1750729, 1956919, 1841772, 1778313, 1661570, 2039446, 1519646, 1285975, 1588528, 1489889, 1700305, 1581318, 1927501, 1320458, 1578055, 1277583, 1733529, 1470340, 1485982, 1641822, 1348070, 1404639, 1475600, 1553686, 1353775, 1509249, 1594931, 1474783, 1247527, 1510773, 1373798, 1274954, 1113116, 1159957, 1407075, 1189066, 1518098, 1373326, 1402330, 1139045, 855657, 1532363, 987108, 1060134, 1249971, 1140851, 1184479, 1227192, 1491843, 1221943]
13876A221943k07118J08516q5017K62694p6394n0771J78731j45063K29786l29886
13866A107421P4805l5213k79000M34167l80366K81898o0044R9371r1481j60178
13856I91380j76158J88016k31292O52443l40814K48717l88717L09524j43671j60230
13846I49198j4613J12447K19880j56140k50794J94999k34886n7873Q9656K6295
13836H78169Q1952p5625K25775k1330o0890k6647k7686L06553n08280O6742N928
13825H44661M84782k15764j07227K6109M4382L8667l51465M51176J71823F75491
13814H35523K91516k06072k0105Q2492j2196l84051L83648K19040k25102l1730
13804I32963P9282j1658P9629k86382O5917J0895l8169j91203L01809l39050L10020
$$ y = [1221943, 1014825, 1123341, 1038324, 1301018, 1224624, 1173853, 1352584, 1207521, 1437307, 1107421, 1182226, 1147013, 868013, 1302180, 921814, 1203712, 1143668, 1243039, 1151558, 991380, 815222, 1003238, 771946, 1424389, 1083575, 1332292, 943575, 1253099, 1109428, 949198, 934585, 1047032, 1266912, 1110772, 859978, 1054977, 820091, 762218, 851874, 878169, 960121, 884496, 1110271, 1088941, 1028051, 1001404, 973718, 1280271, 771991, 838733, 844661, 1329443, 1113679, 1006452, 1032561, 1076943, 1115610, 764145, 1215321, 1387144, 675491, 835523, 1127039, 920967, 900862, 983354, 971158, 587107, 970755, 1189795, 964693, 932963, 1012245, 1000587, 1080216, 793834, 859751, 870646, 832477, 641274, 943083, 604033, 914053]
13793I14053j50731k6180N2873K00597l8539p394p3599j93598L4738N21509m53472
13782G80257o871j13490K74251l25732J21817j60229K35543K29541k82580j89874
13772E62633L40384l34631K05010j03115k5150L0520P4035M2167k06571K75073
13762H60355k97788N931R3458J61178k93826J80339R2672k38541j41688J72669
13752E94759q6855R609L68995k5304k9650l74136L20282M8952j44202J09736M1453
13741H33639k77000N5198R504L31876l37283q6421O15730l47052k68771K75887
13731H05307J40774j84776J8368k2247l14863J80891J70492l56627L527J80657
13721F21503l07550K61572N4541k40469L82143j53545M2987j79439K01484k43189
$$ y = [914053, 763322, 737142, 790015, 990612, 952073, 944679, 871080, 677482, 712220, 1233729, 780257, 773386, 659896, 934147, 608415, 730232, 570003, 805546, 1035087, 752507, 562633, 903017, 568386, 773396, 670281, 645131, 675651, 749686, 791853, 585282, 860355, 562567, 568498, 661956, 823134, 529308, 709647, 802319, 563778, 422090, 594759, 507904, 517513, 886508, 861204, 831554, 457418, 777700, 826652, 682450, 792186, 833639, 556639, 611837, 621341, 953217, 615934, 529513, 1145243, 798191, 529420, 805307, 946081, 761305, 779673, 757426, 442563, 623454, 793946, 437319, 440846, 621503, 313953, 575525, 630066, 389597, 771740, 618195, 661182, 481743, 683227, 440038]
13711D40038M29767l32709K07262k57431L554j85715J02526O6412J87912J8464
13701F80080J60644p6117R2111D20406J99351k49390K02698K05416k99667Q3155
13691E61969P2237O592o8059k12029K60855q6863j30078r0877M54369j31993k98910
13680C37213L98874C11208K21216p0669J16871p0875j08776k7020J03732A69161
13669B86747k9908N33322p1187B85545K28231A58203K84642B12742N41577k72196
13659D82123J172M9157N6831j31116j93133R6577L34667l46862m6317K69244J31030
13648G03373l09499r5396L8225J29364K2545K37251k81102j30348K99773j88025
13638D26161j85999L23994q7397m9961N0468K8435p3547M2374N3102j99495J01944
$$ y = [440038, 869805, 537096, 744358, 486927, 490481, 304766, 407292, 473704, 661616, 680080, 840724, 764607, 856718, 420406, 619757, 370367, 573065, 778481, 478814, 561969, 634206, 640798, 572739, 360710, 621565, 534702, 404624, 313747, 768116, 636123, 337213, 736087, 311208, 532424, 461755, 578626, 507751, 398975, 371955, 475687, 169161, 286747, 256839, 790161, 718974, 285545, 513776, 158203, 442845, 212742, 754319, 482123, 483295, 532452, 589283, 458167, 265034, 361611, 696278, 349416, 303099, 572343, 703373, 393874, 298478, 336703, 466067, 488612, 725863, 444761, 314413, 614186, 426161, 240162, 564156, 476759, 426798, 477266, 505701, 432154, 474528, 527630, 328135, 430079]
13627D30079r5442j58969L4990J07964r4312N4501K77425j62483j75253L37399
13617E55899k10661J04967N12085D17419K15547k35867o1529J62065j04381M29683
13607H22937B07346J25352J95435j77471J06147D7173J9156N42056A61961J5225
13597A77186J59682j18730K52658L0618j01263J29248B37862J25204J23246j38048
13587C48264J33090j4101A67122K12740i111E16151J42902j99849A75593L76646
13577E52239F6450J74530B7236M50914A06043M54473E9899M41706B01339J07190
13567C08529p258k6298j17640L5208K59971B03200D8396J90503N95612l29742
13557E04769k43192J21469A27081Q4860J50494j8348j09592Q6877B4544J59294
$$ y = [430079, 334637, 175668, 210658, 318622, 224310, 278811, 556236, 393753, 218500, 555899, 345238, 450205, 962290, 417419, 632966, 397099, 335570, 497635, 393254, 822937, 207346, 332698, 528133, 350662, 456809, 47173, 66329, 608385, 161961, 177186, 336868, 218138, 470796, 501414, 400151, 529399, 237862, 363066, 486312, 348264, 481354, 467253, 167122, 379862, -9111, 516151, 659053, 459204, 175593, 552239, 66450, 240980, 27236, 478150, 106043, 560516, 59899, 501605, 201339, 308529, 301271, 274973, 157333, 192541, 452512, 203200, 48396, 238899, 834511, 504769, 261577, 383046, 127081, 211941, 362435, 344087, 234495, 321372, 24544, 183838]
13547A83838R887K20720A28846A1600K69294A30116P0980Q5424A2476M71768f5071
13535F38597j19121k46146J11431j69413J57097L5277A76441K15116L25341k84459
13525D32439j75101j09785J54007D8835K18614L96446j553B62948A09111M20293
13515E29404J21190j27636B56172K04535O4481r0356j93621E6901J78589P185
13505B42675l161K99889A79922R3329J7491K06151k34404k8491K80329L1388m6154
13494D99561j84963K0682p1474j21395J50231G1749J34178Q7586j3240n4551r6670
13483A29052Q776K68606B02198H3438L68603j57213N2746K33368k53712m4093
13473B83137q0464Q5409J33020H615K46137A00415R9777L6100J77865A5429L99048
$$ y = [183838, 193725, 414445, 128846, 11600, 280894, 130116, 201096, 286520, 12476, 484244, -65071, 638597, 519476, 273330, 384761, 215348, 372445, 407722, 176441, 391557, 716898, 432439, 257338, 147553, 301560, 48835, 267449, 663895, 662342, 262948, 109111, 529404, 650594, 522958, 256172, 460707, 525188, 434832, 241211, 56901, 235490, 242675, 239514, 539403, 179922, 273251, 290742, 496893, 262489, 233998, 514327, 545715, 499561, 314598, 335280, 263806, 142411, 292642, 71749, 205927, 293513, 280273, 225722, 129052, 137828, 406434, 202198, 83438, 452041, 294828, 347574, 580942, 327230, 283137, 202673, 288082, 421102, 8615, 254752, 100415, 200192, 236292, 414157, 15429, 414477]
13462D14477A49225E8451J23022J48937N2758A71197B1076N02548k02041j48099
13452A73484P1864J54885j94155g7526C50035j19987M3279J71162A99075a0988
13441B84315p0074N6633j9225D5646J37933J29050G2360L30612J71937j98691
13431C76218j49250H4361J38327C0072K57581D9425L40663A87583E5892M33861
13421D89753m8415A76162q7603m68J44805d4312F6282J03400J81266a0374j19482
13410a29856C71923l0007J84901A41966b6570C92844A86534J6241a33279A13737
13399A49385F2079K44920a53992B83691K76636E6639j4362J60551n5045B2803
13388C28252A36779E5671a74843C39781A29776R0870J15018j25497M6149b7892
$$ y = [414477, 149225, 58451, 181473, 330410, 383168, 171197, 21076, 523624, 321583, 173484, 245348, 400233, 206078, -77526, 350035, 230048, 273327, 444489, 199075, -10988, 284315, 214241, 270874, 251649, 45646, 183579, 312629, 72360, 402972, 574909, 376218, 226968, 84361, 222688, 30072, 287653, 49425, 390088, 187583, 55892, 489753, 441338, 176162, 88559, 88091, 232896, -44312, 66282, 169682, 350948, -10374, -129856, 371923, 341916, 526817, 141966, -26570, 392844, 186534, 202775, -133279, 113737, 149385, 62079, 306999, -153992, 283691, 560327, 56639, 42277, 202828, 147783, 22803, 328252, 136779, 55671, -174843, 339781, 129776, 220646, 335664, 210167, 256316, -27892]
13377C99167A06659J5784K27456l7659J58063g831j30433E61848F6681g8165l9475
13366a17640B75092K27688L3648B31907m4004l1297L6911P7351J35443A60110
13355A03360n1348L73265j10287m7277k9923D3956K23086k4075H4581K57785j56203
13344A86163K21703J00956k07696j15032K17290J688q0673r9293P1657j30652
13334A66111M6392D2K49521P3082L2916A72260M414M4136r5952K50077l1394l4524
13322C09017A05722l7652e6667E23865j89607l0343j2034J97599l8951k19619
13312B30910K65069B27551J418q4071d3738C45140L8662A10790m5070J88665b8878
13300C11696P0730D8844L62557n0486A38172M8362B3529h6469F9261J31096b06669
$$ y = [399167, 106659, 122443, 349899, 312240, 470303, -7831, -138264, 561848, 66681, -78165, -117640, 275092, 502780, 536428, 231907, 187903, 156606, 193517, 270868, 406311, 160110, 103360, 52012, 425277, 314990, 267713, 237790, 43956, 267042, 242967, 84581, 342366, 186163, 407866, 508822, 301126, 186094, 403384, 405072, 324399, 225106, 296763, 166111, 212503, 42, 249563, 322645, 355561, 172260, 176674, 220810, 124858, 374935, 343541, 309017, 105722, 68070, -56667, 523865, 334258, 303915, 291881, 489480, 450529, 230910, 495979, 227551, 228969, 144898, -43738, 345140, 383802, 110790, 65720, 254385, -28878, 311696, 382426, 48844, 411401, 360915, 138172, 186534, 23529, -86469, 69261, 200357, -206669]
13288d3345D03336J3159o9828B5956J68087a77568F9925J22379e0219B8672J9943
13277D8615N2450Q2803G2215L34056m1009G6350J32593I0035C9205L35836A08021
13265B6873M1604J77412N02909B69247G8879Q2122i1049H8889K94006H9573f5644
13253C26855A06865d794F0150J31100c66062D1833b63432A06334k6150L75095
13243D55279H39J05118n1942M4979Q515J10096a19927C44025A00903L1489N1908
13232A84300q5449h8046H3393K5833K95675d3771j67974A02985L3250b1670D24572
13220A35110C9093d5378G8042k911J53K08031a24251K6927A89908G7878a22685
13208B36429A05682L94490A96650a86422A70529G8287i1680K0410B87317R075
$$ y = [-43345, 403336, 416495, 346667, 25956, 194043, -177568, 69925, 192304, -50219, 28672, 48615, 101065, 183868, 72215, 406271, 365262, 76350, 208943, 90035, 39205, 375041, 108021, 26873, 68477, 245889, 748798, 269247, 78879, 161001, -91049, 88889, 382895, 89573, -65644, 326855, 106865, -4794, 60150, 191250, -366062, 41833, -263432, 106334, 80184, 455279, 839, 105957, 54015, 98994, 107509, 217605, -119927, 344025, 100903, 132392, 184300, 98851, -88046, 83393, 109226, 404901, -43771, -211745, 102985, 136235, -21670, 424572, 135110, 39093, -45378, 78042, 75131, 75284, 283315, -124251, -97324, 189908, 77878, -122685, 236429, 105682, 500172, 196650, -186422, 170529, 78287, -91680, -71270, 287317, 296392]
13198B96392j34049H0811J45347I2323Q7931K68347k16618o0788l9449J22033
13188B53779A20604K42562B5877J04844D4067K68505j02003b9026q807B4229R7722
13177A21951P5949J14803i3250E9904Q8228K48951b21939H3901P9773d6279J5784
13166c0495C00791o743j19660L6833i1816G4550c3682r6606A53477K04481a35848
13154A06119g0611l3529B57981P6986K9598J25645k27614a61612B61210m5752
13144B15458k0906D6703Q2994l9359a4695B16355L24286B14804e6562j2108j57207
13133b25877A09951J34541a6512B15412p2116L29730f6078b3249N374j00343n2284
13122a70502B29856a49118B09844q1135a14755C86071a05482B29507q3368L1657
$$ y = [296392, 162343, 80811, 226158, 92323, 180254, 448601, 231983, 171195, 131746, 253779, 120604, 363166, 25877, 130721, 44067, 312572, 210569, -29026, -37833, 24229, 121951, 197900, 312703, -93250, 59904, 148132, 397083, -221939, 83901, 163674, -46279, -30495, 300791, 294048, 174388, 211221, -91816, 74550, -33682, -130288, 153477, 357958, -135848, 106119, -70611, -104140, 257981, 334967, 364565, 490210, 262596, -161612, 261210, 215458, 194552, 46703, 129697, 90338, -14695, 216355, 540641, 214804, -56562, -68670, -225877, 109951, 244492, -16512, 215412, 143296, 473026, -66078, -23249, -17875, -118218, -170502, 229856, -149118, 209844, 128709, -114755, 386071, -105482, 229507, 146139, 177796]
13112A77796f6994q0653D8985J59251o4688R4559C2289J31922a19502G4822d5602
13100I5694e4404j04370A76837g7335A96535f8606e725j7277A37016B0585J47870
13089A68455j5954i8151F3270r978k063c0502j2582n672C4229f4739C50802b34366
13076C21653l5155a71493A9743J99744g0918C9230J46714j7162J68308A62258
13065A58866D3249O1746L30573A5801K70258j21526a0367l6429l4012A09883j9351
13054I0532D47J24034f6768B37522K22685E7700J21651h3043A87488L1946o0017
13043A59417A8066a01291D48796a03368P067A42739D8017a5432H387L9744a34616
13031A05046J93286J9418a19257M968C7282f951D3470c3651A32241M0870J45162
$$ y = [177796, -66994, -147647, 48985, 208236, 143548, 238107, 32289, 164211, -119502, 74822, -45602, 95694, -54404, -158774, 176837, -77335, 196535, -68606, -5725, -23002, 137016, 20585, 168455, 152501, -98151, 63270, 53292, 51229, -30502, -43084, -48756, 34229, -64739, 350802, -234366, 321653, 286498, -171493, 19743, 219487, -70918, 39230, 185944, 168782, 337090, 162258, 158866, 43249, 104995, 435568, 15801, 286059, 164533, -10367, -46796, -80808, 109883, 90532, 447, 124481, -66768, 237522, 460207, 57700, 179351, -83043, 187488, 219434, 159417, 18066, -101291, 448796, -103368, -96301, 142739, 48017, -15432, 8387, 48131, -134616, 105046, 298332, 317750, -119257, -114289, 37282, -6951, 43470, -33651, 132241, 173111, 318273]
13020C18273e7058b7265m4582A21664Q3731J05381a06370B357J0536K83142a08806
13008A29771l2403J45039B2305a42927C49582c28833B19147J97995A92806J06155
12998B98961j27194p9630J2659a36463j73673J46293C93698F5604P2433F4482
12987a24072J4135D2214K44804Q9119F5121K10003a5421j82645A14133a9621q3773
12976a03394r6969n2663C21786a38081N332K3977A38646F3472G828K53803b93932
12964C57080A4737J65566H3933b37955B90861j14245G8273c1667I9656J53738
12954B53394J62199J3148A89860A39c84015a54811A29305K76865j65160E5634
12943E4606E859c668j18109J6588A8039i5553C4328Q237J9176P7465a5901B3845
$$ y = [318273, -57058, -27265, -71847, 121664, 205395, 310776, -106370, 2357, 12893, 296035, -108806, 129771, 97368, 242407, 22305, -142927, 349582, -328833, 219147, 417142, 192806, 298961, 171767, 92137, 104796, -136463, -310136, -163843, 393698, 65604, 138037, 64482, -124072, -109937, 42214, 287018, 376137, 65121, 275124, -15421, -198066, 114133, -19621, -103394, -200363, -253026, 321786, -138081, -132749, -108772, 138646, 63472, 7828, 261631, -293932, 357080, 14737, 180303, 83933, -237955, 290861, 176616, 78273, -31667, 99656, 253394, 415593, 428741, 189860, 139, -384015, -154811, 129305, 406170, 241010, 55634, 54606, 5859, -3668, -121777, -105189, 18039, -95553, 34328, 42565, 61741, 139206, -15901, 23845]
12930A47633J9113a50363C08191A37148m1274N5005a51186M73B17662m1459a91795
12918e5810n9166A6126L4564K06593g1772B01069J38087d45356A33957h458q3180
12907i1638A30375L4613J28037C0207L15727a77436b5535B00304e8981F1872B3903
12895a14910p2080I6962K4819g0367q0504j7520B24870a82852C20856A24942B4039
12883A42516a2007q9370L6858D11606A63173c14672B81165D3804a33438A46411
12872A43944k3460J34257r5119l5153i5863A47096b11275h5278B6860b11609i1032
12860C6805b9508l11666D12326n4496a59288A42804g4847j2276B12254D6997B790
12848a07219E2554J45802d26B5219a75010G9173a13850B28331P3582j05399a11738
$$ y = [147633, 166746, -150363, 308191, 137148, 95874, 150879, -151186, -150713, 217662, 176203, -191795, -55810, -114976, 16126, 50690, 257283, -71772, 201069, 339156, -445356, 133957, -8458, -91638, 130375, 164988, 293025, 30207, 345934, -177436, -25535, 200304, -58981, 61872, 23903, -114910, -186990, 96962, 121781, -70367, -150871, -168391, 224870, -182852, 320856, 124942, 24039, 142516, -12007, -101377, -64519, 411606, 163173, -314672, 281165, 43804, -133438, 146411, 143944, 120484, 254741, 159622, 124469, -95863, 147096, -211275, -85278, 26860, -211609, -91032, 36805, -29508, -341174, 412326, 357830, -159288, 142804, -74847, -87123, 212254, 46997, 2790, -107219, 52554, 198356, -426, 25219, -175010, 79173, -113850, 228331, 301913, 196514, -111738]
12836a21047I6403J73970j3403h4328C65246g2119j89637A66250o9771k6672K7654
12825I7461F300K35180a51743j0652K4764A35783j1346J3765J5686J71804j20080
12814B05612a47969b5428A0839J14382m2567i7840A06803O5407o198D1113R080
12803E0193b47442B45596D8788a62028j69478C77541c63867C3175J98859B0700
12792H5165a14414b8104F2110c1409C28860g9321B59233j19327n2808a36309q367
12781a44676b8073A88348K0343j7212l6614c2030j4220C1059J32392A4525D685
12769d5811j64476B05179q4095J39562a50544A14918g5703o1074N0004H870J9411
12758B8281h1628B06478G2967a65943M729P0827K5069l2493A34010I562m120K2966
$$ y = [-121047, 96403, 270373, 256970, -84328, 365246, -72119, -261756, 166250, 96479, 69807, 97461, 6300, 241480, -151743, -162395, -137631, 135783, 124437, 138202, 153888, 325692, 205612, -147969, -25428, 10839, 125221, 82654, -97840, 106803, 172210, 166012, 41113, 50193, -247442, 245596, 48788, -162028, -331506, 377541, -363867, 33175, 232034, 20700, 85165, -114414, -28104, 62110, -31409, 328860, -79321, 259233, 139906, 87098, -136309, -144676, -28073, 188348, 208691, 191479, 154865, -32030, -46250, 31059, 163451, 14525, 4685, -45811, -210287, 205179, 121084, 260646, -150544, 114918, -75703, -136777, -86773, 8870, 28281, -81628, 206478, 72967, -165943, -161214, -90387, -65318, -97811, 134010, 9562, 5442, 28408]
12746B8408J380K9846a33486A43407b91221D24649A55043b46129C63354A67997
12735A42502J60420j22192b46333C8613M8960J39220d929A09371k4869k7076L253
12724F0679a62802D5579a17032D8714J72728B3889K12766a62773M3637A62676
12713G2445N5108d4134C46712A41306D6829J00230P6315Q5763O7114A68714R8583
12702B67297k0903p5486n3541P7414c8361B67283G9892J7045l060a24842e2211
12690I9551a25762J8626j64943A98958i503p5524B36669i6624A72358l9323J08982
12679B42017a10268D65771h0293B57908j7288K21390a2671C76326r3326f6929
12668H3096C7652c7925B72870q5271E5867K19263E7226J87567q7264k7873M2021
$$ y = [28408, 29788, 59634, -133486, 143407, -291221, 424649, 155043, -246129, 363354, 167997, 142502, 302922, 180730, -246333, 38613, 87573, 226793, -4929, 109371, 84502, 57426, 60679, -162802, 45579, -117032, 48714, 221442, 23889, 236655, -162773, -119136, 162676, 72445, 127553, -44134, 346712, 141306, 46829, 147059, 223374, 309137, 376251, 168714, 267297, 246394, 170908, 117367, 194781, -38361, 267283, 79892, 96937, 93877, -124842, -52211, 99551, -125762, -107136, -272079, 198958, -9503, -85027, 236669, -96624, 172358, 133035, 242017, -110268, 465771, -80293, 257908, 240620, 462010, -12671, 376326, 283000, -66929, 83096, 37652, -37925, 272870, 187599, 55867, 275130, 57226, 244793, 157529, 129656, 171677]
12657A71677a19D03023j67980a2422D15983j50028R3282N4983j90072F6530K62494
12646C29024a69329n3383B70088I0421a66523d3438o0580J8457B78365A02035
12635I5902J26754c01058C92497I361L06971C6492K91876b949D39069K09796A57438
12623i4505B38698l997d557A41869J29090j29662d1895k25893a09507C25328a07220
12611A99594a3725r4007H2030j4245i6788p4361e7992C71914j32493C5921J54127
12600A90048p6879f1710A69525E0717i744A60110f4686B64684j12967C3661L6487
12589G0148K48773H7926f8464A28482J24514A8048J84271d8991I9604a34213C2316
12577d15064A50897N815K293b30460q1628H5998K85982a24774A79234a22437n6205
$$ y = [171677, -119, 403023, 235043, -12422, 415983, 265955, 359237, 414220, 224148, 66530, 329024, -169329, -222712, 270088, 90421, -166523, -43438, -104018, -85561, 278365, 102035, 95902, 222656, -301058, 392497, 9361, 316332, 36492, 328368, -2949, 439069, 648865, 157438, -94505, 238698, 234701, -4557, 141869, 270959, 141297, -41895, -267788, -109507, 325328, -107220, 199594, -13725, -107732, 82030, 67785, -96788, -171149, -57992, 371914, 239421, 35921, 190048, 113169, -61710, 169525, 50717, -9744, 160110, -64686, 264684, 151717, 33661, 70148, 318921, 87926, -68464, 128482, 252996, 18048, 202319, -48991, 99604, -134213, 32316, -415064, 150897, 156712, 159005, -230460, -312088, 85998, 371980, -124774, 179234, -122437, -178642]
12566a78642D9708i0275H0355l3540b5690J0764r330G2345c91862m8243H0731
12554A31262a35617p9928F0350P7578M5637b5627k53823i3219G6224J53826a89969
12542e3632C4158L5571A3941J18633i5364B42549c5592A21760K8500h3039j9050
12531a02089l3818A37819c8376o2026B29191b10989F5593b9767B35361c0374A321
12519c4562A42675K31779B1986c0496H6202b9188A2084J30433l0909J18261A2866
12507A36944g7925C0522b36070A28344K58910j23191c7391l62634E6622a4600
12496G1847b92559A04837J18728r7554Q3194c05150a08242k0241n5097D8717d39601
12484H5853K33342m7291A5361K63249C9024J43234F7948d8671B47384M2518a53946
$$ y = [-178642, 49708, -90275, 80355, 46815, -25690, -14926, -24256, 72345, -391862, -440105, 80731, 131262, -135617, -215545, 60350, 137928, 183565, -25627, -279450, -93219, 76224, 230050, -189969, -53632, 34158, 69729, 13941, 132574, -95364, 242549, -35592, 121760, 150260, -83039, -102089, -135907, 137819, -38376, -100402, 229191, -210989, 65593, -29767, 235361, -30374, 1321, -34562, 142675, 374454, 21986, -30496, 86202, -29188, 12084, 142517, 111608, 229869, 12866, 136944, -77925, 30522, -236070, 128344, 387254, 264063, -37391, -400025, 56622, -14600, 71847, -292559, 104837, 223565, 126011, 209205, -305150, -108242, -128483, -183580, 48717, -439601, 85853, 319195, 271904, 15361, 278610, 39024, 182258, 67948, -48671, 247384, 289902, -153946]
12472i7633B54860a55025b8100p2016k57308R0112A52944g1855q8196A67459n9965
12461A07494L40099A26765J42170B9827b13184j30379A21778J25744f0086f398
12450b73561A16977a19561a465l46280a03272B9508a17327j2260d4546F1699c75751
12438A73883f474G3944J2274K87103A86401c6705q6A3746M6713Q6687d6494A13773
12425i5038l3960n7013j9803A28413M727j9691a16530F6091K6107L727K8780d2099
12412e6313A2162c89181A82220b04475A8387a3895A87443a76992A46577P6615
12402B23192G6853a77755j03555C27538j23316F420c25813f1836C86109d2492
12391d9863B54130F7246J89036a56210C35169j20963c34017E6464K03662j03866
$$ y = [-97633, 254860, -155025, -28100, -100116, -357424, -267312, 152944, -71855, -160051, 167459, 107494, 447593, 126765, 268935, 29827, -213184, -343563, 121778, 247522, -60086, -6398, -273561, 116977, -119561, -1465, -347745, -103272, 29508, -117327, -129587, -44546, 61699, -375751, 173883, -6474, 73944, 86218, 373321, 186401, -36705, -36791, 13746, 60459, 147146, -46494, 113773, -95038, -128998, -186011, -205814, 128413, 133140, 113449, -116530, 66091, 92198, 95925, 124705, -42099, -56313, 12162, -389181, 182220, -204475, 18387, -13895, 187443, -176992, 146577, 223192, 76853, -177755, -281310, 327538, 204222, 6420, -325813, -61836, 386109, -42492, -49863, 254130, 67246, 256282, -156210, 335169, 214206, -334017, 56464, 260126, 156260]
12381A56260j5622B0423a55674c0618E6714K42216b5450j40722B06811a30005
12370F4338d0195A56330i4244D641a52411c6791l17652A23829a22434c1316k00043
12359b31359B27578N7168h5108D2109J22101b44837A17732J50436a4260I2055
12348c06504H2148h2139C05782D1123i4606c0700dB71856H4138O2981C6831a52116
12335D4011b27447D3652b56358C14679A5973C085a97164A83242J4615b68562C7360
12323A76104e3322n5036d0015l14908a29945b8943m49200a43895A10776d4788
12312C5590a73755F830f9527j14268A17500b66852B75037c59125I1288a78848
12301d9807j41635B63860J0805G3002e4086G5211J71902F4220L7743d3743A24238
$$ y = [156260, 140638, 20423, -155674, -30618, 56714, 298930, -25450, -166172, 206811, -130005, 64338, -40195, 156330, -94244, 4641, -152411, -36791, -354443, 123829, -122434, -31316, -231359, 227578, 284746, -85108, 42109, 164210, -244837, 117732, 268168, -14260, 92055, -306504, 82148, -82139, 305782, 41123, -94606, -30700, -4, 271856, 84138, 147119, 36831, -152116, 44011, -227447, 43652, -256358, 314679, 15973, 3085, -197164, 183242, 197857, -268562, 37360, 176104, -53322, -108358, -40015, -354923, -129945, -28943, -478143, -143895, 110776, -44788, 35590, -173755, 6830, -69527, -183795, 117500, -266852, 275037, -359125, 91288, -178848, -49807, -191442, 263860, 274665, 73002, -54086, 75211, 247113, 64220, 101963, -43743, 124238]
12289C02528j47072J16259B4007R4183D6244F510J25793e6624H304J20131B6965
12277c5938E6364K72683E472J56183C6644L42939j06997p1775o970Q1294A30018
12265a07582A54714F7904a19351A31582P5516c0936B5596J55996M251K18480r8669
12254C05654e0781B29790C6481a207j98600m6523a9074A01867c27177H219O8118
12243G6337K29954K10153B28500H1035A3479a19674L5781j90976h339C00038j26521
12232A73517E0652Q1120f9731A37893m7472D5039K91956j08587C6137J84323M0531
12221B60991j00483a53932E24346B26783M02759A06240K44709n9435A29878a61719
12210a20994B10641i6652A36832L4308L969g753I5597a30544B68854k3792A19584
$$ y = [302528, 155456, 271715, 24007, 118190, 46244, 6510, 132303, -56624, 8304, 128435, 26965, -35938, 56364, 329047, 5472, 161655, 36644, 379583, 272586, 200811, 193841, 275135, 130018, -107582, 154714, 67904, -119351, 131582, 207098, -30936, 25596, 181592, 185843, 404323, 305654, -50781, 229790, 36481, -1207, -199807, -246330, -19074, 101867, -327177, 8219, 76337, 306291, 516444, 228500, 81035, 13479, -119674, -83893, -274869, -8339, 300038, 173517, 50652, 131772, -69731, 137893, 90421, 45039, 336995, 228408, 36137, 220460, 260991, 160508, -153932, 524346, 226783, 629542, 106240, 350949, 291514, 129878, -161719, -120994, 210641, -96652, 136832, 171140, 175109, -7753, 95597, -130544, 268854, 245062, 119584]
12198d9185C61332j60808K06160A13705a05229B21782m0549K43353J2058q9457
12188C47187J57084g0335A17531a5270D8720p687J48086R6980C2074J07616d5350
12176a79166p2429A36544B6944c10732C26405k2138J9257D5352L55602A79360
12165D0134M68904a3955m0638C6689J99204K8941E8396N861L9234i457B65507
12153b759k9325H0480Q5285e9417B26045f764H322a1139p437l6836A10157i5271
12140C6798K77413j21494a18824K649K7810I0036a4441j4237d607r8246d2209
12128h188A39180g1033C2252c8887A08139J57017h3801j51592J11976O997H1347
12116a0195A7327a70257c6356k8261L0397D44217g3574G6499d58236a33530p9131
$$ y = [-49185, 361332, 200524, 406684, 113705, -105229, 221782, 181233, 424586, 436644, 347187, 504271, -70335, 117531, -15270, 48720, 41033, 189119, 286099, 32074, 139690, -45350, -179166, -251595, 136544, 26944, -310732, 326405, 304267, 323524, 45352, 400954, 179360, 40134, 509038, -13955, -54593, 36689, 235893, 264834, 58396, 64257, 103491, -9457, 265507, -2759, -32084, 80480, 165765, -59417, 226045, -6764, 8322, -11139, -18576, -55412, 110157, -95271, 36798, 314211, 192717, -118824, -116175, -88365, 90036, -14441, -28678, -4607, -102853, -42209, -8188, 139180, -71033, 32252, -38887, 108139, 265156, -83801, -235393, -123417, -116420, 81347, -10195, 17327, -170257, -36356, -64617, -34220, 444217, -73574, 76499, -458236, -133530, -212661]
12105b12661B71270a1404B9495R1917a17016M5168A7773a3909C79153D4872b2705
12093A96433e007j70898i047A08039K29557A56851a40189B08980b71k2131C7790
12081C26833a96037i3773c5198E8586K2546c71661a00170A84108b17090B694P4775
12070G7469b91204H8496C9973K8588b7954B8521h3978A80333g2765A33397P7490
12059B10887A3827L07355O6839J56700J85072J442808A042551A93019h6357C8681
12048A89007B233J89390F6404l1454c2243A33662f4502B96408a22273B21131f3410
12036A25692c02678A94925b7950a0340l9607q8396e5575B06824i4474L5423H5094
12024A80446q6244b03857A28358k7035c53490B50141j2242j17491a62466C0915
$$ y = [-212661, 271270, -11404, 29495, 121412, -117016, -71848, 17773, -13909, 379153, 44872, -22705, 196433, -5007, -175905, -9047, 108039, 337596, 156851, -140189, 208980, -271, -22402, 37790, 326833, -196037, -93773, -35198, 58586, 81132, -371661, -100170, 184108, -217090, 2694, 77469, -291204, 88496, 39973, 68561, -27954, 28521, -83978, 180333, -72765, 133397, 210887, 13827, 321182, 388021, 544721, 729793, 2172601, 1042551, 193019, -86357, 38681, 189007, 2233, 191623, 66404, 34950, -32243, 133662, -64502, 296408, -122273, 221131, -63410, 125692, -302678, 194925, -27950, -10340, -49947, -138343, -55575, 206824, -94474, -59051, 85094, 180446, 94202, -203857, 128358, 101323, -353490, 250141, 237899, 120408, -162466, 30915]
12013C93552a01852B3424L05603A22184b75262A42517g2075q0462p8719b9586
12002A00470d9058B53371a40630F9716e0441p7341p9037C103a73947O9456p8329
11991a82820q8771E5992K39280f0885A7933e1668C46228g0353j71475A8791O9758
11980H8549A8806G362c90825A29401c01614b6781j39852D8225a90497o7914a06019
11968B3309b77235J07737A25075a02535d3611E3140a23187O761A34567b62081
11957e8413K2512q5775A18192h1990k53717J09897H2249J22276B3104a984A58094
11945a46657N5930C7434h6513C0878a40928b0856E5059a47676j6198k25855A08783
11933B50701a83430H7891J1030P271J74253b72815a34149B1657B73J01869A9026
$$ y = [393552, -101852, 23424, 329027, 122184, -275262, 142517, -72075, -152537, -231256, -29586, 100470, -49058, 253371, -140630, 69716, -50441, -127782, -206819, 3103, -173947, -104491, -182820, -271591, 55992, 295272, -60885, 17933, -51668, 346228, -70353, -241828, 18791, 88549, 18806, 7362, -390825, 129401, -301614, -26781, -166633, 48225, -190497, -258411, -106019, 23309, -277235, -169498, 125075, -102535, -43611, 53140, -123187, -116426, 134567, -262081, -58413, -35901, -121676, 118192, -81990, -335707, -225810, 82249, 204525, 23104, -1984, 158094, -146657, -90727, 37434, -86513, 30878, -140928, -20856, 55059, -147676, -163874, -389729, 108783, 250701, -183430, 87891, 98921, 106192, 280445, -272815, -134149, 21657, 273, 102142, 19026]
11921a60725B1966K75189I4666J65990b57648j80113C7008J20323k0808L5834
11911A72357J01824I7699a83024B12043a4314C8867K07606a13491A4067c82822
11900H644J68254i8964D6542h8195C66314b1454D772i3954n9441B78076C6174
11888b03320B26743r0585A8022a52770E6480a91820j2332j9560A45276a70916
11877h7344l32317g3802j4552d2440o2148j06093A40142F767e7178A05489J877
11866A07366J44378A755b10743F2637c02251J25798j09844D6179J10387J49207
11856C05773E8945P4232h2115l2851a2620j6794j63102Q5946k6420C1005a4215
11844B22998G6145K03406f1167E4682d3977b1980j68575E3708R9233l7551c0456
$$ y = [-160725, 21966, 297155, 94666, 260656, -257648, -437761, 37008, 157331, 136523, 172357, 274181, 97699, -183024, 212043, -14314, 38867, 246473, -113491, 14067, -382822, 8644, 176898, -98964, 46542, -88195, 366314, -21454, 4772, -93954, -153395, 278076, 36174, -203320, 226743, 136158, 18022, -152770, 56480, -191820, -204152, -223712, 145276, -170916, -87344, -419661, -73802, -88354, -42440, -104588, -210681, 140142, 6767, -57178, 105489, 107366, 251744, 1755, -210743, 62637, -302251, -176453, -286297, 46179, 156566, 305773, 58945, 133177, -82115, -114966, -12620, -29414, -192516, -106570, -132990, 31005, -14215, 222998, 76145, 279551, -61167, 54682, -43977, -21980, -190555, 53708, 152941, 115390, -30456]
11832A31147a45772F3826c25295I0242j4527c93857a66188c5619k3183o5929C1584
11820c7324q9904l825C15992I7587i8195E7696f9945k7987A46149n1411A3592
11808g8721A87891a69397H3453M4114a69908C93342A08689J92955a10900D2795
11797c92463A50483o8107J29066b0757A73494l2651a64870M1677A01941b37417
11786a15298j63587A05197g741k70232h405m7090j61831J6627H8958J25340q6718
11775A27580D3171h5601r9693i2400G1507J51832a46500A86212k9788Q9523P6581
11764C22528g5577e981A64662G4308Q4232e2685p6933G203a02313j23686B1159
11752D0032f445C56300j24685d08883a64211I6669g8981a1476A08066J03749b2153
$$ y = [131147, -145772, 63826, -325295, 90242, 75715, -393857, -166188, -35619, -58802, -124731, 31584, -37324, -127228, -131053, 315992, 97587, -98195, 57696, -69945, -97932, 146149, 94738, 13592, -78721, 187891, -169397, 83453, 127567, -169908, 393342, 108689, 301644, -110900, 42795, -392463, 150483, 82376, 211442, -20757, 173494, 140843, -164870, -123193, 101941, -237417, -115298, -278885, 105197, -7741, -277973, -8405, -55495, -217326, -200699, 88958, 214298, 127580, 43171, -85601, -185294, -92400, 71507, 223339, -146500, 186212, 156424, 245947, 322528, -75577, -5981, 164662, 74308, 158540, -52685, -129618, 7203, -102313, -225999, 21159, 40032, -6445, 356300, 231615, -408883, -164211, 96669, -78981, -11476, 108066, 211815, -22153]
11740c03023F6977g5365A9895h0992A83010n3458K01424H7586D2605L8363f0175
11728A0809J87797b1646j75535j9P4341N9204q3426g0864o4669c3026p3671A42321
11715C60058j6382a69249A33046D6034J07663c8371A23725G95c0827G6501J49533
11704B26034a27772c7684C30187b94846D30231D1403f984k7684A90550J7528A00294
11692i100j44506A50600M2206B8508a46696A48071a93654A42433k7754b2348b374
11680b02518a5507D5675g5323k28148a25005N5387A36049O4454B6484N2L2445
11669E8981p651b09586n411H4713a63456c804A17479N8945C2404q647K91828b6321
11656G3192a37409B12629r8016K05295j24176j4973k9064a03108j71272c120D05574
$$ y = [-303023, 66977, -75365, 19895, -80992, 183010, 129552, 330976, 87586, 42605, 80968, -60175, 10809, 198606, -21646, -197181, -197200, -122859, -63655, -147081, -70864, -135533, -33026, -106697, 142321, 360058, 343676, -169249, 133046, 46034, 153697, -38371, 123725, 795, -30827, 76501, 226034, -127772, -37684, 330187, -294846, 430231, 41403, -6984, -34668, 190550, 208078, 100294, -9100, -153606, 150600, 192806, 28508, -146696, 148071, -193654, 142433, 114679, -22348, -2374, -202518, -15507, 45675, -75323, -303471, -125005, -69618, 136049, 200503, 26484, 26536, 58981, 51330, -209586, -214997, 84713, -163456, -3804, 117479, 176424, 32404, 23757, 315585, -26321, 73192, -137409, 212629, 114613, 319908, 195732, 180759, 151695, -103108, -274380, -3120, 405574]
11644C90697b37820B57388m7133K03186D920L24108G6684p321a34104A45113o2666
11633H2447M827a8986a93l21325O272A31693Q5480a31927B77852A22204D0364
11621f5188A57992a72940A87163a26247F2699k6104m718K21679j10234a30678
11610B96566H7099a44855A37141b08502R1972A61946a61572D6082a14299a8741
11599e1076j57900A70190b89131C8118A7089a01410H3002J43148k3792a04968
11588a07018e0797B52777a36250A60613d3876C23670A38027a17198C20479a14206
11577F0881O2901F0223J65371K31864C9933K55244M5989H8965n576a22788B61589
11565a68681G5034J66655A9507a12537k03696b309C8476K79657b42538B01932
$$ y = [390697, -237820, 257388, 210255, 413441, 4920, 329028, 76684, 69363, -134104, 145113, 82447, 87274, -18986, -193, -321518, -315246, 131693, 217173, -131927, 277852, 122204, 40364, -65188, 157992, -172940, 187163, -126247, 62699, 36595, 31877, 253556, 143322, -130678, 296566, 87099, -144855, 137141, -208502, -116530, 161946, -161572, 46082, -114299, -18741, -51076, -208976, 170190, -289131, 38118, 17089, -101410, 83002, 226150, 202358, -104968, -107018, -50797, 252777, -136250, 160613, -43876, 323670, 138027, -117198, 320479, -114206, 60881, 123782, 60223, 225594, 457458, 39933, 295177, 341166, 88965, 83389, -122788, 261589, -168681, 75034, 241689, 19507, -112537, -316233, -2309, 38476, 318133, -242538, 201932]
11554B28683e1587K288B94874P6602G6950L70022A68562P8578I0284O7002a3538
11542g1824C23276N6300A45104H655J92669H4163a528B23393a10985q2337C8398
11530a84529N9778N8621a3291A13573a1219B52131b62582A26913O2602J30452
11520C19967a5589G1091K06497r307E9925a11278j24873A63888l906d8490B2147
11508b9198J264B08613G1820K28652B2265K5381M49647a7282B91586g8547C97733
11496A67530K1237a34122G9109a48399q3745F0077m964R3094e74B47651O2549
11485C10200N682G589a62903D01139E6922M15769j84249o417l3088J88577g7089
11473B83290R6748A40202M3615p0731m1816K07055J01467q2847m9403o4310O2003
$$ y = [228683, -51587, -49299, 294874, 371476, 76950, 446972, 168562, 247140, 90284, 157286, -13538, -71824, 323276, 379576, 145104, 8655, 201324, 84163, -1528, 223393, -110985, -193322, 38398, -184529, -124751, -66130, -13291, 113573, -11219, 252131, -262582, 126913, 189515, 319967, -15589, 71091, 277588, 268281, 59925, -111278, -236151, 163888, 159982, -48490, 22147, -29198, -27934, 208613, 71820, 300472, 22265, 47646, 497293, -17282, 291586, -78547, 397733, 167530, 188767, -134122, 79109, -148399, -232144, 60077, 55113, 148207, -574, 247651, 310200, 315882, 7589, -162903, 401139, 56922, 472691, 288442, 282025, 248937, 437514, -77089, 283290, 380038, 140202, 183817, 113086, 71270, 278325, 379792, 296945, 247542, 183232, 245235]
11462B45235a51104m6642D37174j62233c767j06519C68370j55306r9269a19041
11451E45653A40016a10041g19A75856q0934H325L07274I3452J8177f2228j16026
11440a78254B33045O5983K22538d5170C9925c12280B83708D5634d0817A83491
11429b19292d458o1760k07182A1223L37452A18681J61787a00196E0534c4199F6146
11417A48324a03418l4670a321D2784K7978h5219m9073b303A66962b08130o6704
11406b74834C1366b02628h7564B89026A19270b5245B4748J24719K59296j50441
11396B58322b3348B38816J56131b78840A79787a33345B99281E3596c4946B12591
11385A2523c4287B17082O830J50720B4093c8014A44316F543N1415a13418M7919
$$ y = [245235, -151104, -197746, 437174, 274941, -3767, -110286, 368370, 213064, 113795, -119041, 545653, 140016, -110041, -719, 175856, 94922, 8325, 315599, 93452, 111629, -62228, -178254, 233045, 299028, 521566, -45170, 39925, -312280, 283708, 45634, -40817, 183491, -219292, -4458, -66218, -273400, 11223, 348675, 118681, 280468, -100196, 50534, -34199, 66146, 148324, -103418, -138088, -1321, 42784, 70762, -85219, -134292, -2303, 166962, -208130, -274834, 31366, -202628, -87564, 289026, 119270, -25245, 24748, 149467, 408763, 258322, -23348, 238816, 394947, -278840, 179787, -133345, 299281, 53596, -34946, 212591, 12523, -34287, 217082, 223912, 374632, 24093, -38014, 144316, 6543, 57958, -113418, -65499]
11374f5499D4975j7280a46606A42618h0847I273b00403J1032B19104j9337G4404
11362a83042q1877A68758n9372c18803E6954N9410j430k2439L9197n0128a17180
11350A10466a82862j11459A08877J45264d200A21671e6067d139C01267B1051J42978
11339A64029p4354c2738a3130l8020k8470b9385m161A3248J25618b62269C7273
11327a85579C30763h7422C37694p8714j20919A5576P1821J82926q3957a06535
11316A70067a97917A66037P8042d1497M716a7888k06198p5257G7214L0554a96480
11304C4067a30807e7154p1458A18938a52574j81823B47124A07337c10073e2975
11293H1730a0934j00253E4918a50301k5041A24939F2085b6882H2861J21990b50196
$$ y = [-65499, 44975, 27695, -146606, 142618, -80847, 9273, -200403, -189371, 219104, 199767, 74404, -183042, -264919, 168758, 109386, -318803, 56954, 116364, 114934, 92495, 131692, 81564, -117180, 110466, -182862, -294321, 108877, 254141, -4200, 121671, -56067, -4139, 301267, 21051, 164029, 89675, -32738, -13130, -51150, -79620, -29385, -33546, 13248, 138866, -262269, 37273, -185579, 330763, -87422, 337694, 258980, 138061, 15576, 87397, 270323, 186366, -106535, 170067, -197917, 166037, 244079, -41497, -36781, -17888, -224086, -299343, 77214, 107768, -196480, 34067, -130807, -57154, -128612, 118938, -152574, -334397, 247124, 107337, -310073, -52975, 81730, -10934, -111187, 54918, -150301, -175342, 124939, 62085, -26882, 82861, 204851, -250196]
11281f2572B80960C9893d5625n7119A34662D8120g1264j8036k04173b0654B07371
11269B44826e4547G3906a04381G1192a4373m9996F0597a04241j58967B23186d7459
11257B86895d71m8988C253J07590E1065J54422j0914b38913L4851k18692E9779
11245b2953H2770b89265i9737m8855d6596k117B89131a38221a8421j40486l4419
11234a93326I2773k6465a44967B22478h7871j22929h821A78961E1227J0845J66975
11223B29047b41194A76220C9461Q1a60470g7222C01429j02853Q6088A31944O7510
11212A99454n2520h1851E6672b14271I6823a35456o7929b1969A94904b67748A81996
11200a75762C62329B7393J38206d94078A60911a22125N193A67455d8079A70497
$$ y = [-62572, 280960, 39893, -45625, -102744, 134662, 48120, -71264, -89300, -293473, -20654, 207371, 244826, -54547, 73906, -104381, 71192, -14373, -64369, 60597, -104241, -263208, 223186, -47459, 286895, -471, -49459, 3253, 110843, 51065, 205487, 194573, -238913, -204062, -422754, 59779, -22953, 82770, -289265, -99737, -148592, -46596, -48713, 289131, -138221, -18421, -158907, -193326, 92773, 66308, -144967, 222478, -87871, -210800, -8821, 178961, 51227, 62072, 229047, -241194, 176220, 39461, 39542, -160470, -77222, 301429, 198576, 284664, 131944, 199454, 146934, -81851, 56672, -214271, 96823, -135456, -203385, -21969, 194904, -267748, 181996, -175762, 362329, 27393, 165599, -494078, 160911, -122125, -116932, 167455, -48079, 170497]
11189I8322L100i6379M0183k80427F797J79843a19148P304L4777q4360q9672L5644
11177b15455Q4347A76002l3884D193a86852D71454e1898m7220A60610a5067E5856
11165B17243b48601C3198M3896b4286A11181b34178a13513I9976J84381i9011
11154f3980G4529J64132a3726j32166j11421d7657o9123E8105J5208c0370A38754
11142I61Q1202b09952A01971J24548j05776B3446b53071E07504e9583B17655H960
11130C24405j33205o5496K20219a57942A04611A1543a42363D95428f5197m4656
11120a09853C444M15140c30199a55425C1686c4765E5512L2477J04550K97807a94520
11108C653L8245j0099J07001a71566A40470O3358q0851a2572A34782C3691K75241
$$ y = [98322, 101422, -96379, -56196, -336623, 6797, 186640, -119148, -111844, -77067, -161427, -251099, -215455, -131108, 176002, 142118, 4193, -186852, 471454, -51898, -99118, 160610, -15067, 55856, 217243, -248601, 33198, 77094, -24286, 111181, -234178, -113513, 99976, 284357, -99011, -63980, 74529, 238661, -13726, -145892, -257313, -47657, -116780, 58105, 73313, -30370, 138754, 961, 82163, -209952, 101971, 226519, 120743, 23446, -253071, 507504, -59583, 217655, 8960, 324405, 191200, 125704, 345923, -157942, 104611, 11543, -142363, 495428, -65197, -109853, 3444, 418584, -330199, -155425, 31686, -34765, 55512, 87989, 192539, 490346, -194520, 3653, 41898, 31799, 138800, -171566, 140470, 203828, 122977, -12572, 134782, 33691, 308932]
11097C08932D935J10306a97908A46781J6061c9294A18016J49226A6346J01304
11087A17650N3408L9634L760K80929j93308h7827B97219L66808l20027A39817
11076C78814m3394k8350Q3999E9166K3758L13958m2571L82535C61613J12388J61891
11065F35892k59364A15450N54641B17575K44462P7331B17863K18343R0039P0741
11055E96986L4911L7571N1472j20294L88909k05664o8461J55840k41065j56998
11045D73207L11138k7892k15383R4270M31208l35907L1792M4321k30433M13489
11035I89810l93854l6919L31154P7097l63921L34923m44455K45898j76017M48776
11025A012492k74423J2599M6118R2599l44875M16424j97348m3385N5557j69254
$$ y = [308932, 4935, 115241, -197908, 146781, 162842, -39294, 118016, 267242, 16346, 117650, 171058, 210692, 214452, 495381, 302073, -87827, 297219, 664027, 344000, 139817, 378814, 335420, 307070, 391069, 59166, 82924, 396882, 354311, 736846, 361613, 474001, 635892, 376528, 115450, 670091, 217575, 462037, 539368, 217863, 436206, 526245, 596986, 631897, 669468, 720940, 600646, 989555, 783891, 715430, 871270, 630205, 473207, 784345, 756453, 541070, 635340, 1066548, 730641, 762433, 806754, 576321, 989810, 595956, 559037, 890191, 967288, 603367, 938290, 493835, 739733, 563716, 1012492, 738069, 750668, 796786, 889385, 544510, 960934, 763586, 720201, 775758, 606504]
11015F06504L36723l04420K51801j19485l37870L55038N9174k80527M57058m11416
11005F12580k24211N49681l27584m0498K96169K04599k62687L32915k47984l31234
10995E61746M41770j67437J14661j97066m158P3086l2990R429r3129M3432M06094
10984A155438M9140k01916M1079J99088J02857j43079L58333j33880M54153M11216
10974B292429Q6209K02848L20790K19262j4185j17608J96869n8741j66226n42306
10964B419341J05279r2392o77961J70359P3265m87012N33155j16154K26162k11108
10954A942934j05055k56449p4651m55109q7252r9751l30369K07688C12989L42739
10944F55728k22683J6390j84198K1945J9354j15255G796L47435A58828K08986
$$ y = [606504, 943227, 638807, 890608, 771123, 433253, 788291, 847465, 566938, 1023996, 612580, 388369, 938050, 610466, 569968, 866137, 1070736, 808049, 1140964, 892980, 561746, 1003516, 836079, 950740, 753674, 749516, 822602, 789612, 799041, 705912, 749344, 1155438, 1204578, 1002662, 1043741, 1242829, 1345686, 1202607, 1560940, 1427060, 1881213, 2292429, 2378638, 2581486, 2902276, 3121538, 3107353, 2989745, 3186614, 3127873, 2961647, 2419341, 2524620, 2432228, 1754267, 1924626, 1997891, 1510879, 2044034, 1927880, 2154042, 1942934, 1837879, 1581430, 1506779, 1051670, 964418, 864667, 534298, 741986, 312989, 655728, 433045, 449435, 265237, 287182, 306536, 191281, 7796, 355231, 158828, 367814]
10934C67814j78693J43766E2713J39578J05244A32431J03862D4453J38352J2550
10924A95355m3858d6675d253C37356a22383j86399A05913l0340g062C9930a15504
10912h9484L9636A84600J245e3282m162C73613j80470H189o7a22537l2309f4188
10899H2988M949k187C7826J51140b8035A4939a19707D25384B7018a05971I0300
10887b62018J27398E750J7788h2056j11303D895K9817J0504a54195D56639c6226
10875E3170R8800e9520E5788A147b17057B3509R871J97568e4820B07700a32792
10863a31889A32769L84081a83092A71766a60253N8970k31045G6414a09553A47244
10852C18916g77j18140A7050J90544a15481K9560j45242D0575B190a31124M0053
$$ y = [367814, 189121, 332887, 52713, 192291, 297535, 132431, 236293, 44453, 182805, 195355, 151497, -46675, -4253, 337356, -122383, -308782, 105913, 75573, -7062, 39930, -115504, -89484, -49848, 184600, 185845, -53282, -57444, 373613, 193143, 8189, 8122, -122537, -154846, -64188, 82988, 87937, 85750, 37826, 188966, -28035, 14939, -119707, 425384, 27018, -105971, 90300, -262018, -134620, 5750, 23538, -82056, -193359, 4895, 34712, 45216, -154195, 456639, -36226, 53170, 151970, -59520, 55788, 1147, -217057, 23509, 33380, 230948, -54820, 207700, -132792, -131889, 132769, 516850, -183092, 171766, -160253, -101283, -332328, 76414, -109553, 147244, 318916, -777, -118917, 17050, 207594, -115481, -85921, -231163, 40575, 2190, -131124, -91071]
10841i1071j85888K9787a0932B0497i5996E1473b4629o3671j6275A13377c04942
10829B64387d26367A81903a62003d5616A24069a79093c7769B0180a64677L8854
10819a25823j35997H1294c0890j87624Q5067A92368B3017b17009E0967a25803
10808A11792C4103i4614r9488C55900F2000b66526K4730N4948J6868P51j43106
10797c12335J06386D16280a55115B38259a98179i8040j08581G2239f1770A67411
10786i8140K1820k02913a32222C13614G6419b53274B79957c39582G3097J8691
10776I1788c10776B6367L0347D292d09730B06467E6239M2715a68142E7908K48872
10765C06780a73392G4190b8924j8888p9336m434k88212B60795o5225a04763n57158
$$ y = [-91071, -276959, -247172, -10932, 20497, -95996, 51473, -24629, -88300, -104575, 113377, -304942, 264387, -426367, 181903, -162003, -45616, 124069, -179093, -37769, 20180, -164677, -125823, -261820, 81294, -30890, -218514, -133447, 192368, 23017, -217009, 50967, -125803, 111792, 34103, -94614, -194102, 355900, 62000, -266526, -241796, -186848, -169980, -169229, -312335, -205949, 416280, -155115, 238259, -198179, -98040, -206621, 72239, -61770, 167411, -98140, -76320, -279233, -132222, 313614, 76419, -253274, 279957, -339582, 73097, 91788, -310776, 26367, 56714, 4292, -409730, 206467, 56239, 98954, -168142, 57908, 306780, -173392, 74190, -28924, -47812, -127148, -131582, -419794, 260795, 195570, -104763, -661921]
10754f61921B71742n0079A09857M7949B6072d19188A21084J37186a51780a0723
10743C55156B0974P3647P6152G434R3b7922n1772a9389j24084B37122D4504b25881
10730B6584N2303J90919d4801A72402L6215l3852a03933l9929B83130e3305E260
10718a31542c9401j90165J14520j967N2314j1790j76190A18017d964E6421a2183
10706a7545E4499l494d7649k38217g5356l14785A7641L3968J90363c1222k13821
10695b45043J0794B5692b71869A00331a2905k57761J31832C81214b1771m5731
10685f7502m031A27990i9358A19152b8192B05570K3764E4992K09117J35745h0339
10673A74091c4025j40581K8169B21921a81615d0123j55277P7107r8598j81264
$$ y = [-661921, 271742, 221663, 109857, 157806, 26072, -419188, 121084, 258270, -151780, -10723, 355156, 20974, 94621, 170773, 7434, 7527, -27922, -79694, -19389, -143473, 237122, 44504, -225881, 26584, 78887, 269806, -44801, 172402, 208617, 174765, -103933, -143862, 283130, -53305, 5260, -131542, -39401, -229566, -115046, -117013, -64699, -76489, -252679, 118017, -4964, 56421, -12183, -17545, 54499, 51005, -47649, -285866, -75356, -390141, 17641, 51609, 241972, -31222, -245043, -234249, 25692, -271869, 100331, -12905, -270666, -138834, 381214, -21771, -67502, -71533, 127990, -99358, 119152, -28192, 205570, 229334, 54992, 264109, 399854, -80339, 174091, -34025, -174606, -146437, 221921, -181615, -40123, -195400, -118293, -216891, -398155]
10663c98155a29768I380d88833A85814a45788q7916j04965a2310k78174j01322
10653c91806a80573A0109b3921j6936p9569B96009a38837J8943A14728Q7613I4779
10641a9551L224C28074e2258A60282C8640J51932f6589b6384F3471H126c50647
10629D0415J9548a70062o0067a12243I0943g1934B3149a61053E7289d2989j12041
10618a55030A49549b24355A08206b18393l6181A59327c9162J3216A65774a1355
10607C7497a10222K8312B3672E385F64K92480A38106a9214j47095d9570j98239
10596b47809e385m9750B5689J22582i2255c9371n22983a7232o083r7475o8609
10585a89399j231I0784i6670A52020p0118f1185a9709l7660k89245B30376b8455
$$ y = [-398155, -129768, 9380, -488833, 185814, -145788, -233704, -338669, -12310, -290484, -391806, -180573, 10109, -23921, -40857, -120426, 296009, -138837, -119894, 114728, 202341, 94779, -19551, -16327, 328074, -52258, 160282, 38640, 190572, -66589, -26384, 63471, 8126, -350647, 40415, 59963, -170062, -230129, -112243, 90943, -71934, 23149, -161053, 57289, -42989, -155030, 149549, -224355, 108206, -218393, -254574, 159327, -39162, -25946, 165774, -11355, 37497, -110222, -81910, 23672, 5385, 664, 293144, 138106, -19214, -166309, -49570, -247809, -5385, -55135, 25689, 148271, -92255, -39371, -562354, -17232, -23315, -120790, -189399, -190630, 90784, -96670, 152020, 81902, -61185, -19709, -57369, -346614, 230376, -28455]
10573A66483d09350A35631a25531H9421c5149k44374i786A20502d5741J8459k91485
10562c18767J36228c7057k41671a17624H8252d50948B47523n4685n5215k5758
10552A11865b59483A01696E0290l283b50521f8177q9870B91121A26278c5152k00631
10541b35783p0483a3539k4949k54724F8502b84405j05339a33625B108J64389D2270
10529B62678H8948A1220c1726j7447k14193j246g594m1372D9890g4227r806A94534
10516D19046b402j75275O3393r8695h2967A69375c3696j65160A52058a7843A30000
10504d1631k7394k03810Q3040e2441m8966k78714J183D60N5600J19432a70997
10492a03941k35464J41564B1470a42225B63950B9490b04738l9349a15119A29054
$$ y = [166483, -409350, 135631, -125531, 89421, -35149, -279523, -9786, 120502, -45741, -27282, -318767, -182539, -37057, -278728, -117624, 88252, -450948, 247523, 192838, 137623, 111865, -259483, 101696, 50290, 47007, -250521, -68177, -158047, 291121, 126278, -35152, -235783, -306266, -13539, -38488, -293212, 68502, -284405, -389744, -133625, 2108, 166497, 42270, 262678, 88948, 11220, -31726, -49173, -263366, -264612, -7594, -48966, 49890, -74227, -84033, 194534, 419046, -2402, -177677, -114284, -212979, -82967, 169375, -33696, -198856, 152058, -17843, 130000, -41631, -69025, -272835, -189795, -52441, -101407, -380121, -378938, 460, 56060, 175492, -170997, -103941, -339405, -197841, 21470, -142225, 263950, 29490, -204738, -244087, -115119, 129054]
10481B78810J30096J13240k04729O8276A44947m3940k9203J27280c00565A56984
10470c11674c1278n3160C3150J44704K01107a53068C43690g90j9056k79045J02815
10459a96076C0320a79857D1546K47106j42750a36514A48152a26689k03041B5333
10448b079n606B73950a30515B24232q3064N7331h2347j70475C27720q6731a9137
10436b99923a46367A07301b9719a0061F8565B494M628a68265A49283G0935P4381
10425A45316b49989g2271l4756q1726C6198J45586j1899i6269A12604J22488B9073
10413D2382K8141H474i2657B05291a44370d1443m8258l45731J54056A92635j335
10402A91300E2179b00105B13637b0199j25111B34552b32491o8108C15755g5275
$$ y = [278810, 408906, 522146, 317417, 385693, 144947, 101007, 71804, 199084, -300565, 156984, -311674, -31278, -84438, 33150, 177854, 378961, -153068, 343690, -790, -19846, -298891, -196076, 30320, -179857, 41546, 288652, 145902, -136514, 148152, -126689, -329730, 25333, -2079, -7685, 273950, -130515, 224232, 141168, 198499, -82347, -252822, 327720, 240989, -19137, -299923, -146367, 107301, -29719, -10061, 68565, 2494, 7122, -168265, 149283, 70935, 145316, -249989, -72271, -107027, -188753, 36198, 181784, 169885, -96269, 112604, 235092, 29073, 42382, 70523, 8474, -92657, 205291, -144370, -41443, -89701, -435432, -281376, 192635, 191300, 52179, -200105, 213637, -20199, -145310, 234552, -232491, -300599, 315755, -75275]
10391A45794K47151a0698C2345b70512A44348O9535E4677J94933f3278B16146
10380a83722A81529N3118P2265J09982L7970j15676K6794j2638A23086J27407
10370B50493A09763L24225B15594K79999k19910L94097F7459K47184i0195A41970
10359B24157J82519A8119K83265a92337B50848p269k7686K47443K68046C62319
10348G52798l56676m3824K47491m7308o5394m214k3122K2344B1387a9551k2287
10337d1838A64442k09J17046A4000a02569C81956j71113C6142R8614B4012K14837
10326B38849A5532K55165L1135j34718J20175L2805G9300O2453D1974J11560J4010
10315A67544J98146h8757n603j62713d5424J7654D0838b6038B39649b03541h9369
$$ y = [145794, 392945, -10698, 32345, -270512, 144348, 213883, 54677, 249610, -63278, 216146, -183722, 181529, 234647, 306912, 416894, 454864, 339188, 365982, 353344, 123086, 250493, 109763, 433988, 215594, 495593, 275683, 669780, 67459, 314643, -90195, 141970, 224157, 406676, 18119, 301384, -192337, 250848, 243579, 215893, 463336, 731382, 362319, 752798, 396122, 352298, 599789, 552481, 487087, 482873, 459751, 482095, 21387, -19551, -41838, 164442, 164233, 281279, 14000, -102569, 381956, 210843, 36142, 134756, 24012, 238849, 15532, 270697, 301832, 167114, 287289, 320094, 79300, 141753, 41974, 153534, 167544, 365690, -88757, -94360, -257073, -45424, -27770, 40838, -26038, 239649, -203541, -89369]
10303I9146k1793e912A77445b28878L2427B83638b64583f0052B89152E2866i602
10291I9421g9000a6598j44932f3905A66040L9152a98205a538k51805J07464k7576
10280a73455J7631j85142e1603B7629M9453O5048D4804A7906J32495o8236d9772
10268b01337C6995a98442C32292A03944i3650D047J63474K07768O8689k08319
10258B35659L54416k38658o5508A07520J26412K39434b8009j71262I1835J03107
10248A94942B6708K72483a29161b1081A1541e0289K0676j46301a8955k1510o7859
10237a08324k22788A14657J97120A17367K61793C7343h2136B52086a09389L730
10227a05659A70377c40674R8176a16125A09718a61177A81535N429a99669k14676
$$ y = [99146, 77353, -5912, 177445, -228878, -196451, 283638, -264583, -60052, 289152, 52866, -9602, 99421, -79000, -16598, -161530, -63905, 166040, 205192, -198205, -1538, -253343, -145879, -173455, -155824, -340966, -51603, 27629, 77082, 142130, 44804, 17906, 150401, 82165, -49772, -201337, 36995, -198442, 332292, 103944, -93650, 4047, 167521, 375289, 443978, 235659, 590075, 351417, 285909, 107520, 233932, 473366, -28009, -199271, 91835, 194942, 26708, 299191, -129161, -21081, 11541, -50289, -29613, -175914, -18955, -40465, -108324, -331112, 114657, 311777, 117367, 379160, 37343, -82136, 252086, -109389, -105659, 170377, -340674, -242498, -116125, 109718, -161177, 181535, 186964, -199669, -414345]
10217d14345a50293c4183D1738e0214A51916b05606I914J38169b0098k828A17096
10205A4167c02010O6192pi747H4910a23994j10580b8145J288A18119a17629A4024
10192a57362M407C3997b08747C24052I6271B839L584K50992b18674r7751B38472
10180B54635b9288A47142f5765q3255l02868J97016J13728A69314p5822K29520
10170C23012j35079d9263j8371j01118D4337J76358b10509b6083D2446r983g6323
10158A7540i8666C9894b69938c0819p1664j85957K6320J14531m1762K7919A78502
10146I9273b02741j23415l552e0162j32995J5982l11683C6587c58422f2780b9662
10134A52536g0120k27629a31605B53139a14352j83061J25299l0749A40613a90211
$$ y = [-414345, -150293, -34183, 41738, -50214, 151916, -205606, 9914, 148083, -20098, -22926, 117096, 14167, -302010, -235818, -235825, -9747, 84910, -123994, -234574, -28145, -26857, 118119, -117629, 14024, -157362, -152955, 33997, -208747, 324052, 96271, 2839, 6423, 257415, -218674, -316425, 238472, 254635, -29288, 147142, -65765, -149020, -451888, -254872, -141144, 169314, 93492, 323012, 187933, -49263, -67634, -168752, 44337, 220695, -210509, -26083, 42446, 32463, -76323, 17540, -98666, 39894, -269938, -30819, -102483, -288440, -262120, -147589, -189351, -161432, 178502, 99273, -202741, -326156, -329708, -50162, -183157, -167175, -478858, 36587, -358422, -62780, -29662, 152536, -70120, -297749, -131605, 253139, -114352, -297413, -172114, -202863, 140613, -190211]
10123b3089m2620p1565j62875E8549a98947K8944P0177A16438k6569a78154c3791
10111F8330Q9136b03360j77871M4761G5359e9634l27290a09334k2880k9670N7626
10100a04258j5118A28729c49048C1476a03471A5693e3831l47401c5285G4225b18857
10088B50782b49992J22599B41710J14701j0550D8334h9191L5361B66599j26616
10078A39983d4001k0007A17319a00217F5216c72934I2242b32511g5904B5412b00941
10066A66839a54957O1141j5716B2845g4904B5402i6908J6192F6143e8897R516
10055d9381a9654r8712A57250K6812a10574B8373b06954a00589j2438B66386a60108
10043B9993L6001J4067q397a50012b112m3733C61732d9493A011c39446B61156
$$ y = [-23089, -65709, -137274, -300149, 58549, -198947, -170003, -99826, 116438, 89869, -178154, -33791, 68330, 157466, -203360, -381231, -336470, 75359, -59634, -386924, -109334, -132214, -161884, -104258, -119376, 128729, -349048, 31476, -103471, 15693, -53831, -401232, -35285, 74225, -218857, 250782, -249992, -127393, 241710, 356411, 345861, 48334, -89191, -53830, 266599, 139983, -44001, -64008, 117319, -100217, 65216, -372934, 92242, -232511, -75904, 25412, -200941, 166839, -154957, -93816, -109532, 22845, -74904, 25402, -96908, -80716, 66143, -58897, -49381, -19654, -118366, 157250, 184062, -110574, 28373, -206954, -100589, -113027, 266386, -160108, 29993, 65994, 80061, 71664, -150012, -2112, -45845, 361732, -49493, 1011, -339446, 261156]
10031A21322j7681n389a5356G3846a28828E816h2238B08254K3194d4907e079j92833
10019a97912Q6441M0503k84978C05744i6522M7565q8022A14353a04673l5996j15369
10008b56038h5666b8756p6808A24169b8973l05242C1826b77903A38524E9542J53825
9997B13367b9278k84057q7963C1779a15962A2690a64752p0784g3034G0678N9012
9986A29690D2054e9228r9262o452F0366f7061k7347j14391B22112l7594b69629
9974A28529a17285A25554b44576d9295n6533b7227B9243K4467b83443e8019F6664
9962c3461A99496b42054C2640d94467I7885f1616A62543c6658j5151F1189g1640
9950C5031N6270a59142n9375j66A25947a79762D5519c16568a885l35639a02828
$$ y = [121322, 103641, 98252, -15356, 73846, -128828, 5816, -82238, 208254, 231448, -44907, -5079, -197912, -111471, -70968, -355946, 305744, -96522, -48957, -136979, 114353, -104673, -140669, -256038, -85666, -28756, -105564, 124169, -28973, -334215, 31826, -277903, 138524, 59542, 213367, -29278, -313335, -401298, 31779, -115962, 12690, -164752, -235536, -73034, 70678, 129690, 42054, -59228, -158490, -164942, 60366, -67061, -94408, -208799, 222112, 184518, -269629, 128529, -117285, 125554, -244576, -49295, -105828, -27227, 29243, 53710, -283443, -58019, 66664, -33461, 199496, -242054, 32640, -494467, 97885, -61616, 162543, -36658, -51809, 61189, -71640, 35031, 91301, -159142, -218517, -218683, 125947, -179762, 45519, -316568, -1885, -337524, -102828]
9938c18024b4650k7853A99621C1095J09787c76152J56144d7375C6285b40938O8465
9927a72473c9008B12685b66403A49938c15196J47761A50083a40676g44k82626
9917b83370i2611l08987a81363j05298J36715L148D9689b67925E4459J69888l4381
9906A89966a76240J9337l17953j1208A61418G2129O8895c03439a20665j56591
9896b77256J29834L8645B4063a78530I3849K1535c10713h7274H3918k6163J95328
9885B53083a88555L2422q5331N1026j06167a32374j87793I9750b98876f2086F8671
9873F3151M8612d22424A42254c3209j68601N8856E9835P9141a11315d6903k0715
9862f7618k29827m1696a30422B53422a6311m5144j98655g1781A07251k4965J76897
$$ y = [-318024, -24650, -52503, 199621, 31095, 140882, -376152, -220008, -47375, 36285, -240938, -172473, -39008, 212685, -266403, 149938, -315196, -167435, 150083, -140676, -744, -283370, -92611, -401598, -181363, -286661, -149946, -146798, 49689, -267925, 54459, 224347, 189966, -176240, -156903, -474856, -486064, 161418, 72129, 141024, -303439, -120665, -277256, -147422, -108777, 24063, -178530, 93849, 115384, -310713, -87274, 83918, 57755, 253083, -188555, -156133, -241464, -190438, -296605, -132374, -320167, 99750, -298876, -62086, 68671, 63151, 111763, -422424, 142254, -33209, -201810, -142954, 59835, 138976, -111315, -46903, -67618, -297445, -339141, -130422, 253422, -16311, -61455, -260110, -71781, 107251, 82286, 259183]
9851B59183a29092F1755K4740i4678q6010j59389a52822A59279P8217a18923c9081
9839D42052A89390c90750n8976J58428D186J35725E6432g402l0892c362m0128
9828d3490k98082F7743a0735j2949k51248a36140F0188a57701j6917j5008C42405
9816a18425M2244o1888A30192J9485a52160q5729J01991I9802f4873j86459e7232
9804b86835A40614a565A13334d6412H020c15941A20724e0069A55281b83117a38868
9792A50305a04553A97445B725b9630j36816k2220N5326j26739D0024b21795C2042
9780a58868A06639e7724L325l65558a3274j80077p886d4125C84841E2156a52217
9768E3653J9219J26018A6046a97629n133k04756F2575B1652a64775k036o9744
$$ y = [259183, -129092, 61755, 86495, -94678, -180688, -340077, -152822, 159279, 237496, -118923, -39081, 442052, 189390, -390750, -449726, -291298, 4186, 139911, 56432, -7402, -38294, -3362, -43490, -341572, 67743, -10735, -23684, -274932, -136140, 60188, -157701, -174618, -189626, 342405, -118425, -76181, -138069, 130192, 149677, -152160, -237889, -135898, 99802, -64873, -251332, -57232, -286835, 140614, -1565, 113334, -46412, 8020, -315941, 120724, -50069, 155281, -283117, -138868, 150305, -104553, 197445, 2725, -29630, -166446, -188666, -133340, -260079, 40024, -221795, 32042, -158868, 106639, -57724, -54399, -419957, -13274, -193351, -201237, -44125, 384841, 52156, -152217, 53653, 72872, 198890, 16046, -197629, -202762, -407518, 62575, 21652, -164775, -166811, -236555]
9757b36555C3210a84561I9874b26478A30222d66p5302m4337R06B0505a25324N784
9745a19540e508G8638a24991E1959b74295E7993N4607d6657A46313K2330n9445
9734A09198g3551j64558O6372P1509c7757j68387B3940b23859R5619k41267f6454
9722A10883l9592d9141j13545C28358a34516j68958a3273j22074e6938A89995
9711c9826J1756k9478k67880i4824B09604J07375i438A97851a15853D8047N0001
9700I8048b13118R8459h317k7167I252a41869j13432A70856a41243J3768B71598
9688a28356J4567k02994c5240B0201d4185J8394j88672A89896g564j95211e0615
9676A39535d78909G4600J13485a90788B25528m7060d8167k1954Q241j00449q8124
$$ y = [-236555, 33210, -184561, 99874, -226478, 130222, -466, -75768, -120105, -119199, 20505, -125324, -119540, -5508, 78638, -124991, 51959, -274295, 57993, 112600, -46657, 146313, 168643, 109198, -73551, -238109, -171737, -100228, -37757, -206144, 23940, -223859, -128240, -369507, -66454, 110883, 71291, -49141, -162686, 328358, -134516, -303474, -13273, -135347, -56938, 189995, -39826, -28070, -57548, -325428, -94824, 209604, 316979, -9438, 197851, -115853, 48047, 98048, -213118, -114659, -8317, -35484, 9252, -141869, -255301, 170856, -141243, -127475, 271598, -128356, -113789, -316783, -35240, 20201, -44185, -25791, -214463, 189896, -7564, -202775, -50615, 139535, -478909, 74600, 188085, -190788, 225528, 178468, -48167, -70121, -61880, -162329, -250453]
9665b50453k09137P4124A21829b59318D7449h362q6006j05278B8852j046h738
9653c03023n2285a74969k3121G994b88338K531a06052k1589j98704A37222b47577
9641a97663j62113a32849F7741J41216F4398h3926k8278L3650A00287a06560D9289
9629E4115c27420f5226a0382m9351G5944O1196a5453j54574p54J9896g0422K5571
9617d4851C181a35051A19486A3695M6274b48696L9168g0958A58775i4153p7097
9606a71250A18467k8915b04092j27755E0251O9808b28875a10781j44062N7532
9596a97311Q9366j01374m4440G4137b61026a7588j92486A04148C0201L5307a44305
9584a04052j51881B21908b70197C882h279j84032r7530J11022d5728k31651B0471
$$ y = [-250453, -459590, -385466, 121829, -259318, 47449, -8362, -94368, -199646, 28852, 27806, -8738, -303023, -355308, -174969, -198090, 7994, -288338, -285807, -106052, -127641, -326345, 137222, -247577, -197663, -359776, -132849, 67741, 208957, 64398, -83926, -112204, -78554, 100287, -106560, 49289, 54115, -327420, -65226, -10382, -59733, 75944, 137140, -15453, -170027, -170781, -150885, -70422, -44851, 3181, -135051, 119486, 13695, 59969, -248696, -209528, -70958, 158775, -94153, -171250, 118467, 89552, -204092, -331847, 50251, 120059, -228875, -110781, -254843, -197311, -107945, -209319, -253759, 74137, -261026, -17588, -210074, 104148, 30201, 65508, -144305, -104052, -255933, 221908, -270197, 3882, -8279, -192311, -289841, -178819, -45728, -277379, 20471]
9572a05666k00035a32700A52676C9383b26285C7775c46876C6438K9022M1073l430
9561A03103c5165q2919F3920i4728n9764A44746h4729H2551a23694m31683A27836
9549A70158h7751k35832c2166m35211a50221e8248j8695D2910i9439m9094p7778
9538b26311K061B2963a8034B41466c19646g2389C2881b87549B2788g3973D9288
9526b27993D0446J14758g7170A20362a48994b542k79147g6499F6987a16903p0830
9515a87733g0376p8306c31j02870a8462j64229A62436i4992A63431J0378K984
9504A76793a50040j6721A19389b32794m1633B80765A35326a4479A90560B893M3061
9493D5954h6650n48M753a8259q9278b3796p1599A13530b16367d6300l73251i9851
$$ y = [-105666, -305701, -132700, 152676, 39383, -226285, 37775, -346876, 36438, 65460, 106533, 103103, -35165, -118084, 63920, -94728, -154492, 144746, -84729, 82551, -123694, -555377, 127836, 170158, -87751, -323583, -32166, -467377, -150221, -58248, -76943, 42910, -99439, -148533, -226311, -224250, 22963, -18034, 241466, -319646, -72389, 32881, -287549, 22788, -73973, 49288, -227993, 40446, 155204, -77170, 120362, -148994, -2542, -281689, -76499, 66987, -116903, -187733, -70376, -148682, -331, -103201, -18462, -182691, 162436, -94992, 163431, 173809, 176793, -150040, -166761, 119389, -232794, -274427, 280765, 135326, -14479, 190560, 2893, 45954, -86650, -87198, -82445, -18259, -107537, -23796, -95395, 113530, -216367, -46300, -419551, -99851]
9480d5688k78000O4636Q8493C11612D5575L4995l9265K00104b12849G0914L17403
9469C88317a55555j1867q8652c5272C08716b85200J24727F7468b55217R3640k467
9458a64044B0278b1696l8369G9424k6151b75588f732A78794e557C3458K12461
9447B45919C3925b81518f4377J1930n9989j7238b0390j25699D1407q069O1273
9436I4611a28207b3117j60708J4174j06517d9567j19045B38274a54327F8039h3605
9424b7197m5391K4755I5299J15691p9898J56880A39595a56318a4751A371b27886
9412c11430J33138B57355e5038A4842i6148d0213a9453o4815k20020b140k56949
9401b59089A39344i7981R146A47219a8083E4337g0908A54120a89038j64999a11784
$$ y = [-45688, -323688, -259052, -170559, 311612, 45575, 80570, 41305, 241409, -212849, 70914, 388317, -155555, -167422, -256074, -35272, 308716, -285200, -160473, 67468, -255217, -161577, -164044, 20278, -21696, -60065, 79424, 53273, -275588, -6732, 178794, -5557, 33458, 245919, 33925, -281518, -64377, -52447, -112436, -129674, -20390, -146089, 41407, 33338, 94611, -128207, -23117, -183825, -169651, -276168, -49567, -168612, 238274, -154327, 68039, -83605, -27197, -72588, -47833, 95299, 210990, 131092, 287972, 139595, -156318, -14751, 1371, -227886, -311430, -178292, 257355, -55038, 14842, -96148, -40213, -19453, -84268, -304288, -2140, -259089, 139344, -97981, -88835, 147219, -18083, 54337, -70908, 154120, -189038, -354037, -111784]
9389b00637F250b11147n1005k18175K33297N8409P3627L9823B08466a47398B0757
9377a60627D417L5994K81703e3894p079I435b46516a00042q542l4626l6847f1137
9364b30750r4650B97804d1372j53358j30612A06386c38494C3609c63271F1150
9353a96392k6931A52659b26745B0539M25f2963k2818c1197A2222K02233i7231
9341B05560l1633i0864p5254B1742g4008K8532k32664J449a30885J1687B59388
9329c10359b4549l76150Q7875P3937h4989l0760C9948J01963K1879i5519q3018
9318a78537A19059a12522R097j00127D0392K27237a60770K4438o3861C03637a50361
9306A82107b34659C494J06419b14936B5284b46320Q3579G7197Q1789a07988q1258
$$ y = [-200637, 6250, -211147, -262152, -480327, -247030, -188621, -114994, -75171, 208466, -147398, 20757, -160627, 4417, 40411, 322114, -53894, -60973, 9435, -246516, -100042, -108584, -143210, -180057, -61137, -230750, -325400, 297804, -41372, -194730, -325342, 106386, -338494, 33609, -363271, 61150, -196392, -223323, 152659, -226745, 20539, 20964, -62963, -85781, -31197, 12222, 214455, -97231, 205560, 173927, -90864, -166118, 21742, -74008, -45476, -278140, -276691, -130885, -119198, 259388, -310359, -24549, -400699, -312824, -238887, -84989, -115749, 39948, 141911, 163790, -95519, -178537, 119059, -112522, -103425, -203552, 40392, 267629, -160770, -136332, -200193, 303637, -150361, 182107, -234659, 3494, 109913, -214936, 25284, -246320, -162741, 77197, 158986, -107988, -189246]
9295a89246j5917i3097I8946b85535e5802A63751b57190I0487a0666A70034a89430
9283c5829a6954G5677a01962b2135A15356J9321E0443a48776M2984B9434c4391
9271H4223f8423K8074j59270B3305P807J3799J04431b77782J28281L0798L4790
9260h3913A42906K2971n6644h5634A0157J7993d6806B30138A11502H821a08007
9248H6393f3882n0124c6549k47122F8149a24394a6765k81720a29267B1326d09447
9236A26090b40289F7421a06278B54496a08465k6560B24777F4044B4898A193J04822
9225A06015J4350E1581d0706j34506F0221b53233A69488b55719G2968a76551r6401
9214b72952d5785D375b5278A63079a3236F323c65010A50259J60678g8987j41915
$$ y = [-189246, -205163, -93097, 98946, -285535, -55802, 163751, -257190, 90487, -10666, 170034, -189430, -35829, -16954, 75677, -101962, -22135, 115356, 134677, 50443, -148776, -105792, 29434, -34391, 84223, -68423, -40349, -199619, 23305, 31112, 44911, 149342, -277782, -149501, -118703, -83913, 142906, 165877, 109233, -85634, 10157, 28150, -46806, 230138, 111502, 8821, -108007, 86393, -63882, -114006, -36549, -283671, 68149, -124394, -16765, -298485, -129267, 21326, -409447, 126090, -240289, 67421, -106278, 254496, -108465, -135025, 224777, 64044, 24898, 1193, 106015, 120365, 51581, -40706, -175212, 60221, -253233, 169488, -255719, 72968, -176551, -272952, -45785, 4375, -25278, 163079, -13236, 6323, -365010, 150259, 310937, -78987, -220902]
9203b20902J08966C0771Q4076a74187Q6579q2071o2373e5466B78230A835J90520
9192A92355a3352j78677i0285o0178b903k06484g1103l34329A06740b36066g6869
9180A06239b91557m9479B42653a49758d3975l5142k17688Q8263A07239k0716b01346
9168H0018e24281b8380p7461A72584b91143C0126J28920B0386K4186b86954j37376
9157d24330J96588A19111Q4464g4816H2754c19102N3472c5091o0532c1667A75527
9145a91785m26506K73173O6014R9114m0282d3364B7809a77863H2854a05505I8566
9133d61730A49166f5195B89903a69542Q1029j81975b1359j48083I5712J9615a08821
9121b66169r5279A73130A9h0270j38578A8899Q0317D7388a34930k9968B23315
$$ y = [-220902, -111936, 30771, 114847, -174187, -87608, -169679, -232052, -55466, 278230, 1835, 192355, -13352, -192029, -90285, -150463, -2903, -209387, -71103, -405432, 106740, -236066, -76869, 106239, -291557, -341036, 242653, -149758, -43975, -79117, -296805, -208542, 107239, 86523, -201346, 80018, -524281, -28380, -105841, 172584, -291143, 30126, 159046, 20386, 44572, -286954, -424330, -227742, 119111, 203575, -74816, 82754, -319102, -265630, -35091, -95623, -31667, 175527, -191785, -618291, -345118, -279104, -179990, -220272, -43364, 27809, -177863, 82854, -105505, 98566, -461730, 149166, -65195, 289903, -169542, -88513, -270488, -21359, -169442, 95712, 115327, -108821, -266169, -361448, 173130, 19, -80270, -218848, 18899, 99216, 47388, -134930, -164898, 223315]
9109i9146A59157b39137A08092J5616e9835b5726B561b04572Q9735j21506g4542
9097b73133C720h9176k2829j05881N8128A57627a01284n2106j17808c2284k5124
9086e7408r0817L9850J300C7913a06114A2844J01439a57255J022m6759I4349a42710
9073b74321J10819m8332A6337K918b3558g130j10144a683A2170a18465k3833A43085
9060a77582B27497a13913L5732C23549r8775b77265q7697B56081C0214A85b2601
9048G8314B2744a08455C29681J26182f4149A0386b08663H5746d4312k16416c9640
9036A5524a04009b7914B17198j01424b48429B80190b19361G6547b1699l28915
9026c50614J45390A2258a05029b56B20112O1198a86727A84145i9830l41o7672
$$ y = [-99146, 159157, -239137, 108092, 123708, -59835, -25726, 2561, -204572, -114837, -236343, -74542, -273133, 3720, -89176, -112005, -217886, -159758, 157627, -101284, -153390, -271198, -32284, -57408, -148225, -108375, -107075, 37913, -106114, 12844, 114283, -157255, -156233, -202992, 94349, -142710, -274321, -163502, -211834, 16337, 19255, -23558, -7130, -117274, -1683, 12170, -118465, -142298, 143085, -177582, 227497, -113913, -78181, 323549, 224774, -277265, -364962, 256081, 30214, 185, -22601, 78314, 22744, -108455, 329681, 455863, -64149, 10386, -208663, 85746, -44312, -260728, -39640, 15524, -104009, -27914, 217198, 115774, -248429, 280190, -219361, 76547, -21699, -350614, -205224, 12258, -105029, -256, 220112, 281310, -186727, 184145, -99830, -100171, -167843]
9015a67843d4221l560p9332j34996h13K64j98523j49516G7157K8217e6482k190
9003e8672j39914A58035d13748A17747A9350a41204D9425f659B03823m7969C3422
8991c47553a55160r2868c8503j22219j19627h5964B55332c32192A09082a83538
8980A20974a76886f3245j43492B71184b21861j43467a08436A14672b52235G9871
8969a25851M0063o0921n1005h3956j55303a18190A85739b59819A30747a51218
8958b82620r4675I8335J19733h1728D7310a08807A16976a91249p8414h2692j90497
8947b73189l15516g0629I4309a88302D3934j3561a99356D630a32674k64199a11642
8935A98023f6437C76059A71257b31615j00449a16877k3096A68905n1629J89675
$$ y = [-167843, -44221, -47781, -127113, -262109, -813, -549, -199072, -348588, 77157, 105374, -56482, -58672, -198586, 158035, -413748, 117747, 19350, -141204, 49425, -6659, 203823, 155854, 33422, -347553, -155160, -248028, -38503, -160722, -280349, -85964, 255332, -332192, 109082, -183538, 120974, -176886, -63245, -206737, 271184, -221861, -365328, -108436, 114672, -252235, 79871, -125851, -85788, -146709, -197714, -83956, -239259, -118190, 185739, -259819, 130747, -151218, -282620, -377295, 98335, 218068, -81728, 47310, -108807, 116976, -191249, -269663, -82692, -273189, -588705, -70629, 94309, -188302, 43934, 30373, -199356, 4630, -132674, -396873, -111642, 198023, -66437, 376059, 171257, -231615, -332064, -116877, -139973, 168905, 117276, 306951]
8925C06951K82213J00412J615196N101304J4681261F753717B559074j212175n69259
8916G77640j39462i9924H745J8012P9402k7680K16661g6728G76024B06738E501
8904A09987E2981J07595d43269A09764c68983i3666C63207a51365e4926D8770
8893b23178B29412e3511q5116A14261b7845G0985i3411k54200C9917L60194a14971
8881c4552B24508N5740b39495H6293j2630b00223A28312n7851H028i5821j10863
$$ y = [306951, 589164, 689576, 2304772, 7406076, 22087337, 6753717, 2559074, 1346899, 777640, 638178, -99924, 8745, 26757, 106159, 78479, 295140, -76728, 776024, 206738, 5501, 109987, 52981, 160576, -443269, 109764, -368983, -93666, 363207, -151365, -54926, 48770, -223178, 229412, -53511, -138627, 114261, -27845, 70985, -93411, -347611, 39917, 400111, -114971, -34552, 224508, 280248, -239495, 86293, 73663, -200223, 128312, 70461, 8028, -95821, -206684]
$$ [...]
##END NTUPLES=NMR SPECTRUM
##END=
