##TITLE=AC1476_ZJAMBMO302_8100948_ds12Kev9lv
##JCAMPDX= 6.0         $$ Bruker NMR JCAMP-DX V2.0
##DATA TYPE= NMR SPECTRUM
##DATA CLASS= NTUPLES
##ORIGIN= BRUKER
##OWNER= Administrator
$$ 1.72 TOPSPIN		Version 2.1
$$ 2013-08-15 17:05:05.615 -0700  Administrator@X
$$ Compression mode = diff/dup
##.OBSERVE FREQUENCY= 400.02188249412
##.OBSERVE NUCLEUS= ^1H
##.ACQUISITION MODE= SIMULTANEOUS (DQD)
##.ACQUISITION SCHEME= undefined
##.AVERAGES= 64
##.DIGITISER RES= 22
##SPECTROMETER/DATA SYSTEM= spect
##.PULSE SEQUENCE= noesygpps1d.comp
##.SOLVENT NAME= COFFEE_meoh
##.SHIFT REFERENCE= INTERNAL, COFFEE_meoh, 1, 14.96112
##AUDIT TRAIL= $$ (NUMBER, WHEN, WHO, WHERE, PROCESS, VERSION, WHAT)
$$ ##TITLE= Audit trail, TOPSPIN		Version 2.1
$$ ##JCAMPDX= 5.01
$$ ##ORIGIN= Bruker BioSpin GmbH
$$ ##OWNER= Administrator
$$ $$ E:\/data/COFFEE/nmr/AC1476_ZJAMBMO302_8100948_ds12Kev9lv/22/pdata/1/auditp.txt
$$ ##AUDIT TRAIL=  $$ (NUMBER, WHEN, WHO, WHERE, PROCESS, VERSION, WHAT)
(   1,<2013-08-15 17:05:00.771 -0700>,<Administrator>,<X>,<go>,<TOPSPIN 2.1>,
      <created by zg
	started at 2013-08-15 16:53:31.240 -0700,
	POWCHK enabled, PULCHK disabled,
       configuration hash MD5:
       C8 4E 4E 5D D3 5C D8 9E 9F 52 82 E0 59 8A DE 15
       data hash MD5: 64K
       12 94 9F 54 91 F0 66 4D C4 E5 43 49 79 98 D4 C9>)
(   2,<2013-08-15 17:05:03.693 -0700>,<Administrator>,<X>,<proc1d>,<TOPSPIN 2.1>,
      <Start of raw data processing
       efp LB = 0.3 FT_mod = 6 PKNL = 1 PHC0 = 0 PHC1 = 0 SI = 128K 
       data hash MD5: 128K
       D6 6F BB 4E D1 0F 88 D2 E5 72 46 A7 28 33 DD D4>)
(   3,<2013-08-15 17:05:04.693 -0700>,<Administrator>,<X>,<proc1d>,<TOPSPIN 2.1>,
      <pk PHC0 = -80.40344 PHC1 = 0 
       data hash MD5: 128K
       54 F8 DC A7 6F BF 39 DA 62 EB 67 B9 04 22 0A 45>)
(   4,<2013-08-15 17:05:05.084 -0700>,<Administrator>,<X>,<proc1d>,<TOPSPIN 2.1>,
      <abs ABSG = 1 
       data hash MD5: 128K
       48 29 FE 17 E0 A0 FC EE E1 94 B8 46 9D C3 1E 85>)
(   5,<2013-08-15 17:05:05.178 -0700>,<Administrator>,<X>,<proc1d>,<TOPSPIN 2.1>,
      <abs ABSG = 2 
       data hash MD5: 128K
       64 C5 7F 6D 73 C2 DB 5D 4E 0A 0F 46 87 46 E1 94>)
(   6,<2013-08-15 17:05:05.256 -0700>,<Administrator>,<X>,<proc1d>,<TOPSPIN 2.1>,
      <abs ABSG = 3 
       data hash MD5: 128K
       CC D8 94 6E 6D B7 47 B6 19 D7 F2 D4 F4 D2 6F 31>)
(   7,<2013-08-15 17:05:05.334 -0700>,<Administrator>,<X>,<proc1d>,<TOPSPIN 2.1>,
      <abs ABSG = 4 
       data hash MD5: 128K
       78 01 90 44 19 19 30 08 95 B6 60 34 99 DD BE 4F>)
(   8,<2013-08-15 17:05:05.412 -0700>,<Administrator>,<X>,<proc1d>,<TOPSPIN 2.1>,
      <abs ABSG = 5 
       data hash MD5: 128K
       27 4D 84 BB 0D C0 E0 9C 41 4F EA 23 4E 39 EC 9B>)
$$ ##END=
$$ 
$$ $$ hash MD5
$$ $$ 6F 37 3C 1A 84 F5 96 C0 09 0F 50 2B 97 59 D9 CE
##$RELAX= 
##$RELAX= 
##$RELAX= 
##$RELAX= 
##$RELAX= 
##$RELAX= 
##$RELAX= 
##$RELAX= 
$$ Bruker specific parameters
$$ --------------------------
##$DU= <E:\>
##$EXPNO= 22
$$ [...]
##$TP07= 0
##$TPNAME0= <>
##$TPNAME1= <>
##$TPNAME2= <>
##$TPNAME3= <>
##$TPNAME4= <>
##$TPNAME5= <>
##$TPNAME6= <>
##$TPNAME7= <>
##$TPOAL= (0..7)
0.5 0.5 0.5 0.5 0.5 0.5 0.5 0.5
##$TPOFFS= (0..7)
0 0 0 0 0 0 0 0
##$TUNHIN= 0
##$TUNHOUT= 0
##$TUNXOUT= 0
##$USERA1= <user>
##$USERA2= <user>
##$USERA3= <user>
##$USERA4= <user>
##$USERA5= <user>
##$V9= 5
##$VALIST= <valist>
##$VCLIST= <CCCCCCCCCCCCCCC>
##$VD= 0
##$VDLIST= <DDDDDDDDDDDDDDD>
##$VPLIST= <PPPPPPPPPPPPPPP>
##$VTLIST= <TTTTTTTTTTTTTTT>
##$WBST= 1024
##$WBSW= 4
##$XGAIN= (0..3)
0 0 0 0
##$XL= 0
##$YL= 0
##$YMAX_a= 6879518
##$YMIN_a= -13871531
##$ZGOPTNS= <>
##$ZL1= 120
##$ZL2= 120
##$ZL3= 120
##$ZL4= 120
##$ABSF1= 14.96112
##$ABSF2= -5.597062
##$ABSG= 5
##$ABSL= 3
##$ALPHA= 0
##$AQORDER= 0
##$ASSFAC= 0
##$ASSFACI= 0
##$ASSFACX= 0
##$ASSWID= 0
##$AUNMP= <proc_prof1d_extract.lims>
##$AXLEFT= 0
##$AXNAME= <>
##$AXNUC= <1H>
##$AXRIGHT= 0
##$AXTYPE= 0
##$AXUNIT= <>
##$AZFE= 0.1
##$AZFW= 0.1
##$BCFW= 0
##$BC_mod= 0
##$BYTORDP= 0
##$COROFFS= 0
##$CY= 15
##$DATMOD= 1
##$DC= 0
##$DFILT= <>
##$DTYPP= 0
##$F1P= 0
##$F2P= 0
##$FCOR= 0.5
##$FTSIZE= 131072
##$FT_mod= 6
##$GAMMA= 0
##$GB= 0
##$INTBC= 1
##$INTSCL= 1
##$ISEN= 128
##$LB= 0.3
##$LEV0= 0
##$LPBIN= 0
##$MAXI= 10000
##$MC2= 0
##$MEAN= 0
##$ME_mod= 0
##$MI= 0
##$NCOEF= 0
##$NC_proc= -2
##$NLEV= 6
##$NOISF1= 0
##$NOISF2= 0
##$NSP= 0
##$NTH_PI= 0
##$NZP= 0
##$OFFSET= 14.96112
##$PC= 1
##$PHC0= -80.40344
##$PHC1= 0
##$PH_mod= 1
##$PKNL= yes
##$PPARMOD= 0
##$PPDIAG= 0
##$PPIPTYP= 0
##$PPMPNUM= 2147483647
##$PPRESOL= 1
##$PSCAL= 4
##$PSIGN= 0
##$PYNMP= <proc.py>
##$REVERSE= no
##$SF= 400.020009589678
##$SI= 131072
##$SIGF1= 0
##$SIGF2= 0
##$SINO= 400
##$SIOLD= 131072
##$SPECTYP= <>
##$SREGLST= <1H.CDCl3>
##$SSB= 0
##$STSI= 131072
##$STSR= 0
##$SW_p= 8223.68421052631
##$SYMM= 0
##$S_DEV= 0
##$TDeff= 65536
##$TDoff= 0
##$TI= <>
##$TILT= no
##$TM1= 0
##$TM2= 0
##$TOPLEV= 0
##$USERP1= <user>
##$USERP2= <user>
##$USERP3= <user>
##$USERP4= <user>
##$USERP5= <user>
##$WDW= 1
##$XDIM= 131072
##$YMAX_p= 428793933
##$YMIN_p= -12818
##$CURPLOT= <Network HP LaserJet P1505>
##$CURPRIN= <$Network HP LaserJet P1505>
##$DFORMAT= <normdp>
##$LAYOUT= <+/1D_H.xwp>
##$LFORMAT= <normlp>
##$PFORMAT= <normpl>
##$SURQMSG= 1
$$ End of Bruker specific parameters
$$ ---------------------------------
##NTUPLES= NMR SPECTRUM
##VAR_NAME=  FREQUENCY,     SPECTRUM/REAL,   SPECTRUM/IMAG
##SYMBOL=    X,             R,               I
##VAR_TYPE=  INDEPENDENT,   DEPENDENT,       DEPENDENT
##VAR_FORM=  AFFN,          ASDF,            ASDF
##VAR_DIM=   131072,        131072,          131072
##UNITS=     HZ,            ARBITRARY UNITS, ARBITRARY UNITS
##FACTOR=    0.0627417313425164, 1,          1
##FIRST=     8223.62146879497, 363,          -71364
##LAST=      0,             3197,            -72110
##MIN=       0,             -12818,          0
##MAX=       8223.62146879497, 428793933,    0
$$ Real data points
##PAGE= N=1
##DATA TABLE= (X++(R..R)), XYDATA
$$ [...]
$$ plain form
63857 1683150 1747043 1806968 1861627 1909687 1949882 1981503 2004489 2018912 2024598 2021318 2008996 1987570
63845 1987570 1957009 1917703 1870524 1816329 1755719 1689595 1619609 1547625 1474842 1401766 1328855
63834 1328855 1256838 1186480 1118441 1053427 992180 935192 882592 834274 789991 749329 711855
63823 711855 677371 645892 617312 591313 567718 546799 529005 514346 502200 491825 482961 475790
63811 475790 470331 466051 462093 457670 452147 444954 435765 424770 412668 400360 388583 377669 367494
63798 367494 357719 348133 338686 329349 320340 312460 306531 302189 297858 292503 286906 282551 279719 277575
63784 277575 275705 274390 273379 271712 269130 266622 264942 263515 261459 258929 256648 254688 252621 250517
63770 250517 248918 247992 247479 247324 247613 247961 247707 246811 245866 245146 244248 242908 241547 240634 239999 239224 238385 237882
$$ packed form
63857A683150O3893N9925N4659M8060M0195L1621K2986J4423N686l280j2322k1426
63845A987570l0561l9306m7179n4195o0610o6124o9986p1984p2783p3076p2911
63834A328855p2017p0358o8039o5014o1247n6988n2600m8318m4283m0662l7474
63823G11855l4484l1479k8580k5999k3595k0919j7794j4659j2146j0375q864p171
63811D75790n459m280l958m423n523p193r189j0995j2102j2308j1777j0914j0175
63798C67494r775r586r447r337r009p880n929m342m331n355n597m355k832k144
63784B77575j870j315j011j667k582k508j680j427k056k530k281j960k067k104
63770B50517j599r26n13j55K89L48k54q96r45p20q98j340j361r13o35p75q39n03
$$ plain form
63752 237882 237680 237227 236239 235162 234646 234820 235365 236108 237116 238160 238623 238284 237898 238546 240530 243299 246286
63735 246286 249283 252042 254178 255782 257608 260280 263599 266891 269793 272472 275350 278852 283169 288041
63721 288041 293019 298064 303534 309422 315034 319766 323794 327532 330714 332453 332056 329467 325212 320300
63707 320300 315916 312637 310011 307292 304471 302165 300687 299758 299126 298956 299509 300813 302756 305181 307758
63692 307758 310080 312033 313978 316431 319579 323060 326160 328341 329673 330641 331504 332075 332214 332151 332102 331932
63676 331932 331535 331200 331200 331318 331265 331352 332230 334099 336657 339641 342864 345800 347750 348521 348459 347771 346253 343813
63658 343813 340803 337631 334362 330823 326893 322621 318323 314554 311664 309381 307137 304830 302951 301939
63644 301939 301720 301889 302092 302249 302654 303759 305534 307287 308518 309773 312042 315464 319351 323471 328438
$$ packed form
63752B37882k02m53r88j077n16J74N45P43J008J044M63l39l86O48J984K769K987
63735B46286K997K759K136J604J826K672L319L292K902K679K878L502M317M872
63721B88041M978N045N470N888N612M732M028L738L182J739l97k589m255m912
63707C20300m384l279k626k719k821k306j478r29o32j70N53J304J943K425K577
63692C07758K322J953J945K453L148L481L100K181J332R68Q63N71J39o3m9j70
63676C31932l97l35%J18n3Q7Q78J869K558K984L223K936J950P71o2o88j518k440
63658C43813l010l172l269l539l930m272m298l769k890k283k244k307j879j012
63644C01939k19J69K03J57M05J105J775J753J231J255K269L422L887M120M967
$$ plain form
63629 328438 334627 341555 348761 356554 365314 374659 384034 393763 404781 417478 431457 446386 462492
63616 462492 480113 499225 519569 540968 563385 586865 611538 637552 664926 693463 722749
63605 722749 752144 780762 807486 830960 849677 862426 868887 869741 866210 859662 851615 843597 836535
63592 836535 830342 824292 817681 809915 800179 787455 771067 751168 728745 705156 681502 658337
63580 658337 635990 615044 596141 579307 563921 549668 537178 527331 520217 515246 512076 510870
63568 510870 511627 513844 517043 521241 526631 533091 540195 547542 554962 562631 571170 581373 593603 607540
63554 607540 622786 639584 658757 681045 706757 736050 769297 807034 849460 895712 943212
63543 943212 987724 1024466 1049733 1061983 1061976 1052313 1036635 1018472 1000271 983405 969001 958190
$$ packed form
63629C28438O189O928P206P793Q760R345R375R729J1018J2697J3979J4929J6106
63616D62492J7621J9112K0344K1399K2417K3480K4673K6014K7374K8537K9286
63605G22749K9395K8618K6724K3474J8717J2749O461Q54l531o548q047q018p062
63592H36535o193o050o611p766r736j2724j6388j9899k2423k3589k3654k3165
63580F58337k2347k0946j8903j6834j5386j4253j2490r847p114m971l170j206
63568E10870P57K217L199M198N390O460P104P347P420P669Q539J0203J2230J3937
63554F07540J5246J6798J9173K2288K5712K9293L3247L7737M2426M6252M7500
63543I43212M4512L6742K5267J2250pr663j5678j8163j8201j6866j4404j0811
$$ plain form
63531 958190 951209 946643 942195 936181 927929 916842 901795 881766 856752 827848 796679 764826
63519 764826 733382 702679 672608 643376 615730 590227 566639 544419 523546 504513 487617
63508 487617 472695 459542 448183 438632 430641 423739 417392 411158 404946 399098 394030 389813 386258
63495 386258 383251 380729 378423 376081 373970 372777 372793 373446 373804 373439 372713 372408 373182 375209 378196 381751
63479 381751 385703 390009 394416 398500 402033 405114 407915 410475 412752 414585 415598 415400 413933 411328
63465 411328 407460 402070 395570 389257 384309 380755 377769 374773 371861 369287 367110 365450 364755 365454 367521
63450 367521 370508 373983 377894 382640 388860 396938 406580 417048 428009 440062 454214 471019 490548
63437 490548 513206 540114 572459 610591 653629 699196 743131 780202 806349 820801 825791 824315
$$ packed form
63531I58190o981m566m448o014q252j1087j5047k0029k5014k8904l1169l1853
63519G64826l1444l0703l0071k9232k7646k5503k3588k2220k0873j9033j6896
63508D87617j4922j3153j1359r551p991o902o347o234o212n848n068m217l555
63495C86258l007k522k306k342k111j193J6O53L58l65p26l05P74K027K987L555
63479C81751L952M306M407M084L533L081K801K560K277J833J013j98j467k605
63465D11328l868n390o500o313m948l554k986k996k912k574k177j660o95O99K067
63450C67521K987L475L911M746O220Q078R642J0468J0961J2053J4152J6805J9529
63437D90548K2658K6908L2345L8132M3038M5567M3935L7071K6147J4452M990j476
$$ plain form
63425 824315 818702 811153 804482 801431 803496 810970 823921 842618 867080 896607 929709 964252 997814
63412 997814 1028287 1054177 1074299 1087604 1093749 1093684 1089223 1082071 1073433 1064221 1055077 1046191 1037413 1028413
63398 1028413 1018370 1005738 988857 966857 939779 908227 873514 837811 803195 770349 738809
63387 738809 708469 680091 654232 630619 609026 590045 574354 561769 551613 543669 538185 535236
63375 535236 534651 536313 539988 544980 550557 556749 564301 573850 585466 598965 614260 631339 650271
63362 650271 671353 694991 721276 749848 780271 812389 846199 881431 917309 952610 985858
63351 985858 1015494 1040076 1058584 1070750 1077079 1078434 1075611 1069364 1060780 1051308 1042238 1034082 1026410
63338 1026410 1018128 1007861 994328 976732 955085 930229 903349 875199 845815 815230 784455
$$ packed form
63425H24315n613p549o671l051K065P474J2951J8697K4462K9527L3102L4543L3562
63412I97814L0473K5890K0122J3305O145o5m461p152q638r212r144q886q778r000
63398A028413j0043j2632j6881k2000k7078l1552l4713l5703l4616l2846l1540
63387G38809l0340k8378k5859k3613k1593j8981j5691j2585j0156p944n484k949
63375E35236n85J662L675M992N577O192P552R549J1616J3499J5295J7079J8932
63362F50271K1082K3638K6285K8572L0423L2118L3810L5232L5878L5301L3248
63351I85858K9636K4582J8508J2166O329J355k823o247q584r472r070q156p672
63338A026410q282j0267j3533j7596k1647k4856k6880k8150k9384l0585l0775
$$ plain form
63327 784455 755399 729681 707832 689809 675846 666498 662244 663247 668744 675833 679411 674610 659809
63314 659809 637048 609888 581590 554843 531542 511976 494982 479491 465494 453296 442656
63303 442656 433182 424872 417675 411102 404894 399539 395490 392314 389248 386135 383149 380031 376388 372475
63289 372475 368895 365722 362644 359771 357504 355644 353441 350622 347744 345473 344015 343275 342920 342319 341091
63274 341091 339835 339624 340590 341675 342064 342195 342975 344574 346514 348490 350499 352427 354097 355612 357183
63259 357183 358694 359866 360850 362206 364258 366876 370012 373985 378851 383859 388076 391580 395501 400706
63245 400706 406853 413103 419410 426608 435350 445529 456767 468971 482211 496511 512023 529028
63233 529028 547532 567154 587697 609431 632487 656362 680418 704540 728841 753047 776768
$$ packed form
63327G84455k9056k5718k1849j8023j3963r348m254J003N497P089L578m801j4801
63314F59809k2761k7160k8298k6747k3301j9566j6994j5491j3997j2198j0640
63303D42656r474q310p197o573o208n355m049l176l066l113k986l118l643l913
63289C72475l580l173l078k873k267j860k203k819k878k271j458p40l55o01j228
63274C41091j256k11R66J085L89J31P80J599J940J976K009J928J670J515J571
63259C57183J511J172R84J356K052K618L136L973M866N008M217L504L921N205
63245D00706O147O250O307P198Q742J0179J1238J2204J3240J4300J5512J7005
63233E29028J8504J9622K0543K1734K3056K3875K4056K4122K4301K4206K3721
$$ plain form
63222 776768 800225 824134 848920 874512 900795 927626 954461 980656 1006323 1032267 1058693
63211 1058693 1084374 1107328 1125920 1139067 1145868 1145693 1138570 1125085 1105849 1081280 1051922 1018794
63199 1018794 983433 947620 912906 880110 849280 820360 793967 771387 753673 740785 731735
63188 731735 725579 722151 721848 724879 730995 739861 751404 765692 782622 801821 822613 844069 865368
63175 865368 886396 907848 930491 954318 978544 1002313 1025262 1047521 1069285 1090327 1109784
63164 1109784 1126407 1139004 1146582 1148270 1143618 1133057 1117576 1097609 1072630 1042227 1007303 969785
63152 969785 931360 892923 855061 818493 783938 751886 722547 695883 671752 650185 631333
63141 631333 614970 600395 587152 575472 565551 556814 548571 541135 535502 531916 529522 527516 525878
$$ packed form
63222G76768K3457K3909K4786K5592K6283K6831K6835K6195K5667K5944K6426
63211A058693K5681K2954J8592J3147O801j75p123j3485j9236k4569k9358l3128
63199A018794l5361l5813l4714l2796l0830k8920k6393k2580j7714j2888r050
63188G31735o156l428l03L031O116Q866J1543J4288J6930J9199K0792K1456K1299
63175H65368K1028K1452K2643K3827K4226K3769K2949K2259K1764K1042J9457
63164A109784J6623J2597P578J688m652j0561j5481j9967k4979l0403l4924l7518
63152I69785l8425l8437l7862l6568l4555l2052k9339k6664k4131k1567j8852
63141F31333j6363j4575j3243j1680r921q737q243p436n633l586k394k006j638
$$ plain form
63128 525878 524776 523983 523248 522750 522785 523448 524817 526987 529601 531882 533565 535371 538086 541529 544926 547988
63112 547988 551022 554110 556781 558597 559672 560470 561360 562414 563406 563992 564111 564240 564983 566285 567261 567012
63096 567012 565558 563794 562579 562030 561775 561593 561545 561597 561584 561661 562369 563956 566006 568161 570857 574713 579344
63079 579344 583534 586761 589880 594018 599387 605559 612361 619861 627818 635826 643982 652855 662712 673175
63065 673175 683854 694999 707419 721915 738891 758239 779482 802208 826591 853359 883090
63054 883090 915612 950335 987150 1026717 1069746 1116247 1165685 1217635 1271857 1327786 1384500
63043 1384500 1441468 1499041 1557892 1618165 1679385 1740983 1802619 1864189 1925908 1988254 2051431
63032 2051431 2114848 2177342 2237749 2294918 2347221 2392504 2428573 2453556 2465911 2464539 2448936
$$ packed form
63128E25878j102p93p35m98L5O63J369K170K614K281J683J806K715L443L397L062
63112E47988L034L088K671J816J075P98Q90J054R92N86J19J29P43J302R76k49
63096E67012j454j764j215n49k55j82m8N2j3P7P08J587K050K155K696L856M631
63079E79344M190L227L119M138N369O172O802P500P957Q008Q156Q873R857J0463
63065F73175J0679J1145J2420J4496J6976J9348K1243K2726K4383K6768K9731
63054H83090L2522L4723L6815L9567M3029M6501M9438N1950N4222N5929N6714
63043A384500N6968N7573N8851O0273O1220O1598O1636O1570O1719O2346O3177
63032B051431O3417O2494O0407N7169N2303M5283L6069K4983J2355j372j5603
$$ plain form
63021 2448936 2419066 2375288 2318909 2252585 2179460 2101781 2020954 1938971 1858847 1783170 1712897
63010 1712897 1648206 1589958 1539534 1497551 1463590 1437211 1418529 1407619 1403946 1406707 1415451 1430088
62998 1430088 1450420 1475788 1505107 1537234 1571492 1607794 1646170 1686224 1727303 1769126 1811859
62987 1811859 1855413 1898903 1941011 1980643 2017019 2049244 2076158 2096666 2109920 2115008 2110645 2095433
62975 2095433 2068515 2029957 1980696 1922343 1856991 1786898 1714093 1640185 1566477 1494056 1423861
62964 1423861 1356838 1294023 1236159 1183217 1134675 1090317 1050286 1014158 980538 948077 916560
62953 916560 886582 858537 832491 808644 787040 766919 747216 727819 709650 693261 678055
62942 678055 663207 648714 635135 622705 611189 600324 590081 580702 572572 565749 559491 552746
$$ packed form
63021B448936k9870m3778n6379o6324p3125p7679q0827q1983q0124p5677p0273
63010A712897o4691n8248n0424m1983l3961k6379j8682j0910l673K761Q744J4637
62998A430088K0332K5368K9319L2127L4258L6302L8376M0054M1079M1823M2733
62987A811859M3554M3490M2108L9632L6376L2225K6914K0508J3254N088m363j5212
62975B095433k6918l8558m9261n8353o5352p0093p2805p3908p3708p2421p0195
62964A423861o7023o2815n7864n2942m8542m4358m0031l6128l3620l2461l1517
62953I16560k9978k8045k6046k3847k1604k0121j9703j9397j8169j6389j5206
62942F78055j4848j4493j3579j2430j1516j0865j0243r379q130o823o258o745
$$ plain form
62930 552746 545310 538027 531619 525947 520738 516360 513245 511063 509203 507621 506419 504938 502326 498959
62916 498959 496305 495122 494644 493882 492913 492251 491634 490276 488108 485935 484352 483185 482193 481669 481893 482409
62900 482409 482485 482157 482247 483250 484699 485875 486702 487537 488383 488809 488576 487936 487295 486942 487067 487660 488348 488674
62882 488674 488655 488808 489566 490941 492727 494698 496586 498249 499897 501756 503512 504538 504763 504666 504322 503103
62866 503103 500719 497902 495556 493688 491768 489727 487964 486650 485685 485169 485311 485864 486242 486265 486318 486734 487411
62849 487411 488167 489117 490606 492918 495970 499059 501030 501124 499713 498018 497087 497185 497913 498567 498538 497825 497170
62832 497170 497358 498433 499885 501418 503058 504607 505615 506059 506531 507573 509222 511377 514078 517115 519804
62817 519804 521655 523094 525091 528140 531958 536117 540523 545157 549692 553753 557494 561582 566492 572055
$$ packed form
62930E52746p436p283o408n672n209m378l115k182j860j582j202j481k612l367
62916D98959k654j183m78p62r69o62o17j358k168k173j583j167r92n24K24N16
62900D82409P6l28R0J003J449J176Q27Q35Q46M26k33o40o41l53J25N93O88L26
62882D88674j9J53P58J375J786J971J888J663J648J859J756J026K25r7l44j219
62866E03103k384k817k346j868j920k041j763j314r65n16J42N53L78K3N3M16O77
62849D87411P56R50J489K312L052L089J971R4j411j695r31R8P28O54k9p13o55
62832D97170J88J075J452J533J640J549J008M44M72J042J649K155K701L037K689
62817E19804J851J439J997L049L818M159M406M634M535M061L741M088M910N563
$$ plain form
62803 572055 577963 584475 592186 601077 610342 619385 628581 638681 649839 661693 674179 687635 702253
62790 702253 718092 735759 756493 781272 810204 843007 879756 920921 967048 1018689 1076331
62779 1076331 1140041 1209402 1284153 1364670 1451362 1543595 1639574 1737333 1835427 1932515 2026580
62768 2026580 2114879 2194535 2263014 2318122 2357983 2381240 2387231 2375880 2347550 2303204 2244589
62757 2244589 2174059 2094119 2007196 1915706 1821935 1727724 1634521 1543855 1457416 1376337 1300597
62746 1300597 1229528 1162891 1101161 1044854 993964 948122 906938 870042 837104 808010 782791
62735 782791 761135 742201 725249 710350 698124 688719 681262 674516 667909 661836 656983 653545 651159
62722 651159 649522 648911 649920 652647 656300 659909 663446 668004 674666 683481 693870 705809 720048 737109
$$ packed form
62803E72055N908O512P711Q891R265R043R196J0100J1158J1854J2486J3456J4618
62790G02253J5839J7667K0734K4779K8932L2803L6749M1165M6127N1641N7642
62779A076331O3710O9361P4751Q0517Q6692R2233R5979R7759R8094R7088R4065
62768B026580Q8299P9656O8479N5108L9861K3257N991j1351k8330m4346n8615
62757B244589p0530p9940q6923r1490r3771r4211r3203r0666q6439q1079p5740
62746A300597p1069o6637o1730n6307n0890m5842m1184l6896l2938k9094k5219
62735G82791k1656j8934j6952j4899j2226r405p457o746o607o073m853l438k386
62722F51159j637o11J009K727L653L609L537M558O662Q815J0389J1939J4239J7061
$$ plain form
62708 737109 756688 778329 802212 828855 858437 890990 926972 967016 1011272 1059620 1112447
62697 1112447 1170464 1233714 1301477 1373313 1449408 1529507 1612179 1695470 1777594 1856401 1928908
62686 1928908 1992239 2044728 2085356 2112437 2123778 2118151 2095936 2058424 2007305 1944949 1874254
62675 1874254 1797645 1716622 1632635 1547930 1465028 1385533 1309857 1238076 1170685 1108453 1051734
62664 1051734 1000141 952987 909930 870993 835939 804018 774640 748047 724888 705168 688015
62653 688015 672447 657966 644311 631111 618052 605195 592844 581214 570392 560550 552004 545007
62641 545007 539498 535138 531632 528992 527312 526269 525089 523247 520992 518955 517342 515806 514021 512050
62627 512050 510130 508369 506735 505178 503713 502528 501997 502467 504043 506581 509738 512930 515517 517338 518915
$$ packed form
62708G37109J9579K1641K3883K6643K9582L2553L5982M0044M4256M8348N2827
62697A112447N8017O3250O7763P1836P6095Q0099Q2672Q3291Q2124P8807P2507
62686A928908O3331N2489M0628K7081J1341n627k2215l7512n1119o2356p0695
62675A874254p6609q1023q3987q4705q2902p9495p5676p1781o7391o2232n6719
62664A051734n1593m7154m3057l8937l5054l1921k9378k6593k3159j9720j7153
62653F88015j5568j4481j3655j3200j3059j2857j2351j1630j0822r842q546o997
62641E45007n509m360l506k640j680j043j180j842k255k037j613j536j785j971
62627E12050j920j761j634j557j465j185n31M70J576K538L157L192K587J821J577
$$ plain form
62612 518915 520886 523393 526323 529878 534400 539743 545423 551550 559097 568922 580846 594043 608201
62599 608201 623948 642148 663141 686905 713838 744869 780480 819848 861463 904578 949526
62588 949526 996500 1044636 1092509 1138777 1181763 1219078 1248642 1269859 1283045 1287890 1283403 1269348
62576 1269348 1246858 1217463 1182304 1142530 1099680 1055191 1009997 964966 921258 879908 841332
62565 841332 805461 771972 740291 709993 681565 656284 634918 616892 601123 587192 575239
62554 575239 565073 556011 547487 539311 531476 524182 517989 513461 510524 508470 506722 505354 504783 505098
62540 505098 505844 506404 506518 506397 506312 506273 506209 506321 506931 507994 509154 510336 511988 514640 518602 524203 531913
62523 531913 541891 553697 566820 581342 597802 616556 637606 660992 687017 716055 748317 783865
$$ packed form
62612E18915J971K507K930L555M522N343N680O127P547R825J1924J3197J4158
62599F08201J5747J8200K0993K3764K6933L1031L5611L9368M1615M3115M4948
62588I49526M6974M8136M7873M6268M2986L7315K9564K1217J3186M845m487j4055
62576A269348k2490k9395l5159l9774m2850m4489m5194m5031m3708m1350l8576
62565H41332l5871l3489l1681l0298k8428k5281k1366j8026j5769j3931j1953
62554E75239j0166r062q524q176p835p294o193m528k937k054j748j368n71L15
62540E05098P46N60J14j21q5l9o4J12O10J063J160J182J652K652L962N601P710
62523E31913R978J1806J3123J4522J6460J8754K1050K3386K6025K9038L2262L5548
$$ plain form
62511 783865 822681 864604 909176 955578 1002770 1049760 1095705 1139650 1180277 1216044 1245526
62500 1245526 1267562 1281296 1286381 1283076 1271939 1253622 1229336 1201249 1171858 1142928 1115460 1090510
62488 1090510 1069263 1052102 1038345 1027268 1018953 1013884 1012296 1014252 1019673 1027629 1035988 1042428 1045734
62475 1045734 1045780 1042665 1036387 1026930 1013896 996131 972555 943555 911081 877152 842653 807688
62463 807688 772604 738306 705743 675401 647293 621311 597534 576240 557672 541889 528789
62452 528789 518078 509189 501427 494405 488179 482904 478563 475168 472922 471972 472171 473274 475163 477659
62438 477659 480421 483393 487098 491962 497340 501663 503737 503658 502399 500744 498765 496142 492696 488579 484055
62423 484055 479316 474548 469988 465680 461298 456570 451880 448078 445552 443813 442098 440049 437623 434787
$$ packed form
62511G83865L8816M1923M4572M6402M7192M6990M5945M3945M0627L5767K9482
62500A245526K2036J3734N085l305j1137j8317k4286k8087k9391k8930k7468k4950
62488A090510k1247j7161j3757j1077q315n069j588J956N421P956Q359O440L306
62475A045734M6l115o278r457j3034j7765k3576k9000l2474l3929l4499l4965
62463H07688l5084l4298l2563l0342k8108k5982k3777k1294j8568j5783j3100
62452E28789j0711q889p762p022o226n275m341l395k246r50J99J103J889K496
62438D77659K762K972L705M864N378M323K074p9j259j655j979k623l446m117m524
62423D84055m739m768m560m308m382m728m690l802k526j739j715k049k426k836
$$ plain form
62409 434787 431669 428649 425967 423440 420933 418831 417649 417379 417618 418179 419186 420749 422980 426155 430333
62394 430333 434918 439132 442957 447118 452052 457384 462579 467711 473300 479645 486515 493413 500076 506854
62380 506854 514538 523538 533230 542432 550577 558133 565842 573934 582205 590547 599108 608160 618025 628990
62366 628990 641087 654144 668248 684050 702403 723826 748473 776561 808556 844903 885741
62355 885741 930938 980269 1033426 1089757 1147992 1206159 1261836 1312605 1356548 1392613 1420686
62344 1420686 1441252 1454822 1461651 1461967 1456301 1445300 1429231 1407840 1380820 1348441 1311762 1272392
62332 1272392 1231997 1191810 1152386 1113868 1076503 1040797 1007135 975460 945525 917242 890511
62321 890511 864794 839276 813563 787911 762631 737688 713215 689998 668874 649778 631992
$$ packed form
62409D34787l118l020k682k527k507k102j182k70K39N61J007J563K231L175M178
62394D30333M585M214L825M161M934N332N195N132N589O345O870O898O663O778
62380E06854P684R000R692R202Q145P556P709Q092Q271Q342Q561R052R865J0965
62366F28990J2097J3057J4104J5802J8353K1423K4647K8088L1995L6347M0838
62355H85741M5197M9331N3157N6331N8235N8167N5677N0769M3943L6065K8073
62344A420686K0566J3570O829L16n666j1001j6069k1391k7020l2379l6679l9370
62332A272392m0395m0187l9424l8518l7365l5706l3662l1675k9935k8283k6731
62321H90511k5717k5518k5713k5652k5280k4943k4473k3217k1124j9096j7786
$$ plain form
62310 631992 615315 600324 587366 575974 565643 556531 548911 542470 536816 532249 529250 527388 525585
62297 525585 523452 521708 521202 522157 524398 527683 531538 535335 538800 542033 544905 546922 547931 548540 549560
62282 549560 551313 553574 555775 557200 557471 557086 557073 557978 559560 561488 563779 566487 569696 574018 580385
62267 580385 588960 598983 610047 622813 638039 655749 676084 700198 729323 763410 801584 843572
62255 843572 889748 939998 993522 1049648 1107892 1167038 1224899 1279129 1327741 1368886 1400900
62244 1400900 1422919 1435056 1437980 1432713 1420642 1402871 1379249 1348605 1310292 1265191 1215139 1161925
62232 1161925 1107112 1052347 999259 949034 902232 858929 818941 782048 748182 717516 690403
62221 690403 667121 647413 630316 614833 600861 588920 578763 568960 558435 547848 538684 531370
$$ packed form
62310F31992j6677j4991j2958j1392j0331r112p620o441n654m567k999j862j803
62297E25585k133j744n06R55K241L285L855L797L465L233K872K017J009O09J020
62282E49560J753K261K201J425K71l85j3R05J582J928K291K708L209M322O367
62267E80385Q575J0023J1064J2766J5226J7710K0335K4114K9125L4087L8174M1988
62255H43572M6176N0250N3524N6126N8244N9146N7861N4230M8612M1145L2014
62244A400900K2019J2137K924n267j2071j7771k3622l0644l8313m5101n0052n3214
62232A161925n4813n4765n3088n0225m6802m3303l9988l6893l3866l0666k7113
62221F90403k3282j9708j7097j5483j3972j1941j0157r803j0525j0587r164p314
$$ plain form
62209 531370 525144 519522 514829 511275 508458 506056 504254 503169 502511 502115 502250 503106 504537 506631 510005
62194 510005 515079 521428 528262 535291 542742 550743 559048 567274 575237 583129 591473 600719 610826 621350
62180 621350 631954 642553 652912 662404 670333 676436 681063 685031 689248 694389 701028 710166 723266
62167 723266 741393 764537 792131 823887 859642 898750 940291 983634 1027981 1071475 1111620
62156 1111620 1146585 1175416 1197197 1211183 1217954 1219268 1216300 1208923 1197069 1181555 1162763 1139576
62144 1139576 1110827 1077265 1041105 1004122 967249 931666 898986 870248 845603 825098 808973
62133 808973 797055 788622 783069 780155 779520 780712 783932 790007 799230 810775 823738 838315 855394
62120 855394 875344 897735 922031 947904 974771 1001410 1026094 1046923 1062260 1071483 1075492 1076035
$$ packed form
62209E31370o226n622m693l554k817k402j802j085o58l96J35Q56J431K094L374
62194E10005N074O349O834P029P451Q001Q305Q226P963P892Q344R246J0107J0524
62180F21350J0604J0599J0359R492P929O103M627L968M217N141O639R138J3100
62167G23266J8127K3144K7594L1756L5755L9108M1541M3343M4347M3494M0145
62156A111620L4965K8831K1781J3986O771J314k968p377j1854j5514j8792k3187
62144A139576k8749l3562l6160l6983l6873l5583l2680k8738k4645k0505j6125
62133H08973j1918q433n553k914o35J192L220O075R223J1545J2963J4577J7079
62120H55394J9950K2391K4296K5873K6867K6639K4684K0829J5337R223M009N43
$$ plain form
62108 1076035 1074273 1070223 1063670 1055009 1044706 1032434 1017521 1000186 981666 963146 945289 928953
62096 928953 915438 905466 898622 894420 893382 896174 902055 909246 916774 925036 934354 943956 952914 961393
62082 961393 970319 980139 990526 1001186 1012517 1025405 1040597 1058170 1077453 1097534 1117969 1138953
62070 1138953 1160765 1183232 1205818 1228046 1249685 1270666 1291047 1311082 1331282 1352351 1374817
62059 1374817 1398443 1421995 1443769 1462396 1477109 1487522 1493582 1495761 1494854 1491350 1485090 1475496 1461875
62046 1461875 1443492 1419744 1390541 1356494 1318684 1278285 1236315 1193430 1149926 1106079 1062535
62035 1062535 1020303 980357 943253 908933 876792 846206 817243 790677 767169 746709 728990
62024 728990 713795 700578 688228 675979 664223 653702 644122 634406 624169 614071 604670 595804
$$ packed form
62108A076035j762m050o553q661j0303j2272j4913j7335j8520j8520j7857j6336
62096I28953j3515r972o844m202j038K792N881P191P528Q262R318R602Q958Q479
62082I61393Q926R820J0387J0660J1331J2888J5192J7573J9283K0081K0435K0984
62070A138953K1812K2467K2586K2228K1639K0981K0381K0035K0200K1069K2466
62059A374817K3626K3552K1774J8627J4713J0413O060K179r07l504o260r594j3621
62046A461875j8383k3748k9203l4047l7810m0399m1970m2885m3504m3847m3544
62035A062535m2232l9946l7104l4320l2141l0586k8963k6566k3508k0460j7719
62024G28990j5195j3217j2350j2249j1756j0521r580r716j0237j0098r401q866
$$ plain form
62012 595804 587292 579420 572423 566181 560756 556681 554333 553462 553561 554395 556061 558937 563518 569816 576902
61997 576902 583597 589486 594651 598649 600786 601318 601203 600416 597698 592404 585422 577689 568976 558976 548528
61982 548528 538694 529411 520080 510806 502044 493661 485490 478307 473023 469210 465619 461957 458976 456856
61968 456856 454752 452157 449639 447827 446546 445400 444521 444250 444555 445164 445927 446761 447562 448461 449931 452385
61952 452385 455813 459929 464518 469556 475217 481849 489857 499524 510950 524120 539048 555977 575431
61939 575431 597772 622581 648789 675536 702560 729615 756007 781161 805272 828898 852054
61928 852054 874102 894344 912381 927967 940854 950676 956861 958934 957083 952112 944615 934699 922831
61915 922831 910490 899437 890659 884481 881297 881608 885622 893350 904830 919714 936872 954966 973229
$$ packed form
62012E95804q512p872o997o242n425m075k348q71R9Q34J666K876M581O298P086
61997E76902O695N889N165L998K137N32j15p87k718n294o982p733q713j0000j0448
61982E48528r834r283r331r274q762q383q171p183n284l813l591l662k981k120
61968D56856k104k595k518j812j281j146q79k71L05O09P63Q34Q01Q99J470K454
61952D52385L428M116M589N038N661O632Q008R667J1426J3170J4928J6929J9454
61939E75431K2341K4809K6208K6747K7024K7055K6392K5154K4111K3626K3156
61928H52054K2048K0242J8037J5586J2887R822O185K073j851m971p497r916j1868
61915I22831j2341j1053q778o178l184L11M014P728J1480J4884J7158J8094J8263
$$ plain form
61902 973229 991182 1007848 1021819 1031862 1037003 1036432 1030028 1018776 1003947 986078 965424 943096
61890 943096 920760 899163 877779 856044 834267 813217 793503 775483 759137 743806 728604
61879 728604 713297 698322 683856 669486 654977 640860 627972 616744 607120 598817 591537 585264
61867 585264 580514 578030 578156 580661 585018 590565 596568 602745 609795 619018 631357 647083 666239 688817
61853 688817 714535 742962 773964 807675 844092 883077 924586 968304 1013097 1057484 1100682
61842 1100682 1142576 1182465 1218414 1248083 1269917 1283538 1289505 1288911 1282868 1272241 1258043 1241874
61830 1241874 1225604 1210837 1199120 1192273 1191567 1196592 1205703 1217636 1231908 1247614 1262804 1275451
61818 1275451 1284255 1288130 1285657 1275686 1258082 1233480 1202758 1167068 1127962 1086955 1045095 1003127
$$ packed form
61902I73229J7953J6666J3971J0043N141n71o404j1252j4829j7869k0654k2328
61890I43096k2336k1597k1384k1735k1777k1050j9714j8020j6346j5331j5202
61879G28604j5307j4975j4466j4370j4509j4117j2888j1228r624q303p280o273
61867E85264m750k484J26K505M357N547O003O177P050R223J2339J5726J9156K2578
61853F88817K5718K8427L1002L3711L6417L8985M1509M3718M4793M4387M3198
61842A100682M1894L9889L5949K9669K1834J3621N967n94o043j0627j4198j6169
61830A241874j6270j4767j1717o847p06N025R111J1933J4272J5706J5190J2647
61818A275451Q804L875k473r971j7604k4602l0722l5690l9106m1007m1860m1968
$$ plain form
61806 1003127 961787 921788 883876 848966 817753 790050 764982 742036 721504 703805 688908
61795 688908 676531 666330 657612 649455 641412 633682 626463 619714 613720 609143 606091 603731 601208 598448
61781 598448 595677 592793 589649 586422 583158 579465 575140 570669 566664 563277 560656 559366 559721 561153
61767 561153 562927 565022 567661 570421 572743 575034 578336 582948 588200 593604 599371 605607 611807 617494
61753 617494 622827 628084 632951 636714 638948 639674 638988 636870 633417 629050 624372 619839 615562 611393 607129
61738 607129 602697 598326 594594 592036 590513 589208 587639 586443 586660 588333 590433 592204 593904 596044
61724 596044 598615 601495 604959 609221 613872 618325 622510 626636 630553 633932 636843 639620 642206 644167
61710 644167 645276 645707 645655 645137 644126 642560 640307 637407 634260 631354 628867 626707 624692 622455 619563
$$ packed form
61806A003127m1340l9999l7912l4910l1213k7703k5068k2946k0532j7699j4897
61795F88908j2377j0201q718q157q043p730p219o749n994m577l052k360k523k760
61781E98448k771k884l144l227l264l693m325m471m005l387k621j290L55J432
61767E61153J774K095K639K760K322K291L302M612N252N404N767O236O200N687
61753F17494N333N257M867L763K234P26o86k118l453m367m678m533m277m169m264
61738F07129m432m371l732k558j523j305j569j196K17J673K100J771J700K140
61724E96044K571K880L464M262M651M453M185M126L917L379K911K777K586J961
61710F44167J109M31n2n18j011j566k253k900l147k906k487k160k015k237k892
$$ plain form
61695 619563 616166 613222 611490 610489 609056 606845 604597 602876 601267 599063 596155 592801 588997 584616
61681 584616 579964 575658 571900 568305 564490 560560 556803 553173 549419 545672 542587 540681 539745 539104 538347
61666 538347 537558 536902 536271 535396 534064 532189 529906 527715 526338 526268 527426 529213 530809 531588 531595 531625 532598
61649 532598 534781 537767 541056 544378 547578 550677 554028 557989 562318 566326 569619 572283 574290 575317
61635 575317 575270 574393 572716 569989 566396 562671 559134 555284 550786 546182 542052 538100 533908 530090 527785
61620 527785 527179 527347 527465 527405 527173 526582 525692 524914 524353 523468 521607 518604 514704 510195 505212 499689 493495
61603 493495 486792 480189 474246 468833 463303 457294 451060 445002 439230 433684 428385 423447 418951 414919
61589 414919 411332 408162 405396 402879 400124 396570 392280 388119 384927 382663 380654 378458 376111 373760
$$ packed form
61695F19563l397k944j732j001j433k211k248j721j609k204k908l354l804m381
61681E84616m652m306l758l595l815l930l757l630l754l747l085j906r36o41p57
61666E38347p89o56o31q75j332j875k283k191j377p0J158J787J596P79PL0R73
61649E32598K183K986L289L322L200L099L351L961M329M008L293K664K007J027
61635E75317m7q77j677k727l593l725l537l850m498m604m130l952m192l818k305
61620E27785o06J68J18o0k32n91q90p78n61q85j861l003l900m509m983n523o194
61603D93495o703o603n943n413n530o009o234o058n772n546n299m938m496m032
61589D14919l587l170k766k517k755l554m290m161l192k264k009k196k347k351
$$ plain form
61575 373760 371486 369417 367565 365553 362901 359559 355886 352227 348919 346493 345277 344772 344039 342866 342020
61560 342020 342115 342744 343068 342864 342595 342732 343433 344678 346262 347682 348399 348315 347777 347180 346792 346933 347910 349547
61542 349547 351097 351976 352473 353352 354869 356556 358111 359961 362663 366103 369668 372935 375693 377497 377801
61527 377801 376539 374104 370853 367147 363761 361411 359702 357336 353720 349742 346555 344290 342552 341511
61513 341511 341609 342550 343398 343650 343582 343593 343739 343868 343716 342949 341571 340218 339598 339664 339810 339768 339770 339914 340010 340082 340433
61492 340433 340990 341151 340570 339717 339352 339721 340510 341263 341560 341001 339442 337279 335343 334402 334726 336005 337603
61475 337603 338944 339767 340157 340374 340619 340817 340680 340206 340042 340994 343026 345018 345762 344975 343228 341207 339353
61458 339353 337906 336881 336144 335732 335957 336896 338038 338745 338930 338985 339216 339679 340374 341243 342094 342866 343874 345473
$$ packed form
61575C73760k274k069j852k012k652l342l673l659l308k426j216n05p33j173q46
61560C42020R5O29L24k04k69J37P01J245J584J420P17q4n38n97l88J41R77J637
61542C49547J550Q79M97Q79J517J687J555J850K702L440L565L267K758J804L04
61527C77801j262k435l251l706l386k350j709k366l616l978l187k265j738j041
61513C41511R8R41Q48K52o8J1J46J29j52p67j378j353o20O6J46m2KJ44R6P2L51
61492C40433N57J61n81q53l65L69P89P53K97n59j559k163j936r41L24J279J598
61475C37603J341Q23L90K17K45J98j37m74j64R52K032J992P44p87j747k021j854
61458C39353j447j025p37m12K25R39J142P07J85N5K31M63O95Q69Q51P72J008J599
$$ plain form
61440 345473 347578 349761 351732 353496 355243 357318 360082 363512 367124 370546 373882 377297 380585 383494
61426 383494 386086 388374 390106 391417 393195 396036 399211 401480 402677 403578 404374 404371 403354 402287 402188 402985
61410 402985 403887 404315 404012 402702 400177 396648 392750 389247 386681 385048 383744 382067 379759 376958 373910
61395 373910 371046 369016 368030 367336 366024 364252 363016 362701 362625 362156 361535 361364 361893 363050 364603 366044
61379 366044 366924 367615 369175 372079 375551 378528 380775 382715 384627 386528 388484 390597 392920 395640 399004
61364 399004 402692 405685 407312 408164 409459 411656 414243 416764 419449 422700 426502 430755 435866 442583
61350 442583 451167 461028 471337 481821 492715 504062 515334 525698 534353 540691 544716 547445 550365
61337 550365 554098 558017 561400 564329 566923 568398 567775 565164 561481 557169 552108 546591 541353 536577
$$ packed form
61440C45473K105K183J971J764J747K075K764L430L612L422L336L415L288K909
61426C83494K592K288J732J311J778K841L175K269J197R01P96lj017j067r9P97
61410D02985R02M28l03j310k525l529l898l503k566j633j304j677k308k801l048
61395C73910k864k030r86o94j312j772j236l15p6m69o21j71N29J157J553J441
61379C66044Q80O91J560K904L472K977K247J940J912J901J956K113K323K720L364
61364C99004L688K993J627Q52J295K197K587K521K685L251L802M253N111O717
61350D42583Q584R861J0309J0484J0894J1347J1272J0364Q655O338M025K729K920
61337E50365L733L919L383K929K594J475o23k611l683m312n061n517n238m776
$$ plain form
61323 536577 531826 527087 523024 520015 517786 516139 515192 514745 514372 514442 516012 519282 523082 526414 529609
61308 529609 533367 537668 542517 548955 558167 569891 582620 595164 607252 618741 628953 636879 641646
61295 641646 642947 641373 638035 633528 627572 620003 611580 603306 595405 587599 580017 573179 567359 562654
61281 562654 559376 557658 556833 555957 554917 554434 555045 556726 559416 563202 567919 573199 579054 585846 593548
61266 593548 601538 609258 616671 623936 631179 638784 647507 657993 670420 684720 700728 717817 734612
61253 734612 749399 760875 768574 772834 774582 774826 774010 771750 767368 760771 752811 744718 737214 730186
61239 730186 723251 716448 710269 705139 701122 698031 695460 692669 688938 684346 679956 676965 675846 676470
61225 676470 678684 682372 687107 692176 697013 701412 705385 708961 712049 714328 715462 715667 715931 717353 720269
$$ packed form
61323E36577m751m739m063l009k229j647r47m47l73P0J570L270L800L332L195
61308E29609L758M301M849O438R212J1724J2729J2544J2088J1489J0212P926M767
61295F41646J301j574l338m507n956p569q423q274p901p806p582o838n820m705
61281E62654l278j718q25q76j040m83O11J681K690L786M717N280N855O792P702
61266E93548P990P720P413P265P243P605Q723J0486J2427J4300J6008J7089J6795
61253G34612J4787J1476P699M260J748K44q16k260m382o597p960q093p504p028
61239G30186o935o803o179n130m017l091k571k791l731m592m390k991j119O24
61225F76470K214L688M735N069M837M399L973L576L088K279J134K05K64J422K916
$$ plain form
61210 720269 724198 728512 732840 736802 739747 741075 740877 740138 740214 742059 745991 752113 760682 771874 785491
61195 785491 801298 819577 840870 865099 891260 918000 944100 968384 989773 1007758 1022517
61184 1022517 1034367 1043406 1049874 1054435 1057785 1060191 1061597 1061797 1060319 1056529 1050230 1041901 1032117 1021024
61170 1021024 1008615 995138 980877 965830 949919 933240 915872 897773 879221 860956 843507
61159 843507 826727 810360 794686 780104 766519 753875 743071 735496 731577 730373 730769 732572 736157
61146 736157 741412 747273 752167 754739 754324 750971 745141 737482 728725 719565 710497 701975 694730 689660
61132 689660 687284 687558 690219 695011 701530 709412 718872 730607 744904 761375 779786 800567 823993
61119 823993 849390 875740 902688 930387 958776 987673 1017235 1047535 1077823 1106871 1134024
$$ packed form
61210G20269L929M314M328L962K945J328j98p39P6J845L932O122Q569J1192J3617
61195G85491J5807J8279K1293K4229K6161K6740K6100K4284K1389J7985J4759
61184A022517J1850R039O468M561L350K406J406K00j478l790o299q329r784j1093
61170A021024j2409j3477j4261j5047j5911j6679j7368j8099j8552j8265j7449
61159H43507j6780j6367j5674j4582j3585j2644j0804p575l919j204L96J803L585
61146G36157N255N861M894K572m15l353n830p659q757r160r068q522p245n070
61132F89660k376K74K661M792O519P882R460J1735J4297J6471J8411K0781K3426
61119H23993K5397K6350K6948K7699K8389K8897K9562L0300L0288K9048K7153
$$ plain form
61108 1134024 1159332 1182828 1204372 1224158 1242595 1259478 1273795 1284482 1290934 1292718 1289394 1280906
61096 1280906 1267723 1250360 1229070 1204166 1176360 1146498 1115185 1082818 1049893 1017113 985201
61085 985201 954621 925440 897505 870845 845741 822367 800610 780444 762232 746319 732442
61074 732442 719858 708079 697292 688077 680825 675386 671204 667902 665681 664900 665329 666260 667449 669459
61060 669459 672835 677452 682988 689557 697383 706246 715758 725947 737132 749437 762803 777340 793320
61047 793320 811030 830786 852764 876634 901789 928125 956057 985522 1015681 1046062 1077259
61036 1077259 1109839 1143203 1176343 1209249 1242783 1277528 1313483 1350570 1388740 1427799 1467640
61025 1467640 1508275 1549288 1589955 1630549 1672817 1718576 1768830 1825073 1890138 1966303 2053537
$$ packed form
61108A134024K5308K3496K1544J9786J8437J6883J4317J0687O452J784l324q488
61096A280906j3183j7363k1290k4904k7806k9862l1313l2367l2925l2780l1912
61085I85201l0580k9181k7935k6660k5104k3374k1757k0166j8212j5913j3877
61074G32442j2584j1779j0787r215p252n439m182l302k221p81M29R31J189K010
61060F69459L376M617N536O569P826Q863R512J0189J1185J2305J3366J4537J5980
61047G93320J7710J9756K1978K3870K5155K6336K7932K9465L0159L0381L1197
61036A077259L2580L3364L3140L2906L3534L4745L5955L7087L8170L9059L9841
61025A467640M0635M1013M0667M0594M2268M5759N0254N6243O5065P6165Q7234
$$ plain form
61014 2053537 2151213 2260831 2385652 2528987 2695414 2893099 3132475 3423080 3774449 4199666
61004 4199666 4714695 5334435 6073949 6954722 8005651 9257736 10744526 12505136 14559050
60995 14559050 16838219 19128085 21101964 22463984 23102414 23131571 22804718 22393468 22121858
60986 22121858 22142742 22494567 23041999 23482622 23469450 22781917 21419475 19562462 17458111
60977 17458111 15324438 13311633 11502873 9927981 8581017 7439218 6476718 5669327
60969 5669327 4994508 4431598 3962489 3571370 3244107 2968167 2732805 2529302 2351334
60960 2351334 2194757 2056359 1932907 1821785 1721887 1632975 1554335 1484744 1423291 1369222
60950 1369222 1321083 1276865 1234939 1194204 1153643 1112664 1071775 1032064 994036 957601 923011
$$ packed form
61014B053537R7676J09618J24821J43335J66427J97685K39376K90605L51369M25217
61004D199666N15029O19740P39514Q80773J050929J252085J486790J760610K053914
60995A4559050K279169K289866J973879J362020O38430K9157l26853m11250k71610
60986B2121858K0884L51825N47432M40623j3172o87533j362442j857013k104351
60977A7458111k133673k012805j808760j574892j346964j141799r62500q07391
60969E669327o74819n62910m69109l91119l27263k75940k35362k03503j77968
60960B351334j56577j38398j23452j11122r9898q8912p8640o9591o1453n4069
60950A369222m8139m4218m1926m0735m0561m0979m0889l9711l8028l6435l4590
$$ plain form
60939 923011 890838 861072 833131 806819 782408 759726 738074 717262 697830 679970 663071
60928 663071 646754 631643 618503 607136 596630 586347 576233 566460 557228 548805 541413 535085
60916 535085 529763 525396 521846 518889 516431 514641 513814 514145 515551 517560 519533 521253 523151 525674 528627
60901 528627 531453 533943 536139 537690 538019 537238 536260 535740 535383 534590 533292 531811 530316 528877 527803 527367
60885 527367 527254 526661 524995 522192 518315 513173 506605 499068 491701 485584 480921 477016 473081 468933 464829
60870 464829 460882 456941 453049 449731 447677 447195 447993 449431 451021 452791 455187 458610 463086 468378 474121
60855 474121 479732 484488 488110 491247 494980 499789 505265 510862 516530 522369 528038 532982 537219 541448
60841 541448 546145 550767 554129 555502 555091 553517 551257 548731 546470 544712 542999 540671 537768 535014
$$ packed form
60939I23011l2173k9766k7941k6312k4411k2682k1652k0812j9432j7860j6899
60928F63071j6317j5111j3140j1367j0506j0283j0114r773r232q423p392o328
60916E35085n322m367l550k957k458j790q27L31J406K009J973J720J898K523K953
60901E28627K826K490K196J551L29p81r78n20l57p93j298j481j495j439j074m36
60885E27367j13n93j666k803l877n142o568p537p367o117m663l905l935m148m104
60870D64829l947l941l892l318k054m82P98J438J590J770K396L423M476N292N743
60855D74121N611M756L622L137L733M809N476N597N668N839N669M944M237M229
60841E41448M697M622L362J373m11j574k260k526k261j758j713k328k903k754
$$ plain form
60827 535014 532908 531299 529974 529083 528665 528161 526862 524623 521748 518380 514387 509762 504713 499385 493797
60812 493797 488018 482167 476249 470255 464429 459164 454568 450324 446066 441768 437748 434374 431815 430005
60798 430005 428795 428063 427594 426919 425610 423840 422404 421968 422411 423055 423403 423511 423791 424698 426467 428939 431699
60781 431699 434449 437218 440153 443307 446685 450247 453742 456856 459760 463235 467913 473600 479620 485557
60767 485557 491349 496956 502448 508271 514827 521767 528202 533701 538568 543025 546701 549363 551653 554467
60753 554467 557683 560121 560929 560555 560078 559959 559984 560164 560964 562398 563509 563254 561516 558712 554748 549171
60737 549171 542302 535339 529087 523282 517515 512120 507571 503585 499599 495834 493112 491686 490945 490322 489907
60722 489907 490037 490853 492533 495517 500048 505715 511785 517939 524433 531557 539222 547213 555654 564951 575239
$$ packed form
60827E35014k106j609j325q91m18n04j299k239k875l368l993m625n049n328n588
60812D93797n779n851n918n994n826n265m596m244m258m298m020l374k559j810
60798D30005j210p32m69o75j309j770j436m36M43O44L48J08K80R07J769K472K760
60781D31699K750K769K935L154L378L562L495L114K904L475M678N687O020N937
60767D85557N792N607N492N823O556O940O435N499M867M457L676K662K290K814
60753E54467L216K438Q08l74m77j19K5J80Q00J434J111k55j738k804l964n577
60737E49171o869o963o252n805n767n395m549l986l986l765k722j426p41o23m15
60722D89907J30Q16J680K984M531N667O070O154O494P124P665P991Q441R297J0288
$$ plain form
60707 575239 586106 597076 608188 619875 632346 645374 658670 672136 685683 699159 712577
60696 712577 726174 740054 753958 767498 780457 792822 804801 816833 829194 841435 852528
60685 852528 861781 869338 875715 881254 886158 890539 894112 896197 896351 894658 891194 885707 878211 869319
60671 869319 859442 848050 834405 818726 802044 785177 768493 752471 737569 723482 709251 694374
60659 694374 679368 665060 651804 639580 628418 618413 609567 601810 595000 588839 583020 577588 572986
60646 572986 569580 567211 565266 563133 560572 557685 554511 550763 546233 541433 537437 534891 533507 532742
60632 532742 532528 532969 533743 534427 535169 536462 538309 540075 541174 541456 541030 540097 538974 537874 536689 535215
60616 535215 533453 531318 528324 524101 519080 514138 509614 505190 500683 496350 492358 488532 484767 481239
$$ packed form
60707E75239J0867J0970J1112J1687J2471J3028J3296J3466J3547J3476J3418
60696G12577J3597J3880J3904J3540J2959J2365J1979J2032J2361J2241J1093
60685H52528R253P557O377N539M904M381L573K085J54j693l464n487p496q892
60671H69319r877j1392j3645j5679j6682j6867j6684j6022j4902j4087j4231j4877
60659F94374j5006j4308j3256j2224j1162j0005q846p757o810o161n819n432m602
60646E72986l406k369j945k133k561k887l174l748m530m800l996k546j384p65
60632E32742k14M41P74O84P42J293J847J766J099K82m26r33j123j100j185j474
60616E35215j762k135k994m223n021m942m524m424m507m333l992l826l765l528
$$ plain form
60602 481239 478037 475069 472439 470459 469089 467755 465935 463643 461258 459190 457792 457262 457461 458048 458797
60587 458797 459537 459938 459830 459672 460096 460910 461097 460006 458020 455916 454100 452703 451850 451440 451183 451269 452633
60570 452633 456072 461408 468003 475786 485206 496325 508563 521428 534999 549414 564061 577525
60558 577525 588315 595664 599742 601185 600449 597573 592558 585932 578946 573104 569314 567400 566690 567174 569746
60543 569746 575026 582368 590639 599785 610879 624534 640070 656525 673685 691411 708508 723094
60531 723094 733957 740813 743358 741038 734165 724563 714398 704656 695285 686514 679171 673578 668965 664500
60517 664500 660430 657599 656167 655540 655476 656469 658886 662341 666232 670353 674723 679328 684468 690894 699170
60502 699170 709273 721304 736198 755125 778466 805989 837807 874449 916062 962190 1012313
$$ packed form
60602D81239l202k968k630j980j370j334j820k292k385k068j398n30J99N87P49
60587D58797P40M01j08j58M24Q14J87j091j986k104j816j397q53m10k57Q6J364
60570D52633L439N336O595P783R420J1119J2238J2865J3571J4415J4647J3464
60558E77525J0790P349M078J443p36k876n015o626o986n842l790j914p10M84K572
60543E69746N280P342Q271R146J1094J3655J5536J6455J7160J7726J7097J4586
60531G23094J0863O856K545k320o873r602j0165r742r371q771p343n593m613m465
60517F64500m070k831j432o27o4R93K417L455L891M121M370M605N140O426Q276
60502F99170J0103J2031J4894J8927K3341K7523L1818L6642M1613M6128N0123
$$ plain form
60491 1012313 1065934 1121900 1178116 1232100 1281467 1323856 1356901 1378574 1387339 1381995 1361863 1327474
60479 1327474 1280887 1225181 1163710 1099716 1036152 975431 919208 868311 822745 781864 744900
60468 744900 711516 681867 656124 633965 614444 596430 579376 563686 550007 538237 527709
60457 527709 518360 510874 505328 500511 495265 489825 484997 480621 475876 470786 466326 463115 460929 459417
60443 459417 458366 457253 455528 453493 452030 451323 450706 449838 449063 448381 447114 445028 442938 441636 440881 439913
60427 439913 438391 436430 434361 432787 432201 432114 431294 429320 427254 426289 426440 427169 428559 430996 434175 437302
60411 437302 440088 442814 445535 447847 449452 450458 451119 451559 451687 451233 450084 448790 448376 449321 450980 452269
60395 452269 452684 452466 452192 452524 453958 456342 458879 460990 463001 465668 469256 473328 477191 480302 482505
$$ packed form
60491A012313N3621N5966N6216N3984M9367M2389L3045K1673Q765n344k0132l4389
60479A327474m6587n5706o1471o3994o3564o0721n6223n0897m5566m0881l6964
60468G44900l3384k9649k5743k2159j9521j8014j7054j5690j3679j1770j0528
60457E27709r349p486n546m817n246n440m828m376m745n090m460l211k186j512
60443D59417j051j113j725k035j463p07o17q68p75o82j267k086k090j302p55r68
60427D39913j522j961k069j574n86q7q20j974k066r65J51P29J390K437L179L127
60411D37302K786K726K721K312J605J006O61M40J28m54j149j294m14R45J659J289
60395D52269M15k18k74L32J434K384K537K111K011K667L588M072L863L111K203
$$ plain form
60380 482505 484150 485791 487590 489243 490592 491957 493797 496368 499744 503600 506972 508977 510082 511898
60366 511898 515301 519371 522641 524703 526058 527088 527926 528828 529848 530442 530056 528819 527211 525465 523878
60351 523878 523208 523944 525588 527394 529515 532620 536710 541223 546113 551847 558300 564537 569816 574093 577478
60336 577478 579902 581445 582293 582143 580264 576432 571319 565792 560243 554747 549399 544279 539515 535485 532558
60321 532558 530461 528339 525634 522613 519896 517859 516628 516194 516273 516388 516402 516784 518122 520611 524173 528816
60305 528816 534568 541226 548580 556930 567148 580001 595300 611656 627076 639894 649234 654803 656544
60292 656544 654581 649352 641580 632160 622150 612728 604832 598770 594232 590696 587778 585157 582250 578154
60278 578154 572154 564377 555732 547066 538566 530217 522420 515699 509952 504601 499447 494879 491204 488315
$$ packed form
60380D82505J645J641J799J653J349J365J840K571L376L856L372K005J105J816
60366E11898L403M070L270K062J355J030Q38R02J020N94l86j237j608j746j587
60351E23878o70P36J644J806K121L105M090M513M890N734O453O237N279M277L385
60336E77478K424J543Q48j50j879l832n113n527n549n496n348n120m764m030k927
60321E32558k097k122k705l021k717k037j231m34P9J15J4L82J338K489L562M643
60305E28816N752O658P354Q350J0218J2853J5299J6356J5420J2818R340N569J741
60292F56544j963n229p772r420j0010r422p896o062m538l536k918k621k907m096
60278E78154o000p777q645q666q500q349p797o721n747n351n154m568l675k889
$$ plain form
60264 488315 486032 484258 482770 481463 480750 481035 481787 481991 481634 481724 482583 483237 483058 482821 483236 483449 482212
60247 482212 479954 478439 478680 480205 482105 483775 484742 484798 484354 483949 483515 482846 482565 483707 486397 489753
60231 489753 493068 496287 499374 502161 504875 507928 511063 513592 515631 518206 521818 525755 529251 532612
60217 532612 536714 541932 547996 554422 560706 566557 572309 578774 586352 594568 602684 610329 617293 623157
60203 623157 627598 630842 633549 636377 639677 643229 646136 647403 646921 645614 644419 643394 641975 639824
60189 639824 637160 634520 632352 630662 628927 626612 623803 621038 618458 615598 612235 608998 606675 605230
60175 605230 603936 602438 601199 600785 600980 600896 599968 598657 597986 598399 599303 599785 599487 598569 597167 595322 593395
60158 593395 592031 591569 591743 592101 592536 593274 594447 595836 597083 598091 599100 600291 601545 602893 604968
$$ packed form
60264D88315k283j774j488j307p13K85P52K04l57R0Q59O54j79k37M15K13j237
60247D82212k258j515K41J525J900J670R67N6m44m05m34o69k81J142K690L356
60231D89753L315L219L087K787K714L053L135K529K039K575L612L937L496L361
60217E32612M102N218O064O426O284N851N752O465P578Q216Q116P645O964N864
60203F23157M441L244K707K828L300L552K907J267m82j307j195j025j419k151
60189F39824k664k640k168j690j735k315k809k765k580k860l363l237k323j445
60175F05230j294j498j239m14J95q4r28j311o71M13R04M82k98r18j402j845j927
60158E93395j364m62J74L58M35P38J173J389J247J008J009J191J254J348K075
$$ plain form
60143 604968 608427 612896 617173 620652 623950 627808 632125 636523 641167 646323 651657 656710 661633 666666
60129 666666 671323 674952 677725 680099 681545 680877 677829 673452 668948 664992 662154 660954 661238 662279 663674
60114 663674 665467 667370 668732 669461 670120 670848 670984 670067 668404 666337 663746 660708 657954 656107 654984
60099 654984 654021 652949 651810 650794 650326 650776 651901 653121 654500 656773 660214 664253 668405 672697 676889
60084 676889 680267 682760 685299 688324 690827 691754 691607 691587 691669 690635 687757 683420 678205 672281 665784 659022
60068 659022 652114 644996 637902 631324 625373 619560 613342 606651 599912 593748 588510 583891 579177 574130
60054 574130 569344 565453 562399 559901 558177 557512 557351 556689 555438 554784 556021 559502 564792 571227 578026
60039 578026 584272 589279 592922 595481 597239 598292 598563 597865 596050 593206 589672 585840 581958 578045 573891
$$ packed form
60143F04968L459M469M277L479L298L858M317M398M644N156N334N053M923N033
60129F66666M657L629K773K374J446o68l048m377m504l956k838j200K84J041J395
60114F63674J793J903J362P29O59P28J36r17j663k067k591l038k754j847j123
60099F54984r63j072j139j016m68M50J125J220J379K273L441M039M152M292M192
60084F76889L378K493K539L025K503R27j47k0Q2j034k878m337n215n924o497o762
60068F59022o908p118p094o578n951n813o218o691o739o164n238m619m714n047
60054E74130m786l891l054k498j724o65j61o62j251o54J237L481N290O435O799
60039E78026O246N007L643K559J758J053K71o98j815k844l534l832l882l913m154
$$ plain form
60024 573891 569215 563924 558199 552270 546174 539828 533284 526744 520421 514473 509098 504550 501066 498765
60010 498765 497610 497388 497729 498174 498300 497975 497540 497583 498323 499367 500284 501266 502840 504968 506830 507682 507751 508160
59992 508160 510041 513739 518681 523990 529258 534615 540078 545244 549858 554234 558544 561966 563264 562168
59978 562168 559557 556296 552555 548301 543756 539066 534215 529550 525875 523633 522429 521698 521421 521818 522738
59963 522738 523778 524828 526150 528024 530449 533035 535146 536470 537436 538658 539975 540576 540185 539454 538958
59948 538958 538444 537527 536526 536068 536237 536615 536884 536867 536209 534520 531806 528468 524930 521447 518059 514616
59932 514616 511006 507443 504275 501534 499128 497519 497555 499321 501702 503517 504646 505684 506989 508635 510941
59917 510941 514350 518826 523766 528541 532948 537218 541716 546497 551170 555408 559404 563384 566831 568963
$$ packed form
60024E73891m676n291n725n929o096o346o544o540o323n948n375m548l484k301
60010D98765j155k22L41M45J26l25m35M3P40J044R17R82J574K128J862Q52O9M09
59992E08160J881L698M942N309N268N357N463N166M614M376M310L422J298j096
59978E62168k611l261l741m254m545m690m851m665l675k242j204p31k77L97R20
59963E22738J040J050J322J874K425K586K111J324R66J222J317O01l91p31m96
59948E38958n14r17j001m58J69L78K69j7o58j689k714l338l538l483l388l443
59932E14616l610l563l168k741k406j609L6J766K381J815J129J038J305J646K306
59917E10941L409M476M940M775M407M270M498M781M673M238L996L980L447K132
$$ plain form
59903 568963 570027 571239 573140 574823 575264 574628 573712 572791 571743 570757 570242 570381 571351 573507 576834 580744
59887 580744 584950 589957 596049 602392 607997 613062 618533 624744 631338 638059 644619 650119 653741 655898
59873 655898 657670 659169 659406 657760 654608 650454 645545 640565 636608 633963 631658 628738 625362 622194
59859 622194 619312 616291 612917 609346 605838 602789 600792 600299 601362 603928 608160 614157 621512 629409
59845 629409 637114 644145 649975 653827 654926 653091 649083 644375 640552 638857 639861 643015 646445 647821
59831 647821 645930 641254 634888 627343 618721 609520 600577 592302 584504 576908 569463 562256 555453 549200
59817 549200 543336 537440 531518 526322 522480 519586 516686 513495 510596 508540 507332 506706 506334 505758 504707
59802 504707 503552 503036 503431 504274 504857 504612 503190 500722 498018 495954 494558 493177 491593 490444 490311 490829
$$ packed form
59903E68963J064J212J901J683M41o36r16r21j048r86n15J39R70K156L327L910
59887E80744M206N007O092O343N605N065N471O211O594O721O560N500L622K157
59873F55898J772J499K37j646l152m154m909m980l957k645k305k920l376l168
59859F22194k882l021l374l571l508l049j997m93J063K566M232N997P355P897
59845F29409P705P031N830L852J099j835m008m708l823j695J004L154L430J376
59831F47821j891m676o366p545q622r201q943q275p798p596p445p207o803o253
59817E49200n864n896n922n196l842k894k900l191k899k056j208o26l72n76j051
59802E04707j155n16L95Q43N83k45j422k468k704k064j396j381j584j149j33N18
$$ plain form
59786 490829 490984 490110 488390 486618 485664 486030 487712 490335 493301 495848 497264 497325 496486 495577 495333 496051 497279
59769 497279 497897 497181 496062 496649 500029 505058 509817 513630 516998 520167 522879 525314 528293 532366 537389
59754 537389 542997 548901 554707 560039 564922 569584 573916 577640 580794 583519 585605 586948 588344 590940
59740 590940 594807 598779 601809 603794 605042 605701 605941 606005 605775 604924 603800 603540 604921 607536 610386 612818
59724 612818 614602 615592 615812 615711 615945 616961 618823 621261 623830 626268 628740 631505 634421 637087 639443
59709 639443 641852 644620 647829 651646 656373 662095 668520 675196 681667 687633 693254 699112 705457 711703
59695 711703 717085 721530 725384 728625 731000 732666 733856 734081 732603 729728 726772 724593 722928 721257
59681 721257 719484 717546 715146 712196 708907 705200 700683 695374 689806 684248 678551 672927 668035 663979
$$ packed form
59786D90829J55q74j720j772r54L66J682K623K966K547J416O1q39r09k44P18J228
59769D97279O18p16j119N87L380N029M759L813L368L169K712K435K979M073N023
59754E37389N608N904N806N332M883M662M332L724L154K725K086J343J396K596
59740E90940L867L972L030J985J248O59K40O4k30q51j124k60J381K615K850K432
59724F12818J784R90K20j01K34J016J862K438K569K438K472K765K916K666K356
59709F39443K409K768L209L817M727N722O425O676O471N966N621N858O345O246
59695G11703N382M445L854L241K375J666J190K25j478k875k956k179j665j671
59681G21257j773j938k400k950l289l707m517n309n568n558n697n624m892m056
$$ plain form
59667 663979 660076 655999 652380 649752 647703 645624 643681 642428 642046 642553 644201 646967 650167 653274 656756
59652 656756 661349 666785 671924 676021 679189 681669 683165 683008 680630 675898 669274 661616 653627 645536
59638 645536 637401 629463 622088 615609 610440 606989 605139 604017 602638 600694 598504 596361 594130 591403
59624 591403 587903 583825 579820 576473 573783 571325 568821 566278 563575 560320 556158 550987 545000 538885
59610 538885 533807 530549 528702 527260 526057 525856 526977 528626 529926 530906 531997 533182 534087 534543 534662
59595 534662 534685 535005 535899 537027 537760 538214 539280 541292 543292 544165 543918 543255 542411 541045 538921 536025 532304
59578 532304 527860 523230 518939 514937 510841 506533 502203 498131 494821 492974 492812 493644 494566 495325 496084
59563 496084 496655 496597 495933 495237 495061 495638 496983 498851 500716 502216 503562 505129 506828 508333 509802 511859
$$ packed form
59667F63979l903m077l619k628k049k079j943j253l82N07J648K766L200L107L482
59652F56756M593N436N139M097L168K480J496j57k378m732o624p658p989q091
59638F45536q135p938p375o479n169l451j850j122j379j944k190k143k231k727
59624E91403l500m078m005l347k690k458k504k543k703l255m162n171n987o115
59610E38885n078l258j847j442j203k01J121J649J300R80J091J185R05M56J19
59595E34662K3L20Q94J128P33M54J066K012K000Q73k47o63q44j366k124k896l721
59578E32304m444m630m291m002m096m308m330m072l310j847j62Q32R22P59P59
59563D96084N71n8o64o96j76N77J345J868J865J500J346J567J699J505J469K057
$$ plain form
59547 511859 514841 518497 522522 527017 532316 538708 546518 556245 568287 582593 598919 617582 639542
59534 639542 664807 690457 711022 722030 723397 718972 713015 707825 704356 703457 705502 709671 714620
59521 714620 719675 724798 729667 733385 734970 733750 729539 722755 714114 703940 692074 678684 664637
59508 664637 650679 636845 623211 610632 599989 591033 582775 574889 568044 562937 559555 557360 555718
59495 555718 554248 553196 553298 554759 556564 557465 557571 558261 560451 563693 567171 570854 575112 579631 583477
59480 583477 586369 589386 594044 600741 608451 616037 623522 631700 640680 649360 656346 660913 662949 662628
59466 662628 660572 657936 655803 654585 654278 655077 657435 661687 667903 675980 685636 696529 708558 721808
59452 721808 735990 750256 763881 776884 789684 802373 814607 825865 835321 841618 843336 839833
$$ packed form
59547E11859K982L656M025M495N299O392P810R727J2042J4306J6326J8663K1960
59534F39542K5265K5650K0565J1008J367m425n957n190l469q99K045M169M949
59521G14620N055N123M869L718J585j220m211o784q641j0174j1866j3390j4047
59508F64637j3958j3834j3634j2579j0643q956q258p886o845n107l382k195j642
59495E55718j470j052J02J461J805R01J06O90K190L242L478L683M258M519L846
59480E83477K892L017M658O697P710P586P485Q178Q980Q680O986M567K036l21
59466F62628k056k636k133j218l07P99K358M252O216Q077R656J0893J2029J3250
59452G21808J4182J4266J3625J3003J2800J2689J2234J1258R456O297J718l503
$$ plain form
59440 839833 831478 819171 804035 787647 772086 759158 749258 741111 732951 724086 715120 706721 698750
59427 698750 691005 684270 679909 678658 680420 685075 692707 703122 715902 730976 748465 767942 788498
59414 788498 809576 831262 854034 878791 906150 933983 955909 964457 956764 936251 908705 878498
59402 878498 848950 823680 805496 795150 792696 798504 810747 822842 826221 816279 794593 765834
59390 765834 734353 703566 676116 653116 634019 618020 605107 595452 588578 583611 579883 577026
59378 577026 574879 573522 573047 573190 573459 573600 573667 573833 574462 576007 578365 580739 582742 585224 589234 594518
59362 594518 599852 604662 609499 615105 621912 630389 640977 653596 667856 683697 701129 719577 738399
59349 738399 758054 779810 804112 830030 856446 882959 909385 935128 959422 981680 1001281
$$ packed form
59440H39833q355j2307j5136j6388j5561j2928r900q147q160q865q966q399p971
59427F98750p745o735m361j251J762M655P632J0415J2780J5074J7489J9477K0556
59414G88498K1078K1686K2772K4757K7359K7833K1926Q548p693k0513k7546l0207
59402H78498k9548k5270j8184j0346k454N808J2243J2095L379r942k1686k8759
59390G65834l1481l0787k7450k3000j9097j5999j2913r655o874m967l728k857
59378E77026k147j357m75J43K69J41O7J66O29J545K358K374K003K482M010N284
59362E94518N334M810M837N606O807Q477J0588J2619J4260J5841J7432J8448J8822
59349G38399J9655K1756K4302K5918K6416K6513K6426K5743K4294K2258J9601
$$ plain form
59338 1001281 1017413 1029264 1036100 1037358 1033178 1024800 1013728 1000468 984669 966469 946965 927229
59326 927229 907560 887941 868719 850525 833927 819270 806473 794872 783661 772569 761822
59315 761822 751529 741558 731940 722980 714932 707901 701961 697102 693269 690791 690461 692747 697260 703484
59301 703484 711572 721847 734023 747629 762553 778019 791347 799022 799201 792498 780730 766067
59289 766067 751184 738595 729183 722230 717145 714223 713564 714451 716394 719839 725233 732188 740220 749683
59275 749683 761304 775218 790949 807928 825626 843527 861297 878624 894759 908719 920167
59264 920167 929496 936758 941051 941439 938065 931920 923826 913944 902064 888086 872357 855615 838526
59251 838526 821390 804538 788737 774708 762415 751399 741673 733706 727662 723400 721108 721116 723043
$$ packed form
59338A001281J6132J1851O836J258m180q378j1072j3260j5799j8200j9504j9736
59326I27229j9669j9619j9222j8194j6598j4657j2797j1601j1211j1092j0747
59315G61822j0293r971r618q960q048p031n940m859l833k478l30K286M513O224
59301G03484Q088J0275J2176J3606J4924J5466J3328P675J79o703j1768j4663
59289G66067j4883j2589r412o953n085k922o59Q87J943L445N394O955Q032R463
59275G49683J1621J3914J5731J6979J7698J7901J7770J7327J6135J3960J1448
59264I20167R329P262M293L88l374o145q094r882j1880j3978j5729j6742j7089
59251H38526j7136j6852j5801j4029j2293j1016r726p967o044m262k292QJ927
$$ plain form
59238 723043 725938 729442 733995 739679 745584 750573 754027 755623 755165 752949 749619 745221 738942 730207
59224 730207 719561 708146 696652 685053 673055 660631 648318 636999 627069 617982 609081 600652
59212 600652 593520 587814 582943 578674 575355 573033 571239 569775 568904 568637 568738 569490 571501 574541 577563
59197 577563 580176 583129 586979 591238 595313 599370 603781 608539 613732 619750 626509 633273 639842 647115
59183 647115 655757 665063 673899 682167 690552 699193 707435 714726 721237 727689 734826 742798 750971 758765
59169 758765 766679 775778 786068 796211 805191 813409 821649 829759 836942 842629 846432 847888 846935 844117
59155 844117 839746 833371 824674 814346 803441 792276 780580 768384 756247 744860 734756 725980
59143 725980 717773 709177 700314 692445 686305 681084 675599 669745 664153 659154 654941 652194 651524 652508 654134
$$ packed form
59238G23043K895L504M553N684N905M989L454J596m58k216l330m398o279q735
59224G30207j0646j1415j1494j1599j1998j2424j2313j1319r930r087q901q429
59212F00652p132n706m871m269l319k322j794j464q71k67J01P52K011L040L022
59197E77563K613K953L850M259M075M057M411M758N193O018O759O764O569P273
59183F47115Q642R306Q836Q268Q385Q641Q242P291O511O452P137P972Q173P794
59169G58765P914R099J0290J0143Q980Q218Q240Q110P183N687L803J456r53k818
59155H44117m371o375q697j0328j0905j1165j1696j2196j2137j1387j0104q776
59143G25980q207q596q863p869o140n221n485n854n592m999m213k747o70R84J626
$$ plain form
59128 654134 656057 658746 662582 667507 673477 680573 688623 697229 706340 716542 728694 743293 759985
59115 759985 777617 795057 812056 829030 846014 862392 877673 891862 904803 915853 924664 931709
59103 931709 937520 941781 943562 942208 937793 931105 923296 915066 906097 895847 884853 874439 865082
59090 865082 856106 847250 839368 832992 827278 821125 814459 807650 800515 792798 784860 776948 768440 758808
59076 758808 748806 739745 731853 724198 715951 707065 698060 689718 682563 676113 669175 661460 654168 648264
59062 648264 642993 637112 630904 625751 622117 619159 616077 612716 608945 604606 600163 596442 593526 590688
59048 590688 587545 584601 582490 581269 580590 580103 579627 579291 579466 580258 581244 582062 583028 584730 587288 590448
59032 590448 594091 598098 602039 605662 609587 614922 622210 631144 641208 652146 663861 676237 689033
$$ packed form
59128F54134J923K689L836M925N970P096Q050Q606R111J0202J2152J4599J6692
59115G59985J7632J7440J6999J6974J6984J6378J5281J4189J2941J1050Q811P045
59103I31709N811M261J781j354m415o688p809q230q969j0250j0994j0414r357
59090H65082q976q856p882o376n714o153o666o809p135p717p938p912q508r632
59076G58808j0002r061p892p655q247q886r005q342p155o450o938p715p292n904
59062F48264n271n881o208n153l634k958l082l361l771m339m443l721k916k838
59048E90688l143k944k111j221o79m87m76l36J75P92R86Q18R66J702K558L160
59032E90448L643M007L941L623L925N335P288Q934J0064J0938J1715J2376J2796
$$ plain form
59019 689033 701759 713798 724747 734458 742733 749323 754204 757332 758171 756316 752700 749256 747029 745503
59005 745503 744114 743376 743902 745486 747985 752063 757986 764545 770353 775546 780962 786206 789824 791127 790695
58990 790695 789315 787470 785624 783869 781333 776928 770687 763621 756451 749388 743016 738285 735478 733993
58976 733993 733365 733881 736060 740048 745656 752633 760868 770496 781627 793796 806127 818283 830777
58963 830777 844064 857922 872081 886628 901137 914163 924393 931702 936361 937848 935303 928682
58951 928682 918675 905967 891221 875229 858381 840616 822473 805379 790145 776182 763021
58940 763021 751593 742909 736542 731616 728261 726604 725351 723110 720373 718414 716837 714079 709884 705292
58926 705292 700452 694502 687652 681421 676470 671904 667074 662487 658532 654821 651244 648376 646420 644925
$$ packed form
59019F89033J2726J2039J0949R711Q275O590M881L128Q39j855l616l444k227j526
59005G45503j389p38N26J584K499M078N923O559N808N193N416N244L618J303m32
58990G90695j380j845j846j755k536m405o241p066p170p063o372m731k807j485
58976G33993o28N16K179L988N608O977Q235R628J1131J2169J2331J2156J2494
58963H30777J3287J3858J4159J4547J4509J3026J0230P309M659J487k545o621
58951I28682j0007j2708j4746j5992j6848j7765j8143j7094j5234j3963j3161
58940G63021j1428q684o367m926l355j657j253k241k737j959j577k758m195m592
58926G05292m840n950o850o231m951m566m830m587l955l711l577k868j956j495
$$ plain form
58912 644925 643916 644088 645560 647603 649928 653171 657838 663853 671359 680871 692370 705278 719391 734775
58898 734775 750754 766379 781963 798664 816240 832781 847249 861010 876234 893941 914134
58887 914134 936626 960894 985919 1010767 1034646 1056199 1073709 1086442 1094961 1099851 1100972 1098082
58875 1098082 1091149 1079876 1064122 1045035 1024593 1003743 982169 960152 939196 920372 903402
58864 903402 888066 875103 864849 856079 847181 837670 827882 818028 808183 798331 787876 776099 763666
58851 763666 752610 744074 737050 730045 722895 716037 709092 701380 693156 685211 677701 670325 663263 657083
58837 657083 651989 647789 644266 640989 637246 632823 628545 625529 624154 624131 625042 626389 627527 628054 628049 627732
58821 627732 627279 627123 627832 629500 631736 634392 637576 640844 643234 644400 644981 645535 645893 645867 645727 645534 644853
$$ packed form
58912F44925j009J72J472K043K325L243M667O015P506R512J1499J2908J4113J5384
58898G34775J5979J5625J5584J6701J7576J6541J4468J3761J5224J7707K0193
58887I14134K2492K4268K5025K4848K3879K1553J7510J2733Q519M890J121k890
58875A098082o933j1273j5754j9087k0442k0850k1574k2017k0956j8824j6970
58864I03402j5336j2963j0254q770q898r511r788r854r845r852j0455j1777j2433
58851G63666j1056q536p024p005p150o858o945p712q224p945p510p376p062o180
58837F57083n094m200l523l277l743m423m278l016j375k3R11J347J138N27nl17
58821F27732m53j56P09J668K236K656L184L268K390J166N81N54L58k6j40j93o81
$$ plain form
58804 644853 643550 642131 640845 639234 637071 634926 633268 631680 629560 627011 624569 622617 621455 621281
58790 621281 621684 621805 621431 621375 622484 624945 628833 634427 641543 649369 657457 666112 675341 684260 692186
58775 692186 699510 706755 713303 717746 719142 717422 712998 706465 698400 689173 679179 669225 660137 651987
58761 651987 644367 637394 631606 626955 622892 619584 617943 618204 619522 621228 623413 625993 628397 630581
58747 630581 633267 636760 640690 645310 651715 660125 669246 678122 687399 697921 709239 720474 731592
58734 731592 742796 753600 763629 773582 784252 795079 804596 811858 816788 819696 821181 821934 821932 820336
58720 820336 816668 811545 805946 800593 796419 794564 795133 796799 798275 799402 800312 800623 800157 799360 798146
58705 798146 795343 790145 783159 775103 765433 753325 739135 723821 707683 690746 673743 657629
$$ packed form
58804F44853j303j419j286j611k163k145j658j588k120k549k442j952j162j74
58790F21281M03J21l74n6J109K461L888N594P116P826Q088Q655R229Q919P926
58775F92186P324P245O548M443J396j720m424o533q065r227r994r954r088q150
58761F51987p620o973n788m651m063l308j641K61J318J706K185K580K404K184
58747F30581K686L493L930M620O405Q410R121Q876R277J0522J1318J1235J1118
58734G31592J1204J0804J0029R953J0670J0827R517P262M930K908J485P53kj596
58720H20336l668n123n599n353m174j855N69J666J476J127R10L11m66p97j214
58705G98146k803n198o986q056r670j2108j4190j5314j6138j6937j7003j6114
$$ plain form
58693 657629 642620 628613 616042 605458 596757 589486 583353 577869 572251 566368 560969 556372 551862
58680 551862 547093 543022 540519 539031 537592 536237 535421 534888 534245 533943 534722 536894 540958 547862 557553
58665 557553 568331 578900 590111 603326 617937 631900 643823 652980 658091 658103 653988 648114 641716
58652 641716 634285 625379 615768 606602 598489 591615 586019 581578 578119 575388 572689 569206 565170 562013
58638 562013 560780 561079 562144 563951 566487 568942 570675 572047 573276 573402 571679 569131 567380 566554 565709
58623 565709 564713 564313 564829 566209 568987 573833 580308 587302 594602 602973 612849 623865 635469 647070
58609 647070 657799 666932 674343 680008 683560 684959 684998 684424 683198 681235 679018 676726 673694 669675 665704
58594 665704 662775 660677 659160 659109 661269 664905 669145 674716 682829 693177 704576 716830 730406 744901
$$ packed form
58693F57629j5009j4007j2571j0584q701p271o133n484n618n883n399m597m510
58680E51862m769m071k503j488j439j355q16n33o43l02P79K172M064O904R691
58665E57553J0778J0569J1211J3215J4611J3963J1923R157N111J2m115n874o398
58652F41716p431q906r611r166q113o874n596m441l459k731k699l483m036l157
58638E62013j233K99J065J807K536K455J733J372J229J26j723k548j751q26q45
58623E65709r96m00N16J380K778M846O475O994P300Q371R876J1016J1604J1601
58609F47070J0729R133P411N665L552J399L9n74j226j963k217k292l032m019l971
58594F65704k929k098j517n1K160L636M240N571Q113J0348J1399J2254J3576J4495
$$ plain form
58580 744901 759405 773727 787774 800331 810080 817316 823203 827920 831136 833741 837445 842965 850031
58567 850031 858712 869306 881388 894507 909403 927130 947454 969468 992978 1017643 1041414 1061683
58555 1061683 1077612 1089738 1097955 1101817 1102450 1102080 1101653 1100499 1098044 1094192 1088300 1079663 1068921 1057303
58541 1057303 1044589 1029474 1011712 992183 971067 947897 923396 899418 876931 855744 836261
58530 836261 819675 806130 794345 783494 774161 767173 762661 760391 759894 760255 760788 761760 763553 765639
58516 765639 767521 769882 773372 776965 779209 780483 782278 784910 787763 791164 795856 801101 805413 808872
58502 808872 812550 815969 817409 816601 814777 812070 807259 800317 792973 786327 780024 774122 769698 767117
58488 767117 765583 764898 765932 768994 773410 778995 786283 795150 804929 815983 829373 844810 860674
$$ packed form
58580G44901J4504J4322J4047J2557R749P236N887M717L216K605L704N520P066
58567H50031Q681J0594J2082J3119J4896J7727K0324K2014K3510K4665K3771K0269
58555A061683J5929J2126Q217L862O33l70m27j154k455l852n892q637j0742j1618
58541A057303j2714j5115j7762j9529k1116k3170k4501k3978k2487k1187j9483
58530H36261j6586j3545j1785j0851r333o988m512k270m97L61N33R72J793K086
58516G65639J882K361L490L593K244J274J795K632K853L401M692N245M312L459
58502H08872L678L419J440q08j824k707m811o942p344o646o303n902m424k581
58488G67117j534o85J034L062M416N585P288Q867R779J1054J3390J5437J5864
$$ plain form
58475 860674 876025 890691 903478 912451 917152 918533 916670 910781 901591 891306 880881 869682 858225
58462 858225 848769 842452 838126 834910 833727 835403 839181 844149 850425 858081 866408 874889 883358 890745
58448 890745 895344 896714 895674 892197 885311 875423 864652 854357 844310 834803 827371 822645 819496
58435 819496 817152 816322 817499 819984 823317 827971 833935 840363 847255 855781 866294 877671 889034 900432
58421 900432 911389 920573 927395 932239 934865 934434 931360 927230 922667 917211 911351 906393 902154 897087
58407 897087 890974 885118 879725 873736 867600 863420 861678 860539 859115 858673 859774 860946 861305 861959 863672
58392 863672 865489 866733 868046 869473 869811 868801 867715 866952 865331 862478 859532 856879 853798 850971 850536
58377 850536 852797 855738 858635 863219 870257 878085 885714 894376 904682 915213 925351 936563 949461
$$ packed form
58475H60674J5351J4666J2787Q973M701J381j863n889r190j0285j0425j1199j1457
58462H58225r456o317m326l216j183J676L778M968O276P656Q327Q481Q469P387
58448H90745M599J370j040l477o886r888j0771j0295j0047r507p432m726l149
58435H19496k344q30J177K485L333M654N964O428O892Q526J0513J1377J1363J1398
58421I00432J0957R184O822M844K626m31l074m130m563n456n860m958m239n067
58407H97087o113n856n393n989o136m180j742j139j424m42J101J172L59O54J713
58392H63672J817J244J313J427L38j010j086p63j621k853k946k653l081k827m35
58377H50536K261K941K897M584P038P828P629Q662J0306J0531J0138J1212J2898
$$ plain form
58364 949461 962461 974849 988260 1003563 1019110 1033628 1047963 1062397 1075086 1084793 1092445 1098546
58352 1098546 1102018 1103120 1104405 1107006 1109047 1109472 1110293 1113121 1116639 1119626 1123485 1129613 1137144 1145434
58338 1145434 1155953 1169613 1184954 1200865 1218247 1237150 1255448 1272260 1289474 1307733 1324245
58327 1324245 1336776 1346545 1354868 1360465 1362711 1364218 1367321 1370986 1373820 1377048 1381918 1387319 1392688 1400153
58313 1400153 1410995 1423083 1434527 1446745 1461217 1476430 1490913 1506071 1523131 1540464 1556803
58302 1556803 1573864 1592929 1612224 1630544 1649971 1671958 1694233 1714674 1734675 1755643 1775940
58291 1775940 1794608 1814229 1836661 1859743 1881732 1904964 1931471 1959042 1985544 2013098 2043890
58280 2043890 2075939 2107211 2139927 2176375 2214424 2251617 2289797 2331203 2373950 2415806 2458477
$$ packed form
58364I49461J3000J2388J3411J5303J5547J4518J4335J4434J2689R707P652O101
58352A098546L472J102J285K601K041M25Q21K828L518K987L859O128P531Q290
58338A145434J0519J3660J5341J5911J7382J8903J8298J6812J7214J8259J6512
58327A324245J2531R769Q323N597K246J507L103L665K834L228M870N401N369P465
58313A400153J0842J2088J1444J2218J4472J5213J4483J5158J7060J7333J6339
58302A556803J7061J9065J9295J8320J9427K1987K2275K0441K0001K0968K0297
58291A775940J8668J9621K2432K3082K1989K3232K6507K7571K6502K7554L0792
58280B043890L2049L1272L2716L6448L8049L7193L8180M1406M2747M1856M2671
$$ plain form
58269 2458477 2503673 2549243 2593761 2640478 2691935 2745313 2798109 2853598 2915265 2980673 3046508
58258 3046508 3114669 3187278 3260604 3330489 3399277 3470874 3543587 3614612 3687105 3765861 3850227
58247 3850227 3937952 4031499 4133700 4241864 4353206 4471301 4600096 4736661 4877269 5025203
58237 5025203 5184846 5353684 5528306 5712535 5911090 6121198 6339484 6571089 6822496
58228 6822496 7091552 7374380 7675779 8002554 8353218 8724986 9124101 9558154 10025529
58219 10025529 10524349 11064221 11656813 12303064 13003108 13770178 14620450 15558515 16588652
58210 16588652 17731243 19011869 20444999 22047277 23857268 25923883 28288024 30997910
58202 30997910 34131651 37784336 42050137 47045587 52937270 59920771 68194002 77987016
$$ packed form
58269B458477M5196M5570M4518M6717N1457N3378N2796N5489O1667O5408O5835
58258C046508O8161P2609P3326O9885O8788P1597P2713P1025P2493P8756Q4366
58247C850227Q7725R3547J02201J08164J11342J18095J28795J36565J40608J47934
58237E025203J59643J68838J74622J84229J98555K10108K18286K31605K51407
58228F822496K69056K82828L01399L26775L50664L71768L99115M34053M67375
58219A0025529M98820N39872N92592O46251P00044P67070Q50272R38065J030137
58210A6588652J142591J280626J433130J602278J809991K066615K364141K709886
58202C0997910L133741L652685M265801M995450N891683O983501Q273231R793014
$$ plain form
58194 77987016 89598662 103367094 119630724 138762097 161202766 187400223 217723644
58187 217723644 252394910 291131483 332264071 371921077 404448596 424395450 428793933
58180 428793933 418045186 395049504 363680332 327718370 290395464 254174954 220638904
58173 220638904 190582768 164259228 141581231 122240550 105824034 91924852 80178083
58166 80178083 70241862 61805195 54618831 48488465 43241083 38722656 34818879 31446737
58158 31446737 28525133 25973643 23733342 21764690 20026322 18474627 17080547 15827764
58150 15827764 14696302 13664112 12721560 11867817 11094669 10387966 9741905 9157327 8628175
58141 8628175 8143207 7698880 7297217 6932500 6592367 6270786 5968718 5683899 5411340
$$ packed form
58194G7987016J1611646J3768432J6263630J9131373K2440669K6197457L0323421
58187B17723644L4671266L8736573M1132588L9657006L2527519J9946854M398483
58180D28793933j0748747k2995682l1369172l5961962l7322906l6220510l3536050
58173B20638904l0056136k6323540k2677997j9340681j6416516j3899182j1746769
58166H0178083r936221q436667p186364o130366n247382m518427l903777l372142
58158C1446737k921604k551490k240301j968652j738368j551695j394080j252783
58150A5827764j131462j032190r42552q53743p73148p06703o46061n84578n29152
58141H628175m84968m44327m01663l64717l40133l21581l02068k84819k72559
$$ plain form
58132 5411340 5152434 4912604 4690857 4481453 4284324 4103836 3938551 3782007 3632735
58123 3632735 3494245 3366041 3243589 3126455 3017886 2916898 2818976 2724017 2635806 2554242
58113 2554242 2475568 2399602 2329411 2264475 2201229 2139660 2082426 2028257 1973031 1916766 1862992
58102 1862992 1811987 1761110 1711011 1665006 1622948 1581972 1542477 1507143 1474798 1441650 1408067
58091 1408067 1377969 1352006 1327288 1303292 1282034 1262887 1243232 1223829 1207611 1193473 1177051
58080 1177051 1157437 1137402 1117366 1095032 1070860 1048018 1026782 1004634 981983 962128 945306
58069 945306 928350 910652 895027 882128 869374 856080 844484 835003 825506 815982 808957 804415
58057 804415 799061 791376 782831 773552 761719 748125 736371 727342 718034 707077 696952 689452 683262
$$ packed form
58132E411340k58906k39830k21747k09404j97129j80488j65285j56544j49272
58123C632735j38490j28204j22452j17134j08569j00988r7922r4959q8211q1564
58113B554242p8674p5966p0191o4936o3246o1569n7234n4169n5226n6265n3774
58102A862992n1005n0877n0099m6005m2058m0976l9495l5334l2345l3148l3583
58091A408067l0098k5963k4718k3996k1258j9147j9655j9403j6218j4138j6422
58080A177051j9614k0035k0036k2334k4172k2842k1236k2148k2651j9855j6822
58069I45306j6956j7698j5625j2899j2754j3294j1596r481r497r524p025m542
58057H04415n354p685q545r279j1833j3594j1754r029r308j0957j0125p500o190
$$ plain form
58044 683262 677416 673006 669986 666092 660396 654397 648574 641491 633287 626271 620890 614859 607365 600392
58030 600392 594635 587899 579058 570021 562218 554481 545971 538001 531344 524738 517563 511149 506080 500979
58016 500979 495359 490929 488684 487287 485522 483887 482668 481019 479036 478216 478879 479602 479990 481343 483781
58001 483781 485540 486118 487321 490094 493069 495356 498046 501711 505146 507892 511435 516541 521839 526362
57987 526362 531038 536338 540871 543792 546347 549512 552167 553063 552716 552023 550728 548441 545498 541903 537098
57972 537098 531577 526887 523394 519906 515995 512522 509413 505381 500597 497026 495199 493166 489703 486051
57958 486051 483286 480499 476954 473653 471253 468659 465169 461853 459375 456570 452760 449422 447897 447355
57944 447355 446649 446421 447702 450161 453386 458280 465508 473946 482287 490948 501082 512933 526310 541233
$$ packed form
58044F83262n846m410l020l894n696n999n823p083q204p016n381o031p494o973
58030F00392n757o736q841r037p803p737q510p970o657o606p175o414n069n101
58016E00979n620m430k245j397j765j635j219j649j983q20O63P23L88J353K438
58001D83781J759N78J203K773K975K287K690L665L435K746L543N106N298M523
57987E26362M676N300M533K921K555L165K655Q96l47o93j295k287k943l595m805
57972E37098n521m690l493l488l911l473l109m032m784l571j827k033l463l652
57958D86051k765k787l545l301k400k594l490l316k478k805l810l338j525n42
57944D47355p06k28J281K459L225M894P228Q438Q341Q661J0134J1851J3377J4923
$$ plain form
57930 541233 556836 571052 582560 591761 598841 602485 601697 597398 591010 582907 573327 563150 552481
57917 552481 540049 525401 510296 496667 484614 473545 463659 454869 445876 435953 426360 418519 412049
57904 412049 406044 400884 397143 393928 389997 385630 381807 378354 374367 369838 365567 362052 359439 357856
57890 357856 356975 356148 355727 357059 360315 363593 365301 366144 367593 369636 371405 372924 374735 376560 377600
57875 377600 377521 376184 373236 368961 364662 361261 358365 355566 353588 353184 353950 355285 357551 361239 365892
57860 365892 370874 376272 382173 388087 393959 400668 408533 416452 423540 430487 438169 446082 453265 459640
57846 459640 465243 469222 470884 470808 469707 467158 462681 457101 451513 445750 439108 431754 424266 416619 408907
57831 408907 402238 397669 394932 393248 392613 393206 394402 395546 396928 398910 401001 402894 405438 409286 413438
$$ packed form
57930E41233J5603J4216J1508R201P080L644p88m299o388q103r580j0177j0669
57917E52481j2432j4648j5105j3629j2053j1069r886q790q993r923r593p841o470
57904D12049o005n160l741l215l931m367l823l453l987m529m271l515k613j583
57890C57856q81q27m21J332L256L278J708Q43J449K043J769J519J811J825J040
57875C77600p9j337k948m275m299l401k896k799j978m04P66J335K266L688M653
57860C65892M982N398N901N914N872O709P865P919P088O947P682P913P183O375
57846D59640N603L979J662p6j101k549m477n580n588n763o642p354p488p647p712
57831D08907o669m569k737j684o35N93J196J144J382J982K091J893K544L848M152
$$ plain form
57816 413438 416478 418510 420614 423068 425339 427069 427756 426139 421277 413820 405169 396010 386690 378237
57802 378237 371658 366714 362473 358559 354915 351098 346937 343219 340671 338864 337072 335382 333926 331893
57788 331893 328613 324893 322057 320358 319429 319495 320885 323056 325389 328304 332407 337272 342180 347240 352533
57773 352533 357027 359788 361547 363648 366095 367943 368790 368457 366025 360932 354445 348371 342776 336483 329269
57758 329269 321922 314643 307180 300209 294802 290690 286679 282681 279698 277910 276394 274793 273748 273550
57744 273550 273771 274331 275599 277302 278552 279081 279340 279366 278731 277598 276736 276443 276437 276658 277129 277274 276513 275381
57726 275381 274912 275127 275285 275387 276159 277703 279462 281367 283752 286245 288108 289539 291287 293044 293661 293056
57710 293056 292394 292251 291973 291176 290456 290156 289645 288423 287000 286201 286346 287432 289414 292022 294898 298013
$$ packed form
57816D13438L040K032K104K454K271J730O87j617m862p457q651r159r320q453
57802C78237o579m944m241l914l644l817m161l718k548j807j792j690j456k033
57788C31893l280l720k836j699r29O6J390K171K333K915M103M865M908N060N293
57773C52533M494K761J759K101K447J848Q47l33k432n093o487o074n595o293p214
57758C29269p347p279p463o971n407m112m011l998k983j788j516j601j045j98
57744B73550K21N60J268J703J250N29K59K6o35j133q62k93oK21M71J45p61j132
57726B75381m69K15J58J02P72J544J759J905K385K493J863J431J748J757O17o05
57710B93056o62j43k78p97p20l00n11j222j423p99J45J086J982K608K876L115
$$ plain form
57694 298013 301397 304624 307196 309175 310649 311065 310144 309014 309155 310402 311417 312026 313708 317706 324023
57679 324023 332506 343634 357840 375285 396683 423444 456665 496799 544476 600722 666390 742469
57667 742469 831079 934517 1051772 1175317 1290713 1379449 1424651 1417963 1363255 1273656 1164573
57656 1164573 1048884 936277 833549 744038 667981 604364 551940 508718 472206 441022 415333
57645 415333 395156 379168 365631 353605 342758 332869 324032 316629 310698 305892 302161 299672 297948
57632 297948 296035 293720 291666 290150 288669 287004 285572 284415 282841 280527 278014 275736 273449 271068
57618 271068 269091 267681 266183 264098 261849 260123 259060 258433 257995 257404 256428 255411 254880 254625 253964 253001
57602 253001 252694 253508 254891 256246 257465 258354 258558 258347 258483 259029 259187 258543 257419 255835 253332 250231
$$ packed form
57694B98013L384L227K572J979J474M16r21j130J41J247J015O09J682L998O317
57679C24023Q483J1128J4206J7445K1398K6761L3221M0134M7677N6246O5668P6079
57667G42469Q8610J03438J17255J23545J15396Q8736M5202o688n4708q9599j09083
57656A164573j15689j12607j02728q9511p6057o3617n2424m3222l6512l1184k5689
57645D15333k0177j5988j3537j2026j0847r889q837p403n931m806l731k489j724
57632B97948j913k315k054j516j481j665j432j157j574k314k513k278k287k381
57618B71068j977j410j498k085k249j726j063o27m38n91r76j017n31k55o61r63
57602B53001l07Q14J383J355J219Q89K04k11J36N46J58o44j124j584k503l101
$$ plain form
57586 250231 247809 246632 245759 244273 242604 241653 241472 241449 241059 239918 237857 235446 233674 232668 231409 229070
57570 229070 225782 221853 217291 212649 209218 207679 207295 206981 206406 205648 204704 203854 203601 203725 203333 202339 201852
57553 201852 202543 203691 204487 205191 206268 207463 208592 210200 212485 214525 215571 216231 217360 218664 219552
57538 219552 220593 222876 226387 230115 233311 235660 236725 236329 235175 234141 233175 231718 229844 228194 227099
57523 227099 226587 226909 228282 230376 232775 235578 238885 242106 244538 246257 247673 248661 248963 249094 249961 251805
57507 251805 254229 257000 260018 262823 264968 266733 268751 271093 273360 275412 277303 278698 279051 278244 276468
57492 276468 273759 270251 266609 263506 260939 258686 257068 256471 256380 255838 254765 253983 253873 253773 252858 251024
57476 251024 248790 246811 245588 245225 245350 245477 245471 245529 245940 247031 248992 251424 253400 254344 254519 254453 254357 254428
$$ packed form
57586B50231k422j177q73j486j669r51j81k3l90j141k061k411j772j006j259k339
57570B29070l288l929m562m642l431j539l84l14n75p58r44q50k53J24l92r94m87
57553B01852O91J148P96P04J077J195J129J608K285K040J046O60J129J304Q88
57538B19552J041K283L511L728L196K349J065l96j154j034r66j457j874j650j095
57523B27099n12L22J373K094K399K803L307L221K432J719J416R88L02J31Q67J844
57507B51805K424K771L018K805K145J765K018K342K267K052J891J395L53q07j776
57492B76468k709l508l642l103k567k253j618n97r1n42j073p82j10j00r15j834
57476B51024k234j979j223l63J25J27oN8M11J091J961K432J976R44J75o6r6P1
$$ plain form
57458 254428 255002 255845 255974 254951 253790 253737 254670 255699 256864 259053 262276 265272 267100 268152 269307 270878
57442 270878 272852 275409 278574 281662 283645 284106 283628 283257 283669 284863 286613 289037 292413 296431 300110
57427 300110 302696 304334 305571 306588 307303 307883 308690 309825 311040 312012 312517 312514 312251 312057 311935 311676 311391
57410 311391 311443 311752 311784 311501 311650 312782 314622 316748 319171 321733 323696 324642 325228 326316 327905 329607
57394 329607 331628 334388 337555 340323 342435 344243 346038 347995 350445 353478 356544 359122 361536 364479
57380 364479 368079 372086 376546 381408 385865 389077 391361 393755 396506 398913 400624 402162 404082 406389
57366 406389 408847 411225 413257 415043 417426 421181 425834 430115 433614 437163 441451 446167 450801 455443
57352 455443 460276 464907 468812 472142 475619 479785 484587 489539 494079 497928 501270 504583 508315 512682
$$ packed form
57458B54428N74Q43J29j023j161n3R33J029J165K189L223K996J828J052J155J571
57442B70878J974K557L165L088J983M61m78l71M12J194J750K424L376M018L679
57427C00110K586J638J237J017P15N80Q07J135J215R72N05lk63j94j22k59k85
57410C11391N2L09L2k83J49J132J840K126K423K562J963R46N86J088J589J702
57394C29607K021K760L167K768K112J808J795J957K450L033L066K578K414K943
57380C64479L600M007M460M862M457L212K284K394K751K407J711J538J920K307
57366D06389K458K378K032J786K383L755M653M281L499L549M288M716M634M642
57352D55443M833M631L905L330L477M166M802M952M540L849L342L313L732M367
$$ plain form
57338 512682 517565 522424 526619 530072 533405 537208 541476 546015 550960 556365 561622 565902 569107 571931
57324 571931 575064 578687 582616 586585 590517 594794 600037 606342 613021 619375 625374 631302 637210 643087
57310 643087 649035 654838 659948 664473 669519 675788 682465 688334 693537 699264 706067 713538 721359 729675
57296 729675 738457 747437 756652 766256 775896 785062 793979 803309 813020 822391 831129 839698 848582 857921
57282 857921 867822 878239 888616 898427 908037 918196 928771 938885 948302 957765 967835 978253
57270 978253 988572 998619 1008236 1017427 1026929 1037768 1049976 1062483 1074542 1086545 1099205 1112687
57258 1112687 1126850 1141754 1157547 1174262 1191832 1209943 1227948 1245524 1263276 1282021 1301583
57247 1301583 1321155 1340746 1361266 1383062 1405370 1427449 1449232 1470476 1490273 1508081 1524541
$$ packed form
57338E12682M883M859M195L453L333L803M268M539M945N405N257M280L205K824
57324E71931L133L623L929L969L932M277N243O305O679O354N999N928N908N877
57310F43087N948N803N110M525N046O269O677N869N203N727O803P471P821Q316
57296G29675Q782Q980R215R604R640R166Q917R330R711R371Q738Q569Q884R339
57282H57921R901J0417J0377R811R610J0159J0575J0114R417R463J0070J0418
57270I78253J0319J0047R617R191R502J0839J2208J2507J2059J2003J2660J3482
57258A112687J4163J4904J5793J6715J7570J8111J8005J7576J7752J8745J9562
57247A301583J9572J9591K0520K1796K2308K2079K1783K1244J9797J7808J6460
$$ plain form
57236 1524541 1540664 1556798 1572960 1589600 1607309 1626030 1645138 1664227 1683477 1703290 1723777
57225 1723777 1744686 1765854 1787700 1810977 1835836 1861585 1887651 1914303 1941844 1969708 1997138
57214 1997138 2024300 2051690 2078794 2104464 2128513 2151781 2174731 2197185 2219488 2242552 2266350
57203 2266350 2289609 2311497 2332625 2353795 2374736 2394774 2413941 2432672 2450917 2468186 2484203
57192 2484203 2499212 2513975 2529576 2546704 2564979 2583429 2601533 2619189 2635948 2651348 2665979
57181 2665979 2681063 2696725 2711788 2725608 2739034 2753163 2768173 2783807 2799971 2816375 2832656
57170 2832656 2849455 2868340 2889934 2913012 2936062 2958882 2981907 3004967 3027603 3049877 3071955
57159 3071955 3093425 3113799 3133258 3152319 3171367 3191003 3212075 3234633 3257560 3280004 3302579
$$ packed form
57236A524541J6123J6134J6162J6640J7709J8721J9108J9089J9250J9813K0487
57225A723777K0909K1168K1846K3277K4859K5749K6066K6652K7541K7864K7430
57214A997138K7162K7390K7104K5670K4049K3268K2950K2454K2303K3064K3798
57203B266350K3259K1888K1128K1170K0941K0038J9167J8731J8245J7269J6017
57192B484203J5009J4763J5601J7128J8275J8450J8104J7656J6759J5400J4631
57181B665979J5084J5662J5063J3820J3426J4129J5010J5634J6164J6404J6281
57170B832656J6799J8885K1594K3078K3050K2820K3025K3060K2636K2274K2078
57159C071955K1470K0374J9459J9061J9048J9636K1072K2558K2927K2444K2575
$$ plain form
57148 3302579 3326452 3351787 3377807 3403783 3429260 3453884 3477757 3501407 3524719 3546504 3565900
57137 3565900 3583569 3600613 3616837 3631049 3642705 3652286 3660318 3666899 3672087 3676086 3679202 3682251 3686764
57124 3686764 3694192 3705164 3720076 3739992 3766198 3799175 3838871 3885780 3940914 4004724 4076788
57113 4076788 4156723 4244916 4342406 4450788 4572579 4711467 4872148 5060190 5282143 5545414
57103 5545414 5857865 6227792 6664836 7181329 7792874 8517489 9374265 10383070 11565099
57094 11565099 12942567 14537323 16370299 18462260 20833232 23499205 26468385 29738723
57086 29738723 33295014 37105321 41119304 45264584 49429619 53435094 57025047 59910878
57078 59910878 61856299 62745661 62590381 61485808 59565028 56975922 53872696 50406912
$$ packed form
57148C302579K3873K5335K6020K5976K5477K4624K3873K3650K3312K1785J9396
57137C565900J7669J7044J6224J4212J1656R581Q032O581N188L999L116L049M513
57124C686764P428J0972J4912J9916K6206L2977L9696M6909N5134O3810P2064
57113D076788P9935Q8193R7490J08382J21791J38888J60681J88042K21953K63271
57103E545414L12451L69927M37044N16493O11545P24615Q56776J008805J182029
57094A1565099J377468J594756J832976K091961K370972K665973K969180L270338
57086B9738723L556291L810307M013983M145280M165035M005475L589953K885831
57078E9910878J945421Q89362j55280j104573j920780k589106l103226l465784
$$ plain form
57070 50406912 46717655 42926087 39133850 35422956 31857942 28489726 25357215 22485797
57062 22485797 19886942 17561140 15500965 13691852 12112992 10740535 9551160 8523445
57054 8523445 7637608 6875172 6218756 5652019 5160380 4731802 4356319 4024902 3729527
57045 3729527 3464070 3224073 3005623 2805325 2621121 2451849 2295949 2151592 2018001
57036 2018001 1895448 1783841 1682490 1591372 1511417 1443332 1387157 1343148 1312137 1295044 1292999
57025 1292999 1307057 1335052 1367589 1389129 1385464 1350994 1289575 1210148 1122245 1033677 949679
57014 949679 873021 804885 745582 694660 651153 614154 582764 555579 531083 508849 489548
57003 489548 473477 459796 447523 436409 426352 416653 406460 395566 384415 373768 364499 357129
$$ packed form
57070E0406912l689257l791568l792237l710894l565014l368216l132511k871418
57062B2485797k598855k325802k060175j809113j578860j372457j189375j027715
57054H523445q85837p62436o56416n66737m91639m28578l75483l31417k95375
57045C729527k65457k39997k18450k00298j84204j69272j55900j44357j33591
57036B018001j22553j11607j01351r1118p9955o8085n6175m4009l1011j7093k045
57025A292999J4058K7995L2537K1540l665l4470o1419p9427q7903q8568q3998
57014I49679p6658o8136n9303n0922m3507l6999l1390k7185k4496k2234j9301
57003D89548j6071j3681j2273j1114j0057r699j0193j0894j1151j0647r269p370
$$ plain form
56991 357129 351265 346009 341103 337152 334676 333610 333895 335773 339231 343752 348685 353115 355214 352743
56977 352743 344691 331984 316381 299407 282410 266634 252679 240556 230576 223462 219305 217261
56965 217261 216668 217675 220419 224535 230023 237760 248524 262237 278643 297704 318328 337325 350753
56952 350753 356215 353420 343176 326874 306757 285614 265689 248000 232626 219412 208467 200221
56940 200221 195014 192696 192906 195748 201793 211355 224181 239981 258866 281113 306632 334288 361023
56927 361023 381847 391881 389143 375224 353378 326664 297740 269075 242446 218564 197605 179673
56915 179673 164588 151797 140830 131418 123074 115220 107892 101723 96987 93297 90337 88188 86767
56902 86767 85728 85072 85060 85342 85153 84683 85281 87814 91729 96259 101640 108540 117134 127477 140113 155695
$$ packed form
56991C57129n864n256m906l951k476j066K85J878L458M521M933M430K099k471
56977C52743q052j2707j5603j6974j6997j5776j3955j2123r980p114m157k044
56965B17261n93J007K744M116N488P737J0764J3713J6406J9061K0624J8997J3428
56952C50753N462k795j0244j6302k0117k1143j9925j7689j5374j3214j0945q246
56940B00221n207k318K10K842O045R562J2826J5800J8885K2247K5519K7656K6735
56927C61023K0824J0034k738j3919k1846k6714k8924k8665k6629k3882k0959j7932
56915A79673j5085j2791j0967r412q344p854p328o169m736l690k960k149j421
56902H6767j039o56j2K82j89m70N98K533L915M530N381O900Q594J0343J2636J5582
$$ plain form
56886 155695 174448 196247 220313 244286 264520 278156 284486 284124 277952 267586 255708 244669
56874 244669 235228 227445 222059 220045 221359 225215 231295 239913 251459 266527 286226 311453 342115
56861 342115 377746 418559 464934 515698 567049 612774 645573 659744 654230 633167 602852 568320
56849 568320 532881 499392 470289 446594 428178 415093 407934 407211 413306 426864 448343 477396
56837 477396 513589 557600 610869 674139 746801 826679 908626 983138 1038151 1064065 1057852 1023262
56825 1023262 968157 901490 831066 762367 698706 642167 594199 555515 526028 505085 491690
56814 491690 484864 484325 490821 505383 528323 559313 598245 645338 699846 758284 813584 856247
56802 856247 877692 873953 846851 801906 745551 683930 622592 565597 514801 470573 433075 402436
$$ packed form
56886A55695J8753K1799K4066K3973K0234J3636O330l62o172j0366j1878j1039
56874B44669r441p783n386k014J314L856O080Q618J1546J5068J9699K5227L0662
56861C42115L5631M0813M6375N0764N1351M5725L2799J4171n514k1063l0315l4532
56849E68320l5439l3489k9103k3695j8416j3085p159p23O095J3558K1479K9053
56837D77396L6193M4011N3269O3270P2662P9878Q1947P4512N5013K5914o213l4590
56825A023262n5105o6667p0424o8699o3661n6539m7968l8684k9487k0943j3395
56814D91690o826n39O496J4562K2940L0990L8932M7093N4508N8438N5300M2663
56802H56247K1445l739k7102m4945n6355o1621o1338n6995n0796m4228l7498l0639
$$ plain form
56790 402436 378291 360073 347633 341003 339815 343570 352142 365426 382949 404491 430405 459990
56778 459990 489605 513451 526508 526360 512932 487996 455214 419265 383846 350567 319725 291544
56766 291544 266449 244705 226175 210259 196150 183515 172859 164728 158643 153340 147998 142681
56754 142681 137634 132854 128450 124784 121917 119261 116056 112089 107933 104598 102787 102221 101832 100796 99127
56739 99127 97121 94761 92083 89606 87793 86463 85320 84664 84863 85494 85818 85905 86427 87545 88820 90201
56723 90201 92194 94887 97502 99130 99494 98978 98419 98849 100806 103746 106459 108161 108942 109396 110160 111494
56707 111494 112914 113519 113225 113212 114570 116878 118855 120031 120903 121794 122526 123070 123556 123704 123181 122510 122693
56690 122693 123798 124793 124880 124194 123165 122035 121168 120926 120961 120391 118990 117516 116620 116065 115325 114343 113369 112577
$$ packed form
56790D02436k4145j8218j2440o630j188L755Q572J3284J7523K1542K5914K9585
56778D59990K9615K3846J3057j48j3428k4936l2782l5949l5419l3279l0842k8181
56766B91544k5095k1744j8530j5916j4109j2635j0656q131o085n303n342n317
56754A42681n047m780m404l666k867k656l205l967m156l335j811n66l89j036j669
56739I9127k006k360k678k477j813j330j143o56J99O31L24Q7N22J118J275J381
56723I0201J993K693K615J628L64n16n59M30J957K940K713J702P81M54P64J334
56707A11494J420O05k94j3J358K308J977J176Q72Q91P32N44M86J48n23o71J83
56690A22693J105R95Q7o86j029j130q67k42L5n70j401j474q96n55p40r82r74p92
$$ plain form
56672 112577 112084 111907 111731 111132 110253 109784 110150 111086 112053 112737 113154 113665 114796 116544 117994 118205 117463 117108
56654 117108 118118 120388 123277 126234 128868 131062 133163 135616 138361 141005 143473 145978 148481 150776
56640 150776 153036 155680 158717 161641 163854 164769 163866 161299 158192 155664 153777 152006 150390 149399 148992
56625 148992 148673 148264 147800 147006 145770 144806 144825 145301 145165 144485 144261 144709 145000 144684 144123 143472 142495 141560 141566
56606 141566 142605 143763 144472 145009 145539 145828 146053 146695 147392 147201 146265 145923 146742 147759 148164 148426 149046 149405
56588 149405 148713 147212 145726 144748 144493 145049 145967 146536 146865 147815 149512 150941 151474 151702 152289 153040 153723
56571 153723 154721 156190 157538 158456 159556 161360 163567 165942 168984 173059 177850 183356 190430 199452 209384
56556 209384 218867 227467 235127 241423 246283 250543 254781 258322 260316 261182 262140 263876 266342 269134 271350
$$ packed form
56672A12577m93j77j76n99q79m69L66R36R67O84M17N11J131J748J450K11p42l55
56654A17108J010K270K889K957K634K194K101K453K745K644K468K505K503K295
56640A50776K260K644L037K924K213R15r03k567l107k528j887j771j616r91m07
56625A48992l19m09m64p94j236r64J9M76j36o80k24M48K91l16n61o51r77r35O
56606A41566J039J158P09N37N30K89K25O42O97j91r36l42Q19J017M05K62O20L59
56588A49405o92j501j486r78k55N56R18N69L29R50J697J429N33K28N87P51O83
56571A53723R98J469J348R18J100J804K207K375L042M075M791N506P074R022R932
56556B09384R483Q600P660O296M860M260M238L541J994Q66R58J736K466K792K216
$$ plain form
56541 271350 271803 270163 267301 264022 260319 256399 253225 251173 249213 246467 243527 241139 238609 234846
56527 234846 230135 225543 221302 217145 213538 211022 208784 205410 200900 196612 193346 190699 188235 186091
56513 186091 184370 182968 182026 181702 181515 180723 179313 177899 176790 175864 175156 174777 174435 173760 172945 172412 172077
56496 172077 171587 170985 170466 169786 168604 167144 165863 164824 163943 163430 163314 163108 162694 162923 164436 166420 167572
56479 167572 167794 167878 167942 167439 166503 166065 166575 167615 168812 170224 171749 173005 173889 174599 175089 175150 174994 175106
56461 175106 175584 176192 176893 177818 178887 180046 181582 183581 185371 186156 185938 185316 184762 184695 185708 187838 189980
56444 189980 190901 190569 189794 188965 187993 187107 186718 186709 186716 186950 187930 189563 191199 192433 193211 193497 193499 193826 194698 195479
56424 195479 195686 195849 196518 197153 197054 196750 197150 197927 198148 198142 199089 200869 201911 201418 200378 200018 200400 200941 201346
$$ packed form
56541B71350M53j640k862l279l703l920l174k052j960k746k940k388k530l763
56527B34846m711m592m241m157l607k516k238l374m510m288l266k647k464k144
56513A86091j721j402r42l24j87p92j410j414j109r26p08l79l42o75q15n33l35
56496A72077m90o02n19o80j182j460j281j039q81n13j16k06m14K29J513J984J152
56479A67572K22Q4O4n03r36m38N10J040J197J412J525J256Q84P10M90O1j56J12
56461A75106M78O08P01R25J069J159J536J999J790P85k18o22n54o7J013K130K142
56444A89980R21l32p75q29r72q86l89rPK34R80J633J636J234P78K86KL27Q72P81
56424A95479K07J63O69O35r9l04M00P77K21oR47J780J042m93j040l60L82N41M05
$$ plain form
56405 201346 201640 202012 202865 204382 206061 207341 208474 209977 211468 212134 212268 213147 215276 217795 219810 221315
56389 221315 222557 223495 224210 225111 226348 227595 228600 229445 230269 231268 232842 235097 237324 238702 239344 239978
56373 239978 240804 241528 242232 243271 244387 244945 245013 245307 246032 246648 246783 246508 245769 244435 242939 242048 241892 241969
56355 241969 241984 241944 241583 240636 239637 239573 240702 242433 244211 245773 246707 246687 246020 245266 244589 244253 245232 248237
56337 248237 252493 256584 260117 263413 266073 267422 268158 269905 273022 276290 278869 281114 283290 284954
56323 284954 286042 287238 288848 290409 291736 293288 295187 296943 298360 299717 300894 301433 301595 302136 302935
56308 302935 303127 302848 303444 305509 307986 309791 311189 313017 315545 318626 322090 325512 328432 331134 334392
56293 334392 338227 341799 344682 347263 349716 351679 353234 355204 358121 361734 365678 369783 373768 377637
$$ packed form
56405B01346K94L72Q53J517J679J280J133J503J491O66J34Q79K129K519K015J505
56389B21315J242R38P15R01J237J247J005Q45Q24R99J574K255K227J378O42O34
56373B39978Q26P24P04J039J116N58O8K94P25O16J35k75p39j334j496q91j56P7
56355B41969J5m0l61r47r99o4J129J731J778J562R34k0o67p54o77l36R79L005
56337B48237M256M091L533L296K660J349P36J747L117L268K579K245K176J664
56323B84954J088J196J610J561J327J552J899J756J417J357J177N39J62N41P99
56308C02935J92k79N96K065K477J805J398J828K528L081L464L422K920K702L258
56293C34392L835L572K883K581K453J963J555J970K917L613L944M105L985L869
$$ plain form
56279 377637 382323 388721 396104 402810 408562 414684 421934 429621 437146 444883 453095 461477 470314 480737
56265 480737 493155 506692 520691 535613 551996 569843 589544 612140 637985 666384 697110
56254 697110 731099 769117 811038 857088 908491 966055 1029200 1097086 1169652 1246851 1327866
56243 1327866 1411781 1498018 1585498 1672302 1756668 1837310 1912199 1978174 2032453 2073719 2101296
56232 2101296 2114416 2112917 2097770 2070365 2032061 1984678 1930311 1870265 1805134 1736124 1665149
56221 1665149 1593460 1521491 1450242 1381360 1315504 1252121 1191257 1134107 1081297 1032185 986349
56210 986349 944164 905375 868810 834222 802776 774934 749502 725617 704025 685367 668772
56199 668772 653258 639132 626884 616029 606083 597458 590384 584138 578214 573105 569122 565731 562761
$$ packed form
56279C77637M686O398P383O706N752O122P250P687P525P737Q212Q382Q837J0423
56265D80737J2418J3537J3999J4922J6383J7847J9701K2596K5845K8399L0726
56254F97110L3989L8018M1921M6050N1403N7564O3145O7886P2566P7199Q1015
56243A327866Q3915Q6237Q7480Q6804Q4366Q0642P4889O5975N4279M1266K7577
56232B101296J3120j499j5147k7405l8304m7383n4367o0046o5131o9010p0975
56221A665149p1689p1969p1249o8882o5856o3383o0864n7150n2810m9112m5836
56210I86349m2185l8789l6565l4588l1446k7842k5432k3885k1592j8658j6595
56199F68772j5514j4126j2248j0855r946q625p074o246n924n109l983l391k970
$$ plain form
56186 562761 560843 559883 558583 556362 554290 553273 552859 552683 553372 554951 556063 556014 556043 557339 559333 561211
56170 561211 563544 567029 571088 575089 579646 585314 591307 596864 602623 609356 616597 623844 631855 641482
56156 641482 652387 664042 676735 690539 704714 719249 735520 754252 774486 795811 819919
56145 819919 848496 881280 917826 959650 1008984 1066872 1134156 1212832 1304695 1409769 1527387
56134 1527387 1657005 1795936 1937630 2074157 2199610 2310220 2403542 2480130 2544850 2604072
56124 2604072 2661623 2717988 2771253 2816764 2847718 2859198 2851736 2829819 2798096 2760196 2718953
56113 2718953 2674666 2623455 2559451 2478655 2380222 2265901 2140218 2010066 1882040 1760531
56103 1760531 1648960 1550807 1467560 1397268 1337131 1286337 1244742 1210513 1181270 1156375 1136146
$$ packed form
56186E62761j918r60j300k221k072j017m14j76O89J579J112m9K9J296J994J878
56170E61211K333L485M059M001M557N668N993N557N759O733P241P247Q011R627
56156F41482J0905J1655J2693J3804J4175J4535J6271J8732K0234K1325K4108
56145H19919K8577L2784L6546M1824M9334N7888O7284P8676R1863J05074J17618
56134A527387J29618J38931J41694J36527J25453J10610R3322P6588O4720N9222
56124B604072N7551N6365N3265M5511L0954J1480p462k1917l1723l7900m1243
56113B718953m4287n1211o4004q0796r8433j14321j25683j30152j28026j21509
56103A760531j11571r8153q3247p0292o0137n0794m1595l4229k9243k4895k0229
$$ plain form
56092 1136146 1119942 1106752 1096451 1088877 1083003 1078534 1076666 1077742 1079970 1082104 1085304 1090523 1096255
56079 1096255 1101100 1106412 1113950 1122949 1132004 1141896 1153947 1167355 1180829 1195126 1211445 1229073
56067 1229073 1247103 1266603 1288554 1311581 1334253 1357490 1381996 1405604 1426184 1444950 1463750
56056 1463750 1481352 1495781 1508233 1521122 1534254 1546460 1559045 1573962 1590361 1606644 1624101
56045 1624101 1644831 1667869 1691100 1715240 1742096 1770664 1798869 1827419 1858069 1889816 1920739
56034 1920739 1951749 1984558 2017867 2049631 2081210 2115178 2151116 2187727 2226761 2270255 2316166
56023 2316166 2361491 2407476 2456917 2508786 2560827 2615095 2675240 2740321 2806958 2875650 2949239
56012 2949239 3027031 3106378 3188213 3275180 3366149 3458546 3554079 3656178 3764092 3875818 3994301
$$ packed form
56092A136146j6204j3190j0301p574n874m469j868J076K228K134L200N219N732
56079A096255M845N312P538Q999R055R892J2051J3408J3474J4297J6319J7628
56067A229073J8030J9500K1951K3027K2672K3237K4506K3608K0580J8766J8800
56056A463750J7602J4429J2452J2889J3132J2206J2585J4917J6399J6283J7457
56045A624101K0730K3038K3231K4140K6856K8568K8205K8550L0650L1747L0923
56034A920739L1010L2809L3309L1764L1579L3968L5938L6611L9034M3494M5911
56023B316166M5325M5985M9441N1869N2041N4268O0145O5081O6637O8692P3589
56012B949239P7792P9347Q1835Q6967R0969R2397R5533J02099J07914J11726J18483
$$ plain form
56001 3994301 4123858 4262882 4407185 4558055 4719545 4890393 5066568 5249374 5442746
55992 5442746 5645001 5852073 6066753 6295778 6540044 6796998 7070258 7366848 7687135
55983 7687135 8027837 8392890 8790618 9222436 9685640 10185269 10731498 11327797 11974272
55974 11974272 12680274 13460525 14321600 15266776 16311788 17480717 18789671 20251976 21897712
55965 21897712 23771322 25914367 28372005 31215318 34537768 38435043 43014139 48420318
55957 48420318 54830602 62428347 71418597 82066350 94686219 109602491 127161297
55950 127161297 147768350 171853998 199796515 231870625 268006965 307044582 345783115
55943 345783115 378911973 400562068 406754920 397019168 374134857 342546362 306731253
$$ packed form
56001C994301J29557J39024J44303J50870J61490J70848J76175J82806J93372
55992E442746K02255K07072K14680K29025K44266K56954K73260K96590L20287
55983G687135L40702L65053L97728M31818M63204M99629N46229N96299O46475
55974A1974272P06002P80251Q61075R45176J045012J168929J308954J462305J645736
55965B1897712J873610K143045K457638K843313L322450L897275M579096N406179
55957D8420318O410284P597745Q990250J0647753J2619869J4916272J7558806
55950A27161297K0607053K4085648K7942517L2074110L6136340L9037617L8738533
55943C45783115L3128858K1650095O192852r735752k2884311l1588495l5815109
$$ plain form
55936 306731253 270275051 235597039 204032722 176102742 151837567 131015441 113281705
55929 113281705 98227859 85465464 74655244 65490923 57694696 51037637 45341437
55922 45341437 40453630 36237624 32585773 29419038 26666827 24260708 22147661 20291346
55914 20291346 18656165 17203446 15904430 14742384 13699259 12752934 11889278 11104026
55906 11104026 10390161 9734689 9129677 8575077 8068165 7600461 7167169 6769702 6406480
55897 6406480 6070373 5757364 5469076 5204668 4958460 4727462 4513453 4315909 4130464
55888 4130464 3955949 3795576 3649545 3513615 3386420 3271066 3167716 3071232 2977767 2887319
55878 2887319 2798473 2707352 2613665 2521840 2434417 2349845 2267864 2190978 2119055 2048375 1977790
$$ packed form
55936C06731253l6456202l4678012l1564317k7929980k4265175k0822126j7733736
55929A13281705j5053846j2762395j0810220r164321p796227o657059n696200
55922D5341437m887807m216006l651851l166735k752211k406119k113047j856315
55914B0291346j635181j452719j299016j162046j043125r46325q63656p85252
55906A1104026p13865o55472o05012n54600n06912m67704m33292l97467l63222
55897F406480l36107l13009k88288k64408k46208k30998k14009j97544j85445
55888D130464j74515j60373j46031j35930j27195j15354j03350r6484r3465r0448
55878B887319q8846r1121r3687r1825q7423q4572q1981p6886p1923p0680p0585
$$ plain form
55867 1977790 1910445 1847881 1787847 1729393 1674697 1624201 1575140 1526674 1481464 1440517 1401376
55856 1401376 1363096 1328110 1297409 1268659 1240932 1216578 1196355 1177113 1156384 1135163 1114211
55845 1114211 1091821 1067410 1043344 1020995 998485 974398 950316 927781 906124 885134 866559
55834 866559 850984 836252 820842 805974 792772 780252 767701 756238 746444 737156 727975 720204
55822 720204 713921 706898 697804 687841 677991 667381 655688 644444 634587 625222 616008 608211 602258
55809 602258 596848 591587 587843 585934 584278 582565 582911 586476 591569 596511 601741 607593 612593 615563
55795 615563 617074 617325 614888 609049 601188 592388 581840 569063 555661 543533 533288 525536 521432
55782 521432 520402 519251 515052 507438 497391 485892 474741 466278 460918 456809 453012 451045 452346
$$ packed form
55867A977790o7345o2564o0034n8454n4696n0496m9061m8466m5210m0947l9141
55856A401376l8280l4986l0701k8750k7727k4354k0223j9242k0729k1221k0952
55845A114211k2390k4411k4066k2349k2510k4087k4082k2535k1657k0990j8575
55834H66559j5575j4732j5410j4868j3202j2520j2551j1463r794r288r181p771
55822G20204o283p023r094r963r850j0610j1693j1244r857r365r214p797n953
55809F02258n410n261l744j909j656j713L46L565N093M942N230N852N000K970
55795F15563J511K51k437n839p861q800j0548j2777j3402j2128j0245p752m104
55782E21432j030j151m199p614j0047j1499j1151q463n360m109l797j967J301
$$ plain form
55769 452346 456379 462169 469288 476154 479824 479045 475482 470665 463963 454880 444957 435691 426648 417233
55755 417233 408352 400687 393333 385686 378706 372701 365997 357612 349233 342564 336570 329421 321489 314257
55741 314257 307769 301355 295674 291813 289253 286670 283977 281871 280138 278069 275886 274250 272986 271549
55727 271549 270048 268668 266818 263907 260247 256257 251737 246783 242363 239038 236232 233633 232040 231828
55713 231828 231896 231380 231157 232427 234894 237652 240740 244516 248363 251330 253315 254585 254925 254173 252705 250538
55697 250538 246916 241674 236002 230976 226403 221929 218092 215337 213129 211022 209532 209035 208904 208610 208586
55682 208586 209254 210439 212452 216236 221525 226427 229895 233033 236767 239898 240906 240225 239219 238215 237068
55667 237068 236347 236295 235770 233862 231576 230479 230705 231731 233833 237126 240362 242486 244459 247722 251753
$$ packed form
55769D52346M033N790P119O866L670p79l563m817o702r083r923r266r043r415
55755D17233q881p665p354p647o980o005o704q385q379o669n994p149p932p232
55741C14257o488o414n681l861k560k583k693k106j733k069k183j636j264j437
55727B71549j501j380j850k911l660l990m520m954m420l325k806k599j593k12
55713B31828O8n16k23J270K467K758L088L776L847K967J985J270L40p52j468k167
55697B50538l622n242n672n026m573m474l837k755k208k107j490m97j31k94k4
55682B08586O68J185K013L784N289M902L468L138L734L131J008o81j006j004j147
55667B37068p21n2n25j908k286j097K26J026K102L293L236K124J973L263M031
$$ plain form
55652 251753 254984 257289 259618 261750 262344 260882 257804 253077 246346 238286 230223 222512 214643 206797
55638 206797 199902 194285 189456 185076 181124 177366 173709 170742 168904 167541 165712 163455 161224 158729
55624 158729 155558 152398 150366 149499 149061 148894 149259 149789 149829 149540 149535 149672 149271 148197 146721 144727 142091
55607 142091 139460 137605 136338 134973 133368 131573 129128 125842 122747 121018 120458 120208 120374 121506 122901
55592 122901 122951 121159 118604 116458 115155 114828 115339 115917 115836 115498 115933 117310 118872 120193 121582 123317
55576 123317 125369 127864 131086 135060 139665 144903 150545 155959 160904 165973 171547 176888 180988 183717
55562 183717 185354 185713 184636 182687 180395 177444 173622 169770 166720 163959 160562 156757 153296 149977
55548 149977 146200 142469 139876 138467 137448 136624 136293 136129 135639 135363 136161 137610 138593 139196 140402 142047
$$ packed form
55652B51753L231K305K329K132N94j462l078m727o731q060q063p711p869p846
55638B06797o895n617m829m380l952l758l657k967j838j363j829k257k231k495
55624A58729l171l160k032q67m38j67L65N30M0k89nJ37m01j074j476j994k636
55607A42091k631j855j267j365j605j795k445l286l095j729n60k50J66J132J395
55592A22901N0j792k555k146j303l27N11N78q1l38M35J377J562J321J389J735
55576A23317K052K495L222L974M605N238N642N414M945N069N574N341M100K729
55562A83717J637L59j077j949k292k951l822l852l050k761l397l805l461l319
55548A49977l777l731k593j409j019q24l31j64m90k76P98J449R83O03J206J645
$$ plain form
55532 142047 142766 142096 141089 140621 140517 140560 140970 141506 141302 139971 137844 134971 131030 126508 122827 120826
55516 120826 120000 119445 118758 117800 116466 114952 113548 112055 110107 108021 106515 105606 104609 103176 101539 99843
55500 99843 98103 96730 96187 96226 96239 96160 96134 95682 94308 92659 91877 92013 92273 92616 93638 94957 95296 94488
55482 94488 93939 94666 96090 97189 97691 97613 96691 94940 93035 91679 91098 91254 91808 91880 90817 89307 88788
55465 88788 89608 90733 91359 91748 92247 92606 92660 92736 92968 93059 92976 93091 93391 93448 93342 93689 94532 95205 95570 96349
55445 96349 97828 99230 99838 99835 99578 98934 97914 97143 97136 97670 98351 99152 100015 100494 100224 99291 97908 96261 94815
55426 94815 94166 94462 95511 97403 100231 103302 105627 107366 109766 113441 117734 122114 127082 133108 139559
55411 139559 145303 149708 152537 153544 152667 150190 146406 141605 136434 131540 126762 121577 116457 112761
$$ packed form
55532A42047P19o70j007m68j04M3M10N36k04j331k127k873l941m522l681k001
55516A20826q26n55o87r58j334j514j404j493j948k086j506r09r97j433j637j696
55500I9843j740j373n43L9J3p9k6m52j374j649p82J36K60L43J022J319L39q08
55482I4488n49P27J424J099N02p8r22j751j905j356n81J56N54P2j063j510n19
55465H8788Q20J125O26L89M99L59N4P6K32R1q3J15L00N7j06L47Q43O73L65P79
55445I6349J479J402O08lk57o44j020p71pN34O81Q01Q63M79k70r33j383j647j446
55426I4815o49K96J049J892K828L071K325J739K400L675M293M380M968O026O451
55411A39559N744M405K829J007q77k477l784m801n171m894m778n185n120l696
$$ plain form
55397 112761 110972 110064 109025 107908 106840 105139 102388 99491 97694 97012 96472 95545 94636 94396 95090 96501
55381 96501 98071 99359 100437 101507 102160 101728 100473 99581 99653 100034 100002 99782 99798 99721 98973 97611 96035 94265
55363 94265 92152 89992 88394 87732 88018 88921 89649 89356 88036 86583 85641 84918 84023 83424 83922 85497 87180
55346 87180 88007 87784 87072 86567 86368 85890 84731 83398 82662 82414 81905 81083 80798 81491 82528 83114 83153 82982
55328 82982 82983 83662 85264 87015 87582 86705 85609 85390 85829 86253 86699 87533 88581 89356 89695 89626 89042 87989
55310 87989 86903 86125 85588 85206 85086 85113 84942 84656 84747 85209 85421 85210 85173 85550 85707 85305 85064 85637 86560 87122
55290 87122 87555 88472 89685 90497 90729 90659 90320 89707 89351 89917 91365 93085 94703 96182 97431 98358 99123
55273 99123 99847 100258 100044 99342 98506 97664 96874 96357 96215 96203 96146 96259 96731 97328 97696 97752 97558 97244 97158 97605
$$ packed form
55397A12761j789r08j039j117j068j701k751k897j797o82n40r27r09k40O94J411
55381I6501J570J288J078J070O53m32j255q92P2L81l2k20J6p7p48j362j576j770
55363I4265k113k160j598o62K86R03P28k93j320j453r42p23q95n99M98J575J683
55346H7180Q27k23p12n05j99m78j159j333p36k48n09q22k85O93J037N86L9j71
55328H2982JO79J602J751N67q77j096k19M39M24M46Q34J048P75L39o9n84j053
55310H7989j086p78n37l82j20K7j71k86R1M62K12k11l7L77J57m02k41N73R23N62
55290H7122M33R17J213Q12K32p0l39o13l56N66J448J720J618J479J249R27P65
55273I9123P24M11k14p02q36q42p90n17j42j2n7J13M72N97L68N6j94l14q6M47
$$ plain form
55253 97605 98186 98023 96907 95638 94937 94675 94516 94594 95102 95858 96706 97734 98738 99140 98865 98519 98278 97450
55235 97450 95722 93974 93164 93127 93199 93265 93515 93833 94194 94960 96030 96480 95862 95124 95377 96417 97384 98095 98696
55216 98696 98729 97813 96684 96320 96464 96203 95597 95469 95907 96276 96562 97326 98397 98883 98580 98176 97927 97315 96235
55197 96235 95446 95481 95976 96408 96696 96827 96694 96576 97045 98105 99033 99259 98812 97862 96588 95644 95862 97144
55179 97144 98331 98566 98174 97860 97665 97239 96702 96608 97210 98119 98697 98676 98439 98679 99628 100763 101485 101879 102396
55160 102396 103043 103379 103295 103194 103389 103819 104474 105540 106913 107972 108135 107470 106540 105767 105036 103918 102291
55143 102291 100689 99815 99682 99656 99441 99507 100181 100885 100874 100331 100054 100276 100460 100174 99523 98737 97881 96982 96054
55124 96054 95014 93899 93026 92617 92547 92821 93812 95456 96596 96074 94359 93205 93601 94825 95690 95966 96168
$$ packed form
55253I7605N81j63j116j269p01k62j59P8N08P56Q48J028J004M02k75l46k41q28
55235I7450j728j748q10l7P2O6K50L18L61P66J070M50o18p38K53J040R67P11O01
55216I8696L3r16j129l64J44k61o06j28M38L69K86P64J071M86l03m04k49o12j080
55197I6235p89L5M95M32K88J31j33j18M69J060R28K26m47r50j274r44K18J282
55179I7144J187K35l92l14j95m26n37r4O02R09N78k1k37K40R49J135P22L94N17
55160A02396O47L36q4j01J95M30O55J066J373J059J63o65r30p73p31j118j627
55143A02291j602q74j33k6k15O6O74P04j1n43k77K22J84k86o51p86q56q99r28
55124I6054j040j115q73m09p0K74R91J644J140n22j715j154L96J224Q65K76K02
$$ plain form
55107 96168 96558 96899 97045 97278 98009 99224 100388 100987 101106 101243 101602 102036 102618 103651 104875 105468 105277 105348
55089 105348 106610 108678 110641 112339 113974 115112 115187 114608 114187 113746 112469 110500 108948 108249 107742 107079
55073 107079 106871 107466 108112 107941 107008 105883 104882 104186 104082 104537 104998 105135 105390 106347 107861 109199 109834
55056 109834 109795 109429 109061 108799 108577 108480 108816 109615 110311 110406 110242 110503 111049 111022 110182 109396 109536 110511 111639 112400
55036 112400 112513 111826 110572 109415 108893 108971 109279 109484 109353 108840 108280 108170 108638 109350 109999 110512 110765 110502
55018 110502 109691 108627 107620 106862 106560 106746 106947 106579 105791 105441 105977 106772 106896 106270 105807 106519 108616 111325
55000 111325 113555 114801 115379 115739 115872 115626 115252 115125 115141 114929 114551 114439 114695 115016 115305 115838 116693 117483
54982 117483 117762 117437 116808 116432 116805 117863 118997 119889 120933 122388 123591 123777 123316 123274 123926 124594 124891
$$ packed form
55107I6168L90L41J46K33P31J215J164N99J19J37L59M34N82J033J224N93j91P1
55089A05348J262K068J963J698J635J138P5n79m21m41j277j969j552o99n07o63
55073A07079k08N95O46j71r33j125j001o96j04M55M61J37K55R57J514J338O35
55056A09834l9l66l68k62k22r7L36P99O96R5j64K61N46k7q40p86J40R75J128P61
55036A12400J13o87j254j157n22P8L08K05j31n13n60j10M68P12O49N13K53k63
55018A10502q11j064j007p58l02J86K01l68p88l50N36P95J24o26m63P12K097K709
55000A11325K230J246N78L60J33k46l74j27J6k12l78j12K56L21K89N33Q55P90
54982A17483K79l25o29l76L73J058J134Q92J044J455J203J86m61m2O52O68K97
$$ plain form
54965 124891 125211 125946 127022 128282 129596 130574 130936 131199 132137 133566 134523 134729 134843 135166 135141 134518 133969 134087
54947 134087 134577 134932 135119 135156 134853 134509 135013 136615 138278 138908 138660 138443 138702 139342 140354 141840 143758
54930 143758 146144 149247 153027 156993 161074 166198 173414 182702 193138 203921 214788 225698 236596
54917 236596 247234 256844 264159 268140 268512 265462 259233 250375 239993 229267 218834 208789 199067
54904 199067 189659 180846 173335 167723 163700 160237 156789 153763 151631 150224 149265 148929 149400 150382 151509
54889 151509 152813 154347 155845 157228 159022 161825 165740 170702 176865 184223 192353 201042 210622 221166
54875 221166 231808 241468 249803 256742 261540 263077 260975 255751 248056 238423 227638 216670 206076
54862 206076 195932 186339 177657 170176 163916 158738 154450 150843 147827 145493 143938 143107 142798 142518 141442
$$ packed form
54965A24891L20P35J076J260J314R78L62K63R38J429R57K06J14L23k5o23n49J18
54947A34087M90L55J87L7l03l44N04J602J663O30k48k17K59O40J012J486J918
54930A43758K386L103L780L966M081N124P216R288J0436J0783J0867J0910J0898
54917B36596J0638R610P315L981L72l050o229q858j0382j0726j0433j0045r722
54904A99067r408q813p511n612m023l463l448l026k132j407r59l36M71R82J127
54889A51509J304J534J498J383J794K803L915M962O163P358Q130Q689R580J0544
54875B21166J0642R660Q335O939M798J537k102n224p695r633j0785j0968j0594
54862B06076j0144r593q682p481o260n178m288l607l016k334j555q31l09k80j076
$$ plain form
54847 141442 139029 135775 132745 130262 127727 124975 122932 122333 122537 122415 121896 121773 122307 122868 122886 122461 121993
54830 121993 121754 121818 121991 121855 121218 120408 119880 119753 119966 120556 121363 121855 121716 121351 121404 122006 122845 123665 124290
54811 124290 124527 124546 124973 126036 127016 127167 126821 126895 127561 128188 128424 128533 128664 128556 128141 127811 127897 128290 128732
54792 128732 129098 129362 129637 130306 131705 133615 135367 136540 137357 138382 140018 142268 144768 147092 149117
54777 149117 151040 153062 155326 158190 162086 166948 172289 178121 185268 194345 205015 216703 229411
54764 229411 243053 256421 267725 276081 281758 285049 285583 282791 276545 267374 256482 245401 235069
54751 235069 225278 215420 205632 196760 189409 183562 178944 175157 171576 167764 163993 160901 158676 157025
54737 157025 155800 155164 155226 156013 157654 160118 162921 165663 168680 172630 177616 183326 189862 197759 207197
$$ packed form
54847A41442k413l254l030k483k535k752k043n99K04j22n19j23N34N61J8m25m68
54830A21993k39O4J73j36o37q10n28j27K13N90Q07M92j39l65N3O02Q39Q20O25
54811A24290K37J9M27J063R80J51l46P4O66O27K36J09J31j08m15l30Q6L93M42
54792A28732L66K64K75O69J399J910J752J173Q17J025J636K250K500K324K025
54777A49117J923K022K264K864L896M862N341N832P147R077J0670J1688J2708
54764B29411J3642J3368J1304Q356N677L291N34k792o246r171j0892j1081j0332
54751B35069r791r858r788q872p351n847m618l787l581l812l771l092k225j651
54737A57025j225o36O2P87J641K464K803K742L017L950M986N710O536P897R438
$$ plain form
54722 207197 217811 229159 240670 251216 259507 264958 267578 267062 262828 255039 244842 233400 221382
54709 221382 209532 198926 190260 183359 177651 172608 167665 162406 157187 152995 150341 148763 147681 147097
54695 147097 147002 146666 145265 142977 140883 139737 139249 138649 137700 136968 137108 138004 138842 139066 138938 138881 138648 137706
54677 137706 136228 135040 134551 134382 134186 134230 134878 135960 136956 137469 137303 136411 135063 133804 132973 132416 131839
54660 131839 131303 131201 131779 132805 133683 133985 133829 133578 133153 132044 130173 128320 127302 127107 127274 127690 128454
54643 128454 129353 130183 131280 132972 134687 135450 135118 134307 133256 131790 130315 129765 130247 130784 130742 130594 130863
54626 130863 131212 131201 131145 131499 131939 131748 130757 129459 128555 128726 130321 132757 134699 135277 134786 133912 132869 131736
54608 131736 130966 130816 130745 130074 128969 128206 128211 128861 129922 131081 131828 131882 131545 131169 130550 129397 128054 127157
$$ packed form
54722B07197J0614J1348J1511J0546Q291N451K620n16m234p789j0197j1442j2018
54709B21382j1850j0606q666o901n708n043m943n259n219m192k654j578j082n84
54695A47097r5l36j401k288k094j146m88o00r49p32J40Q96Q38K24j28n7k33r42
54677A37706j478j188m89j69j96M4O48J082R96N13j66q92j348j259q31n57n77
54660A31839n36j02N78J026Q78L02j56k51m25j109j871j853j018j95J67M16P64
54643A28454Q99Q30J097J692J715P63l32q11j051j466j475n50M82N37m2j48K69
54626A30863L49j1n6L54M40j91r91j298r04J71J595K436J942N78m91q74j043j133
54608A31736p70j50p1o71j105p63NO50J061J159P47N4l37l76o19j153j343q97
$$ plain form
54590 127157 126794 126661 126790 127407 128243 128795 129227 130181 131637 132716 132837 132350 131767 131115 130423 130167 130619 131203
54572 131203 131203 130843 131009 131989 133054 133420 133147 132892 133103 133686 134284 134641 134732 134689 134616 134465 134212 134098 134536 135656
54552 135656 137084 138279 138913 138812 137837 136185 134609 133872 133980 134381 134835 135585 136587 137300 137591 138222 139839
54535 139839 141871 143142 143374 143442 144217 145690 147259 148320 148549 148053 147376 147028 146986 146931 146857 147044 147509 147939
54517 147939 148127 148022 147403 146074 144396 143111 142569 142593 143054 143943 144779 144717 143610 142406 142072 142532 143004 143007
54499 143007 142662 142318 142196 142224 142037 141390 140656 140543 141229 142197 143065 144024 145199 146170 146604 146890 147606 148646
54481 148646 149349 149290 148537 147318 145889 144636 143937 143935 144598 145861 147452 148835 149602 149867 150076 150555 151366 152398
54463 152398 153435 154299 155003 155585 155772 155204 154062 153045 152556 152379 152304 152488 152877 152894 152235 151471 151255 151318 150945
$$ packed form
54590A27157l63j33J29O17Q36N52M32R54J456J079J21m87n83o52o92k56M52N84
54572A31203%l60J66R80J065L66k73k55K11N83N98L57R1m3p3j51k53j14M38J120
54552A35656J428J195O34j01r75j652j576p37J08M01M54P50J002P13K91O31J617
54535A39839K032J271K32O8P75J473J569J061K29m96o77l48m2n5p4J87M65M30
54517A47939J88j05o19j329j678j285n42K4M61Q89Q36o2j107j204l34M60M72L
54499A43007l45l44j22K8j87o47p34j13O86R68Q68R59J175R71M34K86P16J040
54481A48646P03n9p53j219j429j253o99kO63J263J591J383P67K65K09M79Q11J032
54463A52398J037Q64P04N82J87n68j142j017m89j77p5J84L89J7o59p64k16O3l73
$$ plain form
54444 150945 150142 149582 149505 149449 149102 148729 148531 148200 147427 146520 146187 146880 148435 150210 151476 151911 151865 152034 152833
54425 152833 154130 155504 156559 157020 156881 156573 156761 157691 158774 159033 158078 156543 155453 155181 155184 154827 154193
54408 154193 153935 154467 155525 156403 156466 155649 154761 155070 157123 160082 162649 164474 166072 167562 168329 168059 167261
54391 167261 166443 165553 164662 164420 165123 165903 165600 164126 162293 160643 159167 157967 157371 157343 157519 157912 159011
54374 159011 160942 162995 164293 164668 164643 164684 164689 164256 163325 162465 162336 162955 163756 164362 164905 165459 165605 164941 163691
54355 163691 162438 161458 160733 160407 160728 161561 162307 162411 161757 160594 159296 158183 157446 157200 157522 158320 159217
54338 159217 159849 160199 160364 160097 159131 157887 157156 156911 156253 154855 153667 153650 154564 155658 156796 158030 158678
54321 158678 158035 156722 156204 156967 158153 159069 160029 161463 163046 164143 164564 164527 164370 164637 165958 168464 171514
$$ packed form
54444A50945q03n60p7n6l47l73j98l31p73r07l33O93J555J775J266M35m6J69P99
54425A52833J297J374J055M61j39l08J88R30J083K59r55j535j090k72Ll57o34
54408A54193k58N32J058Q78O3q17q88L09K053K959K567J825J598J490P67k70p98
54391A67261q18q90q91k42P03P80l03j474j833j650j476j200n96k8J76L93J099
54374A59011J931K053J298L75k5M1Nm33r31q60j29O19Q01O06N43N54J46o64j250
54355A63691j253r80p25l26L21Q33P46J04o54j163j298j113p37k46L22P98Q97
54338A59217O32L50J65k67r66j244p31k45o58j398j188j7R14J094J138J234O48
54321A58678o43j313n18P63J186R16R60J434J583J097M21l7j57K67J321K506L050
$$ plain form
54304 171514 174189 175903 176558 176499 176424 176932 178036 179292 180439 181536 182532 183125 183128 182560 181406 179732 178046
54287 178046 177003 176544 175832 174270 172187 170288 168816 167544 166276 165033 163959 163262 163088 163273 163395 163228
54271 163228 162972 162984 163426 164235 165138 165675 165503 164850 164363 164406 164822 165545 167003 169490 172382 174502 175283 175189
54253 175189 174925 174608 173962 173050 172349 172030 171559 170304 168383 166589 165546 165238 165316 165442 165271 164578 163595 162846
54235 162846 162421 161773 160490 158861 157407 156331 155816 156306 157824 159407 159984 159702 159667 160382 161134 161015 159971
54218 159971 158637 157605 157049 156792 156603 156537 156883 157613 158167 158143 157839 157637 157230 156212 155103 154843 155324 155410
54200 155410 154558 153508 153070 153202 153681 154796 156671 158570 159669 160134 160719 161588 162196 162201 161870 161571 161327 160954
54182 160954 160325 159437 158451 157669 157360 157554 157991 158275 158165 157900 158065 158847 159565 159388 158403 157412 156748 156051 155356
$$ packed form
54304A71514K675J714O55n9p5N08J104J256J147J097R96N93Ln68j154j674j686
54287A78046j043m59p12j562k083j899j472j272j268j243j074o97j74J85J22j67
54271A63228k56J2M42Q09R03N37j72o53m87M3M16P23J458K487K892K120P81r4
54253A75189k64l17o46r12p01l19m71j255j921j794j043l08P8J26j71o93r83p49
54235A62846m25o48j283j629j454j076n15M90J518J583N77k82l5P15P52j19j044
54218A59971j334j032n56k57j89o6L46P30N54k4l04k02m07j018j109k60M81Q6
54200A55410q52j050m38J32M79J115J875J899J099M65N85Q69O08Nl31k99k44l73
54182A60954o29q88r86p82l09J94M37K84j10k65J65P82P18j77r85r91o64o97o95
$$ plain form
54163 155356 155494 156888 158641 159550 159528 159338 159266 158903 158159 157709 158251 159748 161531 162793 162972 162092 160880
54146 160880 160276 160716 161943 163395 164467 164549 163333 161266 159336 158219 157816 157748 157998 158742 159776 160491 160513
54129 160513 160176 160174 160847 161935 162954 163656 164114 164548 165221 166357 167964 169760 171389 172720 173800 174638 175192
54112 175192 175505 175603 175325 174488 173263 172149 171442 170919 170140 168994 167877 167302 167344 167447 166926 165689 164340
54095 164340 163458 163039 162751 162481 162371 162583 163318 164723 166398 167397 167253 166733 166899 167668 168120 168086 168430 169635
54077 169635 171130 172366 173610 175049 175946 175529 174225 173211 172999 173171 173298 173377 173433 173316 173061 173028 173564 174702
54059 174702 176140 177286 177553 176966 176378 176755 178283 180360 182289 183688 184454 184818 185369 186599 188338 189931
54043 189931 190960 191605 192377 193755 196000 199043 202532 206220 210200 214570 219067 223415 227876 232959 238529
$$ packed form
54163A55356J38J394J753R09k2j90p2l63p44m50N42J497J783J262J79q80j212
54146A60880o04M40J227J452J072Q2j216k067j930j117m03o8K50P44J034P15K2
54129A60513l37kO73J088J019P02M58M34O73J136J607J796J629J331J080Q38N54
54112A75192L13R8k78q37j225j114p07n23p79j146j117n75M2J03n21j237j349
54095A64340q82m19k88k70j10K12P35J405J675R99j44n20J66P69M52l4L44J205
54077A69635J495J236J244J439Q97m17j304j014k12J72J27P9N6j17k55l3N36J138
54059A74702J438J146K67n87n88L77J528K077J929J399P66L64N51J230J739J593
54043A89931J029O45P72J378K245L043L489L688L980M370M497M348M461N083N570
$$ plain form
54028 238529 243694 247738 250791 253366 255610 257369 258808 260491 262745 265136 266802 267307 267016 266553 266019
54013 266019 264923 262862 259998 256731 253186 249233 244856 240224 235478 230729 226271 222558 219907 218309
53999 218309 217465 216838 215825 214208 212424 211120 210378 209713 208867 208221 208164 208429 208497 208457 208935 210141 211531 212637
53981 212637 213792 215592 217942 220137 221810 223255 224802 226435 228325 231185 235626 241353 247522 253865
53967 253865 261074 270076 281282 294613 309827 326286 342276 354882 361180 360156 353443 343829 332923
53954 332923 320623 306772 292554 279797 269407 261072 254169 248438 244064 241627 241682 243816 246478
53941 246478 248414 250059 252727 256714 261153 265636 270824 277191 284201 291254 298589 306561 314561 321342
53927 321342 326167 329236 331278 332989 334568 335516 335184 333663 331818 330345 329289 328617 328671 329787 331922
$$ packed form
54028B38529N165M044L053K575K244J759J439J683K254K391J666N05k91m63n34
54013B66019j096k061k864l267l545l953m377m632m746m749m458l713k651j598
53999B18309q44o27j013j617j784j304p42o65q46o46n7K65O8m0M78J206J390J106
53981B12637J155J800K350K195J673J445J547J633J890K860M441N727O169O343
53967B53865P209R002J1206J3331J5214J6459J5990J2606O298j024o713r614j0906
53954C32923j2300j3851j4218j2757j0390q335o903n731m374k437N5K134K662
53941B46478J936J645K668L987M439M483N188O367P010P053P335P972Q000O781
53927C21342M825L069K042J711J579R48l32j521j845j473j056o72N4J116K135
$$ plain form
53912 331922 334912 338569 342372 345669 348454 351294 354207 356332 357064 356727 355684 353607 350304 346554 343355
53897 343355 340809 338435 336026 333512 330499 326769 322751 318725 314076 308213 301724 295631 289907 283836
53883 283836 277586 272204 268056 264415 260773 257516 255008 252914 250805 248757 246926 245064 242807 240026
53869 240026 236790 233391 230416 228284 226666 224923 223110 221917 221553 221377 220821 219988 219130 218155 216987 215864
53853 215864 214940 214006 212916 211903 211251 210969 210918 210867 210344 208975 207154 205856 205563 205860 206266 206885 207881 208859
53835 208859 209279 209122 208731 208267 207696 207096 206641 206473 206834 207982 209738 211358 212187 212257 212003 211688 211378 211238
53817 211238 211495 212225 213403 214974 216697 218137 219090 219862 220944 222586 224898 228137 232545 237949 243717
53802 243717 249156 253939 258416 263576 270479 279473 290048 301520 313615 326343 339773 354272 370710
$$ packed form
53912C31922K990L657L803L297K785K840K913K125P32l37j043k077l303l750l199
53897C43355k546k374k409k514l013l730m018m026m649n863o489o093n724o071
53883B83836o250n382m148l641l642l257k508k094k109k048j831j862k257k781
53869B40026l236l399k975k132j618j743j813j193l64j76n56q33q58r75j168j123
53853B15864r24r34j090j013o52k82n1n1n23j369j821j298k93K97M06O19R96R78
53835B08859M20j57l91m64n71o00m55j68L61J148J756J620Q29P0k54l15l10j40
53817B11238K57P30J178J571J723J440R53P72J082J642K312L239M408N404N768
53802B43717N439M783M477N160O903Q994J0575J1472J2095J2728J3430J4499J6438
$$ plain form
53789 370710 389828 411165 432568 450719 462296 465263 459677 447437 431096 412783 394004 375932
53777 375932 359394 344641 331425 319410 308478 298743 290419 283588 277972 272950 267943 262765 257619
53764 257619 252878 248913 245920 243732 241799 239551 236815 233954 231631 230300 229721 228994 227383 225148 223334
53749 223334 222630 222732 222934 222957 222902 222757 222461 222395 223234 225132 227408 229290 230762 232404 234610 237321 240458
53732 240458 244166 248433 252874 257276 262092 267924 274549 280904 286038 289605 291386 291086 289001 286366
53718 286366 284350 282928 281246 278932 276516 274682 273694 273565 274242 275481 276886 278226 279475 280569 281463
53703 281463 282484 284217 286896 290067 292935 294914 296013 296951 298694 301518 304617 307049 308904 310991
53689 310991 313530 315770 317033 317495 317785 318317 319194 320228 320836 320429 319144 317765 316688 315455 313623 311600
$$ packed form
53789C70710J9118K1337K1403J8151J1577K967n586j2240j6341j8313j8779j8072
53777C75932j6538j4753j3216j2015j0932r735q324o831n616n022n007n178n146
53764B57619m741l965k993k188j933k248k736k861k323j331n79p27j611k235j814
53749B23334p04J02K02K3n5j45k96o6Q39J898K276J882J472J642K206K711L137
53732B40458L708M267M441M402M816N832O625O355N134L567J781l00k085k635
53718B86366k016j422j682k314k416j834r88j29O77J239J405J340J249J094Q94
53703B81463J021J733K679L171K868J979J099R38J743K824L099K432J855K087
53689C10991K539K240J263M62K90N32Q77J034O08m07j285j379j077j233j832k023
$$ plain form
53673 311600 310250 310002 310665 311703 312331 311772 309930 307657 305993 305255 305093 305114 305120 304973 304652 304307 303963 303320
53655 303320 302129 300593 299126 297920 297038 296739 297311 298639 300202 301450 302031 301854 301166 300435 299917 299482
53639 299482 299025 298823 299232 300227 301584 303314 305551 308035 310115 311340 311861 312203 312813 313852 315300 317190
53623 317190 319644 322585 325490 327774 329500 331381 333876 336656 339275 342094 346046 351530 357910 364161
53609 364161 369757 374866 379909 385066 390113 394649 398475 401747 404802 407907 411082 414081 416548 418353
53595 418353 419706 420804 421511 421669 421592 421876 422690 423615 424209 424327 423864 422691 421015 419334 417811 416117 414101
53578 414101 412161 410676 409534 408550 407810 407078 405366 401800 396847 392106 388850 387038 385652 383680 380936
53563 380936 378216 376605 376400 376874 377235 377459 377888 378462 378904 379363 380232 381395 382240 382522 382755 383641 385379
$$ packed form
53673C11600j350k48O63J038O28n59j842k273j664p38j62K1Oj47l21l45l44o43
53655C03320j191j536j467j206q82k99N72J328J563J248N81j77o88p31n18m35
53639B99482m57k02M09R95J357J730K237K484K080J225N21L42O10J039J448J890
53623C17190K454K941K905K284J726J881K495K780K619K819L952N484O380O251
53609C64161N596N109N043N157N047M536L826L272L055L105L175K999K467J805
53595D18353J353J098P07J58p7K84Q14R25N94J18m63j173j676j681j523j694k016
53578D14101j940j485j142r84p40p32j712l566m953m741l256j812j386j972k744
53563C80936k720j611k05M74L61K24M29N74M42M59Q69J163Q45K82K33Q86J738
$$ plain form
53546 385379 387614 389808 391639 393249 395040 397188 399518 401976 404861 408339 412124 416126 420972 427240
53532 427240 434427 441416 447911 454689 462391 470829 479708 489366 500375 512855 526564 541282 556827
53519 556827 573030 590068 608515 628630 649811 671133 692329 713803 735754 757756 779351
53508 779351 800668 822136 843782 865164 885995 906539 927283 948450 969974 991724 1013471
53497 1013471 1034786 1055309 1075143 1094770 1114558 1134605 1155007 1175954 1197506 1219523 1241856
53486 1241856 1264320 1286463 1307730 1327892 1347022 1365115 1382223 1398935 1416088 1433779 1451220
53475 1451220 1467753 1483383 1498026 1511083 1522254 1532097 1540970 1548043 1552164 1553302 1552227 1549050 1543086
53462 1543086 1534124 1522899 1510202 1496293 1481441 1466300 1451395 1436570 1421184 1404556 1386257
$$ packed form
53546C85379K235K194J831J610J791K148K330K458K885L478L785M002M846O268
53532D27240P187O989O495O778P702Q438Q879R658J1009J2480J3709J4718J5545
53519E56827J6203J7038J8447K0115K1181K1322K1196K1474K1951K2002K1595
53508G79351K1317K1468K1646K1382K0831K0544K0744K1167K1524K1750K1747
53497A013471K1315K0523J9834J9627J9788K0047K0402K0947K1552K2017K2333
53486A241856K2464K2143K1267K0162J9130J8093J7108J6712J7153J7691J7441
53475A451220J6533J5630J4643J3057J1171R843Q873P073M121J138j075l177n964
53462A543086q962j1225j2697j3909j4852j5141j4905j4825j5386j6628j8299
$$ plain form
53451 1386257 1366407 1345747 1324977 1304027 1282396 1260187 1238229 1217053 1196321 1175543 1154954
53440 1154954 1135401 1117650 1101975 1088245 1076230 1065942 1057621 1051225 1046151 1041755 1037980 1035080
53428 1035080 1033005 1031641 1031551 1033741 1038552 1045341 1053306 1062060 1071361 1080992 1091264 1103062 1117011 1132954
53414 1132954 1150484 1169537 1190156 1212106 1235149 1259427 1285228 1312539 1341173 1371114 1402504
53403 1402504 1435400 1469736 1505480 1542801 1582229 1624593 1670413 1719256 1769994 1821829 1874813
53392 1874813 1929286 1985166 2042017 2099517 2157588 2216226 2275378 2334913 2394507 2453563 2511196
53381 2511196 2566412 2618533 2667670 2714470 2759099 2800729 2838364 2871782 2901089 2925693 2944620
53370 2944620 2957879 2966694 2972111 2973993 2971546 2964172 2951456 2932818 2907619 2875434 2836187 2790431
$$ packed form
53451A386257j9850k0660k0770k0950k1631k2209k1958k1176k0732k0778k0589
53440A154954j9553j7751j5675j3730j2015j0288q321o396n074m396l775k900
53428A035080k075j364r0K190M811O789P965Q754R301R631J0272J1798J3949J5943
53414A132954J7530J9053K0619K1950K3043K4278K5801K7311K8634K9941L1390
53403A402504L2896L4336L5744L7321L9428M2364M5820M8843N0738N1835N2984
53392A874813N4473N5880N6851N7500N8071N8638N9152N9535N9594N9056N7633
53381B511196N5216N2121M9137M6800M4629M1630L7635L3418K9307K4604J8927
53370B944620J3259Q815N417J882k447p374j2716j8638k5199l2185l9247m5756
$$ plain form
53358 2790431 2739553 2685263 2628827 2571189 2513612 2457261 2402028 2346727 2290902 2235732 2182728
53347 2182728 2132267 2083884 2037244 1992043 1947447 1902431 1856598 1810350 1764550 1720231 1678110
53336 1678110 1637964 1598966 1561027 1525301 1492971 1464096 1438113 1414756 1393812 1374585 1356460
53325 1356460 1339567 1324082 1309211 1293793 1277732 1262023 1247442 1233901 1221037 1208735 1197039
53314 1197039 1186104 1176241 1167606 1159976 1153248 1147870 1144206 1141840 1140226 1139789 1141512 1145472 1150660 1156292
53300 1156292 1162602 1170208 1179503 1190850 1204674 1220995 1239331 1259260 1280709 1303598 1327735 1353204
53288 1353204 1380266 1408656 1437438 1465781 1493454 1520348 1545981 1569780 1591596 1611657 1630199
53277 1630199 1647153 1662017 1674062 1682976 1689182 1693082 1694144 1691425 1685035 1676401 1666815 1656261 1643875
$$ packed form
53358B790431n0878n4290n6436n7638n7577n6351n5233n5301n5825n5170n3004
53347B182728n0461m8383m6640m5201m4596m5016m5833m6248m5800m4319m2121
53336A678110m0146l8998l7939l5726l2330k8875k5983k3357k0944j9227j8125
53325A356460j6893j5485j4871j5418j6061j5709j4581j3541j2864j2302j1696
53314A197039j0935r863q635p630o728n378l664k366j614m37J723L960N188N632
53300A156292O310P606R295J1347J3824J6321J8336J9929K1449K2889K4137K5469
53288A353204K7062K8390K8782K8343K7673K6894K5633K3799K1816K0061J8542
53277A630199J6954J4864J2045Q914O206L900J062k719o390q634r586j0554j2386
$$ plain form
53264 1643875 1628959 1611224 1590653 1567648 1542965 1517089 1489985 1461749 1433107 1404771 1376588
53253 1376588 1347812 1318020 1287401 1256305 1225021 1193934 1163548 1134289 1106504 1080456 1055966
53242 1055966 1032086 1007594 982039 956132 930982 906996 883620 860076 836250 812812 790579
53231 790579 769932 750924 733687 718451 705215 693646 683345 673956 665030 656051 646717 637054
53219 637054 627199 617162 606766 595615 583221 569413 554686 539907 525698 512292 499861 488591
53207 488591 478356 468726 459483 450861 443149 436248 429724 423151 416381 409586 402946 396136 388432 379760
53193 379760 371351 364716 359999 356001 351814 347641 343816 339959 335605 330996 326667 322756 319262 316486
53179 316486 314615 313250 311930 310759 309914 308988 307546 306030 305270 305294 305395 305293 305335 305510 305220 304337 303744
$$ packed form
53264A643875j4916j7735k0571k3005k4683k5876k7104k8236k8642k8336k8183
53253A376588k8776k9792l0619l1096l1284l1087l0386k9259k7785k6048k4490
53242A055966k3880k4492k5555k5907k5150k3986k3376k3544k3826k3438k2233
53231G90579k0647j9008j7237j5236j3236j1569j0301r389q926q979r334r663
53219F37054r855j0037j0396j1151j2394j3808j4727j4779j4209j3406j2431j1270
53207D88591j0235r630r243q622p712o901o524o573o770o795o640o810p704q672
53193C79760q409o635m717l998m187m173l825l857m354m609m329l911l494k776
53179C16486j871j365j320j171q45r26j442j516p60K4J01j02M2J75k90q83n93
$$ plain form
53162 303744 304335 305954 307683 308751 308846 308020 306739 305719 305278 305064 304741 304665 305365 306531 307088 306416 305132
53145 305132 304407 304706 305432 305737 305421 304913 304499 303863 302474 300216 297471 294764 292565 291286 291086 291619 292202
53128 292202 292355 292011 291299 290400 289594 289072 288616 287782 286575 285660 285707 286709 288033 288878 288582 286912 284399
53111 284399 282138 280880 280395 279982 279372 278791 278298 277517 276111 274191 272167 270412 269147 268413 268033 267699
53095 267699 267180 266429 265604 265048 265107 265649 265934 265263 263819 262504 261876 261576 260955 260019 259401 259529 260091 260376
53077 260376 260052 259499 259305 259508 259535 259009 258375 258305 258630 258360 256873 254674 252757 251646 251352 251818 252881 253970
53059 253970 254447 254290 254096 254335 254928 255577 256213 256953 257853 258879 260017 261302 262725 264096 265016 265250 265238
53042 265238 265966 267951 270496 272342 272991 272982 272944 272935 272826 272775 272973 273236 273221 272845 272227 271426 270499 269721 269447 269775
$$ packed form
53162C03744N91J619J729J068R5q26j281j020m41k14l23p6P00J166N57o72j284
53145C05132p25K99P26L05l16n08m14o36j389k258k745k707k199j279k00N33N83
53128B92202J53l44p12q99q06n22m56q34j207r15M7J002J324Q45k96j670k513
53111B84399k261j258m85m13o10n81m93p81j406j920k024j755j265p34l80l34
53095B67699n19p51q25n56N9N42K85o71j444j315o28l00o21r36o18J28N62K85
53077B60376l24n53j94K03K7n26o34p0L25k70j487k199j917j111k94M66J063J089
53059B53970M77j57j94K39N93O49O36P40R00J026J138J285J423J371R20K34j2
53042B65238P28J985K545J846O49rl8rj09n1J98K63j5l76o18q01r27p78k74L28
$$ plain form
53022 269775 270465 271153 271578 271711 271713 271645 271277 270470 269729 269916 271249 272959 274154 274575 274270 273077 271044 268956
53004 268956 267736 267337 266868 265840 264806 264630 265476 266680 267389 267261 266734 266608 267186 268005 268606 269269 270552
52987 270552 272314 273778 274547 274961 275421 275910 276317 276713 277106 277324 277285 277006 276343 275288 274600 275412 277902 280936
52969 280936 283391 285205 286748 287905 288513 289100 290307 291861 292978 293653 294637 296162 297488 297892 297400 296301
52953 296301 294620 292457 290309 288634 287383 286284 285296 284528 283976 283636 283594 283733 283635 283075 282404 282112 282221
52936 282221 282437 282710 283200 283852 284421 284861 285227 285210 284346 282836 281570 280953 280212 278447 276102 274652 274853
52919 274853 275950 276818 277188 277343 277192 276407 275224 274333 273928 273506 272731 271896 271292 270661 269705 268677 267986 267530
52901 267530 266924 266179 265605 265167 264508 263607 262940 262904 263493 264596 266171 268050 269960 271897 274044 276116 277241
$$ packed form
53022B69775O90O88M25J33Ko8l68q07p41J87J333J710J195M21l05j193k033k088
53004B68956j220l99m69j028j034j76Q46J204P09j28n27j26N78Q19O01O63J283
52987B70552J762J464P69M14M60M89M07L96L93K18l9k79o63j055o88Q12K490L034
52969B80936K455J814J543J157O08N87J207J554J117O75R84J525J326M04m92j099
52953B96301j681k163k148j675j251j099r88p68n52l40m2J39r8n60o71k92J09
52936B82221K16K73M90O52N69M40L66j7q64j510j266o17p41j765k345j450K01
52919B74853J097Q68L70J55j51p85j183q91m05m22p75q35o04o31r56j028o91m56
52901B67530o06p45n74m38o59r01o67l6N89J103J575J879J910J937K147K072J125
$$ plain form
52884 277241 276809 275177 273231 271512 270025 268670 267481 266568 266039 265856 265601 264682 263152 262070 262522 264291
52868 264291 265941 266334 265674 264952 264737 264823 264873 265032 265760 267178 268740 269714 269952 270014 270435 271064 271328 270898 269802
52849 269802 268050 265583 262615 259636 256948 254503 252313 250597 249299 247828 245698 243255 241320 240144
52835 240144 239110 237600 235851 234685 234541 235007 235347 235289 235197 235513 236245 237043 237629 237977 238099 237843 237026 235742
52817 235742 234533 234249 235558 238352 241658 244400 246387 248469 251688 256373 261899 266977 270143 270395 267794
52802 267794 263396 258456 253814 249975 247327 245850 244878 243605 241810 239793 237739 235560 233392 231815
52788 231815 231352 231919 232861 233447 233384 233052 233202 234185 235467 236137 235874 235219 234931 235311 236143 236947 237257 237002 236693
52769 236693 237002 238022 239169 239816 239758 239130 238307 237919 238440 239554 240400 240680 241048 242138 243702 245098 246097
$$ packed form
52884B77241m32j632j946j719j487j355j189r13n29j83k55r19j530j082M52J769
52868B64291J650L93o60p22k15Q6N0J59P28J418J562R74K38O2M21O29K64m30j096
52849B69802j752k467k968k979k688k445k190j716j298j471k130k443j935j176
52835B40144j034j510j749j166j44M66L40n8r2L16P32P98N86L48J22k56q17j284
52817B35742j209k84J309K794L306K742J987K082L219M685N526N078L166K52k601
52802B67794m398m940m642l839k648j477r72j273j795k017k054k179k168j577
52788B31815m63N67R42N86o3l32J50R83J282O70k63o55k88L80Q32Q04L10k55l09
52769B36693L09J020J147O47n8o28q23l88N21J114Q46K80L68J090J564J396R99
$$ plain form
52752 246097 246698 246641 245792 244705 244106 243959 243755 243563 244007 245180 246394 247178 247819 248626 249406 250074 251084 252634
52734 252634 253944 254026 252975 251899 251690 252393 253657 255182 256649 257703 258183 258055 257109 255172 252716 250769
52718 250769 249869 249435 248555 247182 246133 246029 246690 247642 248803 250372 252292 254088 255274 255739 255746 255658 255645 255674
52700 255674 255783 256271 257356 258635 259227 258740 257832 257425 257564 257597 257366 257527 258450 259509 259999 260267 261259 263146
52682 263146 265087 266389 267317 268563 270354 272308 273854 274609 274593 274293 274360 275063 276098 277005 277625 278123 278725
52665 278725 279519 280372 281026 281398 281762 282439 283348 284067 284334 284221 283893 283525 283458 284029 285067 285896 285980 285285 283888
52646 283888 281689 278756 275588 272694 270154 267910 266206 265323 265068 264920 264589 264137 263705 263483 263817 264932
52630 264932 266646 268697 271278 274769 278927 282802 285568 287081 287545 287100 285963 284541 283058 281297 279094
$$ packed form
52752B46097O01n7q49j087n99j47k04j92M44J173J214P84O41Q07P80O68J010J550
52734B52634J310Q2j051j076k09P03J264J525J467J054M80j28r46j937k456j947
52718B50769r00m34q80j373j049j04O61R52J161J569J920J796J186M65Pq8j3K9
52700B55674J09M88J085J279N92m87r08m07J39L3k31J61R23J059M90K68R92J887
52682B63146J941J302R28J246J791J954J546P55j6l00O7P03J035R07O20M98O02
52665B78725P94Q53O54L72L64O77R09P19K67j13l28l68o7N71J038Q29Q4o95j397
52646B83888k199k933l168k894k540k244j704q83k55j48l31m52m32k22L34J115
52630B64932J714K051K581L491M158L875K766J513M64m45j137j422j483j761k203
$$ plain form
52615 279094 276920 275542 275094 274871 274185 273149 272444 272459 272983 273677 274488 275386 275994 275881 275206 274669 274710 275084
52597 275084 275418 275826 276660 277871 279036 279911 280644 281558 283024 285393 288569 291681 293692 294436 294643 294838
52581 294838 294734 293919 292634 291427 290391 289256 288084 287410 287701 288962 290803 292583 293592 293504 292687 291778
52565 291778 290906 289673 287958 286352 285593 285791 286400 286756 286465 285495 284167 283016 282428 282355 282452 282411 282099 281544
52547 281544 281045 281114 281974 283128 283748 283650 283569 284223 285336 285939 285584 284905 284841 285518 286126 285845 284731 283690 283606
52528 283606 284543 285769 286515 286635 286480 286307 286041 285588 285161 285108 285560 286345 287228 288124 289151 290554 292503 294900
52510 294900 297414 299779 301904 303657 304737 304991 304681 304113 303060 300916 297468 293215 288864 284823 281335
52495 281335 278651 276690 274897 272911 271230 270628 270926 271020 270344 269732 270382 272367 274714 276702 278433 280162
$$ packed form
52615B79094k174j378m48k23o86j036p05J5N24O94Q11Q98O08j13o75n37M1L74
52597B75084L34M08Q34J211J165Q75P33R14J466K369L176L112K011P44K07J95
52581B94838j04q15j285j207j036j135j172o74K91J261J841J780J009q8q17r09
52565B91778q72j233j715j606p59J98O09L56k91r70j328j151n88p3R7m1l12n55
52547B81544m99O9Q60J154O20r8q1O54J113O03l55o79o4O77O08k81j114j041q4
52528B83606R37J226P46J20j55j73k66m53m27n3M52P85Q83Q96J027J403J949K397
52510B94900K514K365K125J753J080K54l10n68j053k144l448m253m351m041l488
52495B81335k684j961j793j986j681o02K98R4o76o12O50J985K347J988J731J729
$$ plain form
52479 280162 281712 282793 283457 283912 284250 284672 285696 287718 290423 292974 294775 295834 296440 296818 297197 297917
52463 297917 299290 301375 303983 306820 309607 312113 314123 315410 315824 315445 314493 313015 310780 307605 303672
52448 303672 299409 295303 291961 289959 289251 288979 288443 288107 288975 290978 292696 292929 291915 290683 289790 289259
52432 289259 289155 289543 290086 290348 290418 290659 290948 290782 290156 289710 289846 290203 290257 289975 289632 289348 289189 289444 290412
52413 290412 291989 293836 295962 298915 303273 309063 315750 322774 330043 337868 346443 355491 364378 372300
52399 372300 378221 380938 379704 374874 367697 359439 350912 342720 335509 329723 325364 322134 319702 317799
52385 317799 316292 315277 314867 314850 314856 314939 315659 317327 319520 321634 323747 326589 330685 335741 340877 345400
52369 345400 349388 353544 358279 363019 366718 369033 370475 371294 370911 368971 366402 364654 364167 364342 364802
$$ packed form
52479B80162J550J081O64M55L38M22J024K022K705K551J801J059O06L78L79P20
52463B97917J373K085K608K837K787K506K010J287M14l79r52j478k235l175l933
52448C03672m263m106l342k002p08k72n36l36Q68K003J718K33j014j232q93n31
52432B89259j04L88N43K62P0K41K89j66o26m46J36L57N4k82l43k84j59K55R68
52413B90412J577J847K126K953M358N790O687P024P269P825Q575R048Q887P922
52399C72300N921K717j234m830p177q258q527q192p211n786m359l230k432j903
52385C17799j507j015m10j7OQ3P20J668K193K114K113K842M096N056N136M523
52369C45400L988M156M735M740L699K315J442Q19l83j940k569j748m87J75M60
$$ plain form
52354 364802 365810 367395 369008 370410 372102 374417 376815 378660 380182 382035 384253 386377 388372 390694
52340 390694 393498 396483 399652 403590 408707 414711 421128 427967 435540 443914 452896 462419 472623 483689
52326 483689 495876 509562 524972 541898 559928 578841 598420 617958 636427 653397 669551
52315 669551 686135 703975 723122 743184 763695 784272 804703 825014 845357 865843 886497
52304 886497 907263 927886 947895 966924 985034 1002423 1018767 1033164 1044986 1054548 1062601 1069249
52292 1069249 1073807 1075777 1075548 1073854 1070840 1066101 1059580 1051982 1044125 1036223 1028072 1019752 1011858 1005018
52278 1005018 999386 994693 990640 987215 984724 983619 984213 986495 990142 994768 1000235 1006840 1015187 1025706
52264 1025706 1038209 1052022 1066633 1082039 1098327 1115126 1131837 1148362 1165146 1182360 1199387
$$ packed form
52354C64802J008J585J613J402J692K315K398J845J522J853K218K124J995K322
52340C90694K804K985L169L938N117O004O417O839P573Q374Q982R523J0204J1066
52326D83689J2187J3686J5410J6926J8030J8913J9579J9538J8469J6970J6154
52315F69551J6584J7840J9147K0062K0511K0577K0431K0311K0343K0486K0654
52304H86497K0766K0623K0009J9029J8110J7389J6344J4397J1822R562Q053O648
52292A069249M558J970k29j694l014m739o521p598p857p902q151q320p894o840
52278A005018n632m693m053l425k491j105N94K282L647M626N467O605Q347J0519
52264A025706J2503J3813J4611J5406J6288J6799J6711J6525J6784J7214J7027
$$ plain form
52253 1199387 1215426 1230382 1244757 1258683 1271407 1281870 1289576 1294688 1297450 1297863 1296083 1292849 1289089
52240 1289089 1285007 1279917 1273197 1265129 1256414 1247089 1236583 1224877 1212952 1201758 1191256 1180882
52228 1180882 1170491 1160260 1150042 1139638 1129602 1121028 1114339 1108910 1104073 1099963 1097065 1095401 1094594
52215 1094594 1094386 1094735 1095673 1097453 1100549 1105160 1110863 1117088 1123695 1130700 1137652 1143867 1149244 1154395 1159960
52200 1159960 1166193 1173170 1180859 1188841 1196474 1203652 1211006 1219054 1227430 1235275 1242115 1247919 1252524 1255475
52186 1255475 1256498 1255802 1253827 1250830 1246726 1241151 1233730 1224499 1214078 1203284 1192635 1182335 1172629
52173 1172629 1163816 1155961 1148926 1142737 1137602 1133448 1129856 1126657 1124224 1122886 1122379 1122353 1123160 1125478 1129077
52158 1129077 1132574 1134775 1135867 1136881 1138161 1138894 1138224 1136478 1134994 1134894 1136211 1138209 1140319 1142544 1145027
$$ packed form
52253A199387J6039J4956J4375J3926J2724J0463P706N112K762M13j780l234l760
52240A289089m082n090o720q068q715r325j0506j1706j1925j1194j0502j0374
52228A180882j0391j0231j0218j0404j0036q574o689n429m837m110k898j664q07
52215A094594k08L49R38J780L096M611N703O225O607P005O952O215N377N151N565
52200A159960O233O977P689P982P633P178P354Q048Q376P845O840N804M605K951
52186A255475J023o96j975k997m104n575p421r231j0421j0794j0649j0300r706
52173A172629q813p855p035o189n135m154l592l199k433j338n07k6Q07K318L599
52158A129077L497K201J092J014J280P33o70j746j484j00J317J998K110K225K483
$$ plain form
52143 1145027 1147529 1149545 1150814 1151430 1151482 1150870 1149635 1148240 1147322 1147256 1148095 1149872 1152793 1157214 1163517 1171878
52127 1171878 1182075 1193725 1206922 1222415 1240773 1261493 1283410 1305992 1329727 1355047 1381411
52116 1381411 1407869 1434177 1460797 1487878 1514733 1540420 1564459 1586877 1607876 1627671 1646422
52105 1646422 1664119 1680625 1695998 1710584 1724645 1737953 1749921 1760051 1768061 1773605 1776138 1775170
52093 1775170 1770526 1762274 1750536 1735581 1718090 1699143 1679761 1660496 1641561 1623304 1606283 1590830
52081 1590830 1576878 1564524 1554510 1547568 1543251 1539964 1536605 1533856 1533411 1536060 1540976 1546837 1553201
$$ packed form
52143A145027K502K016J269O16N2o12j235j395r18o6Q39J777K921M421O303Q361
52127A171878J0197J1650J3197J5493J8358K0720K1917K2582K3735K5320K6364
52116A381411K6458K6308K6620K7081K6855K5687K4039K2418K0999J9795J8751
52105A646422J7697J6506J5373J4586J4061J3308J1968J0130Q010N544K533r68
52093A775170m644q252j1738j4955j7491j8947j9382j9265j8935j8257j7021j5453
52081A590830j3952j2354j0014o942m317l287l359k749m45K649M916N861O364
$$ [...]
##END NTUPLES=NMR SPECTRUM
##END=
