##TITLE=AC1477_ZPERVRI303_8100998_XyNB9lbytl
##JCAMPDX= 6.0         $$ Bruker NMR JCAMP-DX V2.0
##DATA TYPE= NMR SPECTRUM
##DATA CLASS= NTUPLES
##ORIGIN= BRUKER
##OWNER= Administrator
$$ 1.72 TOPSPIN		Version 2.1
$$ 2013-07-31 16:53:11.688 -0700  Administrator@X
$$ Compression mode = diff/dup
##.OBSERVE FREQUENCY= 400.02188249412
##.OBSERVE NUCLEUS= ^1H
##.ACQUISITION MODE= SIMULTANEOUS (DQD)
##.ACQUISITION SCHEME= undefined
##.AVERAGES= 8
##.DIGITISER RES= 22
##SPECTROMETER/DATA SYSTEM= spect
##.PULSE SEQUENCE= zg30
##.SOLVENT NAME= COFFEE_meoh
##.SHIFT REFERENCE= INTERNAL, COFFEE_meoh, 1, 14.98509
##AUDIT TRAIL= $$ (NUMBER, WHEN, WHO, WHERE, PROCESS, VERSION, WHAT)
$$ ##TITLE= Audit trail, TOPSPIN		Version 2.1
$$ ##JCAMPDX= 5.01
$$ ##ORIGIN= Bruker BioSpin GmbH
$$ ##OWNER= Administrator
$$ $$ E:\/data/COFFEE/nmr/AC1477_ZPERVRI303_8100998_XyNB9lbytl/10/pdata/1/auditp.txt
$$ ##AUDIT TRAIL=  $$ (NUMBER, WHEN, WHO, WHERE, PROCESS, VERSION, WHAT)
(   1,<2013-07-31 16:53:05.251 -0700>,<Administrator>,<X>,<go>,<TOPSPIN 2.1>,
      <created by zg
	started at 2013-07-31 16:51:59.266 -0700,
	POWCHK enabled, PULCHK disabled,
       configuration hash MD5:
       C8 4E 4E 5D D3 5C D8 9E 9F 52 82 E0 59 8A DE 15
       data hash MD5: 64K
       6B 13 E8 F2 DB 91 F7 51 9D 0B D8 73 4B 78 F9 35>)
(   2,<2013-07-31 16:53:08.110 -0700>,<Administrator>,<X>,<proc1d>,<TOPSPIN 2.1>,
      <Start of raw data processing
       efp LB = 0 FT_mod = 6 PKNL = 1 PHC0 = 0 PHC1 = 0 SI = 32K 
       data hash MD5: 32K
       A4 B7 EA F9 2E 20 91 EC 80 43 87 18 57 21 41 89>)
(   3,<2013-07-31 16:53:08.376 -0700>,<Administrator>,<X>,<proc1d>,<TOPSPIN 2.1>,
      <pk PHC0 = 97.3938 PHC1 = 0 
       data hash MD5: 32K
       09 B8 B9 B7 96 26 9E B6 FD BC 1C 56 E3 E2 67 F7>)
(   4,<2013-07-31 16:53:08.470 -0700>,<Administrator>,<X>,<proc1d>,<TOPSPIN 2.1>,
      <abs ABSG = 1 
       data hash MD5: 32K
       5A 8E 8F 64 02 23 3F E1 07 53 57 16 DB 5B 2E A0>)
(   5,<2013-07-31 16:53:08.532 -0700>,<Administrator>,<X>,<proc1d>,<TOPSPIN 2.1>,
      <abs ABSG = 2 
       data hash MD5: 32K
       41 CB 45 52 C3 8F BD B5 B4 DA 34 BB 19 AD 09 D2>)
(   6,<2013-07-31 16:53:08.579 -0700>,<Administrator>,<X>,<proc1d>,<TOPSPIN 2.1>,
      <abs ABSG = 3 
       data hash MD5: 32K
       A7 31 2C FA 21 9E A5 D9 66 8F B0 FB 66 C2 9E 55>)
(   7,<2013-07-31 16:53:08.641 -0700>,<Administrator>,<X>,<proc1d>,<TOPSPIN 2.1>,
      <abs ABSG = 4 
       data hash MD5: 32K
       E3 AA 9C 6C 4C 8F 0E C0 CB C1 29 5A 52 0D AD 27>)
(   8,<2013-07-31 16:53:08.704 -0700>,<Administrator>,<X>,<proc1d>,<TOPSPIN 2.1>,
      <abs ABSG = 5 
       data hash MD5: 32K
       C2 E2 68 CE 3C D8 80 7B FA 0E 5C AC 8A F5 9F C7>)
$$ ##END=
$$ 
$$ $$ hash MD5
$$ $$ 46 1F 9B 48 46 A9 EB 84 95 99 15 CF 82 BC 60 E0
##$RELAX= 
##$RELAX= 
##$RELAX= 
##$RELAX= 
##$RELAX= 
##$RELAX= 
##$RELAX= 
$$ Bruker specific parameters
$$ --------------------------
##$DU= <E:\>
##$EXPNO= 10
##$NAME= <AC1477_ZPERVRI303_8100998_XyNB9lbytl>
$$ [...]
150 150 150 150 150 150 150 150
##$TP07= 0
##$TPNAME0= <>
##$TPNAME1= <>
##$TPNAME2= <>
##$TPNAME3= <>
##$TPNAME4= <>
##$TPNAME5= <>
##$TPNAME6= <>
##$TPNAME7= <>
##$TPOAL= (0..7)
0.5 0.5 0.5 0.5 0.5 0.5 0.5 0.5
##$TPOFFS= (0..7)
0 0 0 0 0 0 0 0
##$TUNHIN= 0
##$TUNHOUT= 0
##$TUNXOUT= 0
##$USERA1= <user>
##$USERA2= <user>
##$USERA3= <user>
##$USERA4= <user>
##$USERA5= <user>
##$V9= 5
##$VALIST= <valist>
##$VCLIST= <CCCCCCCCCCCCCCC>
##$VD= 0
##$VDLIST= <DDDDDDDDDDDDDDD>
##$VPLIST= <PPPPPPPPPPPPPPP>
##$VTLIST= <TTTTTTTTTTTTTTT>
##$WBST= 2048
##$WBSW= 25
##$XGAIN= (0..3)
0 0 0 0
##$XL= 0
##$YL= 0
##$YMAX_a= 651779
##$YMIN_a= -554748
##$ZGOPTNS= <>
##$ZL1= 120
##$ZL2= 120
##$ZL3= 120
##$ZL4= 120
##$ABSF1= 14.98509
##$ABSF2= -5.573092
##$ABSG= 5
##$ABSL= 3
##$ALPHA= 0
##$AQORDER= 0
##$ASSFAC= 0
##$ASSFACI= 0
##$ASSFACX= 0
##$ASSWID= 0
##$AUNMP= <proc_prof1d_extract_pilot.lims>
##$AXLEFT= 0
##$AXNAME= <>
##$AXNUC= <1H>
##$AXRIGHT= 0
##$AXTYPE= 0
##$AXUNIT= <>
##$AZFE= 0.1
##$AZFW= 0.1
##$BCFW= 0
##$BC_mod= 0
##$BYTORDP= 0
##$COROFFS= 0
##$CY= 15
##$DATMOD= 1
##$DC= 0
##$DFILT= <>
##$DTYPP= 0
##$F1P= 0
##$F2P= 0
##$FCOR= 0.5
##$FTSIZE= 32768
##$FT_mod= 6
##$GAMMA= 0
##$GB= 0
##$INTBC= 1
##$INTSCL= 1
##$ISEN= 128
##$LB= 0
##$LEV0= 0
##$LPBIN= 0
##$MAXI= 10000
##$MC2= 0
##$MEAN= 0
##$ME_mod= 0
##$MI= 0
##$NCOEF= 0
##$NC_proc= -8
##$NLEV= 6
##$NOISF1= 0
##$NOISF2= 0
##$NSP= 0
##$NTH_PI= 0
##$NZP= 0
##$OFFSET= 14.98509
##$PC= 1
##$PHC0= 97.3938
##$PHC1= 0
##$PH_mod= 1
##$PKNL= yes
##$PPARMOD= 0
##$PPDIAG= 0
##$PPIPTYP= 0
##$PPMPNUM= 2147483647
##$PPRESOL= 1
##$PSCAL= 4
##$PSIGN= 0
##$PYNMP= <proc.py>
##$REVERSE= no
##$SF= 400.02
##$SI= 32768
##$SIGF1= 0
##$SIGF2= 0
##$SINO= 400
##$SIOLD= 32768
##$SPECTYP= <>
##$SREGLST= <1H.CDCl3>
##$SSB= 0
##$STSI= 32768
##$STSR= 0
##$SW_p= 8223.68421052631
##$SYMM= 0
##$S_DEV= 0
##$TDeff= 65536
##$TDoff= 0
##$TI= <>
##$TILT= no
##$TM1= 0
##$TM2= 0
##$TOPLEV= 0
##$USERP1= <user>
##$USERP2= <user>
##$USERP3= <user>
##$USERP4= <user>
##$USERP5= <user>
##$WDW= 1
##$XDIM= 32768
##$YMAX_p= 454460782
##$YMIN_p= -724656
##$CURPLOT= <Network HP LaserJet P1505>
##$CURPRIN= <$Network HP LaserJet P1505>
##$DFORMAT= <normdp>
##$LAYOUT= <+/1D_H.xwp>
##$LFORMAT= <normlp>
##$PFORMAT= <normpl>
##$SURQMSG= 1
$$ End of Bruker specific parameters
$$ ---------------------------------
##NTUPLES= NMR SPECTRUM
##VAR_NAME=  FREQUENCY,     SPECTRUM/REAL,   SPECTRUM/IMAG
##SYMBOL=    X,             R,               I
##VAR_TYPE=  INDEPENDENT,   DEPENDENT,       DEPENDENT
##VAR_FORM=  AFFN,          ASDF,            ASDF
##VAR_DIM=   32768,         32768,           32768
##UNITS=     HZ,            ARBITRARY UNITS, ARBITRARY UNITS
##FACTOR=    0.250966925370066, 1,           1
##FIRST=     8223.43324360094, -159649,      -199106
##LAST=      0,             -12067,          -71108
##MIN=       0,             -724656,         0
##MAX=       8223.43324360094, 454460782,    0
$$ Real data points
##PAGE= N=1
##DATA TABLE= (X++(R..R)), XYDATA
$$ [...]
19542c96981B04281o3252b31426P7296r0591J6169E8818a88067H4095J13551D0533
$$ -396981 204281 141029 -231426 -154130 -244721 -228552 58818 -188067 84095 197646 40533
19530g6033B10000E4798c85973h1569j66047J3805K7751A03300C3507K23373c8300
$$ -76033 210000 54798 -385973 -81569 -247616 -233811 -206060 103300 33507 256880 -38300
19518a5018r4355C02078c59074D42021b3088m35842E9526b94796C12898c56700
$$ -15018 -109373 302078 -359074 442021 -23088 -458930 59526 -294796 312898 -356700
19507a83049d4983r1248C0388d0308J1398A65587c55001L6781C00230g1364F6374
$$ -183049 -44983 -136231 30388 -40308 -28910 165587 -355001 -318220 300230 -71364 66374
19495D4565h5525A99313b81512e3595m156b222A93835a00940H1615Q5041a4918
$$ 44565 -85525 199313 -281512 -53595 -57751 -2222 193835 -100940 81615 166656 -14918
19483a58227k34510A31468F3974B5652f1543r6857B76567a05896a7252j40008
$$ -158227 -392737 131468 63974 25652 -61543 -158400 276567 -105896 -17252 -157260
19473a57260A26405P8313Q6024a91063A60442a3976A6949b84361A49739a19700
$$ -157260 126405 204718 290742 -191063 160442 -13976 16949 -284361 149739 -119700
19462a05704A63756p5722b35397a11434b0409d925b152A9126A995c8361l80095
$$ -105704 163756 88034 -235397 -111434 -20409 -4925 -2152 19126 1995 -38361 -418456
19451d18456a6065j46207q9043L9035f5433A11611K60652c1580H8063I130N6613
$$ -418456 -16065 -162272 -251315 -212280 -65433 111611 372263 -31580 88063 9130 65743
19440F5743g8591A5986c2539j10372j13671h9163j65700A77983b40413k18068
$$ 65743 -78591 15986 -32539 -142911 -256582 -89163 -254863 177983 -240413 -458481
19430d58481b2150A98086F9481l1602f5721o6586C1991k602K54991c44669h4064
$$ -458481 -22150 198086 69481 37879 -65721 -132307 31991 29389 284380 -344669 -84064
19418A20608f4318r0030c5701k85635a30714b7282B65110E0176B2941b30887A2170
$$ 120608 -64318 -154348 -35701 -321336 -130714 -27282 265110 50176 22941 -230887 12170
19406c2951j82806a3842q4815j7030A87591a38362M107G1457e1196k06832b0611
$$ -32951 -215757 -13842 -98657 -115687 187591 -138362 -134255 71457 -51196 -258028 -20611
19394A79532i9215j6128j28456O5566J1508E6660e8842B5923A485c35932J39532
$$ 179532 -99215 -115343 -243799 -178233 -166725 56660 -58842 25923 1485 -335932 -196400
19383a96400Q2498j34884J08373D8074r552d38017q3704C3122K9636a76110j4867
$$ -196400 -113902 -248786 -140413 48074 38522 -438017 -521721 33122 62758 -176110 -190977
19372a90977A57311A6800J49257d63280e2942j327l16148a2205A74157b84849
$$ -190977 157311 16800 166057 -463280 -52942 -54269 -370417 -12205 174157 -284849
19361B7336a12102D5967b49223A09305D3892f0678j02351C2310c35667J04801
$$ 27336 -112102 45967 -249223 109305 43892 -60678 -163029 32310 -335667 -230866
19351b30866m55465A18077b20899O2311B73618B9453c4724p627k03785a04178
$$ -230866 -686331 118077 -220899 -158588 273618 29453 -34724 -42351 -246136 -104178
19340A29586a58920L388L4904K4909l5203k3205N0150p1979a0451B843g0600B58868
$$ 129586 -158920 -155532 -120628 -95719 -130922 -154127 -103977 -175956 -10451 2843 -70600 258868
19327B10700g0426C5287K24582g7659a1675m9246A56099J691c24789A55502B6076
$$ 210700 -70426 35287 259869 -77659 -11675 -60921 156099 157790 -324789 155502 26076
19315c9181j70502j68156C1736M9785a8936B5683M4543a51266j700M3603d5635
$$ -39181 -209683 -377839 31736 81521 -18936 25683 70226 -151266 -152966 -109363 -45635
19303i0763k40625A01686B7983e7465j37523A91348a95307j7128D7645c4233A4276
$$ -90763 -331388 101686 27983 -57465 -194988 191348 -195307 -212435 47645 -34233 14276
19291a78618B74676a4151k72892L8996e2939B2500i4842j45685d7121a9595k68724
$$ -178618 274676 -14151 -287043 -248047 -52939 22500 -94842 -240527 -47121 -19595 -288319
19280b88319A41981a70653C88682d7810m07183A71289G9961a79205K8842j16737
$$ -288319 141981 -170653 388682 -47810 -454993 171289 79961 -179205 -150363 -267100
19270b67100B5858n912K21251a94585d278B41679A00010a79221q142b9584A10287
$$ -267100 25858 19946 241197 -194585 -4278 241679 100010 -179221 -187363 -29584 110287
19258a22043A21800b6259j57099O8785C71837a52753A11440K7940a60340P9900
$$ -122043 121800 -26259 -183358 -114573 371837 -152753 111440 139380 -160340 -80440
19248h0440B29715p2393a75956k19974J51910C46550B890b28100B69030a20584
$$ -80440 229715 157322 -175956 -395930 -244020 346550 2890 -228100 269030 -120584
19237c36785a5328j29128E1422d8715q1247o7968G8507g8342k00520J4800d9130
$$ -336785 -15328 -144456 51422 -48715 -129962 -197930 78507 -78342 -278862 -264062 -49130
19225g396F0663g9515p533p3779E5999P3800a59031I5048e5777j06294f4466b2263
$$ -7396 60663 -79515 -87048 -160827 55999 129799 -159031 95048 -55777 -162071 -64466 -22263
19212e9795j6405b8365H0939d52451a18244I428J34251l1380a55322k107O0284
$$ -59795 -76200 -28365 80939 -452451 -118244 9428 143679 112299 -155322 -157429 -97145
19201i7145A15592l6492b78564g5314k61806a24972l23420i7327A72086g4850
$$ -97145 115592 79100 -278564 -75314 -337120 -124972 -448392 -97327 172086 -74850
19190B6860d2957A5702b20275P3064a907j23303j02511O3698g180o6272b7247
$$ 26860 -42957 15702 -220275 -147211 -1907 -125210 -227721 -164023 -7180 -73452 -27247
19178I803K37181a73629P0993C69504a65719j21159H9971g8386j6196j8474j90492
$$ 9803 246984 -173629 -102636 369504 -165719 -286878 89971 -78386 -94582 -113056 -303548
19167c03548A23216f6493A41349I695i8584K3031j54185q2773H5761C1563M2752
$$ -303548 123216 -66493 141349 9695 -98584 -75553 -229738 -312511 85761 31563 74315
19156G4315a16253o3257M0873O0222j51324a0581A18078a55582M8220l5152f7549
$$ 74315 -116253 -179510 -138637 -78415 -229739 -10581 118078 -155582 -107362 -142514 -67549
19144E9550L6463l9818a64720m55424f211p8721j43568a00211l86983H1492N4092
$$ 59550 96013 56195 -164720 -620144 -6211 -84932 -228500 -100211 -487194 81492 135584
19133A35584Q8117r5982R5668F1370R2359a73562H7404d37558a6833k38424J14793
$$ 135584 223701 127719 223387 61370 153729 -173562 87404 -437558 -16833 -255257 -140464
19122a40464F2868a77196c3010A59883J2329d1459l3017c0973j57981E0583a93117
$$ -140464 62868 -177196 -33010 159883 172212 -41459 -74476 -30973 -188954 50583 -193117
19110c32125a27027B11770b27229Q9747D0030j0160M9391b85654f872D939Q1490
$$ -332125 -127027 211770 -227229 -137482 40030 29870 79261 -285654 -6872 4939 86429
19099H6429J3912Q000l2443a79946P8213L7167l57131E9277c9396I851b98658
$$ 86429 100341 108341 75898 -179946 -101733 -64566 -421697 59277 -39396 9851 -298658
19087i4180C95659a49470C8469a14995k16042n3977J42119G8531a14121A33704
$$ -94180 395659 -149470 38469 -114995 -331037 -385014 -242895 78531 -114121 133704
19076A29618a09786D3449b52720a03899d3666B97377k4005j7928b20887N3589
$$ 129618 -109786 43449 -252720 -103899 -43666 297377 273372 255444 -220887 -167298
19066a67298e3333I4932b06896F3470a88580A81248H023a76702o307k29381f3012
$$ -167298 -53333 94932 -206896 63470 -188580 181248 8023 -176702 -183009 -412390 -63012
19054c1706l33755B34400a97835Q09C05836G7386c94201A37300b23087B58387
$$ -31706 -365461 234400 -197835 -197026 305836 77386 -394201 137300 -223087 258387
19043a49275B3445a8091k09666F3107J64250c4441n0034C8756B388c56945A69130
$$ -149275 23445 -18091 -227757 63107 227357 -34441 -84475 38756 2388 -356945 169130
19031C8060j0655J8729c6853l0474d979j26466l6370A73873b60736B13036d32643
$$ 38060 27405 46134 -36853 -67327 -4979 -131445 -167815 173873 -260736 213036 -432643
19019a09967A98511G5331h6339j04352n7461R1439A12605a59008p0527P8920j7111
$$ -109967 198511 75331 -86339 -190691 -248152 -156713 112605 -159008 -229535 -150615 -167726
19008a67726C58704c07208K1104E1348b29984C4860J1701k496C80g5333I491K1121
$$ -167726 358704 -307208 -286104 51348 -229984 34860 46561 44065 380 -75333 9491 30612
18996C0612Q3127b35465j15587A17515g24656A36051a93457j9193A70806j0503
$$ 30612 113739 -235465 -351052 117515 -724656 136051 -193457 -212650 170806 160303
18986A60303e4277j45983b0824l28837F3856a23134j54971G9287l3058a59934
$$ 160303 -54277 -200260 -20824 -349661 63856 -123134 -278105 79287 46229 -159934
18975C12071j20333b63160Q5245a4566B19617A07426A7168R6218e0401a1716m3977
$$ 312071 191738 -263160 -177915 -14566 219617 107426 17168 113386 -50401 -11716 -55693
18964e5693j09066A50345g531D12074A49318E9886K6364i0671B5693Q1117b0178
$$ -55693 -164759 150345 -7531 412074 149318 59886 86250 -90671 25693 106810 -20178
18952b42896O4906c4798p651j34583j0499g8715l90798a87691m7629J03119A8608
$$ -242896 -177990 -34798 -42449 -177032 -187531 -78715 -469513 -187691 -235320 -132201 18608
18940C3479K3410e6879I3705d24570B30328a95327P8897n6520n0780A1256a9351
$$ 33479 56889 -56879 93705 -424570 230328 -195327 -116430 -172950 -223730 11256 -19351
18928I5820B0970a56513q1454F9383b25749A65607c09975J43383H503K80529A24495
$$ 95820 20970 -156513 -237967 69383 -225749 165607 -309975 -166592 8503 289032 124495
18916B30813a58940J4737o365o1974A46610h5475A26339M2930a83136e8065K592
$$ 230813 -158940 -144203 -150568 -212542 146610 -85475 126339 169269 -183136 -58065 -55473
18905e5473A44794c47855J29377o437f3997B38315a64505F9490b71535D0881d8463
$$ -55473 144794 -347855 -218478 -224915 -63997 238315 -164505 69490 -271535 40881 -48463
18893G1096K18989B4260a46784j18267B4903J62799B3031a84949g6089D5705b88251
$$ 71096 290085 24260 -146784 -265051 24903 187702 23031 -184949 -76089 45705 -288251
18881A7908m721a95524A3621J35491b44231b7501A0937a25895m2157c5451l3026
$$ 17908 13187 -195524 13621 149112 -244231 -27501 10937 -125895 -168052 -35451 -68477
18870f8477k42749A75335l617F6363J33152c49145i9685D7272a01467k7784b441
$$ -68477 -311226 175335 171718 66363 199515 -349145 -99685 47272 -101467 -129251 -2441
18858c35513E6841a06294o6188q7380A16872d13375a09201L3523k83047C2599
$$ -335513 56841 -106294 -172482 -259862 116872 -413375 -109201 -75678 -358725 32599
18847E2733g6344c4890l5311I4823a39892H6053N1991A4669Q222K9685a24868
$$ 52733 -76344 -34890 -70201 94823 -139892 86053 138044 14669 22891 52576 -124868
18835A56866J09759G8240b85420J33910I063J76264c20713a46462k92167G5237
$$ 156866 266625 78240 -285420 -151510 9063 185327 -320713 -146462 -438629 75237
18824f7531C961d31399h0106j55876J16330G496d3611a311B37445j02097K9409
$$ -67531 3961 -431399 -80106 -235982 -119652 7496 -43611 -1311 237445 135348 164757
18813A64757j2377c4218A95268J49038f1154l13275C2283c756l43475J50355F9473
$$ 164757 152380 -34218 195268 344306 -61154 -374429 32283 -3756 -347231 -196876 69473
18801b2979l9141E7611N1638J84221F7350a06369B73864C4047b43129G1959a14535
$$ -22979 -62120 57611 109249 293470 67350 -106369 273864 34047 -243129 71959 -114535
18789d4245A9867h6325K4391j67964l43I692d45712C60347b66773l7793J41162
$$ -44245 19867 -86325 -61934 -229898 -230241 9692 -445712 360347 -266773 -304566 -163404
18778a63404A0522g5810r568k95112J03128A40002a02939p5615B11127j04488
$$ -163404 10522 -75810 -85378 -380490 -277362 140002 -102939 -178554 211127 106639
18768A06639a86081P1495k02452a6280G5165c9144p6340b1995k0705A17346k2575
$$ 106639 -186081 -114586 -317038 -16280 75165 -39144 -115484 -21995 -42700 117346 94771
18757I4771m1009a69881A93068a07959j73976J37002g0483a4725k31965n0215
$$ 94771 53762 -169881 193068 -107959 -281935 -144933 -70483 -14725 -246690 -296905
18747b96905J38756e1503m67583C5949c4719B78250b98673A7538c33264c2484
$$ -296905 -158149 -51503 -519086 35949 -34719 278250 -298673 17538 -333264 -32484
18736a70851M3540r9172g9295K0408A4728a19391A0207P0094e9554j47749F467
$$ -170851 -127311 -226483 -79295 -58887 14728 -119391 10207 80301 -59554 -207303 6467
18724B93596a35747B74805a32400o1878J959e5463A55529g0556m3095J405A09770
$$ 293596 -135747 274805 -132400 -194278 -192319 -55463 155529 -70556 -113651 -112246 109770
18712D9372A676d6448r3443j71127f9466i677C44064b2091k55389E9967o436A1838
$$ 49372 1676 -46448 -139891 -311018 -69466 -9677 344064 -22091 -277480 59967 53531 11838
18699a76605g3910C1649h5169j29263c7339j65731F5643a82792l33668a80658
$$ -176605 -73910 31649 -85169 -214432 -37339 -203070 65643 -182792 -516460 -180658
18688a38893b1186j5971j11440e0753k70832A89930D4307i9369C37819B7498f6960
$$ -138893 -21186 -37157 -148597 -50753 -321585 189930 44307 -99369 337819 27498 -66960
18676C2892a85785d4882B0268b98824j37370B23173F4721a48039G3610a97434
$$ 32892 -185785 -44882 20268 -298824 -436194 223173 64721 -148039 73610 -197434
18665a10460Q649Q173I2932D908K7603d35009H6207B7537J16234c4812A11013
$$ -110460 -101811 -93638 92932 4908 32511 -435009 86207 27537 143771 -34812 111013
18653A01237N1474b22170D8142a56619b4579A46845b84473J32814D29693a41707
$$ 101237 152711 -222170 48142 -156619 -24579 146845 -284473 -151659 429693 -141707
18642a53755b3256j57348h5586j10461G9555M3259d06203J34959n3788a20186
$$ -153755 -23256 -180604 -85586 -196047 79555 122814 -406203 -271244 -325032 -120186
18631E0926M377d349p0342F1285K35401D3886a45928M2587j83867f1272k14949
$$ 50926 55303 -4349 -74691 61285 296686 43886 -145928 -103341 -287208 -61272 -276221
18620b76221l4099l1522a23341I0859i7378A41831a612j04828j47202a00032r4282
$$ -276221 -310320 -341842 -123341 90859 -97378 141831 -1612 -106440 -253642 -100032 -194314
18609a94314K9895G8476K67439q7818b06663A72081b09893g9769J9041A38312
$$ -194314 -164419 78476 345915 258097 -206663 172081 -209893 -79769 -60728 138312
18598A18020b49633b4645n5801j22298g4821a953k88518A84099b30546e8223A32327
$$ 118020 -249633 -24645 -80446 -202744 -74821 -1953 -290471 184099 -230546 -58223 132327
18586f1064k04876g1576K8186G3538b36936A19317m6160A1166R9511a82511C7517
$$ -61064 -265940 -71576 -43390 73538 -236936 119317 73157 11166 110677 -182511 37517
18574A07848a12379D6605J1838a1433A02603b59627j63372a19034p111o5337B0860
$$ 107848 -112379 46605 58443 -11433 102603 -259627 -422999 -119034 -126145 -191482 20860
18562B07821a1850B3979b79525P0735k7791M3134M248B90829A426J25106A845
$$ 207821 -11850 23979 -279525 -208790 -236581 -193447 -189199 290829 1426 126532 1845
18550b83677A35279a75016b6397j45870B8848i9230m7465E9075d3739k79701J06608
$$ -283677 135279 -175016 -26397 -172267 28848 -99230 -146695 59075 -43739 -323440 -216832
18539b16832F2895a03479E886b76759b1628r0278A4279b95564a18195B34976b18449
$$ -216832 62895 -103479 5886 -276759 -21628 -111906 14279 -295564 -118195 234976 -218449
18527g2159m6626k09378B8071c18850B12058I3871A8860J98482K093b01911h2315
$$ -72159 -118785 -328163 28071 -318850 212058 93871 18860 217342 219435 -201911 -82315
18515I5820b17374g3738o4758k72324a82405B00073h2361A4008J72642A0052b61142
$$ 95820 -217374 -73738 -138496 -410820 -182405 200073 -82361 14008 186650 10052 -261142
18503G4975C0453a74704D0039O2321c2559A24437c6225j55238K1593k7296A42608
$$ 74975 30453 -174704 40039 102360 -32559 124437 -36225 -191463 -169870 -197166 142608
18491B82867B8161L04822m8735A0265f5949C24815C6866K45627b20398g109k52034
$$ 282867 28161 332983 284248 10265 -65949 324815 36866 282493 -220398 -7109 -259143
18480b59143a961B28903a60749A01164a64870c9724k68319A60252a29427A60330
$$ -259143 -1961 228903 -160749 101164 -164870 -39724 -308043 160252 -129427 160330
18469B4419c347o0390j55064R8476C16063A53973b96931C85655b36237B02236
$$ 24419 -3347 -63737 -218801 -120325 316063 153973 -296931 385655 -236237 202236
18458B4816b63130Q469I87Q6602b50520A31286a73861B75509a26431a2531k11125
$$ 24816 -263130 -254661 987 87589 -250520 131286 -173861 275509 -126431 -12531 -223656
18447b23656A75464G7361b70879J32749B42633n2345A6587i6354D3567d44117
$$ -223656 175464 77361 -270879 -138130 242633 190288 16587 -96354 43567 -444117
18436D6231c5433B28128g0757r4484h792k8045j0385A91391G3213O028R4615b78232
$$ 46231 -35433 228128 -70757 -165241 -8792 -36837 -47222 191391 73213 79241 173856 -278232
18423b868l55348E4215J8788a93832k71775K29617i9394B80J32350D7345b35228
$$ -2868 -358216 54215 73003 -193832 -465607 -235990 -99394 280 132630 47345 -235228
18411F1296a77391l685A1943g6j59555j9269c6337l33032a3310m6842j37863O1814
$$ 61296 -177391 -181076 11943 -76 -159631 -178900 -36337 -369369 -13310 -60152 -198015 -136201
18399a36201N6680B29483a51694B57324m6196c93248C3674i4086E7541b46960
$$ -136201 -79521 229483 -151694 257324 211128 -393248 33674 -94086 57541 -246960
18388G7287K46041A46814b92381A97069h1456j93611i6287b0145j71172B91870
$$ 77287 323328 146814 -292381 197069 -81456 -275067 -96287 -20145 -191317 291870
18377C7050K18465c09170a03960M9156A57021b6946G1766a53371L8667K9068L4147
$$ 37050 255515 -309170 -103960 -54804 157021 -26946 71766 -153371 -114704 -85636 -51489
18366e1489A99795L7994b89629h2896J9745H8212e0013j01408a1435j18779B7630
$$ -51489 199795 237789 -289629 -82896 -63151 88212 -50013 -151421 -11435 -130214 27630
18354a09479a3440l6628k7465j08282J8529o248B3626a1998H5934J70453C616
$$ -109479 -13440 -50068 -77533 -185815 -167286 -173534 23626 -11998 85934 256387 3616
18342D8711d86582I1433i6009n3322L4888J9517a7305B92739b1302C01927j44326
$$ 48711 -486582 91433 -96009 -149331 -114443 -94926 -17305 292739 -21302 301927 157601
18331A57601c18093K1945C3915M6888i5346A46646o1528K16466l5031I2529a09505
$$ 157601 -318093 -296148 33915 80803 -95346 146646 85118 301584 266553 92529 -109505
18319B1614b80893i1475K0108I5296a6695A06503J4476j2530b29960B94502A28609
$$ 21614 -280893 -91475 -71367 95296 -16695 106503 120979 108449 -229960 294502 128609
18307b07984o7256C4480J88356n1520o4943N5863b09859c2570B4117J03125i7401
$$ -207984 -275240 34480 222836 171316 106373 162236 -209859 -32570 24117 127242 -97401
18295E6999a65291k878E8077c007H9076O3289a73421c0567A52215f4788j44275
$$ 56999 -165291 -168169 58077 -3007 89076 152365 -173421 -30567 152215 -64788 -209063
18284b09063B79112a15575c8823B19662M935A02215c11775H0381a46881j08381
$$ -209063 279112 -115575 -38823 219662 224597 102215 -311775 80381 -146881 -255262
18274b55262J00241l9021I77g2473B82267N1836a7514l8291E6100N2023d7244
$$ -255262 -155021 -194042 977 -72473 282267 334103 -17514 -55805 56100 108123 -47244
18262c68857c5168k51062F3450b7550k78211f3474j13746J9921e9072j53867O754
$$ -368857 -35168 -286230 63450 -27550 -305761 -63474 -177220 -157299 -59072 -212939 -206185
18251b06185l6520H5309d616m2660k44300I6586e9437D136P8573a5663q802l80169
$$ -206185 -242705 85309 -4616 -47276 -291576 96586 -59437 4136 82709 -15663 -24465 -404634
18239d04634e4170H9765e1500p7194b6398l99976a53987F8818c22859B75342r0025
$$ -404634 -54170 89765 -51500 -128694 -26398 -426374 -153987 68818 -322859 275342 185317
18228A85317a15981r7295e0607H7121q6a11961A19241c13311g580j85789m234
$$ 185317 -115981 -213276 -50607 87121 87035 -111961 119241 -313311 -7580 -193369 -197603
18217a97603A86016a64332C05281b57490A32079a16039j46721C6040J4660a46067
$$ -197603 186016 -164332 305281 -257490 132079 -116039 -262760 36040 50700 -146067
18206B3051b90380B47516c10119d0573j60607O175B6577a2596j75638j0442j56925
$$ 23051 -290380 247516 -310119 -40573 -201180 -195005 26577 -12596 -188234 -198676 -355601
18195c55601A57961a98214B82980a2961C28338d1910M682A29944c22353A41070
$$ -355601 157961 -198214 282980 -12961 328338 -41910 -37228 129944 -322353 141070
18184g3165L41A60761L3117D5325O2861D3353b88935A9053a40631O274a6961k72550
$$ -73165 -72824 160761 193878 45325 108186 43353 -288935 19053 -140631 -134357 -16961 -289511
18172b89511c1411B96585b48746e6796k05911i1248j87474J17658P8110k15533
$$ -289511 -31411 296585 -248746 -56796 -262707 -91248 -278722 -161064 -82954 -298487
18162b98487F5050b33159D6034K6982O9574A4041k76a84164H0689b61172e3796
$$ -298487 65050 -233159 46034 73016 142590 14041 13765 -184164 80689 -261172 -53796
18150b42949e8073k30003d5463C97611a9271j0915j04091p9735C84932B5067a92003
$$ -242949 -58073 -288076 -45463 397611 -19271 -30186 -134277 -214012 384932 25067 -192003
18138B17273c78786a01344B03682D5065a04144D3914J26486a18104K5390r6638
$$ 217273 -378786 -101344 203682 45065 -104144 43914 170400 -118104 -92714 -189352
18128a89352J2190P2236d630B2013g6773D3488j2069q431b94936B58751F9363
$$ -189352 -177162 -104926 -4630 22013 -76773 43488 31419 22988 -294936 258751 69363
18116b20555j5979A51618Q8182c10839e6116j48293j06101a16239D8568b51212
$$ -220555 -236534 151618 239800 -310839 -56116 -204409 -310510 -116239 48568 -251212
18105B7071Q9317A5840g3757n852k04582A6076J14833A3455b39285a17624I9591
$$ 27071 116388 15840 -73757 -79609 -284191 16076 130909 13455 -239285 -117624 99591
18093a80392p5172b5109B2741a56793k464l62575C36645c7787B6251d1310A52959
$$ -180392 -255564 -25109 22741 -156793 -159257 -521832 336645 -37787 26251 -41310 152959
18081A8460L3921J01127c11446C20013g9829A73291H0986a49631l7283c0191j20107
$$ 18460 52381 153508 -311446 320013 -79829 173291 80986 -149631 -186914 -30191 -150298
18070a50298A49953o5665c26394g9155p4553b7562C26287D8049c26762A0214J95555
$$ -150298 149953 84288 -326394 -79155 -153708 -27562 326287 48049 -326762 10214 205769
18059B05769a87126A83802C6543M4616b19229a7613j71454f5306k79287A03611
$$ 205769 -187126 183802 36543 81159 -219229 -17613 -189067 -65306 -344593 103611
18048a21556A57519c10400J22619n3179M8248i2158l16347D4463a57891M7987
$$ -121556 157519 -310400 -187781 -240960 -192712 -92158 -408505 44463 -157891 -109904
18038a09904C34458F4427b12776e4587k99523b4526B46950a7924q9041E16033
$$ -109904 334458 64427 -212776 -54587 -354110 -24526 246950 -17924 -106965 516033
18027A5891a62115D5565a13325j50107c3565B8737i7346b0412A01839N839D3791
$$ 15891 -162115 45565 -113325 -263432 -33565 28737 -97346 -20412 101839 107678 43791
18015d6029j97437A09998a59227f4035B10152f0810G8750N6220a74783G6865L12738
$$ -46029 -243466 109998 -159227 -64035 210152 -60810 78750 134970 -174783 76865 389603
18004C89603b69493A47212b67747A32890K1489C3566a52806n06616b84683G0436
$$ 389603 -269493 147212 -267747 132890 154379 33566 -152806 -659422 -284683 70436
17993a60772A61115C1830h6165j19296C28562j31546r5889c57796H996R7627D8261
$$ -160772 161115 31830 -86165 -205461 328562 197016 101127 -357796 8996 106623 48261
17981a19182M56J2608k1076G8321a3240j22989j00952G039J71332a55951j32487
$$ -119182 -118726 -106118 -127194 78321 -13240 -136229 -237181 7039 178371 -155951 -288438
17970b88438Q9257N0653A34511b85618H7835a07708d508B29919b04833D53976
$$ -288438 -199181 -148528 134511 -285618 87835 -107708 -4508 229919 -204833 453976
17959I0126a19242B2893c85919B04832A645O4764b03982B2954b66474a24433B7251
$$ 90126 -119242 22893 -385919 204832 1645 66409 -203982 22954 -266474 -124433 27251
17947g4844m403c1217n7639A75521J757L7437a052p6613K3370D9804l659e556
$$ -74844 -79247 -31217 -88856 175521 177278 214715 -1052 -77665 -54295 49804 46145 -5556
17934a8894l62819I7567P2049c9870l01943A45768g5300p8781A51837J17930c8067
$$ -18894 -381713 97567 169616 -39870 -341813 145768 -75300 -154081 151837 269767 -38067
17922a6237m21077F7743C302M6518K49560G5209l008c43718A14574j4753c87252
$$ -16237 -437314 67743 3302 49820 299380 75209 72201 -343718 114574 99821 -387252
17910d28959c5605A32101P4416j8863q7736a55289D12377F2422A8595b74232a7723
$$ -428959 -35605 132101 206517 187654 99918 -155289 412377 62422 18595 -274232 -17723
17898b83846E3275g5398B39208i9068l3160a3121j6552B37382a15399q7264F4850
$$ -283846 53275 -75398 239208 -99068 -132228 -13121 -29673 237382 -115399 -202663 64850
17886c5173A46372L2604E2043b89988R7911j74008b2476j57466j48252J30644
$$ -35173 146372 178976 52043 -289988 -192077 -366085 -22476 -179942 -328194 -197550
17876a97550A83139b33965O3134m4904P5266B21399G3219a74098Q238j39557B380
$$ -197550 183139 -233965 -170831 -215735 -140469 221399 73219 -174098 -165860 -305417 2380
17864E1379J73165j3165b87393j71926H5507j1757b29230f5355j07469Q009e7521
$$ 51379 224544 211379 -287393 -459319 85507 73750 -229230 -65355 -172824 -164815 -57521
17852b21015d094A09635G104R4346J8740b35823b8742k44461r6392H2109a08043
$$ -221015 -4094 109635 7104 101450 120190 -235823 -28742 -273203 -369595 82109 -108043
17840D765O4715f2762C15327g1388I2024M7007a04827m0516j98614A11985E2886
$$ 4765 69480 -62762 315327 -71388 92024 139031 -104827 -145343 -343957 111985 52886
17828A9769J38521a97634A70837e8029n2699J895A15332a69809r6371O0402A01090
$$ 19769 158290 -197634 170837 -58029 -110728 -108833 115332 -169809 -266180 -205778 101090
17816A00329a18316p3052a2151j75090A16614i4675E10a82982A32331a75666j23384
$$ 100329 -118316 -191368 -12151 -187241 116614 -94675 510 -182982 132331 -175666 -299050
17805b99050a28734k9365A82545c19832d9484A06143a86381A41422J5716a2413
$$ -299050 -128734 -158099 182545 -319832 -49484 106143 -186381 141422 157138 -12413
17794F3375Q1896d8643A93125p7875C5849K86995a00391J4269C7154a29617G2787
$$ 63375 145271 -48643 193125 115250 35849 322844 -100391 -86122 37154 -129617 72787
17782a93993B71627m154A5344b29072a03018A6045b67526k5307D1146K23989A28612
$$ -193993 271627 267473 15344 -229072 -103018 16045 -267526 -292833 41146 265135 128612
17770B58008j17399k1036a12421j62867J07224A39072e5594A90694n6058a54155
$$ 258008 140609 119573 -112421 -275288 -168064 139072 -55594 190694 134636 -154155
17759E4962g0709A39352m5210m4913j12L1052i5334j02549K7731g3153H3837L08402
$$ 54962 -70709 139352 94142 49229 49117 80169 -95334 -197883 -170152 -73153 83837 392239
17747C92239A59420K39570j94144h6674l14871A6592b08477G7883C2822J37864
$$ 392239 159420 398990 204846 -86674 -401545 16592 -208477 77883 32822 170686
17737A70686G2603J4824J05222P133O1172A2556a18549B06783D5947i5206I0285
$$ 170686 72603 87427 192649 199782 260954 12556 -118549 206783 45947 -95206 90285
17725a35928n423A17864a56831A16655a15314r5103c5404n3726K4082a6661A18206
$$ -135928 -141351 117864 -156831 116655 -115314 -210417 -35404 -89130 -65048 -16661 118206
17713a29157J4857b7366j51183k57795a34102p6767d7529C7007c4211A362a08972
$$ -129157 -114300 -27366 -178549 -436344 -134102 -210869 -47529 37007 -34211 1362 -108972
17701b32319B7612J4893a94028c5214B07030N1255E6396a29473o9695c2819L12
$$ -232319 27612 42505 -194028 -35214 207030 258285 56396 -129473 -199168 -32819 -32507
17690c2507l9277k72115J60583G0404K19869a13563A95971l6109a38702B91937
$$ -32507 -71784 -343899 -183316 70404 290273 -113563 195971 159862 -138702 291937
17679b15648B23403E7618c9807k1632d175A85174a43082j61146d8107H7365i3008
$$ -215648 223403 57618 -39807 -61439 -4175 185174 -143082 -304228 -48107 87365 -93008
17667A9222K50947a5755A26730i8239j72489E9945Q3915d1444A70851b21662H3070
$$ 19222 270169 -15755 126730 -98239 -270728 59945 143860 -41444 170851 -221662 83070
17655b91416E2980a20931m593e0973C6103K16594j03171h4361A92900a52949C34414
$$ -291416 52980 -120931 -125524 -50973 36103 252697 149526 -84361 192900 -152949 334414
17643i5435M2554A9527P7179b53984a12196B05979k6842B7120h7891A67460A2752
$$ -95435 -52881 19527 96706 -253984 -112196 205979 179137 27120 -87891 167460 12752
17631c6504k9967o319I673c4732A00334h6764j05594d3938o6320C6937J76105
$$ -36504 -66471 -72790 9673 -34732 100334 -86764 -192358 -43938 -110258 36937 213042
17620B13042g4606A41880b70472a03277A17957D0375a75244P6015A3099K0620
$$ 213042 -74606 141880 -270472 -103277 117957 40375 -175244 -99229 13099 33719
17610C3719J6921i7658A37650J34646A22467D384b13628C36244A26378g9841n9131
$$ 33719 50640 -97658 137650 272296 122467 4384 -213628 336244 126378 -79841 -138972
17599a38972c5565A91220d1181A38528n4671C5472c7046i620A42467a66111d5030
$$ -138972 -35565 191220 -41181 138528 83857 35472 -37046 -9620 142467 -166111 -45030
17587f3356l0835d0041r899k66106C3735D014J56934h0931G1860n158J5206j6546
$$ -63356 -94191 -40041 -49940 -316046 33735 4014 160948 -80931 71860 66702 81908 65362
17575F5362a17347B5720J21679c93867D9435K16364f5263j18973A9878J90183
$$ 65362 -117347 25720 147399 -393867 49435 265799 -65263 -184236 19878 210061
17565B10061F1410h1103f078B94184A549K80530a14890B3195d4756B2138e2497
$$ 210061 61410 -81103 -6078 294184 1549 282079 -114890 23195 -44756 22138 -52497
17553i556D4053J20571D0709A8318d8896D7251a8593A65003D1664g0179L4905
$$ -9556 44053 164624 40709 18318 -48896 47251 -18593 165003 41664 -70179 -35274
17542c5274e537o5022A27782b21572a7066j19719A54053n5974Q4200b5741m5012
$$ -35274 -5537 -70559 127782 -221572 -17066 -136785 154053 98079 182279 -25741 -70753
17531g0753j3668J0678A69914C7864h4332A04383O4794l1031J42181A06267a54915
$$ -70753 -84421 -73743 169914 37864 -84332 104383 169177 138146 280327 106267 -154915
17519D76312j04781l1041A55279h9021A3333K59366A08575m2609J68906D7441
$$ 476312 371531 340490 155279 -89021 13333 272699 108575 65966 234872 47441
17508A72181J11389I090N0106Q6915g3048G9356P297a71657d0507A94064G0690
$$ 172181 283570 9090 59196 146111 -73048 79356 86653 -171657 -40507 194064 70690
17496a94878Q2059A27388n5188i0627j24370G4799K09486b03942R337A49156F7788
$$ -194878 -112819 127388 72200 -90627 -214997 74799 284285 -203942 -194605 149156 67788
17484A57843m9069B8033a60289A74814i115B82643a78340C140N9372f6262B19509
$$ 157843 108774 28033 -160289 174814 -9115 282643 -178340 3140 62512 -66262 219509
17472H7429j788J11513O6194A04157N3101J07074J68678C7522a65382A59417N9284
$$ 87429 85641 197154 263348 104157 157258 264332 433010 37522 -165382 159417 218701
17461B18701E8137K27617J681J23509H671J35798J86496A40938d9673B28265E915
$$ 218701 58137 285754 287435 410944 8671 144469 330965 140938 -49673 228265 5915
17449C56362J01805J29612k09963j39159J98241A04459J71339A0226M30342I6544
$$ 356362 458167 587779 377816 238657 436898 104459 275798 10226 440568 96544
17438I2143J32853q0175i0793F70398A06411K2781O5651L12573d3355B22992a85726
$$ 92143 224996 144821 -90793 670398 106411 129192 194843 507416 -43355 222992 -185726
17426c2625D7003J98198a38186F2528L63564j15043I3931K16211r9047J94684
$$ -32625 47003 245201 -138186 62528 426092 311049 93931 310142 211095 405779
17416D05779k02557m5291Q7327J57985q0188K04885G7084l1619a7181B68929A8308
$$ 405779 203222 157931 245258 403243 323055 527940 77084 45465 -17181 268929 18308
17404A13013l5854a74851F0122m423a12821D13706j57966e3133J7867H5783c84945
$$ 113013 77159 -174851 60122 55699 -112821 413706 255740 -53133 -35266 85783 -384945
17392B77131h2769C49223E1251J49361C2810R9119J73985B8682J92037C6139n644
$$ 277131 -82769 349223 51251 200612 32810 131929 305914 28682 220719 36139 30495
17381C0495R5243a7476k88157J38105A55755O5329A00434J29820C5185J73444
$$ 30495 125738 -17476 -305633 -167528 155755 221084 100434 230254 35185 208629
17371B08629b445G0913N06977B37962D9796e0605H2454b1362A62983L0683j0875
$$ 208629 -2445 70913 577890 237962 49796 -50605 82454 -21362 162983 193666 182791
17360A82791M2653p701I2936K04294A47118J92122k7006a24974E1467K42367A11550
$$ 182791 225444 217743 92936 297230 147118 339240 312234 -124974 51467 293834 111550
17348f5806J1068C9452J89000l7151j8414F7319J93010m4018c37742A18726a46000
$$ -65806 -54738 39452 228452 191301 172887 67319 260329 216311 -337742 118726 -146000
17336C1186J70066M13044A94961b3832A83284h422A79140a07625B06615K14902
$$ 31186 201252 614296 194961 -23832 183284 -8422 179140 -107625 206615 421517
17326D21517e4852A7687J94984J4643d1141D7224J37099m0562a30001B02306D5215
$$ 421517 -54852 17687 212671 227314 -41141 47224 184323 143761 -130001 202306 45215
17314A13325J90270a72931A50728a88046I5487J93595a64268A39165f334A03971
$$ 113325 303595 -172931 150728 -188046 95487 289082 -164268 139165 -6334 103971
17303A34585b3029C11271a01169j53380J14818A57366a55075A53764P6739K6619
$$ 134585 -23029 311271 -101169 -254549 -139731 157366 -155075 153764 230503 257122
17293B57122q2600j9965N29284A88623J64563j01151d3683j84185B42685m7417
$$ 257122 174522 154557 683841 188623 353186 252035 -43683 -227868 242685 195268
17283A95268J07222G0710C4588J41357R8068E969K70561n8492J26234f2801q6339
$$ 195268 302490 70710 34588 175945 274013 5969 276530 218038 344272 -62801 -149140
17272a49140C96241A04720a18893B35166b18466B80388k13C5336j1364L34452
$$ -149140 396241 104720 -118893 235166 -218466 280388 280175 35336 23972 358424
17262C58424b818A70006L03953D096L96904a3857l29872a2407C84004K8781A26129
$$ 358424 -2818 170006 473959 4096 401000 -13857 -343729 -12407 384004 412785 126129
17250a36008A59634M8386A03978J71413d7166m9381B40567b03398A96353K34134
$$ -136008 159634 208020 103978 275391 -47166 -96547 240567 -203398 196353 430487
17240D30487A58960l4746D0768J75833a64117C35724k0368c4969A39689n1045
$$ 430487 158960 124214 40768 216601 -164117 335724 315356 -34969 139689 88644
17230H8644J56022D4451C446L11792J65815k28959O353Q6443A13921J68786e7349
$$ 88644 244666 44451 3446 315238 481053 252094 258447 344890 113921 282707 -57349
17218a35098A69931g0393J6952A19025D5740L00981A21838J70020j3777A35321
$$ -135098 169931 -70393 -53441 119025 45740 346721 121838 291858 278081 135321
17207E376O0592K26674M8487p8688A9041r6J75930p3465g817B3198J1010L42374
$$ 5376 65968 292642 341129 262441 19041 18945 194875 121410 -7817 23198 34208 376582
17195C76582p9382j31336L01332j67785G6276J4221M28038B32930a3266B94551
$$ 376582 297200 165864 467196 299411 76276 90497 518535 232930 -13266 294551
17184H0972K94703A38585M6049l1689r233K16588A30358a5043C32275H4456J56750
$$ 80972 375675 138585 184634 152945 143712 360300 130358 -15043 332275 84456 241206
17173B41206o819M9056N3961O9025j80723c403B53087K84809i8734D83742j73005
$$ 241206 234387 283443 337404 406429 225706 -3403 253087 537896 -98734 483742 310737
17162C10737J73312J40390A87006D2269f196A64691O4985F7044K26193J75134
$$ 310737 484049 624439 187006 42269 -6196 164691 229676 67044 293237 468371
17152D68371j77206g4010D12836j33037j33417J02505J79j9564f5090B87824j36294
$$ 468371 291165 -74010 412836 279799 146382 248887 249066 229502 -65090 287824 151530
17141A51530N0027m2114L96293A43719F0826M22760A75877M21121A97105K53467
$$ 151530 201557 159443 555736 143719 60826 483586 175877 596998 197105 450572
17131D50572j44264O294A24100M9572M6655K45859H0502L80706B2415J4436M67845
$$ 450572 306308 312602 124100 173672 220327 466186 80502 461208 22415 36851 504696
17120E04696A96363g2094C24113P6841J5524L2310j34348l6242J15819j72319
$$ 504696 196363 -72094 324113 400954 416478 448788 314440 278198 394017 221698
17110B21698N3217Q5638p8051M8545A18560M00854k43451N3006j51494L99536
$$ 221698 274915 360553 282502 331047 118560 519414 275963 328969 177475 577011
17100E77011k42903L7535j38515l3540J2045J64140p8475O4667o3327c6442B97729
$$ 577011 334108 371643 233128 199588 211633 375773 297298 361965 298638 -36442 297729
17088B00638N36481G6066J33839P4231K04161k21876J78530B12569h128C78682
$$ 200638 737119 76066 209905 284136 488297 266421 444951 212569 -8128 378682
17077B54951L50611j44570L0786A42695P1373J03268F555M02932j06306k5683
$$ 254951 605562 460992 491778 142695 214068 317336 6555 409487 303181 277498
17067B77498J44915K01553A51626K85829M7783q1513j14654O8867K11869j90830
$$ 277498 422413 623966 151626 437455 485238 403725 289071 357938 569807 378977
17057C78977J75194H7445L96134J58671j40368A70510N31063j8631j46022j24635
$$ 378977 554171 87445 483579 642250 501882 170510 701573 682942 536920 412285
17047D12285L08243l8126m4219Q7164k03112k07194J49989J94319k20699J79715
$$ 412285 720528 682402 638183 725347 522235 315041 465030 659349 438650 618365
17037F18365B96450K42496j37792J59840O6924k78285M03152l64794M4844j34788
$$ 618365 296450 538946 401154 560994 627918 349633 752785 387991 432835 298047
17027B98047a5036G43649j58446j83928K53522j34499K56567l56499M31311j53943
$$ 298047 -15036 743649 585203 401275 654797 520298 776865 420366 851677 697734
17017F97734q316l1224o1128N6672l0414k11033K16716k35977J58256k11580K28843
$$ 697734 689418 658194 597066 653738 623324 412291 629007 393030 551286 339706 568549
17006E68549B60003L59198Q8674J34969j94626k78891J39485K52888N9683J0615
$$ 568549 260003 619201 707875 842844 648218 369327 508812 761700 821383 831998
16996H31998R6258l84808N726M7910R7736K17435l58648k13638M28434Q7188N9319
$$ 831998 928256 543448 549174 597084 694820 912255 553607 339969 768403 855591 914910
16985I14910j79041C25441M04156j58209l2000J82671K23545l06550L46164l70867
$$ 914910 735869 325441 729597 571388 539388 722059 945604 639054 985218 614351
16975F14351Q1849L7348l43345K26697O7251o4804L7646L71733m67415K40584
$$ 614351 696200 733548 390203 616900 684151 619347 656993 1028726 561311 801895
16965H01895O9470K63684k52533M9245r9834O4234p4261k98727O48465m18710
$$ 801895 871365 1135049 882516 931761 831927 896161 821900 523173 1171638 752928
16955G52928N88768l41066o5949R6402l86539L43460p0189j09921j37384N49682
$$ 752928 1341696 1000630 934681 1031083 644544 988004 917815 807894 670510 1220192
16945A220192k35124J06709k62082J79841J22234Q6994k66773l5510K10244k49877
$$ 1220192 985068 1091777 829695 1009536 1131770 1218764 951991 916481 1126725 876848
16935H76848M01194J1393N9372k71125J52972j08918L03299o68627L65751j11713
$$ 876848 1278042 1289435 1348807 1077682 1230654 1121736 1425035 756408 1122159 1010446
16925A010446M47868J3206o13602K94016K6493L34821m12659K85024k24483L66630
$$ 1010446 1458314 1471520 857918 1151934 1178427 1513248 1100589 1385613 1161130 1527760
16915A527760m75314K16455M1273j3517J68207k78873N22061q9489k29006k8255
$$ 1527760 1052446 1268901 1310174 1296657 1464864 1185991 1708052 1618563 1389557 1361302
16905A361302L05923k58025J80838K3432J28132k06003R0312k51373Q1307k7629
$$ 1361302 1667225 1409200 1590038 1613470 1741602 1535599 1625911 1374538 1455845 1428216
16895A428216K78396j14667L2287k0458N8419M51838k12867n21683L98341K39937
$$ 1428216 1706612 1591945 1624232 1603774 1662193 2114031 1901164 1379481 1777822 2017759
16885B017759o5416j01512j10819M01179l69900j73261O94798j40075m64444M02941
$$ 2017759 1952343 1850831 1740012 2141191 1771291 1598030 2292828 2152753 1688309 2091250
16875B091250K03305J21867p23887Q08691k19964N659l21742M80733j57148J00091
$$ 2091250 2294555 2416422 1692535 2501226 2281262 2286921 1965179 2445912 2288764 2388855
16865B388855k72425k6101K36019l7122L17374m171k02809l2134L69186m15643
$$ 2388855 2116430 2090329 2326348 2289226 2606600 2602429 2399620 2367486 2736672 2321029
16855B321029L95647p8038O5049K52669j60625j59143M85215l37055L82422k91732
$$ 2321029 2716676 2638638 2703687 2956356 2795731 2636588 3121803 2784748 3167170 2875438
16845B875438M12093k2900k59780N32135j20082M7040J95203r5988l43995K49748
$$ 2875438 3287531 3264631 3004851 3536986 3416904 3463944 3659147 3563159 3219164 3468912
16835C468912R9731M23579O9897l81760N87656j19689N6991r536J38806k88107
$$ 3468912 3568643 3992222 4062119 3680359 4268015 4148326 4205317 4195781 4334587 4046480
16825D046480M10482k34817O30119J17151R5065o5508J78195J38345m32615L56181
$$ 4046480 4456962 4222145 4852264 4969415 5064480 4998972 5177167 5315512 4882897 5239078
16815E239078L79264M5149J3891K76309K08795l04996K76348J02501J15628L22621
$$ 5239078 5618342 5663491 5677382 5953691 6162486 5857490 6133838 6236339 6351967 6674588
16805F674588K43428P5670L1121p1844P37527k75200K78746J15682O09986k37279
$$ 6674588 6918016 6993686 7024807 6952963 7690490 7415290 7694036 7809718 8419704 8182425
16795H182425L81537N2463M46536J95374L46635p3981L45768N41202L22601l08692
$$ 8182425 8563962 8616425 9062961 9258335 9604970 9530989 9876757 10417959 10740560 10431868
16785A0431868Q89951J54727M59831J98182L28129O27896R9629Q82045J12420
$$ 10431868 11321819 11476546 11936377 12134559 12462688 13090584 13190213 14072258 14184678
16776A4184678L50948L79234O57754L62292M06632P51287M77382Q64101N68309
$$ 14184678 14535626 14914860 15572614 15934906 16341538 17092825 17570207 18434308 19002617
16767A9002617P84823Q27278L64013J480489P25057O72467J104440J054500J325256
$$ 19002617 19787440 20614718 20978731 22459220 23184277 23856744 24961184 26015684 27340940
16758B7340940O93198J397607J306585J707176J296798J719095J700143J980046
$$ 27340940 28034138 29431745 30738330 32445506 33742304 35461399 37161542 39141588
16750C9141588J652663K396484K143309K419494K871179K432984L342247K899788
$$ 39141588 40794251 43190735 45334044 47753538 50624717 53057701 56399948 59299736
16742E9299736L563666L642893L898572M553391M495325N073842N063843N485943
$$ 59299736 62863402 66506295 70404867 74958258 79453583 84527425 89591268 95077211
16734I5077211O342809O187034O822966P174655P267078Q133701P531653Q176092
$$ 95077211 101420020 107607054 114430020 121604675 128871753 137005454 144537107 152713199
16726A52713199P817480P785550P507841P089051N978382N059159L809825K856713
$$ 152713199 160530679 168316229 175824070 182913121 188891503 193950662 197760487 200617200
16718B00617200J174092k74911j263738l444602m364383n110746o709198o908216
$$ 200617200 201791292 201516381 200252643 196808041 192443658 187332912 180623714 173715498
16710A73715498p934099p400542q413172p907554q222800p769515p590864p017240
$$ 173715498 165781399 158380857 149967685 142060131 133837331 126067816 118476952 111459712
16702A11459712o596749o229344o194551n279465n711438m689182m486148m013417
$$ 111459712 104862963 98633619 92439068 87159603 81448165 76758983 72272835 68259418
16694F8259418l896753l748056l355593l304196k712380k811330k590431k182132
$$ 68259418 64362665 60614609 57259016 53954820 51242440 48431110 45840679 43658547
16686D3658547j979062k386319j738686j552960j803859j710996j628792j157722
$$ 43658547 41679485 39293166 37554480 36001520 34197661 32486665 30857873 29700151
16678B9700151j263807j363869j163076r40366r24610j169525p78894n67822o92109
$$ 29700151 28436344 27072475 25909399 24969033 24044423 22874898 22096004 21528182 20836073
16669B0836073j278219n80657p59938n87134n34250l71255j196556k13477m53052
$$ 20836073 19557854 18977197 18217259 17630125 17095875 16724620 15528064 15314587 14861535
16660A4861535n05666o86482k87027l78090l12608o80607l19238m58636m866l62294
$$ 14861535 14355869 13669387 13382360 13004270 12691662 12011055 11691817 11233181 11228315 10866021
16650A0866021l59732n28979l9063k47398n46396j99424k59244K4497j58974n67389
$$ 10866021 10506289 9977310 9938247 9690849 9144453 8945029 8685785 8710282 8551308 7983919
16640G983919j5040l01439j76070n9581j62654l14292K40372l87474n1863o97779
$$ 7983919 7968879 7667440 7491370 7431789 7269135 6954843 7195215 6807741 6755878 6058099
16630F058099Q2682j5350k98883P1220J31426n87750M5365j37927m6975k44920
$$ 6058099 6140781 6125431 5826548 5897768 6029194 5441444 5486809 5348882 5301907 5056987
16620E056987M7562J44243j51362o26186J46874m7520k80010O9522k41341m4530
$$ 5056987 5104549 5248792 5097430 4471244 4618118 4570598 4290588 4360110 4118769 4074239
16610D074239K3642p9940j833P5866j46368n14815L03902k23075n8837m50882
$$ 4074239 4097881 4017941 4016108 4091974 3945606 3430791 3734693 3511618 3452781 3001899
16600C001899L61025j20188Q5065J26849l16510K56839k80483J73868j63236j17234
$$ 3001899 3362924 3242736 3327801 3454650 3138140 3394979 3114496 3288364 3125128 3007894
16590C007894j56877j46576k60588L78446j51454j9263k5125j03582K56818q4569
$$ 3007894 2851017 2704441 2443853 2822299 2670845 2651582 2626457 2522875 2779693 2695124
16580B695124p3171k02382r4126K64416k38957J7555k19310K44253j00515J72380
$$ 2695124 2621953 2419571 2325445 2589861 2350904 2368459 2149149 2393402 2292887 2465267
16570B465267l72383j8379L16585m85413L26358j50988n22914N21733J7169r4986
$$ 2465267 2092884 2074505 2391090 1905677 2232035 2081047 1558133 2079866 2097035 2002049
16560B002049K12910l55063j2842r7701j5788M18397n72448o4340M72079l80739
$$ 2002049 2214959 1859896 1847054 1749353 1733565 2151962 1579514 1515174 1987253 1606514
16550A606514J63025l05888J89640k09990R8200q809R3173K71410m91565n5343
$$ 1606514 1769539 1463651 1653291 1443301 1541501 1532692 1625865 1897275 1405710 1350367
16540A350367O8697L27002k06492n48008R5748L69503k15549j61970N24456l49122
$$ 1350367 1419064 1746066 1539574 991566 1087314 1456817 1241268 1079298 1603754 1254632
16530A254632K0318J23384p3504k27157n6920L10394j83739k4267J29341k09838
$$ 1254632 1274950 1398334 1324830 1097673 1040753 1351147 1167408 1143141 1272482 1062644
16520A062644j00957K73191j98291P0857J47233J18097m49554o104K67825k49626
$$ 1062644 961687 1234878 1036587 1107444 1254677 1372774 923220 917116 1184941 935315
16510I35315j22987K27706j39879j53686O9710L41702j96190j86661M3653J08927
$$ 935315 812328 1040034 900155 746469 816179 1157881 961691 775030 818683 927610
16500I27610J0506L4614K1581r392J04426l58958J64552j05714j84643K02011
$$ 927610 938116 972730 994311 984919 1089345 730387 894939 789225 604582 806593
16490H06593R1030J0665r6983K13894j46323J46688j39697j09812R6104j94R6006
$$ 806593 897623 908288 811305 1025199 878876 1025564 885867 776055 872159 871965 967971
16479I67971J36870C50543K95128O8929K77390r3644k63414K86968j89431q7009
$$ 967971 1104841 350543 645671 714600 991990 898346 634932 921900 732469 645460
16469F45460K18220l80609L08823m9194l61070N12498k45484C20122J62387R9317
$$ 645460 863680 483071 791894 742700 381630 894128 648644 320122 482509 581826
16459E81826O8437j55542q7668K17712m4344K20142k24225j15238L59211j33002
$$ 581826 650263 494721 407053 624765 580421 800563 576338 461100 820311 687309
16449F87309j01221K74828m03623J57925j74274m1686M61513j20062N900j434
$$ 687309 586088 860916 457293 615218 440944 399258 860771 740709 746609 745175
16439G45175B78098J94020j54009J69562j01888K41761j0545k30097J85717q9230
$$ 745175 278098 472118 318109 487671 385783 627544 616999 386902 572619 483389
16429D83389L9907P7512J22806J8953l56694K73733n7918J22681l04959k807K8089
$$ 483389 523296 600808 723614 742567 385873 659606 601688 724369 419410 416603 444692
16418D44692J26818j71090K09561j01237o6127j11856N16178k77298j6697B64791
$$ 444692 571510 400420 609981 508744 442617 330761 846939 569641 552944 264791
16407F07456m8859G3696M78841P8906k26810J89089k88821q8978Q2068J27271
$$ 607456 558597 73696 552537 631443 404633 593722 304901 215923 297991 425262
16397D25262m5473A58745L15841K947r5422L61814k64291B15238G6097O62399
$$ 425262 379789 158745 474586 477533 382111 743925 479634 215238 76097 738496
16387G38496l41450j4908j14067l1395K22461m9564K40940A46839J89335O3681
$$ 738496 397046 382138 268071 236676 459137 409573 650513 146839 336174 399855
16377C99855j0505E9051J62494K62623j12996A76414K11359k8303M5999j3648
$$ 399855 389350 59051 221545 484168 371172 176414 387773 359470 405469 391821
16367C91821J15639n9339Q3573k40684O2499K960J2240m348j07375d6072B72553
$$ 391821 507460 448121 531694 291010 353509 356469 368709 364361 256986 -46072 272553
16355D18409j06592J06915G2662M14292j92500l7183n921J66583j21905J35131
$$ 418409 311817 418732 72662 486954 294454 257271 251350 417933 296028 431159
16345D31159I5064O8930K44917j80734H3654J83535K29781l0475j58591L22901
$$ 431159 95064 163994 408911 228177 83654 267189 496970 466495 307904 630805
16335F30805A81788L3195k4804Q5876e4475B04575I4722K01365L64878k71650
$$ 630805 181788 214983 190179 276055 -54475 204575 94722 296087 660965 389315
16325C89315A74197i197C56790j05908J12908M9842A66535M72054j36040J5061
$$ 389315 174197 -9197 356790 250882 363790 413632 166535 638589 502549 517610
16315E17610c2403A99290K4587J73594A47173K7837K55066A16902J24338j2689
$$ 517610 -32403 199290 223877 397471 147173 175010 430076 116902 241240 228551
16305B28551a69340A34595L51941j43689o8060A30418N0533p1952h3050B52521
$$ 228551 -169340 134595 486536 342847 274787 130418 180951 108999 -83050 252521
16294D10252l712j4911J7052J43206B31420D4849J85642J18105K2682l540K06016
$$ 410252 406540 391629 408681 551887 231420 44849 230491 348596 371278 367738 573754
16283E73754C0436M45785d3444D78164H0455J39575O579K1577j14994L18417j50969
$$ 573754 30436 476221 -43444 478164 80455 220030 226609 248186 133192 451609 300640
16272C00640J65109M9754A56644E689L98157m2071A03883L0957e2356A18258K22893
$$ 300640 465749 515503 156644 5689 403846 361775 103883 134840 -52356 118258 341151
16261C41151C9931L45908A55021o1519l400O5446m1755J59951K2426b9528A52254
$$ 341151 39931 385839 155021 93502 90102 155548 113793 273744 296170 -29528 152254
16249B70572B2073N2453K77263A74220L42991k56537k2870l6376a0826C25658
$$ 270572 22073 74526 351789 174220 517211 260674 237804 201428 -10826 325658
16238A37453K22724j20018j2241p164a1315A31398a0879B49984c6060A29541a07701
$$ 137453 360177 240159 227918 220754 -11315 131398 -10879 249984 -36060 129541 -107701
16226I0169a57998C87879m387j84422A8695L60247j53547M489b5218r266j01462
$$ 90169 -157998 387879 383492 199070 18695 378942 225395 229884 -25218 -34484 -135946
16215a35946A80537J59528j64848k1094J76830f6205A6751J54144M8913j7932
$$ -135946 180537 340065 175217 154123 330953 -66205 16751 170895 219808 201876
16205B01876A00406N33101A4675K49571a9506A88740e7587A55155K9290F7451
$$ 201876 100406 633507 14675 264246 -19506 188740 -57587 155155 184445 67451
16194B44986J04960c0416D7576L55992A6246g7544C77759D5573K05831A11378
$$ 244986 349946 -30416 47576 403568 16246 -77544 377759 45573 251404 111378
16183D37246B05143Q037l7503b0170q9816A54225J77936a11595B82653a5807D22754
$$ 437246 205143 213180 175677 -20170 -109986 154225 332161 -111595 282653 -15807 422754
16171c00058B97356A27124P1371F9898K75033A02527k0499E171L61624C997J08137
$$ -300058 297356 127124 198495 69898 344931 102527 82028 5171 366795 3997 112134
16160A12134M8994g9829A77916P6506b7855A02529b81070D5380a92128g6245B51022
$$ 112134 161128 -79829 177916 254422 -27855 102529 -281070 45380 -192128 -76245 251022
16148E70908a02702r8219d5988A2467L25694j7388D2776M4922h4369j61226A23756
$$ 570908 -102702 -200921 -45988 12467 338161 320773 42776 87698 -84369 -245595 123756
16136a8903j50305N589C45899b4107B41289l8829K14325f9425J5255A40053L3894
$$ -18903 -169208 -163619 345899 -24107 241289 202460 416785 -69425 -54170 140053 173947
16125A73947j6263F0401J38075m5443N9259I6570a8963I7843H053a33095j5941
$$ 173947 157684 60401 198476 153033 212292 96570 -18963 97843 8053 -133095 -149036
16114a49036d2686J6691A82335k1708f1130a2428D23873A77821q7288J17673r3993
$$ -149036 -42686 -25995 182335 160627 -61130 -12428 423873 177821 90533 208206 114213
16103A14213Q1695K36233e0216I7968K16144J28864G8302R6009O2165F5642b50255
$$ 114213 195908 432141 -50216 97968 314112 442976 78302 174311 236476 65642 -250255
16091H6243K64055g2713m3743j4397p3214A23055L8024j2325g1364B00775i8232
$$ 86243 350298 -72713 -116456 -130853 -204067 123055 161079 148754 -71364 200775 -98232
16079a46169A0845a10609j22515B08114b190G539L20241G6770K2893e1944a8064
$$ -146169 10845 -110609 -233124 208114 -2190 7539 327780 76770 99663 -51944 -18064
16067G7635J14859a4008j18063A36030n2105a53564C3046K662a95299d3675j18538
$$ 77635 192494 -14008 -132071 136030 83925 -153564 33046 35708 -195299 -43675 -162213
16056a62213f4795B5461a9925j63481B39953d91739a91630I2523m2514e9944A19796
$$ -162213 -64795 25461 -19925 -183406 239953 -491739 -191630 92523 50009 -59944 119796
16044d9288B08611H6797K2474h8991j45715a7147j95780R1279j60870e4946A76194
$$ -49288 208611 86797 109271 -88991 -234706 -17147 -212927 -121648 -282518 -54946 176194
16032B70299a73018B87606h3544b3299A51781a64989F1953c84231I5851d5688
$$ 270299 -173018 287606 -83544 -23299 151781 -164989 61953 -384231 95851 -45688
16021a49326L4542A24218I623P3225l8324K92905A4547d24013a54658B24054M646
$$ -149326 -114784 124218 9623 82848 44524 337429 14547 -424013 -154658 224054 228700
16010B28700E5526a92576A15999b7090j77832j8203k24162A637b19573h4775j30792
$$ 228700 55526 -192576 115999 -27090 -204922 -223125 -447287 1637 -219573 -84775 -215567
15999b15567C5375J27765g2014d64E6694J45182p288F1857i0259j72794C0982
$$ -215567 35375 163140 -72014 -464 56694 201876 194588 61857 -90259 -263053 30982
15987h2268A34334a19148A51330h6354A65266n1605b1743j21399B64991A18702
$$ -82268 134334 -119148 151330 -86354 165266 113661 -21743 -143142 264991 118702
15976b02396A9161o935L8415J44630C6828a28612q4069B4454P4398f7641k7234
$$ -202396 19161 12226 50641 195271 36828 -128612 -212681 24454 98852 -67641 -94875
15965i4875m6824Q752g847k3724C25710I9888c43417C9484a3072H5217b8706j09037
$$ -94875 -141699 -132947 -7847 -31571 325710 99888 -343417 39484 -13072 85217 -28706 -137743
15953a37743l1822a4124q1529k5845j8479o6255J01080a1672F2764L7669j5398
$$ -137743 -169565 -14124 -95653 -121498 -139977 -206232 -105152 -11672 62764 100433 85035
15942H5035a61709Q70n0266B39831a40062a8263A9552g3229K4343A96484J04852
$$ 85035 -161709 -160839 -211105 239831 -140062 -18263 19552 -73229 -48886 196484 301336
15931C01336F3681B2463n268c94685a54931A96501a90196A59974a31306m7641
$$ 301336 63681 22463 17195 -394685 -154931 196501 -190196 159974 -131306 -178947
15921a78947A01203e1703f895l30831c9744D70941d9580D3976m585M4851b3461
$$ -178947 101203 -51703 -6895 -337726 -39744 470941 -49580 43976 39391 84242 -23461
15909E2412R5217a34961j9054A04827a70433A93998I0447A9291J03856n8832J9339
$$ 52412 147629 -134961 -154015 104827 -170433 193998 90447 19291 123147 64315 83654
15898H3654g5734B4744g6256c1259A33196a17560r1006K3126D9288a93762d8609
$$ 83654 -75734 24744 -76256 -31259 133196 -117560 -208566 -185440 49288 -193762 -48609
15886b29726j24978C6523L20195o8496A10746a46334H007e5033a0811j13041H6328
$$ -229726 -354704 36523 356718 288222 110746 -146334 8007 -55033 -10811 -123852 86328
15874A42918a4140o8781j59798A68896c2224j44900K0457a1843m6496k68882B33690
$$ 142918 -14140 -82921 -242719 168896 -32224 -177124 -156667 -11843 -58339 -327221 233690
15862c26915f5935m0522H7969a78313d3402G8802k4066a76916M9089F059P5062
$$ -326915 -65935 -106457 87969 -178313 -43402 78802 54736 -176916 -127827 6059 81121
15851H1121B5122c56649a51654f8266j24828e7118J8710j14361j94562h307m4994
$$ 81121 25122 -356649 -151654 -68266 -193094 -57118 -38408 -152769 -347331 -8307 -53301
15840e3301B48251a59899B47924D6429J78143a66163C3238a01922A47282c280
$$ -53301 248251 -159899 247924 46429 224572 -166163 33238 -101922 147282 -3280
15829D11059j80297b16268a9402j1439l29044B4362a12085G8028e2807A24275
$$ 411059 230762 -216268 -19402 -30841 -359885 24362 -112085 78028 -52807 124275
15818a7069A0373c0165j12296q7906Q5462l21844g7559k0008A84012i5181J9135
$$ -17069 10373 -30165 -142461 -230367 -144905 -466749 -77559 -97567 184012 -95181 -76046
15807g6046E4170J56999F0161Q7695F8383d5122a0775D37872a70610A72975a84966
$$ -76046 54170 211169 60161 147856 68383 -45122 -10775 437872 -170610 172975 -184966
15795B5946a98845h5888i484j43799K2234p2605N5275q6549a7213l8479l79297
$$ 25946 -198845 -85888 -9484 -153283 -131049 -203654 -148379 -234928 -17213 -55692 -434989
15784d34989H7586a44498n2568j476C5673O0912a34724B05238b05440i0707C2725
$$ -434989 87586 -144498 -197066 -198542 35673 96585 -134724 205238 -205440 -90707 32725
15772F1080a04535B8184M20370b19932L2582i0174k56198a37095a5855j20503
$$ 61080 -104535 28184 448554 -219932 -187350 -90174 -346372 -137095 -15855 -136358
15762a36358H8942b486F781b50888C61738A4678J50999c0028E4214g5874p883
$$ -136358 88942 -2486 6781 -250888 361738 14678 165677 -30028 54214 -75874 -83757
15751h3757b3893j40372e4713B3831J065a06331A18470c3706E74749k62762a24394
$$ -83757 -23893 -164265 -54713 23831 24896 -106331 118470 -33706 574749 311987 -124394
15739b95604R7170l6104c7211k70739f5025j27604L1370j96885A48261a71473
$$ -295604 -198434 -234538 -37211 -307950 -65025 -192629 -161259 -358144 148261 -171473
15728a86252o8500N0417C716d62255Q8380J68222d0277j51826L5068B84086A0347
$$ -186252 -254752 -204335 3716 -462255 -373875 -205653 -40277 -192103 -157035 284086 10347
15716a32979c923A8480R7458C5153d37040a86556K5894p7832j1290a08003L4298
$$ -132979 -3923 18480 115938 35153 -437040 -186556 -160662 -238494 -249784 -108003 -73705
15705g3705M023B08134A8189K75307D3145M4581b58584N1002J9658A22828i1905
$$ -73705 -69682 208134 18189 293496 43145 87726 -258584 -207582 -187924 122828 -91905
15693a8348l8902P052G6933N7398a92714h8696A42801a16643j55415I9437a67011
$$ -18348 -57250 -50198 76933 134331 -192714 -88696 142801 -116643 -272058 99437 -167011
15681e3605A2794g9636k26141a2900A47479a66823A74792b32324P1639A93885
$$ -53605 12794 -79636 -305777 -12900 147479 -166823 174792 -232324 -160685 193885
15670b88595B32582Q9347a79622B54033j20786f4314k7312B8053h794l90660b4754
$$ -288595 232582 321929 -179622 254033 133247 -64314 -91626 28053 -8794 -399454 -24754
15658a5635j82074h9563C7118J2336b0052p7477A24376a1520o4091B5839M5657
$$ -15635 -197709 -89563 37118 49454 -20052 -97529 124376 -11520 -75611 25839 71496
15647G1496d7030P038J3620A17881J40925D3750a63915H973d6700j62025A60200
$$ 71496 -47030 -39992 -26372 117881 258806 43750 -163915 8973 -46700 -208725 160200
15635A6019a32165q7199a03780a4540A40747i5897A33055M7196l3592a32154r781
$$ 16019 -132165 -219364 -103780 -14540 140747 -95897 133055 180251 146659 -132154 -141935
15624a41935l2148m4083N9180B46941c35042a55294A821b60704B46432a6631l5780
$$ -141935 -174083 -218166 -158986 246941 -335042 -155294 1821 -260704 246432 -16631 -52411
15613e2411j80313E2420c60628A71271a39194A22488j6510b51997B8581a21353
$$ -52411 -232724 52420 -360628 171271 -139194 122488 105978 -251997 28581 -121353
15602a87674B6871N4612a47346N3532l00653J29380a31739L7566a2742q4401M0059
$$ -187674 26871 81483 -147346 -93814 -394467 -265087 -131739 -94173 -12742 -97143 -57084
15591e7084l8362P645A9041J46550j0233c74663h2234D9347a57262D4924L3534
$$ -57084 -95446 -87801 19041 165591 155358 -374663 -82234 49347 -157262 44924 78458
15580G8458a30644A43038b56184l8983I0152i0718k12509B6854e6766A00105A4106
$$ 78458 -130644 143038 -256184 -295167 90152 -90718 -303227 26854 -56766 100105 14106
15568C0569b11446g6369A77923l9052a78997L6661A01357i4817k56704A13244
$$ 30569 -211446 -76369 177923 138871 -178997 -142336 101357 -94817 -351521 113244
15557d3954B37804b41102q3746A0250a54751k2985B98203a36371j45212A26480
$$ -43954 237804 -241102 -324848 10250 -154751 -177736 298203 -136371 -281583 126480
15546h9092E56585h3176o2914L6582b2230B59815a23240j13381g2892j48978M7566
$$ -89092 556585 -83176 -146090 -109508 -22230 259815 -123240 -236621 -72892 -221870 -174304
15535a74304D0457K29118d60429I958b18379b5745E5806b15069m2596a02422p55
$$ -174304 40457 269575 -460429 9958 -218379 -25745 55806 -215069 -257665 -102422 -103177
15524a03177B38586a81897P7514A31515b90582a29249j69141D6400J73936F9274
$$ -103177 238586 -181897 -104383 131515 -290582 -129249 -298390 46400 220336 69274
15513b08167a8847c881A35074O5633i8301B02092b28478l6306d9378F8266B822
$$ -208167 -18847 -3881 135074 200707 -98301 202092 -228478 -264784 -49378 68266 2822
15501B5358h184k49818d7954j9771m8202c1196A95634p3645r46d82562G3900b30841
$$ 25358 -8184 -258002 -47954 -67725 -115927 -31196 195634 121989 121043 -482562 73900 -230841
15488b15041c5254m508k67155A26776J58811G7583d15278a59122B13605b30048
$$ -215041 -35254 -39762 -306917 126776 285587 77583 -415278 -159122 213605 -230048
15477A1617a0890j95312e8988D26225A65827M0320E5787g636D3368G929L23378
$$ 11617 -10890 -206202 -58988 426225 165827 206147 55787 -7636 43368 7929 331307
15466C31307a71590I6352a83486h2609c5419B6773J55872a54833j504b1702Q060
$$ 331307 -171590 96352 -183486 -82609 -35419 26773 182645 -154833 -156337 -21702 -13642
15455a3642j10803K417A72409K94203c5691l53778f4526R586B0663h7138D2599
$$ -13642 -124445 -122028 172409 466612 -35691 -389469 -64526 -54940 20663 -87138 42599
15443a95282g8641c0095I2173c82590J38660G3667Q5648a87942B33669b88797
$$ -195282 -78641 -30095 92173 -382590 -243930 73667 159315 -187942 233669 -288797
15432b09332B92063a43327B7897O213J00032L3622E0535M6179c76415A26934b14454
$$ -209332 292063 -143327 27897 34110 134142 167764 50535 96714 -376415 126934 -214454
15420a30531A48212g7322B52361a2001k07199E6087a82320f7541A40906o3547
$$ -130531 148212 -77322 252361 -12001 -219200 56087 -182320 -67541 140906 77359
15410G7359N9614J28001c1437p6420b6395A79170m7786J1588f45j87929P9501
$$ 77359 136973 264974 -31437 -107857 -26395 179170 131384 142972 -645 -188574 -109073
15399a09073o454I1861j385i4170K2169A18566a4316E14751D7597m01a49355j36620
$$ -109073 -115527 91861 90476 -94170 -72001 118566 -14316 514751 47597 47196 -149355 -285975
15387b85975b4082A45061o5427B3463Q5825J02175r7530q655e8479j27089B51909
$$ -285975 -24082 145061 79634 23463 109288 211463 113933 105278 -58479 -185568 251909
15375A22203E9835c65963H0610J25141d9080E2891c47870B8959A0395c30914O0814
$$ 122203 59835 -365963 80610 205751 -49080 52891 -347870 28959 10395 -330914 -270100
15364b70100A1391a63319G3521h8901j5640c982F7324a5562j09456q3065P1442
$$ -270100 11391 -163319 73521 -88901 -104541 -3982 67324 -15562 -125018 -208083 -136641
15353a36641F843b59566i0178L5675j22163C2573J7667J4765i1389A12325B6879
$$ -136641 6843 -259566 -90178 -54503 -176666 32573 50240 65005 -91389 112325 26879
15341a06249N148b2124B04438b84361e4444j46225A74041N534c87097N4167A0367
$$ -106249 -101101 -22124 204438 -284361 -54444 -200669 174041 179575 -387097 -332930 10367
15329c79691e5440m4613k4768n4349A75268a56000A00255A8964L57542g8055L3852
$$ -379691 -55440 -100053 -124821 -179170 175268 -156000 100255 18964 376506 -78055 -44203
15318d4203A69163J35655h8637A27494b00606B53532a25418O837d5723C1864J16397
$$ -44203 169163 304818 -88637 127494 -200606 253532 -125418 -118581 -45723 31864 148261
15307A48261e97C29685a01374N966B6225L2407h8984j60791h8911B262i5260A12768
$$ 148261 -597 329685 -101374 -95408 26225 58632 -88984 -249775 -88911 2262 -95260 112768
15294c80252A77585h9206B16833i9957b6021A51611g8268r8367A85854a13095
$$ -380252 177585 -89206 216833 -99957 -26021 151611 -78268 -176635 185854 -113095
15283e777p22C01052A22149d79659C1512A0681i1424A23630a05601B03729F8446
$$ -5777 -6499 301052 122149 -479659 31512 10681 -91424 123630 -105601 203729 68446
15271a31306d0484o2304j45825a15135C5564R4611c208F9984b0512C5007J85437
$$ -131306 -40484 -102788 -248613 -115135 35564 130175 -3208 69984 -20512 35007 220444
15260B20444G3553b6432o8236A24061J0359J8102j7710L5370J46801R7333k5760
$$ 220444 73553 -26432 -94668 124061 134420 152522 134812 170182 316983 414316 388556
15249C88556P41565K92525m61445M69716m88700D44967A71615E494K8315f4616
$$ 388556 1130121 1422646 961201 1430917 942217 444967 171615 5494 33809 -64616
15238A68771J28156c86907G5675a23708A93799b52446k01731H7289a19113o0178
$$ 168771 296927 -386907 75675 -123708 193799 -252446 -454177 87289 -119113 -179291
15228a79291A66986P345k152E3129J16537H2115a91727F7342M4526O2857e2983
$$ -179291 166986 174331 172179 53129 169666 82115 -191727 67342 111868 174725 -52983
15216F462a30769A51161l3285P8073K3522a7260G0834h6176H0882K11738I4648
$$ 6462 -130769 151161 117876 195949 219471 -17260 70834 -86176 80882 292620 94648
15204A01565a27816d9294A5483K73271a86273H434b0168j83751I3546J58182G234
$$ 101565 -127816 -49294 15483 288754 -186273 8434 -20168 -203919 93546 251728 7234
15192B12247g7411A97880a10923G1449J77085F7458J03301L4279q7805d27644
$$ 212247 -77411 197880 -110923 71449 248534 67458 170759 205038 117233 -427644
15181a23302A71776o6309J05891E362P2815c7549j1511o4134B88017B0406K66847
$$ -123302 171776 105467 211358 5362 78177 -37549 -49060 -113194 288017 20406 287253
15170B87253a36983B3558d2451D5413a42339C13503p4873E2790M7141J28876j8037
$$ 287253 -136983 23558 -42451 45413 -142339 313503 238630 52790 99931 228807 210770
15159B10770I8314a15747C0262F467J8748J37787Q9767r5481g1601E76344F9945
$$ 210770 98314 -115747 30262 6467 25215 163002 252769 157288 -71601 576344 69945
15147C46851j70702a48901j14085g7591E00638D4483J81645B3647L58671A68695
$$ 346851 176149 -148901 -262986 -77591 500638 44483 226128 23647 382318 168695
15136C92260C7922J51221L3180L5948j26582m1705K36111o3412G0350b13031B28290
$$ 392260 37922 189143 222323 258271 131689 89984 326095 262683 70350 -213031 228290
15124B10007j0723i9341H8510g0796L0846G2793I287J23270J16885j03171o5263
$$ 210007 199284 -99341 88510 -70796 -39950 72793 9287 132557 249442 146271 81008
15113H1008i0783C19880C8258L25184e27784B18541a79182B1969d3694m4315C51206
$$ 81008 -90783 319880 38258 363442 -527784 218541 -179182 21969 -43694 -88009 351206
15101B5785J08917i6420b8662A1587J5320a51719a5326k26124a8465I4582K47722
$$ 25785 134702 -96420 -28662 11587 26907 -151719 -15326 -241450 -18465 94582 342304
15090C42304j21518d6817A97686d022A55188E8959R2456i2442A36059J98099o9144
$$ 342304 220786 -46817 197686 -4022 155188 58959 151415 -92442 136059 334158 265014
15079B65014l7001P1158B8096c99817A04200J42974r3693K5808B567h4906A06319
$$ 265014 228013 299171 28096 -399817 104200 247174 153481 179289 2567 -84906 106319
15067C16838A8300J7644K50915A1888L10288k7575A5820b53509A53327F2754J36549
$$ 316838 18300 35944 286859 11888 322176 294601 15820 -253509 153327 62754 199303
15056A99303K41646k12199i1108B65482I4109c9734B82234A8339N31065k27219
$$ 199303 440949 228750 -91108 265482 94109 -39734 282234 18339 549404 322185
15046C22185Q0024A63545f5049B5491J07040J20631B3159K29524A10343a48671
$$ 322185 402209 163545 -65049 25491 132531 253162 23159 252683 110343 -148671
15035C75991P222j36094G810a64523A14453d6709r495b0994D46789A50239J2074
$$ 375991 383213 247119 7810 -164523 114453 -46709 -56204 -20994 446789 150239 162313
15024A62313B7199K89443j04883J46772A20432L46063q8441j03438F5641N3948
$$ 162313 27199 316642 211759 358531 120432 466495 378054 274616 65641 119589
15014A19589J35195R5444F4105P2866J46658E2824L31601a52654C03284J88518
$$ 119589 254784 350228 64105 136971 283629 52824 384425 -152654 303284 491802
15004D91802k10696P5058A45465M63063B02146E9892B3942J11442O4294H3359
$$ 491802 281106 356164 145465 608528 202146 59892 23942 135384 199678 83359
14993D75720A59016L3703D2090J8037K40359m4306b6298B63828O0697B3534M45005
$$ 475720 159016 192719 42090 60127 300486 256180 -26298 263828 324525 23534 468539
14982D68539Q2352g7382A55961q414M0849a71932A53171K85305M1126A31942Q9342
$$ 468539 550891 -77382 155961 147547 188396 -171932 153171 438476 479602 131942 221284
14971B21284Q7179n615C0688K20020K13343F0351J16255L27680q3387A83795Q5477
$$ 221284 308463 302848 30688 250708 464051 60351 176606 504286 420899 183795 269272
14960B69272O1819O8874E5973N01967B00189K02533E9791J27609M1484j05366
$$ 269272 331091 399965 55973 557940 200189 402722 59791 187400 228884 123518
14950A23518J21990k448j19443K05472r4964P0564h0267A95439J14018j54112
$$ 123518 245508 243060 123617 329089 234125 304689 -80267 195439 309457 155345
14940A55345P5153L1917J17417j50429A09188J06609M377L37955A35667n0720
$$ 155345 230498 262415 379832 229403 109188 215797 220174 558129 135667 84947
14930H4947P24522B34183A11969L92427j93927A33917J79513J13210k6884E4749
$$ 84947 809469 234183 111969 504396 310469 133917 313430 426640 399756 54749
14919C85400j76016a210C73246A00882J91959i6725F1470K11145J52367A5622
$$ 385400 209384 -1210 373246 100882 292841 -96725 61470 272615 424982 15622
14908C25708q1091K91402k18467A29680K12143A15457J01871J72697j70210K22182
$$ 325708 244617 536019 317552 129680 341823 115457 217328 390025 219815 441997
14898D41997b7171A47700J82975K68618D0513K51289K4429L84844j89711k53486
$$ 441997 -27171 147700 330675 599293 40513 291802 316231 701075 511364 257878
14888B57878j19670J49778O2496F5180L46259q0434p2059M660L1948k4171D8114
$$ 257878 138208 287986 350482 65180 411439 331005 258946 263606 295554 271383 48114
14876C44928P5413j76734K46329j96282L7437j20847J14188q6819K47752B3650
$$ 344928 420341 243607 489936 293654 331091 210244 324432 237613 485365 23650
14865B0874L40029r1279P6611j0105N6684J56739j08059m5708J35931j73261K37602
$$ 20874 360903 269624 346235 336130 392814 549553 441494 395786 531717 358456 596058
14854E96058k64662I5894J7155K7344k9263N05169B47866Q9892P5480J60521A48538
$$ 596058 331396 95894 113049 140393 111130 616299 247866 337758 413238 573759 148538
14842F30445j82180m7532P5581j98923j34254M3764N035M76106C26153R5629J6525
$$ 630445 448265 400733 476314 277391 143137 186901 191936 668042 326153 421782 438307
14831D38307J53485k77382j46449J20891L24065B77454N9751K44303j21096k18252
$$ 438307 591792 314410 167961 288852 612917 277454 337205 581508 460412 242160
14821B42160M14722l19297L4771J11709J24795J38117B03346m7033K61620k857
$$ 242160 656882 337585 372356 484065 608860 746977 203346 156313 417933 415076
14811D15076K60700O7991k45069J01781k06278j33396K20509E1008L59060L19308
$$ 415076 675776 743767 498698 600479 394201 260805 481314 51008 410068 729376
14801G29376k27064A69154N05105j33478B62064J71654j34110L19150j0368j26482
$$ 729376 502312 169154 674259 540781 262064 433718 299608 618758 608390 481908
14791D81908L3701O5958n6046j60910K25551L1386k28104K62974O2192j50414
$$ 481908 515609 581567 525521 364611 590162 621548 393444 656418 718610 568196
14781E68196m0217K13908j57346P7449L6303B02984P3213K48501J29218l04153
$$ 568196 527979 741887 584541 661990 698293 202984 276197 524698 653916 349763
14771C49763J37238J26567l7523B12382K46530L26694j09130j62653K26713k80150
$$ 349763 487001 613568 576045 212382 458912 785606 676476 513823 740536 460386
14761D60386n8340J36903j1975J07814j0988p5302M0690j734N1792K02225j90813
$$ 460386 402046 538949 526974 634788 623800 548498 589188 587454 639246 841471 650658
14750F50658J91994k37078P9926N4854J26407l90332M7836O5239k26284M83164
$$ 650658 842652 605574 685500 740354 866761 476429 524265 589504 363220 846384
14740H46384k21544K24184q6119N7239k14553J64961m2176L8940J72929R4m9862
$$ 846384 624840 849024 762905 820144 605591 770552 728376 767316 940245 940339 890477
14729H90477j02894j18509J14318j4681J01354K86996n45910K1417J8433J10269
$$ 890477 787583 669074 783392 768711 870065 1157061 611151 632568 651001 761270
14719G61270m6518j10204J30583j61031L16136q1407r5645K1410J166P6331j39650
$$ 761270 714752 604548 735131 574100 890236 808829 713184 734594 735760 812091 672441
14708F72441L4291P3800K3003M04448m50548J94108j89788K27466k51630j75157
$$ 672441 706732 780532 803535 1207983 757435 951543 761755 989221 737591 562434
14698E62434N17358k58938Q3646k51758J57015r646J69807k97698J46775L53364
$$ 562434 1079792 820854 904500 652742 809757 800111 969918 672220 818995 1172359
14688A172359L5623m29853r7302Q1032L30129j97208p6104L38682k96803J62295
$$ 1172359 1207982 778129 680827 761859 1091988 894780 818676 1157358 860555 1022850
14678A022850j770p7586L47241l61089j26223Q9419L26175l87440K57944l5159
$$ 1022850 1021080 943494 1290735 929646 803423 892842 1219017 831577 1089521 1054362
14668A054362L48137n98496M70610m03862J63568k89556L42364M8875k63669J4317
$$ 1054362 1402499 804003 1274613 870751 1034319 744763 1087127 1136002 872333 886650
14658H86650O9081K09837J82100l00090N5892k8219J99928k7689J15747n96260
$$ 886650 955731 1165568 1347668 1047578 1103470 1075251 1275179 1247490 1363237 766977
14648G66977N25816j16171l4904n5253M23912k35479j17299K79978k82235o2000
$$ 766977 1292793 1176622 1141718 1086465 1510377 1274898 1157599 1437577 1155342 1093342
14638A093342J78413J37770o2219L3881p8102j87780N24962k07712j30329l07925
$$ 1093342 1271755 1409525 1347306 1381187 1303085 1115305 1640267 1432555 1302226 994301
14628I94301J08710L40906k16399r8478K10318K83866k47412j73071L09971j1226
$$ 994301 1103011 1443917 1227518 1129040 1339358 1623224 1375812 1202741 1512712 1501486
14618A501486l03928K60548K86201l45896J18142J12481j95322j17628K22975
$$ 1501486 1197558 1458106 1744307 1398411 1516553 1629034 1433712 1316084 1539059
14609A539059j11605K71558M0381l07361P8948J59421n22604M99477q8166K99456
$$ 1539059 1427454 1699012 1739393 1432032 1510980 1670401 1147797 1647274 1559108 1858564
14599A858564l17936J03032j71314K53930J71698Q139k39473l0576J62070j0433
$$ 1858564 1540628 1643660 1472346 1726276 1897974 1906113 1666640 1636064 1798134 1787701
14589A787701K65258m29172J74432L80256m10007J95116Q8183o7253R7181k0464
$$ 1787701 2052959 1623787 1798219 2178475 1768468 1963584 2051767 1984514 2081695 2061231
14579B061231L7968k19047L05517o4355k95302l8902L62363l40375O22334j86657
$$ 2061231 2099199 1880152 2185669 2121314 1826012 1787110 2149473 1809098 2431432 2244775
14569B244775r4045K33159N8060r5510P7906Q7785L7227K55133k09938Q6197n6742
$$ 2244775 2150730 2383889 2441949 2346439 2424345 2512130 2549357 2804490 2594552 2680749 2624007
14558B624007M27298o725K22174k2100M81639K05607L01120R31979R01828K499347
$$ 2624007 3051305 3044580 3266754 3244654 3726293 3931900 4233020 5164999 6066827 8566174
14548H566174L727566R093292J5302777M914621j8856664A0073592m508501k057259
$$ 8566174 12293740 21387032 36689809 41604430 22747766 10073592 5565091 3507832
14540C507832r25993j90396k92107K24663q8938m40889N73554k68854J66075J30549
$$ 3507832 2581839 2391443 2099336 2323999 2235061 1794172 2367726 2098872 2264947 2395496
14530B395496k35742j40692K00710p3602K15709K56917l63222K14424k58782L81415
$$ 2395496 2159754 2019062 2219772 2146170 2361879 2618796 2255574 2469998 2211216 2592631
14520B592631j50155L23432m67459J37032L195L47740k91943M13608m31640O8757
$$ 2592631 2442476 2765908 2298449 2435481 2438676 2786416 2494473 2908081 2476441 2545198
14510B545198J25466L41290k52999K88795N1868M9675j68197o6527K32270j42778
$$ 2545198 2670664 3011954 2758955 3047750 3099618 3149293 2981096 2914569 3146839 3004061
14500C004061J58143k61463L27030J74259l58885J19804P9810K05075p9824K42487
$$ 3004061 3162204 2900741 3227771 3402030 3043145 3162949 3242759 3447834 3368010 3610497
14490C610497r0986j24612R4335J21538L86992l94826J26587l32537P32058l02434
$$ 3610497 3519511 3394899 3489234 3610772 3997764 3602938 3729525 3396988 4129046 3826612
14480C826612j949J53765k2974j34600K31841k48051L69135n3250M41333l30532
$$ 3826612 3824663 3978428 3955454 3820854 4052695 3804644 4173779 4120529 4561862 4231330
14470D231330M0088p6962P3960J95840O1735R8862k24371K87633L30122l41362
$$ 4231330 4271418 4194456 4268416 4464256 4525991 4624853 4400482 4688115 5018237 4676875
14460D676875k03157K50935K27114n87940O70155K51610j82310q8318L26091K09668
$$ 4676875 4473718 4724653 4951767 4363827 5033982 5285592 5103282 5014964 5341055 5550723
14450E550723o4450k87270P51168k87042J3814J85804K41233k69805Q3755J84154
$$ 5550723 5486273 5199003 5950171 5663129 5676943 5862747 6103980 5834175 5917930 6102084
14440F102084j10886K46377N04183o54548L22749N2456K44768j46573L63533k26035
$$ 6102084 5991198 6237575 6741758 6087210 6409959 6462415 6707183 6560610 6924143 6698108
14430F698108J99418J24827J29589j05436K85890J91860K28870j92180J35279
$$ 6698108 6897526 7022353 7151942 7046506 7332396 7524256 7753126 7560946 7696225
14421G696225L2258K31898J0321L28653q0978J65804J63221l21040O30876K22567
$$ 7696225 7728483 7960381 7970702 8299355 8218377 8384181 8547402 8226362 8857238 9079805
14411I079805O0064p1757J95025J49784J04971K9167L09206O13927n2182j66982
$$ 9079805 9139869 9068112 9263137 9412921 9517892 9547059 9856265 10470192 10418010 10251028
14401A0251028J06462M14116R213J57151L67331j9245N81557r0564K87532q2841
$$ 10251028 10357490 10771606 10780819 10937970 11305301 11286056 11867613 11777049 12064581 11981740
14391A1981740K65924P08923K0822L28660n9578J46838M35148O8553P70696l79467
$$ 11981740 12247664 12956587 12977409 13306069 13246491 13393329 13828477 13897030 14667726 14288259
14381A4288259O16195o0464N33997J02103O36744j75823N14250K48708O08446
$$ 14288259 14904454 14843990 15377987 15480090 16116834 15941011 16455261 16703969 17312415
14372A7312415Q6050O31008J28800N88202j50967O81383J39552N95446J42736
$$ 17312415 17398465 18029473 18158273 18746475 18595508 19276891 19416443 20011889 20154625
14363B0154625P61785L59335M40528M58730N70856L35100N83228P43576P05376
$$ 20154625 20916410 21275745 21716273 22175003 22745859 23080959 23664187 24407763 25113139
14354B5113139O25791M52020L94458O57523R77365M36667R40887R66981L17693
$$ 25113139 25738930 26190950 26585408 27242931 28220296 28656963 29597850 30564831 30882524
14345C0882524R07654R08990N32440J027693J153083R98602Q50618Q42012J025274
$$ 30882524 31790178 32699168 33231608 34259301 35412384 36410986 37261604 38103616 39128890
14336C9128890J649251O66458J084978J579006J439092J334873J488887J467377
$$ 39128890 40778141 41444599 42529577 44108583 45547675 46882548 48371435 49838812
14328D9838812J526862J491454J526402K243781J493452J932371K237637J933104
$$ 49838812 51365674 52857128 54383530 56627311 58120763 60053134 62290771 64223875
14320F4223875K344289K572659K663699K403816K843260K719405L220667L349220
$$ 64223875 66568164 69140823 71804522 74208338 77051598 79771003 82991670 86340890
14312H6340890L467587L749936L810957M287408L839454M484186N147545M922626
$$ 86340890 89808477 93558413 97369370 101656778 105496232 109980418 115127963 120050589
14304A20050589N153476N930524N970749O577614O689978P024272P768267Q159476
$$ 120050589 125204065 131134589 137105338 143682952 150372930 157397202 165165469 173324945
14296A73324945Q062183R261416R251242R822371J0818815J1151098J1439341
$$ 173324945 181387128 190648544 199899786 209722157 220540972 231692070 243131411
14289B43131411J2415167J2784522J2978187J3966068J4014459J4435465J4656804
$$ 243131411 255546578 268331100 281309287 295275355 309289814 323725279 338382083
14282C38382083J4657728J4362271J4289945J3943187J2603839J2656063J0850553
$$ 338382083 353039811 367402082 381692027 395635214 408239053 420895116 431745669
14275D31745669R527680P249049M476191J462193m21082m49576o82673l120868
$$ 431745669 441273349 448522398 452998589 454460782 454039700 453590124 452907451 449786583
14267D49786583m564680n426717p473397r959851j1321322j2724310j3883208
$$ 449786583 445221903 439795186 432321789 422361938 411040616 398316306 384433098
14260C84433098j4480183j5139696j5337533j5092022j4742974j3398983j4178043
$$ 384433098 369952915 354813219 339475686 324383664 309640690 296241707 282063664
14253B82063664j3335626j2927318j2615364j1601696j1395898j0438654r937401
$$ 282063664 268728038 255800720 243185356 231583660 220187762 209749108 199811707
14246A99811707r702353r004784q290943p965710p476933p372797o703869o186577
$$ 199811707 190109354 181104570 172813627 164847917 157370984 149998187 143294318 137107741
14238A37107741n898568n628405n562693n163477m707327m312263m140470l417128
$$ 137107741 131209173 125580768 120018075 114854598 110147271 105835008 101694538 98277410
14230I8277410m416521l353461l564268l558723l277108l070505k492757k559352
$$ 98277410 93860889 90507428 86943160 83384437 80107329 77036824 74544067 71984715
14222G1984715k602544k656787j868372k095816k027400k126435j959677k141100
$$ 71984715 69382171 66725384 64857012 62761196 60733796 58607361 56647684 54506584
14214E4506584j173423j218345j923738j557999j481441j401970j198529o83267
$$ 54506584 53333161 52114816 50191078 48633079 47151638 45749668 44551139 43867872
14206D3867872j017040k020192j369659o73191j351330p18214m46142j484066
$$ 43867872 42850832 40830640 39460981 38787790 37436460 36718246 36272104 34788038
14198C4788038l26176j238874j077591o03774o12395q26582r43230n27202q78906
$$ 34788038 34461862 33222988 32145397 31541623 30929228 30102646 29159416 28632214 27753308
14189B7753308n93232m82108q06541o70673m94775n04461o13936o22103n20445
$$ 27753308 27160076 26677968 25871427 25200754 24705979 24201518 23587582 22965479 22445034
14180B2445034J5377n52811k99663q32747k41772p58928l34166p5142l36222m77702
$$ 22445034 22460411 21907600 21607937 20775190 20533418 19774490 19440324 19365182 19028960 18551258
14170A8551258l82606l33819m95327L4070l90065l90139l05097o87229J61976
$$ 18551258 18168652 17834833 17339506 17373576 16983511 16593372 16288275 15601046 15763022
14161A5763022k49316l92909j45816k44135m85326l06297n5364k48029l71764
$$ 15763022 15513706 15120797 14974981 14730846 14245520 13939223 13883859 13635830 13264066
14152A3264066p1041j24839k7556l92523l57737k9653k90668k71649k12588q7557
$$ 13264066 13193025 13068186 13040630 12648107 12290370 12260717 11970049 11698400 11485812 11398255
14142A1398255q0576l44988R5322o86222M80463m01265k41580k48195Q6441k99603
$$ 11398255 11317679 10972691 11068013 10381791 10862254 10460989 10219409 9971214 10057655 9758052
14132I758052J06765k82267L576m10341m5773L37940o31140J50161l03167j48851
$$ 9758052 9864817 9582550 9586126 9175785 9130012 9467952 8836812 8986973 8683806 8534955
14122H534955l00517J13372N7086k82297L37520p43410J93751j1225j73448k90208
$$ 8534955 8234438 8347810 8404896 8122599 8460119 7716709 7910460 7899235 7725787 7435579
14112G435579k68348Q889q9783n9276P7022n0217K41265m85232r5398o1507k42553
$$ 7435579 7167231 7176120 7086337 7027061 7104083 7053866 7295131 6809899 6714501 6652994 6410441
14101F410441j4898L83322o32234J37768j43338k33019J24340l47657k23140L66474
$$ 6410441 6395543 6778865 6146631 6284399 6141061 5908042 6032382 5684725 5461585 5828059
14091E828059k39069j00151j05391K95187k86063k5075R1936k45587J25689n1996
$$ 5828059 5588990 5488839 5383448 5678635 5392572 5367497 5459433 5213846 5339535 5287539
14081E287539j61844l13004J89414M19069l28683M1477l56495J92485j98706p5137
$$ 5287539 5125695 4812691 5002105 5421174 5092491 5133968 4777473 4969958 4771252 4696115
14071D696115l40861K33652l36353K20100j61143J03057n45783O28258j31786
$$ 4696115 4355254 4588906 4252553 4472653 4311510 4414567 3868784 4497042 4365256
14062D365256j93936P4617m9875q1383K12113k48506k92164J25507N7223J7926
$$ 4365256 4171320 4245937 4196062 4114679 4326792 4078286 3786122 3911629 3968852 3986778
14052C986778k81077K30301l16738k3079j1656j78583L2982J80509r4181k50483
$$ 3986778 3705701 3936002 3619264 3596185 3584529 3405946 3438928 3619437 3525256 3274773
14042C274773M1676J82252M1535k4440k51617Q2632k1197l06589K2960J11086
$$ 3274773 3316449 3498701 3540236 3515796 3264179 3346811 3325614 3019025 3041985 3153071
14032C153071O4088j57579J78346O138o7936L666j56062l10850L98231k99352
$$ 3153071 3217159 3059580 3237926 3244064 3176128 3179794 3023732 2712882 3111113 2811761
14022B811761J5562j25917L17956m00872P3022J1090J71235k37203K23189k03053
$$ 2811761 2827323 2701406 3019362 2618490 2691512 2702602 2873837 2636634 2859823 2656770
14012B656770J6531j86838O6444J92316k65885N4430j38949L30400m47588k25533
$$ 2656770 2673301 2486463 2552907 2745223 2479338 2533768 2394819 2725219 2277631 2052098
14002B052098J98910K26363k6236j36235k76000J25979K6929p1191L15272k08222
$$ 2052098 2251008 2477371 2451135 2314900 2038900 2164879 2191808 2120617 2435889 2227667
13992B227667J44360O26377M26227J234623K895738P522011J4824792J1202195
$$ 2227667 2372027 2998404 3424631 4659254 7554992 15077003 29901795 41103990
13984D1103990j4207324j1689572n885745k946594r04237q27617q57284l21459
$$ 41103990 26896666 15207094 9321349 6374755 5470518 4642901 3785617 3464158
13976C464158J08932m53502j75087N6970k55739K82346l87212J12219j31642m28983
$$ 3464158 3573090 3119588 2944501 3001471 2745732 3028078 2640866 2753085 2621443 2192460
13966B192460K65714j6354n4038l63946K53712o6326N3433k63883M2868L11596
$$ 2192460 2458174 2441820 2387782 2023836 2277548 2211222 2264655 2000772 2043640 2355236
13956B355236k46516J54882k90167J74296n819Q4613r0687k03185J05116j82977
$$ 2355236 2108720 2263602 1973435 2147731 2141912 2226525 2135838 1932653 2037769 1854792
13946A854792K23227j01769j85718K18222p9061k8022M7095n46684N37594j00764
$$ 1854792 2078019 1976250 1790532 2008754 1929693 1901671 1948766 1402082 1939676 1838912
13936A838912j82793O0905J0318J21072k87899K86006k25175j58383J20833O5890
$$ 1838912 1656119 1717024 1727342 1848414 1560515 1846521 1621346 1462963 1583796 1649686
13926A649686q6846K68630N7649k62211K85937l37015J34238J34228k12411K36546
$$ 1649686 1562840 1831470 1889119 1626908 1912845 1575830 1710068 1844296 1631885 1868431
13916A868431l82458k68332L19497r0439J16871j28763j82356L59005k33185K07322
$$ 1868431 1485973 1217641 1537138 1446699 1563570 1434807 1252451 1611456 1378271 1585593
13906A585593j84767K56857j52830j13066K01057O4201j67616J02563j77299J18328
$$ 1585593 1400826 1657683 1504853 1391787 1592844 1657045 1489429 1591992 1414693 1533021
13896A533021j22042K9417K96192l61409O3038j69167L19869l24692n0103j04948
$$ 1533021 1410979 1440396 1736588 1375179 1438217 1269050 1588919 1264227 1214124 1109176
13886A109176J23135K08063j31719J41472K02246m83901j40618R6851J27188M3628
$$ 1109176 1232311 1440374 1308655 1450127 1652373 1168472 1027854 1124705 1251893 1295521
13876A295521Q0511j94559N7321k38799J83451J46180o41702N30165J05363j55743
$$ 1295521 1376032 1181473 1238794 999995 1183446 1329626 687924 1218089 1323452 1167709
13866A167709O9824r5319L43879k58580L4527j04936Q7911j08568l11079M55453
$$ 1167709 1237533 1142214 1486093 1227513 1262040 1157104 1245015 1136447 825368 1280821
13856A280821j51441M62899o08784K22806k27464K81424K22561m02479k25631
$$ 1280821 1129380 1592279 983495 1206301 978837 1260261 1482822 1080343 854712
13847H54712J88188j58274M76191m04624J29060l9924j59376n3489K85911k35996
$$ 854712 1042900 884626 1360817 956193 1085253 1045329 885953 832464 1118375 882379
13837H82379M98726l33575m3121j31594K35149k96853L6846R5417Q028J25820
$$ 882379 1381105 1047530 1004409 872815 1107964 811111 847957 943374 951402 1077222
13827A077222j53410N43727k54368m27667J69779r0745j30135M67414j01189p5296
$$ 1077222 923812 1467539 1213171 785504 955283 864538 734403 1201817 1100628 1025332
13817A025332p5565m03519K92580n9060J44782Q8217k55397L29426k08617R9444
$$ 1025332 949767 546248 838828 779768 924550 1012767 757370 1086796 878179 977623
13807I77623j36911J28996l54564L91363j20603k27939L74402m57644J54876J24027
$$ 977623 840712 969708 615144 1006507 885904 657965 1032367 574723 729599 853626
13797H53626J87632m67371R9547M14005p2123j40572j56751p2351J9251o730K77523
$$ 853626 1041258 573887 673434 1087439 1015316 874744 717993 645642 664893 658163 935686
13786I35686k73607L7317O8467L2940J78209J69490l53012K7006j33656L69027
$$ 935686 662079 699396 767863 800803 979012 1148502 795490 822496 688840 1057867
13776A057867j57101j15690O2933j08103l27325K89290M58453j97084k91918k36423
$$ 1057867 900766 785076 848009 739906 412581 701871 1160324 963240 671322 434899
13766D34899K35760J63808J2077K7388p9404K32194D83868K22161p9959L79360
$$ 434899 670659 834467 846544 873932 794528 1026722 483868 706029 626070 1005430
13756A005430j84094j70578r6596J99770K3947m5545r7659j06189J13619C02237
$$ 1005430 821336 650758 554162 753932 777879 732334 634675 528486 642105 302237
13745E31823J48713J52666R2174m57047K50836J38842l15724K14756k45212J79757
$$ 531823 680536 833202 925376 468329 719165 858007 542283 757039 511827 691584
13735F91584p4245B34836K82346J79583N0161P8151l32703K2815k03604K26492
$$ 691584 617339 234836 517182 696765 746926 825077 492374 515189 311585 538077
13725E38077o490J33135l10367M53334l34083n9883O56417n08140j11692J89821
$$ 538077 531587 664722 354355 807689 473606 413723 1070140 562000 450308 640129
13715F40129Q2433q7684k10408J04720Q5937j14339p8067L47137k24709K29646
$$ 640129 722562 634878 424470 529190 615127 500788 422721 769858 545149 774795
13705G74795k43223P6818K16595o2817J15854M6994j73238B06084N66187k89666
$$ 774795 531572 608390 824985 762168 878022 925016 751778 206084 772271 482605
13695D82605J68225R4304N0169l21919J29526J16092k48750L35417j65752l8156
$$ 482605 650830 745134 795303 473384 602910 719002 470252 805669 639917 601761
13685F01761j60583N7138j00877L29740K40290m76545J52884k51227J30096k45851
$$ 601761 441178 498316 397439 727179 967469 490924 643808 392581 522677 276826
13675B76826R1289L00444k44821J50278j09671M07143C97251J58075L989B12951
$$ 276826 368115 668559 423738 574016 464345 871488 397251 555326 559315 212951
13664B86960K09581K67538B88990P4719Q760j24117L18072R4361L7270B80211
$$ 286960 496541 764079 288990 363709 372469 248352 566424 660785 698055 280211
13653D80924A41768K91125K15489B90443L85029j99490O3319J10395k46353L5586
$$ 480924 141768 432893 648382 290443 675472 475982 539301 649696 403343 438929
13643D38929k0594J43130k14477J58978j77287M6850K94042J80B05694J10227
$$ 438929 418335 561465 346988 505966 328679 375529 669571 669751 205694 315921
13633C15921J66529j80853L1027o6582o0053M11873k36360r4866P8714R5796H8544
$$ 315921 482450 301597 332624 266042 205989 617862 381502 286636 365350 461146 88544
13621D80018J72061J24567A31896L81474p9643j1033k1025J85094A92319L39101
$$ 480018 652079 776646 131896 513370 433727 422694 401669 586763 192319 531420
13611E31420k59611I661N48673A94475L88039j00008r5296I4673l9684K13486
$$ 531420 271809 9661 558334 194475 582514 482506 387210 94673 54989 268475
13601B68475K81495j45988Q9511B45920J56628J1391O6486N8853A32166M64314
$$ 268475 549970 403982 493493 245920 402548 413939 480425 539278 132166 596480
13591E96480k38896R8370K20223C25303n4734Q000L90906o5510j59772k8360K8617
$$ 596480 357584 455954 676177 325303 270569 278569 669475 603965 444193 415833 444450
13580D44450l006j85178J0850o0433K47155q1865q0419N543K16723M9002A33677
$$ 444450 441444 256266 267116 206683 453838 371973 291554 297097 513820 562822 133677
13568F63129p4255q4391J10871A14009J40629J6879K09038j89594Q414q3893J26833
$$ 663129 588874 504483 615354 114009 254638 271517 480555 290961 299375 215482 342315
13557C42315J46236M3627l4932j5841P5006j93407I2934K17025j50994N5807K02847
$$ 342315 488551 532178 497246 481405 556411 363004 92934 309959 158965 214772 417619
13546D17619j28846l0542r6662J21632L65947k97393M0984J56774A12081L48985
$$ 417619 288773 258231 161569 283201 649148 351755 392739 549513 112081 461066
13536D61066r4927n5569l7929J5791O2103H0397L64648A42816J37174M8242Q2915
$$ 461066 366139 310570 272641 288432 350535 80397 445045 142816 279990 328232 411147
13525D11147J04864K2052j64722J83341I3913J12313J71177A55574K81216E6984
$$ 411147 516011 538063 373341 556682 93913 206226 377403 155574 436790 56984
13514B01590J77531j85216J5023Q0796R4410d2150C95754r0052J03110A37750
$$ 201590 379121 193905 208928 289724 384134 -42150 395754 305702 408812 137750
13503D16598A54299M0503N04760l01446B7517J68566K74416k32210j17670J0799
$$ 416598 154299 194802 699562 398116 27517 196083 470499 238289 120619 131418
13493A31418L84525q6798a39977D28658A45446D6857J34486k9757K5752J54870
$$ 131418 515943 429145 -139977 428658 145446 46857 181343 151586 177338 332208
13483C32208M1344K0325A32842L59567A69857j7323J87644j5274J0232I6349J81196
$$ 332208 373552 393877 132842 492409 169857 152534 340178 324904 335136 96349 277545
13472B77545l0627L40412h2594D97950J8233d7949B05412J72038j48285a27671
$$ 277545 246918 587330 -82594 497950 516183 -47949 205412 377450 229165 -127671
13461C72926M2868A66020o9922K12337J06675j72241G4074L53803h7078I75M90440
$$ 372926 415794 166020 96098 308435 415110 242869 74074 427877 -87078 975 491415
13450D91415G6169b5300B62776M5276R5611D1306R8261K62551a56491F07769c9812
$$ 491415 76169 -25300 262776 308052 403663 41306 139567 402118 -156491 607769 -39812
13438D40361j67878J62339A15073L8906K02571O665J87998j67719J8701A36110
$$ 440361 272483 434822 115073 153979 356550 363215 551213 383494 402195 136110
13427C67523n6292r6810l353J04251r8935a80241B42601J31761N3656A14658j7554
$$ 367523 311231 214421 211068 315319 216384 -180241 242601 374362 428018 114658 97104
13416I7104M03627k10742Q4337k3426j28343E2258K16743R9237A39754J90484
$$ 97104 500731 289989 374326 350900 222557 52258 269001 368238 139754 330238
13406C30238A53719n883J0769o9353M23915m5886B12884Q8270j6504k5427p3154
$$ 330238 153719 147836 158605 89252 513167 467281 212884 301154 284650 259223 186069
13395A86069M2354a0161C57614E4682M66926a24829H2892L8733l1009K5919R4257
$$ 186069 228423 -10161 357614 54682 521608 -124829 82892 121625 90616 116535 210792
13384B10792c0928E9779J35269H2968L24038A43136L5250K8374K98281C4189m577
$$ 210792 -30928 59779 195048 82968 407006 143136 178386 206760 505041 34189 29612
13373B9612O6162J11238F7497J54022n1586l0631J05052F3599L94443B24681K75897
$$ 29612 95774 207012 67497 221519 169933 139302 244354 63599 458042 224681 500578
13362E00578j08729j51189I5090M42118j99402j2617N2161Q7998J93919j20116
$$ 500578 391849 240660 95090 537208 337806 325189 377350 465348 659267 539151
13352E39151f0184A35271N78648C09524k7764J30967B02047L50122b63612A95934
$$ 539151 -60184 135271 713919 309524 281760 412727 202047 552169 -263612 195934
13341E64082k29089K1340j37913K8328J21242I7659J71625N0055q8196k7053P7662
$$ 564082 334993 356333 218420 246748 367990 97659 269284 319339 231143 204090 281752
13330B81752n300a5394F5613Q1749K8861J16929F2519K57364b7696r4176A39979
$$ 281752 276452 -15394 65613 147362 176223 293152 62519 319883 -27696 -121872 139979
13318D54765j76047m9788D8409L71382J22140A09096m3498h439A74300J38990
$$ 454765 278718 228930 48409 419791 541931 109096 65598 -8439 174300 313290
13308C13290N4241A71651L16136E7003J96521B6970M8894J40985m4118a3683A63177
$$ 313290 367531 171651 487787 57003 253524 26970 75864 216849 172731 -13683 163177
13296E8910J65753F8145O3599J41657q9649G3202a60163A36604K7540m7396j0599
$$ 58910 224663 68145 131744 273401 183752 73202 -160163 136604 164144 116748 106149
13285A06149K34868H7778a1785A73923l0840L9642i2445I8417c8454B51137J9315
$$ 106149 341017 87778 -11785 173923 143083 182725 -92445 98417 -38454 251137 270452
13274B70452h9086A61143i0035C13277A10999e3471E1022K28360k5271j15963
$$ 270452 -89086 161143 -90035 313277 110999 -53471 51022 279382 254111 138148
13264A38148M03776a91610I7155J19151j9174H6628K44787F7137e8921B59783
$$ 138148 541924 -191610 97155 216306 197132 86628 331415 67137 -58921 259783
13253e6254g588A81228B1738L433K77541Q7563A62815m6647K85800A64877J75704
$$ -56254 -7588 181228 21738 25171 302712 390275 162815 116168 401968 164877 340581
13242C40581A66562M1192p8198J21861a04887B79742D4860m46g9195D5998M40111
$$ 340581 166562 207754 129556 251417 -104887 279742 44860 44414 -79195 45998 486109
13231D86109d4940D19029E0872G001M1692J50886C1228J79131b56432G0198O2374
$$ 486109 -44940 419029 50872 7001 48693 199579 31228 210359 -256432 70198 132572
13220A32572j5676O0699l9812O6132B3786K58721N6280A56066e8882C11667F8116
$$ 132572 116896 177595 137783 203915 23786 282507 338787 156066 -58882 311667 68116
13208A07701L29432A71346m8764g3795B69003c0847B60094A10848j8292Q1130
$$ 107701 437133 171346 122582 -73795 269003 -30847 260094 110848 92556 173686
13198A73686o991p4L07318A06487L00638B7215J60998o4836a01524B38094d5061
$$ 173686 166695 166621 473939 106487 407125 27215 188213 123377 -101524 238094 -45061
13186B48345j08643K7825P4419e4976B18658H6596L84567k09921a17063D276A397
$$ 248345 139702 167527 241946 -54976 218658 86596 471163 261242 -117063 4276 1397
13174a19351A2149O9888J39194j4842a514m3073A42537L6086J16358p3904n7356
$$ -119351 12149 82037 221231 206389 -1514 -44587 142537 178623 294981 221077 163721
13163A63721a32298j3757A03925A5333K23986A12390a65306A56515L6166C3404
$$ 163721 -132298 -146055 103925 15333 239319 112390 -165306 156515 192681 33404
13152B048K97232E2585N9634J15022N9955n2696f2327G439K32983j806q6694J9750
$$ 2048 299280 52585 112219 227241 287196 234500 -62327 7439 240422 238616 151922 171672
13140A71672d9231C38304A00699a2008E48396h851C43310I7598J32642c6333B30857
$$ 171672 -49231 338304 100699 -12008 548396 -8851 343310 97598 230240 -36333 230857
13128e9294b288C4101a68860B55377o9433a01413A31974L4058J73423A21272N6891
$$ -59294 -2288 34101 -168860 255377 185944 -101413 131974 166032 339455 121272 178163
13117A78163F1663K42940q6290c0946A05380b9021j06483B9427L4479a99559B13825
$$ 178163 61663 304603 218313 -30946 105380 -29021 -135504 29427 63906 -199559 213825
13105a27655A41881a5655c922B37802q9411F3228J55836A8572l471J09330n5474
$$ -127655 141881 -15655 -3922 237802 148391 63228 219064 18572 15101 124431 68957
13094F8957a36412a6385D3343K02053a6203l0276k0447A16069b186A44157c8235
$$ 68957 -136412 -16385 43343 245396 -16203 -46479 -66926 116069 -2186 144157 -38235
13082A91960I4616J13181C4871M18044A44857j7191E2907h5793F0447a18348K9798
$$ 191960 94616 207797 34871 452915 144857 127666 52907 -85793 60447 -118348 -88550
13071h8550C91214H0145k0137b8142p4199p6469h8590C40830j67077m49q4319
$$ -88550 391214 80145 60008 -28142 -102341 -178810 -88590 340830 173753 173304 88985
13060H8985J6132h8838H9286a41831B40193K6357o6834a0693C96905j36617n8957
$$ 88985 105117 -88838 89286 -141831 240193 266550 199716 -10693 396905 260288 201331
13049B01331I0149a29238L6706C92062A31970E6441d2576B12703a04892k24792
$$ 201331 90149 -129238 -92532 392062 131970 56441 -42576 212703 -104892 -329684
13039c29684C06622k6500o4095m4887n9483L80960e9743E5328L06307I8864l2407
$$ -329684 306622 280122 216027 171140 111657 492617 -59743 55328 361635 98864 66457
13028F6457h8369A98584a51421H5579J82138h6283D55597b933j2118B23398D3357
$$ 66457 -88369 198584 -151421 85579 267717 -86283 455597 -2933 -15051 223398 43357
13016B91127b6061B10955J24003A04923J72248A31110J32903J46057r8291F1107
$$ 291127 -26061 210955 334958 104923 277171 131110 264013 410070 311779 61107
13005H5453k2464b5240k7638G9654Q9088J89476o3915D2635M5036J13780F2732
$$ 85453 62989 -25240 -52878 79654 168742 358218 294303 42635 87671 201451 62732
12993C09767n3989J52925F3675C1383Q8307C5132R6222K5586B5703f2250J3265
$$ 309767 255778 408703 63675 31383 119690 35132 131354 156940 25703 -62250 -48985
12982d8985I4167b9554A28842n1304b57524a03742C7472J73367j00881b47159
$$ -48985 94167 -29554 128842 77538 -257524 -103742 37472 210839 109958 -247159
12971A72011a76041B82580C2934a30469A28240J46298G8178b6895B15101F1658
$$ 172011 -176041 282580 32934 -130469 128240 274538 78178 -26895 215101 61658
12960B01065A4597J41644b54638f6884B61072a29451E826c7961l45145A57418
$$ 201065 14597 156241 -254638 -66884 261072 -129451 5826 -37961 -383106 157418
12949A31356D1721N3372R7834F4714J02487P5336b60164D1955f5973n3422K9876
$$ 131356 41721 95093 192927 64714 167201 242537 -260164 41955 -65973 -119395 -89519
12938h9519C7704J73588m8100Q75c4131a3088A52426K5409F9668a31318B99493
$$ -89519 37704 211292 163192 164067 -34131 -13088 152426 177835 69668 -131318 299493
12926g1385k42140a35668A52551c5489G0043O7969a02716A72241m2907a05794
$$ -71385 -313525 -135668 152551 -35489 70043 138012 -102716 172241 129334 -105794
12915C5482J24114C6962c29247A09570K02136j08479c56741F0984R5583O1757
$$ 35482 159596 36962 -329247 109570 311706 203227 -356741 60984 156567 218324
12905B18324a22404f0479D096O2520e035k55426a2661D71639a130H5509M9779
$$ 218324 -122404 -60479 4096 66616 -5035 -260461 -12661 471639 -1130 85509 135288
12894A35288K59318j27042a36383A29791e6513F448J5319P4015c13745A12569
$$ 135288 394606 267564 -136383 129791 -56513 6448 21767 95782 -313745 112569
12883B23774d8482k6358a6734A01727a21747b5216B17820b94509B61774j29430
$$ 223774 -48482 -74840 -16734 101727 -121747 -25216 217820 -294509 261774 132344
12873A32344a96270B25758A4059L5634K22931I3658j2466h2161p855b0490E4142
$$ 132344 -196270 225758 14059 49693 272624 93658 81192 -82161 -90016 -20490 54142
12861a32728j19199a3967r3539H9778C2100a4813I2397a76206d1042A64826B3120
$$ -132728 -251927 -13967 -107506 89778 32100 -14813 92397 -176206 -41042 164826 23120
12849B11863e8688j16734b5274A84195n0164L2592l6465M9398J40998F7765J21773
$$ 211863 -58688 -175422 -25274 184195 134031 166623 130158 179556 320554 67765 189538
12838A89538a59325B75552C2507J939O263a39324A1215J69174b50605a07419A56754
$$ 189538 -159325 275552 32507 34446 40709 -139324 11215 180389 -250605 -107419 156754
12826a52994d139A00431K93021j05593a18828M2789b355C0857A2845A785b78465
$$ -152994 -4139 100431 393452 287859 -118828 -76039 -2355 30857 12845 1785 -278465
12814D64429A93769a15342A65384c4243G2864J49415J15933b75892k3509A81841
$$ 464429 193769 -115342 165384 -34243 72864 222279 338212 -275892 -299401 181841
12803A8876K71986i8971B02561r3254k5365C4585c8541A82438j1846c85777F6581
$$ 18876 290862 -98971 202561 109307 83942 34585 -38541 182438 170592 -385777 66581
12791a11263C3840b31901C47569F8465c0581A94731E0888a84601d361B25340d5416
$$ -111263 33840 -231901 347569 68465 -30581 194731 50888 -184601 -4361 225340 -45416
12779a69641A42457J6425J46020a1199j93015l9562a0661r0761A82486J23347
$$ -169641 142457 158882 304902 -11199 -204214 -243776 -10661 -101422 182486 305833
12769C05833p3446d2152j05472G8001A8301O6029J36515Q864C2871a73444B85052
$$ 305833 232387 -42152 -147624 78001 18301 84330 220845 229709 32871 -173444 285052
12757D9713K9320j728P5658a51839e5752K5278J3739A3366J7705i6266Q3a5787
$$ 49713 79033 77305 152963 -151839 -55752 -30474 -16735 13366 31071 -96266 -96183 -15787
12744a82236A87589E9282c19044H2048O899A8493K79345p6622O7644b9871C43819
$$ -182236 187589 59282 -319044 82048 88947 18493 297838 221216 288860 -29871 343819
12732A01337D5800J40747B0017N6133K7901L16452b85615A14335b8956j80401
$$ 101337 45800 186547 20017 76150 104051 420503 -285615 114335 -28956 -209357
12722b09357P9390B53110J2164K5951A8739N5402J52197A06409h8624B03527q0330
$$ -209357 -129967 253110 265274 291225 18739 74141 226338 106409 -88624 203527 123197
12711A23197b48781D39518A46843J3275J07197I7739c67512B03530K86626A84123
$$ 123197 -248781 439518 146843 160118 267315 97739 -367512 203530 490156 184123
12700B03622r8182k4901P0344a77571h4381J2450E20214F4040K28380C360M41848
$$ 203622 105440 80539 150883 -177571 -84381 -71931 520214 64040 292420 3360 445208
12689D45208j96718D791b35825C43669C0607c6644B18634M1453H5463J9652J19885
$$ 445208 248490 4791 -235825 343669 30607 -36644 218634 260087 85463 105115 225000
12678B25000K7422A06569D7367c0929B99333j17472b51481A9870P8232b9084k13248
$$ 225000 252422 106569 47367 -30929 299333 181861 -251481 19870 98102 -29084 -242332
12667b42332C96510F8110J72972n7226e0591C82193A5762L02186d3387j9725F3674
$$ -242332 396510 68110 241082 183856 -50591 382193 15762 317948 -43387 -63112 63674
12655A41766L2958a13351K6743B52361l7715a63989A39296E1775g2107I9585a6385
$$ 141766 174724 -113351 -86608 252361 214646 -163989 139296 51775 -72107 99585 -16385
12643B06795q6295A1c28382A61698J44257j38637b9319j81799H3208L0390K11218
$$ 206795 120500 11 -328382 161698 305955 167318 -29319 -211118 83208 113598 324816
12632C24816B3268O4143K04202M2171m6461j07100F9177K13857l7942n5368J21715
$$ 324816 23268 87411 291613 333784 287323 180223 69177 283034 245092 189724 311439
12621C11439A30431i8216A44260A9500J90672A01016A377b518p5053A53065M0000
$$ 311439 130431 -98216 144260 19500 210172 101016 1377 -2518 -77571 153065 193065
12610A93065D95a22945A2787J49939k3508O6693c5923C22798b80150A22320a64575
$$ 193065 495 -122945 12787 162726 139218 205911 -35923 322798 -280150 122320 -164575
12598F475b69441i7494a9014C21968A5078d3209A86642J49243H5270a15146d0000
$$ 6475 -269441 -97494 -19014 321968 15078 -43209 186642 335885 85270 -115146 -40000
12586B5718f5453H136a60568B44540C1436N9625B338J06475A8008h2024B40868
$$ 25718 -65453 8136 -160568 244540 31436 91061 2338 108813 18008 -82024 240868
12574B75796l0389m3397a24297B2141i3935I3268K20845c511j94894A82577a36393
$$ 275796 245407 202010 -124297 22141 -93935 93268 314113 -3511 -198405 182577 -136393
12562c7608A975J05183J56589b7473l1727B35306c48289G5913J05613G2666k2768
$$ -37608 1975 107158 263747 -27473 -59200 235306 -348289 75913 181526 72666 49898
12551D9898h2163r9358m820I3118c3672n3756A84118e2608j2393A4757a37582
$$ 49898 -82163 -181521 -186341 93118 -33672 -87428 184118 -52608 -65001 14757 -137582
12539B33985b54696C10791j15425o5778n6734e129B63949j7267c03147A95964
$$ 233985 -254696 310791 195366 129588 72854 -5129 263949 246682 -303147 195964
12528b72388E380b03205A72476L9075j03839J47428J4192j06649K24966d8777
$$ -272388 5380 -203205 172476 211551 107712 255140 269332 162683 387649 -48777
12517D0559J74058C7608N6824L406O9453J73478l9279p8298J01912O0322j73686
$$ 40559 214617 37608 94432 97838 167291 340769 301490 223192 325104 385426 211740
12506B11740b3938C14542b28898D4937N272d0656m3734C15357a21968B2168a71698
$$ 211740 -23938 314542 -228898 44937 50209 -40656 -84390 315357 -121968 22168 -171698
12494B39278i5066C0315J43601D5992r528D184a04891B35249a187l2515A95936
$$ 239278 -95066 30315 173916 45992 36464 4184 -104891 235249 -1187 -33702 195936
12482a30969D55775G3976B1500K52427j06793a72577B01725j4820H5255i0575
$$ -130969 455775 73976 21500 273927 167134 -172577 201725 186905 85255 -90575
12471b1135A07707a78055g6080J4800I6918C7411a15527j70858h6738g72j58380
$$ -21135 107707 -178055 -76080 -61280 96918 37411 -115527 -286385 -86738 -772 -159152
12460a59152M0311A67819a60964O644c7558j53660A85354C6047M38286A82811
$$ -159152 -118841 167819 -160964 -154320 -37558 -191218 185354 36047 474333 182811
12449B48839b34361B04934i3855A40411O0045J08065a13263A63453O7691d3778
$$ 248839 -234361 204934 -93855 140411 200456 308521 -113263 163453 231144 -43778
12438B26986P4291j33566J56867b03550A65350l8901m4794K52569A56982b43033
$$ 226986 301277 167711 324578 -203550 165350 126449 81655 334224 156982 -243033
12427b6765j46731A39038k3356l3732a44303A36827M8523N0915C8574M7766b05988
$$ -26765 -173496 139038 115682 81950 -144303 136827 185350 236265 38574 86340 -205988
12415H9683g1187j24652j00430a14135J3693A39533K26279d9406a5569o3146p6301
$$ 89683 -71187 -195839 -296269 -114135 -100442 139533 365812 -49406 -15569 -78715 -155016
12404a55016C5663O9153m9743d7552j14316b5886j40037D0586O7146k6095a39032
$$ -155016 35663 104816 55073 -47552 -161868 -25886 -165923 40586 107732 81637 -139032
12392a15773C9613c37489a12061A6925b28653c0306j12412M5286o3433E1343J68105
$$ -115773 39613 -337489 -112061 16925 -228653 -30306 -142718 -97432 -160865 51343 219448
12381B19448O4575k9368d9092a6899E578R8064g1717K3919A55954K2037a7680
$$ 219448 284023 254655 -49092 -16899 5578 103642 -71717 -47798 155954 177991 -17680
12369a09092r1013c7228G994L18306c5266E5971J1399f809j66846A89605d37865
$$ -109092 -200105 -37228 7994 326300 -35266 55971 67370 -6809 -173655 189605 -437865
12357B18443b46727b3050k7535n904G7673P8661J80452a33158F7257O2112e7218
$$ 218443 -246727 -23050 -50585 -56489 77673 156334 336786 -133158 67257 129369 -57218
12345c7227A40982f0919A81802D7976b00071j37069I5164a14691A50430c71427
$$ -37227 140982 -60919 181802 47976 -200071 -337140 95164 -114691 150430 -371427
12334f4985J7694k30637D1350h9849j37036i1565j76530b3282B7416g8064B12337
$$ -64985 -47291 -277928 41350 -89849 -226885 -91565 -268095 -23282 27416 -78064 212337
12322b46466G7178J69714a21189A6617d3010B58179b01066g455B50390e5712F3649
$$ -246466 77178 246892 -121189 16617 -43010 258179 -201066 -7455 250390 -55712 63649
12310A90154A4554c4218A50448J84919o3353b79227g59j14945L82D2642Q7209
$$ 190154 14554 -34218 150448 335367 272014 -279227 -759 -115704 -115322 42642 129851
12299A29851j3051a77669C02235m8872h3349A35859J9167i5735c0171B3530K58573
$$ 129851 116800 -177669 302235 253363 -83349 135859 155026 -95735 -30171 23530 282103
12288B82103h3820B7938d166l0961j46054A71136b66304d3766C42604j00233i4963
$$ 282103 -83820 27938 -4166 -35127 -181181 171136 -266304 -43766 342604 242371 -94963
12276D22501g4140a0540B66388m0142m1189J74057A30991e8759B60890g4775B27007
$$ 422501 -74140 -10540 266388 226246 185057 359114 130991 -58759 260890 -74775 227007
12264I5733j5203l2235J79286r2721p29d7054n7780K4923A97852a17575B62126
$$ 95733 80530 48295 227581 134860 134131 -47054 -104834 -79911 197852 -117575 262126
12252a82386I7473L7406a3454B6687R4893m4181P567B29J45478Q0360a9829h956
$$ -182386 97473 134879 -13454 26687 121580 77399 84966 229 145707 226067 -19829 -8956
12239a27257m7923E2594K25166A2254P9732R0893L13723A30218o2852P6079J34945
$$ -127257 -175180 52594 277760 12254 91986 182879 496602 130218 67366 143445 278390
12228B78390l0748L00623A593J16533c3041B06314o4149L91011j43793j84457
$$ 278390 247642 548265 1593 118126 -33041 206314 142165 533176 389383 204926
12218B04926L28061j59271j5921a91814A08986P3530b66650H617a56353B58077
$$ 204926 532987 373716 357795 -191814 108986 182516 -266650 8617 -156353 258077
12207b05641D8404J10583G7370b56107C40302G6788K71917A51094J91555m7131
$$ -205641 48404 158987 77370 -256107 340302 76788 348705 151094 342649 295518
12197B95518K3163K72593k74750r5465o3621J66824A06668J09631J12142A17757
$$ 295518 318681 591274 316524 221059 157438 324262 106668 216299 328441 117757
12186a48387o6932K1161A11358M7874L38078j67281A46683R8485j6521b01648
$$ -148387 -215319 -194158 111358 159232 497310 330029 146683 245168 228647 -201648
12175A81879P8683M0381q1737j02894M0419J05341f4591a044j26159b8642I4090
$$ 181879 260562 300943 219206 116312 156731 262072 -64591 -1044 -127203 -28642 94090
12163D38414q9395j52703N8915O7491A21732n7204K75818a49933F7696a6496I4720
$$ 438414 349019 196316 255231 322722 121732 64528 340346 -149933 67696 -16496 94720
12151d23830J22865a0156A12414n051l7382g1967k05060b8272E0087b375C50127
$$ -423830 -300965 -10156 112414 107363 69981 -71967 -277027 -28272 50087 -2375 350127
12139a42679f0507D8518a29264j27084A7338J13584d4542n565B56926C4785J38013
$$ -142679 -60507 48518 -129264 -256348 17338 130922 -44542 -50107 256926 34785 172798
12128A72798I725J03031m547K21838h5233n3591B44241g6379j28016D2473K77793
$$ 172798 9725 112756 108209 330047 -85233 -138824 244241 -76379 -204395 42473 320266
12117C20266a31911A17825n1134J93417h2875A04209b0589n7321q1035j21707
$$ 320266 -131911 117825 66691 260108 -82875 104209 -20589 -77910 -158945 -280652
12107b80652B9024L7917a124o0620B40443e4857p513j11598c0232l44148B27372
$$ -280652 29024 66941 -1124 -61744 240443 -54857 -62370 -173968 -30232 -374380 227372
12095f6139C39513I4779R5309L0273a64040g9589l56167a31662A02342c34165
$$ -66139 339513 94779 190088 220361 -164040 -79589 -435756 -131662 102342 -334165
12084G5724f0974C00924e5719m5158A86692C2887J35070a94465N4619B43922p7148
$$ 75724 -60974 300924 -55719 -100877 186692 32887 167957 -194465 -139846 243922 166774
12073A66774P6017Q6228G6699J382i4918D1202P3659b33183J01079B18338e8911
$$ 166774 242791 329019 76699 78081 -94918 41202 114861 -233183 -132104 218338 -58911
12061B21306m2556h9051K6513b6464k49464A75946o2324a16608G7385J70659P06964
$$ 221306 178750 -89051 -62538 -26464 -275928 175946 113622 -116608 77385 248044 955008
12050I55008M72711E20057D3913R1124a78153A47962a4191N161B02860B7742b4676
$$ 955008 1427719 520057 43913 135037 -178153 147962 -14191 -9030 202860 27742 -24676
12038a47813A36672b79299g0507O272B26772d35249B26035b59205j4281P0431
$$ -147813 136672 -279299 -70507 -64235 226772 -435249 226035 -259205 -273486 -203055
12028b03055A0476N3181a86144f4250A50422C1754L6631a51719C8658R036b43035
$$ -203055 10476 63657 -186144 -64250 150422 31754 68385 -151719 38658 47694 -243035
12016G6574K06133N6558B7758L0899a03235A61314a62177L838P6928E4478N00396
$$ 76574 282707 339265 27758 58657 -103235 161314 -162177 -158339 -81411 54478 554874
12005E54874A78579G4621K29259a06270B17502m8460c80995A9221J0355a07768
$$ 554874 178579 74621 303880 -106270 217502 169042 -380995 19221 29576 -107768
11994i8962j26353a05949C4646J08528a842B86376a40924B68035e01977E67920
$$ -98962 -225315 -105949 34646 143174 -1842 286376 -140924 268035 -501977 567920
11983e00199a99464Q3037k24899f4079A50167a71820P0053C6426K0172e1598N797
$$ -500199 -199464 -116427 -341326 -64079 150167 -171820 -101767 36426 56598 -51598 -45801
11972d5801A30764a32786A57268c7720C804J31904J3473Q3324a26861m6131r4829
$$ -45801 130764 -132786 157268 -37720 3804 135708 149181 232505 -126861 -172992 -267821
11961b67821A1632K48293l5785k486h035j07453l60819b27730K7625J4610K1542
$$ -267821 11632 259925 224140 221654 -8035 -115488 -476307 -227730 -200105 -185495 -163953
11950a63953G3187J17941a33503j13422A04427l6826e5716A41317C6369N2852
$$ -163953 73187 191128 -133503 -246925 104427 67601 -55716 141317 36369 89221
11940H9221K16214f268j07159G1259A7329K53706I4506A4352a28236f1164A64410
$$ 89221 305435 -6268 -113427 71259 17329 271035 94506 14352 -128236 -61164 164410
11928A22400a6089C99348b6079j04792j57254D24880j75747a18868c456l4576
$$ 122400 -16089 399348 -26079 -130871 -288125 424880 249133 -118868 -3456 -38032
11918c8032B92888j33008b52595P0767k90443B85687e6598j5768C80414f7454
$$ -38032 292888 159880 -252595 -181828 -472271 285687 -56598 -72366 380414 -67454
11907A47139P1231A06505a40911B43131D2929L16719I8166k5749a28209C19947
$$ 147139 218370 106505 -140911 243131 42929 359648 98166 72417 -128209 319947
11896A2044i7871A97760n0175l1853l5674f4177H8592K41854a03662d4587L981
$$ 12044 -97871 197760 147585 115732 80058 -64177 88592 330446 -103662 -44587 -40606
11885d0606I1374g7686A65722i6962j04655P2398H8934m0243K0537b268j62386
$$ -40606 91374 -77686 165722 -96962 -201617 -129219 88934 48691 69228 -2268 -164654
11874a64654d2254k03809j56048e3525B33674e15937B14692e6957k12980l2605
$$ -164654 -42254 -246063 -402111 -53525 233674 -515937 214692 -56957 -269937 -302542
11864c02542a00215j55433O3675B4659a36800E7216b86391a22067A96395r5810
$$ -302542 -100215 -255648 -191973 24659 -136800 57216 -286391 -122067 196395 100585
11854A00585m5084P7334C3249f941k72884J37813A82345b3300k41015a15154B44529
$$ 100585 55501 132835 33249 -6941 -279825 -142012 182345 -23300 -264315 -115154 244529
11842E6735J0733L2394a46834I4216a53432g6525j69370a02353p987i297F5156
$$ 56735 67468 99862 -146834 94216 -153432 -76525 -245895 -102353 -110340 -9297 65156
11830b5698B5225b55359B8911a27911A29870b3016k04867A12796p15M2194n8199
$$ -25698 25225 -255359 28911 -127911 129870 -23016 -227883 112796 112081 154275 96076
11819I6076b65626H5192l1591Q4356G949K38752f7890n17601B5029J66307F4436
$$ 96076 -265626 85192 53601 137957 7949 246701 -67890 -585491 25029 191336 64436
11807a41518k1716A28351b66538a18722j68697G069J03638b03919B15904C2303
$$ -141518 -163234 128351 -266538 -118722 -287419 7069 110707 -203919 215904 32303
11796b57718J16790B7440K42477A01746O3492a9328k7084B84161p2656b36678
$$ -257718 -140928 27440 269917 101746 165238 -19328 -46412 284161 211505 -236678
11785h4761o8284q7829j6936H8734b89806C75981c15926A48737b35022j04801
$$ -84761 -153045 -240874 -257810 88734 -289806 375981 -315926 148737 -235022 -339823
11775c39823a0843l07447a15371j76389f0217F3168J24356a68056m26832a80167
$$ -339823 -10843 -318290 -115371 -291760 -60217 63168 187524 -168056 -594888 -180167
11764A1904g4978A27597m5386J89115l4656A13933Q23C4976c2794l8538A01663
$$ 11904 -74978 127597 82211 271326 236670 113933 114756 34976 -32794 -71332 101663
11752d56607B48152B669a13749n9049B20121h7511A95043o4392a24081A06488
$$ -456607 248152 2669 -113749 -172798 220121 -87511 195043 130651 -124081 106488
11741H1597b01472N8028a3357k26929A53337a0031G4200g754j56154B72684b36438
$$ 81597 -201472 -143444 -13357 -240286 153337 -10031 74200 -7754 -163908 272684 -236438
11729A38321k480a17034I8503C5111a25963A33749i8300B58629G9533f8775H6613
$$ 138321 135841 -117034 98503 35111 -125963 133749 -98300 258629 79533 -68775 86613
11717B8799f1385A73703B3861A961M60726a82326A34693n2905i6100B91963A5949
$$ 28799 -61385 173703 23861 1961 462687 -182326 134693 81788 -96100 291963 15949
11705C81015a760B77682l0482m5783C1999g0029A45082a31405n6323C76283C8379
$$ 381015 -1760 277682 247200 201417 31999 -70029 145082 -131405 -187728 376283 38379
11693A14751C0736I961a52901I8568i9797P971B3727b8853a1164B8261L11591
$$ 114751 30736 9961 -152901 98568 -99797 -91826 23727 -28853 -11164 28261 339852
11682C39852m6579D3003a29307a3500F7872f5597I0073d35335B28237E6828a29048
$$ 339852 293273 43003 -129307 -13500 67872 -65597 90073 -435335 228237 56828 -129048
11670E354J24421a64322F6718C0800h9006j01479f1391b0282K899A49401K38735
$$ 5354 129775 -164322 66718 30800 -89006 -190485 -61391 -20282 -17383 149401 388136
11659C88136a30679A84442a13758k0933B59599h7544j5379c3738j50631A46023
$$ 388136 -130679 184442 -113758 -134691 259599 -87544 -102923 -33738 -184369 146023
11648a94875J7764C73599O0432d3376A70346g9607E6943K9004g2335B28559H7410
$$ -194875 -177111 373599 434031 -43376 170346 -79607 56943 85947 -72335 228559 87410
11636i8580q5243a097o5892A6372N8926K98221j49222h4958g555B06174q2962
$$ -98580 -183823 -1097 -66989 16372 75298 373519 224297 -84958 -7555 206174 123212
11625A23212l9058M7049A8268L08278A43545n9553b42867B31910m7323Q051i8377
$$ 123212 84154 131203 18268 326546 143545 83992 -242867 231910 184587 192638 -98377
11613a64273E1259b459A11500D8026J52986c58974J71034L6551r6579a01276f911
$$ -164273 51259 -2459 111500 48026 201012 -358974 -187940 -151389 -247968 -101276 -6911
11601d3156A17085l4583Q2769K43236a47471j62123D744a40329m840b8838B51109
$$ -43156 117085 82502 165271 408507 -147471 -309594 4744 -140329 -145169 -28838 251109
11589C3214J83997q8413b02716B04695K71257H6965D3041a58560j50960h9354
$$ 33214 217211 128798 -202716 204695 475952 86965 43041 -158560 -309520 -89354
11578a50909e5586B04465P9658i8461c7439j7137B7473J74603A773P5960C5005
$$ -150909 -55586 204465 284123 -98461 -37439 -54576 27473 202076 1773 77733 35005
11566A67816f7709B33638b34675G5320a91048E5305J08861R0098A18702b4707
$$ 167816 -67709 233638 -234675 75320 -191048 55305 164166 254264 118702 -24707
11555A27834J31k6294C8859b18042A65578C099J85533A6540a23134A60108M1785
$$ 127834 127965 101671 38859 -218042 165578 3099 188632 16540 -123134 160108 201893
11544B01893F3030E85d5156C52704c7126j71686j7873B82999h9273B08799h736
$$ 201893 63030 585 -45156 352704 -37126 -208812 -226685 282999 -89273 208799 -8736
11532i7882D6023f6504B7577O5674a93084a20A90719k8390n2677N4612J32015
$$ -97882 46023 -66504 27577 93251 -193084 -120 190719 162329 109652 164264 296279
11521B96279H6753L1543a34160B79852j03540L2028A00783L8914N65a8312I5078
$$ 296279 86753 118296 -134160 279852 176312 208340 100783 139697 140262 -18312 95078
11509C58223a35199F20592a01579A15489a56765C52409D7880H981J33775g3542
$$ 358223 -135199 620592 -101579 115489 -156765 352409 47880 8981 142756 -73542
11498B1012a737B90619l8526I7928J52065l6447q7966R8692a50616A68602J50686
$$ 21012 -1737 290619 252093 97928 249993 213546 125580 224272 -150616 168602 319288
11487C19288A39561c99424B88275j36700O4280K02919A16866l853J0603K48220
$$ 319288 139561 -399424 288275 151575 215855 418774 116866 113013 123616 371836
11477C71836A43539d338C73465A02473K23199A50018i3353I172J73085E4796b3183
$$ 371836 143539 -4338 373465 102473 325672 150018 -93353 9172 182257 54796 -23183
11465B7850P4425l1980N8844L7336j5820K52788H8049J2679B2907J10069n2840
$$ 27850 102275 70295 129139 166475 150655 403443 88049 100728 22907 132976 80136
11454H0136R1007b50408H8843K81575j82038q00I2744M17272B5210P387b66477
$$ 80136 171143 -250408 88843 370418 188380 187580 92744 510016 25210 32597 -266477
11442D63322H1060b4845A527e9506q6478A09942B3343K29392g1590J0639b0347
$$ 463322 81060 -24845 1527 -59506 -145984 109942 23343 252735 -71590 -60951 -20347
11430A76605F231N9362g2253H8430J60060a08261B59114A16861K48859A40241
$$ 176605 6231 65593 -72253 88430 248490 -108261 259114 116861 365720 140241
11419i9096H0016J3190k9040K62006F4592g3993G46Q3296C3281K5096a92847e6035
$$ -99096 80016 93206 64166 326172 64592 -73993 746 84042 33281 58377 -192847 -56035
11406C45982a05801A34113R2626k7497I9321N8101L91787D6726b2756B78935A10028
$$ 345982 -105801 134113 226739 199242 99321 157422 549209 46726 -22756 278935 110028
11394A21153a32775O5085F3688I265h7457o66q9047B48003C9843J27926A3955
$$ 121153 -132775 -67690 63688 9265 -87457 -88123 -177170 248003 39843 167769 13955
11382a08540A1608c2408l08335H1829J71734n018j12699E1862R2890l5477c7625
$$ -108540 11608 -32408 -340743 81829 253563 248545 135846 51862 144752 109275 -37625
11370f4299N155k41882B09569L0912H817b86695H9977R6656n0016c457j65416
$$ -64299 -59144 -301026 209569 240481 8817 -286695 89977 186633 136617 -3457 -168873
11359a68873E8390b9230k08700a02905k86055A22856a5076j22770J6272A41548
$$ -168873 58390 -29230 -237930 -102905 -388960 122856 -15076 -137846 -121574 141548
11348G285b33573A44650n6620R3722G6560k6527g6361C7482a92891G2233b21668
$$ 7285 -233573 144650 88030 181752 76560 50033 -76361 37482 -192891 72233 -221668
11336f6549B07890h0318C66245D2268b62003Q8334B03402J7796Q3797D0912a34204
$$ -66549 207890 -80318 366245 42268 -262003 -173669 203402 221198 304995 40912 -134204
11324h8844A4990a6937m9280k18700E427a43446n7688R9829L1248B0523a32712
$$ -88844 14990 -16937 -66217 -284917 5427 -143446 -201134 -101305 -70057 20523 -132712
11312B5279K02317a30154c4823r4214q1308F6159J43004F3116a12701a1731m42677
$$ 25279 227596 -130154 -34823 -129037 -210345 66159 209163 63116 -112701 -11731 -454408
11301d54408a07684A61188a92398P7308Q410m7381G7195J13170a16326n0014B26584
$$ -454408 -107684 161188 -192398 -115090 -106680 -154061 77195 190365 -116326 -166340 226584
11289g5966A70030N0882N2487C3997e6807B62209a20490C3869d7985A04057a59379
$$ -75966 170030 220912 273399 33997 -56807 262209 -120490 33869 -47985 104057 -159379
11277h4719B828e2605A98977i5554H10Q7295a1751k34828c3381E0330a86553J9606
$$ -84719 2828 -52605 198977 -95554 810 88105 -11751 -246579 -33381 50330 -186553 -166947
11265a66947c5345k56770D49830i0939f194j3038A20645D9586b40214J19650A64960
$$ -166947 -35345 -292115 449830 -90939 -6194 -19232 120645 49586 -240214 -120564 164960
11253a34022f5317H9657h8147K9346J3760j88294f6361j26615A68724J15511e8720
$$ -134022 -65317 89657 -88147 -58801 -45041 -233335 -66361 -192976 168724 284235 -58720
11241b20335E3544a9751l42997g6993C67458b19277p1469c1343r9130A32688d84677
$$ -220335 53544 -19751 -362748 -76993 367458 -219277 -290746 -31343 -130473 132688 -484677
11229a50818C0571M9985k4223a37569q4900B93189g8072D8837d5701p3379L2802
$$ -150818 30571 80556 56333 -137569 -222469 293189 -78072 48837 -45701 -119080 -86278
11218h6278j58296d9897H8469e8705j87531j21774a27144O1236k5073k14283K3088
$$ -86278 -244574 -49897 88469 -58705 -246236 -368010 -127144 -65908 -90981 -305264 -282176
11207b82176b3912m1147A8465a72805N7418M6476B38843j06348n5953K96134A45878
$$ -282176 -23912 -65059 18465 -172805 -115387 -68911 238843 132495 76542 372676 145878
11195a54322K5562M3875m6594C04903A28664l4853a03057q9078P9658A77171b40818
$$ -154322 -128760 -84885 -131479 304903 128664 93811 -103057 -192135 -112477 177171 -240818
11183b26696J9186g1793D3774c1434E2021i2405l7399c0001B1053b12644Q5498
$$ -226696 -207510 -71793 43774 -31434 52021 -92405 -129804 -30001 21053 -212644 -127146
11172a27146J4474C43227a95221B79838h5770A00786a41106C40745c23506B28388
$$ -127146 -112672 343227 -195221 279838 -85770 100786 -141106 340745 -323506 228388
11161f8465a5770j34630a6668k27720I7557b67445c3650A84728p1155g9166j6907
$$ -68465 -15770 -150400 -16668 -244388 97557 -267445 -33650 184728 113573 -79166 -96073
11150i6073b2784A64919L9788a33846j3046C30439h8701c4115A54676b91770h4334
$$ -96073 -22784 164919 204707 -133846 -146892 330439 -88701 -34115 154676 -291770 -84334
11138b69857C0558f0648F0337e9795A00382A365b17076A70355g2286A12131d1875
$$ -269857 30558 -60648 60337 -59795 100382 1365 -217076 170355 -72286 112131 -41875
11126b04405G8552K8558d0170E6833J98929F3587H959L2590h7931B55556B9664
$$ -204405 78552 107110 -40170 56833 255762 63587 8959 41549 -87931 255556 29664
11114B88065J1163c98250b7311C2133i7694A5627K00983q6166n7483A7473J5239
$$ 288065 299228 -398250 -27311 32133 -97694 15627 216610 130444 72961 17473 32712
11103C2712R1171e7230B07690K4489C0985J95564r2779j6996L29210A98269f641
$$ 32712 123883 -57230 207690 232179 30985 226549 133770 116774 445984 198269 -6641
11091C25437D5684K38515P7851m3851p0636H3646R0773a3696A49103A6084J34515
$$ 325437 45684 284199 362050 318199 247563 83646 174419 -13696 149103 16084 150599
11080A50599J59710l9411M08598k86940a9201C91245o830H6794L56436J52696
$$ 150599 310309 270898 679496 392556 -19201 391245 384415 86794 443230 595926
11070E95926j99944j05429K66497k329o5624r6056J20678j88465j5572Q7880J78173
$$ 595926 395982 290553 557050 554721 489097 393041 513719 325254 309682 397562 575735
11059E75735K6645J78661l00767J36755L8266J4127o1970M13434j32807j3604
$$ 575735 602380 781041 480274 617029 655295 669422 607452 1020886 888079 874475
11049H74475n7005R7775k46939J37842k47109L45396O4465k98708q4128N68219
$$ 874475 817470 915245 668306 806148 559039 904435 968900 670192 586064 1154283
11039A154283l56768j51239J78311k232K2460k34141K93493o3503q6907q5076
$$ 1154283 797515 646276 824587 822355 844815 610674 904167 840664 753757 668681
11029F68681J36258o255N9670l80521L38084k967l491N0110P1292p5531m1092
$$ 668681 804939 798684 858354 477833 815917 812950 809459 859569 930861 855330 814238
11018H14238j37515k19214J57208j37110K39853j85581J02490k3150M2022l5550
$$ 814238 676723 457509 614717 477607 717460 531879 634369 611219 653241 617691
11008F17691N9613M497r9664l3295K1323P8061K16620K8280m13740o954M69903
$$ 617691 677304 681801 582137 548842 570165 648226 864846 893126 479386 472432 942335
10997I42335K00884D40314M04680O7702j28521k80466M22782J78863k19209J59630
$$ 942335 1143219 440314 844994 912696 784175 503709 926491 1105354 886145 1045775
10987A045775j23820q5076L18806m51398K48180J38056L27465l00161N36070K2171
$$ 1045775 921955 836879 1155685 704287 952467 1090523 1417988 1117827 1653897 1676068
10977A676068J74159K06789N12459N01197n8317K08392M15834l87721J21371r6118
$$ 1676068 1850227 2057016 2569475 3070672 3012355 3220747 3636581 3248860 3370231 3274113
10967C274113n91330j78122l98531j51000P3097j96005k78263J34516k13748K76768
$$ 3274113 2682783 2504661 2106130 1955130 2028227 1832222 1553959 1688475 1474727 1751495
10957A751495J21203k36490K537l9697n06158J04132k37770j73987k23117K11273
$$ 1751495 1872698 1636208 1638745 1599048 1092890 1197022 959252 785265 562148 773421
10947G73421k06695B78172K1833M2474A22189K3664K66208c0702E04741A74623
$$ 773421 566726 278172 300005 342479 122189 145853 412061 -30702 504741 174623
10936b3074F4936a0566H6602f8701h052m8266B73966A6909b09846B54073b36510
$$ -23074 64936 -10566 86602 -68701 -8052 -56318 273966 16909 -209846 254073 -236510
10924a56482c2073j124B3923M5491b92159c9543H9189K29675b09010C504b67400
$$ -156482 -32073 -33197 23923 69414 -292159 -39543 89189 318864 -209010 3504 -267400
10912f3292A34947h4144A60212b66249c7475B18742J46250j80206o8851a43774
$$ -63292 134947 -84144 160212 -266249 -37475 218742 364992 184786 115935 -143774
10901a80955a4464k4842D65908A81895b01259A4664J51702a63196A19375L9543
$$ -180955 -14464 -39306 465908 181895 -201259 14664 166366 -163196 119375 158918
10891A58918a30456C4714e3174F888c24229g5518A77844q1495a82538C05142f3307
$$ 158918 -130456 34714 -53174 6888 -324229 -75518 177844 96349 -182538 305142 -63307
10879B58292a68502j00293J11634A12572J03975j02932m5800j6447b71570A15689
$$ 258292 -168502 -268795 -157161 112572 216547 113615 67815 51368 -271570 115689
10868f7344k1090b198m4724H6930a9979B31645H133N7357J89259b06384c9434
$$ -67344 -88434 -2198 -46922 86930 -19979 231645 8133 65490 254749 -206384 -39434
10856A32005C9691a10344r6489D5768c75820J13125J04904F8555c36578J62791
$$ 132005 39691 -110344 -206833 45768 -375820 -262695 -157791 68555 -336578 -173787
10846a73787A74152e3799j74589e5198n9175b3750E4044d0771E8786c02803J37854
$$ -173787 174152 -53799 -228388 -55198 -114373 -23750 54044 -40771 58786 -302803 -164949
10835a64949B476J58176D589K83506G1831N759a70171d0167q8746A55354C5621
$$ -164949 2476 160652 4589 288095 71831 77590 -170171 -40167 -128913 155354 35621
10823a02576G1087d05416H7170c59117e6542a8067B75158B7572c84366C76446
$$ -102576 71087 -405416 87170 -359117 -56542 -18067 275158 27572 -384366 376446
10812C0948a11872G7137i0436B35406r8044B5427Q9920c5004A115a224k2290B9208
$$ 30948 -111872 77137 -90436 235406 137362 25427 115347 -35004 1115 -1224 -23514 29208
10799B87728I2205B4153h3436O271F1293a25850B01736c7419l53943J61500d3538
$$ 287728 92205 24153 -83436 -77165 61293 -125850 201736 -37419 -391362 -229862 -43538
10787a06329H5106N8620d4146A73587f6981B540i4123F3378M80973A84999c7775
$$ -106329 85106 143726 -44146 173587 -66981 2540 -94123 63378 544351 184999 -37775
10775a38657j03463a03893j99432J50188M3675C4746b29016B89678D2719b56730
$$ -138657 -242120 -103893 -303325 -153137 -109462 34746 -229016 289678 42719 -256730
10764G8618J18495a13023b3963G0795Q8692h5324A36110F4687a03716j8180A68351
$$ 78618 197113 -113023 -23963 70795 159487 -85324 136110 64687 -103716 -121896 168351
10752b71330j83949A18363J50369a32904B61686F273d9541n6273L2136j65445
$$ -271330 -455279 118363 268732 -132904 261686 6273 -49541 -105814 -73678 -239123
10742b39123F8594a4344j33081B79543a80483n2074R9283p2102c3205B36645R4717
$$ -239123 68594 -14344 -147425 279543 -180483 -232557 -133274 -205376 -33205 236645 331362
10731C31362a78191N6316E611a35051C62996E4601J46302D5311h3137A42703a57693
$$ 331362 -178191 -121875 5611 -135051 362996 54601 200903 45311 -83137 142703 -157693
10719b18443e3658j33676D2606N089a03767K4755D7675b94721I7237c49933c7611
$$ -218443 -53658 -187334 42606 47695 -103767 -79012 47675 -294721 97237 -349933 -37611
10707A22112b72160B73354b22122M4806k90264a18203o6164A78869i4987F4049
$$ 122112 -272160 273354 -222122 -177316 -467580 -118203 -184367 178869 -94987 64049
10696B69323J22678a16227A11708B2493L32480b76122D5291a0549D1095N8698
$$ 269323 392001 -116227 111708 22493 354973 -276122 45291 -10549 41095 99793
10686I9793a09005F4084k5778a31477b4807k016A41614a99545C4365f2621A4754
$$ 99793 -109005 64084 38306 -131477 -24807 -26823 141614 -199545 34365 -62621 14754
10674a06289B42737b43708A11385m5160a15529F3304a38211A29293H202c5333
$$ -106289 242737 -243708 111385 66225 -115529 63304 -138211 129293 8202 -35333
10663c00613h0695o1736f4172j95892J03236E2846b01224r3552f5082l3013k05979
$$ -300613 -80695 -142431 -64172 -260064 -156828 52846 -201224 -294776 -65082 -98095 -304074
10652c04074D3987J06600o8768a05109C4267c6753l51265a5252q2246A40320d9300
$$ -304074 43987 150587 81819 -105109 34267 -36753 -388018 -15252 -97498 140320 -49300
10640b41725r092A85811D2279J67298e5525a260A03965a66194B86220a87339e8482
$$ -241725 -250817 185811 42279 209577 -55525 -1260 103965 -166194 286220 -187339 -58482
10628a86261A65654J11345A06819b11285A20268a67118k29436J18997C96618c6036
$$ -186261 165654 276999 106819 -211285 120268 -167118 -396554 -277557 396618 -36036
10617a53186l57194a64930K1500b6731k3148B11612H8679B9196R3275C8640a18062
$$ -153186 -510380 -164930 -143430 -26731 -49879 211612 88679 29196 122471 38640 -118062
10605C30784I1282a63990j36962e1813l9407B62988L7726j6726A13032a51661
$$ 330784 91282 -163990 -300952 -51813 -91220 262988 300714 283988 113032 -151661
10594b33923i7953A06148P8889c70097J75229A62943a66488d5090j01535E9458
$$ -233923 -97953 106148 185037 -370097 -194868 162943 -166488 -45090 -146625 59458
10583B44352J77194b3588j09073o5054K7084A79566H471b3717r7072C1875a21639
$$ 244352 421546 -23588 -132661 -197715 -170631 179566 8471 -23717 -120789 31875 -121639
10571a61255j14447f5294m8601j01742L6258f9502j1265l1852r4527L1042h5392
$$ -161255 -275702 -65294 -113895 -215637 -179379 -69502 -80767 -112619 -207146 -176104 -85392
10559a11366F7878e5922A41782C3569a26314J5702B8356b37671C93358o3538G1429
$$ -111366 67878 -55922 141782 33569 -126314 -110612 28356 -237671 393358 329820 71429
10547B13459E1740c7497k1445A23819c4662l21499d3316A13273c98388d0664a135
$$ 213459 51740 -37497 -58942 123819 -34662 -356161 -43316 113273 -398388 -40664 -1135
10535i4721B25751b33789G8855J70832b24552m0535Q5616h7864j1851A77808o6906
$$ -94721 225751 -233789 78855 249687 -224552 -265087 -179471 -87864 -99715 177808 110902
10524A10902n1112c2470k32718B74793a52679J6314j14987q7786a56345A27655
$$ 110902 59790 -32470 -265188 274793 -152679 -136365 -251352 -339138 -156345 127655
10513I4832p559a42423B55416a34834L3699c8661A8179G73a1566m80028D8232
$$ 94832 87273 -142423 255416 -134834 -101135 -38661 18179 773 -11566 -491594 48232
10501A3952Q0080d7066A85875b93765E1266a61216l0805A8189b47311f810A66772
$$ 13952 94032 -47066 185875 -293765 51266 -161216 -192021 18189 -247311 -6810 166772
10489f7931c2349q1694A56143h7565C24435j3627e0755D81228o5188j90776J20942
$$ -67931 -32349 -114043 156143 -87565 324435 310808 -50755 481228 416040 225264 346206
10478C46206J16051j46351B7253K23115A03153b0956A75322c4533p3191E22612
$$ 346206 462257 315906 27253 250368 103153 -20956 175322 -34533 -107724 522612
10467b12132L5765j72135J31296a44A80812d4966B66705c04912A98590k6453b16191
$$ -212132 -176367 -348502 -217206 -144 180812 -44966 266705 -304912 198590 172137 -216191
10455a59193E0242b4789o5577q705H4462b85318L094h8294B436a51137N1617A6005
$$ -159193 50242 -24789 -90366 -99071 84462 -285318 -282224 -88294 2436 -151137 -99520 16005
10442g8982k14310J31266M2759C5749N4808J53176i9813A41327a5069A93746I5860
$$ -78982 -293292 -162026 -119267 35749 90557 243733 -99813 141327 -15069 193746 95860
10430A52752e1970A03918O281b68240A471J22515b46886A551f577j59512B16962
$$ 152752 -51970 103918 110199 -268240 1471 123986 -246886 1551 -6577 -166089 216962
10418e5146A20956b21123J06067j28465O2862A50073A1968d02247a83389E4856
$$ -55146 120956 -221123 -115056 -243521 -180659 150073 11968 -402247 -183389 54856
10407D4931a24939o2341M5637O0461F0031j4985a81953d5340J1448k17965B29139
$$ 44931 -124939 -187280 -141643 -81182 60031 45046 -181953 -45340 -33892 -251857 229139
10395a02199B8628L99095o9155o9137K3058o1426A00042i8657D9468K31744a53097
$$ -102199 28628 427723 358568 289431 312489 251063 100042 -98657 49468 281212 -153097
10383B99997l7286A02840K53236J61003E1231J18515J95099K48304j48075A68799
$$ 299997 262711 102840 356076 517079 51231 169746 364845 613149 465074 168799
10372d9379B03325J36136K5784p0112k6500r8398K6235O11572k48790q5869A69727
$$ -49379 203325 339461 365245 295133 268633 170235 196470 808042 559252 473383 169727
10360A20649L3029M09033B47796B2310J96965a48434A48922K24910K29442L96168
$$ 120649 153678 562711 247796 22310 219275 -148434 148922 373832 603274 999442
10350I99442m92799o9867j82727L15359G5193K11239p8896K50474P9215C15K87816
$$ 999442 506643 436776 254049 569408 75193 286432 207536 458010 537225 315 288131
10339B88131L49641B57399K48948J73096B64951B2014M9119L40717A40712K43754
$$ 288131 637772 257399 506347 679443 264951 22014 71133 411850 140712 384466
10329C84466c98372a12537A15668Q6894E5722j5287L35275j25113h5664C44384
$$ 384466 -398372 -112537 115668 202562 55722 40435 375710 250597 -85664 344384
10318B88360G029L63722j21576K43c1776D98408b66210a02940d0142k98955G7802
$$ 288360 7029 370751 249175 249418 -31776 498408 -266210 -102940 -40142 -339097 77802
10306I9366c78467a16747A87054b7741k03695B8715c40828A06429a43997E1049
$$ 99366 -378467 -116747 187054 -27741 -231436 28715 -340828 106429 -143997 51049
10295D5181g0364B00671r0626b7152F1035a68530H1099C1014e1015p4245A1527
$$ 45181 -70364 200671 110045 -27152 61035 -168530 81099 31014 -51015 -125260 11527
10283d768j07221L0839H847a33582k60827i6317B85800b57138C5162O6693a12148
$$ -4768 -111989 -81150 8847 -133582 -394409 -96317 285800 -257138 35162 101855 -112148
10271c7878r8931p6431M596f2587A05446N6612H0516b76758A79770J16670N3371
$$ -37878 -136809 -213240 -208644 -62587 105446 162058 80516 -276758 179770 296440 349811
10260C49811L25947B29383J25252J78486j00565D9295j1067O4454a39930i818
$$ 349811 675758 229383 354635 533121 432556 49295 38228 102682 -139930 -9818
10249c6217A13085K34140d8079j4110B9424K85394A24291a2715j91950j66004
$$ -36217 113085 347225 -48079 -62189 29424 314818 124291 -12715 -204665 -370669
10239c70669k65577a07011a2067A5551g1658l4026C9456a61060e7064B34303a73569
$$ -370669 -636246 -107011 -12067 15551 -71658 -105684 39456 -161060 -57064 234303 -173569
10227C218i087A53419D9830a4690G3110M6761a61611k23148i5816A34096M6158
$$ 3218 -9087 153419 49830 -14690 73110 119871 -161611 -384759 -95816 134096 180254
10216A80254f3160p9811B91600c21005B06558a0736B5980a38532M4292q9319j74985
$$ 180254 -63160 -142971 291600 -321005 206558 -10736 25980 -138532 -94240 -183559 -358544
10205c58544A15070b46438E5035k5327j2025K39234A27025a07075G6193A8334
$$ -358544 115070 -246438 55035 29708 17683 256917 127025 -107075 76193 18334
10194D4563K24197a07046j98866j28598A60602k1190b5534k40744J00012o0147
$$ 44563 268760 -107046 -305912 -434510 160602 139412 -25534 -266278 -166266 -226413
10184b26413R2019M2540l42283a31264K6374D4743c84193A89383K542d0238Q71
$$ -226413 -134394 -91854 -434137 -131264 -104890 44743 -384193 189383 191925 -40238 -39367
10173c9367a4084k25916A14153b76149H7470B8651b6754l55734A00114c43364
$$ -39367 -14084 -240000 114153 -276149 87470 28651 -26754 -382488 100114 -343364
10162a72165a0456j87441M7074b633n2413E4208J49458f7770B41264q0032a69903
$$ -172165 -10456 -197897 -150823 -2633 -55046 54208 203666 -67770 241264 161232 -169903
10150a27957A50360b78566a13620A07034R3832b78967D1076C346h4585j01399
$$ -127957 150360 -278566 -113620 107034 200866 -278967 41076 3346 -84585 -185984
10140a85984A49974A8468e7384m0205J308i534l49797J01893J00985A60199b06804
$$ -185984 149974 18468 -57384 -97589 -96281 -9534 -359331 -257438 -156453 160199 -206804
10128d302A68298p9087a26258K7418j79422a01865A62363a30993c0425j45299
$$ -4302 168298 89211 -126258 -98840 -278262 -101865 162363 -130993 -30425 -175724
10118a75724c408A91164a01661k4079A86248o912a6961B36559c68120J69463A49380
$$ -175724 -3408 191164 -101661 -125740 186248 179336 -16961 236559 -368120 -198657 149380
10106b56205j71444h6687A25350a35108d6652o1297j41951J17989A08700d36099
$$ -256205 -427649 -86687 125350 -135108 -46652 -107949 -249900 -131911 108700 -436099
10095a65503n6080C3013K05469b26379r5855B3042f6165C28425i1385G6690K36690
$$ -165503 -221583 33013 238482 -226379 -322234 23042 -66165 328425 -91385 76690 313380
10084C13380b44573C22975g8337j24897h6137c0087k35983b9933n4467J6132E8595
$$ 313380 -244573 322975 -78337 -203234 -86137 -30087 -266070 -29933 -84400 -68268 58595
10072c24605R7344h2007A14507b8342e049l70031a44182a9340p5281B20440l9563
$$ -324605 -227261 -82007 114507 -28342 -5049 -375080 -144182 -19340 -94621 220440 180877
10061A80877c5384G0391b03961Q6582c8736p8677H9920a72959e3577k07171g6209
$$ 180877 -35384 70391 -203961 -117379 -38736 -117413 89920 -172959 -53577 -260748 -76209
10049A65745D1557a10453C38862f8586j94983b1244B8395J01023k1757m072f3998
$$ 165745 41557 -110453 338862 -68586 -263569 -21244 28395 129418 107661 103589 -63998
10037B6032a00745b8910I6059c23401B22881a175A0710N2397e5077n6200L6434
$$ 26032 -100745 -28910 96059 -323401 222881 -1175 10710 63107 -55077 -111277 -74843
10026g4843k27280A18175J36730b52863A52717c88236D2230M2101a85733g1170
$$ -74843 -302123 118175 254905 -252863 152717 -388236 42230 84331 -185733 -71170
10015a86940G672d9978j02202f5241p3458B12373I4943b27192j1409l0508O0038
$$ -186940 7672 -49978 -152180 -65241 -138699 212373 94943 -227192 -238601 -269109 -209071
10004b09071E7038c37073a33324H4360a39257q5669E0237J58332h7746L7502k77946
$$ -209071 57038 -337073 -133324 84360 -139257 -224926 50237 208569 -87746 -50244 -328190
9993c28190F9203c54016b200j9592k3242A63999J42708A40848c85187e6908A61451
$$ -328190 69203 -354016 -2200 -21792 -45034 163999 306707 140848 -385187 -56908 161451
9981a94566D4745d4336m5903b0352j26369O3630C3802Q2874J25344c51803B05045
$$ -194566 44745 -44336 -90239 -20352 -146721 -83091 33802 116676 242020 -351803 205045
9969c20625A18261a4422j55006A43098L634C838d79480G0829J32656c42524b9211
$$ -320625 118261 -14422 -169428 143098 146732 3838 -479480 70829 203485 -342524 -29211
9957a73369I376b25883p498F2523c7236l00410j16991a58350P8937G5447d6677
$$ -173369 9376 -225883 -233381 62523 -37236 -337646 -454637 -158350 -79413 75447 -46677
9945G6234K33194a38274J1323L7171c027k7000l41558E3848c34855A72498k4815
$$ 76234 309428 -138274 -126951 -89780 -3027 -30027 -371585 53848 -334855 172498 147683
9934A47683k61h5869j44394A2408c07310D6914d5306l56922i0771I1154d304D9364
$$ 147683 147422 -85869 -230263 12408 -307310 46914 -45306 -402228 -90771 91154 -4304 49364
9921b28099e5101k84389E9460a88970L5321r6505J02148B27208A2645a47541F5249
$$ -228099 -55101 -339490 59460 -188970 -153649 -250154 -148006 227208 12645 -147541 65249
9909A00875k7458l209c20265a46621p8559A68526a6092l65562B05114a2664m06862
$$ 100875 73417 70208 -320265 -146621 -225180 168526 -16092 -381654 205114 -12664 -419526
9898d19526A18963a00922J0337l57555b06699g5045j94338C9024a07224e725n7711
$$ -419526 118963 -100922 -90585 -448140 -206699 -75045 -269383 39024 -107224 -5725 -63436
9887f3436A172a7698j81929p8377h5404B11101b86659f169k21460B50986a53608
$$ -63436 1172 -17698 -199627 -278004 -85404 211101 -286659 -6169 -227629 250986 -153608
9875c39012p353a23703a0160A21877k5869d6786q2817d6230j85719A42705b12380
$$ -339012 -346365 -123703 -10160 121877 96008 -46786 -129603 -46230 -231949 142705 -212380
9863B10698c4686o7377C0328K3980P3415K58747C967K6674a51990B47045g9418
$$ 210698 -34686 -102063 30328 54308 127723 386470 3967 30641 -151990 247045 -79418
9851b11805D2112a87240P0471j36575B4397b49351p8232A00729j4856a27299k2663
$$ -211805 42112 -187240 -116769 -253344 24397 -249351 -327583 100729 85873 -127299 -149962
9840a49962e0351k61774H2094c559A17401c73D6330M06160B3377P1791a66435
$$ -149962 -50351 -312125 82094 -3559 117401 -373 46330 452490 23377 95168 -166435
9828b07944b7982A95165a89351C2069C50b47424B9030q408P6820R1834c03032
$$ -207944 -27982 195165 -189351 32069 350 -247424 29030 20622 97442 189276 -303032
9816I5818g8625A80169l1192a69828C53764A47499b10971a0913j27433r3408j70650
$$ 95818 -78625 180169 148977 -169828 353764 147499 -210971 -10913 -138346 -231754 -402404
9805d02404P487J68535q46J01566q4133E8705b92731a1303A38018c02086a9246
$$ -402404 -394917 -226382 -227228 -125662 -209795 58705 -292731 -11303 138018 -302086 -19246
9793e5708A92912b94321B95131a13808m1601k1273I7633a14249D97409F8939c43283
$$ -55708 192912 -294321 295131 -113808 -155409 -176682 97633 -114249 497409 68939 -343283
9781c60674i2505A4367b40685A68119L00581a3759o1667A16893B6883J37613D50
$$ -360674 -92505 14367 -240685 168119 468700 -13759 -75426 116893 26883 164496 450
9769B56439a33768k78784I3830b04658B18537g4135k13033N681R9006G9685a0410
$$ 256439 -133768 -412552 93830 -204658 218537 -74135 -287168 -281487 -182481 79685 -10410
9757D0459e2382D736a10288A06982c69185A44711B7932d29575B8381p476a11061
$$ 40459 -52382 4736 -110288 106982 -369185 144711 27932 -429575 28381 20905 -111061
9745g0184n2494J9359A39150b39829h0343j17008F6573b42131n2748k23002B26616
$$ -70184 -122678 -103319 139150 -239829 -80343 -197351 66573 -242131 -294879 -517881 226616
9733B3363M5931g2890A0505i0868P742H6364L6720c27072J16923B5057c07704
$$ 23363 69294 -72890 10505 -90868 -83126 86364 123084 -327072 -210149 25057 -307704
9721a18662l1180J7838K1111j04153N5380j02317R5554a8160D6117b99595F5416
$$ -118662 -149842 -132004 -110893 -215046 -159666 -261983 -166429 -18160 46117 -299595 65416
9709a50548b4660P892A78337D3089a88754R4301D3996c835A7972P6579a81163
$$ -150548 -24660 -16768 178337 43089 -188754 -94453 43996 -3835 17972 94551 -181163
9697I9667a87496b0527j32474o2738g5339A67111a36105k76973A06863J0454K370
$$ 99667 -187496 -20527 -153001 -215739 -75339 167111 -136105 -413078 106863 117317 119687
9686A19687g9764j83380A43227a42224j1956g6949A46817F7326M4572O5943b44507
$$ 119687 -79764 -263144 143227 -142224 -154180 -76949 146817 67326 111898 177841 -244507
9674b25347R7282C3933d1022r9433D6997K4728e5035j4612k47173a0709j79595
$$ -225347 -128065 33933 -41022 -140455 46997 71725 -55035 -69647 -316820 -10709 -190304
9663a90304j89326B51809I8482a95877j81104a17249B57687I2631O7422a25300
$$ -190304 -379630 251809 98482 -195877 -376981 -117249 257687 92631 160053 -125300
9652A55378c08245N4552P7454D4832j4184a21288F56J6347c3278l92061J51556
$$ 155378 -308245 -253693 -176239 44832 30648 -121288 656 17003 -33278 -425339 -273783
9641b73783A15031A825a81644c9313j21580B12675o2148b8952A8367M5032L79126
$$ -273783 115031 1825 -181644 -39313 -160893 212675 150527 -28952 18367 63399 442525
9630D42525a82852O5957e6863q9047j29401O9510A74396m8026F1473a56718m5429
$$ 442525 -182852 -116895 -56863 -145910 -275311 -205801 174396 126370 61473 -156718 -202147
9619b02147E7739a72538G2591R4821b00877R6215a391l58237J53881g2933B62474
$$ -202147 57739 -172538 72591 167412 -200877 -104662 -1391 -359628 -205747 -72933 262474
9607b47591A8034a26130C478K23404D4096d16501C36045a69792l4477Q0039A37247
$$ -247591 18034 -126130 3478 226882 44096 -416501 336045 -169792 -204269 -124230 137247
9595c32572J04638L7519j21083g295A33861A9302R6536b376k01738R3924c0042
$$ -332572 -227934 -190415 -311498 -7295 133861 19302 115838 -2376 -204114 -110190 -30042
9583a30417B2840f0201k95285e7296D2477J7158b06556D556d7500l44052d6466
$$ -130417 22840 -60201 -355486 -57296 42477 59635 -206556 4556 -47500 -391552 -46466
9571b64292A42751a07157L35q1845h9374k37924J23134g2951D1253c35395G6387
$$ -264292 142751 -107157 -106822 -188667 -89374 -327298 -204164 -72951 41253 -335395 76387
9559e23414J24225i1149b3743l16532I8550b8385j02970j35701a20142j55773
$$ -523414 -399189 -91149 -23743 -340275 98550 -28385 -131355 -267056 -120142 -275915
9549b75915A5993c2709j61897l54202b7355r8762M8885H9010a64923p9504i5743
$$ -275915 15993 -32709 -194606 -548808 -27355 -126117 -77232 89010 -164923 -244427 -95743
9537E9786J48940b15292k8930I9362k7060J92258a9710j9041k40998G9998M3527
$$ 59786 208726 -215292 -244222 99362 72302 264560 -19710 -38751 -279749 79998 123525
9526A23525c0888A18722a46910k0288J6449A43514c25577J50573e9678C3182d3803
$$ 123525 -30888 118722 -146910 -167198 -150749 143514 -325577 -175004 -59678 33182 -43803
9514b17755A61136b87833L5104N5398A47100l2342a75194B61848j11615b47543
$$ -217755 161136 -287833 -252729 -197331 147100 114758 -175194 261848 150233 -247543
9503I9603b42817a12004D334J62965a36238O2354C2046a13382F2560A0051a67182
$$ 99603 -242817 -112004 4334 167299 -136238 -73884 32046 -113382 62560 10051 -167182
9491I553a15390m00423H9809b223j61339E7831F293M6044L3152a37827d2631B5965
$$ 9553 -115390 -515813 89809 -2223 -163562 57831 6293 52337 85489 -137827 -42631 25965
9478D8352i8828B40217D4878Q232f8964j42928e928o7690F7863N5249b6282A54043
$$ 48352 -98828 240217 44878 53110 -68964 -211892 -5928 -73618 67863 123112 -26282 154043
9465f2299A10550J10167e8576A43697N6406a10531l7850F497c2540A04328a67874
$$ -62299 110550 220717 -58576 143697 200103 -110531 -148381 6497 -32540 104328 -167874
9453b03939f5946B2470d00857A02760a6235m4439k43308a38180C6119a79165J117
$$ -203939 -65946 22470 -400857 102760 -16235 -60674 -303982 -138180 36119 -179165 -178048
9442a78048D13792b11411L6192N4778k9727A06954a02422A48480D6556J48345
$$ -178048 413792 -211411 -175219 -120441 -150168 106954 -102422 148480 46556 194901
9432A94901F187e9988B92479b06151j59965c4891K532k86998A13833b34216m215
$$ 194901 6187 -59988 292479 -206151 -366116 -34891 -32359 -319357 113833 -234216 -238431
9421b38431B9765b31586A12306a11291j9344o7960h6169k08957b4708A44199K6686
$$ -238431 29765 -231586 112306 -111291 -130635 -198595 -86169 -295126 -24708 144199 170885
9410A70885d9414A59681J06189b52781j54263J61753E8670a30257B08164a28652
$$ 170885 -49414 159681 265870 -252781 -407044 -245291 58670 -130257 208164 -128652
9399c82828R1691a39738K1417f478k11765B35336B6882J500J7319f7611L662q6225
$$ -382828 -291137 -139738 -118321 -6478 -218243 235336 26882 28382 45701 -67611 -63949 -150174
9387a50174J4742I8036i6309r7317e6666j29787A83395p1248k9864a03414m7795
$$ -150174 -135432 98036 -96309 -193626 -56666 -186453 183395 112147 82283 -103414 -151209
9376a51209A98281q8641h0089j62711b6644D9690L671a63783k8819B48697G4383
$$ -151209 198281 109640 -80089 -242800 -26644 49690 53361 -163783 -192602 248697 74383
9364g9870j07002C3289J24389c06915A04158K72452a20222n1551N0909D9188a34959
$$ -79870 -186872 33289 157678 -306915 104158 376610 -120222 -171773 -120864 49188 -134959
9352b59720J04080B6957f788A39166m3699a51893f7943p5076H6457i8830A54599
$$ -259720 -155640 26957 -6788 139166 95467 -151893 -67943 -143019 86457 -98830 154599
9340a91429E7851A3723b49010O2561A79495a46998d5780A00105c08715h5796A73515
$$ -191429 57851 13723 -249010 -186449 179495 -146998 -45780 100105 -308715 -85796 173515
9328b25448j30569a9807A64674b0604m0678K7372j15383k21900k03897K23219
$$ -225448 -356017 -19807 164674 -20604 -61282 -33910 -149293 -371193 -575090 -351871
9318c51871g8400A12659M4489f2134n7308A11783a76646F5279C2329K7038a04360
$$ -351871 -78400 112659 157148 -62134 -119442 111783 -176646 65279 32329 59367 -104360
9306A5628d9168l46697d2805p8201d8614m63456h2985G7080i3035p7242B5523
$$ 15628 -49168 -395865 -42805 -121006 -48614 -512070 -82985 77080 -93035 -170277 25523
9294a52452r4405J9129a2808A19721A4260O6132c8697j63404f9544C9158a85688
$$ -152452 -246857 -227728 -12808 119721 14260 80392 -38697 -202101 -69544 39158 -185688
9282c06820J31164A28548E9107N3207B1954b74971G4638i8654l06543A8749a65269
$$ -306820 -175656 128548 59107 112314 21954 -274971 74638 -98654 -405197 18749 -165269
9270a94826e8592R291A00133J83469b75703j32751a70423h3910n5862d2565A66622
$$ -194826 -58592 -49301 100133 283602 -275703 -408454 -170423 -83910 -139772 -42565 166622
9258A35032e1354i673j92366A45313a08891c8412r649m9347j6836a9150j21057
$$ 135032 -51354 -9673 -202039 145313 -108891 -38412 -48061 -97408 -114244 -19150 -140207
9247a40207n3257A27115Q1421h2965m8847m0839o6043e0806j47372j08079D8838
$$ -140207 -193464 127115 208536 -82965 -131812 -172651 -238694 -50806 -198178 -306257 48838
9235a90088K9839A07937J07662A9782b4163A44869c87861D6080a47701A68030
$$ -190088 -160249 107937 215599 19782 -24163 144869 -387861 46080 -147701 168030
9224c26367P3433h34B28920i9150A07920n1909b98814G1567c24493J04969L1936
$$ -326367 -252934 -834 228920 -99150 107920 56011 -298814 71567 -324493 -219524 -187588
9213a87588m09118K88455I7428A7201o70J21701n7016a35073H8712a02257n6185
$$ -187588 -596706 -308251 97428 17201 16531 138232 81216 -135073 88712 -102257 -158442
9202a58442j67408A07043c36209d7435E260a09596J3932a2322k17818I5430f5034
$$ -158442 -325850 107043 -336209 -47435 5260 -109596 -95664 -12322 -230140 95430 -65034
9190b15260g9283a1948l48587K3226B8615P2615b243B46597b0251j61997n9523
$$ -215260 -79283 -11948 -360535 -337309 28615 101230 -2243 246597 -20251 -182248 -241771
9179b41771a9165F0756h6294j34930P6372E1338a47635A78271m0885d5810p4856
$$ -241771 -19165 60756 -86294 -221224 -144852 51338 -147635 178271 137386 -45810 -120666
9168a20666p381N4708j22762N9566K449j2455g1704H5483a11147A22113Q2692
$$ -120666 -128047 -73339 -196101 -136535 -134086 -146541 -71704 85483 -111147 122113 204805
9157B04805G2164a64682A17452k0032l9851J55776b41237n5632J38679C51088
$$ 204805 72164 -164682 117452 97420 57569 213345 -241237 -296869 -158190 351088
9146a06425E9841a17824m7150q8255A92876b28858B47715a17793K7805A06361
$$ -106425 59841 -117824 -164974 -253229 192876 -228858 247715 -117793 -89988 106361
9135b64475B07626e2997k20004A10124i4763c739F8360a74663N1903M00M8828
$$ -264475 207626 -52997 -273001 110124 -94763 -3739 68360 -174663 -122760 -122360 -73532
9124g3532n2334a1810A96209b2217M952I5784a11707k9102M694F8804M8556L17675
$$ -73532 -125866 -11810 196209 -22217 -17265 95784 -111707 -140809 -136115 68804 117360 435035
9112D35035e82592B525A72f0602a5721B43892O1349A02676a87306B8392K152J52851
$$ 435035 -582592 2525 172 -60602 -15721 243892 305241 102676 -187306 28392 30544 183395
9100A83395a04732A23999e0260n4216I5008f1058k51218g6280a9753H2800a98060
$$ 183395 -104732 123999 -50260 -104476 95008 -61058 -312276 -76280 -19753 82800 -198060
9088C4721a55959k1771I0327c18578i5537A39723F8975c6911C1156a53304O6043
$$ 34721 -155959 -177730 90327 -318578 -95537 139723 68975 -36911 31156 -153304 -87261
9077h7261O552p8620p1685P4418C8098R8922b50934A91566k4840Q3351h9496c4612
$$ -87261 -80709 -159329 -231014 -156596 38098 137020 -250934 191566 166726 250077 -89496 -34612
9064a94458A32997b81433O1283B16256a32757f1962L0240E4245d55537g8734k2728
$$ -194458 132997 -281433 -220150 216256 -132757 -61962 -31722 54245 -455537 -78734 -101462
9053a01462d1080C8380J68997a50868B69162b31427M0252K6363A91299c02811
$$ -101462 -41080 38380 207377 -150868 269162 -231427 -191175 -164812 191299 -302811
9042b73514d7202a7261G7924L9199b19079P7023Q202A43255A4373P7152M6795
$$ -273514 -47202 -17261 77924 117123 -219079 -142056 -133854 143255 14373 91525 138320
9031A38320B2362g3697k77382k6959d5753j09626j70581J30370A49371c05691
$$ 138320 22362 -73697 -351079 -378038 -45753 -155379 -325960 -195590 149371 -305691
9020A70404M16a76164j18648J03980L892h9042j497H1951l0551b20412A47040
$$ 170404 170820 -176164 -294812 -190832 -186940 -89042 -90539 81951 51400 -220412 147040
9008F403a99305L6560A68538G2225a91777l2451n6394A34871i534E6361fI3954
$$ 6403 -199305 -162745 168538 72225 -191777 -224228 -280622 134871 -9534 56361 -6 93954
8995c25899E3095f1687A56283a16285I3929d47538J14200a17907j58463A75574
$$ -325899 53095 -61687 156283 -116285 93929 -447538 -333338 -117907 -276370 175574
8984a33285b2451E050i5790m9675O9072j15728j11203E80165B08884B1199L9583
$$ -133285 -22451 5050 -95790 -145465 -76393 -192121 -303324 580165 208884 21199 60782
8973F0782F766R9273d14644a13168b9982j12578q3446A58696e0614k4461C3164
$$ 60782 6766 106039 -414644 -113168 -29982 -142560 -226006 158696 -50614 -75075 33164
8961B3334a21744j28898A20324a70245M0396C6821a44219D07877a65741o2285
$$ 23334 -121744 -250642 120324 -170245 -129849 36821 -144219 407877 -165741 -228026
8951b28026o1659A75466b34790G176f9068p8185c1642l31272J49537b4635l143
$$ -228026 -289685 175466 -234790 7176 -69068 -147253 -31642 -362914 -213377 -24635 -27778
8940b7778j23250q255A23526k8330c0815D59618M9775H0852N8458c07616R4899
$$ -27778 -151028 -159283 123526 95196 -30815 459618 509393 80852 139310 -307616 -212717
8929b12717B23267a98042A23744M99808K72362J059172L459544J1903461m440513
$$ -212717 223267 -198042 123744 623552 895914 1955086 5414630 17318091 12877578
8920A2877578C685637A605874G15890l10923B2960a19779b7836F1722L8816Q4569
$$ 12877578 3685637 1605874 715890 404967 22960 -119779 -27836 61722 100538 185107
8910A85107a28936B86214p8214E0353b02157j15646B27828a14715K5240I8421
$$ 185107 -128936 286214 208000 50353 -202157 -317803 227828 -114715 -89475 98421
8899a84061A93595a41090A05801k8859k5116r646a0038C3174b2546D9745f8953
$$ -184061 193595 -141090 105801 76942 51826 42180 -10038 33174 -22546 49745 -68953
8887a42961q1214B7470L64230a35694a9728j87096A83981o4767e9591j16988n1671
$$ -142961 -224175 27470 391700 -135694 -19728 -206824 183981 119214 -59591 -176579 -228250
8876b28250R8604j95103A1166a61362D2190K14681a709j84360h5649I8539B9593
$$ -228250 -129646 -324749 11166 -161362 42190 256871 -1709 -186069 -85649 98539 29593
$$ [...]
##END NTUPLES=NMR SPECTRUM
##END=
