##TITLE=AC1477_ZPERVRI303_8100998_XyNB9lbytl
##JCAMPDX= 6.0         $$ Bruker NMR JCAMP-DX V2.0
##DATA TYPE= NMR SPECTRUM
##DATA CLASS= NTUPLES
##ORIGIN= BRUKER
##OWNER= Administrator
$$ 1.72 TOPSPIN		Version 2.1
$$ 2013-08-16 21:19:43.335 -0700  Administrator@X
$$ Compression mode = diff/dup
##.OBSERVE FREQUENCY= 400.02188249412
##.OBSERVE NUCLEUS= ^1H
##.ACQUISITION MODE= SIMULTANEOUS (DQD)
##.ACQUISITION SCHEME= undefined
##.AVERAGES= 8
##.DIGITISER RES= 22
##SPECTROMETER/DATA SYSTEM= spect
##.PULSE SEQUENCE= zg30
##.SOLVENT NAME= COFFEE_meoh
##.SHIFT REFERENCE= INTERNAL, COFFEE_meoh, 1, 14.98509
##AUDIT TRAIL= $$ (NUMBER, WHEN, WHO, WHERE, PROCESS, VERSION, WHAT)
$$ ##TITLE= Audit trail, TOPSPIN		Version 2.1
$$ ##JCAMPDX= 5.01
$$ ##ORIGIN= Bruker BioSpin GmbH
$$ ##OWNER= Administrator
$$ $$ E:\/data/COFFEE/nmr/AC1477_ZPERVRI303_8100998_XyNB9lbytl/30/pdata/1/auditp.txt
$$ ##AUDIT TRAIL=  $$ (NUMBER, WHEN, WHO, WHERE, PROCESS, VERSION, WHAT)
(   1,<2013-08-16 21:19:36.725 -0700>,<Administrator>,<X>,<go>,<TOPSPIN 2.1>,
      <created by zg
	started at 2013-08-16 21:18:30.178 -0700,
	POWCHK enabled, PULCHK disabled,
       configuration hash MD5:
       C8 4E 4E 5D D3 5C D8 9E 9F 52 82 E0 59 8A DE 15
       data hash MD5: 64K
       D7 0B CA 0B 14 61 98 E6 18 0F 7D 8E EC C1 09 87>)
(   2,<2013-08-16 21:19:39.647 -0700>,<Administrator>,<X>,<proc1d>,<TOPSPIN 2.1>,
      <Start of raw data processing
       efp LB = 0 FT_mod = 6 PKNL = 1 PHC0 = 0 PHC1 = 0 SI = 32K 
       data hash MD5: 32K
       69 AA BC 9A 02 F5 AE 88 58 DF B1 CE AC B8 BC C2>)
(   3,<2013-08-16 21:19:39.944 -0700>,<Administrator>,<X>,<proc1d>,<TOPSPIN 2.1>,
      <pk PHC0 = 97.46521 PHC1 = 0 
       data hash MD5: 32K
       00 7C 2B 4A AB 3D F7 6E D0 00 E2 4B B9 13 7A C7>)
(   4,<2013-08-16 21:19:40.085 -0700>,<Administrator>,<X>,<proc1d>,<TOPSPIN 2.1>,
      <abs ABSG = 1 
       data hash MD5: 32K
       DD E1 9E 47 D7 32 03 60 5C A1 B3 38 C8 9F B3 B2>)
(   5,<2013-08-16 21:19:40.163 -0700>,<Administrator>,<X>,<proc1d>,<TOPSPIN 2.1>,
      <abs ABSG = 2 
       data hash MD5: 32K
       BF A7 BB 85 66 FC 98 DA 52 27 31 19 88 A7 C7 65>)
(   6,<2013-08-16 21:19:40.241 -0700>,<Administrator>,<X>,<proc1d>,<TOPSPIN 2.1>,
      <abs ABSG = 3 
       data hash MD5: 32K
       9A 83 16 70 3A 13 FA BF D1 9A A0 33 4A 07 44 4A>)
(   7,<2013-08-16 21:19:40.303 -0700>,<Administrator>,<X>,<proc1d>,<TOPSPIN 2.1>,
      <abs ABSG = 4 
       data hash MD5: 32K
       28 7D 4E B9 23 5B 08 61 F6 D4 8D AA 24 0D 31 F6>)
(   8,<2013-08-16 21:19:40.350 -0700>,<Administrator>,<X>,<proc1d>,<TOPSPIN 2.1>,
      <abs ABSG = 5 
       data hash MD5: 32K
       FA EE AE 45 BF 24 1C 3C 84 C2 B6 73 1A 01 D5 84>)
$$ ##END=
$$ 
$$ $$ hash MD5
$$ $$ E0 C3 E1 9C CF B2 7A A7 56 D5 17 D2 C3 16 80 85
##$RELAX= 
##$RELAX= 
##$RELAX= 
##$RELAX= 
##$RELAX= 
##$RELAX= 
##$RELAX= 
$$ Bruker specific parameters
$$ --------------------------
##$DU= <E:\>
##$EXPNO= 30
##$NAME= <AC1477_ZPERVRI303_8100998_XyNB9lbytl>
$$ [...]
##$TP= (0..7)
150 150 150 150 150 150 150 150
##$TP07= 0
##$TPNAME0= <>
##$TPNAME1= <>
##$TPNAME2= <>
##$TPNAME3= <>
##$TPNAME4= <>
##$TPNAME5= <>
##$TPNAME6= <>
##$TPNAME7= <>
##$TPOAL= (0..7)
0.5 0.5 0.5 0.5 0.5 0.5 0.5 0.5
##$TPOFFS= (0..7)
0 0 0 0 0 0 0 0
##$TUNHIN= 0
##$TUNHOUT= 0
##$TUNXOUT= 0
##$USERA1= <user>
##$USERA2= <user>
##$USERA3= <user>
##$USERA4= <user>
##$USERA5= <user>
##$V9= 5
##$VALIST= <valist>
##$VCLIST= <CCCCCCCCCCCCCCC>
##$VD= 0
##$VDLIST= <DDDDDDDDDDDDDDD>
##$VPLIST= <PPPPPPPPPPPPPPP>
##$VTLIST= <TTTTTTTTTTTTTTT>
##$WBST= 2048
##$WBSW= 25
##$XGAIN= (0..3)
0 0 0 0
##$XL= 0
##$YL= 0
##$YMAX_a= 651777
##$YMIN_a= -554880
##$ZGOPTNS= <>
##$ZL1= 120
##$ZL2= 120
##$ZL3= 120
##$ZL4= 120
##$ABSF1= 14.98509
##$ABSF2= -5.573092
##$ABSG= 5
##$ABSL= 3
##$ALPHA= 0
##$AQORDER= 0
##$ASSFAC= 0
##$ASSFACI= 0
##$ASSFACX= 0
##$ASSWID= 0
##$AUNMP= <proc_prof1d_extract_pilot.lims>
##$AXLEFT= 0
##$AXNAME= <>
##$AXNUC= <1H>
##$AXRIGHT= 0
##$AXTYPE= 0
##$AXUNIT= <>
##$AZFE= 0.1
##$AZFW= 0.1
##$BCFW= 0
##$BC_mod= 0
##$BYTORDP= 0
##$COROFFS= 0
##$CY= 15
##$DATMOD= 1
##$DC= 0
##$DFILT= <>
##$DTYPP= 0
##$F1P= 0
##$F2P= 0
##$FCOR= 0.5
##$FTSIZE= 32768
##$FT_mod= 6
##$GAMMA= 0
##$GB= 0
##$INTBC= 1
##$INTSCL= 1
##$ISEN= 128
##$LB= 0
##$LEV0= 0
##$LPBIN= 0
##$MAXI= 10000
##$MC2= 0
##$MEAN= 0
##$ME_mod= 0
##$MI= 0
##$NCOEF= 0
##$NC_proc= -8
##$NLEV= 6
##$NOISF1= 0
##$NOISF2= 0
##$NSP= 0
##$NTH_PI= 0
##$NZP= 0
##$OFFSET= 14.98509
##$PC= 1
##$PHC0= 97.46521
##$PHC1= 0
##$PH_mod= 1
##$PKNL= yes
##$PPARMOD= 0
##$PPDIAG= 0
##$PPIPTYP= 0
##$PPMPNUM= 2147483647
##$PPRESOL= 1
##$PSCAL= 4
##$PSIGN= 0
##$PYNMP= <proc.py>
##$REVERSE= no
##$SF= 400.02
##$SI= 32768
##$SIGF1= 0
##$SIGF2= 0
##$SINO= 400
##$SIOLD= 32768
##$SPECTYP= <>
##$SREGLST= <1H.CDCl3>
##$SSB= 0
##$STSI= 32768
##$STSR= 0
##$SW_p= 8223.68421052631
##$SYMM= 0
##$S_DEV= 0
##$TDeff= 65536
##$TDoff= 0
##$TI= <>
##$TILT= no
##$TM1= 0
##$TM2= 0
##$TOPLEV= 0
##$USERP1= <user>
##$USERP2= <user>
##$USERP3= <user>
##$USERP4= <user>
##$USERP5= <user>
##$WDW= 1
##$XDIM= 32768
##$YMAX_p= 456714821
##$YMIN_p= -691898
##$CURPLOT= <Network HP LaserJet P1505>
##$CURPRIN= <$Network HP LaserJet P1505>
##$DFORMAT= <normdp>
##$LAYOUT= <+/1D_H.xwp>
##$LFORMAT= <normlp>
##$PFORMAT= <normpl>
##$SURQMSG= 1
$$ End of Bruker specific parameters
$$ ---------------------------------
##NTUPLES= NMR SPECTRUM
##VAR_NAME=  FREQUENCY,     SPECTRUM/REAL,   SPECTRUM/IMAG
##SYMBOL=    X,             R,               I
##VAR_TYPE=  INDEPENDENT,   DEPENDENT,       DEPENDENT
##VAR_FORM=  AFFN,          ASDF,            ASDF
##VAR_DIM=   32768,         32768,           32768
##UNITS=     HZ,            ARBITRARY UNITS, ARBITRARY UNITS
##FACTOR=    0.250966925370066, 1,           1
##FIRST=     8223.43324360094, -218735,      -76374
##LAST=      0,             -36143,          57434
##MIN=       0,             -691898,         0
##MAX=       8223.43324360094, 456714821,    0
$$ Real data points
##PAGE= N=1
##DATA TABLE= (X++(R..R)), XYDATA
$$ [...]
19553a56765g20k15488a0597p8343D8844f5295C95559A4086a1332r7632j61703
19542b70667d8107A48059c1119a1281j97787b6721j12032k91530I0138b01120
19531D9744d795j29678k4514f7568B31862a80069A78963a51541A33241a29106
19520A1742a48305N5045j99574O8001N2465M3683C7433a77049B89552b06927h2264
19508C2851L3302a69266A2430a83590g4256M378j21863b3231k01488c6540A03664
19496a47417k41876A36900j7214a21359p1909C6193c05625A44831A9361b30504
19485a77027L938A42224m1934c0356j5070k27768a6861m8480B17289A7393J34724
19474A52117b68502F3457a20105r7825k54453A21489d56159a92315A39329d48920
$$ plain form
19553 -156765 -720 -216208 -10597 -88940 48844 -65295 395559 14086 -11332 -108964 -270667
19542 -270667 -48107 148059 -31119 -11281 -209068 -26721 -138753 -430283 90138 -201120
19531 49744 -4795 -134473 -158987 -67568 231862 -180069 178963 -151541 133241 -129106
19520 11742 -148305 -93260 -292834 -224833 -172368 -128685 37433 -177049 289552 -206927 -82264
19508 32851 66153 -169266 12430 -183590 -74256 -69878 -191741 -23231 -224719 -36540 103664
19496 -147417 -389293 136900 119686 -121359 -193268 36193 -305625 144831 19361 -230504
19485 -177027 -173089 142224 100290 -30356 -45426 -273194 -16861 -65341 217289 17393 152117
19474 152117 -268502 63457 -120105 -217930 -472383 121489 -456159 -192315 139329 -448920
19463A27299a64551a1038m2110l49775R5892f9678B6730a82845j74324K2444a00791
19451A18668b62035c7932F0302J20566i2488A35468E2304b4819k48035a32668
19440F5573a49623f6818k06355a09233k61772B05619a22315k00519E27568A81157
19429h7683K1961D1646f4038A5485N8525a6165j61532C80908b33827J13648c4263
19417b12779G9112K3342b10014m7496A10461c4358F7438a39827A57102c04223
19406a35853A25287a13012l05210K03020A10045k3654J37782f4739r7493c2710
19395c26240J49991b747B4962c10880A14360i97H8728D2364a92D8986b98561J35630
19383a62931a1096F7118d467r1710D7713J15176m6511b1388A49880f7168j21633
$$ plain form
19463 127299 -164551 -11038 -53148 -402923 -307031 -69678 26730 -182845 -357169 -334725 -100791
19451 118668 -262035 -37932 60302 180868 -92488 135468 52304 -24819 -272854 -132668
19440 65573 -149623 -66818 -273173 -109233 -371005 205619 -122315 -322834 527568 181157
19429 -87683 -65722 41646 -64038 15485 74010 -16165 -177697 380908 -233827 -120179 -34263
19417 -212779 79112 102454 -210014 -257510 110461 -34358 67438 -139827 157102 -304223
19406 -135853 125287 -113012 -418222 -215202 110045 86391 224173 -64739 -162232 -32710
19395 -326240 -176249 -2747 24962 -310880 114360 -997 88728 42364 -192 48986 -298561 -162931
19383 -162931 -11096 67118 -4467 -96177 47713 162889 116378 -21388 149880 -67168 -188801
19372a88801A97004d9604j32607Q1405k79341b7363a0328a672j40808A92484c2649
19360d306A90271G8838a19243B32609G1104h3481o1360f0882A95023c26603i1532
19348E6271c24705f3099A5974b75791A36291a21832B46577A15580f114G9125b41713
19336B61457a088H1603b63603q5483e3586A91705c45699A16416q668a43272l2835
19325a76107j29609B81864B8752a24407A34710c11072J40374b4848A78874H7953
19314B42255H3254b80697f1712D4532d7841D9400R0702b74397Q5458d4029j45402
19303a89431B18387a39494f2890K2830j08664B38771F9390K83131a13785A05551
19292A53026c35641A03106J48148g2572q0404o7038A80834a26026A20586O5064
$$ plain form
19372 -188801 197004 -49604 -182211 -100806 -380147 -27363 -10328 -1672 -142480 192484 -32649
19360 -4306 190271 78838 -119243 232609 71104 -83481 -144841 -60882 195023 -326603 -91532
19348 56271 -324705 -63099 15974 -275791 136291 -121832 246577 115580 -6114 79125 -241713
19336 261457 -1088 81603 -263603 -349086 -53586 191705 -345699 116416 107748 -143272 -176107
19325 -176107 -305716 281864 28752 -124407 134710 -311072 -170698 -24848 178874 87953
19314 242255 83254 -280697 -61712 44532 -47841 49400 140102 -274397 -188939 -44029 -189431
19303 -189431 218387 -139494 -62890 -40060 -148724 238771 69390 352521 -113785 105551
19292 153026 -335641 103106 251254 -72572 -152976 -220014 180834 -126026 120586 185650
19282A85650a43164o7352a6808p6748L1342A29736a18049k97692A02544P2937
19272A75481b49898A0815J23383q031b53242N5579Q3086j3608e0431j77007i5304
19260b61241A78889p3569a69817D5246a42526I1298J6178b58937N9328i9531B55463
19248D7881g8751K7375G6933b68676P9890a0266k23040c0037o551j84549B84835
19236c69996J05810O5415O9432k402j0997B6172L4273a73929P2063j65546P6702
19225a90710f9452A21926a788k48295m7777N8305a1494j3656l35010h3340j20419
19214b03759d1408k2623B42443H2009f8877b0002l4329A08386a34603D24466h5720
19202c11000j1030a44939a2698r529C5091h812k20731J08011j09160O1705A76960
$$ plain form
19282 185650 -143164 -210516 -16808 -93556 -62214 129736 -118049 -415741 102544 175481
19272 175481 -249898 10815 134198 126167 -253242 -197663 -114577 -128185 -50431 -227438 -95304
19260 -261241 178889 105320 -169817 45246 -142526 91298 107476 -258937 -199609 -99531 255463
19248 47881 -78751 -51376 76933 -268676 -188786 -10266 -233306 -30037 -36588 -221137 284835
19236 -369996 -264186 -198771 -129339 -131741 -142738 26172 60445 -173929 -101866 -267412 -190710
19225 -190710 -69452 121926 -1788 -250083 -297860 -239555 -11494 -25150 -360160 -83340 -203759
19214 -203759 -41408 -64031 242443 82009 -68877 -20002 -54331 108386 -134603 424466 -85720
19202 -311000 -322030 -144939 -12698 -22227 35091 -8812 -229543 -121532 -230692 -168987 176960
19190b89413J02535D6314b38456r2036C169O5002Q4580k8490a21224A55484g9363
19178b10052j3933f0143J9053k3129A22426m4747A1245a5555k82688K9918h1980
19166B0531J79111D4050d70121J70994g4681k91375D5005a23902E6808c70852
19155c47639e9380A46350m5810K2353a31030G7061b70601A14096b85988D2597
19144b57819a00673k5468L7007E125a37469B3458L45071F7921b35925A50822A1611
19132A23461g4991B23747d2569A07308m149M3040j8646D2072M4744D642a83591
19120A06667M3899i9784A32127c15362J17603O5974J1922H8298e4743H1416M747
19109H6163J71868C987M087f614A56803N038H0578b47097F4452p550g1244B189
$$ plain form
19190 -289413 -186878 46314 -238456 -330492 3169 68171 152751 124261 -121224 155484 -79363
19178 -210052 -223985 -60143 -41090 -64219 122426 77679 11245 -15555 -298243 -268325 -81980
19166 20531 199642 44050 -470121 -299127 -74681 -366056 45005 -123902 56808 -370852
19155 -347639 -59380 146350 100540 122893 -131030 77061 -270601 114096 -285988 42597
19144 -257819 -100673 -126141 -89134 5125 -137469 23458 368529 67921 -235925 150822 11611
19132 123461 -74991 223747 -42569 107308 103159 146199 127553 42072 86816 4642 -183591
19120 106667 150566 -99784 132127 -315362 -197759 -131785 -119863 88298 -54743 81416 86163
19109 86163 258031 3987 8074 -6614 156803 161841 80578 -247097 64452 56902 -71244 2189
19096C09571C792O0809b06513l3018k25045a71487B547P9393A6321a77025I1182
19084D3305e9639j22825Q6982A242b16284a00956l1539j0177L9812g220l16880
19073c24100C7250b68943L5512d7391k39001a12508b4399A49930a75990a9081
19062B7432a81315Q7656c9882D29357b46014I0473a72897H9835b08074c6131B48063
19050b33847E3058f3453o518j14105A6593m591a62797q6126B5712g4768c5016
19038D7137P6694a47156j07953n2892J166B42216c60627D43991H6788e7117B38149
19026A40037b9694D11519j46714j27805K63657E3972a39181A96142a32491G7307
19015a49062I3855c4859l23391B33757D1782C128a00302b1450D42333d16176c019
$$ plain form
19096 309571 3792 64601 -206513 -239531 -464576 -171487 2547 81940 16321 -177025 91182
19084 43305 -59639 -182464 -95482 1242 -216284 -100956 -132495 -142672 -102860 -7220 -324100
19073 -324100 37250 -268943 -233431 -47391 -286392 -112508 -24399 149930 -175990 -19081
19062 27432 -181315 -93659 -39882 429357 -246014 90473 -172897 89835 -208074 -36131 248063
19050 -233847 53058 -63453 -69971 -184076 16593 12002 -162797 -248923 25712 -74768 -35016
19038 47137 123831 -147156 -255109 -308001 -306835 242216 -360627 443991 86788 -57117 238149
19026 140037 -29694 411519 264805 137000 400657 53972 -139181 196142 -132491 77307
19015 -149062 93855 -34859 -358250 233757 41782 3128 -100302 -21450 442333 -416176 -3019
19003b87543d5176j6205m7641c0382n2362R591H1749M3143a77008P4270A65150
18991B04365a48485B9583M2925a45641k00332B32494q7341a1301d154j71869l7989
18980b14012a06695J3355k22573C09967b92145R8117A05335J40324C4731c9632
18969c96655J8265A60737b42906K9318f711B03906c77050j76630A42173b79908
18958C1229i7988A15764c20749j18133J87974a18573K9154E2554b78434B66675
18947b73969K5471D3799l206a615A14073R226g0612B26984a05182k3583p5947
18936b04712P8697k36739E6785b38760k8337j4996J25713E5117g8453j35304Q0623
18925a33134a0730j25085q5191q9078M1859B3132f6431k17024F3422i6554q7038
$$ plain form
19003 -287543 -45176 -61381 -109022 -30382 -82744 -73153 81749 124892 -177008 -102738 165150
18991 204365 -148485 29583 72508 -145641 -345973 232494 145153 -11301 -4154 -176023 -214012
18980 -214012 -106695 -93340 -315913 309967 -292145 -194028 105335 245659 34731 -39632
18969 -396655 -378390 160737 -242906 -213588 -6711 203906 -377050 -553680 142173 -279908
18958 31229 -97988 115764 -320749 -438882 -250908 -118573 -89419 52554 -278434 266675
18947 -273969 -248498 43799 40593 -1615 114073 123299 -70612 226984 -105182 -128765 -204712
18936 -204712 -126015 -362754 56785 -238760 -267097 -282093 -156380 55117 -78453 -213757 -133134
18925 -133134 -10730 -135815 -221006 -310084 -268225 23132 -66431 -283455 63422 -96554 -183592
18914a83592D6034L6104c9195m0220E9192R5009k9047b80823a37104p4998a696
18902A26826g2688I7450Q6862f1982j35708P3602G9392H228e4148k04507C8063
18890b8063k750F6975r511b36811e2857r4905B14263a70790F0223N5604i8930
18878c23596a3564k17277F7831a39733F8827k7740c45768F4049a36547j92500
18868c29047J07262n334Q4054E4343k5099b14924N9690j93479b7480H0639b29483
18856a15629q921j53208h1955E7586K972A7338d9886J8358g116A17274f4788K6085
18844c8703A7356a75068B41101j2347b41478A05185e9494O867c562B14284M4957
18833B59241l2447r754b6270j8466A09621m0071J3774h2253k14550i5981J9073
$$ plain form
18914 -183592 46034 82138 -39195 -79415 59192 154201 125154 -280823 -137104 -212102 -1696
18902 126826 -72688 97450 184312 -61982 -197690 -124088 79392 8228 -54148 -258655 38063
18890 -28063 -30813 66975 57464 -236811 -52857 -147762 214263 -170790 60223 115827 -98930
18878 -323596 -13564 -230841 67831 -139733 68827 41087 -345768 64049 -136547 -329047
18868 -329047 -221785 -227119 -143065 54343 29244 -214924 -155234 -348713 -27480 80639 -229483
18856 -115629 -124550 -277758 -81955 57586 60558 17338 -49886 -31528 -7116 117274 -64788 -38703
18844 -38703 17356 -175068 241101 228754 -241478 105185 -59494 -52627 -3562 214284 259241
18833 259241 226794 217040 -26270 -44736 109621 69550 83324 -82253 -296803 -95981 -76908
18822g6908j81429f3193A20646m0622i5181I2499B7699L6737c9243k83973A25174
18810A3561c4704C4797a45012A33003b02376H8883P5679l8428O8726b07336P7661
18799a29675j39180a22987F8934H217C752b69697D4341a97484q3984Q9253F9503
18787C53791b14968j49046R7257J11139j36579g2561p8472L4054j47780a1884
18776b39769B7767c16260a0667j89363B4988a78465E4643c58176a20922o7621
18766a88543n5452j43664E1123c29982a11005B68724A29106j1965Q0829b36594
18755B01236h9980f532j48900o8688F7656L45106f6918k69926e0706j87596a01225
18743b06229A79525d06890B424a72314l33684J49879R0429h5932A4077a91282
$$ plain form
18822 -76908 -258337 -63193 120646 80024 -95181 92499 27699 64436 -39243 -323216 125174
18810 13561 -34704 34797 -145012 133003 -202376 88883 164562 126134 194860 -207336 -129675
18799 -129675 -268855 -122987 68934 8217 3752 -269697 44341 -197484 -281468 -192215 69503
18787 353791 -214968 -364014 -266757 -155618 -292197 -72561 -151033 -116979 -264759 -11884
18776 -239769 27767 -316260 -10667 -200030 24988 -178465 54643 -358176 -120922 -188543
18766 -188543 -243995 -387659 51123 -329982 -111005 268724 129106 117141 197970 -236594
18755 201236 -89980 -6532 -155432 -224120 67656 412762 -66918 -336844 -50706 -238302 -101225
18743 -206229 179525 -406890 2424 -172314 -505998 -356119 -265690 -85932 14077 -191282
18732A1522K53614E3196b79973e180A21111d7196D09327b32814E0014i7940A61573
18720b70180J34619j7538j79837j38091f6880l3913j025A39203b16688A37899
18709A16357a53903a9560j29154J4217A71613b10042n8380Q7198P8039k79261
18699c82446a35657C14308b44686I2812d76754F9299b8936A40658n0790a86692
18688d2565p5940j68750O1204B1321Q881c16075A46574B1290b22657p8103A91365
18676a11002l26110a86199p632C9417c2468p7141j08489j4259B00144d1653C08274
18664A12465P65h2602q8662C3622e2014B50220A07265c0655B17394J6354C1378
18652H8712K0975a53967q301B3902b33034M7540A10849j6110a32237H4608g4001
$$ plain form
18732 11522 265136 53196 -279973 -5180 121111 -47196 409327 -232814 50014 -97940 161573
18720 -270180 -135561 -153099 -332936 -471027 -66880 -100793 -101818 139203 -216688 137899
18709 116357 -153903 -19560 -148714 -134497 171613 -210042 -268422 -181224 -103185 -382446
18699 -382446 -135657 314308 -244686 92812 -476754 69299 -28936 140658 89868 -186692
18688 -42565 -118505 -287255 -226051 21321 30202 -316075 146574 21290 -222657 -300760 191365
18676 -111002 -437112 -186199 -193831 39417 -32468 -109609 -218098 -232357 200144 -41653 308274
18664 112465 113230 -82602 -171264 33622 -52014 250220 107265 -30655 217394 233748 31378
18652 88712 109687 -153967 -162268 23902 -233034 -185494 110849 94739 -132237 84608 -74001
18640E3436b51494g4213H5215a22172b0012j05485N8007p3465p9047a0246B73012
18628B60107i2897A48240p1075R8005h6307A32585b4387j76413A84788a27614
18617B14712n2442b30931A50532d0676m3752q2333H8351f551k53049n170D5806
18605B14926b76751d2418F3980a38508N1130c6427j31805Q3419k08096A56556
18594D03099A0108a76510C20847h7976j14054A76343b07155J9226k22267f3916
18583A8465J09653L6430b12233C5129g5647k2476F121a8649q8953k61101h6653
18571a2922k18126G9116b7848k93300g151k17982A24595i8499a0933m01627C7645
18559a83522k14238J46648N3229m7264A21130d22035d6917A86170b23415B852
$$ plain form
18640 53436 -251494 -74213 85215 -122172 -20012 -125497 -67490 -140955 -220002 -10246 273012
18628 260107 -92897 148240 77165 175170 -86307 132585 -24387 -200800 184788 -127614
18617 214712 162270 -230931 150532 -40676 -84428 -166761 88351 -6551 -259600 -264770 45806
18605 214926 -276751 -42418 63980 -138508 -87378 -36427 -168232 -84813 -292909 156556
18594 403099 10108 -176510 320847 -87976 -202030 176343 -207155 -187929 -410196 -63916
18583 18465 128118 164548 -212233 35129 -75647 -98123 6121 -18649 -107602 -368703 -86653
18571 -12922 -231048 79116 -27848 -321148 -7151 -225133 124595 -98499 -10933 -412560 37645
18559 -183522 -397760 -251112 -197883 -245147 121130 -422035 -46917 186170 -223415 2852
18548b6006m64109J91578J43063B17370b33834Q6685J010B21298c6366B2063f4934
18536A05163b39094B43747f572k07995b1986A15400R6567a82104A61183O4391
18526B25574c4950k31769a24457k07871h3201c6232k57117a43747A5098M9257
18516F4355e3748a174A5306d73017H4903a93675G513J70999d40478A35186c03102
18504e70159d0708a1391k97188A68854a86955j36187j55016F1800b33772C9988
18493b26819e2252j33100P5212j47904A36957b68324O9607A9131J5324c0681j58240
18482a88921I6643a07229d8313o1774c5805p6766B69071q5550a34178I9833c13991
18470a24706l5845q1380A75802g9305B88855A0190b06108D3239a37546I4009i5718
$$ plain form
18548 -26006 -490115 -298537 -155474 217370 -233834 -147149 -146139 221298 -36366 22063 -64934
18536 105163 -239094 243747 -6572 -214567 -21986 115400 211967 -182104 161183 225574
18526 225574 -34950 -266719 -124457 -332328 -83201 -36232 -293349 -143747 15098 64355
18516 64355 -53748 -1174 15306 -473017 84903 -193675 7513 178512 -440478 135186 -303102
18504 -570159 -40708 -11391 -308579 168854 -186955 -323142 -478158 61800 -233772 39988
18493 -226819 -52252 -185352 -110140 -258044 136957 -268324 -198717 19131 34455 -30681 -188921
18482 -188921 96643 -107229 -48313 -110087 -35805 -112571 269071 183521 -134178 99833 -313991
18470 -124706 -160551 -241931 175802 -79305 288855 10190 -206108 43239 -137546 94009 -95718
18458b36324d5091B0571K42252j11431a91733F7980a6324o9335L1500B8406c04585
18446A03156f1531j86139A39715a59195M4430k81053B4603k528a77813g7094F0278
18434e941m23095c3741m8820B36236n7420d5174j68640q4432f9194A2948J83290
18423A96238d8984M922A11962c80837J13851k06298g5104j03979k3304B88306
18412A98302J96502A11852C5108O3361b6061C5072K2229k26d12636F5203J7458
18401H2661i7458a2477C1763b82001B6193J9044k0824J16698n7527b32053A4819
18389a02174j81143H811b78437H824e715j35353R037j05217B8538c13788F0945
18377b773G431a19900I3634b1416A71355f052m09886A67161O5551i7852c5270
$$ plain form
18458 -236324 -45091 20571 262823 151392 -191733 67980 -16324 -85659 -54159 28406 -304585
18446 103156 -61531 -247670 139715 -159195 -114765 -395818 24603 22075 -177813 -77094 60278
18434 -5941 -429036 -33741 -82561 236236 178816 -45174 -213814 -298246 -69194 12948 196238
18423 196238 -48984 -44062 111962 -380837 -266986 -473284 -75104 -179083 -202387 288306
18412 198302 394804 111852 35108 98469 -26061 35072 57301 57075 -412636 65203 82661
18401 82661 -97458 -12477 31763 -282001 26193 45237 24413 141111 83584 -232053 14819
18389 -102174 -283317 8811 -278437 8824 -5715 -141068 -132031 -237248 28538 -313788 60945
18377 -2773 7431 -119900 93634 -21416 171355 -6052 -415938 167161 232712 -97852 -35270
18365C7015J33930a16568j62292A47524F0559a75362k30417c9383I0833B777N1805
18354E4582a34658k6118A40915K69351b31p5478j22586D5047i8873E7705j6764
18343D0941N8295i7271r2356l4784G941P3079a29979j14694g0907A9419a4808
18331a54945r7314B08032p5147M4816L6937a33892E1210a36016j79132R0768c7086
18319a80028B32438e9003k76268j30524i5392A70998g9558E4924h5984B98096
18308b68887C3589g9429C7477a11276A36546h5679o5410I8348a796m2598k22430
18297b66824B60576n8789r3196j206i4696j87300Q3001A17623P2268h4156E5487
18285c28608A3458b80041A69659B3359P1716h0664E77015a86145B06811a70274
$$ plain form
18365 37015 170945 -116568 -278860 147524 60559 -175362 -405779 -39383 90833 2777 54582
18354 54582 -134658 -160776 140915 410266 -231 -75709 -198295 45047 -98873 57705 40941
18343 40941 99236 -97271 -189627 -224411 7941 81020 -129979 -244673 -70907 19419 -14808
18331 -154945 -252259 208032 132885 177701 214638 -133892 51210 -136016 -315148 -224380 -37086
18319 -180028 232438 -59003 -335271 -465795 -95392 170998 -79558 54924 -85984 298096
18308 -268887 33589 -79429 37477 -111276 136546 -85679 -151089 98348 -1796 -44394 -266824
18297 -266824 260576 201787 108591 107385 -94696 -281996 -198995 117623 189891 -84156 55487
18285 -328608 13458 -280041 169659 23359 95075 -80664 577015 -186145 206811 -170274
18274a51840K3105p3663K5051C97156E2361a74617m0085R6719A96257m9208a06342
18262C9403r184L5033b11750Q0210k98781L0790E841K95586a31595L5108b447
18250B52692B5253a37860N5454j89014C0512b08818i1420k5599C4154M198a63226
18238F8129a40546k66090C7938c62983a24220I005L3639a35898j0380J1540j02942
18227b37680i3014o4392e3346M440f03j87090n541d6892r6960A41024o9001k7213
18215D4810J17060E3728a58494L3742k12308A81404o8213J22366j13440a51134
18204E3128l792c4099B81580G9365k5305f5299o4019a0028F4292a63559O7257
18193i6302j82679C14928a43586E0462R8966K10693b08697q1375a19827D3909
$$ plain form
18274 -151840 -128735 -202398 -177347 397156 52361 -174617 -214702 -117983 196257 147049 -106342
18262 39403 30219 65252 -211750 -131540 -430321 -399531 5841 301427 -131595 -96487 -2447
18250 252692 25253 -137860 -82406 -271420 30512 -208818 -91420 -117019 34154 38352 -163226
18238 68129 -140546 -406636 37938 -362983 -124220 9005 42644 -135898 -146278 -134738 -237680
18227 -237680 -93014 -157406 -53346 -48906 -603 -187693 -193234 -46892 -143852 141024 72023 44810
18215 44810 161870 53728 -158494 -124752 -337060 181404 113191 235557 122117 -151134
18204 53128 49336 -34099 281580 79365 54060 -65299 -129318 -10028 64292 -163559 -96302
18193 -96302 -278981 314928 -143586 50462 149428 360121 -208697 -290072 -119827 43909
18182B2504i6888G5416k8888d23982J12209d9293B28543c4206A0326P7341a95488
18170D5936a80088A79032d58172A41854M7292D6875q38b09615Q0072C98848b65661
18158B34880i9810H9046C3943a69851A15783i0485d4036j59064R5806M483j40720
18147b43531C4281b17818J5071e5551E7018a3886A18970L0727g4444j90469d9482
18135f5657j34365i0680A90974l1817c66452b2120L94j89046O5522A17688b16504
18123a79946B54915F2998q667a73775P9449q6144e9852K7101A89300M976J09535
18112C03811a95440B16071A07959D1719a14538k9553M7128B37158E2471f1222
18101d8771l9093E2271a4027D5711R1601J06396h0918l39804K07010F7938c77020
$$ plain form
18182 22504 -96888 75416 46528 -423982 -311773 -49293 228543 -34206 10326 87667 -195488
18170 45936 -180088 179032 -458172 141854 189146 46875 46037 -209615 -129543 398848 -265661
18158 234880 -99810 89046 33943 -169851 115783 -90485 -44036 -203100 -107294 -102811 -243531
18147 -243531 34281 -217818 -202747 -55551 57018 -13886 118970 149697 -74444 -264913 -49482
18135 -65657 -200022 -90680 190974 159157 -366452 -22120 -21726 -210772 -145250 117688 -216504
18123 -179946 254915 62998 54331 -173775 -94326 -180470 -59852 -32751 189300 194276 303811
18112 303811 -195440 216071 107959 41719 -114538 -144091 -96963 237158 52471 -61222
18101 -48771 -87864 52271 -14027 45711 137312 243708 -80918 -420722 -213712 67938 -377020
18089H1038c30006a33775M1040k4040b8484A58853h7731j27726k24250g1408A37196
18077a16539F2472K05263G807a23940A52781H875b40410A39343i4015A14171E5820
18065c8824a8247G7999M2072c17214G7057k4592J82609m9316I1611b4680k88672
18054c13352a7019k55931I0996a08636e3969r807E1010L5197h0354C4415R9974
18043A34389A2601b6544B25997f5693k43991a2672j46298j31783J6115B68709
18032b44518C77471a88195q6120a5928H8168f4827o2492a6488r4546r1956e8557
18020a3809o7047l24999B21299a19184F2289j8922a60615A17231a41868N3344
18010h8524A03909c17918B38180H8928J42995c8722B1917d4864o8424r8915c6868
$$ plain form
18089 81038 -330006 -133775 -92735 -116775 -28484 158853 -87731 -215457 -439707 -71408 137196
18077 -116539 62472 267735 7807 -123940 152781 8875 -240410 139343 -94015 114171 55820
18065 -38824 -18247 77999 120071 -317214 77057 52465 235074 185758 91611 -24680 -313352
18054 -313352 -17019 -272950 90996 -108636 -53969 -63776 51010 86207 -80354 34415 134389
18043 134389 12601 -26544 225997 -65693 -309684 -12672 -158970 -290753 -274638 268709
18032 -244518 377471 -188195 -274315 -15928 88168 -64827 -127319 -16488 -111034 -202990 -58557
18020 -13809 -80856 -405855 221299 -119184 62289 43367 -160615 117231 -141868 -88524
18010 -88524 103909 -317918 238180 88928 231923 -38722 21917 -44864 -113288 -212203 -36868
17998b67432E2845P2732b54540F4138a7457A75988b37415H4883e04I0551k3319
17987F7232a07941j42804B40419H7194F425J62744D7141N5022K6649B6013J87157
17976B13170j4650C3041a41254B4329J70914E4018J26575a41601M4248m7230A21346
17964B90128A2791h914H474b44750A12943h2600H5528g452k45995B81422C2681
17952a6431C46153A50457e02728a79586e8296j27314o362m9399B51400q3538f3525
17940c2842j40999f3686O607K7233B21759e0365D2641J6393d0062j24834e8768
17928i9527J1467q5719j05589A81869b9964j45344B4137d3366B86091a21439j83762
17917c05201a15898n8818d1454A29372e3193A5889L9024a4214I8705F221L963
$$ plain form
17998 -267432 52845 125577 -254540 64138 -17457 175988 -237415 84883 -504 90551 67232
17987 67232 -107941 -250745 240419 87194 6425 169169 47141 102163 128812 26013 213170
17976 213170 198520 33041 -141254 24329 195243 54018 180593 -141601 -97353 -144583 121346
17964 290128 12791 -8914 8474 -244750 112943 -82600 85528 -7452 -253447 281422 32681
17952 -16431 346153 150457 -502728 -179586 -58296 -185610 -191972 -241371 251400 167862 -63525
17940 -32842 -173841 -63686 -57079 -29846 221759 -50365 42641 59034 -40062 -164896 -58768
17928 -99527 -88060 -173779 -279368 181869 -29964 -175308 24137 -43366 286091 -121439 -305201
17917 -305201 -115898 -174716 -41454 129372 -53193 15889 54913 -14214 98705 6221 10184
17906A0184a48944A02005a69528M6138B34596a08352c6304C28358A38767b10713
17895b64189F1542c38321J61926E389b1778A86961j9876Q5851Q2341h0138k59511
17884c39649A78142N1879a62253O8200A1450J07785D8322f0121F7002a52254B18597
17872A79999a24480l9683A98927C4211e417B53075h1002A61459o0834g0836C1109
17860h6965k0782j37131J18616J4588j78405F6055a93460B49721f6596K7660a6236
17848d6345l29867e0955k7858k46497A64669m7405m543J55178c5479p1911e0813
17836B25207g865A23550a1225D5754a78058A27838i4189k84256d2668m361j69918
17825b16947c506A4623J93613G2868e965A02058b52902a20347a1320G8207B1549
$$ plain form
17906 10184 -148944 102005 -169528 -123390 234596 -108352 -36304 328358 138767 -210713
17895 -264189 61542 -338321 -176395 5389 -21778 186961 167085 252936 335277 -80138 -339649
17884 -339649 178142 230021 -162253 -94053 11450 119235 48322 -60121 67002 -152254 218597
17872 179999 -124480 -164163 198927 34211 -5417 253075 -81002 161459 100625 -70836 31109
17860 -86965 -107747 -244878 -126262 -111674 -290079 66055 -193460 249721 -66596 -38936 -16236
17848 -46345 -376212 -50955 -78813 -325310 164669 117264 112721 267899 -35479 -107390 -50813
17836 225207 -7865 123550 -11225 45754 -178058 127838 -94189 -378445 -42668 -47029 -216947
17825 -216947 -3506 14623 208236 72868 -5965 102058 -252902 -120347 -11320 78207 21549
17813a9431k07235e4459B9550c597n3844j1054A21496O2348K4308b05205D54073
17801C7416a0226B24012a35156b1247j25505d5323o7940k28252R1617B28838q7875
17790A40963j9606h0756G2947h4203A05997a7952A7131e5015g541k29848C2100
17778e8075J9371A55621H550d1757j40629B13515b02385C5425c64235c784D1819
17766a19566H6932N5381a11464A05238J9914a4107B38930J13911j16656B0826
17755A93642a40624k01355C2314E099a23412B31271G0543J4254C8296j641K6121
17744F2776g3985C05923A38993a39603C8773j072J14025a98479B55404r3224l8639
17733A23541a9329M46A8527b38435A02629b68576J10698p5297n1227h6363j8238
$$ plain form
17813 -19431 -226666 -54459 29550 -3597 -57441 -68495 121496 183844 208152 -205205 454073
17801 37416 -10226 224012 -135156 -21247 -146752 -45323 -113263 -341515 -249898 228838 140963
17790 140963 121357 -80756 72947 -84203 105997 -17952 17131 -55015 -7541 -237389 32100
17778 -58075 -38704 155621 8550 -41757 -182386 213515 -202385 35425 -364235 -3784 41819
17766 -119566 86932 142313 -111464 105238 125152 -14107 238930 352841 236185 20826
17755 193642 -140624 -341979 32314 5099 -123412 231271 70543 84797 38296 36655 62776
17744 62776 -73985 305923 138993 -139603 38773 37701 151726 -198479 255404 162180 123541
17733 123541 -19329 -18883 18527 -238435 102629 -268576 -157878 -233175 -284402 -86363 -104601
17722a04601j01652a8042I434b95374l3835C977P3447c14596i6580B1279g3765
17710g8243G6337k8221L51500c935q3116m5384c7709B18735C7234N8334f0323
17698H5655f9232j90201a8254j60231I8573h3921G9090J71930C2626L416a6974
17686f0423A43156A9562b3776A95611r3441B9591P110Q9044c6685j6066F985K01515
17674B08500b11236D2093R6740b01388A86139a16305P677c9279A56708e2128A93913
17662D20181b21847Q4060r2456B08410c5446C7085b50874C87943H2776J24497
17652B07273I9556b02905f8685k02502E1647b32642B64304A539Q5850K91480A01078
17640C5071J34876k6597J0108G4789f9368r5240C70583A1042b9172j53666Q4901
$$ plain form
17722 -104601 -206253 -18042 9434 -295374 -329209 3977 77424 -314596 -96580 21279 -73765
17710 -78243 76337 48116 399616 -3935 -87051 -132435 -37709 218735 37234 95568 -60323
17698 85655 -69232 -259433 -18254 -178485 98573 -83921 79090 251020 32626 36042 -16974
17686 -60423 143156 19562 -23776 195611 102170 29591 36701 125745 -36685 -52751 6985 208500
17674 208500 -211236 42093 138833 -201388 186139 -116305 -108628 -39279 156708 -52128 193913
17662 420181 -221847 -137787 -230243 208410 -35446 37085 -250874 387943 82776 207273
17652 207273 99556 -202905 -68685 -271187 51647 -232642 264304 1539 87389 378869 101078
17640 35071 169947 143350 153458 74789 -69368 -164608 370583 11042 -29172 -182838 -97937
17629i7937i591j95839B97082a41260A20815M656c73106F0738i8827D2739a55904
17617d2860A78657a67709G1403c1503q7547C69317B8726H753b7065B38913G2964
17605a09343A52774c03581d5474H2454b0700g614B83625b9687A88699a01888b7282
17593A68392a39400G1295Q7382a68011A31966B4181h579k1921p6882C33095a93434
17581a17838l4988o3001A25317B1208K7153b7761k04173E4787Q5063R8949d6535
17569A2985K31029j02924j0473d9718j37367B21465C080g1826h702A71393R8994
17558B70387L4019c4321j16442A5137a07932A38051a38244B24809g2515O547m0887
17547a06855A2014h4148A47678g1644B3114J57143E6243a10143L2047d937H5047
$$ plain form
17629 -97937 -9591 -205430 297082 -141260 120815 125471 -373106 60738 -98827 42739 -155904
17617 -42860 178657 -167709 71403 -31503 -119050 369317 28726 8753 -27065 238913 72964
17605 -109343 152774 -303581 -45474 82454 -20700 -7614 283625 -29687 188699 -101888 -27282
17593 168392 -139400 71295 158677 -168011 131966 24181 -8579 -30500 -107382 333095 -193434
17581 -117838 -152826 -215827 125317 21208 48361 -27761 -231934 54787 139850 238799 -46535
17569 12985 244014 141090 130617 -49718 -187085 221465 3080 -71826 -8702 171393 270387
17558 270387 304406 -34321 -150763 15137 -107932 138051 -138244 224809 -72515 -65968 -106855
17547 -106855 12014 -84148 147678 -71644 23114 180257 56243 -110143 -78096 -4937 85047
17535C24117b06539b7556A43045b01612B71234a30914B51601a3517G5001L53727
17525D28728a25061B26155a9923C26946j50640k1787E5736Q759K09727A34533
17514G1534C4843i9304i275B05382c453C40416H324f876A58516J9771k0902a47037
17501B35261M0391d8309A80186K11637A9948J61098K3300D493K45763C3727K69971
17490C03698a44122o1248B6122K31246c2876B45576a35511A75717J06593j7098
17480B65212j26223F3496J35180N6822K3730f6760a6473A92899L12778E5117c4700
17468C7782a67808A6208b88944h4824I8918A9568J30535G596L17315I5183a48228
17456a23263A70178B0861a2283C60689A17817J51682K22053G2708L85296B25072
$$ plain form
17535 324117 -206539 -27556 143045 -201612 271234 -130914 251601 -13517 75001 428728
17525 428728 -125061 226155 -19923 326946 176306 154519 55736 64495 274222 134533
17514 71534 34843 -99304 -9275 205382 -3453 340416 8324 -6876 158516 178287 157385 -147037
17501 235261 275652 -48309 180186 391823 19948 181046 204346 4493 250256 33727 303698
17490 303698 -144122 -205370 26122 257368 -32876 245576 -135511 175717 282310 265212
17480 265212 138989 63496 198676 255498 279228 -66760 -16473 192899 505677 55117 -34700
17468 37782 -167808 16208 -288944 -84824 98918 19568 150103 7596 324911 95183 -148228
17456 -123263 170178 20861 -12283 360689 117817 269499 491552 72708 458004 225072
17445D18985j68037K9790q1248a05450a6353C60980a30242M9170D50889A12879
17434B20321o5977J84049I1152J65921a3502j0974j6361B66282K2969M8971K6863
17423C65085i247B41768K45993A65271K58214A97590L9505k0451K83336K16624
17413G16604B4188k927f0309k53645B69424j07463e5210M942A91557b9100C03378
17401F0062J48231K97b1589C26806K4278D099J91789J44245A58725M725O2824
17390B26274J11133r0422b5666C97421A44413m5419a03702B38881r077g819A89076
17378H5356d9992C77792C6970J95237J95831A32013E8183O20a58622B15632K06042
17367D21674h916E6267K32681j0211P2564E2060K85984G2311g3593A13188f6821
$$ plain form
17445 418985 250948 280738 199490 -105450 -16353 360980 -130242 -81072 450889 112879
17434 220321 154344 338393 91152 257073 -13502 -24476 -40837 266282 289251 338222 365085
17423 365085 -9247 241768 487761 165271 423485 197590 237095 216644 499980 716604
17413 716604 24188 21261 -60309 -313954 269424 161961 -55210 -50268 191557 -29100 303378
17401 60062 208293 208590 -21589 326806 351084 4099 195888 340133 158725 163450 226274
17390 226274 337407 246985 -25666 397421 144413 98994 -103702 238881 229804 -7819 189076
17378 85356 -49992 377792 36970 232207 428038 132013 58183 58803 -158622 215632 421674
17367 421674 -8916 56267 288948 278737 351301 52060 338044 72311 -73593 113188 -66821
17355B53871b52498a7974A64755J05726A17983K37707n3681A14882l3369K0261
17345A01774c9115I1204D104N4806J60001e6758B77885G6003O4669L8947G1630
17333B73960n9817a98572C52388A25570C9585J54438I1711a19640F6073J34511
17323B00584C0833L81486m2101A17553a4852E6158K51304m6658D5872J15447a941
17311B87837j12641i9296C56461b10650A26510b32036D2917J80454K2571j10358
17301A35584C9956J88158j7148B6000L73433A0266a07455D05690p3055J3692A08995
17289C71250j31530A10750l3884J08402K59369h2418A24691J43814j3700A13808
17278g5933I3129J22077a1144B90074m1888r0830J95058A12574a33311b1980C12889
$$ plain form
17355 253871 -252498 -17974 164755 270481 117983 355690 302009 114882 81513 101774
17345 101774 -39115 91204 4104 58910 218911 -56758 277885 76003 140672 179619 71630
17333 273960 214143 -198572 352388 125570 39585 194023 91711 -119640 66073 200584
17323 200584 30833 412319 370218 117553 -14852 56158 307462 260804 45872 161319 -1941
17311 287837 175196 -99296 356461 -210650 126510 -232036 42917 223371 245942 135584
17301 135584 39956 228114 210966 26000 399433 10266 -107455 405690 332635 346327 108995
17289 371250 239720 110750 76866 185268 444637 -82418 124691 268505 254805 113808
17278 -75933 93129 215206 -11144 290074 248186 157356 352414 112574 -133311 -21980 312889
17266B60535n55b29622G0748J75191B4722K27329p5373J59960M8036A21619n6151
17255F5468K13745q8515c71532A05344K07433F0659K01995b22513I5821J61194
17245B57015j12939P5147M6747n2260Q0726E9122J21737D3299O1607K7520a91311
17233B23315a0602B95546N7626A8131d5998B19375r9730c9802j53717A7669M50515
17222D68184g5983I0335c0974C20063C2690Q6129J18245q1227J4863J55425a08930
17210A38986a78643D73095j23618G6721P650h584A21471a6921C09300B9227J30265
17199A59492K82609a21249E02368a48034B32368j05554J71021K1235B9969M35281
17189D65250J8948j65587J0153A24024K45314I3408j0486J49290D4827J92109
$$ plain form
17266 260535 259980 -229622 70748 245939 24722 252051 176678 336638 384674 121619 65468
17255 65468 279213 190698 -371532 105344 312777 60659 262654 -222513 95821 257015
17245 257015 144076 219223 265970 213710 294436 59122 180859 43299 104906 132426 -191311
17233 223315 -10602 295546 353172 18131 -45998 219375 119645 -39802 -193519 17669 468184
17222 468184 -75983 90335 -30974 320063 32690 118819 237064 155837 170700 326125 -108930
17210 138986 -178643 473095 349477 76721 84371 -8584 121471 -16921 309300 29227 159492
17199 159492 442101 -121249 502368 -148034 232368 126814 297835 319070 29969 465250
17189 465250 484198 318611 328764 124024 369338 93408 82922 232212 44827 236936
17179B36936K49566I4902K32230p5982R3040j07292O8764M727I1380K29578B0878
17167C54909D5660K06698J6404J40872A01513J79651A13965O2222l8333M83790
17157F21644g0321D7901M16835j21843A56483m9567J31800r1828B6650K04262
17147B30912r2742l0569a3581C65452A41415K50108j34432K77662m2944c05367
17136D99024j56596b848A71504J55810j47114N0624M978J61653k2148o0211j18373
17125A96723K82690A95476P5346Q9938d8004A32628L79875q0598r91m7480p6234
17114C07200k7003K84926k68968O4597Q7748B22645P3949k0976K05149H202L96203
17103D04405j81572K11257k04856N7808P0674L7538A52659J11132J15648K47694
$$ plain form
17179 236936 486502 94902 327132 251150 344190 236898 305662 310389 91380 320958 20878
17167 354909 45660 252358 268762 409634 101513 281164 113965 176187 137854 621644
17157 621644 -70321 47901 464736 342893 156483 106916 238716 146888 26650 230912
17147 230912 138170 107601 -13581 365452 141415 391523 257091 534753 491809 -305367
17136 499024 342428 -2848 171504 327314 180200 230824 235802 397455 375307 315096 196723
17125 196723 479413 195476 270822 360760 -48004 132628 512503 431905 430914 383434 307200
17114 307200 280197 565123 296155 360752 448500 222645 296594 275618 480767 8202 404405
17103 404405 222833 434090 229234 287042 357716 395254 152659 263791 379439 627133
17093F27133p0349k75120K16389L7229j76048J39008L12323l79343j55685K53068
17083E28605j905k28654J25252L1338j8235M5481A18888L45383A64390O17195
17073G81585l15104j26868L9812q3020j38636M16599J05665Q7823A90231K54282
17063D44513L840R719J91856l04597J66595p2784j38133m2250J57982J91455C02372
17051H89231j68905n5742l04227M27549l44939Q3513n187M8649k1384K90668D01392
17039I45084k79557l15329K43192k0109J23976B87131K8890j56847M12489N1990
17029F23653N9897j10365B48747L22410k23645O35467j50612l93899O4614m6304
17019D56778L68194n8142j56712k48611O83405l64711k56233J96892M3638k83187
$$ plain form
17093 627133 556784 281664 498053 535282 359234 498242 810565 431222 275537 528605
17083 528605 526700 298046 423298 454636 436401 481882 118888 464271 164390 781585
17073 781585 466481 339613 379425 296405 157769 574368 680033 767856 190231 444513
17063 444513 448353 458072 649928 345331 511926 439142 301009 258759 416741 608196 302372
17051 889231 720326 664584 360357 787906 442967 526480 521293 569942 548558 839226 401392
17039 945084 665527 350198 593390 573281 697257 287131 316021 159174 571663 623653
17029 623653 683550 573185 248747 571157 347512 982979 832367 438468 503082 456778
17019 456778 824972 766830 610118 361507 1044912 680201 423968 620860 664498 381311
17009C81311M47258k90001K54018k53265P9784K77955l32421K7578B86529Q84590
16999A171119n77665N0470J28627n7600p6725K09257k29502K64262m7630O1890
16989H96503l62624K30829K13047k75764k9033K56395l26684K09252C65854M44930
16979H10784k18813L7592L72800l21868J72565J23425j40794j61383L94219k69950
16969G98577N9325J91323k96949J93362l14197q779L04521k13206J62887J05676
16959I82540j34008q3889K93569k77513L7687J32965Q9765j86295J23733J25100
16949A103654q8656K29815N7937m48586K82164j86209q39j89667L64723K69617
16939A393953l67909P1094O4031m7932r2088R756K23927k8654L06447l78603Q1205
$$ plain form
17009 381311 828569 538568 792586 539321 619105 897060 564639 592217 286529 1171119
16999 1171119 593454 643924 772551 714951 638226 847483 617981 882243 834613 896503
16989 896503 533879 764708 977755 701991 672958 929353 602669 811921 365854 810784
16979 810784 591971 629563 1002363 680495 853060 976485 835691 674308 1068527 798577
16969 798577 857902 1049225 752276 945638 631441 622662 927183 713977 876864 982540
16959 982540 848532 764643 1058212 780699 818386 951351 1041116 854821 978554 1103654
16949 1103654 1014998 1244813 1302750 854164 1136328 950119 949280 759613 1124336 1393953
16939 1393953 1026044 1097138 1161169 1113237 1021149 1030905 1254832 1226178 1532625 1154022 1235227
16928A235227J40586J1843k98386J80033L7599Q2177o0918k46300L0193M19959
16918A532013j8578k63652j3944L17167j26359L03503n7917l32508L11248j89795
16908A461178L42080l53410k3487L59613m38268L60742r302j3267k62779J01564
16898A524664K38175O0997k54647L27900R7570J32430k12249l7357l02940M04163
16888A978706k41018J90332j06036K34494k9773L4940k45055K80090j9888N0014
16878B126806P5980J35617j78652N36466l73345j10992K38944j15496M3534k5873
16868B352989K34068k07278J38626L49939l83520J03505J01872L8060J17087J83
16858B845531l70494N91224j39035N7453R2756J03575j04539K20897K678K20066
$$ plain form
16928 1235227 1375813 1387656 1089270 1269303 1306902 1389079 1328161 1081861 1112054 1532013
16918 1532013 1513435 1249783 1235839 1553006 1426647 1730150 1672233 1339725 1650973 1461178
16908 1461178 1803258 1449848 1426361 1785974 1347706 1708448 1699146 1685879 1423100 1524664
16898 1524664 1762839 1823836 1569189 1897089 1994659 2127089 1914840 1877483 1574543 1978706
16888 1978706 1737688 1928020 1821984 2056478 2026705 2061645 1816590 2096680 2076792 2126806
16878 2126806 2202786 2338403 2159751 2696217 2322872 2211880 2450824 2335328 2378862 2352989
16868 2352989 2587057 2379779 2518405 2868344 2484824 2588329 2690201 2728261 2845348 2845531
16858 2845531 2475037 3066261 2927226 2984679 3077435 3181010 3076471 3297368 3300046 3520112
16848C520112J4065l71524L87402M7878J68905j27077K04558J08393l56327J61716
16838C758101K41709K91893J02550m09183M70943l15586K43194K61669k64454
16829D380836L80186j37030J56282L1271K01002m4989L41991k90216K61922N33058
16819E814313q2949K00650j06740L40809k34283K83978O1784P2189K14047K79733
16809F843531k67604K79266L88429q5782O19957r1178J84955L49650j07510k1532
16799H092182L61807L20109M38406l45181N48407M42039j88662L82376N93656
16790A0645139K44786K99958M94968K38370L43146L62842L17185L79192P21326
16781A4046912J94405M31063M31864M32069K63848J201139M07126L27266P40563
$$ plain form
16848 3520112 3534177 3162653 3550055 3597933 3766838 3639761 3844319 3952712 3596385 3758101
16838 3758101 3999810 4291703 4394253 3985070 4456013 4140427 4383621 4645290 4380836
16829 4380836 4761022 4623992 4780274 4811545 5012547 4967558 5309549 5019333 5281255 5814313
16819 5814313 5731364 5932014 5825274 6166083 5931800 6215778 6277562 6349751 6563798 6843531
16809 6843531 6575927 6855193 7243622 7157840 7777797 7686619 7871574 8221224 8113714 8092182
16799 8092182 8453989 8774098 9212504 8867323 9415730 9857769 9669107 10051483 10645139
16790 10645139 10889925 11189883 11684851 11923221 12266367 12629209 12946394 13325586 14046912
16781 14046912 14241317 14672380 15104244 15536313 15800161 17001300 17408426 17735692 18476255
16772A8476255N19311Q77351O13974J186645K05976P18803J251233N13200J317782
16763B5680530R41978J191377J243870J632768J032663J549020J422547J546829
16755C6241582J309269K642473J392396K166107K454422K246925K694485K566784
16747E3714443K599778L178362L221457L801684M045204L793405M080520M770503
16739H3205356N114990N390775N165380N822612O510882O526000O719491O638882
16731A31094368O972429P459334P515444O341927P294234N669996N821891M983589
16723A83153212L867693L002073J223155O18893q62867k230711l244896m440543
16715A81086009n223525o023845o353521o943094p125051p432944p767482o667443
$$ plain form
16772 18476255 18995566 19872917 20486891 21673536 21879512 22598315 23849548 24362748 25680530
16763 25680530 26622508 27813885 29057755 30690523 31723186 33272206 34694753 36241582
16755 36241582 37550851 40193324 41585720 43751827 46206249 48453174 51147659 53714443
16747 53714443 56314221 59492583 62714040 66515724 70560928 74354333 78434853 83205356
16739 83205356 88320346 93711121 98876501 104699113 111209995 117735995 124455486 131094368
16731 131094368 138066797 145526131 153041575 159383502 166677736 172347732 178169623 183153212
16723 183153212 187020905 190022978 191246133 191865026 191002159 188771448 185526552 181086009
16715 181086009 175862484 169838639 163485118 156542024 149416973 141984029 134216547 127549104
16707A27549104p291549o759355o389824o144347n737485n262108n358152n309785
16699G9296499m289246m217255l742399l875577l527726l100812k718176k649445
16691E1175863l427048j963650k162431k264090j645385j877076j870071j648828
16683C4317284j540255j484701j414480q88694j245820j484687p80137j005267
16675B4473243r89528j111716o97697r19344k23264j088215o37254o39242m46906
16666A7720077j017356j60889o53357n89725n79293l84989m99481m50233l17739
16657A3067015m52953l33185m47285k80386n44703k91138m8493k20947m56917
16648I991008j00511j52215m45209m68571J58678l00697j74348l32923l72587
$$ plain form
16707 127549104 120257555 113498200 107108376 100964029 95226544 89964436 84606284 79296499
16699 79296499 75007253 70789998 67047599 63172022 59644296 56543484 53825308 51175863
16691 51175863 47748815 45785165 43622734 41358644 39713259 37836183 35966112 34317284
16683 34317284 32777029 31292328 29877848 28989154 27743334 26258647 25478510 24473243
16675 24473243 23483715 22371999 21674302 20754958 20531694 19443479 18806225 18166983 17720077
16666 17720077 16702721 16541832 15888475 15298750 14719457 14334468 13834987 13384754 13067015
16657 13067015 12614062 12280877 11833592 11553206 11008503 10717365 10668872 10447925 9991008
16648 9991008 9890497 9738282 9293073 8824502 8983180 8682483 8508135 8175212 7802625
16639G802625k07467j2163R8029p27436q1887j6602k68732L4407j79633k66306
16629F174835K059j2856k54070K11733n75244P9927k00378l33792l9321r2807
16619D960086L41318m08200J4508l88664k26028L48178m72700L14910q4449k27500
16609D171459o1017j16440K63953k3660j51275l03280j8054o9108J03814n12711
16599C283681O20822l17127j57690m19330K82678Q6029m73729K26425m9540J30261
16589C212480o90487K83863K94770n27411J67368J9253n0331M541K97857m01149
16579B610754n632k11417J46883k8220J40347k66767J56662l17123q0141r3828
16569B051518K37595M0754k09926J18226j84736J90859j54103j33081K34107k25736
$$ plain form
16639 7802625 7595158 7582995 7681024 6953588 6871701 6855099 6586367 6620774 6441141 6174835
16629 6174835 6176894 6164038 5909968 6121701 5546457 5626384 5426006 5092214 5052893 4960086
16619 4960086 5301404 4893204 4907712 4519048 4293020 4641198 4168498 4483408 4398959 4171459
16609 4171459 4110442 3994002 4257955 4234295 4083020 3779740 3761686 3692578 3796392 3283681
16599 3283681 3904503 3587376 3429686 3010356 3293034 3379063 2905334 3131759 3082219 3212480
16589 3212480 2521993 2805856 3100626 2573215 2740583 2759836 2709505 2714046 3011903 2610754
16579 2610754 2605122 2393705 2540588 2512368 2652715 2385948 2542610 2225487 2145346 2051518
16569 2051518 2289113 2329867 2119941 2238167 2053431 2244290 2090187 1957106 2191213 1965477
16559A965477o5794R2385j92057K0521J38753j67663J52178N1942k77984o7444
16549A650314J49348J7953r9177J3991O2800K46318l50158p2341J79565p6164
16539A722449J14426k27917P2287j5249k02473J12422j33455K1044m3837Q6214
16529A505911j23352j14540K31409k02230M8388J14533l14243q8222K73714j99322
16519A132046j2373J29179N9044j80416J01409n5122K54403m15031L30269j76603
16509A166805j65603J90190j53301m7452R8709M0226p0456J40269j75662n1641
16499I72084J01848j26257J48446m30563M61426k7385l62026L20753l02949K11678
16489I67055P3371l26789L69373k9910J9274r364k2199j09760K8646N0618Q9237
$$ plain form
16559 1965477 1899683 1992068 1800011 1820532 1959285 1791622 1943800 1995742 1717758 1650314
16549 1650314 1799662 1817615 1718438 1732429 1795229 2041547 1691389 1619048 1798613 1722449
16539 1722449 1836875 1608958 1681245 1665996 1463523 1575945 1442490 1463534 1419697 1505911
16529 1505911 1382559 1268019 1499428 1297198 1345586 1460119 1145876 1057654 1331368 1132046
16519 1132046 1119673 1248852 1307896 1127480 1228889 1173767 1428170 1013139 1343408 1166805
16509 1166805 1001202 1191392 1038091 990639 1089348 1129574 1059118 1199387 1023725 972084
16499 972084 1073932 947675 1096121 665558 1126984 1099599 737573 1058326 755377 967055
16489 967055 1040426 713637 1083010 1053100 1072374 1063010 1040811 931051 959697 1010315 1099552
16478A099552j91514r3402K53773k72561J98265n1041l22797K65289m8873k14711
16468F21980J1560K37471k12168k13208L63302J09190j5296l35945L1855Q6857
16458F85598k6391J08800l29488L29047k33836O7386J73726k11960K01082J26115
16448H90079j46344r5157J48507m1258J66840p9565k34330k4302J91401j12876
16438F62995J0502L06658j95662B43496N01500C35986M29811j24420B98308P39582
16428A037890m43813m9974K41819j08051j79377J56542Q3180p4752k55507J12492
16418E20449K2738L17217j16032C69536J39669N4627j92647L6915q2425J97202
16408E22877j0587j48728K7969K50181K14348C14393R6931J03053M39986l77619
$$ plain form
16478 1099552 908038 814636 1068409 795848 994113 943072 620275 885564 836691 621980
16468 621980 633540 871011 658843 445635 808937 918127 902831 566886 598741 685598
16458 685598 659207 768007 438519 767566 533730 601116 774842 562882 763964 890079
16448 890079 743735 648578 797085 755827 922667 843102 608772 584470 775871 662995
16438 662995 673497 980155 784493 243496 744996 335986 765797 641377 298308 1037890
16428 1037890 594077 544103 785922 677871 498494 655036 738216 663464 407957 520449
16418 520449 543187 860404 744372 369536 509205 563832 371185 408100 325675 522877
16408 522877 512290 363562 391531 641712 856060 314393 411324 514377 954363 576744
16398E76744P2413k08990n2161N5024K55108l30659j73781M63379F2874K62813
16388C25687Q9444A58256K79463j23674j24787M26458k17977L17495Q1812l6216
16378G60830k00066q2830m7818J73305j91989j02412K33319p6207A73232J70104
16368C43336P2986K4399J34651j57244p8003K75299j59729R829K04832k23124
16358D47232L53656M1247B27823L28951j31143K99790l60034J46812k01773Q8112
16348C98538j49536J20134M1188q8088A11321l3277M84651D215M66387A93292
16337D54222k04375O1670d9644D57447A87591L42663B44617M9183R3943k6900
16327C60843O2473j89604J54163Q6878k19944J4767j7909J56836j55726K76968
$$ plain form
16398 576744 649157 440167 388006 443030 698138 367479 193698 657077 62874 325687
16388 325687 415131 158256 437719 314045 189258 615716 397739 715234 797046 760830
16378 760830 560764 477934 430116 603421 411432 309020 542339 466132 173232 343336
16368 343336 416322 440721 575372 418128 340125 615424 455695 465524 670356 447232
16358 447232 800888 842135 227823 556774 425631 725421 365387 512199 310426 398538
16348 398538 249002 369136 410324 322236 111321 78044 562695 4215 470602 193292
16337 454222 249847 311517 -49644 457447 187591 530254 244617 293800 387743 360843
16327 360843 423316 233712 387875 474753 254809 269576 251667 408503 252777 529745
16317E29745j17364F2641P15128I0284M03712k22033K74839j66864P1253j78764
16307B72427j02767J07637O9560R8742j24106n5478j3840M5868j47812N2286K52843
16296D55360o8418P1653I6007O1875n621j4264M52734G8295M3774J3431l5144
16285A00356M60714k52157G4605L01412B9614J41401m14L45758A17602D7194R1446
16274A38640d3158A48027K85859j14307J89958A8499L02423O0639I3487L83504
16264D76991j60355K48913O7925a45878D33895H6764L485b3123D6585A1734L82370
16253C94104B191K82557F4128J39190K9010k4618M0866J74693o6443P0344A13979
16241A47669d6879C21835N0921j505k1075I9372J07375J05910j10571J84796A46785
$$ plain form
16317 529745 412381 62641 777769 90284 493996 271963 546802 379938 451191 272427
16307 272427 169660 277297 346857 445599 321493 266015 252175 298043 150231 202517 455360
16296 455360 386942 458595 96007 157882 152261 137997 590731 78295 122069 135500 100356
16285 100356 561070 308913 74605 376017 29614 171015 170601 516359 117602 47194 138640
16274 138640 -43158 148027 433886 319579 509537 18499 320922 381561 93487 476991
16264 476991 316636 565549 633474 -145878 433895 86764 90249 -23123 46585 11734 394104
16253 394104 2191 284748 64128 203318 232328 207710 248576 423269 356826 427170 113979
16241 147669 -46879 321835 372756 371251 350176 99372 206747 312657 202086 386882 146785
16229A21390E2764J81584J49403m3053F0018j4028J85815J73179A87480k7267
16219A60213Q1338m2084J06583K3807D8789L39569j38351C9308P7319B2469J59405
16208A81874m4039L93950k23690H5695K83230D8729K33131H316M10414H3340J04923
16197A88263B1117M91616A68600b2574A36471L4800a87361B71114K3468H5393
16186f5207A29669J30686p9466K3635K76307D1362J00050J93749f8872C2542J51557
16175A84099F2969K34761H3636J11232B9828K43697M2753p5687J03501H3604J39319
16164B22923k3669E289c3456A71053J01980E5125i1408n5180I8552K25843a76969
16152A36248D2434J07045N9196B0220g843G4414p7R2787K61770h1584G4255J67760
$$ plain form
16229 121390 52764 234348 383751 340698 60018 45990 231805 404984 187480 160213
16219 160213 241551 199467 306050 329857 48789 388358 250007 39308 116627 22469 181874
16208 181874 137835 531785 308095 85695 368925 48729 281860 8316 418730 83340 188263
16197 188263 21117 512733 168600 -22574 136471 171271 -187361 271114 294582 85393
16186 -65207 129669 260355 180889 204524 480831 41362 141412 335161 -68872 32542 184099
16175 184099 62969 297730 83636 194868 29828 273525 316278 240591 344092 83604 222923
16164 222923 199254 5289 -33456 171053 273033 55125 -91408 -146588 98552 324395 -176969
16152 136248 42434 149479 208675 20220 -7843 74414 74337 167124 428894 -81584 74255 242015
16140B42015F1741Q5698a19913B79891E4199h3139o6847B36514o4422i8470B16828
16128I5079J33283a23670G4544i0095F1426L53211A40132J8019a57038f7882B51510
16116A89043b10594A58108b12182F25000a23611D2915a10733d8398F7474J56546
16106B24020b11911B29251D8177J40793a473E1369J91035j03363i3896C0092N5608
16095H5700L30920c16521M2360a25703A72621l4880A8625g847l06638E136b42904
16083a14848A10343e978A31539E0389c04781F3378K12419D0862c18920A43490
16072c8325j67437B6131e9176C5963h1939j56493E2868b53010A9739a43770I4253
16060C2214b8240A57778e5814l56393A52405P7214J76570A98580c83932i4607
$$ plain form
16140 242015 61741 147439 -119913 279891 54199 -83139 -149986 236514 172092 -98470 216828
16128 95079 228362 -123670 74544 -90095 61426 414637 140132 158151 -157038 -67882 251510
16116 189043 -210594 158108 -212182 625000 -123611 42915 -110733 -48398 67474 224020
16106 224020 -211911 229251 48177 188970 -1473 51369 242404 139041 -93896 30092 85700
16095 85700 416620 -316521 -274161 -125703 172621 137741 18625 -7847 -314485 5136 -242904
16083 -114848 110343 -5978 131539 50389 -304781 63378 275797 40862 -318920 143490
16072 -38325 -205762 26131 -59176 35963 -81939 -238432 52868 -253010 19739 -143770 94253
16060 32214 -28240 157778 -55814 -412207 152405 229619 406189 198580 -383932 -94607
16049C08902a19682F1808J19120f3014C3766J26762C4195e4684A39205c0148p5451
16038a05599b7624r2545N3929j39192k2380B40764A0249b06219N2237l8294A6669
16026g4601j61052M9644b7270D3738J19767a24888E6348c44185A06857a50123
16015f8160A16882J160b07453C4241O8231g04k36947i6319C59907b4937q071j70053
16003b03061i7163B8887Q4502f7380k14829A04124D3447h459p8738A1308f7877
15991d5109o5600N0796B75327p6086D448c24312d4592l31237I9990N5242J27843
15980B83075j07515m1158f36731C09883F8530j1394P9944C234e7275B47144E4303
15968A51247f7727j34527C36263a17505l6A06344d18646P9253A49003b65097A45939
$$ plain form
16049 308902 -119682 61808 180928 -63014 33766 160528 34195 -54684 139205 -30148 -105599
16038 -105599 -27624 -120169 -66240 -205432 -227812 240764 10249 -206219 -153982 -192276 16669
16026 -74601 -235653 -186009 -27270 43738 163505 -124888 56348 -344185 106857 -150123
16015 -68160 116882 118042 -207453 34241 102472 -704 -237651 -96319 359907 -24937 -33008 -203061
16003 -203061 -97163 28887 113389 -67380 -282209 104124 43447 -8459 -87197 11308 -67877
15991 -45109 -110709 -59913 275327 199241 4448 -324312 -44592 -375829 99990 155232 283075
15980 283075 175560 134402 -636731 309883 68530 57136 137080 3234 -57275 247144 54303
15968 151247 -67727 -202254 336263 -117505 -117541 106344 -418646 -339393 149003 -265097 145939
15956B82988Q9696G206b52445f4143p4505A88478h0802A29126i6890c9047C04368
15944b42391A94673a54013f9140a0742j3694j16422H0853d823B28955C507J07264
15933A10771A9126a97953D4361D756O5521c6484G8669d3976e13j63800J0032A9436
15920G1617a61637B35129a9819L126o9011K3667D3280b8603A62964R0226a39361
15908a8131j38374o1117D66b48330G9037r477J35666H5507f6332A64068L43828
15897E07896a57963c3129q0735r3184R3872B23752k1598h5937a469A51072a65874
15885H4612i1571D8101b47963A35664J65686b90899A30747a37057g661A87663
15874b06746c0306j47778G8107c5143p7789B36772K32359d1962D2341a67948B65152
$$ plain form
15956 282988 372684 7206 -252445 -64143 -138648 188478 -80802 129126 -96890 -39047 304368
15944 -242391 194673 -154013 -69140 -10742 -24436 -140858 80853 -4823 228955 3507 110771
15933 110771 19126 -197953 44361 4756 70277 -36484 78669 -43976 -513 -164313 -154281 19436
15920 71617 -161637 235129 -19819 -16693 -85704 -62037 43280 -28603 162964 253190 -139361
15908 -18131 -156505 -217622 466 -248330 79037 69560 205226 85507 -66332 164068 507896
15897 507896 -157963 -33129 -113864 -207048 -113176 223752 202154 -85937 -1469 151072 -165874
15885 84612 -91571 48101 -247963 135664 301350 -290899 130747 -137057 -7661 187663
15874 -206746 -30306 -178084 78107 -35143 -112932 236772 469131 -41962 42341 -167948 265152
15862a58420a7134k52432l9550a23900D1452a20696A48158a64188B32289p3071
15852A59218b62407a02049b8930A85421f3862C8819d2755B27962c98433D4185
15841b82948H6543a95275k39166J79689A80195b5424n9634j4708k31004p0924
15831d01694a07846M4049D81482a53587j84346b2976F6113M1495e2590k48740
15821c01330A8794d35853J77455j00898a8455A86927F1500A6662a51512j35944
15811b87456j06992c1942j71686j72702B87117B131J7686a07468c9314A2640a61522
15799D4742f5553G1604a62999E8997J40563b76838A90525C838i4949A3885N8045
15788G1930b99691B65778G0296b48224p5301a7093l3050k6990j47184J3200E4612
$$ plain form
15862 -158420 -17134 -269566 -309116 -123900 41452 -120696 148158 -164188 232289 159218
15852 159218 -262407 -102049 -28930 185421 -63862 38819 -42755 227962 -398433 44185
15841 -282948 86543 -195275 -434441 -254752 180195 -25424 -85058 -99766 -330770 -401694
15831 -401694 -107846 -63797 481482 -153587 -337933 -22976 66113 107608 -52590 -301330
15821 -301330 18794 -435853 -258398 -359296 -18455 186927 61500 16662 -151512 -287456
15811 -287456 -394448 -31942 -203628 -376330 287117 2131 19817 -107468 -39314 12640 -161522
15799 44742 -65553 71604 -162999 58997 199560 -276838 190525 3838 -94949 13885 71930
15788 71930 -299691 265778 70296 -248224 -323525 -17093 -50143 -77133 -224317 -211117 54612
15776A63626d7540G8585p729h5950o3171q0583m00155a62910J0253B74510A11481
15764b67873i4973C2985G190J19221d29939B28036A05346K28787j25991n3793
15754A54349a34941N1040l13506B88515a90699D23982C364d592n3904A30052i5231
15742C1046a43280A72344E8625a967C95234f2412q1729c690l55300f7518C27468
15730D6376c0292k21563G8602J9144J16799M3075a10834A4107o169M2009K6870
15719G6817K5945a12605k45674g567j6707m31083g8331L1147B5690b82089J16754
15708a65335H4086a79930J9769j39105A72860i8952A48175b37834P7711l62427
15698e22550A28848K7330g4352A21941a0406r7251i216B35118L02851A34753b96211
$$ plain form
15776 163626 -47540 78585 70856 -85950 -149121 -229704 -629859 -162910 -152657 274510 111481
15764 -267873 -94973 32985 7190 126411 -429939 228036 105346 334133 208142 154349
15754 154349 -134941 -83901 -397407 288515 -190699 423982 3364 -4592 -58496 130052 -95231
15742 31046 -143280 172344 58625 -1967 395234 -62412 -144141 -3690 -358990 -67518 327468
15730 46376 -30292 -251855 78602 97746 214545 257620 -110834 14107 7938 49947 76817
15719 76817 102762 -112605 -358279 -7567 -24274 -455357 -78331 -47184 25690 -282089 -165335
15708 -165335 84086 -179930 -160161 -299266 172860 -98952 148175 -237834 -160123 -522550
15698 -522550 128848 156178 -74352 121941 -10406 -107657 -9216 235118 537969 134753 -296211
15686B9061N8288J53266o1193N2092r588a24415A13947M6681E2701i0097I3991
15674i165j13226c4537A72318a26629A08071b03960l8173B9589c65715a53076
15663a91779K22F2909b47529e7172j13572A05520a1806C38051a92646A74239E3583
15651a72441f2950o3093j21821e1086I3438l1440J0896b82B74325C9043k142b04464
15638a68308p1742A32447J46481e51095a48605j71344D6273c33301P2452l4870
15628b95719H7064a09558B1704b32140D1746J23314j6425d4658j28355C24657
15617C5491a90117e1882p7555d8849j55634k5102g0312j70999A63649a73004A04367
15605B09595a9688k07275i1305E7806a42301D08758f05359B3696a6729j48609
$$ plain form
15686 29061 87349 240615 179422 231514 221926 -124415 113947 160628 52701 -90097 93991
15674 -9165 -122391 -34537 172318 -126629 108071 -203960 -242133 29589 -365715 -153076
15663 -191779 -191557 62909 -247529 -57172 -170744 105520 -11806 338051 -192646 174239 53583
15651 -172441 -62950 -126043 -247864 -51086 93438 61998 72894 -282 274325 39043 36901 -204464
15638 -168308 -240050 132447 278928 -551095 -148605 -319949 46273 -333301 -260849 -295719
15628 -295719 87064 -109558 21704 -232140 41746 165060 148635 -44658 -173013 324657
15617 35491 -190117 -51882 -129437 -48849 -204483 -229585 -70312 -241311 163649 -173004 104367
15605 209595 -19688 -226963 -91305 57806 -142301 408758 -605359 23696 -16729 -165338
15595a65338A1671M8221J08070i3634K6391k19949A72921c71996a26783b7030
15584A19978k0777a23020A02765c5465k239k97703E2969b62058D313J4697a12259
15572i38m26082a5808C17608D9016A7312c03661B42929a71671j75711C55454h6774
15560a06150M087I9981a63479g2825B40710a826A63917d4465J4866l031J2697
15549a9933A92864C5545g8941A3339a16968F9533D419a08541J1202L0763b961
15537I2181P3735d96388D8464p065E460a44327j57408g7290A79246a46934A32176
15525e5477j59579B17693a00984D4132N5208j6225h1850r6999C1181g4021k04730
15514b78751J20814C3524a92624g0235d381l04596A4803O4907J3347b5186j52941
$$ plain form
15595 -165338 11671 59892 167962 -93634 -67243 -287192 172921 -371996 -126783 -27030
15584 119978 99201 -123020 102765 -35465 -37704 -335407 52969 -262058 4313 19010 -112259
15572 -938 -427020 -15808 317608 49016 17312 -303661 242929 -171671 -347382 355454 -86774
15560 -106150 -102063 99981 -163479 -72825 240710 -1826 163917 -44465 -29599 -32630 -19933
15549 -19933 192864 35545 -78941 13339 -116968 69533 4419 -108541 -97339 -66576 -2961
15537 92181 165916 -496388 48464 41399 5460 -144327 -301735 -77290 179246 -146934 132176
15525 -55477 -215056 217693 -100984 44132 99340 83115 -81850 -178849 31181 -74021 -278751
15514 -278751 -157937 33524 -192624 -70235 -4381 -308977 14803 79710 93057 -25186 -178127
15503a78127C73523D1043g6296j01187A13845p057b47976o8557A12344b32384
15492i9366K0090A7061J485i9338D132i1768j6226n9401g771p7839F5261c4995
15479C4362m217d4034C553g1524A58995d32287J56965d0682j41027A43116J05393
15468B48509c06952F2824c61907B18471B6355g6143A78704p4545l8954d7861E3790
15456H6178J14762a91379R787B57768C2232j4282a68053F7147f2793n2270L4135
15445h0928E3064P5542F0259a02214o1532G3835d0210I3013N5678J15279a46884
15433b4084j70303P2287H2650a9669A13563a45516A4047d3193n2573q9738j41384
15422c26888A85165G9074J75755G5067d8330I47b12491a04970B25809P3747a82868
$$ plain form
15503 -178127 373523 41043 -76296 -177483 113845 106788 -247976 -316533 112344 -232384
15492 -99366 -79276 17061 18546 -99338 4132 -91768 -107994 -167395 -7771 -85610 65261 -34995
15479 34362 30145 -44034 3553 -71524 158995 -432287 -275322 -40682 -181709 143116 248509
15468 248509 -306952 62824 -361907 218471 26355 -76143 178704 104159 65205 -47861 53790
15456 86178 200940 -191379 -181592 257768 32232 17950 -168053 67147 -62793 -115063 -80928
15445 -80928 53064 128606 60259 -102214 -163746 73835 -40210 93013 148691 263970 -146884
15433 -24084 -194387 -122100 82650 -19669 113563 -145516 14047 -43193 -95766 -185504 -326888
15422 -326888 185165 79074 254829 75067 -48330 947 -212491 -104970 225809 299556 -182868
15410B77731A34660b72066A77575a3488k08863L2612k6359A19673K23328g1091
15399a08859K1094p6685F9464l2960a90006B2266L6439J38664p2452i5057B31396
15387b03354d3809N831A60639m3588d8628k9096l5324L3661C2890b14975b3334
15375b2327H0100K28119c49007F4757K1737a77405j29515C45011C1243K513a48061
15363b34647r8462O0372a10549A52036k2637j8628b12294g0772o8664I1567a11696
15351a66700d5466o5592j64866F5150a6548A03705f4558a4814B3220a4892j17146
15340a32038B3259P8500m674P8205l5595J07130C7047a43580K9464B68902I35
15328e3272j37263K2123c6995A01972A9513a63739D3383M19307a08749b8896C0714
$$ plain form
15410 277731 134660 -272066 177575 -13488 -222351 -189739 -216098 119673 343001 -71091
15399 -108859 -87765 -164450 69464 36504 -190006 22266 58705 197369 124917 -95057 231396
15387 -203354 -43809 -37978 160639 117051 -48628 -77724 -113048 -79387 32890 -214975 -23334
15375 -22327 80100 308219 -349007 64757 86494 -177405 -306920 345011 31243 33756 -148061
15363 -234647 -333109 -272737 -110549 152036 129399 110771 -212294 -70772 -139436 91567 -111696
15351 -166700 -45466 -111058 -275924 65150 -16548 103705 -64558 -14814 23220 -14892 -132038
15340 -132038 23259 101759 97085 175290 139695 246825 37047 -143580 -114116 268902 935
15328 -53272 -190535 -168412 -36995 101972 19513 -163739 43383 462690 -108749 -28896 30714
15316D2962c6750q0719B4480i4386B30739A09630e259A31761J71583j20013b9175
15304B70736F0049A3403a29858E0336h2273A92245C0257K9013J59620r2559d5663
15292a05106A92867E8938a30804A67730d902k0742a0608j69869B1368J2705a44440
15280A42780l527c12900B70722A0604J7114K081J45371G4993f13A70002a21482
15268A0464K81534j28718A2200c3693A01605d517j27569B39981b04635C64678
15257A05908a35554D12279i6403b1406D88753l3585j62578K93661M46434L19329
15247A352014j21664K25750o04823B14708M3425n7940J40440j54200i545A37962
15236b79883b8089B21434I2378e548j78764I8734A9043J69036K36163h6502o2883
$$ plain form
15316 42962 -36750 -117469 24480 -94386 230739 109630 -5259 131761 303344 183331 -29175
15304 270736 60049 13403 -129858 50336 -82273 192245 30257 59270 218890 126331 -45663
15292 -105106 192867 58938 -130804 167730 -4902 -25644 -10608 -180477 21368 34073 -144440
15280 142780 139253 -312900 270722 10604 27718 29799 175170 74993 -613 170002 -121482
15268 10464 291998 163280 12200 -33693 101605 -4517 -132086 239981 -204635 364678
15257 105908 -135554 412279 -96403 -21406 488753 455168 292590 586251 1032685 1352014
15247 1352014 1230350 1456100 851277 214708 258133 200193 340633 186433 -9545 137962
15236 -279883 -28089 221434 92378 -5548 -184312 98734 19043 188079 424242 -86502 -149385
15225a49385H9809M6999k4939a31105L4108p5288c4496H7826g8387C44682E6014
15213F5239J3041P3650a19665F5345J684a80178A37531B1439c10562J11949B87585
15201f6427j25531B72416A5769a58055A65905d4736H6595j0939K8894c18310e2577
15189c5070j50434F0396J4865P4835p0350h6240H7896g9791D2929J63058C7781
15177I7775Q2077Q775f1263p7576m2055k5111d6063B08395d991A41078k3824m7039
15165G0215a24938n0418a0957r6248D10243B2484Q2830J6852a33809C40563f9402
15153A21739d1760A41085a02438n3033a688l3384E09000a27234B95444h15B85685
15141e6007L175I3207A9852K14497m2949K01755j76898a60277A79639a92414A9167
$$ plain form
15225 -149385 89809 136808 111869 -131105 -96997 -172285 -34496 87826 -78387 344682 56014
15213 65239 78280 151930 -119665 65345 67029 -180178 137531 21439 -310562 -198613 287585
15201 -66427 -191958 272416 15769 -158055 165905 -44736 86595 75656 104550 -318310 -52577
15189 -35070 -185504 60396 75261 150096 79746 -86240 87896 -79791 42929 205987 37781
15177 97775 179852 188627 -61263 -138839 -180894 -206005 -46063 208395 -4991 141078 117254 70215
15165 70215 -124938 -175356 -10957 -107205 410243 22484 105314 122166 -133809 340563 -69402
15153 121739 -41760 141085 -102438 -155471 -1688 -35072 509000 -127234 295444 -815 285685
15141 -56007 -52832 93207 19852 234349 191400 393155 216257 -160277 179639 -192414 19167
15129B26422q2504j7959m7533R592L48005A0849L87078b62496A44045j4361L8585
15118A68269J18701j5287A01724q267a95754E5043Q8652a0490G0804Q5290O6689
15107B22783p0927a66759E14246D9526K93934A40107p83m0054R15J95793B8902
15095B36259J00633l7602a6329C0564K85286a2680p91A12413J43020a35979O0171
15084g5808C14321G2753J73218D0432M8750J22343L3064q5773o9843h1017E4809
15072I4018J63046o5746K6485d1742B6024J18956J2654d1848E2528J28828l988
15061A77368g0905p4219F7060J13238b913E5367K16358j23476P8114c1486B0775
15049C01728J6522k5678p8666b51298D223J64580J1646J18445j30373K500K00134
$$ plain form
15129 226422 143918 125959 78426 88018 436023 10849 397927 -262496 144045 129684 168269
15118 168269 286970 271683 101724 93457 -195754 55043 143695 -10490 70804 156094 222783
15107 222783 151856 -166759 514246 49526 343460 140107 139324 99270 100185 295978 28902
15095 236259 336892 299290 -16329 30564 315850 -12680 -13471 112413 255433 -135979 -75808
15084 -75808 314321 72753 245971 40432 89182 211525 244589 158816 88973 -81017 54809
15072 94018 257064 191318 217803 -41742 26024 144980 157634 -41848 52528 181356 177368
15061 177368 -70905 -145124 67060 180298 -2913 55367 271725 148249 226363 -31486 20775
15049 301728 318250 292572 213906 -251298 4223 168803 180449 298894 168521 171021 371155
15038C71155G4657J98549O3651J0308j64558K8830n4623O2655r3869C6799K82968
15027C19767K2869d0478B70543I3494g2794B5903L10531j06980I2994j79J97756
15016B90571j27379b09189D38031J44642b06316C24849q1273H4251J57525l7552
15006B04224B451K16665p6616J05303J91956j29150p0338K6608o4407P6494r1958
14995A87008m7195K53748a22960B34916E0457L18994A03868J29058j1791I0653
14984A87516J93379j62963J14726A30999K02221l9727J381d3786D5239K16787
14974B62026r4672j1330K03514D8574J40311P9108k7370J36752J17267n5558j27806
14963C11278A4747d2393B65206P3513J6420B4634R1684g7026C71741H7363J78768
$$ plain form
15038 371155 74657 273206 336857 347165 182607 211437 156814 219469 125600 36799 319767
15027 319767 342636 -40478 270543 93494 -72794 25903 336434 229454 92994 92815 290571
15016 290571 163192 -209189 438031 582673 -206316 324849 243576 84251 241776 204224
15006 204224 2451 219116 142500 247803 439759 310609 240271 266879 202472 278966 187008
14995 187008 139813 393561 -122960 234916 50457 369451 103868 232926 221135 90653
14984 187516 380895 217932 332658 130999 333220 293493 294874 -43786 45239 262026
14974 262026 167354 156024 359538 48574 188885 267993 240623 377375 494642 439084 311278
14963 311278 14747 -42393 265206 338719 355139 24634 116318 -77026 371741 87363 266131
14952B66131D2829J53061b4063C59333A33660J06159g0543E25496k31263a2018
14941B47951M995J57423H3437K88674l9118A54139K30559D5522L02456P7038B09232
14929D79524k35264j00008a48510D54302A69265a7717A20502J97477j38871M2266
14919B21374l3403p2863K08071q6781q300c2556B01970K98342a10906B44680J51210
14908C95890A24051K68725A20207K51996A01477L06539j24275j11867P2083J05265
14898C49222l4846K21286j88541k2996l1864K80246A65660L09672k0297k8933
14888D26102k12558J43964J25170B25737l859R289J33840J17284L6392A77058
14877F17411B20747H1029M06903J1615k09927q4338L65959A82465J148M0881k9620
$$ plain form
14952 266131 42829 195890 -24063 359333 133660 239819 -70543 525496 294233 -12018
14941 247951 252946 410369 83437 372111 332993 154139 384698 45522 347978 425016 209232
14929 479524 244260 144252 -148510 454302 169265 -17717 120502 317979 179108 221374
14919 221374 187971 115108 323179 236398 228098 -32556 201970 500312 -110906 244680 395890
14908 395890 124051 392776 120207 372203 101477 408016 283741 171874 243957 349222
14898 349222 314376 535662 347121 324125 292261 572507 165660 475332 455035 426102
14888 426102 213544 357508 482678 225737 221878 231167 365007 482291 518683 177058
14877 617411 220747 81029 487932 499547 289620 205282 571241 182465 183613 224494 194874
14866A94874L13820k13750A01353R7688J30443K59337j3541A24185K89264Q2307
14856D95756p0166j88389K81041m1368J71153P521l15773L77512l11817J37614
14846E43084j99891I7978L37729l6379j72735J36171O3497M16842l71803N5690
14836E26990J27952B83410N98841k31382j45473L64351B90336l6306J45530j84207
14826B15353K34084k17246J30757j9282o066K24717q0011l8236P4798o1091j2116
14815D45661j42445L94513B39274J86264j97360M34431l24750J09178P9265J76739
14805G03041B73901L96940K34906l27204j77052O2817k05705L80827j50454A90688
14794D48972j23238K04974O0485p6208J28113A77922K42303j21358Q0271J77320
$$ plain form
14866 194874 508694 294944 101353 199041 329484 588821 575280 124185 413449 495756
14856 495756 425590 237201 518242 476874 648027 655548 339775 717287 405470 543084
14846 543084 343193 97978 435707 399328 226593 362764 426261 843103 471300 526990
14836 526990 654942 283410 882251 650869 505396 869747 290336 254030 399560 215353
14826 215353 449437 232191 362948 343666 337600 562317 482306 444070 518868 457777 445661
14815 445661 303216 697729 239274 425538 228178 662609 337859 447037 526302 703041
14805 703041 273901 670841 905747 578543 401491 464308 258603 639430 488976 190688
14794 448972 325734 530708 591193 514985 643098 177922 420225 298867 379138 556458
14784E56458l6885L16579k64772o764K85680k43836K39335k05807j34924Q0543
14774E85607P9645M5171J93713D29999L5980K23203A99088M06778k21998O3563
14764D47431J46488K78393l19539J20053q9568q7432M25805B55176N45227k61793
14754E38610J73544J70099l52292J24028l23163J65244J34435l0331R7515k08332
14744D89357p1589M01245l0918M8389K3599j72986o5766J39316N0983J77267j42903
14733H45994l40664M20243m52842K33054p4853j6471j28324J3432L13589j72787
14723F40371K24557k94303K75547k00803K26230J65109k61812M11534E81081L06730
14713H87811k72780K46367K16824j11114l52699M00655k60655p3397l23982L76370
$$ plain form
14784 556458 519573 836152 571380 564616 850296 606460 845795 639988 505064 585607
14774 585607 665252 710423 904136 429999 465979 689182 199088 605866 383868 447431
14764 447431 593919 872312 552773 672826 583258 495826 921631 255176 800403 538610
14754 538610 712154 882253 529961 653989 330826 496070 630505 600174 697689 489357
14744 489357 417768 819013 788095 836484 860083 687097 621331 760647 811630 988897 845994
14733 845994 505330 925573 472731 705785 630932 614461 486137 499569 813158 640371
14723 640371 864928 570625 846172 645369 871599 1036708 774896 1186430 581081 887811
14713 887811 615031 861398 1078222 967108 614409 1015064 754409 681012 357030 733400
14703G33400j24493K97950K00492j40543K51439j45635l01110j13053J48996J54478
14693I61921o3885q3534j259R5888J75713j23804j64657M57001l26016r5682M8120
14682H79806K7970k5666L97092p9592p2166k89880M9674k1273L11711j41746L4722
14671A070652R9366l89161R908J41213O6349j13489K5045M35835n46957Q6323
14661H85084O14467j64484k72413q7089j7189N09474j97334m06201J68234j90998
14651H41551l462J94066M9801O4567K69917j34693J59007n24206M07130k03606
14641A120072j49794j07170M86417k5197j01581L28196l37335r9946K73057m3058
14631A343661J27677o6033j59182K64594l27260j21248M14713n27580N35610l59513
$$ plain form
14703 733400 608907 906857 1107349 966806 1218245 1072610 771500 658447 807443 961921
14693 961921 898036 814502 813243 909131 1084844 961040 796383 1253384 927368 831686 879806
14682 879806 907776 882110 1279202 1199610 1127444 837564 887238 865965 1177676 1035930 1070652
14671 1070652 1170018 780857 790765 931978 998327 884838 909883 1345718 798761 885084
14661 885084 1499551 1335067 1062654 975565 958376 1467850 1270516 864315 1032549 841551
14651 841551 838089 1032155 1081956 1146523 1416440 1281747 1440754 916548 1323678 1120072
14641 1120072 970278 863108 1349525 1324328 1222747 1550943 1213608 1113662 1386719 1343661
14631 1343661 1471338 1405305 1246123 1510717 1183457 1062209 1476922 949342 1484952 1125439
14621A125439q3564L16557R5595l3222J20431j03859J73637j64604j42144K79703
14611A583969K44806l58183M5590m4340K23171j62235J28071j55586k35343l15899
14601I54021N84851p148p9429K23476j57060O26677m09094j47820k24106M75550
14591A839918k34471J73332J26327j38829p1524M7489n1599J92519n1594k96844
14581A534724N74232k83344M5982J18927J90474l157R504J9875p5966J68717l25680
14570A974288R8997K7783O1453K47077m8837K75914L6887k34127P5019L54938
14560B869392j60566o4244N24811M8225l89979Q09293k47595O56383J66707J137086
14550E349513P40760J584287M362362Q270387J8350463P739393B1507054H852225
$$ plain form
14621 1125439 1041875 1358432 1454027 1420805 1541236 1437377 1611014 1446410 1304266 1583969
14611 1583969 1828775 1470592 1516182 1471842 1695013 1532778 1660849 1505263 1269920 954021
14601 954021 1538872 1531724 1452295 1675771 1518711 2145388 1736294 1588474 1364368 1839918
14591 1839918 1605447 1778779 1905106 1766277 1694753 1742242 1690643 1883162 1831568 1534724
14581 1534724 2108956 1825612 1871594 1990521 2180995 2177838 2187342 2207217 2131251 2299968 1974288
14570 1974288 2073285 2101068 2162521 2409598 2360761 2636675 2673562 2439435 2514454 2869392
14560 2869392 2708826 2644582 3169393 3217618 2827639 3636932 3389337 4045720 4212427 5349513
14550 5349513 6090273 7674560 12036922 20307309 38657772 46397165 21507054 8852225
14541D293333j272152p76305k09845j37368o094J03700N9626L70996o69190N69313
14531B326014O5012m72815N81301l22809N2859K22491o119m6564M7233n8140J69323
14520B557786k47926J18091j2935P4178K08080K64666n45397J0759M49645k7037
14510B849910j64531J17535R4641j85349K03855K0174k31508L47871q3343J2212
14500B981467O9129J88804j27067K84170j06970j28511R8876k05398J62175L35797
14490C552472k26322K13680J11798J46299l90499M31894j11916J62178j55573
14481C734011L97708l9252l23217l7005K34890j62832L1717J84773K62612l42037
14471C941368M66806l40381K07288N90045o18882P2970L78802M7461j07542M3434
$$ plain form
14541 4293333 3021181 2244876 2035031 1897663 1891569 1995269 2054895 2425891 1756701 2326014
14531 2326014 2391026 1918211 2499512 2176703 2229562 2452053 2445934 2399370 2446603 2388463 2557786
14520 2557786 2309860 2427951 2415016 2489194 2697274 2961940 2416543 2427302 2876947 2849910
14510 2849910 2685379 2802914 2897555 2712206 2916061 2936235 2704727 3052598 2969255 2981467
14500 2981467 3050596 3239400 3112333 3396503 3289533 3161022 3259898 3054500 3216675 3552472
14490 3552472 3326150 3539830 3651628 3797927 3407428 3839322 3727406 3889584 3734011
14481 3734011 4131719 4092467 3769250 3732245 3967135 3804303 3836020 4020793 4283405 3941368
14471 3941368 4408174 4067793 4275081 4865126 4246244 4319214 4698016 4745477 4637935 4681369
14461D681369q2714L40482q1352J88217k9010p091k22670M13962j38105j70783
14451D892305N93845j88183J69676k2310m7129M94207p7496L04852n16619N73734
14441F176882l66550K12989P07927l71381J51332j4368J45158m55099K47412K90779
14431F725081M23374o1909J5193L35974j32075M2743j87294M74884J31812K9650
14421G797433R7057R7322K34846K4871O0250M14489k40740p4387K7171K99841
14411H738153P63015k98828L48763j2188j89551N03188K99413l2449p2115M10604
14401A0458005m9979M06332j5253K67249K32979J54517J50346M48262K9795M46464
14391A2528717J18209J35485J08101L1034M11018Q7674K75943j3459Q20702j40438
$$ plain form
14461 4681369 4598655 4939137 4857785 5046002 5016992 5009901 4787231 5201193 5063088 4892305
14451 4892305 5486150 5297967 5467643 5445333 5398204 5892411 5814915 6119767 5603148 6176882
14441 6176882 5810332 6023321 6731248 6359867 6511199 6496831 6641989 6186890 6434302 6725081
14431 6725081 7148455 7086546 7101739 7437713 7305638 7348381 7161087 7635971 7767783 7797433
14421 7797433 7894490 7991812 8226658 8251529 8311779 8726268 8485528 8411141 8438312 8738153
14411 8738153 9501168 9202340 9551103 9538915 9349364 9852552 10151965 10119516 10047401 10458005
14401 10458005 10408026 10814358 10799105 11066354 11299333 11453850 11604196 12052458 12082253 12528717
14391 12528717 12646926 12782411 12890512 12921546 13332564 13420238 13696181 13682722 14503424 14362986
14381A4362986M08586L77229R9058M61992l0363N10944L71501J73660M96373O76513
14371A7908479J27956K05285J48102N7956Q79863J42888O33174L58440O38372
14362B1100515L02381N36252K84047K39608P02892P43559M33261P07383K24754
14353B5274652J012896N40301N20849M67561Q02356O03040P21386P57066Q58250
14344C1558357Q13327N97142J009925J088692R38635J034076P47995J047316J593730
14335D0429195R93531R15350J493449J416848J396977J201558J663774J597146
14327E1107828J598531J474473J742994K317641K052934K011951K174136K612628
14319F7093116J759404K594015K621353K988165K881610K903272L413128L710908
$$ plain form
14381 14362986 14771572 15148801 15247859 15709851 15679488 16190432 16561933 16735593 17231966 17908479
14371 17908479 18036435 18241720 18389822 18447778 19327641 19470529 20103703 20462143 21100515
14362 21100515 21402896 21939148 22223195 22462803 23165695 23909254 24342515 25049898 25274652
14353 25274652 26287548 26827849 27348698 27816259 28618615 29221655 29943041 30700107 31558357
14344 31558357 32371684 32968826 33978751 35067443 36006078 37040154 37788149 38835465 40429195
14335 40429195 41422726 42338076 43831525 45248373 46645350 47846908 49510682 51107828
14327 51107828 52706359 54180832 55923826 58241467 60294401 62306352 64480488 67093116
14319 67093116 68852520 71446535 74067888 77056053 79937663 82840935 86254063 89964971
14311H9964971L562458L372358M121086M622710M485926M705446N031911N251915
14303A25118781N702711N692088O646782O568277P044537P383558P658149Q556213
14295A80371096Q930303R508216R887383J0196562J1019831J1361274J1996402
14288B53271067J2304305J3158159J3359472J3816971J4083511J4262758J4415932
14281C48672175J4234496J4149633J3812490J2998150J2453296J1286469R917370
14274D37524079Q318173O352602K874998J192041M52928n21388k733641l346116
14266D50113676n181023q767762j0415059j2186149j3344335j4379565j4611191
14259C71228592j5116171j4996291j5003465j4900676j3469988j4068312j3510685
$$ plain form
14311 89964971 93527429 96899787 101020873 105643583 110129509 114834955 119866866 125118781
14303 125118781 130821492 136513580 143160362 149728639 156773176 164156734 171814883 180371096
14295 180371096 189301399 198809615 208696998 218893560 229913391 241274665 253271067
14288 253271067 265575372 278733531 292093003 305909974 319993485 334256243 348672175
14281 348672175 362906671 377056304 390868794 403866944 416320240 427606709 437524079
14274 437524079 445842252 452194854 455069852 456261893 456714821 456193433 453459792 450113676
14266 450113676 444932653 436164891 425749832 413563683 400219348 385839783 371228592
14259 371228592 356112421 341116130 326112665 311211989 297742001 283673689 270163004
14252B70163004j3082426j2528984j1890705j1607204j0250154j0394755r764271
14245A90644505q825102q132218q454035p496369p350884o974937o239688n876081
14237A31295191n497533n418485n229784m777799m372320m320031l823267m076643
14229I3779329l565753l411150l522874l146620k619633l195214k472407k452288
14221F9393390k243006k494210k215036j896400j827957k006080j796549j513772
14213E3400380j599705j737289j602930j206021j665256j292075n52766j363712
14205D2380626j294953j229755j480932o56872r01048m97263j449929p06048j241560
14196C2922266p63520p47020o71113q47156n73954q29471m86693p55549p83878
$$ plain form
14252 270163004 257080578 244551594 232660889 221053685 210803531 200408776 190644505
14245 190644505 181819403 173687185 165233150 157736781 150385897 143410960 137171272 131295191
14237 131295191 125797658 120379173 115149389 110371590 105999270 101679239 97855972 93779329
14229 93779329 90213576 86802426 83279552 80132932 77513299 74318085 71845678 69393390
14221 69393390 67150384 64656174 62441138 60544738 58716781 56710701 54914152 53400380
14213 53400380 51800675 50063386 48460456 47254435 45589179 44297104 43744338 42380626
14205 42380626 41085673 39855918 38374986 37718114 36817066 36319803 34869874 34163826 32922266
14196 32922266 32158746 31411726 30740613 29893457 29319503 28490032 28003339 27247790 26463912
14187B6463912o22237o65651o30786o93052k77964q81479J81072p73813m34350
14178B1665652l31909n53382l08643m33585n07992n51350l66925k82927l93688
14169A7935251j27845m65884k93168l38069J2482n75355k13512q75964l5529J15913
14159A5138320o28003j26614k34744l88894l10863k07087N1851n30167q8163j91742
14149A2483894k02317o7113n1331l00187l16316j73630J25669k63216k46187k55749
14139A0733517k22009M0451n5274l74518l76429M57899o05100j32971K69184o20916
14129I113834p8695M7779o1104m21116j25719j2943N7032l53722K72905k23487
14119H214764j89411L15957m03686j92115N1721j92989J96325n61873M7722k43681
$$ plain form
14187 26463912 25841675 25176024 24545238 23852186 23574222 22692743 22873815 22100002 21665652
14178 21665652 21333743 20780361 20471718 20038133 19530141 18978791 18611866 18328939 17935251
14169 17935251 17807406 17341522 17048354 16710285 16722767 16147412 15933900 15057936 15022407 15138320
14159 15138320 14510317 14383703 14148959 13760065 13449202 13242115 13293966 12763799 12675636 12483894
14149 12483894 12281577 12214464 12163133 11862946 11546630 11373000 11498669 11235453 10989266 10733517
14139 10733517 10511508 10551959 10496685 10122167 9745738 10203637 9598537 9465566 9734750 9113834
14129 9113834 9035139 9082918 9021814 8600698 8474979 8462036 8519068 8165346 8438251 8214764
14119 8214764 8025353 8341310 7937624 7745509 7797230 7604241 7800566 7238693 7286415 7042734
14109G042734J60307J62063k99321k74702l1899j51453q9094l01792J18166K43250
14099F578259l50959l35931J60848K32692l44110l14149O8199k4811j79679L05289
14089E795648j30790k1951j17016j71344O6521O8387j57334o19691P89776n30417
14079D971789j47804n9395j1818J110P9531J49827k11783k11598k4365L799j20216
14068D419077J86957k25254r3802J8875j56924P3758K60901m20086J31718o2193
14058D133027j91543K60864O4322K31450l50942k2258m83282K10345K9831l15450
14048C566364J73804P6919l59473J61987k17988N0979R9585j14803k67411M75784
14038C645747r3126J607j7756p0295K69809j94138r0343j87676q6193j08457L58448
$$ plain form
14109 7042734 7203041 7365104 7065783 6791081 6759182 6607729 6518635 6216843 6335009 6578259
14099 6578259 6227300 5891369 6052217 6284909 5940799 5626650 5694849 5670038 5490359 5795648
14089 5795648 5664858 5642907 5525891 5354547 5421068 5489455 5332121 4712430 5502206 4971789
14079 4971789 4823985 4764590 4752772 4753882 4833413 4983240 4771457 4559859 4535494 4539293 4419077
14068 4419077 4606034 4380780 4286978 4305853 4148929 4222687 4483588 4063502 4195220 4133027
14058 4133027 3941484 4202348 4266670 4498120 4147178 4124920 3641638 3851983 3881814 3566364
14048 3566364 3740168 3817087 3457614 3619601 3401613 3452592 3552177 3437374 3169963 3645747
14038 3645747 3552621 3554228 3536472 3466177 3735986 3541848 3451505 3263829 3177636 3069179 3427627
14027C427627l77502j20701N2414p1167K25879j82667n7616r126l867m20594M39865
14016B902545m46943L28994J25739j01251n06105M31760j99026j91919N8765L6398
14006B438957o455l54540L59905K15709l17263l54985M08484q8305k99588P49307
13996B751226n18335j5315J58751j94101k7270M98053O80069Q30715K879109O424512
13986A3467414J7431486J5192160j9760452j2550664n441788k224027j121728
13979D992401p65535n81150k4077l56659k8699p1833j64444k6618k72506Q5509
13969B786389j48798n3083n3496j97294K38454l17904M92300m81645l2590L4054
13959B266387j94134k8762J86036K02338m64586L62274j93020k19782K67985n0461
$$ plain form
14027 3427627 3050125 2929424 2981838 2910671 3136550 2953883 2896267 2887141 2883274 2462680 2902545
14016 2902545 2455602 2784596 2910335 2809084 2302979 2734739 2535713 2343794 2402559 2438957
14006 2438957 2432502 2077962 2437867 2653576 2336313 1981328 2389812 2301507 2001919 2751226
13996 2751226 2232891 2217576 2376327 2182226 2154956 2653009 3333078 4163793 7042902 13467414
13986 13467414 30898900 46091060 26330608 13779944 8338156 6114129 4992401
13979 4992401 4226866 3645716 3621639 3264980 3236281 3164448 3000004 2973386 2700880 2786389
13969 2786389 2637591 2584508 2531012 2333718 2572172 2254268 2746568 2264923 2232333 2266387
13959 2266387 2072253 2043491 2229527 2431865 1967279 2329553 2136533 1916751 2184736 2134275
13949B134275J53379k09157k55663K58369o5834k43715J20475k0539M8503j49336
13939A770757L22535k81095j06466q1788K35487J00019j74355n23734J98790J29846
13929A589996Q9293J57228j99866J23918P1297l69774K46168J0903m08378r03
13919A309882O0801L8555K78876k01722O42594o69273O65141m61128j61351J96723
13909A699098m20165Q551M21911l75127l4083J62834m27033O46374l23960n7312
13899A301088J49698l8019k09115p3448Q4362M75150k96754q4586K27233n8312
13889A477297Q969j30843p0543j21426J54457j86816J20527j03950j70m4227K53661
13878A356936j89391J7744N4108N799J9420P175n1447J93003l47950l6279R2892
$$ plain form
13949 2134275 2287654 2078497 1822834 2081203 2015369 1771654 1892129 1871590 1920093 1770757
13939 1770757 2093292 1812197 1705731 1623943 1859430 1959449 1785094 1261360 1460150 1589996
13929 1589996 1679289 1836517 1636651 1760569 1831866 1462092 1708260 1719163 1310785 1309882
13919 1309882 1370683 1409238 1688114 1486392 2128986 1459713 2124854 1663726 1502375 1699098
13909 1699098 1278933 1287484 1709395 1334268 1300185 1463019 1035986 1682360 1358400 1301088
13899 1301088 1450786 1412767 1203652 1130204 1214566 1689716 1392962 1308376 1535609 1477297
13889 1477297 1486266 1355423 1284880 1163454 1317911 1131095 1251622 1147672 1147502 1103275 1356936
13878 1356936 1167545 1185289 1239397 1245196 1264616 1271791 1220344 1413347 1065397 1029118 1122010
13867A122010J67436l77762J34947j03486L26753j25500o8087M8769J65349k18111
13857A072318J158Q5097N7095l85489K08543k27685M0276P5421K39454j64002
13847A002186J30352J52887k43813L49037n62035O53776k64848n7732q2512k24876
13837H52422M87879k94384l54050M91141l68751L19705j82281j11923J53991K2641
13827A016390J60384J24620l91380R5496k40606K60077q5979J84153k20174K05368
13817A108349k01109J70102N1565q7569j95637J23842j67217L59203m95060M34438
13807A100907j15475J41992k93649k26053N2743R6010K75154L04667m30450J26468
13797A032314m50129L2163Q3563J30711J17004k74765K07492M6907D03450K99729
$$ plain form
13867 1122010 1289446 911684 1046631 943145 1269898 1144398 1076311 1125080 1290429 1072318
13857 1072318 1073476 1158573 1215668 830179 1038722 811037 851313 926734 1166188 1002186
13847 1002186 1132538 1285425 1041612 1390649 828614 1482390 1217542 1159810 1077298 852422
13837 852422 1340301 1045917 691867 1183008 814257 1133962 951681 839758 993749 1016390
13827 1016390 1176774 1301394 910014 1005510 764904 1024981 939002 1123155 902981 1108349
13817 1108349 907240 1077342 1128907 1041338 845701 969543 802326 1161529 666469 1100907
13807 1100907 985432 1127424 833775 607722 660465 756475 1031629 1336296 905846 1032314
13797 1032314 582185 614348 697911 828622 945626 670861 878353 925260 403450 703179
13787G03179K07571j16561P1466q1443j86339P6330J15154j55258J97204j83430
13777F47873J49833r255L2275Q3166D49120L58795j97860L29012l60730J55226
13767G33563j13051k02753L15419J21591p5676p7032j72996K16130j68504K53480
13757H30171k01195K79605l81873K26869q8504J25830j45562O5379k09705J62667
13747F63682K77021C71867L35450q5014J96657k75790O9638L79733l87885K69658
13737H74314l29174J09761j11345L99577m54910A87436M64093J460J17975j73029
13727E97935k7554K52914j11977O4673J24636C70270J58382p3472j50362K55600
13717E60418J15450o807J62145l51313o7894K15161m6276L3732B93767J11916
$$ plain form
13787 703179 910750 794189 865655 784212 597873 674203 789357 634099 831303 647873
13777 647873 797706 788451 820726 903892 449120 807915 610055 939067 578337 733563
13767 733563 620512 417759 733178 854769 779093 702061 529065 745195 576691 830171
13757 830171 628976 908581 526708 753577 665073 790903 645341 710720 501015 663682
13747 663682 940703 371867 707317 622303 818960 543170 612808 992541 604656 874314
13737 874314 545140 654901 543556 943133 488223 187436 651529 652989 770964 597935
13727 597935 570381 823295 711318 775991 900627 370270 528652 455180 304818 560418
13717 560418 675868 669061 831206 479893 411999 627160 580884 614616 293767 405683
13707D05683M74971k25945j99379R818K163K81651n855l3417j24907j25837J24317
13696E83263k74971M04504R4794j99715j3855k2481m7201K5167j06418L74012
13686H17099B58045N24224K61499l85860m9035B67556J15269N22225l80893K77418
13676H01575B14182N61085k50391n0762o323J06932p2646j23687O2089K09106
13666F49585j17413P5410j02275J1221j72724J4057j12326K64394B53950F9610
13655B67593K7600J83744J04857l3904q6814j02992J03877B23019M9791j29058
13645A43752K82589j62545r6541M70769j0563j94366o6310K1084K3792A55769
13634A99948M98001C13552L69569j78650k06978K00821J54729l9521B98412K76864
$$ plain form
13707 405683 880654 654709 455330 465148 467311 748962 743107 709690 584783 458946 583263
13696 583263 308292 712796 807590 607875 594020 571539 524338 549505 443087 817099
13686 817099 258045 782269 1043768 657908 608873 267556 382825 905050 524157 801575
13676 801575 214182 775267 524876 474114 467791 574723 502077 378390 440479 649585
13666 649585 532172 607582 505307 516528 343804 357861 245535 509929 253950 69610
13655 267593 295193 478937 583794 549890 463076 360084 463961 223019 272810 143752
13645 143752 426341 263796 167255 638024 627461 433095 366785 387869 411661 155769
13634 199948 697949 313552 683121 504471 297493 498314 653043 613522 298412 575276
13624E75276N9136B79989K93912j01785O434l0335n6557m3411K57277J3168k05747
13613D12945j45619J96510P3959B52942K84303j92397j60338K31569j1672P2466
13603D76873m0533A25940L21371J37341q7823M3824m5736k14026J8201j771J17898
13592D15219L2239n1949j45220n8140O1975A4094P04002J06980B96140k7949L46775
13581F14966j56929A67298L04209j36404e4181B16121C9422N57629o6767j03165
13571D27119A19014K64134A25205P4727M0575r3036J47063J71169J5084k16510
13561B64277o8754R9432F6140K78491O7447E1049P21443I3564L28200A95586j2896
13550A82690J08369m4911j794l1562J81438j92059A00551K78456A76659J02952
$$ plain form
13624 575276 634412 279989 573901 472116 478550 448215 391658 348247 605524 618692 412945
13613 412945 267326 463836 537795 252942 537245 344848 184510 416079 404407 476873
13603 476873 436340 125940 447311 584652 496829 540653 494917 280891 299092 297321 415219
13592 415219 447458 395509 250289 192149 254124 14094 718096 825076 296140 268191 614966
13581 614966 458037 167298 471507 335103 -54181 216121 39422 597051 530284 427119
13571 427119 119014 383148 125205 199932 240507 147471 294534 465703 480787 264277
13561 264277 195523 294955 66140 344631 412078 51049 772492 93564 421764 195586 182690
13550 182690 291059 246148 244354 212792 394230 202171 100551 379007 176659 279611
13540B79611L49322B70587K39255j73350J37A60163K72978A98651n7719J26953
13530B67885Q4063j48829J04005n6759K42984j03577K2960q1623J06963r0414
13520C47658G6432M80599k35438j9546b9643D00511j27281N733L18642B68913
13509B30828j14661J39490K20186B22371J02064l2870o0786J99382K8619R3542
13499E52322p4987j62943f622B97398F3276K07034J6945I6467K62778p6548K20392
13488E03089A30602J08458F8009N8373J94694J76850B11557K82962p2530r200
13478D12789A89787G3299L20677r3559P7472L5853K22q9362J23723A65109J60103
13467C25212q7385J45677P2559n0015J0713A04064J03237L24449A43985J12046
$$ plain form
13540 279611 628933 270587 509842 336492 336629 160163 433141 198651 140932 267885
13530 267885 351948 203119 307124 250365 493349 389772 412732 331109 438072 347658
13520 347658 76432 557031 321593 302047 -29643 400511 273230 278963 597605 268913
13509 230828 116167 255657 475843 222371 324435 291565 230779 430161 458780 552322
13499 552322 477335 314392 -6622 297398 63276 270310 287255 96467 359245 282697 503089
13488 503089 130602 239060 68009 126382 321076 497926 211557 494519 421989 412789
13478 412789 189787 73299 393976 300417 377889 413742 413964 324602 448325 165109 325212
13467 325212 237827 383504 456063 406048 416761 104064 207301 531750 143985 256031
13457B56031R4060j15371n2499K31223B00586B1277O5M03548R8257B39056g3498
13445C36083N6267P1104A58714K1079J31579r5576p4412E7118a18526A31824k6205
13434A05619K56553J04948A86690C9112a63412C83824j03310c3928B82859j24724
13424A58135K11482J85625B22813M2794J58608k05895a97675B08963b7803D51414
13413E8456a08758A10232a6203D64331B22061R2K97532R9584D895i4136B09292
13401A24123L08399A49503m0618K61208C0923J89601c9593D26897b1182B16405
13390B87088j31949Q4187K2814J47057o0842a3027C69762j08573q8197L3219L16509
13379E22720a07482G9653J28854q8095N4533J56484L1458B4808L25912p4794m6135
$$ plain form
13457 256031 350091 234720 182221 413444 200586 21277 21342 424890 523147 239056 -73498
13445 336083 392350 463454 158714 179793 311372 215796 141384 57118 -118526 131824 105619
13434 105619 362172 467120 186690 39112 -163412 383824 280514 -33928 282859 158135
13424 158135 369617 555242 222813 265607 424215 218320 -197675 208963 -27803 451414
13413 58456 -108758 110232 -16203 464331 222061 222153 519685 619269 4895 -94136 209292
13401 124123 432522 149503 108885 370093 30923 220524 -39593 426897 -21182 216405
13390 287088 155139 239326 262140 409197 348355 -13027 369762 261189 172992 206211 522720
13379 522720 -107482 79653 208507 120412 174945 331429 362887 24808 350720 275926 229791
13368B29791r9632D9258a1371C87309a4572A31526K7515o6626J70048j31226J94192
13357C25429E2073k2872O6141M2203J09125J40642E6379L84792B02778K71628
13347D74406A86378L22039n5820A19305K90780r4039K88692j40747j97263J44872
13337D11600A61153i9573q01C32727A33380F5436M47720j44490r6383A27409J05418
13326B32827A07987g5079D24964B09627B8713R2862J86406A51682L45259J1603
13316E08544R6574g5624B66998r9367K392R6776a63010E98679A62070K6013a08383
13304D69576A90657R7633A33515E6035J5558A1440L60168K3999a00844j2154A16135
13292A74449R941J13784I1727d7452C07083p9141F7397J41406K62538k05272I4296
$$ plain form
13368 229791 130159 49258 -11371 387309 -14572 131526 159041 92415 262463 131237 325429
13357 325429 52073 29201 95342 137545 246670 387312 56379 441171 202778 474406
13347 474406 186378 508417 452597 119305 410085 316046 604738 463991 266728 411600
13337 411600 161153 -99573 -100374 332727 133380 65436 513156 368666 272283 127409 232827
13326 232827 107987 -75079 424964 209627 28713 121575 307981 151682 496941 508544
13316 508544 605118 -75624 266998 167631 170023 266799 -163010 598679 162070 188083 -108383
13304 469576 190657 288290 133515 56035 71593 11440 371608 395607 -100844 -112998 116135
13292 174449 184390 298174 91727 -47452 307083 227942 67397 208803 471341 266069 94296
13280A29863J1280J58571R3955e124B42640N7658e9084C48775d9922j28544E9833
13268D28631n9610d3564A9193a07129E54154a10831l2892A41759L64528a56642
13257B51741l6739G2928L82002j47603C1362R8894Q835j6044O7871Q4900K4542
13246C00360D7659P9297n917O7688I0106J40459F6391e9977A53939a4359C1201
13234B09952N05j00640J25077a2982C8133K79585b14525J01285C78707q9315m9364
13223B40028a73453B33157P0929c8442C86879a10234j837H4548k1232K14143h4803
13211A68517a00521C15629b61798N6023A58465k4898i0989p969J1537B38892j02712
13200A36180a92233B54845j4831l0048J31005b8744j6843A05726J09403M5170
$$ plain form
13280 129863 141143 299714 393669 -5124 242640 300298 -59084 348775 -49922 -178466 59833
13268 428631 369021 -43564 19193 -107129 554154 -110831 -143723 141759 506287 -156642
13257 251741 215002 72928 454930 307327 31362 130256 139091 123047 190918 275818 300360
13246 300360 47659 126956 121039 188727 90106 230565 66391 -59977 153939 -14359 31201
13234 209952 210457 109817 234894 -12982 38133 317718 -214525 -113240 378707 289392 240028
13223 240028 -173453 233157 304086 -38442 386879 -110234 -112071 84548 63316 277459 -84803
13211 168517 -100521 315629 -261798 -205775 158465 133567 -90989 -98958 -87421 238892 136180
13200 136180 -192233 254845 240014 209966 340971 -28744 -45587 105726 215129 260299
13190B60299A28462l9483g0161D99905A48655J48773j25631K22124n3295a70571
13179A95160P1474F5784L97907A85570d6216A34658K93592A11370J45804F5601
13168B76095A2296K07250B0626J39064C6993J72239C2818N7033K5129L5670O501
13157A57151J97739D738i2590A72297J25823j24598L7442H5549K88052A04716
13146B43120H2041M68069j79894b86475B05757i1029A16211a34695C10330j27696
13136A82634H1369B8701K89964A16514J99534I1660e7792A22786c7753g275F8441
13124C28881a19165B70408B1590e377j1817j64214C3130J68476a3385p0344H36
13112C69503A63997J05215K67073a31795H6684d2371j01821B70487n8910b46607
$$ plain form
13190 260299 128462 88979 -70161 499905 148655 297428 171797 393921 340626 -170571
13179 195160 266634 65784 463691 185570 -46216 134658 428250 111370 257174 65601
13168 276095 12296 219546 20626 159690 36993 209232 32818 89851 114980 150650 157151
13157 157151 354890 4738 -92590 172297 298120 173522 210964 85549 373601 104716
13146 243120 82041 550110 370216 -286475 205757 -91029 116211 -134695 310330 182634
13136 182634 81369 28701 318665 116514 316048 91660 -57792 122786 -37753 -7275 68441
13124 328881 -119165 270408 21590 -5377 -17194 -181408 33130 201606 -13385 -83729 836
13112 369503 163997 269212 536285 -131795 86684 -42371 -144192 270487 211577 -246607
13101F2968O9785K8103O5553J21874A7948K72604L6376H4605a91154A76370L8116
13090B14486B788J58582i0701q6177k2161F0855J14157a43848B97119a84498e3414
13078a04651B1573a31724F7365L31647a37491B78316d7161C13467F4788j3886
13068E0902a67862G5625f6762k6376A07357l237b7279C81825b42293P1792A02502
13056c9830E3205Q9286c33269A48243M1591d3018B58335r0450B7497b4737A98035
13044A05262e2739E5212N29834B10969g7041A76983h9715C4203e1397D84597A14535
13032A37180a62008B39828d4814I0671c1833B42215D3879K06270e72E7524K86332
13021C43856j06312K45012j19987a9274B47349J22365a44566C81525K13625B80199
$$ plain form
13101 62968 132753 160856 226409 348283 17948 290552 326928 84605 -191154 176370 214486
13090 214486 2788 161370 -90701 -176878 -199039 60855 175012 -143848 297119 -184498 -53414
13078 -104651 21573 -131724 67365 399012 -137491 278316 -47161 313467 64788 50902
13068 50902 -167862 75625 -66762 -93138 107357 104120 -27279 381825 -242293 -170501 102502
13056 -39830 53205 142491 -333269 148243 189834 -43018 258335 167885 27497 -24737 198035
13044 105262 -52739 55212 585046 210969 -77041 176983 -89715 34203 -51397 484597 114535
13032 137180 -162008 239828 -44814 90671 -31833 242215 43879 250149 -572 57524 343856
13021 343856 237544 482556 362569 -19274 247349 369714 -144566 381525 595150 280199
13010E7697A0984K33236F2803J37601F1258J17850b3580E3653g2464k19618B2749
12998B02610Q791b6219C93467G2109a45571D60463H5161d34740A38892g6915A67406
12986B80269e8071j8257A66022d2569n9445M7968F3196k9124b19106A34150m031
12975A30119J94981D5442j4412J59501n6689J35573G516N3396K6162P9937a66902
12963A04782a56839B56808d3078E9863J66156J3224B4068C826a59292L2610j15902
12952b42584e5282o652B89966r3216n6631c7577A63004j9796C4491b1207A28550
12940I5959R7073K07582i3614c4265j30541B39944a86815p3992A40426J8529D5700
12928F7468N1689K27096C1250c2951I9510a5628m1769C31711j57305P918l2367
$$ plain form
13010 57697 10984 244220 62803 200404 61258 179108 -23580 53653 -72464 -292082 22749
12998 202610 211401 -26219 393467 72109 -145571 460463 85161 -434740 138892 -76915 167406
12986 280269 -58071 -76328 166022 -42569 -102014 -54046 63196 34072 -219106 134150 130119
12975 130119 325100 45442 31030 190531 133842 269415 7516 60912 87074 167011 -166902
12963 104782 -156839 256808 -43078 59863 226019 239243 24068 3826 -159292 -126682 -242584
12952 -242584 -55282 -61934 289966 196750 140119 -37577 163004 143208 34491 -21207 128550
12940 95959 193032 400614 -93614 -34265 -164806 239944 -186815 -260807 140426 158955 45700
12928 67468 119157 346253 31250 -32951 99510 -15628 -57397 331711 174406 182324 149957
12917A49957M4497K28001B8677L02476a53243n161A00070c01415A30085a61497
12906b18415B63555j10373B5342L30442J61819F5571A0559N6391b86991J4755
12896b72236I3874L4548N2584o415K8242K1817L5808r8975A5053J61922a00639
12884B26957A0343a63560e9028l7826I6513b42947c7531B22719a35230D3988c66631
12872A12138P3625a36356B30237D5849j337A140K21664g0260A73114a28642B30349
12860b7560j47778q9380b2357A37155a13370C85902c53313b2115A54847L1176
12850A86023b22219H0898a09421A42537J36890a13576B606a6847A66295O3518
12840B29813M5252I5350J0190h9855m0397K0765K4492D03320G1544L0665a2090
$$ plain form
12917 149957 194454 422455 28677 331153 -153243 -158404 100070 -301415 130085 -161497
12906 -218415 263555 153182 25342 355784 517603 65571 10559 66950 -286991 -272236
12896 -272236 93874 128422 181006 174591 202833 224650 260458 161483 15053 176975 -100639
12884 226957 10343 -163560 -59028 -96854 96513 -242947 -37531 222719 -135230 43988 -366631
12872 112138 185763 -136356 230237 45849 44512 1140 222804 -70260 173114 -128642 230349
12860 -27560 -175338 -264718 -22357 137155 -113370 385902 -353313 -22115 154847 186023
12850 186023 -222219 80898 -109421 142537 279427 -113576 2606 -16847 166295 229813
12840 229813 275065 95350 105540 -89855 -130252 -109487 -84995 403320 71544 102209 -12090
12828b0355B40937E2874j5102N8117a7565A38409P8441H761b45261D60755a13524
12816B93534e3552f669F9453c9504f3F3503i4361E5070B1860b39682j89374H2137
12803b1831j15083d3216B72050A28319o0575g1922B13315q1381E1449Q6491Q551
12792A46491K1391D6269K19107k9252b00576F8044a95609B1710N599J36028O2817
12781B26154K67105a28719n096a8154D6487d214l00295I8175a79464A79945f3266
12769a31722O2754H5557l5096b34404d0286p9363a2717B1530N0307b58816A76357
12757H4259B2818J57197M5183D0832J56192a88442n9951d4791F1072A497f9021
12745A80592J71804g5139A01311b3820A80668B247c5986A63982d5082G1100K93003
$$ plain form
12828 -20355 240937 52874 37772 95889 -17565 138409 216850 8761 -245261 460755 -113524
12816 293534 -53552 -6669 69453 -39504 -63 63503 -94361 55070 21860 -239682 -429056 82137
12803 -21831 -136914 -43216 272050 128319 67744 -71922 213315 131934 51449 137940 146491
12792 146491 167882 46269 265376 236124 -200576 68044 -195609 21710 27309 163337 226154
12781 226154 493259 -128719 -133815 -18154 46487 -4214 -304509 98175 -179464 179945 -63266
12769 -131722 -68968 85557 50461 -234404 -40286 -119649 -12717 21530 71837 -258816 176357
12757 84259 22818 180015 225198 40832 197024 -188442 -248393 -44791 61072 1497 -69021
12745 180592 352396 -75139 101311 -23820 180668 2247 -35986 163982 -45082 71100 364103
12734C64103A36310J56391J78570A07020k5436K1845b67880C20956A58270f7506
12723I1639J64089n6935q0383J94313I5395Q4236i1906k59500b1111m8618f232
12711d5937A78065A1328a8807I9069J02110P4375j7253d7372B25956O3310G2595
12699B23121M0568a46193C7527K19909a27213k31353C12395f4899A88070G6048
12688D3694h9511e580m6779l29310A51579J83637I3084J25212e2811A05996J04860
12677B10856O6157b33138f5749p9731a5130A47633b39656D03012a39514N0573
12667h8941C82095b04291D34897b33106h6758B92385J45766a87611B72548B4566
12656h1978I9493J39104j2743J1043j15361L04720H488J68566L1870H122b21982
$$ plain form
12734 364103 136310 292701 471271 107020 81584 103429 -267880 320956 158270 -67506
12723 91639 255728 198793 118410 312723 95395 179631 -91906 -351406 -21111 -69729 -6232
12711 -45937 178065 11328 -18807 99069 201179 275554 258301 -47372 225956 289266 72595
12699 223121 263689 -146193 37527 257436 -127213 -358566 312395 -64899 188070 76048
12688 43694 -89511 -5580 -52359 -381669 151579 335216 93084 218296 -52811 105996 210856
12677 210856 277013 -233138 -65749 -145480 -15130 147633 -239656 403012 -139514 -88941
12667 -88941 382095 -204291 434897 -233106 -86758 292385 438151 -187611 272548 24566
12656 -81978 99493 238597 225854 236897 121536 426256 8488 177054 208924 8122 -221982
12644i7870A27435a70087B56903A4313J3966L4409C735L34111A10063L89062g6268
12632B03579F0522h5654B12028B5371J389M19497A99528K37829B0847J4746Q8212
12621A23805O1725k098J68705A66883l476J202o0522j0382J42956c3854B31665
12609b24547B5742a14697A338K36258c0976G0540h8000I2692J20652b94771C55334
12597b0358A80023K61620A12960n0328B6331L442c9057j3415B27624k2916b51584
12585B60785b62750E5084O7587C9596b83746i0244K9522B90016d7402k8916j5927
12574i2245E1020J93493q4395n5928M1765K35949A72957O899R9574p4871h002
12562a41756H0351J78734a25624A65586C5855K57860F1748A7668a5263A40898
$$ plain form
12644 -97870 127435 -170087 256903 14313 28279 62688 3735 337846 110063 499125 -76268
12632 203579 60522 -85654 212028 25371 26760 446257 199528 437357 20847 35593 123805
12621 123805 185530 183432 352137 166883 163407 164609 104087 93705 236661 -33854 231665
12609 -224547 25742 -114697 1338 237596 -30976 70540 -88000 92692 213344 -294771 355334
12597 -20358 180023 441643 112960 62632 26331 29773 -39057 -52472 227624 204708 -251584
12585 260785 -262750 55084 122671 39596 -283746 -90244 -60722 290016 -47402 -76318 -92245
12574 -92245 51020 244513 160118 104190 145955 381904 172957 179856 279430 204559 -8002
12562 -141756 80351 259085 -125624 165586 35855 293715 61748 17668 -15263 140898
12551c24508I8804d0868j67569F6150K63327i7457l719B07520J35998a14980d2027
12539A9865J39329M9072a56046e8542B22728J13366A40363d7712j5140A17964
12528a72247B3147i629D15538A59780a23578J3439L4719a770B29871a14062a6059
12516H0928A6190L08996b03344g6567B05212J7244c8818l7960A29644a003B83594
12504B63116h9958j65619J19528e0200j80162D54449A48356b92148R0928c6415
12493b53015B5443L84899d7209B79097e6662B6819d4472A16923a40340A54578
12482F5011L08616A15157M7029b97656d7038l1344F6574K39227j40367e3916C8119
12470a89566H3425M1933C6900J8528Q0664a46035b2570m32992a92462I5832p943
$$ plain form
12551 -324508 98804 -40868 -208437 66150 329477 -97457 -101176 207520 343518 -114980 -42027
12539 19865 159194 208266 -156046 -58542 222728 336094 140363 -47712 -62852 117964
12528 -172247 23147 -9629 415538 159780 -123578 -110139 -75420 -1770 229871 -114062 -16059
12516 80928 16190 325186 -203344 -76567 205212 222456 -38818 -76778 129644 -1003 283594
12504 263116 -89958 -255577 -136049 -50200 -230362 454449 148356 -292148 -201220 -36415
12493 -253015 25443 410342 -47209 279097 -56662 26819 -44472 116923 -140340 154578
12482 65011 373627 115157 162186 -297656 -47038 -78382 66574 305801 165434 -53916 38119
12470 -189566 83425 125358 36900 55428 136092 -146035 -22570 -455562 -192462 95832 87889
12459H7889L2524a03025e509k2880B79606e95805a61835A41555A8109O6844d2246
12447a42020M1271A26241E5703k5172b06994B54772D0157a7364j47680N1359k8418
12436a42103j26047q5426a43928B00635a49570b3111j73360l5640c3447p5585
12426a09032I7679h5494A57045J19514A4517K82144I8115C030M7939J65762c49548
12414c2349A06791b0329D6218e9449j41929A38843A3925i5752J8719j42397E1103
12402a37575A54162h562E6527J94776b66043A79393M9885C7638K0123e299p7447
12391h2746l30216J48546A40614b45046l0172H8401j267Q1467M5636h002B78508
12379a79222j13417O9194I9911a80617J6169B1723J95258m8663D6598P1539b47994
$$ plain form
12459 87889 120413 -103025 -5509 -28389 279606 -595805 -161835 141555 18109 84953 -42246
12447 -142020 -100749 126241 55703 30531 -206994 254772 40157 -17364 -165044 -113685 -142103
12436 -142103 -268150 -353576 -143928 200635 -149570 -23111 -196471 -232111 -33447 -109032
12426 -109032 97679 -85494 157045 276559 14517 296661 98115 3030 50969 216731 -349548
12414 -32349 106791 -20329 46218 -59449 -201378 138843 13925 -95752 -77033 -219430 51103
12402 -137575 154162 -8562 56527 251303 -266043 179393 229278 37638 57761 -5299 -82746
12391 -82746 -412962 -264416 140614 -245046 -275218 88401 87134 168601 214237 -8002 278508
12379 -179222 -292639 -223445 99911 -180617 -164448 21723 216981 168318 46598 118137 -247994
12367A01390K31381A39025O8435C8383M7277j1113d15427D11079A07379A3159
12356d8494I9448d538q1838M1170A33398E9180b29210G4223K52291j20371B9621
12344F3223J85970a93296f6795A41974E7893b86140J00369c8267o1561A38025
12333E2002K72882A35115L1672b36946B49080b2410H7708e19677G3449o016N7987
12322A25420c02180a04530B5073K100L04611e3278a5741l59872J08484a22564
12311c87208B43511a9809A99194d0887B2491f3331A72376F0514a0761B83712d3729
12299b11164A89488a2819C89558i6269A08052a28014n1828f57A25924R2613a10583
12287H8255O036C7576L0681L1870a70509A52992h5446r5125C5690J09860b6045
$$ plain form
12367 101390 332771 139025 207460 38383 85660 74547 -415427 411079 107379 13159
12356 -48494 99448 -4538 -86376 -45206 133398 59180 -229210 74223 326514 206143 29621
12344 63223 249193 -193296 -66795 141974 57893 -286140 -185771 -38267 -99828 138025
12333 52002 324884 135115 166787 -236946 249080 -22410 87708 -519677 73449 67433 125420
12322 125420 -302180 -104530 25073 27173 331784 -53278 -15741 -375613 -267129 -122564
12311 -387208 243511 -19809 199194 -40887 22491 -63331 172376 60514 -10761 283712 -43729
12299 -211164 189488 -12819 389558 -96269 108052 -128014 -179842 -657 125924 218537 -110583
12287 88255 94291 37576 68257 100127 -170509 152992 -85446 -180571 35690 145550 -26045
12275B05972A8492g8094A50399a42293M9405F4031K70065A12660N0393L9028J4170
12264B16251Q7064d101r4226A86409D9017N8242a35083J1005A85007a7103F1495
12252D22815A67681a5735A16288N0335J65342c974C05852j47405J28378F7980
12241a00863l57132J34131A2085J37310J05791F2348g9363d480A53959K90317
12231D44276F3417J80990F2356J92860r6664j5793F5847J38471q6328K3732K40502
12220C82224J12j81243G1261a44027A56042G6846c3163D62243r3606K7277q0168
12209C15746j38215L03697A01717L64950B01954J27335o0187d3772C06022H138
12198A22441J68643l8001H2855j1504c3016B08742a74564C21371j08447J35685
$$ plain form
12275 205972 18492 -78094 150399 -142293 -92888 64031 334096 112660 163053 202081 216251
12264 216251 303315 -4101 -98327 186409 49017 107259 -135083 -124078 185007 -17103 61495
12252 422815 167681 -15735 116288 166623 331965 -3974 305852 158447 286825 67980
12241 -100863 -457995 -323864 12085 149395 255186 62348 -79363 -4480 153959 444276
12231 444276 63417 244407 62356 255216 158552 142759 65847 204318 117990 141722 382224
12220 382224 382336 201093 71261 -144027 156042 76846 -33163 462243 368637 395914 315746
12209 315746 177531 481228 101717 466667 201954 329289 269102 -43772 306022 8138
12198 122441 291084 253083 82855 71351 -33016 208742 -174564 321371 212924 348609
12188C48609a34447A83678l7567R4214R7615i1922I8068A1947g0963I4244J09236
12177B03480K43831j75535I7028D2072A824K44626o9093L0793J51442g7136B72813
12165D0982A2765K60439E9361J28042K09716E6630b0520A10848a9313A06505P0357
12154A76862D0553e0843A09614K9707Q0159J1947j8106D7531K88437j13808b45868
12142b19158d8358k1990L0218n3225A8364b00682O9944A3166J09155J02074a09540
12130A70467a92911I0174k1444J61357J07720q7450e2239o9398M7524B09538a35501
12118b06882B3533a75165q8635A91340b43784A65220a57952B71881A685Q6628
12108H8313n628a16988H2014M53248a28588B7213a25631n622A30922P5135a16742
$$ plain form
12188 348609 -134447 183678 146111 240325 337940 -91922 98068 11947 -70963 94244 203480
12177 203480 447311 271776 97028 42072 1824 246450 177357 208150 359592 -77136 272813
12165 40982 12765 273204 59361 187403 397119 56630 -20520 110848 -19313 106505 176862
12154 176862 40553 -50843 109614 139321 219480 231427 213321 47531 335968 222160 -245868
12142 -219158 -48358 -70348 -40130 -93355 18364 -200682 -130738 13166 122321 224395 -109540
12130 170467 -192911 90174 68730 230087 337807 250357 -52239 -121637 -74113 209538 -135501
12118 -206882 23533 -175165 -263800 191340 -243784 165220 -157952 271881 1685 88313
12108 88313 82685 -116988 82014 535262 -128588 27213 -125631 -131253 130922 206057 -116742
12096A46957d38162d6817k81841a42066g0840F6064b96582H262b45992A10254
12085a5097j50396f0677j01174M1639q0304Q6735D2597J03418E8168a2884j26704
12074a39588b5201n8321C7316A3632J17031h8719A78728L4789C2977j6016f5068
12062a0115A01079L567a90693k04503a8491F7707j9217L9407m2198J037313P33626
12051A816638E94306k03272a857A18235A4133M76534A47443g9865m34449b49898
12040i1450M5532C7268c5874A15727a00440A75991J1881d2618j36429a6010A5159
12028A82898d55640E2221O1053c76403f2153A20555b18644i6890A1317c81734
12017g0162D2519i9796A0053c78664E50699A19822O803h7756D08779A47229J40339
$$ plain form
12096 146957 -438162 -46817 -328658 -142066 -70840 66064 -296582 8262 -245992 110254
12085 -15097 -165493 -60677 -161851 -120212 -200516 -113781 42597 146015 58168 -12884 -139588
12074 -139588 -25201 -83522 37316 13632 130663 -88719 178728 213517 32977 16961 -65068
12062 -10115 101079 104646 -190693 -395196 -18491 67707 48490 87897 45699 1083012 1816638
12051 1816638 594306 391034 -1857 118235 14133 490667 147443 -79865 -514314 -249898
12040 -91450 -45918 37268 -35874 115727 -100440 175991 187872 -42618 -179047 -16010 15159
12028 182898 -455640 52221 113274 -376403 -62153 120555 -218644 -96890 11317 -381734
12017 -70162 42519 -99796 10053 -378664 550699 119822 126625 -87756 408779 147229 287568
12006B87568a76587A93630e02059a09949L3695m7660K2168L6374C8590g752j23668
11995a31420f4626D0561c05686a08859I9929e5292l83362a65595J2316j53664
11985c06943G5939e4822j71017D3738K58351H9857b13927b8610B2987b02360A94977
11973a79174A15018M16450a07720e844k47871a9881j75714E0765L03154A1224
11962F8155k9925a74559A56404e34113A20399d438n5966l4913I625N1113J69163
11951B29901I9262a02630A27166A6026c25460c9638C8060a61851D1651K35435
11941B77086A19822d9551k82908D2017K78953F4295P5295F8250a1030E2883J20997
11930A73880c3380A22092K4948f9195A74814K0574d2105B01478d0939E7693b78917
$$ plain form
12006 287568 -176587 193630 -502059 -109949 -76254 -123914 -101746 -65372 38590 -7752 -131420
11995 -131420 -64626 40561 -305686 -108859 99929 -55292 -438654 -165595 -153279 -306943
11985 -306943 75939 -54822 -225839 43738 302089 89857 -213927 -28610 22987 -202360 194977
11973 -179174 115018 531468 -107720 -5844 -253715 -19881 -195595 50765 353919 11224
11962 68155 38230 -174559 156404 -534113 120399 -4438 -60404 -95317 9625 60738 229901
11951 229901 99262 -102630 127166 16026 -325460 -39638 38060 -161851 41651 277086
11941 277086 119822 -49551 -332459 42017 320970 64295 139590 68250 -11030 52883 173880
11930 173880 -33380 122092 147040 -69195 174814 195388 -42105 201478 -40939 57693 -278917
11918b48394f6371j13628O3565A28774i7303r831M1520A20310b5207m84431a70626
11906a12380j46679k57741a13216a7255H939a93500O0669b4994o5966K7086l2407
11895i6281A22699b17116B963c23179J05403C18189A41198E7108J81595A7512
11884a38632F3457O0974b54197A89919R1684A05787i0327j36185L8884A15148
11873b34896h6896k6699A06604L6974B4914K24666a65987A59632M5832r1094B8396
11861d4053C24159G9397M1801L134P5742E6689J31816c2353j82342h772F3778
11849d364o0043m50490d5082j57611f8685G0158B1833R1082m1953b75629C51286
11837I6413O8788a38594A88037k4494b6292C6480a29448k73166J96026L0796M7348
$$ plain form
11918 -248394 -66371 -179999 -116434 128774 -97303 -107134 -65614 120310 -25207 -509638 -170626
11906 -112380 -259059 -516800 -113216 -17255 8939 -193500 -132831 -24994 -90960 -63874 -96281
11895 -96281 122699 -217116 2963 -323179 -217776 318189 141198 57108 238703 17512
11884 -138632 63457 124431 -254197 189919 281603 105787 -90327 -226512 -187628 115148
11873 -234896 -86896 -113595 106604 143578 24914 249580 -165987 159632 205464 114370 28396
11861 -44053 324159 79397 121198 124332 200074 56689 188505 -32353 -214695 -8772 63778
11849 -4364 -64407 -514897 -45082 -202693 -68685 70158 21833 112915 70962 -275629 351286
11837 96413 165201 -138594 188037 163543 -26292 36480 -129448 -402614 -206588 -175792 -128444
11826a28444j19335D9944R448f2907k4277B92713j35659b67155j98556a55479
11815b07678M0160A9205h1405A71355a24095j32052B9938h4544C22028E6878a40788
11803b36915J06673I168b89983C0909J10744R3982a43688C9510O9239a66381r0330
11792b56711B80763c17628C7986A5096a79025L421A34127d6382k04225A68291
11781B36045j02439b87748B90489n243F8099b2969A42820b01655H5771d2863n9511
11770a02374k21421I9279A6578b87173b3625B4501h7559D5410K18255B1004J08474
11759A29478b52258B12936a48978O4614E4001b09438H979a61162A66832D974R2067
11748I7041J41074e2077B15029B333a91914A26980J8739r02A0811g6778c1326
$$ plain form
11826 -128444 -247779 49944 59392 -62907 -87184 292713 157054 -267155 -465711 -155479
11815 -207678 -167518 19205 -81405 171355 -124095 -256147 29938 -84544 322028 56878 -140788
11803 -236915 -130242 9168 -289983 30909 141653 235635 -143688 39510 108749 -166381 -256711
11792 -256711 280763 -317628 37986 15096 -179025 -175604 134127 -46382 -250607 168291
11781 236045 133606 -287748 290489 285246 68099 -22969 142820 -201655 85771 -42863 -102374
11770 -102374 -323795 99279 16578 -287173 -23625 24501 -87559 45410 263665 21004 129478
11759 129478 -252258 212936 -148978 -84364 54001 -209438 8979 -161162 166832 4974 97041
11748 97041 238115 -52077 215029 2333 -191914 126980 145719 144817 10811 -76778 -31326
11736A3433P9310F862D01Q8906a83890q4618C705d4092I3635a72846j38971i9103
11723A35309J60982d3l01974m0546B01528a21323k6918B01737r2543P4636C486
11711F7691R4505b79611J21253j28227B50744B5948b02783N3384A92158a23011
11700b12455Q0694b2460D9988K21410k1669b46318B06235a12504A77746j9529
11690A58217f6771I7467l0748g9864j19684A97332K68081q2408a09433p1271B4794
11678A25606m0629O1820K10489p7078K5952Q8621a86268I3289K17409c4458F7014
11666e9220I126L5210Q3588L2593j0525a35471D88987b16246i4713I4664R3874
11655A88538A5930h1995m050j60770B974L18373C0445J01503N9938O2679o2109
$$ plain form
11736 13433 92743 6862 401 89307 -183890 -268508 3705 -44092 93635 -172846 -311817 -99103
11723 135309 296291 -43 -302017 -342563 201528 -121323 -148241 201737 109194 183830 3486
11711 67691 162196 -279611 -158358 -286585 250744 25948 -202783 -149399 192158 -123011
11700 -212455 -131761 -22460 49988 271398 249729 -246318 206235 -112504 177746 158217
11690 158217 -66771 97467 66719 -79864 -199548 197332 465413 383005 -109433 -180704 24794
11678 125606 84977 146797 357286 280208 306160 394781 -186268 93289 310698 -34458 67014
11666 -59220 9126 44336 127924 160517 149992 -135471 488987 -216246 -94713 94664 188538
11655 188538 15930 -81995 -86045 -246815 2974 321347 30445 131948 191886 254565 192456
11644A92456b3617m70695A48934b52739C10672H3139f2300j8084j16012h9912
11633B21793j07086A2042a33967H2212b17156B06260n3916g9918B50977I3298
11622c2093a3390C437M7941B1453J35363C0041g1688b6555F2348a17653k0298
11611a37951K2138K4651C3653J55751K51467b74923A37176J11262a92178C25474
11600b40146D7467d26318b1835A18306a69960F6415P0295A1210i0258C09103E2053
11588b32897a01026I0056a4666C01800r2084a65501B46145H0274J0989b55824
11577d9053A63041J35635A40801a41490C2866O2257O2845J42689a20294a8512
11566g1045m9545B15031f5393H4515a35264A09560J9421N9900J726a46320f5278
$$ plain form
11644 192456 -23617 -494312 148934 -252739 310672 83139 -62300 -80384 -196396 -89912
11633 221793 114707 12042 -133967 82212 -217156 206260 152344 -79918 250977 93298
11622 -32093 -13390 3437 51378 21453 156816 30041 -71688 -26555 62348 -117653 -137951
11611 -137951 -115813 -91162 33653 189404 440871 -274923 137176 248438 -192178 325474
11600 -240146 47467 -426318 -21835 118306 -169960 66415 136710 11210 -90258 309103 52053
11588 -232897 -101026 90056 -14666 301800 209716 -165501 246145 80274 91263 -255824
11577 -49053 163041 298676 140801 -141490 32866 95123 157968 300657 -120294 -18512
11566 -71045 -120590 215031 -65393 84515 -135264 109560 128981 188881 190607 -146320 -65278
11554B2476Q5926f526H1432a12412G5836J84924C2673b6961k34145A18493J38986
11543B57479b4617a0448C53504j56638k0621a02329E9665J02014N163f8799B07563
11531B53463J91783A79073i2275e29A35282B173J9065N1165K00250E8358N1207
11520A09565J476J40421G5576J88201e720C59390Q2736b27953A47121L235p1938
11509G8418L13485r7480B8735K42514O4385F5562J7265e7504A33622c2174C53354
11497D70074A46103b8338D6195K18394m1326B4729K45453B268L08754A33296J99010
11486C32306E3193M92629B21131I5478L1403H158K49031m2164a04106A98173R3765
11475B91938k9258J9024a80108B47559A5336L3860J03138J75888N5088j37651
$$ plain form
11554 22476 108402 -6526 81432 -112412 75836 260760 32673 -26961 -261106 118493 257479
11543 257479 -24617 -10448 353504 196866 176245 -102329 59665 161679 166842 -68799 207563
11531 253463 445246 179073 -92275 -529 135282 2173 21238 72403 272653 58358 109565
11520 109565 111041 251462 75576 263777 -5720 359390 442126 -227953 147121 150356 78418
11509 78418 391903 294423 28735 271249 335634 65562 82827 -57504 133622 -32174 353354
11497 470074 146103 -28338 46195 264589 223263 24729 270182 2268 311022 133296 332306
11486 332306 53193 545822 221131 95478 126881 8158 257189 215025 -104106 198173 291938
11475 291938 262680 281704 -180108 247559 15336 49196 152334 328222 383310 245659
11465B45659a03787k57995B87685p2465L22614g6412A86868L6080a69982C3461
11454B00977p9001J5678K0075J34013b9426B06992M2711H9293a16041B63359O4424
11443C27783d5489a3279d03E569N36568i0221k3474A36589b33685D6416K40927
11432B87343o9308p0770c6384I2254f13909I3709a42575A93098b5071A50232a26399
11420B10024l6227N7293b70901b4460C38002j02322e6668C53828o0304A23725
11409d3357n8921A93091b84956E6360O522J15296K81315a2875F4303K9262d1518
11397a118o9460E9046J37812M011b81825B9110d6441A35095B7376c0865C21829
11385b60676M8245C28973a18445B61345J62142G9529P8582a6684A21239B5903
$$ plain form
11465 245659 -103787 -361782 287685 215220 537834 -76412 186868 222948 -169982 33461
11454 200977 121976 137654 157729 291742 -29426 206992 249703 89293 -116041 263359 327783
11443 327783 -45489 -13279 -403 5569 542137 -90221 -113695 136589 -233685 46416 287343
11432 287343 218035 147265 -36384 92254 -613909 93709 -142575 193098 -25071 150232 -126399
11420 210024 173797 231090 -270901 -24460 338002 235680 -56668 353828 293524 123725
11409 -43357 -102278 193091 -284956 56360 62882 178178 459493 -12875 64303 93565 -41518
11397 -1118 -70578 59046 196858 200869 -281825 29110 -46441 135095 27376 -30865 321829
11385 -260676 -212431 328973 -118445 261345 423487 79529 158111 -16684 121239 25903
11374B22671q3723m7743C839b3077O960A19787a32422B6873a14257C75781A53231
11362C1112O5035c92458g1047j71098Q0975j80831A79965c36051R1561e8873k42308
11351c01181A24438b98428Q0387a5705B114a78519A55436H218J60265c01066a08803
11339d7933A71024B2362q148c17237A90257b0376A21551K6791e01209a55863E7559
11327a37475j04013C6727M2592Q8038m5127B3604J41901c90960i3789j69331B5348
11315i7155L2461j2667a2081j09005j9200B38407l439l0673c42224e1114a5537
11303a5744r2011D3823J7383B2699p0J6893a4478j55234g9916j31409J05370C4188
11290h8798I2441C1695M5219A7393c9219j07000a8919j35656A75494h4806B20661
$$ plain form
11374 222671 138948 91205 3839 -23077 -16117 119787 -132422 26873 -114257 375781 153231
11362 31112 96147 -392458 -71047 -242145 -161170 -342001 179965 -336051 -244490 -58873 -301181
11351 -301181 124438 -298428 -218041 -15705 2114 -178519 155436 8218 168483 -301066 -108803
11339 -47933 171024 22362 14214 -317237 190257 -20376 121551 148342 -501209 -155863 57559
11327 -137475 -241488 36727 79319 167357 122230 23604 165505 -390960 -93789 -263120 25348
11315 -97155 -64694 -77361 -12081 -121086 -140286 238407 234968 204295 -342224 -51114 -15537
11303 -15744 -107755 43823 61206 22699 22629 39522 -14478 -169712 -79916 -211325 -105955 34188
11290 -88798 92441 31695 76914 17393 -39219 -146219 -18919 -154575 175494 -84806 220661
11278a61310A51376J7173M8501o3737a16086A23709i2629A78575A3587a12804
11267h294j36545C5541i4766o0875k8115n2991I6257c4001J0884D99c56934A0205
11254A1476a2440l7980D4635J0659K4939J5055D1566e360k79205R4392p9156F1309
11241g0203j21724k5404H9925b2668B01517a5030D33373b49035E1454b23355B61886
11229a37491a9476l60004a08189A24723b99492A82262q2383N8363a57958l3134
11219a91092N6414C9473e8239J9355B1177c6443j07551o7254A09082a79769p33
11208a80502p4389K3103F5445L7929a90706D66662a80178G8985J89979L8163e3920
11196c13655J36047j1034A19389i8764A13060i1811l00158J58975N759R0068d7292
$$ plain form
11278 -161310 151376 168549 217050 153313 -116086 123709 -92629 178575 13587 -112804
11267 -8294 -144839 35541 -94766 -155641 -183756 -236747 96257 -34001 -23117 499 -356934 10205
11254 11476 -12440 -50420 44635 55294 80233 95288 41566 -5360 -284565 -190173 -269329 61309
11241 -70203 -191927 -217331 89925 -22668 201517 -15030 433373 -249035 51454 -223355 261886
11229 -137491 -19476 -379480 -108189 124723 -299492 182262 99879 158242 -157958 -191092
11219 -191092 -134678 39473 -58239 -38884 21177 -36443 -143994 -211248 109082 -179769 -180502
11208 -180502 -254891 -231788 65445 103374 -190706 466662 -180178 78985 268964 307127 -53920
11196 -313655 -177608 -188642 119389 -98764 113060 -91811 -391969 -232994 -227235 -137167 -47292
11184B12466h8222j52985i3631o0480E7814g7772L1501n3094A88455b16470e2477
11172b03059R0003A27932D8678b33030N0732A08090K6591h7988j24614k484D5819
11160A92539H3396B4331d99649e949H3870C9178b03754q3167B29592c83713B18427
11148B54948b31695H0593i080o5033A31320o0872J6986C1489d08828K03503C6081
11136A72851M3414a9130j70734J5697g4993o7618A36973a91866N0770a4256A7961
11124A95021C5813g0038A45204L43372A85570a21456A44640a05726E43568G4011
11113A70428J94523e3007m9166F5586K3862N8772b47289B96048O4229L493p0235
11102B93535J0028a1936C22248a0655G6877J08038o6919b2019A5009L41063K8309
$$ plain form
11184 212466 -88222 -241207 -93631 -154111 57814 -77772 -46271 -99365 188455 -216470 -52477
11172 -203059 -113056 127932 48678 -233030 -182298 108090 134681 -87988 -212602 -215086 45819
11160 192539 83396 24331 -499649 -5949 83870 39178 -203754 -286921 229592 -383713 218427
11148 254948 -231695 80593 -9080 -74113 131320 70448 87434 31489 -408828 -205325 36081
11136 172851 216265 -19130 -189864 -174167 -74993 -142611 136973 -191866 -141096 -14256 17961
11124 195021 35813 -70038 145204 488576 185570 -121456 144640 -105726 543568 74011
11113 170428 364951 -53007 -102173 65586 89448 148220 -247289 296048 360277 363770 293535
11102 293535 303563 -11936 322248 -10655 76877 184915 117996 -22019 15009 356072 384381
11091C84381j22320O3353K4027A38072h611B71316K52497k37120M5332L01824
11081F33849B20661g1597C61342q6749A29431a28762C50581p4380A21619K90933
11071D12552K32581B36154L36931k76448C3005L13496q0051o6428J87410Q7779
11061D75211L8170R3198j35851J42939O2612j86356M61334l64707K05836k57462
11051E34924K45214n7764L42229L88363o73024L16328l12169q7783L96002k47873
11041H44447n2273j74225L00501j63412M2810J55826m11732J98053p4490j42682
11031E22823J59863j73372J94656k22859K56718j67814M88547k82724O2537J40155
11021I78530J1483k99085P6529K23418j11181l62466K21561O8405k79316j00501
$$ plain form
11091 384381 262061 325414 349441 138072 -8611 271316 523813 286693 332025 633849
11081 633849 220661 -71597 361342 274593 129431 -128762 350581 276201 121619 412552
11071 412552 645133 236154 573085 296637 33005 346501 266450 200022 387432 475211
11061 475211 513381 606579 470728 613667 676279 489923 951257 586550 792386 534924
11051 534924 780138 722374 1064603 1452966 779942 1096270 784101 696318 1092320 844447
11041 844447 792174 617949 918450 755038 797848 953674 541942 739995 665505 522823
11031 522823 682686 509314 703970 481111 737829 570015 1058562 775838 838375 978530
11021 978530 990013 690928 767457 990875 879694 517228 738789 807194 527878 427377
11011D27377K8954J28052L44951j27879j48282q3357N7871L20237J01610k21375
11001H28159k47505J17572K17319J05618m05258q9890Q1014J26813K58871l0756
10991I61957J21772k50844p6827J51426O7779j04631J56281j27181M52518k08012
10981A144238M89496m4173K3988m2282K73298N1134M81323L38512J59508N16736
10971C391778J26092j96418L42802n89814j2052l34524l52531l1072k00887m40132
10961A703242j20286M26437l09327k3761n1995M38543l12096l00520j52803l14135
10951I83299k77207K09328j12092k53500o5719j51944J50244F5653J62864K33075
10941D61592E2517N4914j2316K26668F2189J65678n2003c03557C4203a82756p7215
$$ plain form
11011 427377 456331 584383 929334 801455 653173 569816 627687 947924 1049534 828159
11001 828159 580654 698226 915545 1021163 615905 526015 607029 733842 992713 961957
10991 961957 1083729 832885 756058 907484 975263 870632 1026913 899732 1352250 1144238
10981 1144238 1633734 1589561 1613549 1571267 1844565 1895699 2377022 2715534 2875042 3391778
10971 3391778 3517870 3321452 3664254 3074440 3062388 2727864 2375333 2344261 2143374 1703242
10961 1703242 1582956 2009393 1700066 1676305 1624310 2062853 1750757 1450237 1297434 983299
10951 983299 706092 915420 803328 549828 484109 332165 482409 65653 228517 461592
10941 461592 52517 107431 95115 321783 62189 227867 175864 -303557 34203 -182756 -259971
10930b59971a4811B80150G505M61666A83838o7125a20739F5837K0684c4748i169
10918A71288C6498a39828L7847D3033a26583j1293H9651f3835j24811A0146b55603
10906A33226g1498L1322A34888A898c54403B8518Q1218C3702L3647a92162e2517
10894a91230L6373E09335a70194d5777a7527P245B0955J27612A2830K8446h5723
10882b29238C64591h996m6092A37661J14269f8234A9281Q0171m0572a66335p4412
10871b40747P0468j28813F05762a85074P1687M4886I836J08639a22071j96703
10861c18774D070c07101g2386A43261f6515a4465O155j3302A84805l4185b78047
10849B9289J84960F0680D565c67887B47550A04718d6121G776b02784j47912C5765
$$ plain form
10930 -259971 -14811 280150 7505 469171 183838 116713 -120739 65837 86521 -34748 -9169
10918 171288 36498 -139828 -101981 43033 -126583 -137876 89651 -63835 -188646 10146 -255603
10906 133226 -71498 -40176 134888 1898 -354403 28518 109736 33702 67349 -192162 -52517
10894 -191230 -154857 509335 -170194 -45777 -17527 -10282 20955 148567 12830 41276 -85723
10882 -229238 364591 -8996 -55088 137661 251930 -68234 19281 99452 58880 -166335 -240747
10871 -240747 -170279 -299092 605762 -185074 -113387 -68501 9836 118475 -122071 -318774
10861 -318774 4070 -307101 -72386 143261 -66515 -14465 -8310 -21612 184805 150620 -278047
10849 29289 214249 60680 4565 -367887 247550 104718 -46121 7776 -202784 -350696 35765
10837H931b35980A13482J9870h025B9123g8889H0122g6023g393j58246j6421I3435
10824a90986O3850c4969M386A08605N3368D4553N1639d8659j80222O2313e7814
10812A70744a29976j44839a33315A1623P0655A6694a47864O2424A4829a64578
10801c95787G3402Q4098m0218a04380d3416E6475g5574B15021G5319C6909M6844
10790H3753b16100E0960a7115l7741j87925I4796J49989A03568J1608e7971j28134
10779a86105B4832e496j87686l49742K19063P6875C51404A529e1402j17482P3257
10768i5627A37790a23522n250j59024b990j70811B17076a64013B74349b33862
10757G6707Q3249a88295h7473C0177g6388j00651F7783J57543b57585L242a0759
$$ plain form
10837 8931 -235980 113482 133352 -8025 29123 -78889 80122 -76023 -7393 -165639 -182060 93435
10824 -190986 -127136 -34969 -30583 108605 161973 44553 96192 -48659 -228881 -166568 -57814
10812 170744 -129976 -274815 -133315 11623 82278 16694 -147864 -85440 14829 -164578
10801 -395787 73402 157500 117282 -104380 -43416 56475 -75574 215021 75319 36909 83753
10790 83753 -216100 50960 -17115 -54856 -242781 94796 244785 103568 115176 -57971 -186105
10779 -186105 24832 -5496 -193182 -542924 -323861 -246986 351404 1529 -51402 -168884 -95627
10768 -95627 137790 -123522 -128772 -287796 -2990 -173801 217076 -164013 274349 -233862
10757 76707 159956 -188295 -87473 30177 -76388 -177039 67783 225326 -257585 -254343 -10759
10745b3842l117r8797n5434O3683o380k24334c576j09523D4488E271J77950a86222
10732b1218B34219A5738J13131a29451N2691A8759a04047r9369B6791i6998L1774
10721f5224n2388D67691A32063h9190j31824j1489d7643k16087d4384B39560D2873
10709E0619g0861c5201a3084I4792e79159K62598J20074B82728m981e6925j29707
10698a86632c7097A674i047D9237a16930M1453A54343E3232a8040B41746b38279
10686a32641B81355A1289N8847a79729b8140I3144g9290k22639I6694a85607O8736
10675a16871M6739B55281A06436J0075j0974a9212C48382d901A79083l9318a7355
10663b0051D3121a16791j42535f8987p592j7663B1480K82212b30966B876a08983
$$ plain form
10745 -23842 -26959 -125756 -181190 -117507 -123887 -348221 -3576 -113099 44488 5271 183221 -186222
10732 -21218 234219 15738 128869 -129451 -76760 18759 -104047 -203416 26791 -96998 -65224
10721 -65224 -117612 467691 132063 -89190 -221014 -232503 -47643 -263730 -44384 239560 42873
10709 50619 -70861 -35201 -13084 94792 -579159 -316561 -196487 282728 277747 -56925 -186632
10698 -186632 -37097 1674 -9047 49237 -116930 -75477 154343 53232 -18040 241746 -238279
10686 -132641 281355 11289 70136 -179729 -28140 93144 -79290 -301929 96694 -185607 -116871
10675 -116871 -70132 255281 106436 116511 105537 -19212 348382 -4901 179083 139765 -17355
10663 -20051 43121 -116791 -259326 -68987 -76579 -94242 21480 303692 -230966 2876 -108983
10651h3667j71083f2977j61688F1842c50123a11245j5941J4769a756m5220j30736
10640a77712b0798k1039B71326o8463g7159L6839r4506o0391D39289a34485A01505
10628b5518k25128e4720a4462k8275o8070p6335p6328C1954J02069b06424C67781
10616b04984G150b88575P8698p52e7975D389K13283b17823A7796a51077A52195
10604B4119P0379a47886a6201G2445b3055j8294J4807I7163M6726a97892A0835
10592E8231c7656q5836B57003G2691J02417a22627k20784J63138I2015a30626
10581A13824J14401c9444j70949B41821o8730e80327B11789B676J08001J1056
10571A21733b4265q3782r2731f842l70117A8023b01035A14627a45696e1977L028
$$ plain form
10651 -83667 -254750 -62977 -224665 61842 -350123 -111245 -127186 -112417 -1756 -46976 -177712
10640 -177712 -20798 -41837 271326 202863 -77159 -40320 -134826 -195217 439289 -134485 101505
10628 -25518 -250646 -54720 -14462 -42737 -110807 -187142 -263470 31954 134023 -206424 367781
10616 -204984 7150 -288575 -209877 -210629 -57975 4389 217672 -217823 17796 -151077 152195
10604 24119 94498 -147886 -16201 72445 -23055 -41349 -26542 97163 143889 -197892 10835
10592 58231 -37656 -123492 257003 72691 175108 -122627 -343411 -180273 92015 -130626
10581 113824 228225 -39444 -210393 241821 173091 -580327 211789 2676 110677 121733
10571 121733 -24265 -108047 -200778 -6842 -376959 18023 -201035 114627 -145696 -51977 -48949
10560d8949F0166a93624Q7080a3731C0060a48205j94430B16625b00754E9672a29788
10548a14622l992J0176j14377B88994G9503g904j65622n4878L171A61936b42221
10536B42065a01847j95862I9237L25720b8536J1104D2961b55967O402B14868f4247
10524A80283c488A48461M10j3350D4999d3689B40626j11409g2398I8387k5190
10513G3197B0749d7195D73042d30556b00094H0289a24613J8363l0773j4944l9795
10502a91762g4211c5216p282a4157j72627f0026J3011B4168e9182A44230d0339
10490a84900E6024L08247a56655A90542B7336a3648A55893L52153J0161j53031
10480C65176A58218N9131N2873K07438d3585A95835d5560B06610F7245a58686
$$ plain form
10560 -48949 60166 -193624 -106544 -13731 30060 -148205 -342635 216625 -200754 59672 -129788
10548 -114622 -118614 -108438 -222815 288994 79503 -7904 -173526 -228404 -225233 161936 -242221
10536 242065 -101847 -297709 99237 424957 -28536 -17432 42961 -255967 -249565 214868 -64247
10524 180283 -3488 148461 148871 135521 44999 -43689 240626 129217 -72398 98387 73197
10513 73197 20749 -47195 473042 -430556 -200094 80289 -124613 -106250 -137023 -151967 -191762
10502 -191762 -74211 -35216 -42498 -14157 -186784 -60026 -47015 24168 -59182 144230 -40339
10490 -184900 56024 364271 -156655 190542 27336 -13648 155893 508046 518207 365176
10480 365176 158218 217349 270222 477660 -43585 195835 -45560 206610 67245 -158686
10469b683m6310A23195r728K38879A416a0227j27834F8781j8757J41736b75343
10457b66051D08927a19792J6890j02586d6907j40525B52459B1999J7190a6074
10446c47888E6082b7193B367c12825H9414F195J6444J46117b08849B52803I284
10434A04611R7036e2946B57539a01270D984K7120e7458k01002d3702k06264A3860
10422C8618L7922J47198i2240j48874c3185o6938k89716B8541c26000a62096g2621
10410I1418a19985j24782e2265q6683p449k2988B23349c39240K583A69192c503
10398e1659o1592o3979l5426A27414D4281a89810B21586P3385a33669D27202A94329
10386D6261M9583m0372Q9744C530M5538O6842a895A15082k960K69568A61598n6832
$$ plain form
10469 -2683 -48993 123195 113467 352346 1416 -10227 -138061 68781 50024 191760 -275343
10457 -266051 408927 -119792 -102902 -205488 -46907 -187432 252459 21999 39189 -16074
10446 -347888 56082 -27193 2367 -312825 89414 6195 22639 168756 -208849 252803 9284
10434 104611 201647 -52946 257539 -101270 4984 32104 -57458 -258460 -43702 -249966 13860
10422 38618 76540 223738 -92240 -241114 -33185 -100123 -389839 28541 -326000 -162096 -72621
10410 91418 -119985 -244767 -52265 -138948 -146397 -169385 223349 -339240 -336657 169192 -3503
10398 -51659 -113251 -177230 -212656 127414 44281 -189810 221586 294971 -133669 427202 194329
10386 46261 95844 55472 145216 3530 49068 115910 -1895 115082 112122 381690 161598 104766
10374A04766J16867J88472H1437e7958C16560M3774H8837l8811N73354j3823B70221
10362F68095r5499j56388G3215L48904A00879K92450A42167k6255K88799j09284
10352B95427L8547J70148k8123J57602q8820P7465k78396M2320H3863N01074B5566
10340F09592p6663a8237A63664O9763Q3294n2879g3373C75229j31567J94931B758
10328c7590j16627g543I2893f1452B40029A06182M42696B20129b07740D46923
10317A15601M6323J39144P13a26103C40815c5673j3785A28972R2119J8986m2316
10306A97761k4959E9714K583A5873R5298J57607b45627G3056O5741B900J15898
10295A18798M9237a75852L499F3295a5950D40721a19598d7879l0054p7753K5837
$$ plain form
10374 104766 221633 410105 81437 -57958 316560 360334 88837 50026 623380 609557 270221
10362 668095 572596 416208 73215 422119 100879 393329 142167 115912 404711 295427
10352 295427 333974 504122 475999 633601 544781 622246 343850 386170 83863 584937 25566
10340 609592 532929 -18237 163664 233427 316721 263842 -73373 375229 243662 438593 2758
10328 -37590 -154217 -7543 92893 -61452 240029 106182 548878 220129 -207740 446923
10317 115601 161924 301068 301781 -126103 340815 -35673 -49458 128972 221091 240077 197761
10306 197761 172802 59714 62297 15873 111171 268778 -245627 73056 138797 2900 118798
10295 118798 168035 -175852 -172353 63295 -15950 440721 -119598 -47879 -77933 -155686 -129849
10284a29849B28009r3085J4059c38557D0445j6153b00545d8954B11304g5760A5349
10272d2639j11373A93419R1556A3205M516J23185a81746A17379e1053A99984F681
10260B28544J63630j82172q40R5946G8431f3466B13519J11870F5023a37131M2115
10249i5016A54084c1932o9096m7701A57079b55671C22448A03796R638h1099A40270
10237A32446a34304O4532k7258c7961B14079b20713a1626K350C9046b24340M6024
10226a78316P6012A64185a37638A91458b16551j50320e7996j73217b0948o5235
10216h6183b3726E9328F865d7389j76865k33584K11989C0202K62928a31768j46228
10205b77996A55335a67822E49J21341d5649j4473H9249j1184L3404E4542O0523
$$ plain form
10284 -129849 228009 134924 148983 -338557 40445 24292 -200545 -48954 211304 -75760 15349
10272 -42639 -154012 193419 284975 13205 17721 140906 -181746 117379 -51053 199984 6681
10260 228544 392174 210002 209162 305108 78431 -63466 213519 325389 65023 -137131 -95016
10249 -95016 154084 -31932 -101028 -148729 157079 -255671 322448 103796 113434 -81099 140270
10237 132446 -134304 -69772 -97030 -37961 214079 -220713 -11626 -9276 39046 -224340 -178316
10226 -178316 -102304 164185 -137638 191458 -216551 -366871 -57996 -231213 -20948 -86183
10216 -86183 -23726 59328 6865 -47389 -224254 -457838 -245849 30202 293130 -131768 -277996
10205 -277996 155335 -167822 549 121890 -45649 -60122 89249 78065 111469 54542 115065
10194A15065i9166A4479f256l12648h101j84138g4764m8283k87160a11411k10041
10183c21452A33226c3786k58573b9649a2564B1551g1000E6409f3537B54155a73054
10171a55012A89287d4111A45626a83399b8545R53k97684j57840b27415a07418
10160b46943Q6120j14333k5305P898I2580j2178a45907H0442k6034O6937J73448
10149B94793a35723A30158l0278b17048m5093M0667D1846g6088j23684i0086c5900
10137A30683A4759i2098M3394C47558j45214J2454b64877B30446F3067b4375A4620
10125A01603A6872e2585k21821C7035f8638B07242c20771E1169c78680a66322
10114I2790f7915j56251a06985d2183k14475e9491r9409o6124j60256D1213J85411
$$ plain form
10194 115065 -99166 14479 -6256 -318904 -8101 -192239 -74764 -123047 -410207 -111411 -321452
10183 -321452 133226 -33786 -292359 -29649 -12564 21551 -71000 56409 -63537 254155 -173054
10171 -155012 189287 -44111 145626 -183399 -28545 -27592 -325276 -483116 -227415 -107418
10160 -246943 -160823 -275156 -300461 -292563 92580 80402 -145907 80442 54408 121345 294793
10149 294793 -135723 130158 99880 -217048 -262141 -221474 41846 -76088 -199772 -90086 -35900
10137 130683 14759 -92098 -48704 347558 202344 214798 -264877 230446 63067 -24375 14620
10125 101603 16872 -52585 -274406 37035 -68638 207242 -320771 51169 -378680 -166322
10114 92790 -67915 -224166 -106985 -42183 -256658 -59491 -158900 -225024 -385280 41213 226624
10103B26624B5414f3795m82725A31816a88062r6696A17171J04751a7840j5738
10093c3578k35213C2883J5763a5097m0286n0761C0682J72010a26005C6112a48676
10081A61242d6075C6954K86779A32890M39332I806J9335e83356a02142k91628
10071c93770f6948n6965M3494A00620O0581a78822J5014Q1428k63998A95566G3096
10059B6471K59003c41440a2228j95642b0547k08270j13212D1870a01376E7013
10048a49351A83b63040A86085a968j82800I9756J1074b47564l23973K60124J46549
10037a64864B01919b39463A80554E2037M7688h5627q2002g6660o5350p7209D6817
10025H9798f4616j1016A30177c99743b7100H0385J58481c42111a62743J1165r6892
$$ plain form
10103 226624 25414 -63795 -546520 131816 -188062 -284758 117171 221922 -17840 -33578
10093 -33578 -268791 32883 48646 -15097 -55383 -106144 30682 202692 -126005 36112 -148676
10081 161242 -46075 36954 323733 132890 572222 9806 29141 -583356 -102142 -393770
10071 -393770 -66948 -123913 -80419 100620 161201 -178822 -163808 -82380 -346378 195566 73096
10059 26471 285474 -341440 -12228 -207870 -20547 -228817 -342029 41870 -101376 57013
10048 -149351 183 -263040 186085 -1968 -184768 99756 110830 -247564 -571537 -311413 -164864
10037 -164864 201919 -239463 180554 52037 99725 -85627 -167629 -76660 -142010 -219219 46817
10025 89798 -64616 -75632 130177 -399743 -27100 80385 238866 -342111 -162743 -151578 -248470
10014b48470B1616c32531a13934I0221b96753A56419b98622g1295m08771A48104
10003b40747P851f6834A97314b65104N2988a8836j88999J02183k39054B9081I222
9991A8977b3842B33068c0661k6995A12335b31927O8244B59555A27570c24385j90640
9980e15025a91311A40225K23383a78397h2834k46862G4638a87872e9908J6326
9970d3582k37905A6309L167g202E8100g7723p7402B897b0623e361l1962I598O711
9957A6309b88107g917j96029j09773A03262b85356a6154A40738b87238h0427p9092
9946a59519q8065A14216g4847k3140a9235j20969M4448c5803a2315A26500b4629
9934A54335a66485F56d6575H4366d06005a84567B21054b32361J2224C5036c32673
$$ plain form
10014 -248470 21616 -332531 -113934 90221 -296753 156419 -298622 -71295 -480066 148104
10003 -240747 -232896 -66834 197314 -265104 -212116 -18836 -207835 -105652 -344706 29081 9222
9991 18977 -23842 233068 -30661 -57656 112335 -231927 -163683 259555 127570 -324385 -515025
9980 -515025 -191311 140225 363608 -178397 -82834 -329696 74638 -187872 -59908 -43582
9970 -43582 -281487 16309 19476 -7202 58100 -77723 -155125 2897 -20623 -5361 -37323 9598 16309
9957 16309 -288107 -7917 -203946 -313719 103262 -285356 -16154 140738 -287238 -80427 -159519
9946 -159519 -247584 114216 -74847 -97987 -19235 -140204 -95756 -35803 -12315 126500 -24629
9934 154335 -166485 656 -46575 84366 -406005 -184567 221054 -232361 -220137 35036 -332673
9922h1303n4123b8028j02720A37830c31772e8926l32418A13952b46619B0872b9628
9910B6339K11525c5057j12628e9347F7250J57715A5252b29325c858j6328m0225
9899f0411F259c96072b9024j6049j69723j35519a52207j50603R5642B13033a92938
9887e3799I6939A4350K40582A00407a67481j13520A26807c6273j07800d4743G2463
9875C3656J20847a70968A76338a3363j99429h3988j02398a2744k03650b5508k6930
9864e2438n7274k23100e7840C41838b16147A44420a06627L3201j60833E5500a32633
9852B15620E3945f4055K9780A72233d3933I3095b21311M0702C55627G3300b324
9840b96540F3866b880B56469I8986q194A2728b23608D1621N4492d40379f5232
$$ plain form
9922 -81303 -135426 -28028 -130748 137830 -331772 -58926 -391344 113952 -246619 20872 -29628
9910 26339 237864 -35057 -147685 -59347 67250 224965 15252 -229325 -3858 -20186 -60411
9899 -60411 6259 -396072 -29024 -45073 -214796 -350315 -152207 -302810 -207168 213033 -192938
9887 -53799 96939 14350 254932 100407 -167481 -281001 126807 -36273 -144073 -44743 72463
9875 33656 154503 -170968 176338 -13363 -212792 -83988 -186386 -12744 -216394 -25508 -52438
9864 -52438 -109712 -332812 -57840 341838 -216147 144420 -106627 -73426 -234259 55500 -132633
9852 215620 53945 -64055 -34275 172233 -43933 93095 -221311 -180609 355627 73300 -2324
9840 -296540 63866 -2880 256469 98986 90792 12728 -223608 41621 96113 -440379 -65232
9828a81364D6207d34747a75556o2257G9526a19145j58638a22420E2952b21073
9817b08282j4529G1780a43966k92782D8383A8538h830k74965A7899b90552F9350
9805a14775E7971j4685b78330R6732l0266C8677h5604M862H9861d9754J1376m04711
9793d43089B06629R4731A12854b03441P5200e0928A32139P1034c40623g8251i274
9781B11896a31501j56632R9335a5056I0664P8430h3930l8148j4368L8299b2781
9769E7353b95110C1979L2395J67523I1996a96592L0826a7264q4280A6386K52167
9758B68553f5823H7662j3948a48189d0637H8653a55759I580L11738A7229a33702
9746G6337a82833o6972r8409a5803l42882h1468j4343A07293a17200K9968l24739
$$ plain form
9828 -181364 46207 -434747 -175556 -237813 79526 -119145 -277783 -122420 52952 -221073
9817 -208282 -222811 71780 -143966 -436748 48383 18538 -8830 -283795 17899 -290552 69350
9805 -114775 57971 43286 -278330 -181598 -211864 38677 -85604 -80742 89861 -49754 -38378 -443089
9793 -443089 206629 301360 112854 -203441 -128241 -50928 132139 203173 -340623 -78251 -9274
9781 211896 -131501 -288133 -188798 -15056 90664 169094 -83930 -122078 -136446 -98147 -22781
9769 57353 -295110 31979 64374 231897 91996 -196592 -165766 -17264 -101544 16386 268553
9758 268553 -65823 87662 73714 -148189 -40637 88653 -155759 9580 321318 17229 -133702
9746 76337 -182833 -249805 -348214 -15803 -358685 -81468 -95811 107293 -117200 -87232 -411971
9735d11971a65087O7528A48069a32381E2829b35017Q6829o3670A21449g1557A1374
9723A14426J57676a23966A70912l1320a48272l4442A97010J11942n1917j15189
9713A41846f07245a8705j49482d9872k48420f2751k578r7598A94819c45685e5708
9701A13668b57481g0924k58218g3370j44842C2073M3656b50666A06846f3156j12934
9690a76090F2293b10137j0749B42041J51778b89711A23078b41593A86660G1763
9679a26017m5060J593q8702A40592d4285k68093c9838G9151c90534A63936D083
9667b47141G2100B4262J29553B4962O328N9567a45374o9770o2325h8914j54017
9656b42931p2063L7313a13574j37233J73G1245g1515r5876N9290q0700H1294e4593
$$ plain form
9735 -411971 -165087 -97559 148069 -132381 52829 -235017 -148188 -211858 121449 -71557 11374
9723 114426 272102 -123966 170912 139592 -148272 -182714 197010 308952 257035 141846
9713 141846 -607245 -18705 -168187 -49872 -298292 -62751 -65329 -162927 194819 -345685 -55708
9701 113668 -257481 -70924 -329142 -73370 -218212 32073 75729 -250666 106846 -63156 -176090
9690 -176090 62293 -210137 -220886 242041 393819 -289711 123078 -241593 186660 71763
9679 -126017 -171077 -169484 -258186 140592 -44285 -312378 -39838 79151 -390534 163936 4083
9667 -247141 72100 24262 153815 24962 31290 90857 -145374 -215144 -277469 -88914 -242931
9656 -242931 -314994 -277681 -113574 -250807 -250634 71245 -71515 -167391 -108101 -188801 81294 -54593
9643a34564G1584b13882A73124f2917A33601A9302c60884B28391C9634a48162
9632b58698a25319I3386g8105n9013D6165c2603m4853o5152f2706a2572I3596
9620A8828b08300c1217F66P9503a57664l2862H5983l1146b79797f7527k13693
9609b81220D8475J43630a39713b8499C6646M4198a33123j70019a19910j79706
9599b99616J45662P5327F7019h8797B0756P5710e46194B62729i2219A53546c65664
9587H1679i8120I9566a52599P5888l47721J82146J00552k33328h6648I2669f5844
9575a67219l5001l1403J05802D05401A59225G0013A8402a26645K7189l18444a0793
9563D6119i5691A33918n2723c84632A42430a8279l72594h197k48493B08209D7126
$$ plain form
9643 -134564 71584 -213882 173124 -62917 133601 19302 -360884 228391 39634 -148162
9632 -258698 -125319 93386 -78105 -137118 46165 -32603 -77456 -142608 -62706 -12572 93596
9620 18828 -208300 -31217 666 80169 -157664 -190526 85983 54837 -279797 -67527 -281220
9609 -281220 48475 192105 -139713 -28499 36646 80844 -133123 -303142 -119910 -299616
9599 -299616 -153954 -78627 67019 -88797 20756 96466 -546194 262729 -92219 153546 -365664
9587 81679 -98120 99566 -152599 -76711 -424432 -242286 -141734 -375062 -86648 92669 -65844
9575 -167219 -202220 -233623 -127821 405401 159225 70013 18402 -126645 -99456 -417900 -10793
9563 46119 -95691 133918 81195 -384632 142430 -18279 -390873 -8197 -256690 208209 47126
9551f8373j23537L5544k50833A89704f6231j43896H2909J31766D1655b3325k19758
9540b43083K419A67929k4622J40353b4908N450A65188A1818J53351d48405c9588
9528b95741h892l05051A15296K5712E5783h2905C67690A58218f1760A85872a5955
9516F2283a41185o5282J2651B9908a25276L2981B74000b70834a12160b8945p871
9505c6816k1202J4842A47396l2660b24159F6237N538a15373a3069l4572j5194
9494f2835p6635D1250K13647A23549b83182j42188i09A552b50596A58384J48704
9483C07088b10229B77126b30565n1596B29236G7151L7197N0574a01286A69057
9472a5119m836j02902B17196H2972b2400i292j66544A44737b79122a3216I2735
$$ plain form
9551 -68373 -191910 -156366 -407199 189704 -66231 -210127 82909 214675 41655 -23325 -243083
9540 -243083 -240664 167929 143307 283660 -24908 -19458 165188 11818 165169 -448405 -39588
9528 -295741 -8892 -313943 115296 141008 55783 -82905 367690 158218 -61760 185872 -15955
9516 62283 -141185 -206467 -193816 29908 -125276 -92295 274000 -270834 -112160 -28945 -36816
9505 -36816 -58018 -43176 147396 114736 -224159 66237 71775 -115373 -13069 -47641 -62835
9494 -62835 -139470 41250 254897 123549 -283182 -425370 -909 1552 -250596 158384 307088
9483 307088 -210229 277126 -230565 -282161 229236 77151 114348 164922 -101286 169057
9472 -15119 -19955 -122857 217196 82972 -22400 -9292 -175836 144737 -279122 -13216 92735
9460G3441P301i8501m8949M963E9801A885L5814B037c38558B1694b15140C39396
9447a95095O8176D799a61012H2356M6263d0586j05172E2964c9665m0315C8978
9435A21742J03815B9129a35575f7424F0748h7616L2201j97756a13572l07442f5787
9423A1048K6323b72483O4693A55838a6733I519c41943D0654O2239O7350a93362
9411c41707A76699a6330A06425a28512l795E5008b92252A93849h9277L8008A64153
9399E3323b55590q0763A13845j5009C3884g7841j07789O2963A90455c12898G0841
9387a25610J1154B53473c4134F356J47758l3398b20571Q9314p2373j45850J34737
9376b14743D46772b57689k724J12077B05887b71936B9687c49128J22963G5824
$$ plain form
9460 73441 80742 -98501 -147450 -142487 59801 1885 37699 2037 -338558 21694 -215140 339396
9447 -195095 -126919 4799 -161012 82356 128619 -40586 -145758 52964 -39665 -79980 38978
9435 121742 225557 29129 -135575 -67424 60748 -87616 -55415 -253171 -113572 -421014 -65787
9423 11048 37371 -272483 -207790 155838 -16733 9519 -341943 40654 102893 170243 -193362
9411 -341707 176699 -16330 106425 -128512 -132307 55008 -292252 193849 -89277 -51269 164153
9399 53323 -255590 -336353 113845 98836 33884 -77841 -185630 -122667 190455 -312898 70841
9387 -125610 -114456 253473 -34134 6356 154114 120716 -220571 -131257 -203630 -349480 -214743
9376 -214743 446772 -257689 -260413 -148336 205887 -271936 29687 -349128 -226165 75824
9365g5626a5005j30524D8409G615K26477a54742j2235O7439D7836K4734a90718
9353i1702A41872J43802b64879j29496J94335f8076I2613J79285B4468d42642
9342c55193C15455g8673j2475I7341A1822a09985K2362j61981e9452G3327L85137
9331D58464a88472J3146A47477c79285H5212c23664J54051j3600g7753m9370N5582
9320g1541j14381h4467b5456j78519p4353g6227n1049e1192F8827b74282q4656
9309c58938C522b97880h7830j06570A94598C2075d1575A34294f0951o5214I4177
9297c48266a01235D25834c37180d7664J4668I3541J30675f440B31618b10999F5253
9285C8883J49899d26332d5681j47885i4425a7808j82518l623l2897Q6937A46606
$$ plain form
9365 -75626 -15005 -145529 48409 7615 234092 -154742 -166977 -99538 47836 72570 -190718
9353 -91702 141872 285674 -264879 -394375 -200040 -68076 92613 271898 24468 -442642
9342 -355193 315455 -78673 -91148 97341 11822 -109985 -87623 -249604 -59452 73327 458464
9331 458464 -188472 -175326 147477 -379285 85212 -323664 -169613 -183213 -77753 -127123 -71541
9320 -71541 -185922 -84467 -25456 -203975 -278328 -76227 -127276 -51192 68827 -274282 -358938
9309 -358938 3522 -297880 -87830 -194400 194598 32075 -41575 134294 -60951 -126165 94177
9297 -348266 -101235 425834 -337180 -47664 -32996 93541 224216 -6440 231618 -210999 65253
9285 38883 188782 -426332 -45681 -193566 -94425 -17808 -200326 -203949 -236846 -149909 146606
9273E5540a18466j21875E8758a73720B47585b93898a20730H5739a01629b6451
9262i1859k22582a03348H2898O0403b59762D911K22764d90819A17074d12682H9470
9250c29478a37775e5281j14122n2557k033A40535a04353C59257j14830d22637
9239a91713q9233d6337J1587B21763A2573a31613B69098a16921n7771B69962i4175
9227a48005l6200r7501Q8785N0085l5498P4147I1339a76788k2596A15578M6738
9216A62316D7419J14414p6648a83199A18290f6646d767E7646K2468b38936g6596
9204B9660d9457j93814F9310i2356H6700a12643B9070J19008b45735n198m1082
9193b92015a10658j72361K0775f9500B66281b30637B11061a39197K3318L2868
$$ plain form
9273 55540 -118466 -240341 58758 -173720 247585 -293898 -120730 85739 -101629 -26451
9262 -91859 -314441 -103348 82898 143301 -259762 4911 227675 -490819 117074 -412682 89470
9250 -329478 -137775 -55281 -169403 -221960 -223993 140535 -104353 359257 244427 -422637
9239 -191713 -280946 -46337 -34750 221763 12573 -131613 269098 -116921 -174692 269962 -94175
9227 -148005 -184205 -281706 -192921 -142836 -178334 -104187 91339 -176788 -199384 115578 162316
9216 162316 47419 161833 85185 -183199 118290 -66646 -4767 57646 80114 -238936 -76596
9204 29660 -49457 -243271 69310 -92356 86700 -112643 29070 148078 -245735 -250933 -292015
9193 -292015 -110658 -283019 -262244 -69500 266281 -230637 211061 -139197 -115879 -83011
9183h3011K072j1246j96893B89664A6046a35025H0572f9087i394k07239c0147
9171C7642o655d37602a5560l05576J40577J3121D3087j5244J17727i1366j5238
9160a06604B06760b07787A17908m3211C2756j0961F576c11395a40651k70507E984
9148b59697K5964A70122b59477l4083I6769R6741G6066J1015a90217M2936k9480
9137a76761A64532G0351e1628A06583b11363A58478G4646f3036C803b568k66378
9126b68946f0600k8736j36009j06311B00504a94661Q3429F5158g9731A9431K38151
9115B57582F8555P0625c16440j60121a67754j59573a61250E6368b41110C7715
9104d2224j47757A98647L3205i0470O467B35305h6952b5710B587b09250H2943
$$ plain form
9183 -83011 -80939 -92185 -289078 289664 16046 -135025 80572 -69087 -9394 -216633 -30147
9171 37642 30987 -437602 -15560 -321136 -180559 -167438 43087 27843 145570 -91366 -106604
9160 -106604 206760 -207787 117908 74697 32756 21795 6576 -311395 -140651 -411158 5984
9148 -259697 -233733 170122 -259477 -293560 96769 193510 76066 87081 -190217 -147281 -176761
9137 -176761 164532 70351 -51628 106583 -211363 158478 74646 -63036 3803 -2568 -268946
9126 -268946 -60600 -89336 -225345 -331656 200504 -194661 -111232 65158 -79731 19431 257582
9115 257582 68555 139180 -316440 -476561 -167754 -327327 -161250 56368 -241110 37715
9104 -42224 -189981 198647 231852 -90470 -84003 235305 -86952 -25710 2587 -209250 82943
9092i9336B974M0086c8036B62199n8932a33595D092L1656a66763Q1901b5889k61844
9080b87733K9080D1668b04195j73420a29366i721G9471d6703A09043a35003A75718
9068a69558D9269J83427a48111d3800k0826E7669K4468a71215p3916A56893C0997
9056a66788A37147c70307A00965M9163a84376j3550i7215B03929l7478a12837
9045D54394a7024D8941a23340K5988F5796a06999A38846h6432k15282J11411k31730
9034d22033A35072A9334J6423L5853a76521I4806c7052A26878a0514r9575j86992
9023b97081i9306k18942J18341j90427A24131a07530M1185B90790A29659m8550
9013H1109b96043A01533b33088A20100A2037b87842c7129k55372A27029M3710
$$ plain form
9092 -99336 2974 43060 -38036 262199 203267 -133595 4092 35748 -166763 -84862 -25889 -287733
9080 -287733 -258653 41668 -204195 -377615 -129366 -9721 79471 -46703 109043 -135003 175718
9068 -169558 49269 232696 -148111 -43800 -64626 57669 82137 -171215 -245131 156893 30997
9056 -166788 137147 -370307 100965 150128 -184376 -197926 -97215 203929 166451 -112837
9045 454394 -17024 48941 -123340 -97352 65796 -106999 138846 -86432 -301714 -190303 -422033
9034 -422033 135072 19334 35757 71610 -176521 94806 -37052 126878 -10514 -110089 -297081
9023 -297081 -99306 -318248 -199907 -390334 124131 -107530 -66345 290790 129659 81109
9013 81109 -296043 101533 -233088 120100 12037 -287842 -37129 -292501 127029 170739
9003A70739a13758A45362d24325I2035l2534R4550d2516m2107C5261b15441F7875
8991a8655I6606O2526J19772A08192c90732M5073B19436c4555A19970a34445O3584
8980g0861F9095a44064l472H0907a85615A2205K04939F1238a04308I717K75498
8969B85215a79635b0462A57369d8811j09397n0406A20921b11510P5005k5330j60917
8958c22752Q4883j2967K125N1070j51629g8186j38371H5210J26237a05082p1558
8947a76640F0251k9024a33242d9272k75042B3563R3192J65527b08338B90409A06727
8935b27796B44117P932H0905j5135J50684b32238E1583L08183F8730L71652O96235
8924A136617K83089K685606J2280013k819391C242222H30794B63643q3148K75810
$$ plain form
9003 170739 -113758 145362 -424325 92035 59501 154051 -42516 -84623 35261 -215441 67875
8991 -18655 96606 159132 278904 108192 -390732 -345659 219436 -34555 119970 -134445 -70861
8980 -70861 69095 -144064 -147536 80907 -185615 12205 217144 61238 -104308 9717 285215
8969 285215 -179635 -20462 157369 -48811 -158208 -208614 120921 -211510 -136505 -161835 -322752
8958 -322752 -237869 -250836 -248711 -197641 -349270 -78186 -216557 85210 211447 -105082 -176640
8947 -176640 60251 31227 -133242 -49272 -324314 23563 116755 282282 -208338 290409 106727
8935 -227796 244117 252049 80905 65770 216454 -232238 51583 359766 68730 440382 1136617
8924 1136617 1419706 4105312 16385325 13565934 3242222 830794 263643 180495 456305
8915D56305j65365a88016A45223e08528A28945J06342g1571F19032B18678a74659
8904A8714h9257q9486I3580d0143o5849e1825j40060H7834b7651E2977J17349
8893A70326a6234C1057a23436H1145a00519l00455A20576a79997l9512D1065b28681
8881b92768J07024k66512i5393C4318P5829a5979j11879I1283J80261B713c59879
8869a96200B0541P2970J9140f6642F4276e4183B9488h6175I5500R3581c84459
$$ plain form
8915 456305 290940 -188016 145223 -508528 128945 235287 -71571 619032 218678 -174659
8904 18714 -89257 -178743 93580 -40143 -105992 -51825 -191885 87834 -27651 52977 170326
8893 170326 -16234 31057 -123436 81145 -100519 -400974 120576 -179997 -219509 41065 -228681
8881 -292768 -185744 -452256 -95393 34318 110147 -15979 -127858 91283 271544 2713 -359879
8869 -196200 20541 93511 112651 -66642 64276 -54183 29488 -86175 95500 189081 -384459
$$ [...]
##END NTUPLES=NMR SPECTRUM
##END=
