##TITLE=AC1477_ZPERVRI303_8100998_XyNB9lbytl
##JCAMPDX= 6.0         $$ Bruker NMR JCAMP-DX V2.0
##DATA TYPE= NMR SPECTRUM
##DATA CLASS= NTUPLES
##ORIGIN= BRUKER
##OWNER= Administrator
$$ 1.72 TOPSPIN		Version 2.1
$$ 2013-08-16 21:32:42.913 -0700  Administrator@X
$$ Compression mode = diff/dup
##.OBSERVE FREQUENCY= 400.02188249412
##.OBSERVE NUCLEUS= ^1H
##.ACQUISITION MODE= SIMULTANEOUS (DQD)
##.ACQUISITION SCHEME= undefined
##.AVERAGES= 64
##.DIGITISER RES= 22
##SPECTROMETER/DATA SYSTEM= spect
##.PULSE SEQUENCE= noesygpps1d.comp
##.SOLVENT NAME= COFFEE_meoh
##.SHIFT REFERENCE= INTERNAL, COFFEE_meoh, 1, 14.9608
##AUDIT TRAIL= $$ (NUMBER, WHEN, WHO, WHERE, PROCESS, VERSION, WHAT)
$$ ##TITLE= Audit trail, TOPSPIN		Version 2.1
$$ ##JCAMPDX= 5.01
$$ ##ORIGIN= Bruker BioSpin GmbH
$$ ##OWNER= Administrator
$$ $$ E:\/data/COFFEE/nmr/AC1477_ZPERVRI303_8100998_XyNB9lbytl/32/pdata/1/auditp.txt
$$ ##AUDIT TRAIL=  $$ (NUMBER, WHEN, WHO, WHERE, PROCESS, VERSION, WHAT)
(   1,<2013-08-16 21:32:38.100 -0700>,<Administrator>,<X>,<go>,<TOPSPIN 2.1>,
      <created by zg
	started at 2013-08-16 21:21:07.460 -0700,
	POWCHK enabled, PULCHK disabled,
       configuration hash MD5:
       C8 4E 4E 5D D3 5C D8 9E 9F 52 82 E0 59 8A DE 15
       data hash MD5: 64K
       AB 5F C5 4B 4C 5B A9 4A 2C 0C 6C D4 93 8D 14 F0>)
(   2,<2013-08-16 21:32:40.991 -0700>,<Administrator>,<X>,<proc1d>,<TOPSPIN 2.1>,
      <Start of raw data processing
       efp LB = 0.3 FT_mod = 6 PKNL = 1 PHC0 = 0 PHC1 = 0 SI = 128K 
       data hash MD5: 128K
       33 34 52 A3 22 72 B8 68 48 46 94 4A E8 F9 E9 AF>)
(   3,<2013-08-16 21:32:41.975 -0700>,<Administrator>,<X>,<proc1d>,<TOPSPIN 2.1>,
      <pk PHC0 = -80.16174 PHC1 = 0 
       data hash MD5: 128K
       99 3F 45 79 1D 46 BD 2C B4 96 22 4D F3 62 62 B0>)
(   4,<2013-08-16 21:32:42.382 -0700>,<Administrator>,<X>,<proc1d>,<TOPSPIN 2.1>,
      <abs ABSG = 1 
       data hash MD5: 128K
       8E 45 DE B1 05 A2 18 9F FD 04 59 AB 30 74 DE 08>)
(   5,<2013-08-16 21:32:42.507 -0700>,<Administrator>,<X>,<proc1d>,<TOPSPIN 2.1>,
      <abs ABSG = 2 
       data hash MD5: 128K
       2C 7B 98 D8 83 DC BF B9 07 C5 22 A9 31 8D B9 95>)
(   6,<2013-08-16 21:32:42.600 -0700>,<Administrator>,<X>,<proc1d>,<TOPSPIN 2.1>,
      <abs ABSG = 3 
       data hash MD5: 128K
       AF 47 7A E7 95 FB 3E 4A 80 F4 DD 75 2A 90 57 B1>)
(   7,<2013-08-16 21:32:42.678 -0700>,<Administrator>,<X>,<proc1d>,<TOPSPIN 2.1>,
      <abs ABSG = 4 
       data hash MD5: 128K
       C8 07 E2 77 4E 8B 42 1A A4 BD 55 66 BA 1D 10 70>)
(   8,<2013-08-16 21:32:42.741 -0700>,<Administrator>,<X>,<proc1d>,<TOPSPIN 2.1>,
      <abs ABSG = 5 
       data hash MD5: 128K
       19 C8 5D 61 B8 B2 B7 08 CE 78 D5 50 E8 F1 E4 D3>)
$$ ##END=
$$ 
$$ $$ hash MD5
$$ $$ 81 C2 7D EF 33 85 AF 9F 94 C0 60 8B 07 F5 74 F9
##$RELAX= 
##$RELAX= 
##$RELAX= 
##$RELAX= 
##$RELAX= 
##$RELAX= 
##$RELAX= 
##$RELAX= 
$$ Bruker specific parameters
$$ --------------------------
##$DU= <E:\>
##$EXPNO= 32
$$ [...]
150 150 150 150 150 150 150 150
##$TP07= 0
##$TPNAME0= <>
##$TPNAME1= <>
##$TPNAME2= <>
##$TPNAME3= <>
##$TPNAME4= <>
##$TPNAME5= <>
##$TPNAME6= <>
##$TPNAME7= <>
##$TPOAL= (0..7)
0.5 0.5 0.5 0.5 0.5 0.5 0.5 0.5
##$TPOFFS= (0..7)
0 0 0 0 0 0 0 0
##$TUNHIN= 0
##$TUNHOUT= 0
##$TUNXOUT= 0
##$USERA1= <user>
##$USERA2= <user>
##$USERA3= <user>
##$USERA4= <user>
##$USERA5= <user>
##$V9= 5
##$VALIST= <valist>
##$VCLIST= <CCCCCCCCCCCCCCC>
##$VD= 0
##$VDLIST= <DDDDDDDDDDDDDDD>
##$VPLIST= <PPPPPPPPPPPPPPP>
##$VTLIST= <TTTTTTTTTTTTTTT>
##$WBST= 2048
##$WBSW= 25
##$XGAIN= (0..3)
0 0 0 0
##$XL= 0
##$YL= 0
##$YMAX_a= 7069774
##$YMIN_a= -13281021
##$ZGOPTNS= <>
##$ZL1= 120
##$ZL2= 120
##$ZL3= 120
##$ZL4= 120
##$ABSF1= 14.9608
##$ABSF2= -5.597382
##$ABSG= 5
##$ABSL= 3
##$ALPHA= 0
##$AQORDER= 0
##$ASSFAC= 0
##$ASSFACI= 0
##$ASSFACX= 0
##$ASSWID= 0
##$AUNMP= <proc_prof1d_extract.lims>
##$AXLEFT= 0
##$AXNAME= <>
##$AXNUC= <1H>
##$AXRIGHT= 0
##$AXTYPE= 0
##$AXUNIT= <>
##$AZFE= 0.1
##$AZFW= 0.1
##$BCFW= 0
##$BC_mod= 0
##$BYTORDP= 0
##$COROFFS= 0
##$CY= 15
##$DATMOD= 1
##$DC= 0
##$DFILT= <>
##$DTYPP= 0
##$F1P= 0
##$F2P= 0
##$FCOR= 0.5
##$FTSIZE= 131072
##$FT_mod= 6
##$GAMMA= 0
##$GB= 0
##$INTBC= 1
##$INTSCL= 1
##$ISEN= 128
##$LB= 0.3
##$LEV0= 0
##$LPBIN= 0
##$MAXI= 10000
##$MC2= 0
##$MEAN= 0
##$ME_mod= 0
##$MI= 0
##$NCOEF= 0
##$NC_proc= -2
##$NLEV= 6
##$NOISF1= 0
##$NOISF2= 0
##$NSP= 0
##$NTH_PI= 0
##$NZP= 0
##$OFFSET= 14.9608
##$PC= 1
##$PHC0= -80.16174
##$PHC1= 0
##$PH_mod= 1
##$PKNL= yes
##$PPARMOD= 0
##$PPDIAG= 0
##$PPIPTYP= 0
##$PPMPNUM= 2147483647
##$PPRESOL= 1
##$PSCAL= 4
##$PSIGN= 0
##$PYNMP= <proc.py>
##$REVERSE= no
##$SF= 400.020009714671
##$SI= 131072
##$SIGF1= 0
##$SIGF2= 0
##$SINO= 400
##$SIOLD= 131072
##$SPECTYP= <>
##$SREGLST= <1H.CDCl3>
##$SSB= 0
##$STSI= 131072
##$STSR= 0
##$SW_p= 8223.68421052631
##$SYMM= 0
##$S_DEV= 0
##$TDeff= 65536
##$TDoff= 0
##$TI= <>
##$TILT= no
##$TM1= 0
##$TM2= 0
##$TOPLEV= 0
##$USERP1= <user>
##$USERP2= <user>
##$USERP3= <user>
##$USERP4= <user>
##$USERP5= <user>
##$WDW= 1
##$XDIM= 131072
##$YMAX_p= 457809815
##$YMIN_p= -15477
##$CURPLOT= <Network HP LaserJet P1505>
##$CURPRIN= <$Network HP LaserJet P1505>
##$DFORMAT= <normdp>
##$LAYOUT= <+/1D_H.xwp>
##$LFORMAT= <normlp>
##$PFORMAT= <normpl>
##$SURQMSG= 1
$$ End of Bruker specific parameters
$$ ---------------------------------
##NTUPLES= NMR SPECTRUM
##VAR_NAME=  FREQUENCY,     SPECTRUM/REAL,   SPECTRUM/IMAG
##SYMBOL=    X,             R,               I
##VAR_TYPE=  INDEPENDENT,   DEPENDENT,       DEPENDENT
##VAR_FORM=  AFFN,          ASDF,            ASDF
##VAR_DIM=   131072,        131072,          131072
##UNITS=     HZ,            ARBITRARY UNITS, ARBITRARY UNITS
##FACTOR=    0.0627417313425164, 1,          1
##FIRST=     8223.62146879497, 697,          -70016
##LAST=      0,             2715,            -70413
##MIN=       0,             -15477,          0
##MAX=       8223.62146879497, 457809815,    0
$$ Real data points
##PAGE= N=1
##DATA TABLE= (X++(R..R)), XYDATA
$$ [...]
63881F31445P916J0129J2923J5695J8177K0970K4573K8605L2541L6511M0814M5054
63869I25353M8474N0897N2864N4983N7385N9607O0815O0407N8580N6064N3257
63858A538686M9916M5732M0616L4411K6952J8686J0516K787n016j3200k1186k8404
63846A700496l5152m1857m8037n2805n6116n8745o1157o3075o4064o3905o2518
63835A093065o0113n7361n4861n2452m9591m6276m2970l9749l6294l2823l0097
63824E90478k8267k6405k3671k0422j7681j5937j4879j3950j2724j1017r088p465
63812C88972o268m959l188j484o48p05j050j457k288l779n704p771r757j1125
63798C28789j1207j0062q646p765p181o229m912l925l671l808l755l335k739k202
$$ plain form
63881 631445 639361 649490 662413 678108 696285 717255 741828 770433 802974 839485 880299 925353
63869 925353 973827 1024724 1077588 1132571 1189956 1249563 1310378 1370785 1429365 1485429 1538686
63858 1538686 1588602 1634334 1674950 1709361 1736313 1754999 1765515 1768302 1763286 1750086 1728900 1700496
63846 1700496 1665344 1623487 1575450 1522645 1466529 1407784 1346627 1283552 1219488 1155583 1093065
63835 1093065 1032952 975591 920730 868278 818687 772411 729441 689692 653398 620575 590478
63824 590478 562211 535806 512135 491713 474032 458095 443216 429266 416542 405525 396437 388972
63812 388972 382704 377745 374557 373073 372425 371720 370670 369213 366925 363146 357442 349671 339914 328789
63798 328789 317582 307520 298874 291109 283928 277699 272787 268862 265191 261383 257628 254293 251554 249352
63784B49352j842j702j755j880j847j520j098j069j655k347k335j515o59m16n48
63769B27164n32m64q28j469j623j018l08j39l39m70o06j028j404j038P2J075J299
63752B18344R83P06O00M93M69P16J023R41M74J06J19K88M49P87J315J556J185
63735B30554P11Q70J611K209K356K502K980L452L470L196L139L508M134M882N752
63720B75326O686P438P676P128N886M539L751L521L140K007K01j806l575m684
63706C17234m783m105l541l701m201m293l934l599l270k383q56M72Q32N46P19
63691B81137K042M013N382N335M270L325L150L368L302K799K119J423Q66P44J089
63676C24364J277P09l41j058j089o05L64J863L359M033L884L760M074M214L568
$$ plain form
63784 249352 247510 245808 244053 242173 240326 238806 237708 236639 234984 232637 230302 228787 228128 227712 227164
63769 227164 226632 226168 225340 223871 222248 221230 220922 220783 220444 219974 219368 218340 216936 215898 215970 217045 218344
63752 218344 219327 220033 220633 221126 221595 222311 223334 224275 224749 224855 224974 225262 225711 226498 227813 229369 230554
63735 230554 231265 232135 233746 235955 238311 240813 243793 247245 250715 253911 257050 260558 264692 269574 275326
63720 275326 282012 289450 297126 304254 310140 314679 318430 321951 325091 327098 327299 325493 321918 317234
63706 317234 312451 308346 304805 301104 296903 292610 288676 285077 281807 279424 278568 279040 279872 280418 281137
63691 281137 283179 287192 292574 297909 302179 305504 308654 312022 315324 318123 320242 321665 322531 323275 324364
63676 324364 325641 326350 326009 324951 323862 323257 323621 325484 328843 332876 336760 340520 344594 348808 352376
63661C52376K363J146J0j149k177k958l782m910o072o817p033o784n972m631l316
63646C00294k633k514k379j879j222p24l79J34J099K318L095K963K422K524L600
63631C06719M879N554N734O008O604P385Q195Q751Q635P947P610Q423J0059J1645
63617D14148J2981J4486J6157J7499J8528J9909K1933K4060K5843K7594K9709
63606F42847L1847L3465L4604L5442L5202L2408K6539J8906J1469N163k18m773
63594I02901p894r088q800p998p293o891p241r033j2429j6721k0919k4423k7014
63581G37157k8576k9069k8562k7142k4926k2216j9407j6666j3954j1337q975o739
63569D99588m246j451J167L112M312N016N616O603Q099R424R729R285R363J0549
$$ plain form
63661 352376 354739 355885 355895 354746 352569 349611 345829 340919 334847 328030 320997 314213 308241 303610 300294
63646 300294 297661 295147 292768 290889 289667 288943 288564 288698 289797 292115 295210 298173 300595 303119 306719
63631 306719 311598 317152 322886 328894 335498 342883 351078 359829 368464 376411 384021 392444 402503 414148
63617 414148 427129 441615 457772 475271 493799 513708 535641 559701 585544 613138 642847
63606 642847 674694 708159 742763 778205 813407 845815 872354 891260 902729 907892 907674 902901
63594 902901 895007 885919 877119 869121 861828 854937 847696 838663 826234 809513 788594 764171 737157
63581 737157 708581 679512 650950 623808 598882 576666 557259 540593 526639 515302 506327 499588
63569 499588 495342 493891 495058 498170 502482 507498 513114 519717 527816 537240 546969 556254 565617 576166
63555E76166J2001J2937J3946J6021J9024K2149K5446K9666L4932M0819M7629
63544H50736N5860O3749O6721O0688M5782K6295P333p937j8488k4403k6285k5130
63532A074921k1979j7549j2388p440m186l839o368j0551j5223k0213k5791l1455
63520H97939l5760l7605l7340l6389l5832l5529l4584l2503k9711k6943k4417
63509E31326k1863j9181j6624j4347j2235j0366r081q355p571o342n156m684m752
63496C90769m592l864k969k387k259k496k869k959k429j385j90Q77J571J601J167
63481C67586J199K333L874M552M256M120M843N789O157O065N897N335L811J595
63467D27412m50j983l398m881n940o095n509m709l954l232k688k574k754k668
$$ plain form
63555 576166 588167 601104 615050 631071 650095 672244 697690 727356 762288 803107 850736
63544 850736 906596 970345 1037066 1097754 1143536 1169831 1177164 1169227 1150739 1126336 1100051 1074921
63532 1074921 1052942 1035393 1023005 1015565 1011379 1007540 1001172 990621 975398 955185 929394 897939
63520 897939 862179 824574 787234 750845 715013 679484 644900 612397 582686 555743 531326
63509 531326 509463 490282 473658 459311 447076 436710 427629 419274 411703 405361 400205 395521 390769
63496 390769 386177 382313 379344 376957 374698 372202 369333 366374 363945 362560 362370 363247 364818 366419 367586
63481 367586 368785 371118 374992 379544 383800 387920 392763 398552 404709 410774 416671 422006 425817 427412
63467 427412 426962 424979 421581 416700 410760 404665 399156 394447 390493 387261 384573 381999 379245 376577
63453C76577k026j266r36q11j25J332K946M229N432O853Q150Q947R712J1252J3631
63438D43897J6311J9262K3187K8674L5802M4399N3490O0233O0687N2810L8519
63427H77271K2235P594m014j2349j7054j7775j4891r468k570N115J3019K0493
63415H67606K7077L2775L7627M0953M1456L8408L2414K4654J5821O391k385q754
63403A154043j1982j2872j2568j1530j0098r279j0174j2956j7084k2229k8250
63392I95021l4265l8669m0461m0159l9007l7612l5689l2966k9752k6589k3679
63381F16173k0939j8304j5743j3097j0262p428m847k388K17K720M510N533O483
63368E42628P798R136J0246J1692J3929J6320J8010J9432K1805K5254K8628L1415
$$ plain form
63453 376577 374551 373285 372349 371538 371413 372745 375691 379920 385352 392205 400355 409302 419014 430266 443897
63438 443897 460208 479470 502657 531331 567133 611532 665022 725255 785942 838752 877271
63427 877271 899506 907100 903086 890737 873683 855908 841017 831549 828979 834094 847113 867606
63415 867606 894683 927458 965085 1006038 1047494 1085902 1118316 1142970 1158791 1165182 1162797 1154043
63403 1154043 1142061 1129189 1116621 1105091 1094993 1085714 1075540 1062584 1045500 1023271 995021
63392 995021 960756 922087 881626 841467 802460 764848 729159 696193 666441 639852 616173
63381 616173 595234 576930 561187 548090 537828 530400 525553 523165 523382 526102 530612 536145 542628
63368 542628 550426 559562 569808 581500 595429 611749 629759 649191 670996 696250 724878 756293
63356G56293L4513L8546M2418M4512M4641M3816M2301L8932L2548K3550J3761
63345A155831M987k077p660j1877j4157j3993j2005r811q755r192j1068j4505
63333A045718j9427k5021l0136l4059l6550l7448l6716l4700l1927k8582k4519
63322G06633j9623j3757o468K508J1775J7618J5872N426r968k4028l2575l5726
63310F17687l5757l3914l0188k5339k1171j8445j5943j2472q863o908o947p610
63298C94130p718p337o926o405n497m402l566l100k722k260j908k004k604l353
63284C34328l818l893l762l509k977k132j313q95q74q81n74J09Q78J235R34L71
63268C13227K20N74P73L54k31k19M07R44R60P92R67J537K172K644K999L300L480
$$ plain form
63356 756293 790806 829352 871770 916282 960923 1004739 1047040 1085972 1118520 1142070 1155831
63345 1155831 1160818 1158741 1151081 1139204 1125047 1111054 1099049 1089238 1080483 1071291 1060223 1045718
63333 1045718 1026291 1001270 971134 937075 900525 863077 826361 791661 759734 731152 706633
63322 706633 687010 673253 666785 669293 681068 698686 714558 719984 710016 685988 653413 617687
63310 617687 581930 548016 517828 492489 471318 452873 436930 424458 415595 408687 401740 394130
63298 394130 386412 379075 372149 365744 360247 355845 352279 349179 346457 344197 342289 340285 337681 334328
63284 334328 330510 326617 322855 319346 316369 314237 312924 312029 311155 310274 309700 309809 310687 311922 312856 313227
63268 313227 313447 314021 314794 315148 314917 314698 315105 316049 317009 317801 318768 320305 322477 325121 328120 331420 334900
63251C34900L509L629M155N054N891O321O503O827P442Q211R048R952J0897J1977
63237D34316J3492J5502J7419J8542J8985J9491K0404K1304K1832K2205K2732
63226F46224K3291K3552K3337K2678K1962K1974K3161K4703K5171K4394K3816
63215I04263K4481K5463K5038K2785J9561J5849J1152M994k317j0008j7285k3438
63203A000538k8046l1287l3585l4948l4963l3544l1275k8880k6525k3777k0190
63192F73518j5935j1781q284n097j500K405N713Q107J0435J3387J6287J8009J8656
63179G23920J9407K0872K2451K3351K3466K3086K2382K1451K0470J9603J8937
63168I59396J8483J7938J6625J4076J0567O611K000l967j1255j8649k4792k9291
$$ plain form
63251 334900 338409 342038 346193 351247 357138 363459 369962 376789 384231 392442 401490 411442 422339 434316
63237 434316 447808 463310 480729 499271 518256 537747 558151 579455 601287 623492 646224
63226 646224 669515 693067 716404 739082 761044 783018 806179 830882 856053 880447 904263
63215 904263 928744 954207 979245 1002030 1021591 1037440 1048592 1053586 1051269 1041261 1023976 1000538
63203 1000538 972492 941205 907620 872672 837709 804165 772890 744010 717485 693708 673518
63192 673518 657583 645802 637518 632421 630921 633326 639039 647146 657581 670968 687255 705264 723920
63179 723920 743327 764199 786650 810001 833467 856553 878935 900386 920856 940459 959396
63168 959396 977879 995817 1012442 1026518 1037085 1043696 1045696 1041729 1030474 1011825 987033 957742
63156I57742l2593l5162l7029l8002l7957l6979l5245l2866k9966k6970k4541
63145E90432k2877k1289j8844j5532j2438j0652j0158r914q949p268n667m746
63133D42098m281l746l150k883k867k492j532n10R1L99O25N69J95O6P07J869K975
63116D28133L817M300L996K747J337Q32J357K181K714K843K551J974J646J993
63102D62421K695L087L030K785K337J595J000J077J598J950K122K438K574J913
63088D92622P74J35J02k06j010j344n94N87J411K038K783L224L010K875L797N494
63072E15698O703O875O847P588Q927R886J0024J0041J0875J2485J4003J5109J6581
63059F51642J9117K2212K4916K7214K9815L2840L5748L8399M1227M4319M7227
$$ plain form
63156 957742 925149 889987 852958 814956 776999 740020 704775 671909 641943 614973 590432
63145 590432 567555 546266 527422 511890 499452 488800 478642 468728 459779 452511 446844 442098
63133 442098 437817 434071 430921 428038 425171 422679 421147 420637 420728 421127 421752 422321 422516 422582 423289 425158 428133
63116 428133 431950 436250 440246 442993 444330 445162 446519 448700 451414 454257 456808 458782 460428 462421
63102 462421 465116 468203 471233 474018 476355 477950 478950 480027 481625 483575 485697 488135 490709 492622
63088 492622 493396 493531 493633 493427 492417 491073 490479 491066 492477 494515 497298 500522 503532 506407 510204 515698
63072 515698 522401 529276 536123 543711 552638 562524 572548 582589 593464 605949 619952 635061 651642
63059 651642 670759 692971 717887 745101 774916 807756 843504 881903 923130 967449 1014676
63048A014676M9786N2199N4282N5542N6098N6475N6415N5106N2931N1682N2456
63037A607648N4384N6084N7283N8299N8954N8892N8141N6413N2611M5900L6658
63026B201267K5639J2933j343j6114l0150m3198n5263o5408p2481p6607p8789
63015A800486p9228p7267p2844o6838n9984n2428m4451l6574k8863k0910j2718
63004A248381m903K111Q372J3917J8704K3073K7459L1521L4293L5471L5894L6538
62992A510831L7564L8547L9047L8833L8013L7113L6520L5732L3665K9746K4187
62981A899798J7245Q847q82j1427k2373l3521m4305n3779o1402o7316p1562p3693
62969A485630p3563p1888o9538o6654o2893n8229n3034m7695m2590l8158l4563
$$ plain form
63048 1014676 1064462 1116661 1170943 1226485 1282583 1339058 1395473 1450579 1503510 1555192 1607648
63037 1607648 1662032 1718116 1775399 1833698 1892652 1951544 2009685 2066098 2118709 2164609 2201267
63026 2201267 2226906 2239839 2238496 2222382 2192232 2149034 2093771 2028363 1955882 1879275 1800486
63015 1800486 1721258 1643991 1571147 1504309 1444325 1391897 1347446 1310872 1282009 1261099 1248381
63004 1248381 1243478 1245589 1253961 1267878 1286582 1309655 1337114 1368635 1402928 1438399 1474293 1510831
62992 1510831 1548395 1586942 1625989 1664822 1702835 1739948 1776468 1812200 1845865 1875611 1899798
62981 1899798 1917043 1925890 1925008 1913581 1891208 1857687 1813382 1759603 1698201 1630885 1559323 1485630
62969 1485630 1412067 1340179 1270641 1203987 1141094 1082865 1029831 982136 939546 901388 866825
62958H66825l1406k8254k5278k3027k1612k0529j9313j8104j7393j7301j7236
62947F27372j6395j4699j3030j2302j2371j2257j1406j0299r640r417r092q398
62935D88066p575o929o477o037n482m912m524m268l777k883k056j890k203k239
62921D26814j869j849k529l045k456j183m55o28r38q95r02j329j825j994k067
62906D02850k340k450j912j035o20q61j184j154r55q19o00j35L96Q30J346K045
62890C93402K493K141J133K35n0N3R4K7J18M63Q58J194J673K445L056K649R83
62873D12967r63j835j419p65p34r85q99q00j468k656l137k342j139o04o97o53
62857C91871j92K40K25j64n48n99k34K79N66O30R00J538K009J750J037P22J094
$$ plain form
62958 866825 835419 807165 781887 758860 737248 716719 697406 679302 661909 644608 627372
62947 627372 610977 596278 583248 570946 558575 546318 534912 524613 514973 505556 496464 488066
62935 488066 480491 473562 467085 461048 455566 450654 446130 441862 438085 435202 433146 431256 429053 426814
62921 426814 424945 423096 420567 417522 415066 413883 413428 412800 411862 410967 410065 408736 406911 404917 402850
62906 402850 400510 398060 396148 395113 394493 393632 392448 391294 390339 389520 388920 388785 389181 390011 391357 393402
62890 393402 395895 398036 399169 399404 399354 399407 399501 399528 399646 400109 400967 402161 403834 406279 409335 411984 412967
62873 412967 412004 410169 408750 407985 407251 406266 405367 404567 403099 400443 397306 394964 393825 393221 392524 391871
62857 391871 391679 391919 392144 391980 391432 390833 390599 390878 391444 392074 392974 394512 396521 398271 399308 400030 401124
62840D01124J462J100J87m50m12j64l17p67q16j51O80J010R15R90J411J753J757
62823D09312J764K172K818L203L100K719K478K693L298L805L832L656L849M335
62809D53034M390L784L297L705M738N557N893O152O682P522Q688J0133J1477J2314
62795E47366J2743J3237J4017J4917J5815J6883J8415K0618K3525K6876L0328
62784G54740L3994L8449M3926M9835N5596O1598O8612P6434Q3796Q9694R4166
62773A450840R7612R9908J00345R8094R2549Q3641P1948N8279M3023K6241Q360
62762B230840r597k6618m2226n6255o8454p8385q5594q9829r1353r0979q9478
62751A502072q6979q3253p8556p3703o9219o4817n9966n4621m9225m4250l9873
$$ plain form
62840 401124 402586 403686 403873 403423 403011 402847 402530 401763 400947 400796 401476 402486 403401 404391 405802 407555 409312
62823 409312 411076 413248 416066 419269 422369 425088 427566 430259 433557 437362 441194 444850 448699 453034
62809 453034 457424 461208 464505 468210 472948 478505 484398 490550 497232 504754 513442 523575 535052 547366
62795 547366 560109 573346 587363 602280 618095 634978 653393 674011 697536 724412 754740
62784 754740 788734 827183 871109 920944 976540 1038138 1106750 1183184 1266980 1356674 1450840
62773 1450840 1548452 1648360 1748705 1846799 1939348 2022989 2094937 2153216 2196239 2222480 2230840
62762 2230840 2221243 2194625 2152399 2096144 2027690 1949305 1863711 1773882 1682529 1591550 1502072
62751 1502072 1415093 1331840 1253284 1179581 1110362 1045545 985579 930958 881733 837483 797610
62740G97610l5919l2006k7953k4098k0974j8605j6425j4032j1706r982q907q011
62728E68992o897n660m628l823k836j328M69J987L019L852M615N054N144N416
62714E73376O191O987P388Q087J0183J3633J7228K0217K3026K6231K9676L3103
62702G75326L6894M1542M6797N1942N6683O1280O5964P0664P5161P9209Q2423
62691A443885Q4285Q4276Q1949P7005O9488N9766M8140L4607J9085J920j5847
62680A988559l2680m7170n8675o7484p4268p9479q3231q5389q5546q3263p8778
62669A212596p3200o7617o2230n6839n1786m7652m4240m0699l6703l2738k9129
62658F69763k5667k2316j9501j7338j5345j3294j1655j0796j0389j0008r709r528
$$ plain form
62740 797610 761691 729685 701732 677634 656660 638055 621630 607598 595892 585910 577003 568992
62728 568992 562095 556435 551807 547984 545148 543820 544289 546276 549295 553147 557762 562816 567960 573376
62714 573376 579567 586554 593942 602029 612212 625845 643073 663290 686316 712547 742223 775326
62702 775326 812220 853762 900559 952501 1009184 1070464 1136428 1207092 1282253 1361462 1443885
62691 1443885 1528170 1612446 1694395 1771400 1840888 1900654 1948794 1983401 2002486 2004406 1988559
62680 1988559 1955879 1908709 1850034 1782550 1708282 1628803 1545572 1460183 1374637 1291374 1212596
62669 1212596 1139396 1071779 1009549 952710 900924 853272 809032 768333 731630 698892 669763
62658 669763 644096 621780 602279 584941 569596 556302 544647 533851 523462 513454 503745 494217
62646D94217r088q231p419o974o424n292l982l198k899k495j758q23K36J240J538
62631D38648O50q72j914k063j792j633j660j733j577p85O29J802J801Q34N7J90
62615D30582R03J616K179K696L221L871M736N544N876N848O189P428R380J1503
62601E01572J3439J5090J6564J8216K0429K3328K6793L0692L4763L8476M1514
62590G80876M4207M6912M9021M9314M7308M3601L8737L2526K4808J6120P172j823
62578A178779j0794j9309k6919l3540l8999m2668m4182m4216m3835m3286m1995
62567G89036l9699l6838l3878l0865k7868k5274k3279k1526j9521j7237j4978
62556D98073j2850j0704q572o900o157o288o631o383n249l664k391j836j757j627
$$ plain form
62646 494217 485129 476898 469479 462505 456081 450789 446807 443609 440710 438215 436457 435634 435870 437110 438648
62631 438648 439298 438426 436512 434449 432657 431024 429364 427631 426054 425269 425898 427700 429501 430335 430392 430582
62615 430582 431485 433101 435280 437976 441197 445068 449804 455348 461224 467072 473261 480689 490069 501572
62601 501572 515011 530101 546665 564881 585310 608638 635431 666123 700886 739362 780876
62590 780876 825083 871995 921016 970330 1017638 1061239 1099976 1132502 1157310 1173430 1180602 1178779
62578 1178779 1167985 1148676 1121757 1088217 1049218 1006550 962368 918152 874317 831031 789036
62567 789036 749337 712499 678621 647756 619888 594614 571335 549809 530288 513051 498073
62556 498073 485223 474519 465947 459047 452890 446602 439971 433588 428339 424675 422284 420448 418691 417064
62542D17064j270r57q02k83J197L244M446L837K077O90L92P08J105J664K518L419
62526D39049M321N640P461R092J0122J1359J3786J6946J9401K0770K2221K4750
62514F04918K8005L1271L4681L8657M2796M6112M8114M8903M8427M6401M2863
62503A061148L8113L2066K4324J5059N250m144j2796k0622k7326l2553l6182l8105
62491A004232l8132l6432l3792l1027k8311k5416k2314j9102j5625j1653p483
62480G34945l805q32J934M833P337Q501P933O120L883J823J04j512l531o351r872
62465G51510j3502j6648j9184k1375k3347k4741k5058k4308k3145k2228k1529
62454E16445k0502j8848j6877j5007j3203j1142q840o832n575m867m020k671j182
$$ plain form
62542 417064 415794 414837 414035 413752 414949 418193 422639 426476 428553 429243 429635 430343 431448 433112 435630 439049
62526 439049 443370 449010 456471 465563 475685 487044 500830 517776 537177 557947 580168 604918
62514 604918 632923 664194 698875 737532 780328 826440 874554 923457 971884 1018285 1061148
62503 1061148 1099261 1131327 1155651 1170710 1175960 1171816 1159020 1138398 1111072 1078519 1042337 1004232
62491 1004232 966100 929668 895876 864849 836538 811122 788808 769706 754081 742428 734945
62480 734945 731140 730308 732242 737075 744412 752913 760846 766966 770849 772672 772776 771264 767733 761382 751510
62465 751510 738008 721360 702176 680801 657454 632713 607655 583347 560202 537974 516445
62454 516445 495943 477095 460218 445211 432008 420866 412026 405194 399619 394752 390732 388061 386879
62441C86879j75K55O14J319K168K648K573K212J841J388O60k96j128j507j475
62426C97976j424j735k380k933k991k556k075k105k883l972m382l391j415K05
62412C63939N06j82q04q54p10r07j432j835j709j072m05k67o36p67JJ375K434
62395C56675K740K651K630K700K775K967L240L221K692K050J834K075K405K753
62381C93408L410M436N350N637N417N492O553Q329R666R683Q859Q599R661J1359
62367D95859J2556J3068J3684J5060J7094J9373K1775K4504K7839L1925L6660
62356G29397M1697M6782N2082N7813O3416O7490O8865O7496O3974N8417N0437
62345A367866M0213K8935J7942P855j131q693j4917k0914k7949l5760m2622m7340
$$ plain form
62441 386879 386704 386959 387573 388892 391060 393708 396281 398493 400334 401722 402382 402086 400958 399451 397976
62426 397976 396552 394817 392437 389504 386513 383957 381882 379777 376894 372922 368540 365149 363734 363939
62412 363939 364445 364263 363459 362605 361895 360988 359556 357721 356012 354940 354535 354268 353632 352865 352866 354241 356675
62395 356675 359415 362066 364696 367396 370171 373138 376378 379599 382291 384341 386175 388250 390655 393408
62381 393408 396818 401254 406604 412241 417658 423150 429703 438032 447698 457381 466240 474839 484500 495859
62367 495859 508415 521483 535167 550227 567321 586694 608469 632973 660812 692737 729397
62356 729397 771094 817876 869958 927771 991187 1058677 1127542 1195038 1259012 1317429 1367866
62345 1367866 1408079 1437014 1454956 1462811 1461680 1452987 1438070 1417156 1389207 1353447 1310825 1263485
62333A263485n0429n2799n4114n3293n0233m6112m2080l8392l4826l1233k7611
62322G82363k4151k1399j9863j9384j9288j9171j9079j9001j8734j8230j7504
62311E66559j6285j4428j2649j2002j2307j2068j0346p992o430n922n638m964
62299D45528l915k696j523p14l64r8M10Q60P71K43j72j51L33J293K554L519L748
62282D49626L589L668L940L948L790L995M408M144L056K337L062M656N564N307
62268E05090N105O306Q701J0895J2104J3141J5371J9097K3423K7550L1580L5946
62256G14309M0663M5637N1103N7125O2898O7284O9923P1078P0345O6346N8205
62245A374916M6881L4477K2390J0669q31j1360j9852k6370l2356l9119m6482n3196
$$ plain form
62333 1263485 1213056 1160257 1106143 1052850 1002617 956505 914425 876033 841207 809974 782363
62322 782363 758212 736813 716950 697566 678278 659107 640028 621027 602293 584063 566559
62311 566559 550274 535846 523197 511195 498888 486820 476474 468482 462052 456130 450492 445528
62299 445528 441613 438917 437394 436680 436316 436218 436628 437488 438259 438502 438330 438179 438512 439805 442359 445878 449626
62282 449626 453215 456883 460823 464771 468561 472556 476964 481108 484164 486501 489563 494219 499783 505090
62268 505090 510195 516501 525202 536097 548201 561342 576713 595810 619233 646783 678363 714309
62256 714309 754972 800609 851712 908837 971735 1039019 1108942 1180020 1250365 1316711 1374916
62245 1374916 1421797 1456274 1478664 1489333 1488502 1477142 1457290 1430920 1398564 1359445 1312963 1259767
62233A259767n8325o1652o2981o2017n9090n5260n1306m7164m2725l8502l4923
62222F85822l1569k7815k3864k0440j7730j5374j3297j1824j0969j0227r204q009
62210D85500o944o191n720n279m588l839l642m103m322l393j570J98J495K459
62196D40061L028L098L298M442O229P513Q053Q847J0399J1778J2087J1926J2454
62183E43213J3643J4389J4126J3416J2910J2381J1077Q754O084L998K752J971
62171F58714J618K457N049Q764J2573J6509K1415K7296L3034L7934M2453M6901
62159I14717N0402N1808N0816M7474M1455L2845K3109J4175O724J64n963j1520
62147A216206j6616k1931k7869l3943l9246m3099m5109m5054m3010l9482l5194
$$ plain form
62233 1259767 1201442 1139790 1076809 1014792 955702 900442 849136 801972 759247 720745 685822
62222 685822 654253 626438 602574 582134 564404 549030 535733 523909 512940 502713 493509 485500
62210 485500 478556 472365 466645 461366 456778 452939 449297 445194 440872 437479 435909 436107 437602 440061
62196 440061 443089 446187 449485 453927 460156 467669 475722 484569 494968 506746 518833 530759 543213
62183 543213 556856 571245 585371 598787 611697 624078 635155 643909 649993 653991 656743 658714
62171 658714 660332 662789 667838 676602 689175 705684 727099 754395 787429 825363 867816 914717
62159 914717 965119 1016927 1067743 1115217 1156672 1189517 1212626 1226801 1233525 1233689 1227726 1216206
62147 1216206 1199590 1177659 1149790 1115847 1076601 1033502 988393 943339 900329 860847 825653
62136H25653l0794k6647k2734j8823j4863j1095p665m379j064K061M678O904R236
62123G10468J2055J5373J8897K2100K4386K5362K4871K2727J8928J4340J0713
62112I20220R379J0153J1765J3041J3230J1709Q315L877k46l339n479o698o714
62099I79213n602m006k327l19K115M241N185N004M537M322M119L503K507J569
62085A004061J089J145J505J867K243L134N106Q147J1542J4582J7218J9871K2678
62072A114188K5105K6322K5835K3907K1540J9920J9454J9454J9142J8862J9667
62061A353396K1673K3706K5024K6283K7934K8465K5721J9746J2928P201K484j850
62049A572711n532q363j1520j6486k3181l0183l6519m2210m7265n1098n3172n3581
$$ plain form
62136 825653 794859 768212 745478 726655 711792 700697 693032 688653 687589 689650 694328 701232 710468
62123 710468 722523 737896 756793 778893 803279 828641 853512 876239 895167 909507 920220
62112 920220 929599 939752 951517 964558 977788 989497 997812 1001689 1001443 998104 992625 985927 979213
62099 979213 973611 969605 967278 966959 969074 973315 978500 983504 988041 992363 996482 999985 1002492 1004061
62085 1004061 1005150 1006295 1007800 1009667 1011910 1015044 1020150 1028297 1039839 1054421 1071639 1091510 1114188
62072 1114188 1139293 1165615 1191450 1215357 1236897 1256817 1276271 1295725 1314867 1333729 1353396
62061 1353396 1375069 1398775 1423799 1450082 1478016 1506481 1532202 1551948 1564876 1572077 1574561 1572711
62049 1572711 1567179 1558816 1547296 1530810 1507629 1477446 1440927 1398717 1351452 1300354 1247182 1193601
62037A193601n2872n1639n0276m8697m6400m3146l9438l5950l2695k9233k5507
62026G37748k1916j8713j5913j3667j2191j1242j0310r348q866r176r925j0490
62014E85991j0546j0150r564q975q239o988n211l426k000n95J188L025M360N448
62000E34318P054R118J0536J0414Q910O729M405K335Q22k65j469l064m786o343
61986E78714p737q943r836j0611j1681j2842j3165j2124j0351q837p867p155o590
61973D50975o172n586m532l392k921l310l929m086l646k897k092j217q4J276K288
61958D10675K170R16l31l49Q64K196K781K806L029L936N570P722R978J1799J2923
61943D76685J3707J4883J6941J9798K2983K6006K8587L0690L2477L4077L5217
$$ plain form
62037 1193601 1140729 1089090 1038814 990117 943717 900571 861133 825183 792488 763255 737748
62026 737748 715832 697119 681206 667539 655348 644106 633796 624448 615582 606406 596481 585991
62014 585991 575445 565295 555731 546756 538517 531529 526318 522892 520892 520297 521485 524510 528870 534318
62000 534318 541372 550490 561026 571440 580350 587079 591484 593819 594641 594376 592907 589843 585057 578714
61986 578714 570977 562034 552198 541587 529906 517064 503899 491775 481424 472587 464720 457565 450975
61973 450975 444803 439217 434685 431293 428372 425062 421133 417047 413401 410504 408412 407195 407111 408387 410675
61958 410675 412845 413761 413430 413081 413945 416141 418922 421728 424757 428693 434263 441985 451963 463762 476685
61943 476685 490392 505275 522216 542014 564997 591003 619590 650280 682757 716834 752051
61932G52051L5190L3516L0701K8076K6523K5616K4244K1929J9063J6007J2525
61921A025441Q290L478j461o249j0722j4497j7051j8005j7145j4339r764m127
61909I23849J598O749J1304J5698K0266K4682K7870K8764K7246K4027J9607J3825
61897A145485O734p08p392j3136j8422k3265k7134k9849l1817l3212l3681l3110
61885I00493l1976l0565k8499k5637k2883k1330k0875k0463j9628j8921j8704
61874F41012j8327j6975j4777j2506j0502q466o217m115k607j703j010q3J343
61861E45067L300N648Q216J0854J3401J5752J8136K1103K4964K9363L3677L7723
61849G67204M1712M5630M9133N2099N4683N6636N7169N5803N2863M8698M2872
$$ plain form
61932 752051 787241 820757 851458 879534 906057 931673 955917 977846 996909 1012916 1025441
61921 1025441 1033731 1037209 1035748 1029499 1018777 1004280 987229 969224 952079 937740 927976 923849
61909 923849 925447 932196 943500 959198 979464 1004146 1032016 1060780 1088026 1112053 1131660 1145485
61897 1145485 1152219 1151511 1144119 1130983 1112561 1089296 1062162 1032313 1000496 967284 933603 900493
61885 900493 868517 837952 809453 783816 760933 739603 718728 698265 678637 659716 641012
61874 641012 622685 605710 590933 578427 567925 559459 553242 549127 546520 544817 543807 543724 545067
61861 545067 548367 554015 562231 573085 586486 602238 620374 641477 666441 695804 729481 767204
61849 767204 808916 854546 903679 955778 1010461 1067097 1124266 1180069 1232932 1281630 1324502
61838A324502L4758K4667J3782L084o952j5675k2008k5241k5605k3864k0635j6251
61826A244562j0873m434L163J1485J9349K5397K8811K9412K7286K2573J5452O178
61814A418361m733j6371k7642l7790m6432n3140n7382n9133n9088n7907n5545
61803I43198n1807m7287m3073l9507l5910l1738k7553k4338k2189k0182j7557
61792E82057j4579j2048j0277q868p407o054n205m870m617m116l508l140l132
61779D94236l314l441l340l000k611k517k857l300l324k809k212k002k051j808
61765D55650j127n79p62j474j939j767j298q35j31J071K312K842K595K229K113
61750D58900J908J275N14J23R2J9l10p94j301j713j814j509j114j034j170r03
$$ plain form
61838 1324502 1359260 1383927 1397709 1400793 1393841 1378166 1356158 1330917 1305312 1281448 1260813 1244562
61826 1244562 1233689 1229255 1232418 1243903 1263252 1288649 1317460 1346872 1374158 1396731 1412183 1418361
61814 1418361 1413628 1397257 1369615 1331825 1285393 1232253 1174871 1115738 1056650 998743 943198
61803 943198 891391 844104 801031 761524 725614 693876 666323 641985 619796 599614 582057
61792 582057 567478 555430 545153 536285 528878 522824 517619 512749 508132 504016 500508 497368 494236
61779 494236 490922 487481 484141 481141 478530 476013 473156 469856 466532 463723 461511 459509 457458 455650
61765 455650 454523 453944 453182 451708 449769 448002 446704 445869 445738 446809 449121 451963 454558 456787 458900
61750 458900 460808 462083 462597 462720 462812 462831 462521 461727 460426 458713 456899 455390 454276 453242 452072 451169
61734D51169J28J476K331K368K041K036K567L235L552L447L218L146L323L790
61720D87827M510N232N659N829O070O393O357N703M828M224L762K930J584rj750
61705E49149l612n089n425m711m028m115m347l683k201r86o49o95m89j30J8N5
61689E09062L02N79L60m31j243j624j640j495j166p14o01j211k258l029l227l184
61673D88480l222l257l119k949k963l072l031k779k407j923j345q92p71p98n90
61658D55362j49J25L4p2K15Q31J398J685J707J551J392J528K100K876L506L977
61642D78066M554N359O265P114P664P384N807L304J023k37q28j628k931m353n554
61627E11009o501p068p009o400n636m826l655k055n58L57R10J578K335K805K909
$$ plain form
61734 451169 451297 452773 455104 457472 459513 461549 464116 467351 470903 474350 477568 480714 484037 487827
61720 487827 492337 497569 503228 509057 515127 521520 527877 533580 538408 542632 546394 549324 550908 550899 549149
61705 549149 545537 540448 535023 530312 526284 522169 517822 514139 511938 510952 510303 509608 509119 508989 509007 509062
61689 509062 509364 509943 510303 509872 508629 507005 505365 503870 502704 501990 501389 500178 497920 494891 491664 488480
61673 488480 485258 482001 478882 475933 472970 469898 466867 464088 461681 459758 458413 457521 456750 455952 455362
61658 455362 455213 455338 455372 455300 455515 456346 457744 459429 461136 462687 464079 465607 467707 470583 474089 478066
61642 478066 482620 487979 494244 501358 509022 516406 522213 525517 526540 526303 525475 523847 520916 516563 511009
61627 511009 504508 497440 490431 484031 478395 473569 469914 467859 467301 467658 468568 470146 472481 475286 478195
61612D78195K802K309J055p79k416l429m211n230o260o803o862o776o524n837
61598D29234m919m496m886n485n484m750l769k984k562k576k967l351l272k705
61584C75028k062j642j356j095j076j596k547l384l565k982k052j364j162j175
61570C47970j145j340k170l305l762l126k166j790j863j631r95n87p58j189j522
61555C20621j704j622j028q8O00P34N66L51O8j28P8M48K47n68j039n79J03K85
61537C17345N71J836L395L585K203Q89Q84J547J662J235J096J327J038l56k313
61522C35944l757m207m111m159m393m211l345k445k269k549k282j203j70O9j79
61507B96733k29j08l38r62j355j006j11O43O99J3j010j907k421k368j574l13M70
$$ plain form
61612 478195 480997 483306 484361 483582 481166 477737 473526 468296 462036 455233 448371 441595 435071 429234
61598 429234 424315 419819 414933 409448 403964 399214 395445 392461 389899 387323 384356 381005 377733 375028
61584 375028 372966 371324 369968 368873 367797 366201 363654 360270 356705 353723 351671 350307 349145 347970
61570 347970 346825 345485 343315 340010 336248 333122 330956 329166 327303 325672 324677 324090 323332 322143 320621
61555 320621 318917 317295 316267 316179 316779 317513 318079 318430 318498 318370 318448 318896 319143 318575 317536 316957 317060 317345
61537 317345 317916 319752 323147 326732 328935 329824 330708 332255 333917 335152 336248 337575 338613 338257 335944
61522 335944 332187 327980 323869 319710 315317 311106 307761 305316 303047 300498 298216 297013 296843 296912 296733
61507 296733 296504 296396 296058 295096 293741 292735 292624 293267 293966 293979 292969 291062 288641 286273 284699 284386 284856
61490B84856M4j051j448o17N46J034Q78O22L92J19Q2M96R70J115J317K124L119
61473B94598L299K524J670J264Q76R7o60q52o91p52j041j054n73j5P7l55q13p61
61455B96838k18K15J44n7K01P36P71J66k35J45P16O23P4kO72J490K008K450K992
61436C09729L332L291L296L772M436M662M293L669L055K437J794J178O52M13Q03
61421C50812J712K230J560K87NJ397L309M134L584K547J675Q90M5p22j447k470
61405C69548l825m901n110m637m197m193m276l835k755j699j459k023k502k195
61391C21941j465j170j402j393o53K91N77k2j018j758j855j370p60m12j03P35
61375C10163K080L095L101K385J741J588J888K482K979K746J604L72P2O99J412
$$ plain form
61490 284856 284900 283849 282401 281784 282330 283364 284242 284864 285256 285375 285457 285953 286923 288038 289355 291479 294598
61473 294598 297897 300421 302091 303355 304231 304328 303668 302816 302125 301373 300332 299278 298705 298690 298767 298412 297599 296838
61455 296838 296620 296835 296979 296922 297123 297859 298630 298796 298561 298706 299422 300045 300119 300117 300789 302279 304287 306737 309729
61436 309729 313061 316352 319648 323420 327856 332518 336811 340480 343535 345972 347766 348944 349596 350009 350812
61421 350812 352524 354754 356314 356601 356606 358003 361312 365446 369030 371577 373252 374142 374187 373465 372018 369548
61405 369548 365723 360822 355712 351075 346878 342685 338409 334574 331819 330120 328661 326638 324136 321941
61391 321941 320476 319306 317904 316511 315858 316149 316726 316704 315686 313928 312073 310703 309943 309531 309428 310163
61375 310163 312243 315338 318439 320824 322565 324153 326041 328523 331502 334248 335852 336224 336296 336995 338407
61360C38407J809K291L102L787M008M219N029O233P049P163P113P616Q867J0468
61346D17161J1835J2565J2544J1800J0347Q354O430N387N440N898N908N422M980
61333E24071M704M025K594R32k65j131k354m023n398o006o255o625o756o027m714
61318D86772l737l343k836j831r34p16p04n1J109J821J654J266J546K810M856
61303D87682P265R343J0301R858Q408O429M019J138j913m619o626p766p972p413
61289E08134o603n999n632n285m905m544m044l170k034j112p40p89q59n16N94
61274D62496K506M718O458P365P702P835P801P518P085O591N932N211N081O171
61260E50470Q175J0046J1187J2086J3464J5096J5887J5027J2850J0486Q796P808
$$ plain form
61360 338407 340216 342507 345609 349396 353404 357623 362652 368885 375934 383097 390210 397826 406693 417161
61346 417161 428996 441561 454105 465905 476252 484606 491036 496423 501863 507761 513669 519091 524071
61333 524071 528775 532800 535394 536326 536061 534930 532576 528553 523155 517149 510894 504269 497513 491486 486772
61318 486772 483035 479692 476856 475025 474091 473375 472671 472620 473729 475550 477204 478470 480016 482826 487682
61303 487682 494947 504290 514591 524449 532857 539286 543305 544443 542530 537911 531285 523519 515547 508134
61289 508134 501531 495532 489900 484615 479710 475166 471122 467952 465918 464806 464066 463277 462418 461902 462496
61274 462496 465002 469720 476178 483543 491245 499080 506881 514399 521484 528075 534007 539218 544299 550470
61260 550470 558645 568691 579878 591964 605428 620524 636411 651438 664288 674774 683570 691378
61248F91378P055O225N300M124K274m04l387n933p724q778r018q446p680p543
61234F57443q052q407q174p805p711p510o675n340l887k242l12J319J951J777
61220E96375J536J338P35j21l49L86J350J828K058K556L121L096K260R11o20k038
61204F14422k860k652j523l7J345K614L995N645P552R624J1886J4541J7624K0575
61190G02751K2439K2616K1289J9017J6241J3362J0949R439Q729Q332P933P544
61178H70641P214O819O228N468M600L536K146N53q49j842k724l956n503o869p903
61163H77559r107j0862j2694j3817j4169j4403j4930j5566j5986j6022j5399j3803
61151G10801j1412q817o300l558m64K290L521K396j037n689r755j1835j2059j1729
$$ plain form
61248 691378 698433 704658 709958 714082 716356 715952 712565 706632 698908 690130 681112 672666 664986 657443
61234 657443 649391 640984 632810 625005 617294 609784 603109 597769 593882 591640 591328 592647 594598 596375
61220 596375 597911 599249 599984 599863 599514 599900 601250 603078 605136 607692 610813 613909 616169 617080 616460 614422
61204 614422 611562 608910 607387 607350 608695 611309 615304 620949 628501 638125 650011 664552 682176 702751
61190 702751 725190 747806 769095 788112 804353 817715 828664 838103 846832 855164 863097 870641
61178 870641 877855 884674 890902 896370 900970 904506 906652 907205 906356 904514 901790 897834 892331 885462 877559
61163 877559 868452 857590 844896 831079 816910 802507 787577 772011 756025 740003 724604 710801
61151 710801 699389 690572 684272 680714 680250 682540 686061 688457 687420 681731 671976 660141 648082 636353
61137F36353j1620j1179r658p463n677m658l798k599j288k31P36J991L544N121
61123E89574O777Q946J1797J4775J7204J9088K0952K2906K4437K5246K5736K6369
61111H13807K7062K7657K8439K9598L0571L0626K9824K8722K7401K5485K2921
61100A122113J9959J6441J1958O654J193l987q740j2717j5699j8218k0877k3155
61088A074925k4041k3839k4096k5442k6728k6760k5799k4755k3820k2664k1213
61077H05768j9669j8232j7195j6702j6210j4950j3037j1348j0111q684o952n697
61065F46981n187m513l009j216J82J357K621L737M644N825P248Q056Q048Q434
61051F83208J0186J2613J4487J5657J6690J7753J8766J9895K1206K2556K4305
$$ plain form
61137 636353 624733 613554 603896 596433 590756 586098 582300 579701 578413 578182 578918 580909 584453 589574
61123 589574 596351 605297 617094 631869 649073 668161 689113 712019 736456 761702 787438 813807
61111 813807 840869 868526 896965 926563 957134 987760 1017584 1046306 1073707 1099192 1122113
61100 1122113 1142072 1158513 1170471 1177125 1178318 1174331 1165591 1152874 1137175 1118957 1098080 1074925
61088 1074925 1050884 1027045 1002949 977507 950779 924019 898220 873465 849645 826981 805768
61077 805768 786099 767867 750672 733970 717760 702810 689773 678425 668314 659630 652678 646981
61065 646981 641794 637281 634272 633056 633238 634595 637216 640953 645597 651422 658670 666726 674774 683208
61051 683208 693394 706007 720494 736151 752841 770594 789360 809255 830461 853017 877322
61040H77322K7011L0090L2172L3288L5125L8295M1268M3061M4974M8181N1486
61029A302273N3185N3550N3599N3144N2057N1914N4257N8606O4134P1700Q1979
61018A950398R3135J02796J10897J18576J26606J37510J56619J87482K28757K79253
61008C492029L42738M23027N18779O30698P70423R53474J188327J484913J862074
60999A1666482K305355K693457K801300K443721J652824O98757q8908n23565n98641
60990B3050782l81705N3291N72331R30094Q67303L03665n77617j454885k079030
60981B1284229k378653k412409k272808k037932j768373j506486j271196j064623
60973F571749q85926p35141o08816n01268m10501l37613k81050k36286k00489
$$ plain form
61040 877322 904333 934423 966595 999883 1035008 1073303 1114571 1157632 1202606 1250787 1302273
61029 1302273 1355458 1409008 1462607 1515751 1567808 1619722 1673979 1732585 1796719 1868419 1950398
61018 1950398 2043533 2146329 2257226 2375802 2502408 2639918 2796537 2984019 3212776 3492029
61008 3492029 3834767 4257794 4776573 5407271 6177694 7131168 8319495 9804408 11666482
60999 11666482 13971837 16665294 19466594 21910315 23563139 24261896 24172988 23649423 23050782
60990 23050782 22669077 22722368 23294699 24224793 25092096 25395761 24818144 23363259 21284229
60981 21284229 18905576 16493167 14220359 12182427 10414054 8907568 7636372 6571749
60973 6571749 5685823 4950682 4341866 3840598 3430097 3092484 2811434 2575148 2374659
60964B374659j73017j51844j33863j18417j06624r7293q7299p6031o5706n7072
60954A307493m8474l9754l3568l1604l2301l3366l4110l4320l3202l0712k8155
60943I27927k6354k4683k2597k0668j9436j8674j8269j8538j9260j9672j9655
60932G00121j9658j9425j8268j6623j5714j5539j4941j3737j2987j2863j2191
60921E28175j0626r400r220r168q494p811p592p051n579l964l130k793k311j756
60907D39280j236k57J190J993J438N57P39J750K273J953J715K186K806K726J833
60892D60946P47K7l31o23q69q25o33q72j588j905j321p44j295k572l286l226l213
60875D38417l381l014k164j884k466k880k552k338l007l886l835k750j340l6J122
$$ plain form
60964 2374659 2201642 2049798 1915935 1797518 1690894 1593601 1506302 1430271 1364565 1307493
60954 1307493 1259019 1219265 1185697 1154093 1121792 1088426 1054316 1019996 986794 956082 927927
60943 927927 901573 876890 854293 833625 814189 795515 777246 758708 739448 719776 700121
60932 700121 680463 661038 642770 626147 610433 594894 579953 566216 553229 540366 528175
60921 528175 517549 508149 498929 489761 481267 473456 465864 458813 453234 449270 446140 443347 441036 439280
60907 439280 438044 437787 438977 440970 442408 442965 443704 445454 447727 449680 451395 453581 456387 459113 460946
60892 460946 461693 461720 461389 460766 459897 459072 458439 457567 455979 454074 452753 452009 450714 448142 444856 441630 438417
60875 438417 435036 432022 429858 427974 425508 422628 420076 417738 414731 410845 407010 404260 402920 402884 404006
60860D04006K002K358K092J290K71l85l63n4J66P91K431M342M863L470J349j57
60844D28472o87l07R05K359L026K513J348J02r82j478j081m34n07j026q86j50
60828D31187n2p29p80L09J078M72l81j22O11M23m50p33l37l68j146j760j571j056
60810D24595r92j556k390l005l193l260l667m294m515m208l973m100m097l660
60796C77685l273l245l024k184j318j188j573j752j576j343j069o70l77l59l37
60781C54397j08N2Q9N68J690K555K253J210N94P59J117J329J767K835M376N787
60765C81270O436O162N590N580O192O621O274N395M447L633L208L384L648L023
60751D50863J460J25j34L41J065K155L440L951L261K269J723R66p61k698l507
$$ plain form
60860 404006 406008 408366 410458 411748 412019 411634 411271 411217 411383 412174 414605 418947 423810 427280 428629 428472
60844 428472 427785 427478 428383 430742 433768 436281 437629 437731 436749 435271 434190 433756 433249 432223 431337 431187
60828 431187 431135 430406 429626 429935 431013 431485 431104 430982 431593 432016 431566 430833 430496 430128 428982 427222 425651 424595
60810 424595 423603 422047 419657 416652 413459 410199 406532 402238 397723 393515 389542 385442 381345 377685
60796 377685 374412 371167 368143 365959 364641 363453 361880 360128 358552 357209 356140 355470 355093 354734 354397
60781 354397 354289 354341 354430 354998 356688 359243 361496 362706 363300 364059 365176 366505 368272 371107 375483 381270
60765 381270 387706 393868 399458 405038 411230 417851 424125 429520 433967 437600 440808 444192 447840 450863
60751 450863 452323 452448 452314 452655 453720 455875 459315 463266 466527 468796 470519 471485 470724 468026 464519
60736D64519l223k997l435m316n448o662p334p017o301o020n968n337m066k874
60722C93521k221k102k439k892k730j762q74p77q45k09O85Q79O93J261K643L722
60706C86553L906L637L359L129L173L694M190M072L785M283N493O441O788O990
60692D49493P072O496N356M447M078L879L886M567N628O013N402M655M492M719
60678E20183N021N494O124O646P176Q093R089R390R055R125J0115J1408J2374
60665F29293J3023J3248J2513J0852R211Q255P692P180O975P084O790N699M460
60652G42275L721L084J819k4j857l372m474n009n231o009p801r850j1063j1387
60638F84822j1658j2344j3075j3318j2938j2132j1227j0466r763q782p468o230
$$ plain form
60736 464519 461296 458299 454864 450548 445100 438438 431104 424087 417786 411766 405798 400461 396395 393521
60722 393521 391300 389198 386759 383867 381137 379375 378501 377724 376879 376670 377355 378234 378927 380188 382831 386553
60706 386553 390459 394096 397455 400584 403757 407451 411641 415713 419498 423781 429274 435715 442503 449493
60692 449493 456565 463061 468417 472864 476942 480821 484707 489274 494902 500915 506317 510972 515464 520183
60678 520183 525204 530698 536822 543468 550644 558737 567826 577216 586271 595396 605511 616919 629293
60665 629293 642316 655564 668077 678929 688140 696395 704087 711267 718242 725326 732116 737815 742275
60652 742275 745996 749080 750899 750875 749018 745646 741172 736163 730932 724923 717122 707272 696209 684822
60638 684822 673164 660820 647745 634427 621489 609357 598130 587664 577901 569119 561651 555421
60626E55421n427m933m452l972l619l307k919k597k560k718k766k584k414k591
60612E08562l173l820m090l929l730l820m065m227m339m504m553m397m372m793
60598D50750n359n605n564n429m872l511j890j089j351j857j990j937k002k104
60584D06190k139k169k039j502q41o24q18r12r57j450k065j709k17J176J765K588
60568C94277M776P597R356R766J0102J1205J2394J2525J1242Q952O224L550J223
60555E03189q80l202n827q026q733p608n419l209j282P27K836M516N617O841Q676
60540D88216J0535J1630J2150J2640J2622J1042P983M771K218j48k876n609p633
60527E57541q551q114o317m043k625k319k031r71K75Q19O73L46J05L39J708M053
$$ plain form
60626 555421 549994 545061 540609 536637 533018 529711 526792 524195 521635 518917 516151 513567 511153 508562
60612 508562 505389 501569 497479 493550 489820 486000 481935 477708 473369 468865 464312 459915 455543 450750
60598 450750 445391 439786 434222 428793 423921 420410 418520 417431 416080 414223 412233 410296 408294 406190
60584 406190 404051 401882 399843 398341 397500 396876 396058 395146 394189 392739 390674 388965 388748 389924 391689 394277
60568 394277 399053 406650 416006 425772 435874 447079 459473 471998 483240 492192 498416 501966 503189
60555 503189 502309 499107 493280 485254 476521 468913 463494 460285 459003 459730 462566 467082 472699 479540 488216
60540 488216 498751 510381 522531 535171 547793 558835 566818 571589 573807 573659 570783 565174 557541
60527 557541 548990 540876 534559 530516 527891 525572 523541 522570 522845 523664 524337 524683 524788 525127 526835 530888
60511E30888N827N582L637J596O57J049K514M541O445P972R623J1916J4749J7990
60497F24986K2033K7034L2156L6508M0343M4322M7842M9080M6743M0979L2561
60486A044587K1982R555m097j7927l0613m0908m8142n2313n3562n1963m8113m3380
60474F85106l8873l4514k9681k4519j9985j6754j4714j3388j2361j1334j0283
60463D58700r483r022q495p535o385n507m888m291l802l575l348k824k253j987
60449C85305j765j182o65j010j995k411j675o10k27m78n75j18O19J150J193P33
60433C76289kp03j236j660j977k042j805j493j428j712k062k021j424o78l06j86
60417C55554L67J580K736K976K312J482J071J100J272J255Q86L25p0j83j41J22
$$ plain form
60511 530888 536715 542297 545934 547530 548187 549236 551750 556291 562736 570708 580331 592247 606996 624986
60497 624986 647019 674053 706209 742717 783060 827382 875224 924304 971047 1012026 1044587
60486 1044587 1066569 1076124 1072027 1054100 1023487 982579 934437 882124 828562 776599 728486 685106
60474 685106 646233 611719 582038 557519 537534 520780 506066 492678 480317 468983 458700
60463 458700 449217 440195 431700 424165 417780 412273 407385 403094 399292 395717 392369 389545 387292 385305
60449 385305 383540 382358 381693 380683 378688 376277 374602 373992 373765 373287 372712 372594 373213 374363 375556 376289
60433 376289 376287 375584 374348 372688 370711 368669 366864 365371 363943 362231 360169 358148 356724 356046 355740 355554
60417 355554 355921 357501 360237 363213 365525 367007 368078 369178 370450 371705 372591 372916 372846 372663 372522 372644
60401C72644P79J470J468Q72P75J614K244J536K31m0Q53J524J319J124J622K138
60385C92173J854J188J070J512J737J384Q80P29J040J690K416K746K260J188N04
60370D14371J067K621L877L828K771J786J322R27L34MJ60J41n67j227p28P12J754
60353D33153J757J410J459J763J967K289L078M132N036N831O925Q455J0030J0993
60339D98278J0798R297O842L983J069j736m179n994p195q010q484q398p631o315
60325D72325m802l679l555m344m964m376k893j851j971k627k760j976o18O75J313
60310D33897J191R63J413K502L607M647O260Q686J1285J3447J5159J6300J6186
60297E35543J4492J1858Q872N061j47n855j0135j1869j1455r814p556n086k705
$$ plain form
60401 372644 373423 374893 376361 377233 378008 379622 381866 383402 383633 383593 384446 385970 387289 388413 390035 392173
60385 392173 394027 395215 396285 397797 399534 400918 401798 402527 403567 405257 407673 410419 412679 413867 414371
60370 414371 415438 418059 421936 425764 428535 430321 431643 432570 432904 432908 433068 433209 432642 431415 430687 431399 433153
60353 433153 434910 436320 437779 439542 441509 443798 446876 451008 456044 461875 468800 477255 487285 498278
60339 498278 509076 518373 525215 529198 530267 528531 524352 518358 511163 503153 494669 486271 478640 472325
60325 472325 467523 463844 460289 455945 450981 446605 443712 441861 439890 437263 434503 432527 431909 432584 433897
60310 433897 435088 436051 437464 439966 443573 448220 454480 463166 474451 487898 503057 519357 535543
60297 535543 550035 561893 570765 575826 575679 569824 559689 547820 536365 526551 518995 513909 511204
60284E11204l30K117M048M512L402J632j52k237m834p142q203q242q272q640q746
60269D70117q237p574p199o791n899m731l877l498l339l260l231k990k245j268
60255D05978o80o25o00k76J0j72o78j013r86p88o12m38j94J05L53M86O58J109
60237D01637J674J695Q67p2n2R31J898K383K861L544L767L226K788L253M051M149
60221D38600L642L316L189K696K024J960K507K887K909L135L636L823L825M581
60207D82730O120P078O672N974O210O842O576N495M755M551L865K295Q90O81J247
60192E51981J350M70q06j660j842j659j496j479j580j842k329k888l244l418l712
60177E25846m169m372l990l280k722k433k207j945j665j336r86q65j078j251r21
$$ plain form
60284 511204 510874 512991 517039 521551 524953 526585 526433 524196 519362 512220 504017 495775 487503 478863 470117
60269 470117 461880 454306 447107 440316 434417 429686 425809 422311 418972 415712 412481 409491 407246 405978
60255 405978 405298 404673 404073 403797 403807 403635 402957 401944 400958 400170 399558 399120 398926 399031 399384 399870 400528 401637
60237 401637 403311 405006 405873 405801 405749 406680 408578 410961 413822 417366 421133 424359 427147 430400 434451 438600
60221 438600 442242 445558 448747 451443 453467 455427 457934 460821 463730 466865 470501 474324 478149 482730
60207 482730 488850 495928 502600 508574 514784 521626 528202 533697 538452 543003 546868 549163 550053 550734 551981
60192 551981 553331 553801 552995 551335 549493 547834 546338 544859 543279 541437 539108 536220 532976 529558 525846
60177 525846 521677 517305 513315 510035 507313 504880 502673 500728 499063 497727 496741 495876 494798 493547 492626
60162D92626k31K33J87k5K5L96Q77J224J254R53O30P12J265J846J956J534R23
60145E06385N43O30J211K183L355M490N317N748O043O658P663Q526Q626P931O919
60130E82228N894M702L166J448j60j600k945m029m405l772k377r70k26k05l92
60115E76357l79l50o82j220j309o95M7K21j20m18n11p91j516k363k885k968k750
60098E57668k455k472l151m198m622l744k040m66P37K020L469M585N165N692O466
60083E62654P000O759O013N450N233M954M348L545K640J505J28j222k299l162
60069F03546m102n274o458p159p125o721o576o804o888o455n783n293m971m601
60055E19336m285m230m259l998l458l016k799k495j783p24L43J097J539K039K950
$$ plain form
60162 492626 492395 492628 492815 492790 492815 493211 494088 495312 496566 497519 498149 498861 500126 501972 503928 505462 506385
60145 506385 506928 507558 508769 510952 514307 518797 524114 529862 535905 542563 550226 558752 567378 575309 582228
60130 582228 588122 592824 595990 597438 597278 595678 592733 588704 584299 580527 578150 577180 576954 576749 576357
60115 576357 575978 575628 574946 573726 572417 571722 571769 571990 571870 571452 570941 570150 568634 566271 563386 560418 557668
60098 557668 555213 552741 549590 545392 540770 537026 534986 534520 535257 537277 540746 545331 550496 556188 562654
60083 562654 569654 576413 582426 587876 593109 598063 602411 605956 608596 610101 610229 609007 606708 603546
60069 603546 599444 594170 587712 580553 573428 566707 560131 553327 546439 539984 534201 528908 523937 519336
60055 519336 515051 510821 506562 502564 499106 496090 493291 490796 489013 488289 488632 489729 491268 493307 496257
60040D96257L966M251L538K705K798L659M162L671K685J928J424P07m29j714k776
60025E26832l537m255n216o351p272p775q086q473q761q534p727o698n831n154
60011D33162m385l248j942j171j348j819j482k98N62M18Q7N49J476J922J832J774
59995D26089J710J190N71P68J835K856L330L621L957M029L836L888M242M198L402
59980D69522K407J803J498J117N02m45j698k699k828k439k526l134l139j986o22
59965D55333q3j42jN25J211J971K520K278J337P34R48J014N3j161j326n95j93
59948D64423m83p89q82j281j992k210j566p09l39m72r56j921l321m601n150m883
59932D32868m149l443l121l046k578j361%N61K41j54n1L88R05J508K090K361K442
$$ plain form
60040 496257 500223 504474 508012 510717 513515 517174 521336 525007 527692 529620 531044 531751 531322 529608 526832
60025 526832 523295 519040 513824 507473 500201 492426 484340 475867 467106 458572 450845 444147 438316 433162
60011 433162 428777 425529 423587 422416 421068 419249 417767 417469 418031 418449 418536 419085 420561 422483 424315 426089
59995 426089 427799 428989 429560 430328 432163 435019 438349 441970 445927 449956 453792 457680 461922 466120 469522
59980 469522 471929 473732 475230 476347 476849 476404 474706 472007 469179 466740 464214 461080 457941 455955 455333
59965 455333 455250 455108 455107 455632 456843 458814 461334 463612 464949 465683 466631 467645 467698 466537 465211 464616 464423
59948 464423 463940 463151 462269 460988 458996 456786 455220 454511 454172 453700 452744 450823 447502 442901 437751 432868
59932 432868 428719 425276 422155 419109 416531 415170 415170 415731 415972 415818 415767 416155 417060 418568 420658 423019 425461
59915D25461K869L678M094L540K571K205K661L224L254K851K464K229J872J218
59901D64191N60L95P49J030P34J40m9L58Q19Q52O74Q43J586K670L797M796N466
59884D89611N513M875L993L615M139N255O312O937P125O899O210N203M201L215
59870E63103J822k45k587m464n497n803n656n264m778m244l598k861k202j657
59856E16069r34K12J568K663L404M298N991Q563J1123J2143J0513O505J658k347
59842E81429m575m815l360j102O77J133L67j210l528o471r128j0254r553p980
59828E21630o624n686m729l520k433k090k756m006m999n241n064n120n523n742
59814D58097n407m806m362l929l038j843j177j451j892j434k11N86L29l09n90
$$ plain form
59915 425461 428330 432008 436102 439642 442213 444418 447079 450303 453557 456408 458872 461101 462973 464191
59901 464191 464751 465146 465895 466925 467659 467799 467750 468108 468927 469779 470453 471296 472882 475552 479349 484145 489611
59884 489611 495124 499999 503992 507607 511746 517001 523313 530250 537375 544274 550484 555687 559888 563103
59870 563103 564925 564680 562093 557629 552132 546329 540673 535409 530631 526387 522789 519928 517726 516069
59856 516069 515135 515347 516915 519578 522982 527280 533271 541834 552957 565100 575613 582118 583776 581429
59842 581429 576854 572039 568679 567577 568254 569387 569754 568544 565016 558545 549417 539163 529610 521630
59828 521630 515006 509320 504591 501071 498638 496548 493792 489786 484787 479546 474482 469362 463839 458097
59814 458097 452690 447884 443522 439593 436555 434712 433535 432084 430192 428758 428547 429133 429462 429153 428563
59799D28563q20j542k311k271j579j163j171q28N3N81K03m69p80j025j548j777
59783D12116j076l5J61o14j306j100k10P66J566K142K327J958J195N87O92J513
59767D20682K344K471K005J653J728J915K038K336K771K871K575K522L017L432
59753D54360L174K634K537K922L420L949M419M326L449K529K469L063L315K762
59739D99328J786R49N57P25J168J313J056R93J379J445N90m40n31P9K10m05q25
59722E09377m10M13R36Q82K88m74o55Q1R14P68j44n97p6P59J372K011K839L437
59704E21721L562L606L913M233M211L877L378K669J792J028P13J098K188L380
59690E61369L578K326N10p57j570k667l794l847k574j044k41k11o87j540k342
$$ plain form
59799 428563 427743 426201 423890 421619 420040 418877 417706 416878 416931 417512 417715 417246 416466 415441 413893 412116
59783 412116 411040 411005 411166 410552 409246 408146 407936 408702 410268 412410 414737 416695 417890 418477 419169 420682
59767 420682 423026 425497 427502 429155 430883 432798 434836 437172 439943 442814 445389 447911 450928 454360
59753 454360 457534 460168 462705 465627 469047 472996 477415 481741 485190 487719 490188 493251 496566 499328
59739 499328 501114 502063 502620 503345 504513 505826 506882 507875 509254 510699 511289 510849 510318 510397 510607 510202 509377
59722 509377 508967 509380 510316 511198 511486 511012 510357 510438 511352 512120 511976 511379 511303 512062 513434 515445 518284 521721
59704 521721 525283 528889 532802 537035 541246 545123 548501 551170 552962 553990 554703 555801 557989 561369
59690 561369 564947 567273 567783 567026 565456 562789 558995 555148 552574 551530 551289 551078 550391 548851 546509
59675E46509k529k320k554l383m019m079m192m833n412n092l806k087m91M07K24
59660E02343o50j251j079m71J86Q71J438J549J370J560K257K845K902K649K196
59645E18715J296N9r16j428j859k312k528k800l772n023n145l829k534k375k614
59630D82935k159j319r56r00n36j36k99o07k05P40J313J341J402J458O37j455
59614D81254l995n707n923m934l716l151l134k671j194O45J854K275K321K125
59600D56049J641J153Q77L94p82k258l058k764j798p07K73J098J814K453K776
59585D57161K360J253J79k85l83o66j225j834k405k884l066k948k871l031l203
59570D36152l250l351l413k949j932j082q66q91p48o38o49k40P99J706J789J428
$$ plain form
59675 546509 543980 541660 539106 535723 531704 527625 523433 518600 513188 508096 504290 502203 501712 502119 502343
59660 502343 501693 500442 499363 498892 499078 499949 501387 502936 504306 505866 508123 510968 513870 516519 518715
59645 518715 520011 520070 519154 517726 515867 513555 511027 508227 504455 499432 494287 490458 487924 485549 482935
59630 482935 480776 479457 478501 477601 477065 476929 476630 476023 475818 476558 477871 479212 480614 482072 482709 481254
59614 481254 477259 471552 465629 460695 456979 453828 450694 448023 446829 447474 449328 451603 453924 456049
59600 456049 457690 458843 459720 460114 459332 457074 454016 451252 449454 448747 449020 450118 451932 454385 457161
59585 457161 459521 460774 460953 460668 460285 459619 458394 456560 454155 451271 448205 445257 442386 439355 436152
59570 436152 432902 429551 426138 423189 421257 420175 419309 418418 417670 417032 416383 416143 416942 418648 420437 421865
59554D21865J238J036M31k19l55o9L84J202K342L084L170L527M862O511P744R140
59538D65893J1400J4003J6626K0536K6129K9961K7170J7208M940m323q926r833
59526F10784q136m874j502J105L259N270O504O382N336M136L008J994J179O1k327
59511F32179n958r345j1167j1598j1522j1334j1110j1095j1227j0919r916q786
59499E08202q015p288o222n052m024k891j595p22n95n81k8P67J172J212J241J293
59483D76874J393J986L223M393M787M731N051N931P044Q332R785J0817J0620R055
59469E64022O594L727R43j075j975k174k234k005j028O01K349L910N136N799O139
59454E88729P233R780J2837J4792J5513J6441J8390K0408K1158K0490J9048J6932
$$ plain form
59554 421865 423103 424139 424570 424351 423996 423927 424311 425513 427855 430939 434109 437636 442498 449009 456753 465893
59538 465893 477293 491296 507922 528458 554587 584548 611718 628926 633866 629543 620617 610784
59526 610784 602648 597774 596272 597377 600636 605906 612410 618792 624128 628264 631272 633266 634445 634506 632179
59511 632179 626221 616876 605709 594111 582589 571255 560145 549050 537823 526904 516988 508202
59499 508202 500187 492899 486677 481625 477601 474710 473115 472393 471798 471217 471189 471956 473128 474340 475581 476874
59483 476874 478267 480253 483476 487869 492656 497387 502438 508369 515413 523745 533530 544347 554967 564022
59469 564022 570616 574343 575286 574211 572236 570062 567828 565823 564795 565396 567745 571655 576791 582590 588729
59454 588729 595962 605742 618579 633371 648884 665325 683715 704123 725281 745771 764819 781751
59442G81751J3489Q129R60p075j4357j9173k0751j9772j7691j5578j3720j2125
59430F64087j1069j0978j1829j2816j2858j1485r095o274l099O64M876Q854J1880
59417F00858J3805J5177J6830J9048K1295K3249K5986L0848L6297L7052K8284
59406H68729J0927q354k2698k9637l0547k7661k2707j6714r318P38J2354J9875
59394G44987J6869K996j4543k7431l2854l3097l0807k6920k2321j8626j6493j4815
59382E26945j2499r943q055o768n418l941k754j913j148m77r6J37N15R55J186
59367D76726J250J288J089M40k00j4J144K559L499L902M218M939O264P875R146
59352E24125R805J0306J1245J2662J4222J5795J7427J9022K0484K1893K3008K3050
$$ plain form
59442 781751 795240 803369 804329 797254 782897 763724 742973 723201 705510 689932 676212 664087
59430 664087 653018 642040 630211 617395 604537 593052 583957 577683 574584 575248 580124 588978 600858
59417 600858 614663 629840 646670 665718 687013 710262 736248 767096 803393 840445 868729
59406 868729 879656 871302 848604 818967 788420 760759 738052 721338 712020 712758 725112 744987
59394 744987 761856 764852 750309 722878 690024 656927 626120 599200 576879 558253 541760 526945
59382 526945 514446 504503 496448 489680 484262 480321 477567 475654 474506 474029 473933 474070 474585 475540 476726
59367 476726 477976 479264 480353 480793 480593 480579 481723 484282 487781 491683 495901 500840 507104 514979 524125
59352 524125 533930 544236 555481 568143 582365 598160 615587 634609 655093 676986 699994 723044
59340G23044K1690J9817J8438J7003J4004R254M419R18j652m439p665j0781j3561
59327G90489j6049j7842j8358j7779j6999j6514j5915j4656j2875j1195r954q924
59315F13429p751o435n235m256l295k151q58M70J840L280M803O596R083J2543
59301F22063J6725K0762K3039K1384J4449L646p063j4203j7465j8725j9126j8269
59289F27217j5889j2799r862p169m703k896j945j308l66Q97K199L447M577N466
59275E86866O264P374Q853J0351J1805J3515J5369J6640J6912J6552J5920J4807
59263G41228J3024J0901Q705O132K881p29m148p177r745j1649j2873j3754j4367
59250G08429j4332j3511j2391j1327j0001q193o412n212m327l184j775m43Q09
$$ plain form
59340 723044 744734 764551 782989 799992 813996 823250 827669 828587 826935 822496 814831 804050 790489
59327 790489 774440 756598 738240 720461 703462 686948 671033 656377 643502 632307 622353 613429
59315 613429 605678 599243 594008 589752 586457 584306 583448 583918 585758 589038 593841 600437 609520 622063
59301 622063 638788 659550 682589 703973 718422 722068 715005 700802 683337 664612 645486 627217
59289 627217 611328 598529 588667 581498 576795 573899 571954 570646 570280 571177 573376 576823 581400 586866
59275 586866 593130 600504 609357 619708 631513 645028 660397 677037 693949 710501 726421 741228
59263 741228 754252 765153 773858 779990 782871 782142 777994 770817 761072 749423 736550 722796 708429
59250 708429 694097 680586 668195 656868 646867 638674 632262 627050 622723 619539 617764 617321 618130
59237F18130K107L238L975M556N181N424M863L865L023K085L81j894l730m676
59223F46528n369o552q215r903j1245j1995j2029j1582j1114j0740j0079q807
59211E28898p178n824n123m913m679m038l014j874q26m9J56k90q08o06L01J068
59195D91201J236J303J739K086J691Q19L30N37J127J953L150M447N145M990M619
59180E26373M830N663O442O615O413O536P169P601P129O165N869O722Q078R225
59166F20830J0071J0554J0304R464R083R847J0943J0908R348P040M800K888J226
59153G27306m87k694n349p617q805r301r941j0700j0840j0100r053q341q207q626
59139F17245r196r129q032o627n885n672n008l611k235j463j030n81k05L9N24
$$ plain form
59237 618130 620237 623475 627450 632006 637187 642611 647474 651339 654362 656447 656828 654934 651204 646528
59223 646528 641159 634607 626392 616489 605244 593249 581220 569638 558524 547784 537705 528898
59211 528898 521720 515896 510773 505860 501181 497143 494129 492255 491429 491380 491536 491246 490438 489832 490133 491201
59195 491201 492437 493740 495479 497565 499256 500075 500405 500942 502069 504022 507172 511619 516764 521754 526373
59180 526373 531203 536866 543308 549923 556336 562872 570041 577642 584771 590936 596805 603527 611605 620830
59166 620830 630901 641455 651759 661223 670306 680153 691096 702004 711352 718392 723192 726080 727306
59153 727306 726819 724125 718776 711159 702354 693053 683112 672412 661572 651472 642419 634078 625871 617245
59139 617245 608049 598920 590888 584261 578376 572704 567696 564085 561850 560387 559357 558776 558571 558610 559134
59124E59134J544K958M531O172P652Q608R012R325R910J0734J1631J2506J3182
59111F66899J3529J3785J4260J4664J4282J3013J1601J0657J0001R254Q567Q250
59099H08762P997P061N132K704N10j105k235l028l510l776m061m393m359l690
59085H02009k979l219m512n852o528p045q191r848j1343j2481j3426j3930j3538
59072F89117j2375j1085j0085r431r205r336r290q583p451o479n786n268n144
59059E79599n492n593m728l446k966l495m100m198m070l861l203k173j527j632
59045E29115j916j762j158l51M29P81M82J57O85J827K450K257K181K793L557M066
59029E45593M770N788O288N965O015P499R649J0962J1371J2076J3546J4953J5448
$$ plain form
59124 559134 560678 563636 568167 574339 581991 590599 599611 608936 618846 629580 641211 653717 666899
59111 666899 680428 694213 708473 723137 737419 750432 762033 772690 782691 791945 800512 808762
59099 808762 816759 823820 828952 831656 832166 831061 828826 825798 822288 818512 814451 810058 805699 802009
59085 802009 799030 795811 791299 785447 778919 771874 763683 753835 742492 730011 716585 702655 689117
59072 689117 676742 665657 655572 646141 636936 627600 618310 609727 602276 595797 590011 584743 579599
59059 579599 574107 568514 563786 560340 557374 553879 549779 545581 541511 537650 534447 532274 530747 529115
59045 529115 527199 525437 524279 523928 524357 525138 525620 525777 526462 528289 530739 532996 535177 537970 541527 545593
59029 545593 550363 556151 562439 568404 574419 581918 591567 602529 613900 625976 639522 654475 669923
59016F69923J5076J4295J3310J1941R789O600K867k63k032k791l243l450l007
59003G29015j878m35J009K226K974L357L916M855N534N277M220K824J073j116
58989G62851l121m192m562n178o436p913r207j0242j0863j0874j0501j0057r240
58976F60465p504n174l262k035o31J556L950N752P089Q504R749R937Q896P649
58962G04941P357Q128R095R409Q865P651N897L693J348p96k839n200p863j0110
58948G39576j1281j1507j1376j1111j0509r510q299o886n026k685k75J711K950
58935F55772L166K077k23k972n226o588p367p947q212p744o574n408m948n156
58921E92650n442n421n123m555l572k403j711j817k187k048j266k22Q31J862K692
$$ plain form
59016 669923 684999 699294 712604 724545 734334 740934 743801 743538 741506 738715 735472 732022 729015
59003 729015 727137 726702 727711 729937 732911 736268 740184 745039 750573 755850 760070 762894 763967 762851
58989 762851 759730 755538 750976 745798 739362 731449 722242 712000 701137 690263 679762 669705 660465
58976 660465 652961 647787 644525 642490 641859 643415 647365 653117 660206 668710 678459 688396 697292 704941
58962 704941 712298 720426 729521 738930 747795 755446 761343 765036 766384 765588 762749 757549 749686 739576
58948 739576 728295 716788 705412 694301 683792 674282 665983 659097 654071 651386 651111 652822 655772
58935 655772 658938 661015 660792 657820 652594 646006 638639 630692 622480 614736 608162 602754 597806 592650
58921 592650 587208 581787 576664 572109 568537 566134 564423 562606 560419 558371 557105 556883 557714 559576 562268
58906E62268L173L732N137P509J0053J1982J3382J4791J6118J6534J5500J3528
58894F93707J1651J0307R067P549O197N940P240R724J2662J5480J7746J9033J9045
58881H45348J7802J5637J2975J0102O949L216j139n520r059j1477j3325j5224
58869H56285j6999j7777j6978j5068j3165j1899j0915r637q271p557p643p862
58857G12514p798p918q636r467r738r702j0040j0574j0391r187p622o299n272
58844E99870m615m604n030n174m856m798n420n971n464m147l266l519m195m018
58830E34793k628j022m48r37j350r96m93o00q85n46K8k00r84q93M56J720J858
58813E26873J562J850K393K237J368N75K84L90Q34J441J702J329P56M40J28n27
$$ plain form
58906 562268 565441 569173 574310 581819 591872 603854 617236 632027 648145 664679 680179 693707
58894 693707 705358 715665 724732 732281 738478 744418 751658 761382 774044 789524 807270 826303 845348
58881 845348 863150 878787 891762 901864 908813 912029 910890 905370 896311 884834 871509 856285
58869 856285 839286 821509 804531 789463 776298 764399 753484 743847 735576 728019 720376 712514
58857 712514 704716 696798 688162 678695 668957 659255 649215 638641 628250 619063 611441 605142 599870
58844 599870 595255 590651 585621 580447 575591 570793 565373 559402 553938 549791 546525 543006 538811 534793
58830 534793 532165 531143 530695 529758 528408 527412 526919 526319 525434 524888 524916 524716 523732 522839 523295 525015 526873
58813 526873 528435 530285 532678 534915 536283 536858 537142 537532 538366 539807 541509 542838 543594 544034 544162 543635
58797E43635j138j121o71m77p53j205j726k348k736k348j032R21L071M827N531
58782E42430N088M256L826L892M221M823N585N895N332M292L297K150M32j599
58768E93920l379m895o289p072o674n613n068n309n374m437k739j065Q5O79R69
58753E37739J261J567J560J143Q54J294K332L308L769L712L416L395M105N294
58739E74749O045N880N398N358N752O277P032Q019Q671Q641Q472Q613Q494P570
58725F74971O535O238N994M525K246R81J398K209K200J707J730K632M171N831
58711G23368O844O734O058N785N779M940K970Q52p79k577n247q324j0903j2836
58697G22664j4511j6007j7092j7647j7618j6904j5619j4117j2552j0756q809p199
$$ plain form
58797 543635 542497 541376 540705 540228 539475 538270 536544 534196 531460 529112 528080 529001 532072 536899 542430
58782 542430 547518 551774 555600 559492 563713 568536 574121 580016 585348 589640 592937 595087 595519 593920
58768 593920 590541 585646 579357 572285 565611 559998 554930 549621 544247 539810 537071 536006 536091 536770 537739
58753 537739 539000 540567 542127 543270 544124 545418 547750 551058 554827 558539 561955 565350 569455 574749
58739 574749 580794 586674 592072 597430 603182 609459 616491 624510 633181 641822 650294 658907 667401 674971
58725 674971 681506 687744 693738 698263 700509 701490 702888 705097 707297 709004 710734 713366 717537 723368
58711 723368 730212 736946 743004 748789 754568 759508 762478 763330 762551 759974 754727 746403 735500 722664
58697 722664 708153 692146 675054 657407 639789 622885 607266 593149 580597 569841 561032 553833
58685E53833o211n628n242n160n416n704n719n440m877l966k773j550n48j4j36
58670D95449n56k73J350L696N645O998Q340R840J1048J1771J2105J1632R659O333
58656E93037K668o57l540n578o102n370m587m423m392m025l589l328l025k708
58642E44381k810l241l269k757k494k691k322o72J440K820L439L858L901K935
58628E42518J113n67j351j245o87j63J7n3p4J4J12M78J517L016M365N609P353
58611E61972R415J0586J0203R022Q044P374O682N872M745K996J101K79P17R50
58597F39958k13j985k850k613k197k071k038k035k017j485k0J909L641N314P360
58582F38658R425J0766J1362J1671J1603J0743R367Q218P373O291M961M130M323
$$ plain form
58685 553833 547622 541994 536752 531592 526176 520472 514753 509313 504436 500470 497697 496147 495599 495585 495449
58670 495449 494893 494620 495970 499666 505311 512309 520649 530489 541537 553308 565413 577045 586704 593037
58656 593037 595705 595048 591508 585930 579828 574458 569871 565448 561056 557031 553442 550114 547089 544381
58642 544381 541571 538330 535061 532304 529810 527119 524797 524125 525565 528385 531824 535682 539583 542518
58628 542518 543631 543064 541713 540468 539781 539618 539635 539582 539508 539522 539634 540112 541629 544645 549010 554619 561972
58611 561972 571387 581973 592176 601198 609242 616616 623298 629170 633915 636911 638012 638291 639008 639958
58597 639958 639745 637760 634910 632297 630100 628029 625991 623956 621939 620454 620434 622343 625984 631298 638658
58582 638658 648083 658849 670211 681882 693485 704228 713595 721813 729186 735477 740438 744568 748891
58569G48891N323O705Q191R507J0596J2001J4403J7654K0827K3229K4886K6007
58557I28220K6524K6258K5090K2807J9174J4357R055M126J45k760m785o176p018
58544A055017p387p645q318r648j1508j3741j6190j8479k0192k1284k1925k2007
58532H76693k1352k0274j9228j8000j6047j3583j1405r625p642n428l727k701
58520G27681j663m91M9j08J82J433K494K336J566J231J261J354K174M210O349
58505G50058P089O560N958N552M731L525K628K085J305K10p57j574k568l564m073
58490G77165m163m176l928l093k035j228k97J321L202M583N836P965J0882J3471
58476H05505J5228J6564J7457J7119J5236J2421R208N542J502k350n612q317j0402
$$ plain form
58569 748891 754214 760919 769110 778617 789213 801214 815617 833271 854098 877327 902213 928220
58557 928220 954744 981002 1006092 1028899 1048073 1062430 1071485 1075611 1075756 1072996 1068211 1062035 1055017
58544 1055017 1047630 1039985 1031667 1022019 1010511 996770 980580 962101 941909 920625 898700 876693
58532 876693 855341 835067 815839 797839 781792 768209 756804 747179 739537 734109 730382 727681
58520 727681 726018 725527 725576 725468 725650 727083 729577 731913 733479 734710 735971 737325 739499 743709 750058
58505 750058 757147 763707 769665 775217 779948 783473 786101 788186 789491 789701 788944 787370 784802 781238 777165
58490 777165 773002 768826 764898 761805 759770 758542 758245 759566 762768 767351 773187 781152 792034 805505
58476 805505 820733 837297 854754 871873 887109 899530 908738 914280 915782 913432 907820 899503 889101
58463H89101j1580j1804j1369j0454r039p141m751j796J416M155O159P994R877
58450H50768J0874J0118Q137N988L680O17k893n843p887r360j0162r800q370o477
58436H29390m439k374o69N62J979L885N288N364N164O319Q572J0281J1120J2402
58422H92844J4722J6916J7612J6450J3674R857O088L115K80l340o912q580q163
58409I64563p435p476p511o796n960n671n442m603l386k286j269k28N61R99J500
58394I09560K411L628M848N617N285L773K076J103L27j213k981l518k703j844
58380I26369j496q86L14J298J653K078K931L472L135K465K253K703L845N721P806
58365I63661R186R658R927J0589J1683J3106J4541J5216J4787J4141J4165J4192
$$ plain form
58463 889101 877521 865717 854348 843894 834855 827714 822963 821167 822583 826738 832897 840891 850768
58450 850768 861642 871760 879897 885885 889565 890182 887289 881446 873559 864199 854037 844237 835867 829390
58436 829390 824951 822577 821908 822470 824449 828334 833622 838986 844150 850469 859041 869322 880442 892844
58422 892844 907566 924482 942094 958544 972218 982075 988163 991278 991558 988218 981306 972726 964563
58409 964563 957128 949652 942141 935345 929385 923714 918272 913669 910283 907997 906728 906500 907061 908060 909560
58394 909560 911971 915599 920447 926064 931349 935122 937198 938301 938628 937415 934434 930916 928213 926369
58380 926369 924873 923987 924301 925599 927252 929330 932261 935733 938868 941333 943586 946289 950134 955855 963661
58365 963661 972847 982505 992432 1003021 1014704 1027810 1042351 1057567 1072354 1086495 1100660 1114852
58353A114852J2940J0596Q385O580M605K733J852J792J733J996L468N544O739
58340A183815P211Q460J0633J2487J3854J5684J7579J8041J7416J7790J9440K0171
58328A362581J8973J7484J6857J5926J3671J0984Q657O051L134J552K159L540
58316A481569M302M922O056P071P562Q424J0153J1889J3181J4838J7073J8791
58304A605831J9649K0698K2151K2791K2415K2455K3226K3175K1901K1086K1345
58293A846723K1010J9509J8874K0233K1767K1987K2087K3156K3990K3876K4556
58282B087768K7117K9649L0488L1124L3454L6654L9329M2217M6205N0005N2332
58271B506342N4095N6115N7137N6525N6310N8121O0578O2230O4343O8197P2367
$$ plain form
58353 1114852 1127792 1138388 1146773 1153353 1157958 1160691 1162543 1164335 1166068 1168064 1171532 1177076 1183815
58340 1183815 1191026 1199486 1210119 1222606 1236460 1252144 1269723 1287764 1305180 1322970 1342410 1362581
58328 1362581 1381554 1399038 1415895 1431821 1445492 1456476 1465133 1471184 1474318 1475870 1478029 1481569
58316 1481569 1485871 1490793 1496849 1503920 1511482 1519906 1530059 1541948 1555129 1569967 1587040 1605831
58304 1605831 1625480 1646178 1668329 1691120 1713535 1735990 1759216 1782391 1804292 1825378 1846723
58293 1846723 1867733 1887242 1906116 1926349 1948116 1970103 1992190 2015346 2039336 2063212 2087768
58282 2087768 2114885 2144534 2175022 2206146 2239600 2276254 2315583 2357800 2404005 2454010 2506342
58271 2506342 2560437 2616552 2673689 2730214 2786524 2844645 2905223 2967453 3031796 3099993 3172360
58260C172360P5453P8657Q2936Q6452Q7688Q8196Q9346Q9531Q7738Q6564Q8332
58249D113253R1391R3734R6943J02853J09698J15511J22027J31095J40639J48372
58239E265516J56164J66319J76976J85818J94817K06489K19029K30207K42482
58230G043817K58926K77611K95504L14324L36911L61480L85461M11318M42555
58221A0127907M77751N14621N55807O04312O57738P13716P76128Q48962R29626
58212A6206568J016109J114801J232836J369138J522173J699244J907752K145322
58204B8213943K410917K718570L088482L534252M073269M739534N570342O592118
58196F0941427P837439R362367J1227711J3484183J6204813J9509222K3518615
$$ plain form
58260 3172360 3247813 3326470 3409406 3495858 3583546 3671742 3761088 3850619 3938357 4024921 4113253
58249 4113253 4204644 4298378 4395321 4498174 4607872 4723383 4845410 4976505 5117144 5265516
58239 5265516 5421680 5587999 5764975 5950793 6145610 6352099 6571128 6801335 7043817
58230 7043817 7302743 7580354 7875858 8190182 8527093 8888573 9274034 9685352 10127907
58221 10127907 10605658 11120279 11676086 12280398 12938136 13651852 14427980 15276942 16206568
58212 16206568 17222677 18337478 19570314 20939452 22461625 24160869 26068621 28213943
58204 28213943 30624860 33343430 36431912 39966164 44039433 48778967 54349309 60941427
58196 60941427 68778866 78141233 89368944 102853127 119057940 138567162 162085777
58189A62085777K8299118L3825701L9790444M5140316M7762337M5046727L5395374
58182D37345794J9606178Q57843j6811602l0339594l8537043m1824156m1435767
58175B88861653l8736374l4854229l0570245k6356807k2470889j9028425j6050289
58168A00794395j3506766j1356733r558029q060278o810784n769205m906444m193044
58160C6633112l600092l107884k702330k365643k080506j839707j640984j474943
58152A7821023j328003j194688j077080r73959q79848p93424p17702o52104n92151
58143I612064n36538m87647m45870m09817l80848l60661l45397l28677l09580
58134F007029k91639k75247k57489k38569k21834k07666j93325j78734j66619
$$ plain form
58189 162085777 190384895 224210596 264001040 309141356 356903693 401950420 437345794
58182 437345794 456951972 457809815 440998213 410658619 372121576 330297420 288861653
58175 288861653 250125279 215271050 184700805 158343998 135873109 116844684 100794395
58168 100794395 87287629 75930896 66372867 58312589 51501805 45732600 40826156 36633112
58160 36633112 33033020 29925136 27222806 24857163 22776657 20936950 19295966 17821023
58152 17821023 16493020 15298332 14221252 13247293 12367445 11574021 10856319 10204215 9612064
58143 9612064 9075526 8587879 8142009 7732192 7351344 6990683 6645286 6316609 6007029
58134 6007029 5715390 5440143 5182654 4944085 4722251 4514585 4321260 4142526 3975907
58125C975907j57044j47294j37188j29312j23805j17931j10992j04995j00318
58116B847028r5291r0066q6445q3804p9612p4067o9930o7638o4925o1379n9046
58105B014825n8154n6547n3719n1423m9797m7022m3291m0942l9922l7259l2077
58094A504672k7246k4696k2859k0222j8060j7854j8780j9453j9801j9874j9100
58083A276727j7904j7968j9793k1919k3229k4051k4427k3629k2127k1745k2949
58072A036986k3954k3400k2042k0928j9821j8280j6729j5579j4637j3865j3433
58061H34318j2811j1293r567r149j0121j1091j1445j1903j2700j3061j2753j2458
58049F95966j2342j1807j0814r882q773o839m676l630l759m000m284n470p159
$$ plain form
58125 3975907 3818863 3671569 3534381 3405069 3281264 3163333 3052341 2947346 2847028
58116 2847028 2751737 2661671 2575226 2491422 2411810 2337743 2267813 2200175 2135250 2073871 2014825
58105 2014825 1956671 1900124 1846405 1794982 1745185 1698163 1654872 1613930 1574008 1536749 1504672
58094 1504672 1477426 1452730 1429871 1409649 1391589 1373735 1354955 1335502 1315701 1295827 1276727
58083 1276727 1258823 1240855 1221062 1199143 1175914 1151863 1127436 1103807 1081680 1059935 1036986
58072 1036986 1013032 989632 967590 946662 926841 908561 891832 876253 861616 847751 834318
58061 834318 821507 810214 800647 791498 781377 770286 758841 746938 734238 721177 708424 695966
58049 695966 683624 671817 661003 651121 642348 635509 630833 627203 623444 619444 615160 609690 602531
58036F02531p725o736n469m785m375m277n150o715p823q326r058r849r586q455
58022E04202p978q425q297o954n698n569n877n670m965l986k767j938k255l073
58008D30750k949j993j686k185j974o58J52m27j117o89K89Q99J294J735J897J995
57992D25333K963M691N705N426N035N289N335M557L802L622L057J442j98q04r59
57977D74296j600k433k847l257m235n356n959o143o123n653m839m394m384l983
57963D13090l141l016l935m448l476j960j256j286j386j653k211k458k249k604
57949C78011l972m950m164k270q02m0O64J401K014K967M552N952O405O591P653
57934D00012R487J1172J2361J3101J2976J1635R605P526N175K253o25k769m523
$$ plain form
58036 602531 594806 588070 582601 577816 573441 569164 564014 557299 549476 541150 532092 522243 512657 504202
58022 504202 496224 487799 479502 472548 466850 461281 455404 449734 444769 440783 438016 436078 433823 430750
58008 430750 427801 425808 424122 421937 419963 419305 419457 419030 417913 417224 417513 418412 419706 421441 423338 425333
57992 425333 428296 432987 438692 444118 449153 454442 459777 464334 468136 471758 474815 476257 476059 475255 474296
57977 474296 472696 470263 467416 464159 459924 454568 448609 442466 436343 430690 425851 421457 417073 413090
57963 413090 409949 406933 402998 398550 395074 393114 391858 390572 389186 387533 385322 382864 380615 378011
57949 378011 374039 369089 364925 362655 361853 361813 362477 363878 365892 368859 373411 379363 385768 392359 400012
57934 400012 409499 420671 433032 446133 459109 470744 480349 487875 493050 495303 494678 491909 487386
57921D87386o482q311r463j0313j1443j2435j2609j2309j2244j2067j0919r006
57909C59785p405o600o211n932n716n332m621l941l649l522l328l374l782l892
57895B92480l285k671k806l159k760j721q02qJ200K637L544L772L801L759L397
57880B97378K826K357J795P39o10j674k279k552k396j802j296j258j202n24L78
57865B89880O19K15O2O59J683K662L447M063M597N138N544N618N680O373P520
57850C43760P963P017N312L706K211O35o66j477k333l544m467m639m766n582o528
57835C36602o668o157n685n197m364l549l114k423q59Q08J508J685K521L881M602
57820C13591M530M644N293N787N811N721N335L881J372j185l278n411p844r827
$$ plain form
57921 487386 480904 472593 463130 452817 441374 428939 416330 404021 391777 379710 368791 359785
57909 359785 352380 345780 339569 333637 327921 322589 317968 314027 310378 306856 303528 300154 296372 292480
57895 292480 289195 286524 283718 280559 277799 276078 275276 275268 276468 279105 282649 286421 290222 293981 297378
57880 297378 300204 302561 304356 305095 304485 302811 300532 297980 295584 293782 292486 291228 290026 289502 289880
57865 289880 290499 290714 290776 291435 293118 295780 299227 303290 307887 313025 318569 324187 329867 336240 343760
57850 343760 351723 358740 364052 367758 369969 370604 369938 368461 366128 362584 358117 353478 348712 343130 336602
57835 336602 329934 323777 318092 312895 308531 304982 301868 299445 298586 299394 300902 302587 305108 308989 313591
57820 313591 318121 322765 328058 333845 339656 345377 350712 354593 355965 354780 351502 346091 338247 328420
57806C28420j0578j0261r632r191q897q327p165n817n206n476n558m614l263k507
57792B31928k217j775j441j753k131j612n39m6j05K78J160J637J693K282L431
57777B30790M017L887M415O218P887P890O556N163M077K829J345O8q76j882l331
57762B79053n144o720p312o847o209o232o630o535n841n127m487l532k441j861
57748B04135j695j164k23K40j10n36n28m91o95o47j17J96k80j088j463j296p89
57731A93449K5Q69J047L51m13l99K47Q47J141J249J145P85M14L72O88J203J745
57714B04765K061J918J485J164R64M32o10j769k666l267l466k936j746o35k79
57699A95415n16n81Q4J295K246K133R93k15n97k77j1j75o52j367k192k542j908
$$ plain form
57806 328420 317842 307581 297949 288758 279861 271534 264369 258552 253346 247870 242312 237698 234435 231928
57792 231928 229711 227936 226495 224742 222611 220999 220460 220414 220309 220587 221747 223384 225077 227359 230790
57777 230790 234807 238694 243109 249327 257214 265104 271660 276823 280900 283729 285074 285142 284266 282384 279053
57762 279053 273909 267189 259877 253030 246821 240589 233959 227424 221583 216456 211969 208437 205996 204135
57748 204135 202440 201276 201053 201293 201183 200647 200119 199628 198933 198286 198169 198365 198085 196997 195534 194238 193449
57731 193449 193474 194343 195390 195741 195328 194929 195176 196023 197164 198413 199558 200343 200757 201129 201817 203020 204765
57714 204765 206826 208744 210229 211393 212357 212789 212179 210410 207744 204477 201011 198075 196329 195694 195415
57699 195415 194899 194318 194402 195697 197943 200076 201069 200854 200257 199980 199969 199794 199142 197775 195583 193041 191133
57682A91133o97K68J013K343M516O830Q754J0612J2951J5921J9554K4046K9577
57669C26821L6336M4912N5957O8830Q0408Q5206P7345N4278J9958j6198m5017
57658G88836o2698p0461p0762o5571n7373m9033m1879l5382k9209k4132k0452
57647B61884j7157j3493j0150q018o780n596m285l084j980j015n64o82q10n97
57633A87673l97n00n38j97J93K10r8n19j013j413j426j159j047j136j083r41j098
57616A75511j435j427j123j055j175r61n75p02j140r75k59p0n79p05j15J18m54
57599A62879p07R9R73R04M09K81J49n00j115j186j384k331l304l419l093l008
57583A45647k760j885j224j711k667k746j915j080n09k2l7q52j575j225l83k58
$$ plain form
57682 191133 190436 190704 191717 194060 198576 205406 214160 224772 237723 253644 273198 297244 326821
57669 326821 363157 408069 464026 532856 613264 698470 775815 830093 850051 833853 788836
57658 788836 726138 655677 584915 519344 461971 412938 371059 335677 306468 282336 261884
57647 261884 244727 231234 221084 213066 206286 200690 196405 193321 191341 190326 189762 189080 188270 187673
57633 187673 187276 186776 186238 186041 186234 186444 186346 185827 184814 183401 181975 180816 179769 178633 177550 176609 175511
57616 175511 174076 172649 171526 170471 169296 168335 167760 167058 165918 164943 164684 164614 164035 163330 163215 163333 162879
57599 162879 162172 162271 163244 164148 164557 164838 164987 164487 163372 162186 160802 158471 155167 151748 148655 145647
57583 145647 142887 141002 139778 138067 135400 132654 130739 129659 129150 129128 129091 128239 126664 125439 125056 124798
57567A24798p65r71r17j299j824j603q59n54n52J24J322J838J465J180J210O33
57551A23226o69j395p60L45Q21P45O43M95J81k7n1l00p82p04L77J754K455K394
57533A28748K044J485M62r08k008k304j789r40k59J88O98J324J583J144M22Q3
57517A29973K47O22J127J743K061J656P41l7l04j0Q13J746J865P84n95j078o80
57500A40674l04l03l65m64q91j431j628j763k446l271l073j714m91m25j114j625
57484A19366j675j445j085p80p34p00j44Q41J422J134M61O2k9j03k71n54r97j329
57466A13440j050j50O76Q38N66M81P85J111R96L25n22r29o15M2M51M25K07J15
57448A17192M48J371K475K811J954P19J99L42K84j88l61J52Q06R23M98k3k73j68
$$ plain form
57567 124798 124033 123062 122145 120846 119022 117419 116560 116006 115454 115578 116900 118738 120203 121383 122593 123226
57551 123226 122557 121162 120402 120747 121568 122313 122956 123451 123632 123605 123554 123254 122472 121768 122145 123899 126354 128748
57533 128748 130792 132277 132739 131831 129823 127519 125730 124790 124531 124719 125417 126741 128324 129468 129890 129973
57517 129973 130220 130842 131969 133712 135773 137429 138170 138133 137829 137819 138632 140378 142243 143027 142432 141354 140674
57500 140674 140370 140067 139702 139238 138347 136916 135288 133525 131079 127808 124735 123021 122530 122105 120991 119366
57484 119366 117691 116246 115161 114381 113647 112947 112803 113644 115066 116200 116661 116723 116694 116591 116320 115766 114769 113440
57466 113440 112390 112240 112916 113754 114320 114801 115586 116697 117693 118018 117496 116567 115952 115994 116445 116870 117077 117192
57448 117192 117640 119011 121486 124297 126251 126970 127169 127511 127795 127607 127246 127398 128204 129127 129625 129602 129329 129161
57430A29161K7j46o84q67j95O62O22k44p64l18M33O48L70J01n5l63q88j294j168
57411A25038n17M0j15o46m88O58J632J303J70m26k21r2n18j040j243j164p46J59
57393A21784J177J651J600J585J667J397Q81Q09J330J801J836J708J591J320J009
57378A43146R89J011N36j24k2Q08J221P23K01L34N71L07%K25N68M58K98P57J481
57359A53488J584J094R08J359J706J239K91j29M74J538K093J840J397J397J777
57344A72056K129K327K331J874J056P35J427K157J549j07j087n26O77J415J600
57329A89613J511J131O50O15J021J103N53R4L55R56J310J482J699J647R78J6n41
57312B04193k98P35K116K980K696J757J336J787K406K738L150L820M212M016L637
$$ plain form
57430 129161 129188 129042 128358 127491 127296 127958 128580 128336 127572 127254 127687 128335 128705 128806 128751 128388 127500 126206 125038
57411 125038 124521 124561 124446 123800 123312 123970 125602 126905 127075 126649 126428 126336 125818 124778 123535 122371 121625 121784
57393 121784 122961 124612 126212 127797 129464 130861 131742 132551 133881 135682 137518 139226 140817 142137 143146
57378 143146 144135 145146 145682 145558 145536 146344 147565 148288 148489 148823 149394 149701 149701 149926 150494 150952 151250 152007 153488
57359 153488 155072 156166 157074 158433 160139 161378 161669 161540 162014 163552 165645 167485 168882 170279 172056
57344 172056 174185 176512 178843 180717 181773 182508 183935 186092 187641 187534 186447 185921 186598 188013 189613
57329 189613 191124 192255 192905 193520 194541 195644 196197 196291 196646 197602 198912 200394 202093 203740 204718 204734 204193
57312 204193 203895 204630 206746 209726 212422 214179 215515 217302 219708 222446 225596 229416 233628 237644 241281
57297B41281L351K856K154J860K212K660K940L399L891L548K426K005L135M599
57283B82317M845M128L735L939L989L616L249L109L074L156L306L155K677K639
57269C30934L545M695N091M854M867N525O615P956R334J0225J0406J0411J0730
57256D25188J0994J0782J0533J0879J1535J1826J1812J2038J2574J3204J4042
57245E55407J5100J5779J5684J5471J5963J6972J7933J8990K0272K0796J9694
57234G48061J8056J7948J9636K1305K1607K0978K0222J9337J8309J7717J7862
57223I61038J8127J7949J7618J7576J7598J7292J6842J6668J6713J6599J6282
57212A150302J6075J6166J6465J6863J7445J8324J9355K0135K0473K0699K1231
$$ plain form
57297 241281 244632 247488 249642 251502 253714 256374 259314 262713 266604 270152 272578 274583 277718 282317
57283 282317 287162 291290 295025 298964 302953 306569 309818 312927 316001 319157 322463 325618 328295 330934
57269 330934 334479 339174 344265 349119 353986 359511 366126 374082 383416 393641 404047 414458 425188
57256 425188 436182 446964 457497 468376 479911 491737 503549 515587 528161 541365 555407
57245 555407 570507 586286 601970 617441 633404 650376 668309 687299 707571 728367 748061
57234 748061 766117 784065 803701 825006 846613 867591 887813 907150 925459 943176 961038
57223 961038 979165 997114 1014732 1032308 1049906 1067198 1084040 1100708 1117421 1134020 1150302
57212 1150302 1166377 1182543 1199008 1215871 1233316 1251640 1270995 1291130 1311603 1332302 1353533
57201A353533K1846K1880K1217K0519K0274K0305K0491K1189K2488K3737K4509
57190A591988K5314K6706K8319K9547L0596L1914L3135L3560L3292L2933L2524
57179A929828L1798L1114L1104L1589L1825L1651L1401L0873K9512K7558K5969
57168B264222K5156K4726K4522K4900K5836K6692K7086K7272K7437K7405K7219
57157B552473K7278K7704K8119K8265K8316K8483K8833K9457L0443L1665L2985
57146B874021L4461L5932L6831L6997L7121L7683L7991L7251L6004L5302L4802
57135C274396L3161L0235K7487K6023K5566K5640K6546K8644L1682L5258L9074
57124C603712M2463M4526M5126M4954M4401M3331M2191M2289M4474M8306N2978
$$ plain form
57201 1353533 1375379 1397259 1418476 1438995 1459269 1479574 1500065 1521254 1543742 1567479 1591988
57190 1591988 1617302 1644008 1672327 1701874 1732470 1764384 1797519 1831079 1864371 1897304 1929828
57179 1929828 1961626 1992740 2023844 2055433 2087258 2118909 2150310 2181183 2210695 2238253 2264222
57168 2264222 2289378 2314104 2338626 2363526 2389362 2416054 2443140 2470412 2497849 2525254 2552473
57157 2552473 2579751 2607455 2635574 2663839 2692155 2720638 2749471 2778928 2809371 2841036 2874021
57146 2874021 2908482 2944414 2981245 3018242 3055363 3093046 3131037 3168288 3204292 3239594 3274396
57135 3274396 3307557 3337792 3365279 3391302 3416868 3442508 3469054 3497698 3529380 3564638 3603712
57124 3603712 3646175 3690701 3735827 3780781 3825182 3868513 3910704 3952993 3997467 4045773 4098751
57113D098751N8273O4356P1378P9698Q9627J00738J12207J24166J37842J54328
57103E091364J74213J98715K29809K68752L15555L70706M36312N14762O07275
57094H207463P14496Q37424R76501J130523J297469J475754J663153J854259K039217
57085B0196259K204235K332578K405861K405751K315230K119730J811069J394906
57077C7185619Q96272L56428j78555o70099j093843j439949j709339j908488k045264
57068B9392782k127236k161532k154437k110864k034994j931701j806970j666999
57060A3398049j517693j365056j215162j073131r42231q23998p18753o25941n44600
57051D571484m73924m13219l61343l16642k77618k43439k13695j88040j66031
$$ plain form
57113 4098751 4157024 4221380 4292758 4372456 4462083 4562821 4675028 4799194 4937036 5091364
57103 5091364 5265577 5464292 5694101 5962853 6278408 6649114 7085426 7600188 8207463
57094 8207463 8921959 9759383 10735884 11866407 13163876 14639630 16302783 18157042 20196259
57085 20196259 22400494 24733072 27138933 29544684 31859914 33979644 35790713 37185619
57077 37185619 38081891 38438319 38259764 37589665 36495822 35055873 33346534 31438046 29392782
57068 29392782 27265546 25104014 22949577 20838713 18803719 16872018 15065048 13398049
57060 13398049 11880356 10515300 9300138 8227007 7284776 6460778 5742025 5116084 4571484
57051 4571484 4097560 3684341 3322998 3006356 2728738 2485299 2271604 2083564 1917533
57042A917533j47026j30162j14900j01415q9859p9356o8581n7378m6667l6491
57032A045698k5447j2601J865J9134M2197O9761R0204Q6853N2969J39n0550q4789
57020A235433j01343j05559j01856r3010q1998p1219o1195n1955m4584l9845l6447
57009D46422l2480k7842k3841k0976j8632j6516j4906j3725j2658j1981j2071
56998B40794j2269j1449r640p871o524n060l317j825o86O21K143L269L974N146
56984A97306P303R870J1935J2862J1912Q400K820l007p436j0127j1482j1785j1292
56971B07279j0416r278p639n616l863k723j735l36J512L664O175R076J2210J5522
56957B13832J8857K1314K1432J8440J2830N609k258r491j4509j6586j6533j5697
$$ plain form
57042 1917533 1770507 1640345 1525445 1424030 1334171 1254815 1186234 1128856 1082189 1045698
57032 1045698 1020251 1007650 1009515 1028649 1070846 1140607 1230811 1317664 1370633 1370772 1320222 1235433
57020 1235433 1134090 1028531 926675 833665 751667 680448 619253 567298 522714 482869 446422
57009 446422 413942 386100 362259 341283 322651 306135 291229 277504 264846 252865 240794
56998 240794 228525 217076 207436 199565 193041 187981 184664 182839 182153 182774 184917 188186 192160 197306
56984 197306 204609 214479 226414 239276 251188 259588 262408 259401 251965 241838 230356 218571 207279
56971 207279 196863 187585 179946 174330 170467 167744 166009 165673 167185 170849 177024 186100 198310 213832
56957 213832 232689 254003 275435 293875 306705 312314 310056 300565 286056 269470 252937 237240
56945B37240j4651j3164j1046q501n964l827k134l28K293N752R322J2419J5217
56932B22628J8270K1789K5179K6848K4738J7846P464l626j3154k0181k4350k5501
56920B77950k4256k1969j9653j7434j5224j3222j1515r905q398p263o471n628
56908A17012m584l528k501j534j111j545k029j388J73J283J455J629K402L179
56894A08913L594M349N928P697R167J1004J3805J6901J9357K1117K2123K1230
56882B65185J7367J1185M453j718o991j0787j2442j2218j1023r251o744l765j073
56869B22178J033L111N878R550J3812J8136K2193K6275L1018L6498M1742M5087
56857D76511M4619L8533K6337J0205n770j8369k6844l1678l3026l1141k7213k2545
$$ plain form
56945 237240 222589 209425 198379 189878 183914 180087 177953 177625 179918 185670 194992 207411 222628
56932 222628 240898 262687 287866 314714 339452 357298 364762 361136 347982 327801 303451 277950
56920 277950 253694 231725 212072 194638 179414 166192 154677 144772 136374 129111 122640 117012
56908 117012 112428 108900 106399 104865 103754 102209 100180 98792 98965 100248 101703 103332 105734 108913
56894 108913 112507 116856 122784 130481 139648 150652 164457 181358 200715 221832 243955 265185
56882 265185 282552 293737 298190 296472 289481 278694 266252 254034 243011 233760 227016 223251 222178
56869 222178 223211 226322 232200 241750 255562 273698 295891 322166 353184 389682 431424 476511
56857 476511 521130 559663 586000 596205 590435 572066 545222 513544 480518 449377 422164 399619
56845C99619j7440j1726n809k37N216J1188J7815K4914L2592M0953M9722N8786
56833F05593O8089P5804P7410O8282M7681J9669r548l4569n2150o1625o4506o2903
56821F77227n8057n0708m2305l4681k8444k2660j6271r140j671N927J3690K1725
56809D54632L0137L8866M7382N4402N7558N3597M0172J8479o298k8023m3235n1738
56797F65931n4747n3539m9479m4051l8340l2807k7497k2219j6808j1516o838k640
56785C05450J900P148J2484J7385K2168K6789K9629K8471K2350J1970r88j4109
56773D70647k4630l0932l3493l3664l2105k9215k6119k3807k1746j8747j4958
56762A81231j1719r624q103o700n491m332k972j987k286l541m352m170l829l897
$$ plain form
56845 399619 382179 370453 364644 364407 369623 380811 398626 423540 456132 497085 546807 605593
56833 605593 673682 749486 826896 895178 942859 962528 952980 918411 866261 804636 740130 677227
56821 677227 619170 568462 526157 491476 463032 440372 424101 414961 413290 419217 432907 454632
56809 454632 484769 523635 571017 625419 682977 736574 776746 795225 788927 760904 717669 665931
56797 665931 611184 557645 508166 464115 425775 392968 365471 343252 326444 314928 308090 305450
56785 305450 307350 314498 326982 344367 366535 393324 422953 451424 473774 485744 484756 470647
56773 470647 446017 415085 381592 347928 315823 286608 260489 236682 214936 196189 181231
56762 181231 169512 159888 151785 145085 139594 135262 132290 130303 128017 124476 120124 115954 112125 108228
56748A08228l748k820j703j293j587j910j816j307o42j98j68k69j36R8J15J19
56732I0963M94Q55L65q65j619j131m8N46L91m6l64m60l18NL40N96Q27J115J460
56713I3106J824K096K072J689J122O00L01L86Q10J064O70Q1K68J232J757J101
56697A10179k6p51j247j831j905r67J88N36M32Q22J483J490R07N66M15k75j208
56680A08808j206j13Q73J050R71J076R35L01k34k34q2j76k39J13P81J410J689
56663A15723J290K18p59p47J11Q14Q42N86M87N47O82Q38P48K79j37j19j2j70n
56644A21216J127K504K806K087J629J897K063J614J019O32K59O5N71J423J555
56629A42467R18O95J322J665Q24m81j051p70k95JQ0o5k41j81j05n15j270j605
$$ plain form
56748 108228 104480 101660 99957 98664 97077 95167 93351 92044 91402 91204 91036 90767 90631 90729 90844 90963
56732 90963 91457 92312 92677 91812 90193 89062 89014 89560 89951 89905 89541 89081 88763 88768 89108 89704 90531 91646 93106
56713 93106 94930 97026 99098 100787 101909 102509 102810 103196 104006 105070 105740 105821 106089 107321 109078 110179
56697 110179 110153 109402 108155 106324 104419 103452 103640 104176 104608 105430 106913 108403 109310 109876 110291 110016 108808
56680 108808 107602 107489 108362 109412 110383 111459 112394 112695 112461 112227 112145 111969 111730 111843 112624 114034 115723
56663 115723 117013 117231 116472 115725 115836 116650 117492 118078 118565 119112 119794 120632 121380 121659 121522 121403 121391 121221 121216
56644 121216 122343 124847 127653 129740 131369 133266 135329 136943 137962 138594 138853 138918 139489 140912 142467
56629 142467 143385 144080 145402 147067 147891 147410 146359 145589 145294 145295 145375 145310 145069 144888 144783 144268 142998 141393
56611A41393j270p82m67j45J14l3k78J45J117J547R67J92QK21L85M98O33O98P70
56592A45713Q58L49j174k702k752j559p61q32n88M17J039P41O81J478J780M93
56576A43181j152j382n37j60m16j52R68K061K578K901L417M023M557M969N185
56561A70041N343N938P190Q584R547J0141J0585J0545R565P865O222N255N125
56548B71946N559N881N374L960K205O62m10q55q84j311k640m064m391l905l979
56533B73148m873n387m954m501m744n129n154n261n668n690n077m732n132n301
56519B01545m381l070k461k510k638k803k951k489j388q03j412k155j759o41l7
56504A70047p7m7J58J34NJ59L25j9p12j197j348j292r22k97Q9P7K19P40J027P37
$$ plain form
56611 141393 140123 139341 138874 138729 138843 138810 138532 138677 139794 141341 142308 142500 142508 142729 143114 143612 144245 144943 145713
56592 145713 146571 146920 145746 143044 140292 138733 137972 137140 136552 136969 138008 138749 139430 140908 142688 143181
56576 143181 142029 140647 140110 139950 139534 139382 140350 142411 144989 147890 151307 155330 159887 164856 170041
56561 170041 175384 181322 188512 197096 206643 216784 227369 237914 247479 255344 261566 266821 271946
56548 271946 277505 283386 288760 292720 294925 295587 295177 294322 293438 292127 289487 285423 281032 277127 273148
56533 273148 268275 262888 257934 253433 248689 243560 238406 233145 227477 221787 216710 211978 206846 201545
56519 201545 197164 194094 191633 189123 186485 183682 180731 178242 176854 176051 174639 172484 170725 170084 170047
56504 170047 169970 169923 170081 170215 170220 170379 170704 170685 169973 168776 167428 166136 165214 164917 165006 165083 165302 166042 167069 167806
56484A67806M62N26K45o84j174l28R86J402R94O63L98m03j452j835j399o88R6
56467A65615J026J709J649J082O26M55N66J208K264K844K354J333N28o7n51m69
56451A82172K05N12J0k80M40J171O68m15n54L20J105J480J873K024J276N6n07
56434A91556l21k53n73o76l42j9N6J6j73n33o84m36k97n30l72P11J777J657P66
56415A91330L68O62R63J196J743K215J917J217J054J357J236N17j83n95p92m49
56399B03756O17J569J511R30Q13R22L91m13l26N10P03k18j149j097j68J141K410
56382B11902L015K540J540R77R97J150J403J914K223J861J392J629K201K169J552
56367B38465J003M20o22j552j437o17k23l42j98J75M2m60m96j48k15n11j2J276
$$ plain form
56484 167806 168268 168794 169039 168355 167181 166853 167839 169241 170235 170898 171296 170893 169441 167606 166207 165519 165615
56467 165615 166641 168350 169999 171081 171707 172162 172728 173936 176200 179044 181398 182731 183259 183192 182641 182172
56451 182172 182377 182889 182899 182619 183059 184230 184898 184483 183929 184249 185354 186834 188707 190731 192007 192063 191556
56434 191556 191235 190982 190409 189733 189391 189372 189428 189444 189271 188738 188054 187618 187321 186791 186419 187130 188907 190564 191330
56415 191330 191698 192360 193323 194519 196262 198477 200394 201611 202665 204022 205258 205775 205592 204997 204205 203756
56399 203756 204373 205942 207453 208383 209196 210118 210509 210096 209770 210280 210983 210765 209616 208519 208351 209492 211902
56382 211902 214917 217457 218997 219974 220971 222121 223524 225438 227661 229522 230914 232543 234744 236913 238465
56367 238465 239468 239888 239266 237714 236277 235660 235437 235095 234897 235072 235114 234654 234158 234010 233795 233284 233272 234548
56349B34548K168K171J970J942J607P66m4m07k92M39J642K344J856J109J499K686
56333B56004L072K262J425J306J455J456J461J459J314J423K096K579K042J173
56319B80527J155J570J072j97p77l15J40J97N47J242J483J272J402J715J214O6
56303B92313m11O9M99P11J724L536M612M191L300K794K199J184N59R56J824K433
56287C22493K707K672K251J916K319L076L228K941L314M429N130M939M575M435
56273C70425M124L747M092N258O542P673Q762R160Q186O837O891Q336R639J0478
56259D70150J2028J4453J6491J7842J9664K2183K4185K5522K7842L1914L6393
56248G18667M0134M3715M7736N1509N4493N7269O0050O1845O1973O0908N8822
$$ plain form
56349 234548 236716 238887 240857 242799 244406 245172 245128 244721 244429 244868 246510 248854 250710 251819 253318 256004
56333 256004 259076 261338 262763 264069 265524 266980 268441 269900 271214 272637 274733 277312 279354 280527
56319 280527 281682 283252 284324 284127 283350 283035 283175 283372 283919 285161 286644 287916 289318 291033 292247 292313
56303 292313 291902 291971 292470 293181 294905 298441 303053 307244 310544 313338 315537 316721 317280 318236 320060 322493
56287 322493 325200 327872 330123 332039 334358 337434 340662 343603 346917 351346 356476 361415 365990 370425
56273 370425 374549 378296 382388 387646 394188 401861 410623 419783 427969 434806 441697 450033 459672 470150
56259 470150 482178 496631 513122 530964 550628 572811 596996 622518 650360 682274 718667
56248 718667 758801 802516 850252 901761 956254 1013523 1073573 1135418 1197391 1258299 1317121
56237A317121N4894M8837M1593L3783K4912J4757M131o242j6205k5151l2155l7406
56225A422869m1981m6010m8692n0172n1407n2123n1062m8467m5986m3895m0861
56214I02213l6861l3695l1923k9922k6827k3921k2064k0241j7787j5776j4989
56203F28207j4567j3765j2959j2034r970p046n183n030m877l539k088j652j655
56190E33842j423j436j789j473k24Q09J108J447J898J484M71N23J793K473K018
56175E41521J970K769K762J499R10J903K829K742L095M682N985O218O825Q296
56161E94006Q710P414O814Q329R838R520R138J0787J3349J4949J6215J8349K0446
56148G47864K1614K3300K6896L1224L5029L9687M6851N5821O5753P8044R3647
$$ plain form
56237 1317121 1372015 1420852 1462445 1496228 1521140 1535897 1540028 1533786 1517581 1492430 1460275 1422869
56225 1422869 1380888 1334878 1286186 1236014 1184607 1132484 1081422 1032955 986969 943074 902213
56214 902213 865352 831657 799734 769812 742985 719064 697000 676759 658972 643196 628207
56203 628207 613640 599875 586916 574882 564912 557866 552683 547653 542776 539237 537149 535497 533842
56190 533842 532419 530983 529194 527721 527497 528306 529414 530861 532759 534243 534714 535237 537030 539503 541521
56175 541521 543491 546260 549022 550521 551431 553334 556163 558905 562000 566682 572667 578885 585710 594006
56161 594006 602716 610130 616944 625273 635111 644631 653769 664556 677905 692854 709069 727418 747864
56148 747864 769478 792778 819674 850898 885927 925614 972465 1028286 1094039 1172083 1265730
56137A265730J10233J24492J35046J40574J37993J25774J07223Q7650P0212N6715
56127B361642M9421M8464M9488M7186L9872K8486J3774k442j5766k2778k4794
56116B572553k5649k7787l3059m4432o2963q4719j03984j18074j26518j28053
56106A817315j21961j10727r7932q4908p1858o0235n0981m2542l3535k5469j9987
56095A097180j5764j1135p320n885n354l607j372o2J298L698N341M712L882N160
56081A070772P002O989O249P032Q481Q727Q744J0120J1496J1143J0538J1501J2488
56068A191282J1819J1557J3849J6414J6289J5076J5714J7082J6770J6285J8120
56057A360257K0533K0651K0006K1434K3197K2070J9593J9306K0231J9207J7307
$$ plain form
56137 1265730 1375963 1500455 1635501 1776075 1914068 2039842 2147065 2234715 2304927 2361642
56127 2361642 2411063 2459527 2509015 2556201 2596073 2624559 2638333 2635891 2620125 2597347 2572553
56116 2572553 2546904 2519117 2486058 2441626 2378663 2293944 2189960 2071886 1945368 1817315
56106 1817315 1695354 1584627 1486695 1401787 1329929 1269694 1218713 1176171 1142636 1117167 1097180
56095 1097180 1081416 1070281 1062961 1057076 1051722 1048115 1046743 1046681 1047979 1051677 1057018 1061730 1065612 1070772
56081 1070772 1077774 1084763 1091012 1098044 1106525 1115252 1123996 1134116 1145612 1156755 1167293 1178794 1191282
56068 1191282 1203101 1214658 1228507 1244921 1261210 1276286 1292000 1309082 1325852 1342137 1360257
56057 1360257 1380790 1401441 1421447 1442881 1466078 1488148 1507741 1527047 1547278 1566485 1583792
56046A583792J7666J9183J8795J7830J9691K3212K4831K5478K8676L3651L6979
56035A849784L9266M3520M8520N0633N0584N1755N3454N2659N0668N1095N2989
56024B394927N2923N2031N3832N6979N7595N6849N8857O2924O5466O7430P2007
56013C051820P7204P8940P9251Q3141Q9555R3984R7429J03782J11011J14559J16828
56002D097504J23436J32684J38968J43893J53053J64612J72506J78381J88410
55993E493447K00884K09522K16555K29424K46786K61545K75351K95643L20571
55984G749728L42089L62055L89441M23262M54942M85991N25986N74446O22811
55975A1930751O72997P35058Q07876Q82396R62477J061260J178573J305033J446830
$$ plain form
56046 1583792 1601458 1620641 1639436 1657266 1676957 1700169 1725000 1750478 1779154 1812805 1849784
56035 1849784 1889050 1932570 1981090 2031723 2082307 2134062 2187516 2240175 2290843 2341938 2394927
56024 2394927 2447850 2499881 2553713 2610692 2668287 2725136 2783993 2846917 2912383 2979813 3051820
56013 3051820 3129024 3207964 3287215 3370356 3459911 3553895 3651324 3755106 3866117 3980676 4097504
56002 4097504 4220940 4353624 4492592 4636485 4789538 4954150 5126656 5305037 5493447
55993 5493447 5694331 5903853 6120408 6349832 6596618 6858163 7133514 7429157 7749728
55984 7749728 8091817 8453872 8843313 9266575 9721517 10207508 10733494 11307940 11930751
55975 11930751 12603748 13338806 14146682 15029078 15991555 17052815 18231388 19536421 20983251
55966B0983251J621555J831443K068057K342003K678754L087558L568015M146106
55958D2326742M867671N758861O834311Q141389R749483J1702457J4041915J6872763
55950A20295592K0332276K4489392K9314884L4600101L9550197M2321986M0384787
55943C51289215L2032664J7939973J192807j4381406k6112190l3178067l6088383
55936B92694613l5889758l3693066l0455014k6851856k3274518j9936328j6956875
55929A05637198j4370498j2145304j0242504q640917p308193o192432n254643
55922D1482707m478779l843010l311031k858729k482377k173662j910897j680679
55914A8743543j485357j322994j180454j051361r41371q50642p68986o92637o28556
$$ plain form
55966 20983251 22604806 24436249 26504306 28846309 31525063 34612621 38180636 42326742
55958 42326742 47194413 52953274 59787585 67928974 77678457 89380914 103422829 120295592
55950 120295592 140627868 165117260 194432144 229032245 268582442 310904428 351289215
55943 351289215 383321879 401261852 402454659 388073253 361961063 328782996 292694613
55936 292694613 256804855 223111789 192656775 165804919 142530401 122594073 105637198
55929 105637198 91266700 79121396 68878892 60237975 52929782 46737350 41482707
55922 41482707 37003928 33160918 29849887 26991158 24508781 22335119 20424222 18743543
55914 18743543 17258186 15935192 14754738 13703377 12762006 11911364 11142378 10449741 9821185
55905I821185n77936n31723m86436m48624m19703l91457l60669l33901l13686
55896E957050k93600k70992k51547k37190k21842k03215j87055j75704j63728
55887C952177j48588j34995j25048j14697j03522r7796r9803j03499j04355j04506
55877B815368j04998j02146r5094q8449q4109p8659p1633o7838o8458o8208o4459
55866A921317o1066o0029n7542n1853m7158m5896m4554m0792l7626l6829l5053
55855A402919l0347k6080k4677k3549k0802j9095k0289k1973k2536k4181k7689
55844A141701k9672k8288k6431k6258k5742k3560k2135k2724k2647k0398j8550
55833H75296j8593j7927j5053j2773j3033j3311j1423r339r001q739p192o609
$$ plain form
55905 9821185 9243249 8711526 8225090 7776466 7356763 6965306 6604637 6270736 5957050
55896 5957050 5663450 5392458 5140911 4903721 4681879 4478664 4291609 4115905 3952177
55887 3952177 3803589 3668594 3543546 3428849 3325327 3227531 3127728 3024229 2919874 2815368
55877 2815368 2710370 2608224 2513130 2424681 2340572 2261913 2190280 2122442 2053984 1985776 1921317
55866 1921317 1860251 1800222 1742680 1690827 1643669 1597773 1553219 1512427 1474801 1437972 1402919
55855 1402919 1372572 1346492 1321815 1298266 1277464 1258369 1238080 1216107 1193571 1169390 1141701
55844 1141701 1112029 1083741 1057310 1031052 1005310 981750 959615 936891 914244 893846 875296
55833 875296 856703 838776 823723 810950 797917 784606 773183 763844 754843 746104 738912 732303
55821G32303q834j1763j2961j3250j3907j3924j2720j2031j2487j1872r256p146
55809E92152p183p395o171n113n414n251l403j727j389l31K639N046M878L991
55795E65329M424M794L417J712J371J151m74k330l022l589m891n228l487k042
55781E57135l551p329j1332j5131j8413j9333j7214j4397j2865j1284p918l802
55769D14566n56K250M840N022J334l817p061q068q245p648o001m640m684n001
55755C72291m356l746m307n007m749m667n934p314p349o942p330p540o421n120
55741B91509n007n000l623j881j480j843j508q53r75j403j343j572k746l519k667
55726B56089j564k105l746m871n412n817n208l129j423j772k903k758j799j523
$$ plain form
55821 732303 723469 711706 698745 685495 671588 657664 644944 632913 620426 608554 599298 592152
55809 592152 584969 577574 571403 566290 560876 555625 552222 550495 549106 548775 551414 556460 561338 565329
55795 565329 569753 574547 577964 579676 581047 582198 581724 579394 576372 572783 567892 562664 559177 557135
55781 557135 553584 546255 534923 519792 501379 482046 464832 450435 437570 426286 418368 414566
55769 414566 414010 416260 421100 426122 427456 423639 416578 408510 400265 392617 386616 381976 377292 372291
55755 372291 367935 364189 359882 354875 350126 345459 339525 332211 324862 317920 310590 303050 296629 291509
55741 291509 286502 281502 277879 275998 274518 272675 271167 270314 269339 267936 266593 265021 262275 258756 256089
55726 256089 254525 252420 248674 243803 238391 232574 227366 224237 222814 221042 218139 215381 213582 212059
55712B12059j362M0J881K517K517L489M817M527K705J194M48p45k713m446n428
55697B21500n923n822m973m137l976l823l001k297k520k714j718k76K88L16Q31
55682A81755J425J293J141K005L180L360K862K684K438J301r1p27j056j710j747
55667A98113m10P08j94j939k048o48K2o60j232r94o90n08K33J492K527L281L984
55650B01037L948K630J188J037J520J087o7o20o42j185k118k615l125m511n888
55635A91676n755m709m535n167n051m112l640l582k705j332j143k142k474j535
55621A43794p45q82j058p72p33j152j284j139j630k632k924k350k126k557k500
55606A19310j551p84p82p86l79k20n52o63l94n48j244j520j061p75j061j139o31
$$ plain form
55712 212059 210697 210737 212618 215135 217652 221141 225958 230485 233190 234384 234832 234087 231374 226928 221500
55697 221500 215577 209755 204782 200645 196669 192846 189845 187548 185028 182314 180596 180320 180608 180924 181755
55682 181755 183180 184473 185614 187619 190799 194159 197021 199705 202143 203444 203353 202626 201570 199860 198113
55667 198113 197703 198411 198217 196278 194230 193582 193604 192944 191712 190718 190028 189520 189753 191245 193772 197053 201037
55650 201037 204985 207615 208803 209840 211360 212447 212380 211760 211118 209933 207815 205200 202075 197564 191676
55635 191676 185921 181212 176677 171510 166459 162347 158707 155125 152420 151088 149945 147803 145329 143794
55621 143794 143049 142167 141109 140337 139604 138452 137168 136029 134399 131767 128843 126493 124367 121810 119310
55606 119310 117759 116975 116193 115407 115028 114808 114256 113593 113199 112651 111407 109887 108826 108051 106990 105851 105220
55589A05220l43p52j118p94k34o0j88l65n89o18l9Q74J294J069R15J319K121L023
55571A10735L678L544K661K155K782L523K993J672J097J307R86j66j147j670k433
55556A31717l355l480k901k821l411l498k726k154k202j914q84j58m58r83q43
55541I9929l07K4J14J3l30l97N19J917K323J320M0n74o36k06J075K665L036J655
55523A12180j49r63q18m31j64k52r67k017k680k830k907k835k148j238j088j649
55507H9044j865j456j131r40j13J149J494N59m13n87n53p45n77Q0K77l31o51%
55489H3241P28O04O9j68k98n96p07n53p32j229j092k13Q8q12j554q13P28J634
55471G8325J719J513R31j24q67o82l20p05j320j030O7R25J097R45P06M09K93M10
$$ plain form
55589 105220 104877 104125 103007 102213 101979 101919 101731 101366 100777 100159 100120 100994 102288 103357 104272 105591 107712 110735
55571 110735 114413 117957 120618 122773 125555 129078 132071 133743 134840 136147 137133 136967 135820 134150 131717
55556 131717 128362 124882 121981 119160 115749 112251 109525 107371 105169 103255 102371 102213 101755 100772 99929
55541 99929 99622 99646 99760 99773 99443 99046 99565 101482 103805 105125 105165 104591 103955 103749 104824 107489 110525 112180
55523 112180 112031 111068 110250 109819 109655 109403 108436 106419 103739 100909 98002 95167 93019 91781 90693 89044
55507 89044 87179 85723 84592 83652 83539 84688 86182 86741 86328 85741 85188 84443 83866 83946 84223 83892 83241 83241
55489 83241 83969 84573 84642 84474 84176 83580 82873 82320 81588 80359 79267 79054 79142 78330 76776 75963 76691 78325
55471 78325 80044 81557 82488 82364 81497 80815 80495 79790 78470 77440 77507 78432 79529 80474 81180 81589 81882 82292
55453H2292K40m05p04LQ84N56r18k044j743m13Q57J358J025J69p78j400j303l08
55435G7368J021J403K30j323j510k68Q44R06N87N16K18o01j040k01J404K538K667
55418H4759K079J240O52P24J198J311R03P05J121J551J295M06o50j481j710j327
55402I2776j176j956k785k171m67K71n96j325o80J25l11j141p91M65J188J089
55386H2515R15P13o0j135j606j339r54o83l40j28l76p35n49R8N53N34K18k52o70
55367G6719o16o6K73j01p25r59r41j045j017m54L41Q42J072J224R98J52q72j531
55349G3294j927k246k051r07P44K013K436J896M33j227j774q32K91J99p97j311
55333F8234p19M63J404J461M18r95j521r41m48p86j030j49J256J920J748J433
$$ plain form
55453 82292 82532 82127 81423 81426 82310 82866 81948 79904 78161 77748 78605 79963 80988 81157 80379 78979 77676 77368
55435 77368 78389 79792 80022 78699 77189 76921 77765 78671 79258 79774 79992 79391 78351 78150 79554 82092 84759
55418 84759 86838 88078 88730 89454 90652 91963 92866 93571 94692 96243 97538 97944 97294 95813 94103 92776
55402 92776 91600 89644 86859 84688 84221 84492 83896 82571 81891 82016 81705 80564 79773 80238 81426 82515
55386 82515 83430 84143 84083 82948 81342 80003 79049 78366 78026 77898 77522 76787 76238 76336 76889 77423 77641 77389 76719
55367 76719 76103 76037 76310 76209 75484 74525 73584 72539 71522 71068 71409 72251 73323 74547 75545 75697 74825 73294
55349 73294 71367 69121 67070 66163 66907 68920 71356 73252 73685 72458 70684 69852 70143 70342 69545 68234
55333 68234 67515 67978 69382 70843 71261 70266 68745 67804 67356 66570 65540 65391 66647 68567 70315 71748
55317G1748J073N24L52J013J626J083q0m15J80M30j81p61o35k67k21k97r2K84
55299G5364M31J21m98r42p87l11k64p27q89l72R1L8K89J577K967K963J556J3q22
55280G9798r53m75L30O00j35r57o69M33J045P32J23l85q13q04J9J063J326P56
55262H1034N7n39j134j253m63M22K25p30j021l08M13O24Q23J169J097N59K33K01
55244H1409j72q17p73J46Q44O08M9j41k42o44j000q98n94m14j23N25J142J156
55226H0061N20l55j003j142q76o96q58r25m67R8J47m9K69R42J056M40k3K18P06
55207G8063Q44O26K76l1o9K24L62n2n50m17J03K33J6J60O44P59M51L89O18M44
55187H3093j92m53l0M04L85J66j91r84j844j807q26k3pj31J47L65J30q2J21L68
$$ plain form
55317 71748 72821 73345 73697 74710 76336 77419 77339 76924 77104 77534 77353 76592 75957 75690 75469 75172 75080 75364
55299 75364 75795 75916 75418 74476 73689 73378 73114 72387 71498 71126 71217 71255 71544 73121 76088 79051 80607 80620 79798
55280 79798 78845 78370 78700 79300 79165 78208 77539 77972 79017 79749 79872 79487 78674 77870 77889 78952 80278 81034
55262 81034 81091 80552 79418 78165 77702 78124 78349 77619 76598 76290 76703 77327 78150 79319 80416 80975 81208 81409
55244 81409 81237 80420 79647 79793 80637 81245 81294 81153 80911 80267 79267 78369 77775 77361 77238 77763 78905 80061
55226 80061 80581 80226 79223 78081 77205 76509 75651 74726 74259 74357 74504 74455 74724 75666 76722 77162 77139 77357 78063
55207 78063 78907 79533 79809 79778 79709 79933 80295 80243 79693 79276 79379 79612 79628 79788 80432 81191 81642 82031 82649 83093
55187 83093 82901 82448 82418 82822 83207 83373 83182 82198 80354 78547 77721 77698 77691 77560 77707 78072 78202 78120 78241 78609
55167G8609L65N03R70J242J061R89J421J886J940J824J701J205L41o0M65J219
55151I5681J401J106P01J7j008j734j603r85n46l92l33l84m91m61n43j283k349
55134H6794k528j465l50j94m32j17M69N17J38k2k7l56q53r67p05m37j17M65R96
55115H0809J084J017J278J609J381O44kk92l76k75L9K97L09M30R59J435J236N93
55097I2175L09O23R91Q84K16p32j346j015M7P25L86j52J91J058J144Q4j154j673
55079I2761j456p70K13J024J028L05k63j52J41l0m54m85j26n1o15j265j227m82
55061H8096K62N29N88Q17J008P84L94L81O13M45j12k49L39Q64O51J67K08O67Q23
55042I7275M31j60o06p37m05K20N46K59j21K6M28L44k71p53p45n78n34l86J95
$$ plain form
55167 78609 78974 79477 80447 81689 82750 83739 85160 87046 88986 90810 92511 93716 94057 93997 94462 95681
55151 95681 97082 98188 98889 98906 97898 96164 94561 93576 93030 92638 92305 91921 91430 90969 90426 89143 86794
55134 86794 84266 82801 82451 82257 81825 81708 82177 82694 82832 82810 82783 82427 81574 80607 79902 79465 79348 79813 80809
55115 80809 81893 82910 84188 85797 87178 87822 87820 87528 87152 86877 86916 87213 87522 87952 88911 90346 91582 92175
55097 92175 92484 93107 94098 94982 95198 94466 93120 92105 92152 92877 93263 93111 93302 94360 95504 95588 94434 92761
55079 92761 91305 90535 90748 91772 92800 93105 92842 92690 92831 92801 92347 91862 91736 91685 91070 89805 88578 88096
55061 88096 88358 88887 89475 90292 91300 92084 92478 92859 93472 93917 93805 93556 93895 94759 95410 95577 95785 96452 97275
55042 97275 97706 97546 96940 96203 95798 96018 96564 96823 96702 96728 97156 97500 97229 96476 95731 95153 94619 94233 94428
55023I4428J110J917K151J599M36q19j651j853j457o02L41Q58P75M31J86J8j97
55006I7671l51l63m49p35q39k92P25J455J400P65Q1l53o13p97p18j46O32Q88L87
54987I8348r6K61J122J458J045O47P15Q39O84N84P84Q57M41j11k77lN34J248J816
54968A10896J659P29k69p48q23o22J39J405K320K179J296L61m46j109j251p09
54952A15007r6Ko4L28R35R45J52q08j209p45L17J111P41o29j748j809j289q74
54934A10267l77M83J101Q43K26J33L99L09K2L06J131J790K244L087M201M672M320
54917A35157M119M807N930O642O722O341N489M025K032j77k219l805n003o125
54903A63935p121p361o477n106m213l933l639k967k152j526j251j383j647j399
$$ plain form
55023 94428 95538 97455 99606 101205 101641 100822 99171 97318 95861 95259 95600 96458 97233 97664 97850 97868 97671
55006 97671 97320 96957 96508 95773 94934 94642 95367 96822 98222 98987 99068 98715 98102 97305 96587 96441 97073 97961 98348
54987 98348 98252 98513 99635 101093 102138 102785 103500 104339 105023 105607 106391 107248 107689 107578 107301 107298 107832 109080 110896
54968 110896 112555 113284 113015 112267 111444 110822 110961 112366 114686 116865 118161 118522 118076 116967 115716 115007
54952 115007 114911 114913 114849 115177 116112 117057 117209 116401 115192 114447 114764 115875 116616 115987 114239 112430 111141 110267
54934 110267 109890 110373 111474 112317 112543 112676 113075 113384 113406 113712 114843 116633 118877 121964 126165 130837 135157
54917 135157 139276 144083 150013 156655 163377 169718 175207 179232 181264 181087 178868 175063 170060 163935
54903 163935 156814 149453 142976 137870 133657 129724 126085 123118 120966 119440 118189 116806 115159 113760
54889A13760l70P63J127P51L02Q8k8L3N42J445K460L522M539N086M968M766N073
54872A48827N586N730N774O315O944O472M447J550j417m011n781o436o381o335
54858A61284o340n943n207m629m312m086m214m854n103l811j468Q4m3r07j368
54843A09083j329j073o27k40m01q40n75N35J307R11Km38m68n67n63q9M70M42p6
54824A05464m18l38j75j59j35R2M58N94J19q19j312n81Q98J738J303L77l0J90
54806A07266O01R40J001M34o96j603j530o69J22K53j58n44l65M02J125J153O16
54789A08348K25K97M93M92L92L24K21J08R5J2l72p64n51K79J133J772K539L443
54771A18486L891L642L285L403L865M342M842N420N908O272O749P338P673P491
$$ plain form
54889 113760 113390 114153 115280 116031 116333 116421 116393 116426 116968 118413 120873 124395 128934 134020 138988 143754 148827
54872 148827 154413 160143 165917 172232 179176 185648 190095 191645 190228 186217 180436 174000 167619 161284
54858 161284 154944 149001 143794 139165 134853 130767 126553 121699 116596 112785 111317 111401 111358 110451 109083
54843 109083 107754 106681 106054 105814 105413 104573 103998 104533 105840 106751 106753 106315 105847 105280 104717 104628 105098 105540 105464
54824 105464 105046 104708 104533 104374 104239 104331 104789 105383 105502 104683 103371 102790 103688 105426 106729 107106 107076 107266
54806 107266 107867 108807 109808 110242 109546 107943 106413 105744 105866 106119 105961 105417 105052 105454 106579 107732 108348
54789 108348 108573 108870 109363 109855 110247 110571 110792 110900 110995 111007 110635 109871 109320 109599 110732 112504 115043 118486
54771 118486 122377 126019 129304 132707 136572 140914 145756 151176 157084 163356 170105 177443 185116 192607
54757A92607O728N125K523m23k722m375o208q178r015q087o495n628n503n257
54743A45092m475l260j811o31m63j177j516o90L96M27n39j444j748j550p65O90
54727A26536K112K552K122J885K403L166L537L677M226N429O692O970N849M165
54713A81321L098K571J368r51l188m169m309m758n718o585p047p034o119m159
54699A34321k176j410j685j760j192p64r99j392j355r88o15k13K39M26M4p67j536
54682A18178j793j342m91L8k28j006j626j687j157j67Q80J357J085O07L96J50
54666A13194m76r83o42L49J106J262J089O86ln15k29N64Q53L45j64p4K23J70p5
54647A16680k0M25R67J258R74J18o30m08O45J277N81q40j636j285m62jPL7L37
$$ plain form
54757 192607 199335 204460 206983 206560 203838 199463 193255 185077 176062 167975 161480 155852 150349 145092
54743 145092 140617 137357 135546 134915 134452 133275 131759 131069 131465 131892 131353 129909 128161 126611 125846 126536
54727 126536 128648 131200 133322 135207 137610 140776 144313 147990 152216 157645 164337 171307 177156 181321
54713 181321 184419 186990 188358 187407 184219 180050 175741 170983 165265 158680 151633 144599 138480 134321
54699 134321 132145 130735 129050 127290 126098 125334 124335 122943 121588 120600 119985 119772 120011 120437 120481 119714 118178
54682 118178 116385 115043 114552 114590 114362 113356 111730 110043 108886 108719 109599 110956 112041 112648 113044 113194
54666 113194 112718 111735 111093 111442 112548 113810 114899 115585 115582 115067 114838 115402 116255 116600 116436 116362 116585 116755 116680
54647 116680 116660 117085 118052 119310 120284 120402 119772 119364 120009 121286 121867 121027 119391 118106 117644 117643 117650 117687 118024
54628A18024N15M8q78j342p70K32N24k18j220j637j302n03M21J049J000M08q5
54611A14266p6J50J78J21L37P44Q68N44J14j23k99n93p57l98L74R98J215J339
54593A19002J579J532Q51K7j29L39O02K40k38l48k72l22k94J35P81J140R25J86
54575A25736p31j208q06Q2N21K38o4J49M85M27J52K1j09l96m93j70J23Lj23J53
54555A23990L40j97j065j391j138r39r42p67l35J12O02J183J440J117Q58J295
54539A24163J815J476P18Q22J789K231J525O10L35L43R3k44m03n10m40K67J320
54522A35910J603P64p4Q8P77J095J160J504J789J234k3j065j483j627j730j538
54506A38384r67m54m13p14r09p62m52k41j19J26M32L83j22n07k76J82J84j27j57
$$ plain form
54628 118024 118539 118587 117709 116367 115597 115829 116353 116135 114915 113278 111976 111473 111894 112943 113943 114351 114266
54611 114266 114190 114340 114518 114639 114976 115720 116588 117132 117246 117123 116824 116231 115474 115076 115450 116448 117663 119002
54593 119002 120581 122113 122964 122991 122862 123201 123803 124043 123805 123457 123185 122863 122569 122704 123485 124625 125550 125736
54575 125736 125005 123797 122991 123073 123594 123832 123768 123917 124402 124829 124981 125002 124893 124497 124004 123834 123957 123960 123837 123990
54555 123990 124330 124133 123068 121677 120539 119600 118658 117891 117556 117668 118270 119453 120893 122010 122868 124163
54539 124163 125978 127454 128172 128994 130783 133014 134539 135149 135484 135827 135920 135676 135273 134763 134323 134590 135910
54522 135910 137513 138277 138203 138291 139068 140163 141323 142827 144616 145850 145827 144762 143279 141652 139922 138384
54506 138384 137417 136963 136550 135836 134927 134165 133713 133472 133353 133479 133911 134294 134172 133665 133389 133571 133755 133628 133471
54487A33471n3m97j175p88R83K595K489R97l14n85j39M44R14J201J372J583J708
54470A44206J275J90q30r64j96Q48J613J880J631J098O60M26K22J26M59J012R26
54453A54582j24j263j508j064q61j204j508j214l56N84J005N53m33j112j111r20
54437A44046r65q54r7Q84J202O63j60p91j063p80J19J024J067J74p79r86m97P5
54419A42282K88K26L39Q84J503J503P13k49p45p56n85l61j81k01k02L35J285J619
54401A47697P94k38k99L13M13j42l78N5L40Lk45L71J477K099J808Q44m02j529
54383A52981k034j631n76N31J191J314J228J402J868J980J137l33j407j476q11
54368A55364M2P60J104Q49J22n79q48o20K2Q60J398J233O63M05O21P48M54J09
$$ plain form
54487 133471 133418 132921 131746 130958 131941 134536 137025 138022 137708 137123 136984 137428 138342 139543 140915 142498 144206
54470 144206 145481 145671 144841 143877 143681 144529 146142 148022 149653 150751 151411 151837 152059 152185 152644 153656 154582
54453 154582 154458 153195 151687 150623 149762 148558 147050 145836 145480 146064 147069 147622 147189 146077 144966 144046
54437 144046 143081 142227 142130 143014 144216 144879 144719 143928 142865 142085 142204 143228 144295 144469 143690 142704 142207 142282
54419 142282 142570 142796 143135 144019 145522 147025 147738 147489 146744 145988 145403 145042 144861 144660 144458 144793 146078 147697
54401 147697 148491 148253 147954 148267 148680 148538 148160 148215 148555 148558 148313 148684 150161 152260 154068 154912 154510 152981
54383 152981 150947 149316 148740 149271 150462 151776 153004 154406 156274 158254 159391 159058 157651 156175 155364
54368 155364 155406 156166 157270 158119 158241 157662 156814 156194 156216 157076 158474 159707 160370 160775 161396 162144 162598 162707
54350A62707J9j73q83j798k275k182j904j665j326p66j90L8k19o46o53K7R48J426
54332A50485J338J064P17qj082j862j910j635j686k033k088j507n25L38O22K66
54316A40494k23j82M35R82J037R13J019J146Q89L36r6k18rN93J357J601R85J13
54298A51172k19q7MJ93R17J764J794J094P98J319J598P45n71j097p21l69o44j289
54280A56401j790j804j199k34L99K08n72j396k070k575k576j790n96K70N60M76
54264A41712R6n66j050p54J79J017J476J938K466K435J486K73k25K41J142J784
54248A53650J744J002j3p56j078j201j217j052q97j086j407j226n10l8k67o60
54232A44988o38m38m58m16N7N74N46K12J67K83l6o54p49j03N36N33R0l32o79j123
$$ plain form
54350 162707 162726 162553 161670 159872 157597 155415 153511 151846 150520 149754 149564 149602 149383 148737 148084 148111 149059 150485
54332 150485 151823 152887 153604 153596 152514 150652 148742 147107 145421 143388 141300 139793 139268 139606 140228 140494
54316 140494 140271 140089 140524 141506 142543 143456 144475 145621 146510 146846 146750 146532 146523 147116 148473 150074 151059 151172
54298 151172 150953 150866 150870 151063 151980 153744 155538 156632 157430 158749 160347 161092 160521 159424 158703 158334 157690 156401
54280 156401 154611 152807 151608 151374 151773 151981 151409 150013 147943 145368 142792 141002 140406 140676 141236 141712
54264 141712 141808 141242 140192 139438 139617 140634 142110 144048 146514 148949 150435 150708 150483 150724 151866 153650
54248 153650 155394 156396 156383 155627 154549 153348 152131 151079 150182 149096 147689 146463 145953 145915 145648 144988
54232 144988 144350 143912 143454 143038 143095 143669 144215 144427 144594 144877 144841 144187 143438 143335 143871 144404 144494 144162 143483 142360
54212A42360j642k002j924j289m47r3m45p77l57N01R69J076J565K448K759J949
54196A44651O71k28p04j083j309j170p94m82l51l60l96k12K69N61J07p99j234
54179A37137r03m42k89j72P8P1l00m50q6K20M1j51P9K83Q1R1Q74J668J401M86
54159A39717K61R03J299R38O43J060J637J594J008L57l21j128j699j497n59M78
54143A44691R71O70k57j374k182k335j730n62O48J303J307J123J068Q58K91j05
54127A44385K05P67O30j92p27n22j86j87j03M59J012R77O94Q65J397J587J237
54110A52298P89M75N0n66j085j394j691j893j511n09K43k3q36r86j04Q95R87K15
54092A45354n95p61j74Q24J596J518O35k31l93j38k06o43q51o55n13n24p5J165
$$ plain form
54212 142360 140718 138716 136792 135503 135056 134963 134518 133741 133384 133885 134854 135930 137495 139943 142702 144651
54196 144651 145322 145094 144390 143307 141998 140828 140034 139552 139201 138841 138445 138233 138502 139063 139170 138371 137137
54179 137137 136234 135792 135503 135331 135409 135480 135180 134730 134644 134864 134905 134754 134833 135116 135197 135288 136162 137830 139231 139717
54159 139717 139978 140881 142180 143118 143761 144821 146458 148052 149060 149417 149096 147968 146269 144772 144213 144691
54143 144691 145662 146332 146075 144701 142519 140184 138454 137892 138540 139843 141150 142273 143341 144199 144490 144385
54127 144385 144590 145357 145987 145795 145068 144546 144360 144173 144070 144529 145541 146518 147212 148077 149474 151061 152298
54110 152298 153087 153562 153612 153046 151961 150567 148876 146983 145472 144963 145206 145183 144347 143361 143257 144152 145139 145354
54092 145354 144759 143998 143824 144648 146244 147762 148397 148166 147773 147635 147429 146786 145935 145280 144767 144243 144168 145333
54074A45333K414K642J794O50j81o35p59n03M5O13R58R64O66L17K13K72M9n55
54056A54297j000p77j00M39N44K88j26k45M87J912K913K687J922J938K888L660
54040A71727L548L028K787K820K834K901L215L642L924M025M022L923L775L724
54026B19895L762L634L092K139J027J86K3M37O84J33q69j376j071n79o13j314
54010B29190k490l883n009n337m919m341l893l272k381j813k045k626k702k032
53996A82447j081k77K75N43M41Lo27j242j555j350q63p40j234j722j464o95l40
53979A70519p09j021n51L20O85M68N34J364K211K030R02j02l57l02m50m74J37
53962A75204J023J260O13j17r1O93J576J860J270K18l39K90J776L130L796L929
$$ plain form
54074 145333 147747 150389 152183 152833 152652 152017 151258 150755 150800 151413 152371 153335 154001 154318 154531 154803 154852 154297
54056 154297 153297 152520 152420 152859 153403 153691 153565 153320 153807 155719 158632 161319 163241 165179 168067 171727
54040 171727 175275 178303 181090 183910 186744 189645 192860 196502 200426 204451 208473 212396 216171 219895
54026 219895 223657 227291 230383 232522 233549 233735 233758 234195 234879 235012 234143 232767 231696 231117 230504 229190
54010 229190 226700 222817 217808 212471 207552 203211 199318 196046 193665 191852 189807 187181 184479 182447
53996 182447 181366 181089 181364 181907 182348 182351 181724 180482 178927 177577 176714 175974 174740 173018 171554 170859 170519
53979 170519 169810 168789 168238 168558 169243 169711 170245 171609 173820 175850 176752 176650 176293 175991 175541 175067 175204
53962 175204 176227 177487 178100 177983 177892 178585 180161 182021 183291 183509 183170 183460 185236 188366 192162 196091
53946A96091L761L297K811K898L700M676N505O679Q698J1189J3425J5502J8258
53933B96490K1958K5499K6981K4858J8784R954P16o646j1150j3283j4035j4020
53921C66106j3397j2275j0833r168p210m870k242L01K254L310L589L486L212K626
53907C24889J553K39p68j200j381j788k395k719k472j958j796k361l519m704n322
53892B94298n295n189n503n971o008n717n784o245o199n072l539k524k025j547
53878B27680j165j296j801k232k605l121l348k744j804j604k189k490k015j513
53864A97753j578j691j236n91m47o93o91k58K88O86Q15N20j67q64j265j528j861
53847A87192k095j919j313m68L87R17Q35M03L09P30J022O81J20K7L57N51M36L50
$$ plain form
53946 196091 199852 203149 205960 208858 212558 217234 222739 229418 238116 249305 262730 278232 296490
53933 296490 318448 343947 370928 395786 414570 424524 425240 418594 407444 394161 380126 366106
53921 366106 352709 340434 329601 320433 313223 308353 306111 306412 308666 311976 315565 319051 322263 324889
53907 324889 326442 326681 325913 324713 323332 321544 319149 316430 313958 312000 310204 307843 304324 299620 294298
53892 294298 289003 283814 278311 272340 266332 260615 254831 248586 242387 237315 233776 231252 229227 227680
53878 227680 226515 225219 223418 221186 218581 215460 212112 209368 207564 205960 203771 201281 199266 197753
53864 197753 196175 194484 193248 192657 192210 191517 190826 190568 190856 191542 192357 192877 192710 191846 190581 189053 187192
53847 187192 185097 183178 181865 181397 181784 182701 183536 183939 184248 184978 186000 186681 186801 186828 187185 187736 188172 188522
53829A88522N23P90Q20L78m89j303j525j206q96p56l28N16J136J093R35J263J641
53812A91114J252K80l30j53M74J296K223K752K352J633J939L533N048N264M572
53797B23249M046L810L269K497K328L009L655L384K404J573J186P94M8p26r60
53782B53566n39J08M60K70l89j269k160l000l659l717k834j439n82p08j047o60
53766B32401K50P94Q12R86J637K393L172M583O942R730J2494J5530J8966K1697
53752C32387K1900J8427J1402K049p497j4815j8575j9304j8448j6909j4915j2719
53740B62983j0654q701o741n096m218l871l334k341j312o21k23l5j06k51l3O43
53724B16089J253J208N73L6K49J184K147K409J862R76K25j47R5J042K200K782
$$ plain form
53829 188522 189045 189835 190655 191033 190544 189241 187716 186510 185614 184858 184530 185046 186182 187275 188210 189473 191114
53812 191114 192366 192646 192316 192163 192637 193933 196156 198908 201260 202893 204832 208365 213413 218677 223249
53797 223249 227295 231105 234374 236871 239199 242208 245863 249247 251651 253224 254410 255204 255252 254526 253566
53782 253566 253027 253135 253595 253865 253476 252207 250047 247047 243388 239671 236837 235398 234816 234108 233061 232401
53766 232401 232651 233445 234257 235243 236880 239273 242445 247028 253970 263700 276194 291724 310690 332387
53752 332387 354287 372714 384116 386165 378668 363853 345278 325974 307526 290617 275702 262983
53740 262983 252329 243628 236887 231791 227573 223702 220368 218027 216715 216094 215871 215836 215730 215479 215446 216089
53724 216089 217342 218550 219123 219159 219408 220592 222739 225148 227010 227986 228211 228064 228159 229201 231401 234183
53708B34183K711K834L678M573M503L431K242J748K203L420M752N348N002M408
53694B85036M143L860L112K325K092J998J262K11j10K62J03j102k303k375j506
53679B97008o75m06o38j118j484j378r26o48o76n23P1O64P73N55L93L14K07K43
53661B91756N91J022J155Q76L22l12o12n4J389L041M212M860N294N572N563N243
53645C29918M515K978N65j815k927k701k434l179m339m419l065j618j470k335
53631C07674k791k198j340j035r81m63M33J033J202J476K162K946L478L789L965
53616C19350L926L651L361L284L513M040M664M909M456L603K984K836K895K937
53602C70409K982L019L003L067L323L467L155K609K306K094J367J80n63m11q2
$$ plain form
53708 234183 236894 239728 243406 247979 252482 255913 258155 259903 262106 265526 270278 275626 280628 285036
53694 285036 289179 293039 296151 298476 300568 302566 303828 304039 303929 304191 304294 303192 300889 298514 297008
53679 297008 296333 295927 295289 294171 292687 291309 290383 289735 289059 288536 288607 289271 290044 290599 290992 291306 291513 291756
53661 291756 292347 293369 294524 295400 295722 295410 294798 294744 296133 299174 303386 308246 313540 319112 324675 329918
53645 329918 334433 337411 337976 336161 333234 330533 328099 324920 320581 316162 313097 311479 310009 307674
53631 307674 304883 302685 301345 300310 299329 298866 299299 300332 301534 303010 305172 308118 311596 315385 319350
53616 319350 323276 326927 330288 333572 337085 341125 345789 350698 355154 358757 361741 364577 367472 370409
53602 370409 373391 376410 379413 382480 385803 389270 392425 395034 397340 399434 400801 400981 400418 400007 399925
53587C99925m39j337j944j857j423j203j487k133k644k603k164j904k073k376
53573C74338k566k784l050k941k120r71k63m20j170j780j536m51N61N63j76m75
53557C54759J45Q27P71M11N93J140J149M11k90k94K12P19J085J510K172L056L946
53540C72322M527M656M591M789N427O259O852O978O856P077Q040R443J0602J1293
53526D69712J1916J2708J3292J3374J3344J3675J4115J4152J3997J4417J5643
53515F20345J7179J8715K0531K2753K4906K6639K8334L0381L2207L2758L1966
53504I06714L1056L1202L2287L3339L3773L3669L3077L1652K9260K6478K4146
53493A246653K2562K1405K0394J9669J9463J9601J9595J9184J8586J8109J7653
$$ plain form
53587 399925 399486 398149 396205 394348 392925 391722 390235 388102 385458 382855 380691 378787 376714 374338
53573 374338 371772 368988 365938 362997 360877 359906 359643 359223 358053 356273 354737 354286 354847 355410 355234 354759
53557 354759 354904 355731 356502 356913 357506 358646 359795 360206 359916 359622 359834 360553 361638 363148 365320 368376 372322
53540 372322 376849 381505 386096 390885 396312 402571 409423 416401 423257 430334 438374 447817 458419 469712
53526 469712 481628 494336 507628 521002 534346 548021 562136 576288 590285 604702 620345
53515 620345 637524 656239 676770 699523 724429 751068 779402 809783 841990 874748 906714
53504 906714 937770 968972 1001259 1034598 1068371 1102040 1135117 1166769 1196029 1222507 1246653
53493 1246653 1269215 1290620 1311014 1330683 1350146 1369747 1389342 1408526 1427112 1445221 1462874
53482A462874J6889J5978J5655J6323J7413J8033J8012J7691J6940J5227J2625
53471A643660R884P304M434J203j676l987o649j0291j3918j6130j6915j7245j7486
53458A562188j7388j7291j7951j9402k1096k3008k5318k7228k7567k6622k5906
53447A313411k5844k5298k3742k2366k2145k2244k1352j9469j7274j4769j1738
53436A087170q851p002o010n055m054l518l295k487o73J634L835N833P789R764
53422A075080J1752J3644J5225J6449J7659J9241K1146K2913K4058K4433K4528
53411A286128K5383K7639L0605L2924L4274L5627L7641L9764M1389M2989M5390
53400A679753M8634N2255N5959N9319O1533O2423O2998O4150O5410O5895O5868
$$ plain form
53482 1462874 1479763 1495741 1511396 1527719 1545132 1563165 1581177 1598868 1615808 1631035 1643660
53471 1643660 1653544 1660848 1665282 1666485 1664809 1660822 1654173 1643882 1629964 1613834 1596919 1579674 1562188
53458 1562188 1544800 1527509 1509558 1490156 1469060 1446052 1420734 1393506 1365939 1339317 1313411
53447 1313411 1287567 1262269 1238527 1216161 1194016 1171772 1150420 1130951 1113677 1098908 1087170
53436 1087170 1078319 1071317 1065307 1060252 1056198 1052680 1049385 1046898 1046225 1047859 1051694 1057527 1065316 1075080
53422 1075080 1086832 1100476 1115701 1132150 1149809 1169050 1190196 1213109 1237167 1261600 1286128
53411 1286128 1311511 1339150 1369755 1402679 1436953 1472580 1510221 1549985 1591374 1634363 1679753
53400 1679753 1728387 1780642 1836601 1895920 1957453 2019876 2082874 2147024 2212434 2278329 2344197
53389B344197O6259O7109O7637O7457O6568O4564O1151N7200N3984N1365M8066
53378C015557M3752L9496L5930L2350K8141K3859K0214J6883J3143Q823L918k129
53366C279937r844j8846k8227l7572m6815n5342o1932o5972o8144o9662p0962
53355B746619p1456p0544o8506o6138o3743o1051n8131n5752n4479n3999n3823
53344B068997n4091n5016n5882n5490n3473n0569m7588m4819m2301m0018l7642
53333A532108l4771l1521k8395k5532k2606j9584j7019j5447j4937j5289j6188
53322A290819j7009j6959j5793j4136j2900j2367j1873j0414p768n042l651l564
53310A159343l183j346J213L063M007M887O048P178Q441J0455J3093J5503J7458
$$ plain form
53389 2344197 2410456 2477565 2545202 2612659 2679227 2743791 2804942 2862142 2916126 2967491 3015557
53378 3015557 3059309 3098805 3134735 3167085 3195226 3219085 3239299 3256182 3269325 3278148 3282066 3279937
53366 3279937 3270093 3251247 3223020 3185448 3138633 3083291 3021359 2955387 2887243 2817581 2746619
53355 2746619 2675163 2604619 2536113 2469975 2406232 2345181 2287050 2231298 2176819 2122820 2068997
53344 2068997 2014906 1959890 1904008 1848518 1795045 1744476 1696888 1652069 1609768 1569750 1532108
53333 1532108 1497337 1465816 1437421 1411889 1389283 1369699 1352680 1337233 1322296 1307007 1290819
53322 1290819 1273810 1256851 1241058 1226922 1214022 1201655 1189782 1179368 1171600 1166558 1162907 1159343
53310 1159343 1156160 1154814 1156027 1159090 1163097 1167984 1174032 1181210 1189651 1200106 1213199 1228702 1246160
53297A246160J9619K2194K4424K5838K7042K8699L0582L2204L3609L4904L5544
53286A560819L4786L2616K9754K6996K4732K2871K0976J8784J6575J4650J2568
53275A816127R582N781K029j287m586q014j1023j3384j5720j8495k1293k3640
53263A716077k5762k7973k9983l1502l2833l4203l5195l5568l6004l7137l8342
53252A351575l8389l7063l5244l3593l2049l0539k9337k8616k8243k8152k8375
53241A001975k8697k8699k8301k7922k7948k8266k8209k6942k4068k0170j6533
53230G16220j4039j2531j1370j0303r483q986q782q968r605j0490j1436j2547
53218E87680j3888j5045j5439j5007j4266j3787j3725j3682j2906j1010q751p570
$$ plain form
53297 1246160 1265779 1287973 1312397 1338235 1365277 1393976 1424558 1456762 1490371 1525275 1560819
53286 1560819 1595605 1628221 1657975 1684971 1709703 1732574 1753550 1772334 1788909 1803559 1816127
53275 1816127 1825709 1831490 1833519 1832232 1827646 1819632 1808609 1795225 1779505 1761010 1739717 1716077
53263 1716077 1690315 1662342 1632359 1600857 1568024 1533821 1498626 1463058 1427054 1389917 1351575
53252 1351575 1313186 1276123 1240879 1207286 1175237 1144698 1115361 1086745 1058502 1030350 1001975
53241 1001975 973278 944579 916278 888356 860408 832142 803933 776991 752923 732753 716220
53230 716220 702181 689650 678280 667977 658494 649508 640726 631758 622153 611663 600227 587680
53218 587680 573792 558747 543308 528301 514035 500248 486523 472841 459935 448925 440174 432604
53206D32604p988q851q691p476o459o576p567q529q758q138p156o519o429o365
53192C27102n871n209m796m425l682k863k661l037l236k980k753k806k576j610
53178B78597m30O4l18r61j224r72m60m1O1p7j66n5Q8J4k59m52l21P0L53K16j83
53157B73544k86K36J028J441J258Q18M87L05J83P9q7m61j016j393j209n24J41
53140B74544L12M9j38Q8M75N09J19k46j83J76L76O8p88j868k521k241j294n60
53122B66877n25p98q41p64q96r79m67M29P35p2j352k042j837j291j039j179j365
53105B52594j330j095q31o29n76q37j402j746j234K5J038R71L7r22j416j474j155
53088B40018m73K55N36K88q6k75l93o26q99j047j061r91p44k03N14J045J092P40
$$ plain form
53206 432604 424616 415765 407074 399598 393139 386563 378996 370467 361709 353571 346415 339896 333467 327102
53192 327102 321231 316022 311226 306801 303119 300256 297595 294558 291322 288342 285589 282783 280207 278597
53178 278597 278167 278231 277913 276952 275728 274756 274296 274255 274316 274239 274073 274018 274106 274120 273861 273409 273088 273158 273511 273727 273544
53157 273544 273258 273494 274522 275963 277221 278039 278526 278831 279014 279093 279006 278545 277529 276136 274927 274403 274544
53140 274544 274856 274905 274767 274855 275330 275839 275958 275712 275529 275705 276081 276149 275361 273493 270972 268731 267437 266877
53122 266877 266352 265554 264713 263949 263053 262074 261607 262036 262771 262699 261347 259305 257468 256177 255138 253959 252594
53105 252594 251264 250169 249338 248709 248133 247296 245894 244148 242914 242939 243977 244948 244985 244063 242647 241173 240018
53088 240018 239545 239800 240336 240624 240538 240263 239870 239244 238345 237298 236237 235246 234502 234299 234813 235858 236950 237690
53070B37690M07L63L54j02j029j853k074j763j290q53n54n22o32m26K70R05R19
53053B29810N75N29P55O60K41K61J080K013K267J958J667J506J128M81j73p84
53037B43974j519k193k236j426l22L57N03N23O08N59K50j15l96p08j032r79m33
53020B35415p1n67j394j253J39J514J761J407J644K498K863K144Q82k16j010j509
53004B44247j562j245r87r25o55N9P95J056R19P31N45K46l1m7J57M05O60Q71P80
52985B46019K57l49o00n00l15o0L45O75O58N36P56J150J083N12K21O64J276J332
52967B53660J011J000J430J852K071K343K774L092L114K908K384J195o25k347
52953B75862l102k684j653r19j163k297l341l247k061q37k92n8L68O38J96n45
$$ plain form
53070 237690 238097 238460 238814 238712 237683 235830 233756 231993 230703 229850 229296 228774 228142 227716 227986 228891 229810
53053 229810 230385 230914 231669 232329 232570 232831 233911 235924 238191 240149 241816 243322 244450 244931 244758 243974
53037 243974 242455 240262 238026 236600 236278 236635 237138 237661 238269 238828 239078 238963 238567 237859 236827 235848 235415
53020 235415 235344 234777 233383 232130 232269 233783 235544 236951 238595 241093 243956 246100 246982 246766 245756 244247
53004 244247 242685 241440 240453 239528 238873 238932 239727 240783 241702 242433 242978 243224 243193 243146 243303 243708 244368 245239 246019
52985 246019 246276 245927 245327 244827 244512 244452 244797 245472 246130 246666 247422 248572 249655 250167 250388 251052 252328 253660
52967 253660 254671 255671 257101 258953 261024 263367 266141 269233 272347 275255 277639 278834 278209 275862
52953 275862 272760 270076 268423 267504 266341 264044 260703 257456 255395 254558 254266 254208 254576 255214 255410 254865
52937B54865o54r8J13o16j660k051j645j044p34o47l72L46J187J363M26j056k027
52920B45696k057j583j107p37m86l99k47K93R93J166O78J71P5N1k66o23p87j102
52902B39729j770k148j549l81L15K30o3j07K0K58P40J371J770J815J773J782J612
52885B45397J064L18j52J1O68J055L87j113k195k055j411j458k110k174j201j71
52869B34860j08p76j239j103o57j75L96J149J938K397K223J511Q03O10Q60J008
52853B43697O83n7r60j766k185k132j977k184k619k640j996j244j051j447j959
52838B20163k160j868j141l99l10j171k380k830j962l56P64P45J51M8O40R90K94
52821B09218r61j576j156l98M0K94O86J058J098R57J095J611K181K523K786L297
$$ plain form
52937 254865 254211 254113 254226 253610 251950 249899 248254 247210 246476 245829 245457 245803 246990 248353 248779 247723 245696
52920 245696 243639 242056 240949 240212 239726 239327 239080 239373 240366 241532 242210 242381 242456 242507 242241 241618 240831 239729
52902 239729 237959 235811 234262 233881 234196 234426 234363 234256 234276 234534 235274 236645 238415 240230 242003 243785 245397
52885 245397 246461 246779 246627 246638 247306 248361 248748 247635 245440 243385 241974 240516 238406 236232 235031 234860
52869 234860 234752 233976 232737 231634 230977 230802 231198 232347 234285 236682 238905 240416 241219 241829 242689 243697
52853 243697 244380 244323 243363 241597 239412 237280 235303 233119 230500 227860 225864 224620 223569 222122 220163
52838 220163 218003 216135 214994 214595 214285 213114 210734 207904 205942 205586 206350 207095 207246 207294 207934 208924 209218
52821 209218 208257 206681 205525 205127 205167 205461 206147 207205 208303 209260 210355 211966 214147 216670 219456 222753
52805B22753M071M547L899J805j058l458m604m628m120l462k679j755r07m77n92
52790B09335r16r45o21m16o20r10q46n44l61j73L79J096J313R49P22J044J366
52773B09852J048L79J54N25Q66O88J71k67m94o59r05j266j615j636j061j22M71
52756B06129L18n6L02J483K451K303J436Q91Q68O42p1n85l38K36M68M20N04O56
52738B18057N80L97L58K30k24n44j54N91Q77P77J154K126K693K129R05j57q32
52721B28963j252j410j360j376j505j433j083q56r52j040q31m77q0N06J013P65
52705B17592j76o35J60J311J439N89k9J32M88O49R93J638J884J229K51k14k67
52688B27034n62j024q28K77J381J593J239J211J503J256K90l29K41J323J621R65
$$ plain form
52805 222753 226824 231371 235270 237075 236017 232559 227955 223327 219207 215745 213066 211311 210404 209927 209335
52790 209335 208419 207474 206853 206437 205817 204907 204061 203517 203156 202983 203362 204458 205771 206720 207442 208486 209852
52773 209852 210900 211279 211433 211958 212824 213512 213683 213416 212922 212263 211358 210092 208477 206841 205780 205658 206129
52756 206129 206447 206391 206693 208176 210627 212930 214366 215257 216125 216767 216696 216111 215773 216009 216477 216897 217401 218057
52738 218057 218637 219034 219392 219622 219398 218854 218700 219291 220168 220945 222099 224225 226918 229047 229952 229795 228963
52721 228963 227711 226301 224941 223565 222060 220627 219544 218688 217736 216696 215865 215388 215308 215814 216827 217592
52705 217592 217416 216781 216941 218252 219691 220280 220251 220383 220871 221520 222513 224151 226035 227264 227515 227301 227034
52688 227034 226472 225448 224620 224897 226278 227871 229110 230321 231824 233080 233370 233041 233282 234605 236226 237191
52672B37191L07K30M10M96O52R25R30M93K0j47k05l72m50k26O3J20m4k73m16l5
52652B39669J319L170M051L046Q98r62k017k632k965k824k395k171k097j581n42
52637B31967K84L24r8l03r9L07R64K134L698M942N316N222N579O364O130L588
52621B76319m37l498m205l553l235l422l144k201j536j698k033j735r43l91m69
52606B43819j011j611j819j337l79L57M51K51L75Q32J027O33L0k12nL70Q06J370
52588B43947J819J640Q07J46M39J336J688J011J00M2R32J903K090J313K1j100
52572B58134j518j141l94J22J18j31o5N08J020O62o38j953k348j843j079m50J5
52555B49019J72q2l48r0N20Q12O38M23K56k17q08o86L15J194J104M27m8k72n70
$$ plain form
52672 237191 237498 237728 238138 238634 239286 240211 241141 241634 241654 241507 241302 240930 240480 240254 240317 240437 240393 240120 239704 239669
52652 239669 240988 244158 248209 251255 252153 251191 249174 246542 243577 240753 238358 236187 234090 232509 231967
52637 231967 232251 232575 232477 232174 232075 232382 233346 235480 239178 244120 249436 254658 260237 266601 272731 276319
52621 276319 275882 272384 268179 264626 261391 257969 254825 252624 251088 249390 247357 245622 244679 244288 243819
52606 243819 242808 241197 239378 238041 237662 238019 238470 238721 239096 239928 240955 241588 241618 241406 241401 241771 242577 243947
52588 243947 245766 247406 248213 248359 248798 250134 251822 252833 252933 252975 253907 255810 257900 259213 259234 258134
52572 258134 256616 255475 255081 255203 255321 255190 255125 255633 256653 257315 256677 254724 252376 250533 249454 249004 249019
52555 249019 249191 249109 248761 248671 249191 250003 250641 251064 251320 251103 250295 249609 249924 251118 252222 252649 252601 252329 251759
52536B51759p71n35j06Q4J74N09Q23N78m0k61J88P52P75J55p34j352j359j012
52518B49627r60j385j624j091j30M86O34P86J167J591J938K304K770L396M191
52503B63700M697M079K173K0j305j962k718l448l348k345j367j080j278j596j956
52488B52266k143j740q04J7K91K04N3j12j83J24P93J378J560J432J211R87Q37
52471B56171P88O84N12O94J502K298K115J097N60J397K986M011L844K847J743
52456B83249J020O32J39p07j495j696j547j842k809l695l684k827j822j301j340
52441B60275j401p83N11J489J207p5j277j804j762j152N2J111R14m55j551j395
52425B53904o14k54l49l67k62l31m71l54j0L47P69J307J686J729J847K514L579
$$ plain form
52536 251759 250988 250453 250347 250431 250605 251114 251937 252515 252475 252214 252402 253154 253929 254084 253350 251998 250639 249627
52518 249627 248667 247282 245658 244567 244437 244923 245557 246343 247510 249101 251039 253343 256113 259509 263700
52503 263700 268397 272476 274649 274669 273364 271402 268684 265236 261888 259543 258176 257096 255818 254222 252266
52488 252266 250123 248383 247579 247596 247887 248091 248144 248032 247849 247973 248766 250144 251704 253136 254347 255334 256171
52471 256171 256959 257643 258155 258849 260351 262649 264764 265861 266421 267818 270804 274815 278659 281506 283249
52456 283249 284269 284901 285040 284333 282838 281142 279595 277753 274944 271249 267565 264738 262916 261615 260275
52441 260275 258874 258091 258602 260091 261298 261223 259946 258142 256380 255228 255280 256391 257305 256850 255299 253904
52425 253904 253290 253036 252687 252320 252058 251727 251256 250902 250892 251239 252008 253315 255001 256730 258577 261091 264670
52408B64670M521N216N987P175Q987J1351J3470J3856J1505O900J556l264o977
52395C44953r284j0065r596q407o847n143l665k731k178j556p12J41Q30J326J525
52380B88591J285Q06N79R37J681K328K534K391K397K996M117N165N650N613N404
52365C32474N233N043M653L927K955K092J490O24j168l490m814m096k048l04M37
52350C43008P40J229J728J851J758J948K568L276L773M119M481M776M758M498
52336C84511M467N033O050P138Q195R324J0467J1485J2570J4025J5734J7266J8545
52323E24810J9837K1083K1860K2237K2871K3887K4283K3138K0934J9042J8182
52312G62164J7977J7834J7548J7115J6614J6330J6520J6827J6400J4830J2735
$$ plain form
52408 264670 269191 274407 280394 287569 296556 307907 321377 335233 346738 353638 355194 351930 344953
52395 344953 335669 325604 316008 307601 300754 295611 291946 289215 287037 285481 284769 284910 285740 287066 288591
52380 288591 289876 290682 291261 292198 293879 296207 298741 301132 303529 306525 310642 315807 321457 327070 332474
52365 332474 337707 342750 347403 351330 354285 356377 357867 358491 357323 353833 349019 344923 342875 342571 343008
52350 343008 343748 344977 346705 348556 350314 352262 354830 358106 361879 365998 370479 375255 380013 384511
52336 384511 388978 394011 400061 407199 415394 424718 435185 446670 459240 473265 488999 506265 524810
52323 524810 544647 565730 587590 609827 632698 656585 680868 704006 724940 743982 762164
52312 762164 780141 797975 815523 832638 849252 865582 882102 898929 915329 930159 942894
52301I42894J1120J0304R655Q467O835N482M739M020K580M56j739l770n897q035
52287I87111r554j0154j0382j0734j0841j0021q349o555n073l664j949J49K419
52274I02403M474N942O801P517Q578R991J1444J2770J3999J5125J6162J7215J8213
52261A050634J8670J8114J6684J5066J3768J2735J1646J0423R377Q847Q666Q134
52249A202764O711M680K719R54j074l471n722p574r425j1425j2875j3132j2610
52236A140520j2188j2062j1861j1529j1269j0849r790q224o811n904n334m959
52224A029740m745m365l467k344j611j173k71J229K394K513K177K584M094N921
52210A032676P142P614P983Q866R986J0218Q790O331M361L743M040M368M391M348
$$ plain form
52301 942894 954014 964318 973973 982440 989275 994757 999496 1003516 1006096 1006552 1004813 1001043 995146 987111
52287 987111 977557 967403 957021 946287 935446 925425 917076 910521 905448 901784 899835 899984 902403
52274 902403 906877 912819 919620 927137 935715 945706 957150 969920 983919 999044 1015206 1032421 1050634
52261 1050634 1069304 1087418 1104102 1119168 1132936 1145671 1157317 1167740 1177117 1185964 1194630 1202764
52249 1202764 1209475 1214155 1216874 1217828 1216754 1213283 1207561 1199987 1190562 1179137 1166262 1153130 1140520
52236 1140520 1128332 1116270 1104409 1092880 1081611 1070762 1060972 1052748 1045937 1040033 1034699 1029740
52224 1029740 1024995 1020630 1017163 1014819 1013208 1012035 1011764 1012993 1015387 1017900 1020077 1022661 1026755 1032676
52210 1032676 1039818 1047432 1055415 1064281 1074267 1084485 1093275 1099606 1103967 1107710 1111750 1116118 1120509 1124857
52196A124857M552N113N856O346O328O058N822N289L957K251J244J102O60r05
52182A178530k815l849m131m830o428q273r682j0557j0808j0149q744p352o434
52169A084478n649m585l454k629k001j254m46K74J157K480L835M457M250L892
52155A084805L856L863L431K468J161k52j360j749j543j363j445j260m40M86P80
52140A091438N43L28J45l77r71q12K88J565K434L216M509O354Q452J0681J3067
52125A140860J5581J8211K0915K3362K5184K6663K8540L0842L2525L2656L1523
52114A426862L0050K8622K7096K5458K3852K2084J9760J6841J3666J0549P755
52103A652595N566L996K622J173L4l39k91o83j839l322m691n958p360r132j1470
$$ plain form
52196 1124857 1129409 1134522 1140378 1146724 1153052 1159110 1164932 1170221 1174178 1176429 1177673 1178775 1179435 1178530
52182 1178530 1175715 1171866 1167735 1162905 1156477 1148204 1138522 1127965 1117157 1107008 1098264 1090912 1084478
52169 1084478 1078829 1074244 1070790 1068161 1066160 1064906 1064460 1064734 1065891 1068371 1072206 1076663 1080913 1084805
52155 1084805 1088661 1092524 1095955 1098423 1099584 1099332 1097972 1096223 1094680 1093317 1091872 1090612 1090172 1090658 1091438
52140 1091438 1091981 1092309 1092454 1092077 1091106 1090294 1090582 1092147 1094581 1097797 1102306 1108660 1117112 1127793 1140860
52125 1140860 1156441 1174652 1195567 1218929 1244113 1270776 1299316 1330158 1362683 1395339 1426862
52114 1426862 1456912 1485534 1512630 1538088 1561940 1584024 1603784 1620625 1634291 1644840 1652595
52103 1652595 1658161 1662157 1664779 1665952 1665986 1665647 1665356 1664673 1662834 1659512 1654821 1648863 1641503 1632371 1620901
52088A620901j4201j6653j8244j9130j9685j9507j7697j4224j0270o927m123j249
52076A458991J715M195N914P275Q857J0863J3116J5368J7431J9012J9641J9051
52064A601429J7689J6511J6043J5847J5173J3913J2578J1580J0835J0024Q799
52053A750421O902M395J744o55k942n500q354j1223j3983j6648j9116k1399k3796
$$ plain form
52088 1620901 1606700 1590047 1571803 1552673 1532988 1513481 1495784 1481560 1471290 1464363 1460240 1458991
52076 1458991 1460706 1464901 1470815 1478090 1486947 1497810 1510926 1526294 1543725 1562737 1582378 1601429
52064 1601429 1619118 1635629 1651672 1667519 1682692 1696605 1709183 1720763 1731598 1741622 1750421
52053 1750421 1757323 1761718 1763462 1762807 1759865 1754365 1746011 1734788 1720805 1704157 1685041 1663642 1639846
$$ [...]
##END NTUPLES=NMR SPECTRUM
##END=
