##TITLE=AC1478_ZPERCUS304_8101089_t9cD9gReun
##JCAMPDX= 6.0         $$ Bruker NMR JCAMP-DX V2.0
##DATA TYPE= NMR SPECTRUM
##DATA CLASS= NTUPLES
##ORIGIN= BRUKER
##OWNER= Administrator
$$ 1.72 TOPSPIN		Version 2.1
$$ 2013-07-31 18:00:14.081 -0700  Administrator@X
$$ Compression mode = diff/dup
##.OBSERVE FREQUENCY= 400.02188249412
##.OBSERVE NUCLEUS= ^1H
##.ACQUISITION MODE= SIMULTANEOUS (DQD)
##.ACQUISITION SCHEME= undefined
##.AVERAGES= 8
##.DIGITISER RES= 22
##SPECTROMETER/DATA SYSTEM= spect
##.PULSE SEQUENCE= zg30
##.SOLVENT NAME= COFFEE_meoh
##.SHIFT REFERENCE= INTERNAL, COFFEE_meoh, 1, 14.98509
##AUDIT TRAIL= $$ (NUMBER, WHEN, WHO, WHERE, PROCESS, VERSION, WHAT)
$$ ##TITLE= Audit trail, TOPSPIN		Version 2.1
$$ ##JCAMPDX= 5.01
$$ ##ORIGIN= Bruker BioSpin GmbH
$$ ##OWNER= Administrator
$$ $$ E:\/data/COFFEE/nmr/AC1478_ZPERCUS304_8101089_t9cD9gReun/10/pdata/1/auditp.txt
$$ ##AUDIT TRAIL=  $$ (NUMBER, WHEN, WHO, WHERE, PROCESS, VERSION, WHAT)
(   1,<2013-07-31 18:00:07.534 -0700>,<Administrator>,<X>,<go>,<TOPSPIN 2.1>,
      <created by zg
	started at 2013-07-31 17:59:01.878 -0700,
	POWCHK enabled, PULCHK disabled,
       configuration hash MD5:
       C8 4E 4E 5D D3 5C D8 9E 9F 52 82 E0 59 8A DE 15
       data hash MD5: 64K
       60 78 FF A0 00 64 A5 41 47 73 AE 2C 6E 3B 9C 5D>)
(   2,<2013-07-31 18:00:10.393 -0700>,<Administrator>,<X>,<proc1d>,<TOPSPIN 2.1>,
      <Start of raw data processing
       efp LB = 0 FT_mod = 6 PKNL = 1 PHC0 = 0 PHC1 = 0 SI = 32K 
       data hash MD5: 32K
       31 5D 50 5C 6B 22 B8 0C AE EB 0E 7E 01 CA D5 AF>)
(   3,<2013-07-31 18:00:10.706 -0700>,<Administrator>,<X>,<proc1d>,<TOPSPIN 2.1>,
      <pk PHC0 = 99.28894 PHC1 = 0 
       data hash MD5: 32K
       1D 3F 8F 7D EF 95 4B 41 BD 3E BB 26 57 04 E0 73>)
(   4,<2013-07-31 18:00:10.815 -0700>,<Administrator>,<X>,<proc1d>,<TOPSPIN 2.1>,
      <abs ABSG = 1 
       data hash MD5: 32K
       2A AE E5 8D 73 C7 1E 58 B2 D8 1B 02 00 DE 86 35>)
(   5,<2013-07-31 18:00:10.878 -0700>,<Administrator>,<X>,<proc1d>,<TOPSPIN 2.1>,
      <abs ABSG = 2 
       data hash MD5: 32K
       14 02 7D AA 02 28 46 1C C5 E6 C1 15 31 30 07 44>)
(   6,<2013-07-31 18:00:10.956 -0700>,<Administrator>,<X>,<proc1d>,<TOPSPIN 2.1>,
      <abs ABSG = 3 
       data hash MD5: 32K
       4F 29 93 6B 55 91 EB C3 26 33 99 36 4B 50 65 1F>)
(   7,<2013-07-31 18:00:11.018 -0700>,<Administrator>,<X>,<proc1d>,<TOPSPIN 2.1>,
      <abs ABSG = 4 
       data hash MD5: 32K
       0F 3B 2E A1 F4 52 0A 46 F6 C2 B1 9C F0 CC 2D E3>)
(   8,<2013-07-31 18:00:11.065 -0700>,<Administrator>,<X>,<proc1d>,<TOPSPIN 2.1>,
      <abs ABSG = 5 
       data hash MD5: 32K
       CA 21 D0 2C 33 88 7A 72 80 D6 72 07 79 04 DE E1>)
$$ ##END=
$$ 
$$ $$ hash MD5
$$ $$ F0 F3 9C 85 73 C5 FC A8 8A 26 68 6F C6 42 71 B2
##$RELAX= 
##$RELAX= 
##$RELAX= 
##$RELAX= 
##$RELAX= 
##$RELAX= 
##$RELAX= 
$$ Bruker specific parameters
$$ --------------------------
##$DU= <E:\>
##$EXPNO= 10
##$NAME= <AC1478_ZPERCUS304_8101089_t9cD9gReun>
$$ [...]
150 150 150 150 150 150 150 150
##$TP07= 0
##$TPNAME0= <>
##$TPNAME1= <>
##$TPNAME2= <>
##$TPNAME3= <>
##$TPNAME4= <>
##$TPNAME5= <>
##$TPNAME6= <>
##$TPNAME7= <>
##$TPOAL= (0..7)
0.5 0.5 0.5 0.5 0.5 0.5 0.5 0.5
##$TPOFFS= (0..7)
0 0 0 0 0 0 0 0
##$TUNHIN= 0
##$TUNHOUT= 0
##$TUNXOUT= 0
##$USERA1= <user>
##$USERA2= <user>
##$USERA3= <user>
##$USERA4= <user>
##$USERA5= <user>
##$V9= 5
##$VALIST= <valist>
##$VCLIST= <CCCCCCCCCCCCCCC>
##$VD= 0
##$VDLIST= <DDDDDDDDDDDDDDD>
##$VPLIST= <PPPPPPPPPPPPPPP>
##$VTLIST= <TTTTTTTTTTTTTTT>
##$WBST= 2048
##$WBSW= 25
##$XGAIN= (0..3)
0 0 0 0
##$XL= 0
##$YL= 0
##$YMAX_a= 655973
##$YMIN_a= -559150
##$ZGOPTNS= <>
##$ZL1= 120
##$ZL2= 120
##$ZL3= 120
##$ZL4= 120
##$ABSF1= 14.98509
##$ABSF2= -5.573092
##$ABSG= 5
##$ABSL= 3
##$ALPHA= 0
##$AQORDER= 0
##$ASSFAC= 0
##$ASSFACI= 0
##$ASSFACX= 0
##$ASSWID= 0
##$AUNMP= <proc_prof1d_extract_pilot.lims>
##$AXLEFT= 0
##$AXNAME= <>
##$AXNUC= <1H>
##$AXRIGHT= 0
##$AXTYPE= 0
##$AXUNIT= <>
##$AZFE= 0.1
##$AZFW= 0.1
##$BCFW= 0
##$BC_mod= 0
##$BYTORDP= 0
##$COROFFS= 0
##$CY= 15
##$DATMOD= 1
##$DC= 0
##$DFILT= <>
##$DTYPP= 0
##$F1P= 0
##$F2P= 0
##$FCOR= 0.5
##$FTSIZE= 32768
##$FT_mod= 6
##$GAMMA= 0
##$GB= 0
##$INTBC= 1
##$INTSCL= 1
##$ISEN= 128
##$LB= 0
##$LEV0= 0
##$LPBIN= 0
##$MAXI= 10000
##$MC2= 0
##$MEAN= 0
##$ME_mod= 0
##$MI= 0
##$NCOEF= 0
##$NC_proc= -8
##$NLEV= 6
##$NOISF1= 0
##$NOISF2= 0
##$NSP= 0
##$NTH_PI= 0
##$NZP= 0
##$OFFSET= 14.98509
##$PC= 1
##$PHC0= 99.28894
##$PHC1= 0
##$PH_mod= 1
##$PKNL= yes
##$PPARMOD= 0
##$PPDIAG= 0
##$PPIPTYP= 0
##$PPMPNUM= 2147483647
##$PPRESOL= 1
##$PSCAL= 4
##$PSIGN= 0
##$PYNMP= <proc.py>
##$REVERSE= no
##$SF= 400.02
##$SI= 32768
##$SIGF1= 0
##$SIGF2= 0
##$SINO= 400
##$SIOLD= 32768
##$SPECTYP= <>
##$SREGLST= <1H.CDCl3>
##$SSB= 0
##$STSI= 32768
##$STSR= 0
##$SW_p= 8223.68421052631
##$SYMM= 0
##$S_DEV= 0
##$TDeff= 65536
##$TDoff= 0
##$TI= <>
##$TILT= no
##$TM1= 0
##$TM2= 0
##$TOPLEV= 0
##$USERP1= <user>
##$USERP2= <user>
##$USERP3= <user>
##$USERP4= <user>
##$USERP5= <user>
##$WDW= 1
##$XDIM= 32768
##$YMAX_p= 453016739
##$YMIN_p= -749092
##$CURPLOT= <Network HP LaserJet P1505>
##$CURPRIN= <$Network HP LaserJet P1505>
##$DFORMAT= <normdp>
##$LAYOUT= <+/1D_H.xwp>
##$LFORMAT= <normlp>
##$PFORMAT= <normpl>
##$SURQMSG= 1
$$ End of Bruker specific parameters
$$ ---------------------------------
##NTUPLES= NMR SPECTRUM
##VAR_NAME=  FREQUENCY,     SPECTRUM/REAL,   SPECTRUM/IMAG
##SYMBOL=    X,             R,               I
##VAR_TYPE=  INDEPENDENT,   DEPENDENT,       DEPENDENT
##VAR_FORM=  AFFN,          ASDF,            ASDF
##VAR_DIM=   32768,         32768,           32768
##UNITS=     HZ,            ARBITRARY UNITS, ARBITRARY UNITS
##FACTOR=    0.250966925370066, 1,           1
##FIRST=     8223.43324360094, 82536,        -58915
##LAST=      0,             -26827,          -89330
##MIN=       0,             -749092,         0
##MAX=       8223.43324360094, 453016739,    0
$$ Real data points
##PAGE= N=1
##DATA TABLE= (X++(R..R)), XYDATA
$$ [...]
23859 49465 161862 21116 -153331 98718 207789 -140311 205270 285900 60771 -23826 -389543
23848 -389543 42338 177520 -184529 -23944 -102707 18613 -210005 -306207 -114052 120064
23837 132451 -8346 42574 -272031 78234 -104255 -88308 15441 -3726 -105979 -156299 39524
23825 72403 -62517 98421 -149620 10012 -134018 112757 -62820 -46638 -29428 24889 -102157
23813 -278426 171065 -143624 204236 209943 -106013 -51733 -138883 134547 -16887 201765
23802 -110956 93955 -164902 -157067 19074 115089 16063 -56920 -101528 27533 180814 157441
23791 157441 -153730 45188 -334 -68664 -21486 51462 64353 188187 7320 88983 200647
23780 200647 -173912 -257369 69404 -37183 -92585 -144546 -131995 54283 -67115 -121330 -163302
23769 -163302 -239056 -28343 -170249 195625 337948 -313577 2671 14866 18926 -24941 -7535
23757 -67636 104490 55389 -382924 193546 -96086 -101979 -12869 -100638 -50122 320029 51062
23745 -414309 25453 -167772 -263340 167662 117400 -6110 -47792 120063 -125 -14292 34793
23733 -299846 -98247 47504 -204946 153942 -339668 -163979 -169005 67450 386208 31897 -26307
23721 194920 117148 67506 22918 -46228 -160131 -47287 70974 331120 -222181 -88720 -65924
23710 -65924 -128859 -163369 -256963 -255481 -179264 172147 54288 -168220 337108 90946 -109366
23698 -69422 263420 -6706 246065 -33301 -149662 -112358 -34096 3616 352465 -129650 -151230
23687 -151230 -105649 22290 72360 -39929 -228179 -218972 -169306 46337 178743 275581 -91809
23675 394324 -17151 -265783 111680 122075 -38185 -94030 -104906 6855 -77331 24075 -57258
23663 211100 218024 26991 11251 22762 173809 98917 255750 138065 -34790 -301891 -467744
23652 -467744 -87487 130152 40389 -4253 -157999 -154401 -242857 49268 93244 -105761 -348413
23641 -348413 -162658 -32047 -247999 -61456 -44920 -105809 104742 -230157 82715 -59836 -159402
23630 -159402 48319 180359 3261 -115938 -146017 -158325 -95204 -50607 -119151 -320163 435
23618 -173850 4502 41694 226693 -79093 -146776 41442 -7793 29541 -35821 -206903 511635
23606 -127524 168820 -229643 4329 285533 79528 -234037 -21619 -275410 -112526 -175652
23596 -175652 35786 -42368 259565 51127 170778 -103063 169601 -136078 237819 -256087
23585 -72024 -341226 2608 181310 -113108 -361147 -106050 -79245 142039 -427854 -20755
23574 183487 305320 3948 88088 -88876 -113264 25904 316852 48443 -6969 15039 17626 8917
23562 8917 88391 313318 -217933 -89194 -97551 -10019 -357481 34070 -272106 -104239 -51771
23550 124910 83619 34087 -52032 -22054 112450 142511 -104268 -1705 -35287 123219 89017
23539 89017 -248195 -88384 113469 248614 -69175 147395 -136061 -209644 -332689 74689
23528 143246 318999 -151314 139679 49869 295875 -66094 -69514 2547 -123833 -24732 174435
23516 170560 44648 105043 -137225 -171461 -185180 -179079 -217372 -242878 -112188 -182604 -40926
23504 135542 71005 -31852 107916 44794 -172752 231640 50298 -42626 -97540 102092 -234562
23492 124623 -75966 198536 168287 -48 2568 175745 -293763 735 104359 111925 269645 -371782
23479 -260703 -1137 238095 -44210 215445 -147506 57718 -181139 41299 554159 -15652 -318376
23468 -318376 -84855 -207376 -182184 221075 -276067 -54262 139169 188472 -231531 -287272
23458 -287272 25426 -266367 -176687 81817 80266 -91850 -235632 91419 -245083 273883 -80064
23446 -17988 -133570 37803 -37003 -138980 -73344 -253599 -220955 127366 -88525 165157 -53882
23434 22510 165400 62165 -173881 29676 94028 -50232 -73508 86957 -272828 -350994 -168114
23422 -101380 -286572 -67759 119229 -49265 263225 225019 -153754 -14990 27088 135466
23412 135466 -130471 3390 -143202 313771 86245 -445976 12752 185567 -198523 -55786
23401 -28609 -115801 -198467 -359692 184807 -206660 -214541 -7862 -94456 -23065 -431741 -135136
23389 102743 -152255 -196013 28599 -152426 92069 -22651 47190 197110 -23725 165085 118137
23378 118137 240657 88647 -87115 -6296 89452 86634 235726 -32174 441107 -5371 62649
23366 76737 -231044 30349 90743 -200542 2138 -267120 65943 -219451 191271 -75304 259487
23354 154595 -145500 236079 489631 103722 124163 94355 -283712 295699 -54471 -188207
23344 -188207 271216 -324508 -49827 93205 187120 -178425 96007 2317 -43536 63402 -312703
23332 42480 42371 -225553 -128515 -146443 304209 -66943 11557 -178601 128186 137934 -196664
23320 -16192 121532 -180667 -161059 -41698 247542 -334734 -210352 115078 -79596 303570
23309 158468 -220351 -21780 -242003 -281842 -248526 -64978 -468550 -132724 253599 -194899
23298 -54249 -36793 -133488 33232 132245 61699 -129020 252869 -10186 -72 -169844 141476
23286 63472 -123644 -150370 -277772 -55652 -151445 -29602 182304 122641 -305003 -228847 91553
23274 -14906 -61845 -28549 -240565 396357 230658 174733 59837 80362 221707 63086 -206780
23262 -255615 -74983 -106033 -120525 -266911 -370503 -139286 -55050 -394890 -54653 26294 114141
23251 114141 -262349 119564 20515 186313 68664 -145090 -54872 280208 1864 -90748 -152830
23240 -152830 18983 -558091 -100225 -87169 224631 -40843 212314 -48954 -8100 -389516 8933
23228 -235333 -45839 63527 119616 -199877 -68244 -87948 188551 82081 -94399 -351394 -53235
23216 -32365 -43588 -192120 95408 47708 -416883 383562 -227026 140250 328284 -240952
23205 28278 -326893 -46029 -186777 -164109 313571 226746 -26281 184754 -446755 24201 -106250
23193 -215795 -375547 33556 34654 240244 -9665 -5450 -32298 6266 -151035 -347326 -102207
23181 126763 -66847 43070 -315608 218581 -51460 -395990 -124246 -227190 -238790 328687
23170 256726 -134766 85527 -115279 148216 -68681 289886 64435 -279 63982 -56404 132119
23158 -158371 -296189 66752 201777 109482 -114402 50144 8766 59750 221093 -68873 42949
23146 299626 213510 -79536 -132138 -234457 127653 225202 58399 -165271 -130947 -161215 -163369
23135 -163369 -53710 35835 -183749 448412 43700 -50461 325688 21521 -242012 -154506 93692
23123 -87237 -27193 109495 317900 -248154 210175 -194653 -218760 -384901 -102363 200140
23112 -118961 73635 4533 224941 -395325 192270 108971 315381 53964 -130135 100295
23101 301178 54103 118484 -434034 264895 458 264119 -233294 -220618 -212843 2565 116897
23090 116897 7768 -141549 -181044 -3308 -131278 -86818 -186496 -85743 91169 -395257 350129
23078 121116 117550 158011 9778 -114605 -311964 -7622 48762 31633 148182 61244 56713 -92783
23065 -283472 271392 20411 -199558 85255 -140075 -284710 -53652 -381676 -156465 489223
23054 273031 166912 -198497 -371054 2672 260233 -94836 112886 -134858 -77323 -112923
23044 -112923 -20657 23688 120419 94215 -145171 75196 -355712 -322768 -293537 225345 -299859
23032 -8443 -331535 180394 133664 182062 187839 67157 -63213 -3011 352825 12984 -47756 169809
23019 157548 -52628 89218 -188995 220336 -130530 -210641 -135082 3209 -30689 220664 -250366
23007 194839 -231976 -229487 -231590 -116366 162032 4123 -135782 304477 26677 185173 114620
22996 114620 123072 -65990 -181902 195882 -68966 80235 -218294 22115 33192 -308696 47566
22984 37975 67426 -336059 -149488 13710 -44529 -83504 -154430 -66369 -157043 414333 130329
22972 -130115 -410923 -368983 -90211 -183862 25687 -95520 254236 -152857 -96872 45904 -415147
22960 106323 -169769 -193418 -80601 135080 -47592 211596 -323928 -31971 -103981 -33213 65200
22948 69344 83730 -244876 64683 -19725 177584 68817 205241 -766 207744 -151799 -147432
22937 -147432 201867 -61794 -32009 -32510 80254 30122 122400 -248792 1397 208675 -45712
22925 137397 25986 14765 85127 134919 -6004 -114320 222926 191528 -21189 -127254 -126767
22914 -126767 -61155 -160937 -377294 183482 171892 225882 34869 140954 132537 -266730 85772
22902 55335 -120677 -175397 138354 -193257 -129929 -355059 25794 -192135 -131150 -78468 -132512
22891 -132512 -291523 -174052 -127817 -368251 -81450 124908 121770 -87967 310111 274189 -122961
22879 103079 -187695 -48559 -175602 154569 11605 93759 -81131 145299 160870 114817 -176450
22867 145795 -220496 158660 24036 238729 18216 -61851 161167 -312782 -64299 71623
22856 -272321 -160221 195731 -342840 420423 146469 89759 -206284 -269242 12225 -337716
22845 58958 221196 -117240 87264 156858 -55648 -144190 33478 -15913 -232771 371601 -43029
22833 -99538 65124 -155204 61999 -110825 102952 -14627 -175276 3016 39787 88286 258125
22822 258125 89665 113144 -302240 -57626 -124511 -372615 -158777 73394 -319423 214408
22811 -207430 -93250 134470 101351 -30688 -215794 -53036 -137906 -352908 -129333 187979
22800 -78528 -334901 -365845 -301133 -103271 -37671 -313589 47388 105742 164466 25161 -88046
22788 -349339 147520 -23057 -109357 51416 113853 81707 -286077 36064 384184 41257 65569
22777 65569 -183680 31504 -138371 -141990 47872 301626 -13821 166626 148453 76713 -102305
22765 344210 225876 416186 36462 -113668 -59824 -125401 -38134 272787 252820 -87810 -221989
22754 -221989 -172368 224840 -29318 31046 -311458 -18778 25797 -79462 161006 88234 -161030
22742 -54023 -227317 -250868 -458622 -9883 -54768 77897 6724 -142747 159695 -71605 354446
22730 -119049 7649 -135122 137540 -128532 -11849 -419018 -32831 240576 -128598 -173120
22720 -173120 4191 -186993 -62370 38864 92394 -230239 -38697 35885 -178221 -316536 227323
22708 -50317 76277 106766 94779 -78237 -14533 26845 72300 5705 -121273 -79362 -174387 -278524
22696 -278524 176510 203173 -305753 -55560 155830 -281949 75475 -64291 -52457 90393 -188382
22684 -109565 88248 89959 122354 186015 -131763 -124515 -134072 -66786 287002 47035 4064 36657
22672 36657 -24985 73475 106297 -154278 37572 104279 248601 -46943 -34511 -153395 -269299
22661 -269299 89423 -22264 -253767 73178 -198544 -191233 144512 265588 -350739 -180108
22651 -180108 -151736 -272632 -126715 -19746 209115 -325992 203147 -234435 179267 -315988
22640 160747 31970 -135909 -384255 -298734 -183699 -26663 -121076 47439 181262 31883 -243756
22628 -39971 -16089 61252 201721 17914 93115 -26154 69317 152567 18710 -49449 -257642
22617 -257642 22099 -145776 -285422 -317162 69854 233030 -31764 -181687 20241 -137788
22606 262976 -59763 -444605 429074 -76349 125639 176022 -345822 37206 -38853 11341 -79056
22594 -3710 -155512 75341 -198850 64698 108340 278598 448346 219237 -191148 68481 -147749
22582 -3359 107036 81484 180363 -296169 86466 -151458 -61759 201056 98088 36081 124119
22571 124119 81364 -141572 129735 -165825 -107621 39243 -121353 -82939 181729 -297085
22560 -22209 -30306 -238528 -56077 51711 162754 -192906 16609 -391251 -27991 -251331 72029
22548 203125 175715 38879 3693 -327240 -155066 -279827 -86724 -109231 -318564 195129 28172
22536 -219970 93681 -127061 -136742 -556464 -24886 -9995 -310398 33580 -101647 -178055 15344
22524 102603 -313611 -289648 5985 327446 -49040 110 1209 82394 -227130 -70969 320875
22512 -81893 35236 57293 142735 -322324 -51354 -364749 -73586 -32544 100561 -298006 47068
22500 -55949 -46721 -41878 -332338 -277482 -21881 171345 -11994 242275 -201124 -106611 144241
22488 35716 -69127 -60 105344 221533 45941 -152289 -35817 153261 -115524 116408 -204703
22476 -392320 3779 -284289 114543 -134854 -216422 156020 -113505 110687 154233 -173479
22465 -334808 331143 -273106 79209 366277 244752 -37830 -223072 51891 -230836 -145173
22455 -145173 -59685 -225338 47549 179552 55528 -52883 -142036 152415 -28311 -72695 -225208
22444 -225208 69650 -21153 -79030 -61466 -233796 -88265 -233360 -203685 -110078 1173 -87112
22432 -60308 -263986 -17980 -110622 -115070 178091 -107739 76837 556249 102752 -120873 58224
22420 -118972 -142713 111923 59487 142076 174590 92634 295920 -239949 331022 11004 -197893
22408 -98924 65763 -13674 -147921 165423 -388150 -161242 350963 -10448 -72943 -389139
22398 -389139 113065 -133026 -104985 -109800 -74585 -42341 -342029 118094 -55871 -60841 -317056
22387 -317056 -189287 57094 -215298 -79846 147391 -55250 96629 -19546 187737 21343 206469
22376 206469 378580 -39093 172630 -118219 115210 -373661 147407 -131748 34703 -53976
22365 358282 44523 18697 18492 -176219 162357 -142500 32584 49902 481463 -42892 -75523
22354 -75523 -1819 100948 225002 -202158 -120275 -217872 -141559 -169271 34792 -42273 117956
22342 6653 102156 -445703 -272111 64523 -192144 -39375 12725 -47220 19799 53224 141697
22331 141697 -24928 -354876 -11116 -138754 -14250 -156313 -89291 443564 42135 -44737 -402710
22320 -402710 -77701 43056 125919 -95510 -264259 91303 13473 -222239 -233253 15699 -5725
22308 -187443 -230553 28503 145567 -276778 -112693 163591 -283502 -102007 -121288 -43976
22297 -39777 -148544 4825 153938 -77388 -409157 313486 74323 -309546 223361 -172879
22286 -122322 -10361 127187 -365603 -1873 138360 -34669 3450 81819 -55638 -5335 -71412
22275 -71412 -56219 -63145 70533 -143648 303679 -36655 -117974 -41925 -127345 234288 3257
22263 -69325 3758 330896 -78005 96684 76456 -280395 -503913 -346264 26721 -41959 -326325
22252 -326325 -221527 -32623 -199176 50605 -319722 -198931 98543 294127 -336084 170690
22241 217944 305235 8475 222777 -60137 398487 -231464 110160 280730 -29593 -369549
22231 -369549 11098 56094 -83289 203886 48034 25711 169855 -525958 -218921 -181498 -70798
22219 -4068 -149917 147243 9402 -158125 -116434 254655 -239320 103658 -132899 -174946 37990
22207 -66451 6630 114907 276783 -52150 -137618 -179415 -116023 86437 -84475 -248964 -5433
22195 198789 -61481 66410 -13025 -364720 -131081 -120803 -182649 36707 38640 -99170 176836
22183 251016 -160842 66212 -104779 85982 -179228 -10992 -315148 -44011 -56496 -31390 215273
22171 44799 222442 182068 173250 -240227 -327606 -146538 -141390 -273825 -292394 122009 -97012
22159 61363 -421787 303346 -14200 -25503 -419196 213246 148575 164170 -98421 59126 15309
22147 -226704 -123944 -57798 197214 -83125 165957 -72500 7515 101625 -24626 -5855 -173395
22136 -173395 -114284 151693 294225 -25496 179943 -161354 -137929 -221952 -177776 -190699 -11485
22124 -80976 -282645 -297734 104069 46683 1162 -276294 216982 -191293 -163381 -52064 137222
22112 -155608 186716 33003 105944 -305541 -149021 -142063 -56361 -375350 181185 243856 -236361
22100 -505784 165984 242944 -120722 -126300 -104973 113854 -222976 72950 -7446 359346 -192848
22088 204425 -109609 219258 504 -91577 -326319 21465 151615 94082 89332 -67515 272602
22076 -117741 -191475 -123248 -160875 66076 -123514 -301532 -279068 -130547 -15479 83453 -31521
22064 -267705 -250423 -74969 4787 -42282 211678 -246421 -49634 38861 76444 309056 -345052
22052 -89144 -75820 -177423 -46726 82993 123394 9123 -260412 -25427 -148585 73051 -332840
22040 -297551 78306 -118779 67879 257744 -60029 -189928 178785 82044 51133 -68820 379918
22028 211288 86402 -63636 69746 -307548 -78078 -333068 -159682 -62810 -2101 -153518 -204703
22017 -204703 -5139 224426 -2123 -226189 -146824 239541 179130 8794 -243358 -334492 150821
22005 -154857 -196463 -113606 123760 40856 -338704 -66486 -261204 -360031 -499947 293720
21994 -154212 106230 -284644 -34247 -274051 -220260 51903 -6864 101277 -74756 -69391 -105977
21983 -105977 -2209 42179 -69802 157895 316366 -156553 46647 89758 145196 -324500 -15122
21971 95381 -450022 -374233 -67260 -298125 -8346 -537002 50835 -33194 -89620 -51471 -124538
21960 -124538 -215436 39210 91505 -347527 -159095 -85484 -253093 -37717 16135 63239 81542
21949 81542 259098 -142388 10096 76560 -45566 133660 -189668 -83343 181645 -124598
21938 -116565 -314745 109003 112456 -55952 176591 90340 -150750 -54134 -8941 -366739 -117185
21926 -375467 116066 -337917 -69277 -58480 116483 236204 218179 28752 243131 239671 23674
21914 16560 -174114 -27278 -202579 48499 38049 30429 -20776 -95221 178651 79093 49477
21903 49477 222051 -11921 -43087 21082 -16365 132196 251056 -63656 -33342 -228539 121302
21891 44254 17089 5472 -204405 -43374 8240 -74128 45301 -65448 -269500 -170419 -21732 -91028
21879 -91028 177612 360225 174861 321799 180938 109744 -283492 -408831 -32516 336665
21868 -205259 -143484 118849 -5713 185943 14655 -265292 141413 -221292 280491 185540
21858 185540 195515 -36773 -225554 59497 78251 -268034 -159149 83960 -13800 188347 33021
21846 -101519 130500 43767 29124 64946 -121468 159151 -161438 -56582 -28629 -54451 -204703
21835 -204703 201662 -314667 182677 22671 -32976 336051 -120721 -346687 -147472 -142707
21825 -142707 125707 174739 -403886 1153 -114590 -52875 -69659 -216214 -111176 10784 -111577
21813 -178920 -204965 -182439 -181953 155348 106890 175727 -196767 18582 93069 -171206 89703
21801 154739 -48295 47274 -87969 -76482 30181 -124350 -66554 -17207 12456 -121468 341511
21789 33240 -92174 35219 157178 -17568 -130946 124677 -113371 -112453 -141478 -229834 -219577
21778 -219577 -187508 -43211 -141169 -406389 -151605 -50345 -3460 -428387 180667 -119335 134245
21766 175243 -159418 122616 105853 -7449 -19895 3331 70908 -38848 91804 52101 -32939
21754 65677 114691 -329777 47920 52084 227996 156398 -123875 -175080 -220200 103407 20804
21742 -102728 67782 -6746 -285779 -74452 -59520 50309 32639 -128024 -323545 -233585 -267854
21731 -267854 -463553 -278764 137857 -247365 34114 -104326 4733 242215 -44897 -289880
21721 -289880 -172674 -213706 -119255 -31013 -318090 124423 -222062 245766 -285027 274844
21710 -178541 -221353 302451 -82104 99439 18828 61366 209876 -171697 63487 -136602 107036
21698 84384 117028 21443 -123182 -369586 -54022 -114533 -29720 242699 -228068 -181892 132272
21686 12629 -155936 -292471 -86552 127122 347845 -343391 -47764 18652 280150 114588
21675 95782 -95166 384548 -105036 91389 -415585 97688 -273376 -39946 -374386 -120827
21664 -92325 61832 -56777 252119 -336453 48995 -101011 190724 96843 339362 -134935
21653 -122564 -45802 112279 117812 -229665 256238 -225792 -174692 74529 11030 205501 -171563
21641 -11249 -327337 351535 -31789 -149709 20019 115008 -286957 45051 32796 -38611 24086
21629 26481 50616 -109049 90395 276953 -39213 -94349 2353 -53245 -158537 17627 -117475
21617 55705 -256189 183372 -102488 55451 -401978 -94126 104697 -255214 -26900 22566
21606 183598 -144998 -294650 -30437 206110 -48893 -114610 40344 160854 5877 -64717 -216543
21595 -216543 -64832 -377749 90803 226226 -259243 -74624 -62323 50825 148953 155222 63031
21583 -30868 126055 -207901 166009 70076 131046 311515 -22604 157192 215935 -54702 -279115
21572 -279115 -178414 98260 -8780 -56873 -212649 -134506 -201266 279237 18602 -197598 120176
21560 34502 109549 -19037 -121858 -210827 190312 -330129 65502 -141329 204985 -59203 175893
21548 -96250 -108849 -235802 306985 -162714 50807 -72424 226970 -157963 -128359 -10425 -354175
21537 -354175 341423 245252 99642 -72772 -1650 -77238 -121488 -99946 96877 -48966 26682
21525 -18721 35141 -197555 -239832 119709 82459 -152390 -152055 47174 261046 258036 110271
21513 54696 92093 229727 157695 -247873 -114146 -59017 -333447 -148640 -83019 235286
21502 231362 7917 118277 357256 231179 -426560 128435 152154 -149472 -229116 -125264
21492 -125264 -9647 247933 82247 102037 -105220 111940 44908 -174584 164058 -208883
21481 91011 -93101 -17857 -61960 161853 -139592 272417 245864 -356428 81757 54697 -373759
21469 -454653 -139502 302097 158412 -277849 -65948 -180128 72325 -14638 210557 -350153
21458 -121697 209853 -381655 54784 -82248 -62058 -363085 -46026 -119611 -263687 -184862 247048
21446 35360 78773 -191102 -113112 -100645 209133 211924 72762 136152 323598 33364 135513
21435 135513 114456 146116 5448 144631 -47475 379063 123425 -149269 71439 -74299 -148087
21424 -148087 -105214 -173739 169302 -65986 -36882 47224 -119788 50918 -81190 -64281 -173983
21413 -173983 61925 -321681 163460 48449 -29744 -58137 77302 264254 262535 37687 -156597
21401 -154710 -106224 214005 246444 -328892 -191433 57025 -81417 -40537 132871 -179400
21390 1836 201385 100104 -54886 -229462 11505 10070 157387 43082 -291063 196184 263298
21379 263298 34777 177552 -14461 -46614 -347962 -108511 -66913 -294044 -26539 -109101 -390762
21368 -390762 355818 -53519 117276 -144160 -341800 -80976 35054 43803 -117888 155983
21357 -176352 -286654 -668 -203430 36514 -91140 -119445 114368 -41974 -136205 -101118 187248
21345 135495 -303694 5605 -293250 60982 -131090 -54574 100428 148935 -216502 -210834 -163636
21334 -163636 236110 -50165 -26047 -149877 -74686 138307 -261717 58325 82903 -273641
21323 -82282 29328 -398432 -114228 -336892 242283 186390 175880 193986 -62662 53115 -62027
21311 66561 -188241 -116000 -38644 -117547 -325619 61758 -32753 -103533 59725 -15495 10121
21299 -233759 91779 -17270 147103 -69859 38798 53281 -98364 91304 -31371 10377 189143
21288 189143 -114982 288127 21898 35759 15091 -263985 -321456 -137077 -210678 -61771 105078
21276 -247154 -264129 -85259 221940 -166472 108704 -18646 211372 -126247 220288 9119
21265 -253022 30077 -25070 289434 -104220 -165657 -262859 -146792 -87505 139674 -8968 -103889
21254 -103889 115998 -188649 86725 28224 -113322 135883 -165340 357223 -80603 -119563
21244 -119563 -60271 -92400 -46922 134052 -35164 142737 92817 -31040 132770 -245951 26393
21232 -216009 -32259 68092 189214 -127253 -25718 -231704 -303797 278838 39220 133390 4899
21220 -55704 -108223 -64435 -210304 186707 -57009 -161487 -84903 -142791 13461 217407 334750
21209 334750 328 -95584 -438176 -150650 -100579 33307 -246324 -45714 -304264 -235184 85135
21197 -101646 -125680 -173200 -164455 -228056 -402490 -103151 -279432 71623 -74618 -298649 94657
21185 28705 -277720 45285 173614 -198895 5645 80313 -165266 99993 -399140 -172797 135729
21173 187980 -14297 -113508 -201342 6406 33161 -314514 145693 83687 -267297 -186733 -150706
21162 -150706 113272 74278 -72340 96188 -115894 -76159 -110427 -554658 -279734 316646
21151 85642 28823 20971 116410 78873 -58777 125295 -158637 -65699 -64144 -108970 32701 108466
21139 108466 -23742 -20754 210333 432613 116269 -127603 146333 -316078 120213 -30550
21128 8867 -30356 -184885 43090 -4930 -126519 9057 88976 68866 -228316 -119893 -78888
21117 -78888 -36986 -22767 -139143 -60802 -41949 69099 -24064 -25115 -138485 -49897 125507
21105 328198 484765 17379 -76225 -6960 -349895 240610 -335597 -186425 -180638 247102 -74553
21093 -365940 -45709 138783 -63255 132971 129246 211109 -44459 126917 -77927 -973 -243413
21082 -243413 -46898 -122827 145323 -13465 -14223 185199 80916 -100704 62086 152814 -454951
21070 55217 -215194 -219653 84341 -126506 -155851 193782 -263003 46382 -169324 151795 107556
21059 107556 -167136 -42869 108815 22498 -70592 -15412 -164615 94657 4067 200462 16315
21047 75549 111323 -65589 -57960 -229085 -136491 48096 55384 -178858 -358757 -28184 -346542
21036 -346542 -300634 -113590 -266164 217934 -61003 -11261 -129605 -245474 100895 -50458
21025 -6330 157673 -300641 -130700 -167743 9561 -203202 44127 272201 115855 -320432 -153758
21013 4100 30439 52536 -5842 -102439 -115442 -283703 -727146 -99228 137868 122695 -164980
21001 154113 236646 110146 122387 -184370 -40860 -308341 -130331 13100 -147652 -220720
20991 -220720 73758 -378565 -196059 222058 164418 -177059 -105024 323815 -29533 -67978
20981 -67978 -160080 228411 29399 -472546 -71685 -342524 58343 -124092 -131219 4632 -36909
20969 -162696 -338190 -37355 164957 -141858 -154917 -167334 -81368 -280705 -188974 -235515 -83565
20957 -221846 32181 198732 375111 22008 -18987 80127 971 -157078 35414 -181345 -296629
20946 -296629 167085 113276 -107237 37594 46139 85650 -58149 -255620 78270 -174077 -79939
20934 235758 143820 65477 56529 231108 144307 87637 -149866 150866 -173109 81988 -291684
20922 -201238 -17197 34375 -14799 47682 143217 71796 112061 -196772 273325 -245272 -67234
20910 -352951 380220 78579 148777 -339018 -186588 -349143 -273171 -239997 87140 -42755 -171865
20899 -171865 37807 518802 140653 -126783 -149598 6480 -175903 50062 56361 -31398 87221
20887 -215513 59479 -305055 -110319 -13516 215439 8890 -162355 -43705 170627 -24530 -26437
20876 -26437 -205329 -164798 -113562 -133792 -310747 -148751 -157659 -196314 -263310 -16619 -70255
20865 -70255 48763 -4071 -95762 -218233 -23797 -148238 -49258 122336 -266895 -84242 -187834
20854 -187834 112978 34499 81495 -346661 20502 86280 -21727 -53860 -94064 -117506 -159234
20843 -159234 -329609 39104 104198 -9186 -158073 -354099 -258504 -116199 -334864 -523387
20833 -523387 -59418 -12796 28414 50736 187076 -74090 235768 228981 -1642 249541 -77441
20821 114887 5388 -278599 -319535 -378 88365 -141424 167527 174326 74673 285406 -169146
20809 -217053 33244 -292756 -79471 -246778 241702 -209600 132642 10090 20578 -84301
20798 -353417 -46266 28831 -238180 -386887 -123452 -566080 49789 107157 64444 -61094 -68697
20787 -68697 -308700 39486 -220082 23964 57221 122974 -133752 -121742 75695 87443 154927
20776 154927 -113181 148832 -98087 -207727 181138 -273835 -222089 -365348 -134626 -120034
20766 -120034 127575 -124029 -216608 -29327 -179460 -235738 -73136 -2128 -44809 465661 -12088
20754 39224 157249 100584 107256 -276812 7366 -84431 38987 179364 -246414 216595 13778
20742 29163 -179305 -73044 326245 -297996 -146649 -5505 -57955 284981 207254 97190 -115615
20730 310595 157129 -164878 -95375 6271 68502 297297 37427 -157441 -250291 111039 -305350
20718 -345862 163048 -59495 -308598 -148043 -266118 -358072 125090 -23125 175852 -154705
20707 -186647 -93445 -306253 109916 -84411 161612 -180454 -72027 227633 -432665 -94759
20696 -75587 84927 -83257 -295125 -96322 -111950 -54956 213649 -246905 168005 -429194 61846
20684 -15429 -86816 55664 -109276 36755 124951 31585 -300786 88068 -302491 98719 -180484
20672 100519 -223963 -244107 -224460 83147 -292358 -92979 23574 203083 -149513 -153685 -181209
20661 -181209 24044 -176605 -54901 75212 234124 68856 -256493 -204552 -40102 216109 -80518
20649 -233828 -56532 1049 -65613 -236679 -113497 -4315 71819 -168021 -15445 -144975 -158515
20638 -158515 -325642 173596 -292417 -402098 83874 83067 183941 -276909 118572 -29914
20627 -22170 -258019 -100202 -110496 -160763 114711 -12687 -101300 -9037 176189 -154413 -253553
20616 -253553 -125455 74393 192855 -43600 33465 146888 -227100 93908 116609 113205 -130903
20604 -257950 136555 -83557 -228882 77724 84333 -21855 217374 57896 -108854 19613 286640
20593 286640 -187390 -11255 -89153 -54389 -130128 -164656 517447 30144 65927 98931 -222147
20581 -122957 -106768 90270 132557 80682 -116421 128265 -74450 -27252 48212 143492 -306497
20569 -205123 19965 -69572 -140217 -250061 126284 -68663 95198 -58227 -215306 -162201 -127019
20558 -127019 -264985 -74024 -481063 51467 13260 -54915 -143038 87247 -61094 -61806 -91613
20547 -91613 -462828 -215187 -25363 -199285 -65916 -318494 -339629 -70757 -153487 70678 -50408
20535 -5332 -231738 -53817 79156 142498 14500 -40620 -24500 202759 120742 -104646 -242979
20524 -242979 89589 -135515 -2790 -50939 95867 38991 205691 287256 -126037 331126 -83065
20512 -410112 -66044 61939 -89020 -78070 29363 -272754 105012 15508 84934 11591 -364020
20500 96576 233917 153564 37175 -320253 -167337 -239592 99709 299193 -107412 45941 217117
20489 217117 -118590 -399528 -264910 -117867 15673 68933 -7016 27539 -331011 50684 -61369
20477 -328885 80287 -57266 164505 -19628 -329284 109789 -25110 -5904 -76503 490511 -111423
20465 -211601 -122928 141145 385633 -125475 -132369 -36716 -67955 -359620 -120951 -311789
20455 -311789 92754 -132431 -131495 -298743 149002 687409 250999 60048 290857 1165 11651
20444 11651 12007 -226539 -153446 111305 -182318 159523 120063 -233051 -366418 -197346 -181643
20433 -181643 -402560 346714 -378445 -208840 -19631 -122428 156403 322115 75860 110596
20423 110596 48355 -454811 105483 68317 -16890 58228 92351 13073 222261 -211113 3010
20411 -438260 -66913 -42041 -12261 -158517 42378 -167299 -228345 42777 -21495 -121104 -38735
20399 -252306 56988 134898 203006 136294 91861 -180322 -269306 181272 -12840 -95960 99494
20387 -259430 120297 -69951 230861 48978 -86299 -137533 122909 -11822 -258899 314113
20376 -226627 -58784 -71154 -145097 -77827 190761 155892 -238522 3597 -138151 -332052 -196280
20365 -196280 -119727 -39177 -101926 190566 -39684 66098 -70296 -189102 71028 -309360 -302838
20354 -302838 -4436 -22206 172719 204296 -48563 -50673 -461721 -179203 -177370 -13900 -117407
20343 -117407 -173187 -116778 -155903 -436561 138093 81586 -98648 54509 -160333 -12909 15325
20331 35491 -140470 250303 -70653 -149509 -33547 223125 -186766 19415 512467 132858
20320 -292943 -365877 55330 -38771 -104939 135016 -108063 -158277 17225 -71002 -234022 -143636
20309 -143636 313704 -463485 289808 -66554 121285 -206729 -21721 -383490 -421299 -276364
20299 -276364 -183558 -97352 -98369 -197936 32176 -18956 -240297 -95434 -124294 -45090 10634
20287 -45348 -110915 38777 -45813 -134621 -13184 -189345 52830 -120844 61253 24814 -170354
20275 -228487 -18385 -55578 68117 -22694 -74676 -193522 44906 -16408 57275 -87632 -262405
20264 -262405 -287492 -236034 102727 -216426 -185971 -37737 59770 -263121 -79672 128043 -80949
20252 47780 -12940 158109 237778 43599 -95992 275751 51927 71685 -288019 29410 -84755
20240 -62647 -65426 -16716 204481 9729 -153854 -130343 -109231 90721 -31664 -315008 -50807
20228 -81008 -229694 133466 -97762 265168 264355 -257268 -68127 -260122 -174027 -287290 -104205
20216 -73826 -14343 243935 -128703 -203360 -27052 -233722 -262117 83461 -419423 28776 131238
20205 131238 16990 -153438 -113199 -128790 -138017 324262 1391 142663 -148841 -132527 52612
20193 -100189 17086 59985 -267967 -290195 -65209 55968 264058 -148699 -95112 -153726 318107
20181 -267783 17721 -141903 84056 -136537 -30247 -106596 15111 8022 -99316 165646 277624
20170 277624 138856 84337 13107 188462 110909 280780 -231539 112757 29034 -183177
20159 -89017 -231372 -181592 -326006 -83687 27157 -208840 -156910 71968 -210929 49734 -229854
20147 44752 488941 -136746 -212453 -70477 -279960 -98479 -151699 -219766 144780 -225029 -16155
20135 75568 47904 20489 -236235 73075 178580 -214933 90987 -365110 139570 218255 62415
20123 51895 29223 -148572 160157 -66893 -496782 -105007 -31565 62712 -9428 -244194 44035
20111 -165422 151692 -27325 44138 -86387 -348913 -224382 39683 -196571 -267391 5324 -183732
20099 89035 -195569 -251043 -201705 -125450 -30026 32223 -312966 -285684 -114988 147648 -4971
20087 235401 296264 -135316 -296663 -221427 -236681 257040 -198155 70097 -323816 -84444
20076 272285 168413 -133270 -56862 -164233 -151248 74613 104778 11617 85539 52709 -113006
20064 -195877 -224277 -152636 -80401 248062 -128127 -58084 47857 -49391 53371 -135332 -48271
20052 -56975 -136441 67927 -60418 28694 -180816 -319337 -323223 129760 234204 146101 419396
20041 419396 -37771 -131614 -10129 23989 9976 574980 114569 35636 -103685 20341 147145
20030 147145 -80324 91577 76524 147314 -149938 -213748 -155996 -79052 11595 8207 -155398
20018 -42853 340877 -172055 -89354 -221491 -301239 -12181 199081 -139484 5316 -99411 -190063
20007 -190063 -89495 207343 -104917 170580 -376943 -230515 141486 74923 -205181 -106030
19997 -106030 -206409 -87914 -68414 23921 183985 126909 28867 113081 -167489 46290 -250433
19985 -91091 -300435 178430 18604 -332937 -17367 -104756 -105095 137003 -245970 -85988 232027
19973 -14291 30855 170713 8914 192267 -129421 -32733 -140174 24855 -79845 172584 189738
19962 189738 -162463 19771 -132709 94176 -140822 -176206 -154020 -51283 -557 -311556 233217
19950 12455 -203436 -218992 32114 103928 -237196 -101272 23267 -12892 -12745 -119620 -50248
19938 -249342 -33319 11966 -46838 -124244 96093 121564 94206 45688 9698 327106 -400448
19926 -229573 139876 -225599 36021 -449382 -178911 -74782 94775 117808 -161815 -139137
19916 -139137 -358209 180138 285707 -230505 -356408 -327401 143072 -156796 -54507 -41717
19906 -41717 74912 -18321 212679 10350 -59052 -81261 -137471 -16316 -154886 157870 -194092
19894 -27858 33560 194826 12839 -289899 364309 -336025 -146177 -119416 -202039 -155561 19043
19882 -75561 -175414 132743 134087 17024 -32898 -395334 -331827 -90239 72865 -47883 -221038
19871 -221038 36969 -488390 -174918 6089 -230319 -135131 26637 -393772 -127384 67101 151288
19860 151288 -47127 -171771 -357891 -384175 -133955 -139734 -280166 -225112 466728 -18586 104199
19848 -107793 -304499 -50189 102601 193301 -225061 -172237 193394 432723 5318 -28256 -229135
19837 -229135 46217 -140667 -148608 -264367 29177 -103254 -158628 -169603 46288 -322101 91536
19825 118679 21540 72505 -3921 -39456 188878 -155276 45326 -143041 192687 -134169 -19864
19813 -158580 -283875 -270640 -340779 -336915 -169102 -149907 -84174 26372 55968 -268656 91716
19801 114861 -286274 -159116 331398 173491 -273306 -65598 -97823 -151432 123935 34462
19790 79860 -145621 -13258 -281094 -118675 84980 48707 -46038 -290987 -324881 128124 -330401
19778 -278341 133939 85837 -186039 -20219 -247845 -146610 -429476 82409 281170 342804
19768 342804 -168259 -48513 -47984 -75247 -222176 -105497 36845 62542 97957 -104263 207733
19756 -18382 -80130 -178084 -43572 -323733 135913 42539 -246124 64728 67971 -67516 -154441
19745 -154441 -41059 279061 24995 89860 6925 -38870 83515 -136463 -129305 -187569 -1930 18404
19732 -479345 102186 -197233 -52494 -96139 117717 -473803 254084 -466870 516089 26775
19721 -44181 -27493 -53398 -25790 60625 -280668 -318307 188331 39078 -189601 216694 -203999
19709 -182656 180919 89054 -45794 -65210 -132196 -218254 225949 -56943 -451155 -26641 46111
19697 136637 -3585 -4620 26354 -21313 25131 -300687 -351172 -232241 184298 54816 157650
19686 157650 -179635 8717 88494 40975 -27043 -179896 6133 -157364 -308463 -205729 135225
19674 -215777 7768 69381 37176 -12530 -140545 -43765 -448212 81716 -188193 -161997 315243
19662 -42904 -280877 -66420 31423 -316629 -184578 208198 -7763 -39270 -216002 266673 -155828
19650 -30596 -10992 367002 -105835 -324596 -29317 -143223 -135081 -408322 157699 -138714
19639 251646 69437 -31060 284473 -121423 -145976 -275804 -348048 235777 -202752 -98379
19628 -333607 49434 -217082 -219747 -180017 -176379 -62095 -131159 -473624 -195948 178700 403224
19617 403224 -229744 68944 56702 117348 113054 -23452 -222094 -204891 301 -221293 -277893
19606 -277893 58055 -81709 -286329 -74928 -86942 110515 -207738 -237151 29281 -136733 -115065
19595 -115065 64577 -210205 3804 -57565 62329 -166853 16286 208207 145836 -225562 -15375
19583 42563 143008 -325651 -15826 -126351 -137325 105348 109653 -5204 61014 -257223 -142045
19572 -142045 -94737 -238113 -19880 -278154 201338 -245136 291860 147647 -139697 -233960
19562 -233960 57981 -106033 44003 -222321 -373782 -35951 160576 -21200 -238070 -167780
19552 -167780 120477 -158808 -211129 151355 -352668 19494 43407 128443 -30403 -62703 -59567
19541 -59567 -142313 48115 -237175 19346 -291146 20791 32429 -228173 -324788 70929 -77756
19529 -60503 -186001 166716 -86532 -185722 -234406 -45015 -126722 126146 -232453 95950 -123927
19517 95048 -155955 80949 -144774 -26398 -360648 -52010 -120425 323883 74856 -271564 336067
19505 -366252 -84057 118461 14638 -194612 -159568 -66540 -192319 -9575 101467 35013 123542
19494 123542 -160102 -23022 -51626 -347726 -68899 -14891 -246874 -277166 69600 -223160 -2963
19482 -493762 -86926 -134894 77499 -122644 9633 80107 -239083 109080 176292 -408099 17331
19470 216500 -47073 133121 -9464 49521 -34846 250422 -148302 117030 12585 72202 -61785
19458 -414099 -361592 52897 20241 8708 -230927 -124436 -106851 220609 -153515 41127 -5509
19446 160930 -43303 -302208 -39408 -203024 -23828 -143253 163656 129718 -59587 -95065 119711
19434 -361367 -62376 483236 43281 -49014 128440 83855 -192529 -399094 100609 -602104
19423 -428464 88221 -211143 -167479 199803 -220502 40362 113775 -75315 -155685 -79827 -57404
19412 -57404 -450452 -74754 -126946 151279 25539 -208566 -198514 88138 -179866 -310689 -60116
19400 201190 -432425 -33805 82822 77078 -437122 -56081 -324596 -252153 -43574 -95862 1915
19388 -173697 -566500 -75200 -118327 208725 28939 -99034 182903 -208471 67100 -154633
19377 -119451 50870 82072 -282898 106018 -128319 -308655 -281152 -253374 54472 -29110 -559
19365 -44264 -413840 -76479 -70164 -62585 -129532 34278 106843 -60684 -173142 185363 -129875
19353 111727 -165109 5955 -84303 208558 -258424 -291863 178162 127559 68558 -166500 -342725
19342 -342725 -199355 50435 327618 -71939 -140840 105980 -140229 321436 116559 -98782
19331 -24563 -138523 123587 237875 -82119 108074 -155714 -180066 323484 107603 -127336
19320 -275430 -52641 -3589 283014 47666 187526 -73959 10171 -457504 -11120 -60267 -16958
19308 101897 -59920 -265699 -177962 161806 223403 -357898 -39423 78211 -102255 -54207 -124494
19297 -124494 -49742 -43711 -115617 23278 19515 -158937 48605 95986 -505800 -212665 2726
19285 -170124 94234 190737 173809 -233810 -305545 50415 104269 13107 231851 -124135 23805
19273 -120454 -100987 -202095 -231485 -234916 6949 17682 -57961 -341209 -56558 -183632 329873
19261 -195817 -277699 126177 121071 -13734 -279648 122216 68220 -93602 -172560 -164350 112180
19249 -106561 198634 116128 -24123 52056 -229299 -101625 147303 -214636 -224964 148849
19238 21690 -76299 -511827 -144143 -317222 -365306 -374963 144170 95140 172608 -328451 391103
19226 -72991 110442 -199865 220636 -330432 72137 -142207 115379 119072 -296245 110939
19215 -114287 78003 -305761 796 -72499 -173159 42926 29890 -104599 -226179 -210572 -281821
19204 -281821 -304931 96134 313702 -472848 -38722 232009 440593 17954 -315811 -514870
19194 -514870 -27885 -190217 50948 -219278 145207 76596 -6786 88488 87582 -219148 -472653
19183 -472653 144168 -211787 61881 -429703 -225709 -8061 29716 -189717 108098 -246501
19172 41441 -109441 -44178 -318891 183950 198762 -21033 -176848 -134209 15143 17029 -12082
19160 -118582 17400 54326 -167816 -275159 -200312 -188230 -91963 -300107 123535 36133 -241658
19148 80935 57428 143199 137516 -81066 -301526 -234793 -132600 504567 -340736 -407103 -327997
19137 -327997 -162091 160502 -217196 -622216 -197292 -53632 -126781 -152258 142919 -69132
19126 285389 9254 8872 -141520 -3640 -353104 -295463 21377 -9776 63352 9215 -19337 82775
19113 -220183 216233 16103 126937 220351 -227475 -129286 17678 -29675 -301081 10047 -55899
19101 -99868 -74357 -229131 -208022 55665 -132409 -99773 60922 135236 -4333 -153437 -97048
19090 -97048 -139992 -262168 72392 -117278 -178895 218070 -27193 126440 112483 -113807 -9710
19078 -91094 -111242 -172010 112581 199992 -133010 -115241 -68949 -110487 -40149 -200368 7227
19066 95759 37564 -57936 -23718 -97521 -238039 -201346 168818 -178590 -89114 -134435 -39021
19054 -407745 101084 -199514 -146328 -258066 136332 -186698 165144 -139511 210111 32451
19043 134835 -34471 330805 -208486 225672 -62889 -145761 56234 112076 -55139 -75147 -148042
19032 -148042 -118408 -331846 9481 2500 -142481 -134017 188617 -50148 191565 85285 159793
19021 159793 256795 177443 -5462 -118802 -259769 -146510 -111456 -22980 -79719 -19375 218425
19009 71591 -77510 116033 250653 -41188 81872 57706 -53459 -6105 -206963 150796 -249060
18997 91886 457092 59223 102688 -361087 14023 -262707 -358902 -65408 233934 250313 -128351
18985 48928 -159925 -235574 18337 127453 43215 13743 -5378 -207711 -15635 -157071 -66307
18973 -85223 137847 -27694 -292070 -24591 25437 187026 -28643 -31892 -75526 305782 -127314
18961 -421338 -70499 -52291 -82848 15974 29408 183265 4474 108397 -77628 -71548 -226818
18950 -226818 91306 -17373 -51986 582541 -182158 239135 55347 -151511 16185 -323902
18939 -42271 71818 -319433 -69556 -117106 358594 153246 72745 -3211 -94358 266439 -188284
18927 125975 -148470 320509 -240545 118155 147571 -2855 274757 145895 -217089 -37320
18916 -41473 -183869 -16358 -36829 -323397 -215224 -101706 -145825 -254765 -7537 -44696 -196495
18905 -196495 29572 -361024 -22756 -285344 -83571 -123377 163508 28552 -84391 159778 231912
18894 231912 103257 -138959 -104698 322483 13378 -141116 226484 -58591 11174 30324
18884 30324 -104200 -329638 -183637 134171 -193157 -53065 -130695 -277878 19005 -194993
18873 104619 -83760 -268882 -6923 -118181 135708 -109272 -184255 -96793 -7969 -34526 -155875
18862 -155875 96359 -174765 -28873 285131 -30060 -190017 -102915 29823 -83002 81253 -170986
18850 -109546 173542 91505 -87879 26819 -199220 159465 -225964 -53471 154173 -322940
18839 134267 -232091 82284 -4469 -314535 86680 -5787 -101681 -125677 -98072 -248521 66097
18827 1399 -127231 -110447 -361184 143968 -254946 -267047 -112987 86817 -113450 -358871
18817 -358871 -132864 -230954 60691 -141636 -228460 -321820 391606 109276 31663 31359 -25099
18805 220612 221827 -406732 -69533 -83306 -142354 -100591 147535 -112898 -166478 -134849 19967
18793 89761 -140202 -9863 204918 -72150 -119017 -273327 330487 46642 -192010 -206356 139909
18781 -101146 -37462 337243 139237 -2576 -47395 -82608 127889 216658 -267731 -160985 -71391
18769 84929 86629 120883 -220557 257588 -64079 -204263 202905 -26708 -202509 -60647 -191158
18758 -191158 -105764 -67381 -55103 -154355 318415 19361 -207089 -73901 -30280 -188056 -211175
18747 -211175 44207 -120827 106289 -38149 -59680 -71341 -79898 -57699 258909 -84332 153168
18735 88341 -253215 29239 -356826 83750 82221 11877 -78553 -47636 -127440 76137 155771
18724 155771 229273 -6842 -225048 137876 22807 259298 143765 -23377 -48110 122647 -193253
18712 44278 -35990 -128868 -325613 -282977 -38683 -62586 -323003 -118802 245380 -70571 -124141
18701 -124141 -103375 -90092 -256541 126398 -132202 20295 196464 -209669 218826 -269382
18690 -93864 -287626 -393269 108959 -246531 -210896 -160923 -56710 24262 -242836 117853
18679 48507 -69874 -61444 -116645 144352 106314 -308583 41218 -154750 -32062 33417 -373395
18667 102125 25638 -121290 358409 175369 54522 39531 284674 -258865 33159 96661
18657 96661 -71394 -141728 66015 56126 180329 -80235 381695 196187 -37397 -312185 -248006
18646 -248006 -246470 180130 -89563 -177675 -42764 -179119 162414 97632 159549 -165681 25928
18634 171575 -46661 38976 130576 114031 1386 17096 -241946 -352950 -175418 27589 -133170
18622 -32610 96872 -262299 -11886 -139460 -132868 112116 -167528 -153853 -5409 -368900 -158188
18610 44017 -145080 -152630 14308 259396 -132546 14523 20209 -239880 -278015 55168 -256524
18598 286655 23740 144575 75847 53885 113482 -270609 -198134 -254654 89930 20439 -287228
18586 -255278 -155234 -128285 13453 -76393 201851 323077 -81293 -137947 -195834 99921 75833
18575 75833 -297827 -209699 32455 -37600 147589 -31557 -246691 3247 -98968 -295426 299890
18563 -155296 226891 -112919 300655 -330762 -113266 301140 66471 69471 -114310 259990
18552 -240385 162382 -59803 -20108 9572 9112 -137154 -168230 121219 -214044 18576 -66194
18540 -209291 220557 -41587 -401125 4331 -55573 -158829 -11981 -75805 -5949 193997 478319
18529 478319 8861 42129 -21504 -16221 -161658 -84402 -88252 198351 -19084 -269174 12942
18517 -191557 252343 -67793 449082 72861 -239324 -32109 -44613 -258958 -174638 -20101 -132160
18506 -132160 17925 -233017 -40165 70612 -10896 -73531 -117950 63496 -143900 -349744 91169
18494 -111519 -230929 122701 -61117 50395 -27016 -117675 -239516 -244552 -91183 136451 357145
18483 357145 -55125 -59827 147177 102892 -14571 -141737 450514 -176061 -75207 -219584 149762
18471 216237 -139539 -17059 129305 -179678 -82188 225575 -154795 -165429 -142787 -176226
18461 -176226 -168435 -186683 -320683 -103428 242668 -175762 -214801 -166997 -203340 128309 -137773
18449 -142206 16712 -194928 -25924 30261 -24743 -237404 -24747 -116055 99254 -73653 6077
18437 28875 -193925 -284595 -239924 404605 -175788 -154874 153626 -23843 114444 -194013
18426 112843 -267557 -27427 -283424 -241508 280609 25858 -128800 273549 -111354 -146523
18416 -146523 -29566 35504 -193396 210693 84847 -7944 -82096 71862 -95580 307419 -344345
18404 41190 -48831 114997 164526 -149688 -128812 39945 -133142 23528 226761 -134580 -36757
18392 -239156 -54731 10110 -104301 -105083 86969 -172055 -329854 -85515 277027 40822 -52514
18380 -47721 -448417 27745 29289 18262 -63042 212830 191123 -17657 100827 63064 -236946
18368 11955 118061 12552 18876 87443 71627 -38860 -169324 -16455 46375 -114064 136390
18356 -23684 190845 56738 -331448 -47731 70366 192146 -287003 100624 -110664 180862
18345 109765 311160 -167766 371559 50352 -200036 -263716 -154179 -139872 -210080 -119442
18335 -119442 100463 116465 162388 -175284 -62500 -178150 -301837 -40355 37554 122540 -234778
18323 -71610 205899 -27499 -60038 14778 123855 91483 148429 -193506 49323 281289 -10843
18311 -97531 -141075 -80289 -169154 213742 -48275 -24109 -145081 105837 141071 97199 -53077
18299 128122 -233555 -78476 -305760 7644 45706 -331383 156169 -211410 -204878 -64819 -166731
18288 -166731 -1400 43978 -298467 -89451 -11056 -97444 -152740 106447 -237375 -163547 -28402
18276 91063 -434231 5304 -208594 -203282 227222 209299 -77905 -94619 -32868 209128 -106680
18264 -329657 83993 -158661 302200 79686 -444887 106892 -118926 -248908 -91873 -176636
18254 -176636 -384251 201308 -8726 -63567 27115 -62915 -230909 -180149 208622 -483264 -429878
18243 -429878 142530 -297748 56886 -62360 99125 -77152 -120481 -198917 219220 -22025 41552
18231 -127054 -18194 -88091 -58896 178945 166568 92893 52893 -80933 -404445 149998 78077
18220 78077 -113580 -230845 93650 -54022 113205 -56410 62848 -320499 386093 59384 -142249
18208 385386 -307023 -70262 179416 -81763 -251598 -53019 -23800 12195 -286276 18827 88742
18197 88742 -128139 383433 83422 -156060 64538 138358 56606 67717 216708 -403374 25208
18185 -129882 -94523 -153483 -465239 -101720 -73117 47117 -263541 70081 -97305 -183350 1535
18173 -111739 53254 256314 71728 -229738 -191151 60468 -213389 243173 -39668 12515 -351829
18161 -47721 1290 -152264 -204040 -231047 -44497 225709 -99509 152374 -98924 -88190 -115387
18150 -115387 -81791 -171162 105883 -98746 -1170 -342676 45664 -36504 -125292 181948 -159208
18138 -121597 -113814 61941 -181504 20446 141851 65590 64519 596 314843 -22515 -30812 -67669
18126 -67669 133698 116369 -115189 -106920 -82225 -114649 122176 -224462 -257300 -30258 -234862
18115 -234862 130234 -10126 243190 334009 71516 51070 -353575 -42069 233452 -40037 259799
18103 -55340 -175944 -181930 -41066 -190908 -172745 -185530 -12185 246661 -383644 166881 58430
18091 -235459 118361 -91125 -27146 192163 -42435 -55316 368147 205082 -36561 235238
18080 69967 -54178 -110120 -127950 -237347 109016 -71436 88465 -153534 -23516 -96107 -86809
18069 -86809 -38729 182534 -107237 -44832 155689 1315 -245660 -65853 95115 -101085 192021
18057 -3706 4316 309603 -159824 131359 -13440 -11519 61863 189616 -25212 32129 -177495
18045 19334 34998 -119817 43494 121639 -1719 163107 -547954 -157550 243642 74198 -355853
18033 357800 39841 -75040 -216377 45964 74892 -207509 -6312 191006 -54672 -84916 32673
18021 -49445 13380 -170269 190292 277922 -166179 36269 -3629 -280926 -134209 -70962 -122730
18010 -122730 152482 -37314 -71792 -175330 166252 -143379 -336054 -102771 126068 -330400
17999 100033 -237970 -196994 -98152 -521908 -202407 67461 3459 249258 14705 145482 131232
17988 131232 -13526 38252 -75212 -308318 -35304 -20227 54829 305098 -109248 24098 -142576
17976 139593 -221744 -29794 16805 -29423 5819 -411570 -221250 -93760 58602 42797 -22002
17964 -248554 -224121 61532 878 -108519 38971 222998 -238121 -243723 -103672 -166367 262681
17952 -264302 57380 -195037 -208615 -127736 54151 -37996 19200 -25544 -351270 14395 492
17940 39718 -71817 -10908 -87707 157671 -72660 113905 -67193 176230 -228314 16131 -325626
17928 168928 315196 -127267 -45315 103680 46999 -118029 -95817 -109115 -5779 -26886 -151202
17917 -151202 -27069 -119951 -139193 152536 -123384 -411406 -11885 16682 147833 136234 -94058
17905 18804 210759 -44057 44825 -61330 -68123 79737 42091 275119 -189878 -90359 164860
17893 -166208 164795 -122294 -102113 -220431 -72569 -296345 20803 -196741 -123461 60586
17882 16360 376599 -125768 -80762 -117290 299494 -8216 -163977 137961 184424 167729 78161
17870 26593 159494 87027 -71467 235958 134322 255140 -208095 -138799 -14511 -62464 139034
17858 188363 40213 93550 227504 -243365 -49125 -77602 210475 -256730 57550 -5492 -78863
17847 -78863 166915 105243 -95936 -335956 -341310 -151175 95189 -15144 -62055 62329 336808
17836 336808 -90971 149320 214609 278814 -66066 -117817 -104348 10335 126856 228448 -19129
17824 86581 109652 -211493 32669 158055 -1451 -185241 -70724 -39068 411228 40923 161270
17813 161270 115811 313243 -144900 33753 100401 -285339 -43703 -59679 111773 5291 -284581
17801 67580 162473 -97853 43158 76565 315898 64867 -113000 -56534 194131 -193269 -196002
17790 -196002 173446 121251 -220450 270244 -290633 165178 -76174 194302 -56116 -190045
17780 -190045 -237827 203078 -105291 45570 71712 -192599 268400 147289 130070 68157
17770 68157 -205818 -168829 115410 -104190 -231901 339296 -65833 399478 -289056 -97979
17759 -215224 139918 -150097 -217357 39480 -170020 -156461 -103685 75904 344867 192433
17749 192433 70112 -31751 -45513 242735 161390 210118 123705 34713 124214 41062 -19644
17737 13861 81298 49032 -20458 170545 134952 -199471 44145 127328 35316 143868 67511
17725 39245 -49857 -67774 -137178 150175 125957 113393 144437 12443 -41798 -221526 112968
17713 -62076 -169096 -205973 256304 171912 329872 -72093 -37989 106146 145374 91607 -53771
17701 -229720 -143250 410168 -31746 154459 411562 -12815 129362 106684 -41895 -37249 402532
17689 -115377 69867 260558 70037 178763 332842 26056 -104074 -180293 -63825 -180305
17679 -180305 -194308 209206 -11706 -193606 68470 -42750 123630 -97506 -142911 142272 30274
17667 13477 55874 122140 106314 -379773 53636 -196461 -324257 23101 -321342 -187315 214126
17655 46652 139079 -54228 -21183 43211 -171901 -298734 -62443 58652 7703 -7376 63764 -109526
17642 265351 -178708 -146142 99218 206672 -417916 31726 22490 -27853 -67479 -130006 -226242
17631 -226242 91569 -221882 254853 -65454 208783 36878 -632 -195544 -250664 9340 50949
17620 50949 268292 115900 121196 -53426 -131652 218482 89830 -171821 -36226 -19832 241080
17608 177734 32033 26356 5986 -259899 -205393 -37749 133882 -109863 402811 3746 -145202
17596 5498 195082 242777 -118097 -253173 200992 255387 -29359 206131 -166633 -79359 -103971
17585 -103971 86785 124458 -124695 59740 32099 84001 51438 20057 -128722 302156 66066
17573 183144 -195908 63573 12284 124128 3128 -127289 -59357 201337 -27327 -202008 -206053
17562 -206053 120227 202151 187285 355661 -55061 -19962 188836 310849 -7963 132691 -22471
17550 271596 41821 203891 365333 -65742 74667 -38689 276388 -59583 -162692 202836
17539 -70649 344790 -34657 -162399 -181636 82012 250210 -35304 130628 103678 -173733 349552
17527 288716 146089 -103317 -285246 18316 36420 229475 -91668 -305252 148172 -77991
17516 63086 371331 -85216 -100333 123044 -19148 -152351 -44344 275045 206174 -80249 51634
17504 314800 -34516 112221 312342 -60296 162066 102072 363337 43062 189044 40952
17493 195242 204154 155533 118651 -111704 199637 380185 128592 -187326 -126085 5024 -71428
17481 111480 127985 36337 -274867 399613 326927 241516 13385 -320919 -9069 184391 283441
17470 283441 9254 201290 251583 -179905 120700 97255 70687 196083 264833 -147730 190026
17458 185473 465056 -95126 296997 419973 33578 278216 302628 -198705 78889 310293
17448 310293 315521 315427 309622 220857 210869 321782 458461 266263 252376 362710 215508 134091
17436 134091 115195 419102 373700 106828 571040 292125 214958 267560 198227 505638
17426 505638 62932 93803 368930 24686 154527 33416 108363 -113351 488874 119474
17415 348900 341258 418452 444516 -25783 186742 78840 176260 208021 -167529 284177 113916
17403 -43090 409275 -40125 244771 -132582 57254 239172 91688 -286996 -104276 244792
17392 -210115 204673 -21330 470324 -26222 313735 82416 72458 185829 63420 338787 49169
17380 404747 209557 -16231 -84479 173973 520056 213442 48332 -50765 126889 137836
17370 137836 107287 125212 266609 207044 299749 269901 421960 -98107 161611 -79913 297173
17358 492311 129957 92719 411445 -124594 737 136071 -61239 -22476 260781 -86921 -57964
17347 -57964 -67758 352639 372266 192152 299491 43633 -6431 48940 130635 249901 260573
17336 260573 195140 -131059 -35566 142307 427467 -26113 397605 119602 245738 7456
17325 383390 102304 146891 74239 338461 226914 397743 -121695 75401 334035 184819
17315 184819 216998 114125 337524 51992 -142212 301025 -15429 377817 214477 94718
17304 224514 73112 243540 570943 -109864 138153 207224 -238320 39836 256319 146896
17294 146896 -188325 332718 107730 438765 -54967 59587 133839 161990 198892 152096 -132707
17282 87284 -58745 -161790 171006 333702 -119476 234453 -109477 80391 -64101 -224124
17272 -224124 114651 404589 -25497 375917 81424 242719 40266 93329 100375 157348 -95010
17260 37379 208538 388599 477412 -16503 254238 93860 158932 46619 126722 232669 -198269
17248 197799 141801 -133690 201522 122046 104290 57490 508856 319530 408728 396546 340063
17237 340063 315094 47577 199895 -2687 526071 213875 205753 49815 518599 337415 66988
17225 289074 101787 465629 599533 75251 527017 -150886 84407 289769 259745 499015
17215 499015 338792 -98445 -163735 98321 312122 69206 116979 409997 353711 161585 504682
17204 504682 274382 311737 145073 371807 147662 -109409 234869 276709 510069 60886
17193 234259 154227 28639 262376 89102 524416 196019 78281 221566 189605 311304
17183 311304 392459 30186 97439 363041 428864 378368 124550 355867 134905 -245079
17172 339860 329355 155642 200805 142163 143614 3452 351911 -142596 407752 140858 25665
17160 321694 46423 137659 -83833 362831 143605 332780 289176 77242 -146852 454762
17149 693616 -139862 488644 240139 235224 160656 280297 117685 226391 210372 269550
17139 269550 686876 111448 357702 209517 169162 263390 145922 216762 599409 576851
17129 576851 410 271835 532922 214590 427243 635313 384538 238787 176751 199366
17119 199366 145754 548495 362044 395566 321002 332552 327716 263195 255955 -409 661334 353270
17107 353270 819293 466729 -72191 62798 718770 94831 447815 308337 498331 538967
17097 538967 135825 640937 143282 627090 443091 301382 821992 361155 609780 487707
17087 487707 559199 195516 434236 368477 547538 627784 298818 562022 424447 631667
17077 631667 636025 414318 589888 380794 393511 202291 832288 499563 278525 593546
17067 593546 408473 56623 491639 439764 531909 785176 651587 373707 243396 444291
17057 444291 413786 284634 236895 505223 893569 407007 208775 567642 625466 500843
17047 500843 699947 469299 753806 824760 413979 530734 567105 409176 287639 658825
17037 658825 484244 568741 947822 398887 166238 731118 779173 747282 543921 693453
17027 693453 727420 659992 268654 317816 737057 792581 437214 575201 708298 613248
17017 613248 668876 530387 540440 531648 834755 762238 432129 833869 672605 902417
17007 902417 767167 758388 374453 655677 402455 423198 493687 1016524 700865 659575
16997 659575 723807 1073528 954701 980739 745649 445195 871220 659894 350459 1054313
16987 1054313 1139713 951604 1141602 373696 1050370 895879 755060 840861 671608 912851
16977 912851 780901 840166 653744 966698 659743 621087 847859 1053664 1123465 982388
16967 982388 800606 889855 1205038 760483 802790 823622 940592 1184733 859830 712615
16957 712615 1383632 1134703 876519 959067 832194 780861 1270746 1143543 1233998 1262175
16947 1262175 719084 731875 1012903 1127789 1272023 1101660 1376084 1561252 1389396 1082576
16937 1082576 1163541 1157469 1214142 1085659 1474167 1290146 1085557 904139 1137998 1213762
16927 1213762 1429337 1111751 1388364 1556631 1615685 1364995 1335188 1338903 1441783 1392851
16917 1392851 1331705 1449424 1703815 1634239 1742922 1420847 1757515 1743296 1604650 1488962
16907 1488962 1653381 1563289 2094058 1738256 1746556 1302565 1581650 1641908 1795092 1537973
16897 1537973 1822424 1550199 1532970 1801771 1868479 2040392 2585607 1702968 1833545 1936151
16887 1936151 1848578 2410682 1814481 2028770 2240130 2003473 1963665 2252124 2373723 2583598
16877 2583598 2212491 2201264 2171259 2608122 2508532 2471316 2646026 2274383 2518055 2175641
16867 2175641 2521858 2282180 2713012 2721410 2673100 2889661 2689260 2905544 2789011 2782902
16857 2782902 2996803 3071377 3056647 3088400 3162222 3306054 3242105 3346809 3354658 3307363 3220548
16846 3220548 3180928 3817869 3495235 3587627 3780340 3788651 3679613 3753488 3775283 3903521
16836 3903521 3812834 4502631 3799071 4399410 4006574 4181447 4729993 4632043 4391693 4766454
16826 4766454 4623739 5011950 4767570 5056698 5003978 5333532 5346097 5328540 5292646 5655971
16816 5655971 5704666 5797768 6308719 6124569 6362024 6204586 6800872 6848058 6742714 6918596
16806 6918596 7185475 7285651 7214004 7394530 7760011 7922951 7895122 8574981 8724785 9108296
16796 9108296 8745586 9317845 9347493 9668618 9617074 10127026 10694696 10754778 10917596 11065129
16786 11065129 11227415 11961380 12363657 12568589 12994719 13223824 13432817 14120309 14425916
16777 14425916 14994031 15539864 15889892 16339283 17301660 17412774 18227051 19108040 19517316
16768 19517316 20354624 20814530 21766855 22398515 23540874 24567701 25688167 26322454 27604119
16759 27604119 28446664 29948030 30956699 32927599 33941282 35956988 37361361 39336383
16751 39336383 40947576 43318476 45193563 47567800 50345861 52685612 55813692 58834718
16743 58834718 62342794 65836988 69551801 73711776 77918011 82868154 87437682 92906391
16735 92906391 98880708 104369176 111004237 117364456 124687409 131919025 139187654 146363568
16727 146363568 154058074 161153717 168291373 175413585 181140200 186286139 190712224 193545458
16719 193545458 195595147 196189105 195722928 193748056 190559979 186451821 181004253 174943023
16711 174943023 168160383 160903546 153381175 145629958 138244839 130701272 123449374 115906259
16703 115906259 109657251 103077607 96940703 90950473 85774274 80482307 76064265 71479146
16695 71479146 67843462 64031922 60402432 56918833 54081452 51146255 48312278 46104201
16687 46104201 43690318 41614776 39438507 38142775 35750279 34074699 32578958 31289702
16679 31289702 29556553 28521241 27235012 26052553 25296351 23966626 22995911 22067848
16671 22067848 21340153 20561574 19898275 19462671 18424960 17602016 17206286 16325473 16048195
16662 16048195 15293293 14976684 14629038 14002392 13533043 13212323 12750533 12290286 11929337
16653 11929337 11601755 11188763 10749090 10775827 10194662 9985700 9847001 9633733 9136736
16644 9136736 8876241 8347743 8532982 8144390 7937849 7683601 7770332 8052250 7360998 7014750
16634 7014750 6692785 6968017 7083760 6123736 5856696 6022634 5756810 5976634 5877253 5473120
16624 5473120 5584169 5396026 5251247 5151104 5215777 4623565 4743497 4717328 4945739 4529679
16614 4529679 4244948 4545351 4126513 4330444 4111074 4108890 3854113 3953007 4133858 3944989
16604 3944989 3889115 3596462 3826176 3496808 3551122 3345955 3235996 3075667 3147151 3193436
16594 3193436 2946138 3098462 3023443 2730120 3045649 2746515 2758284 2464411 2822237 2972707
16584 2972707 2837456 2404732 2233819 2476263 2639809 2702686 2288449 2383230 2224879 2293676
16574 2293676 2222931 1884704 2009478 2294600 1897523 2278082 2123425 1931606 1940616 2238542
16564 2238542 2056922 1878072 1887033 1740799 1808702 1580646 1879266 1776883 1986498 1573008
16554 1573008 1681822 1881456 1760524 1646501 1348153 1472261 1680084 1518760 1828016
16545 1828016 1652139 1091367 1672417 1536327 1592892 1509219 1704984 1443303 1315206 1413411
16535 1413411 1138692 1423751 1637377 1220108 1153934 1548512 1528000 1290353 1453847 1202642
16525 1202642 1054372 1366974 1113501 1235981 1337058 1104509 1099408 878166 1002686 1155506
16515 1155506 1174477 941414 1260760 861023 1047664 1494107 957309 907647 1210988 1020707
16505 1020707 1151401 1105913 1011547 899712 713868 722332 475916 1258627 898125 894636
16495 894636 755670 1051376 837818 1018382 744893 979879 865069 620759 585302 1037303
16485 1037303 696403 833616 755411 819395 976162 649372 804275 849114 891894 703567
16475 703567 719003 855978 745958 688808 629030 469459 807544 565539 784597 781048
16465 781048 544294 618087 765664 558558 728706 740087 614118 631128 511155 597923
16455 597923 522270 473083 600473 462301 629828 533933 965183 686050 563778 460314
16445 460314 458038 577743 568156 445292 545649 959861 451395 540868 624295 500645 567869
16434 567869 651568 643270 519315 490796 359395 471815 500490 353511 199456 379416
16424 379416 488779 379151 238331 403608 419670 200777 530886 400496 543198 666126
16414 666126 824460 349661 509121 442527 529263 358200 376211 448587 217474 302524
16404 302524 464254 376138 164206 202958 487674 450212 193944 566630 78113 212265
16394 212265 374596 247799 40984 485778 313556 316502 482154 485636 444895 377745 -13535
16382 36236 447971 285908 177331 309835 579841 333028 383387 318072 242976 93410
16371 411422 145116 689683 50562 271132 259162 -171642 442518 555331 -4500 335086
16360 258405 112625 334160 360389 147742 219995 203829 389991 78683 56739 288864
16350 288864 218980 346795 371638 392623 191173 231700 111242 7574 429756 563523 632708
16339 632708 337661 438117 158462 108856 -14213 68888 72845 177658 105107 181615 105915
16328 105915 303858 73355 307405 36928 98105 50286 256181 482470 199385 165560
16318 165560 506408 397577 347091 -473500 58298 -84589 285749 -50858 252450 30554
16307 155834 6854 2067 157184 -145261 51400 118784 -149103 67116 76408 224670 215848
16296 215848 347874 65805 367414 168796 -6383 -68615 114549 103986 244820 108710
16285 481854 -196458 113860 220807 -98457 -168453 156960 270964 -23895 308901 147162
16274 64618 380043 124122 658808 -152686 -78946 173957 135685 180681 47887 222322
16264 222322 107580 382826 -42448 114023 -150690 -127336 208323 -214683 236677 413732
16254 413732 196576 -28425 272707 215754 148445 44638 -70582 4811 1181 -17662 170418
16242 -75230 -165271 261842 364869 9097 167141 128216 55471 146849 81591 115615 33051
16230 93147 282490 -111305 215607 159983 32286 -35190 -43828 361473 34633 35160 33850 -175982
16217 373474 333826 103476 402138 267824 105634 495 -14175 191916 176365 162396 89640
16206 89640 195571 -21344 -80096 129435 -137988 159568 72892 155922 439135 89278 264405
16195 264405 120397 -100035 -16140 129911 336300 271935 346536 -252322 -62390 328748
16184 120513 -68282 122852 154590 -41433 357432 -208520 17984 53119 325268 27133 -177578
16172 -89517 -178372 -21915 277689 117102 -84672 -52161 165857 199732 21957 -64683 204390
16160 -23431 22084 -303574 -28230 175308 115785 163076 224084 229936 223429 93850 20094 4120
16147 123024 20260 -11234 -37871 164291 -174838 26268 -78157 179724 193392 60070 112503
16136 112503 90119 149038 -107234 -93586 -226807 -341483 8076 220249 124699 -320010 287065
16124 146128 136001 -5207 205825 -111502 -185868 -194046 18823 129399 -133887 123889 103569
16113 103569 -51612 260246 176354 -87858 -154541 -256832 -90756 -87417 -88808 15347 163669
16102 163669 110680 216417 40418 -153751 -36928 363932 -33701 166321 105703 76300 502673
16091 502673 76685 48123 -264089 64084 225858 -199275 159919 -1963 -92790 212460 219568
16080 219568 74650 -78515 88932 101215 -253940 53553 -180307 -53753 129325 243085 -67600
16068 -100368 37335 73831 -79062 162950 -57289 98232 -107646 151382 202442 -65928 35282
16056 -340345 -9460 34073 -221924 -182621 262812 6154 166992 -72683 -16648 178576 -181817
16044 -260852 -386327 -62754 -172550 -152608 18022 -59032 393293 61977 -121524 -273061
16034 -273061 174519 -193531 66429 -3656 -56279 -118231 -189591 -303445 -114453 -233152 -141765
16023 -141765 -454473 193934 91390 430517 66974 170652 -69649 -76196 -150671 145309 91622
16012 91622 111626 327802 48179 -51975 -85481 -130605 156302 93656 -201143 71943 205526
16001 205526 57016 -13639 -111121 125829 -5341 -195382 -189575 105994 101293 -433097 -230162
15990 -230162 -106051 8871 333353 323555 134314 -63282 -54652 -55739 67749 204393 176363
15979 176363 8836 -216431 -143317 -148013 -279734 77336 -210723 -159518 -10935 -232324 -357126
15968 -357126 214231 -219293 129001 -178774 198030 -101663 -59481 -119507 330336 -118308
15957 106528 16204 78078 -255232 -302892 -39082 -305515 29393 107224 -467823 -173908 -74687
15945 -243585 110242 106701 24370 5975 -162308 -82719 -348848 -172870 -354215 269510 -51002
15933 379253 -25991 175560 283143 -110718 -271648 -54354 -44827 15135 101485 -229920 -184388
15922 -184388 -112915 177849 -228664 -46918 -430664 -90864 136653 199379 44785 -221833
15911 -291656 -135756 -177139 -335831 -344584 -117443 92290 220018 194667 286315 -2549 -245774
15900 -245774 105647 -195658 473652 3621 190478 -34724 -167679 -176370 -113063 -72440 -263513
15889 -263513 104216 -25627 -23606 47835 77119 86132 251056 -274938 175922 27103 -112229
15877 66499 -43300 203521 -43827 -75591 -237660 183360 156985 93687 -17950 -64238 -5222
15865 -104902 -137664 103042 164467 -233158 41032 -198798 4216 244390 -147604 217614
15854 -13600 -440895 -292922 1315 62513 6116 34300 21080 18652 196974 -23049 -122528 -92502
15842 -92502 -300851 49801 2516 -41495 126502 -226581 157849 305324 90669 -186589 -174708
15831 -174708 -126325 -187551 -10394 26059 89517 143160 -106981 33398 -40441 139132 -160554
15819 28213 -63824 -54995 54971 -202649 320075 -134549 -12842 -322080 -25301 41087 -74611
15807 -328789 -241949 366473 -109117 199749 86066 108282 -7744 -106426 75044 -41214 221822
15795 75845 -220322 -307911 -78044 -58006 -202988 -9314 -169414 -9167 169448 -144292 119617
15783 -62014 191348 206355 10733 -65482 -296443 203224 171331 32927 -152253 254272 -13274
15771 200990 -239689 117870 -200172 -191879 270921 89457 286867 131560 -208958 148689
15760 -212843 -38291 99527 197429 71274 83534 114280 -4659 -123600 -257214 -279262 -435595
15749 -435595 122335 31387 -3262 116472 -145390 358224 -152672 -240984 -25746 132831
15738 -240734 -108904 -371778 -102426 13880 -53050 -62426 -97354 -749092 92974 -201976 -232196
15727 -232196 201297 22136 -20114 141827 -104951 -180880 -205217 -125248 118835 53481 -246485
15715 74042 -168989 -150085 -156998 33362 -107669 231549 134837 124781 -41076 241905 -97278
15703 40109 127075 -44040 -94612 -19600 -136656 36436 -100251 184445 -72351 -190379 176112
15691 -65591 126436 -7331 147613 148197 207425 75637 61785 30570 -368644 -31959 -204774
15680 -204774 -96966 162945 350440 33763 -53136 -122215 -205335 56216 -217084 -309303 -94483
15668 109088 -91709 74633 143907 -417928 256148 -166444 134781 222764 36117 270265
15658 270265 63037 -155643 -97597 34313 -223528 -73021 -133719 89049 -192520 -287673 230507
15646 -290412 633759 219187 -108624 -48549 -9883 146457 7306 273610 -356921 -92889 -42566
15634 -168824 9084 -50430 -82483 240034 -219347 286103 -353256 118871 84028 -30256 4999
15622 -187721 -72968 -256763 -160268 -65106 150174 -11005 24934 -89825 -42649 106699 -38529
15610 -62232 -28431 74932 -206667 -253806 -70182 150767 239054 -243821 -41296 20078 257349
15599 257349 134236 -280446 -287525 -290101 -379976 -51951 28829 185247 98205 94353 -97012
15587 127374 -125013 -125068 38004 255519 20786 -305362 -245849 -76857 97473 78726 51237
15576 51237 -71791 70665 73388 -79019 -321929 -133810 -95261 -93232 -119777 316922 -37638
15564 158467 286241 -256478 41170 164195 -21166 144386 -271860 302702 5975 -131411
15553 -272370 66443 -232079 185871 -84321 -129333 79695 -197481 41758 -376177 373413
15542 65660 11967 -10112 48508 205709 -147158 153264 143185 -100561 -100496 -26559 205300
15530 -63633 -509918 26385 -149750 32350 208597 159364 -103464 -166277 137476 -25642 -11500
15518 289869 255098 -169084 -73647 63487 -206666 204764 -57676 -131674 -107844 241941 14722
15506 141875 74697 -132121 260878 65946 156475 -30938 -2048 -16049 224345 -130234 -14987
15494 168612 6244 194919 24802 -6447 187493 -48727 -117637 146235 -131761 -109611 367224
15482 -240091 -84536 404405 348837 57314 234325 120465 -119895 -44214 386171 -229907
15471 -100257 245339 7101 -95910 100462 89311 77797 37039 104217 64421 -148189 -211969
15460 -211969 -965 149181 215620 -131900 191756 -29454 -199300 -243777 -182330 152000 -37116
15448 287441 -164528 91193 30074 9077 -56735 -234593 -451775 63100 253463 -53797 129329
15436 88345 110153 368390 59044 13100 126845 -16806 -291756 329025 192713 -25412 -145414
15425 -145414 -85374 -9950 -100016 -115134 -285687 -49194 -262488 -182855 -259028 -73487 -73994 173995
15412 -76208 360037 15231 -89848 20818 48483 86185 -44198 -105126 -6673 -18375 42075 362764
15400 362764 275452 -32372 215075 104484 -110726 -228003 5458 -194195 -24098 114875
15389 298945 -151210 -38285 34681 -214138 -57969 -280651 313175 -161827 433025 328194
15379 328194 -103574 120574 85964 204804 -90962 -148769 -46464 -270340 -276691 -107738 -40833
15367 287567 145991 -36353 36130 -268183 234071 -88 -102962 140856 100208 -136058 -31765
15355 -53701 104037 178052 -49709 -73273 97754 -263487 97293 133094 -31156 127389 -40606
15343 -19433 -35530 -67522 290707 121345 -432171 117629 18301 -230559 74848 -87553 -17743
15331 9941 161026 -240318 -129937 25449 -210657 -16022 369535 -54282 282247 84942 69379
15320 69379 137144 56927 30815 -11609 345014 -63362 -19786 451278 -194026 40487 -45664
15308 -6818 55627 -31253 -201356 102511 163738 184628 363204 48907 -43310 97345 421996
15297 421996 332287 243286 175524 -69207 19253 -63314 480810 -28335 288101 -127096 -157865
15286 -157865 20196 611959 183711 -136183 28496 173524 -184534 -112533 301224 109848
15275 29775 126172 105481 65932 177765 225751 164010 -155772 196474 -162222 42834 -98603
15263 214500 154735 80923 -141370 80689 -16840 -284724 -183642 185285 115925 345964
15253 345964 312576 300468 103220 209925 417272 617114 1753895 1589928 1208537 1460605
15243 1460605 774673 502446 -124266 -32663 62847 -206216 -154504 43899 310687 12301
15232 -216750 -92044 -249996 110767 -38511 162089 236504 1708 322596 280179 -162451 4910
15220 91573 159005 186692 25727 93844 -82507 -150521 123900 337809 -80552 -109593 129345
15208 286639 178057 245584 -90124 46846 227615 -70421 -27300 -339279 381295 49345 -166664
15196 461494 174522 -176436 45942 114591 68213 -9651 62123 91993 138429 260680 211411
15185 211411 89305 61060 -269715 8387 -83528 -19424 -255352 112863 -23018 367329 104974
15173 110437 283692 -12657 -197797 -103987 -299285 297319 -450854 154526 -148339 313532
15162 79435 103358 274034 305188 -225841 105238 4267 -230182 43158 -30230 -13819 113570
15150 67341 -100115 -126583 220623 -49458 288549 49947 2000 -70230 250360 225031 185002
15139 185002 115841 63403 -1060 173633 22465 50588 229771 94102 93457 16162 237054
15128 237054 -18589 166726 277834 33827 222444 115748 54398 246055 238767 -153714
15117 259270 27075 77426 194557 320658 94953 325238 215184 56680 290184 189320
15107 189320 -66027 -126442 -1320 201483 -154226 232989 -43524 239890 -122184 213651
15096 -2131 -183980 94959 -10364 189755 -38927 25776 153086 203889 160062 179678 288811
15085 288811 339070 71915 128527 171528 247455 436830 334147 128436 -123258 269406
15074 280725 140078 66381 356608 -85452 -178879 -85549 144673 344792 158634 -19898
15063 -74816 300634 324711 339241 -63741 219235 138363 70414 578939 102957 283895 48180
15051 272732 234788 132657 124570 -59726 82050 269629 221327 173246 305377 477230 144964
15039 338763 50727 216773 155281 147947 306088 335893 273456 56172 12486 380948 38988
15027 261935 102230 219707 348344 85220 381191 383623 244389 -23215 -2613 -55902 19365
15015 113686 97440 119808 -63807 133937 2327 61883 224019 -4449 297425 -101333 172844
15003 199900 578007 148595 81473 214981 -78578 313795 86687 8895 196957 -1366 312602
14991 296512 36381 370669 -3120 367923 366642 239208 499110 358944 123451 148595 216794
14980 216794 290350 180183 42732 186001 34275 325712 168202 100055 303406 344361
14970 344361 174238 232794 242744 385395 350555 403835 102369 411545 87378 438169 -31545
14958 -120405 679175 265087 77910 143651 -82703 334858 373874 104552 223366 408322
14948 408322 331401 182490 -103517 192872 102743 474139 678790 295075 151736 170596
14938 170596 247513 175453 229065 538014 374081 340614 367059 -251301 70503 245744 241492
14927 241492 348829 473708 140284 360703 88118 319462 479575 108097 -137818 332144
14916 591639 215671 519146 212444 329016 581127 269041 -138984 251953 305748 302657
14906 302657 203183 104419 -2143 425272 343973 144536 286457 489588 594296 215508
14895 717058 330222 280069 4077 182324 348618 35006 381069 166927 774481 715147
14885 715147 632107 -287378 431858 295817 345614 312402 666557 227002 319821 492317
14875 492317 163507 335731 377748 178653 476766 380090 166552 -24009 289642 284387
14865 284387 105552 400050 158529 532641 131351 354802 315483 477288 153742 337389
14855 337389 304796 193407 367966 823112 506679 391883 577334 258351 200367 439422
14845 439422 396922 808902 443123 709610 437868 166452 558611 334241 875059 378234
14834 112780 361804 450461 300879 592221 339767 391400 159551 474930 337574 541592
14824 541592 624895 438958 774101 126501 162449 607172 233235 420803 654787 377661
14814 377661 493544 383943 310833 559132 737011 806736 653805 331343 700304 669247
14804 669247 560413 696940 543261 540470 419024 264291 295624 339649 600949 566474
14794 566474 575649 668133 625332 660351 735127 793800 726323 769717 636113 535573 594018
14783 594018 297763 612466 452912 555257 264575 429537 306545 841439 591381 525909
14773 525909 657466 571928 325975 455000 175963 770227 575623 635683 745306 342717
14762 625244 655611 778421 387295 802893 590909 820389 683728 446096 394450 629383
14752 629383 521338 757875 307298 638384 673658 577979 676157 651061 540881 1032966
14742 1032966 872473 531375 534613 859601 721564 645555 866252 490694 524960 599911
14732 599911 723285 409957 744161 928320 657288 393240 579633 472785 784835 763942
14722 763942 459475 807319 626863 884920 745271 839577 681328 751738 806926 1035588
14712 1035588 900068 825113 928743 1018354 811002 765145 1211139 768097 825874 498798
14702 498798 1118701 850136 940604 1031302 855663 899812 1077028 1106629 873683 987007
14692 987007 920722 790136 707221 1145015 947695 1220869 990162 1138616 1036959 816284
14682 816284 1122950 1144137 1017405 1057839 909117 1100994 1261162 895904 980224 872410
14672 872410 919142 938515 1080933 858739 989126 1342422 955913 1010021 828353 1264308
14662 1264308 799939 1148296 815216 1238585 1384805 1124933 1431942 1137557 1138710 1391784
14652 1391784 1093404 1138191 1505567 1311651 1082222 1278480 1026382 1391897 830895 1086452
14642 1086452 1246605 1419153 1519540 1172801 1162354 842149 1231749 1209978 1463166 1420722
14632 1420722 1468472 1269819 1530047 1314375 1529464 1182457 1457938 1469156 1225631 1173204
14622 1173204 1691820 1710156 1532066 1404807 1647136 1627664 1783681 1676519 1232505 1866513
14612 1866513 1115490 1661308 1393083 1614071 1468905 1613219 1645987 1559035 1667714 1778499
14602 1778499 1744431 1542319 1543463 1830202 1834526 1809251 1558821 1680837 1922890 1939793 1751697
14591 1751697 1788029 1787008 1888190 2029309 1665237 1901409 2005372 1618192 2207285 1670916
14581 1670916 1990313 1965848 1948709 1958070 2005589 2154534 2303303 2231085 2147422 1995582 2193672
14570 2193672 2180036 2117504 2533848 2576288 2278509 2527038 2945153 2586499 2616210 2855015
14560 2855015 2980704 2854933 3080966 3345788 3105602 3389639 3765442 3847411 4178712 4653423
14550 4653423 6321330 8916672 14339212 22918273 35732865 41747405 20886308 11269063
14542 11269063 5466131 3304752 2848554 2417024 2000343 2103611 2041649 2127412 2061408
14533 2061408 1912079 2313417 2342617 2174913 2131075 2040563 2190111 2321014 2217845 2291119
14523 2291119 2366339 2697050 2464989 2487559 2590433 2659734 2699114 2792431 2990641 2803384
14513 2803384 2532023 2867941 2320733 2978585 2649281 2792176 2905525 3080864 3284079
14504 3284079 2872050 3044306 3166238 3314278 3067676 2911048 3171099 3333885 3065203
14495 3065203 3320842 3393485 3274028 3500604 3284081 3386310 3361780 3628189 3565290 3586583
14485 3586583 3665438 3167397 3717942 3648154 3999416 3541384 3851460 4141204 3892518 3973788
14475 3973788 4181585 4039699 4278124 4295253 3891913 4265860 4322593 4382516 4127702 4605104
14465 4605104 4719616 4541563 4685563 4630483 5002161 5003915 4742423 4848570 5146056 5079769
14455 5079769 5065650 4989174 5428115 5420406 5357727 5337765 5281545 5515789 5704229 5525050 5739529
14444 5739529 5597996 5941686 6099463 6189612 6217074 6329419 6100287 6409652 6047336 6600553
14434 6600553 6666935 6668533 6831674 7026876 6872848 6900907 7031543 6995606 7251715 7449519
14424 7449519 7515359 7642705 7799506 7542959 8019523 7990026 8103703 8272352 8496924 8415247
14414 8415247 8494347 8746389 9132224 9009727 9077492 9515240 9441527 9588840 9888031 9812688
14404 9812688 10284969 9951457 10315368 10671471 10805398 10810931 11088634 10998605 11348049 11563811
14394 11563811 11633980 11995026 12042565 12493568 12464340 13004104 12784042 13153796 13392714 13763473
14384 13763473 14241909 14082616 14508417 14372546 14866877 15115653 15515010 15993976 16145569
14375 16145569 16461728 16954633 17365622 17493700 17559701 18076551 17954737 18838578 19292719
14366 19292719 19619572 19965215 20291963 20665597 21099524 21805152 22478960 22807051 23150323
14357 23150323 23670904 24403656 24919425 25546832 25879506 26782974 27273989 28190781 28575056
14348 28575056 29335118 30133086 30607634 31737508 32540308 33324573 34141368 34916118 35796119
14339 35796119 37257078 38118589 39018300 40107015 41642269 42609744 44000993 45081478
14331 45081478 46153913 47709661 48796191 50846726 52650946 54255666 55807022 57914688
14323 57914688 59532152 61907720 63860313 65902217 68396526 71145301 73726821 76384742
14315 76384742 79356849 82298461 85584166 88887275 92454905 95967356 100335695 104348301
14307 104348301 108986275 113842065 118514712 123843835 129558273 135819782 141786867 148838879
14299 148838879 155716674 163462144 170731248 179109945 188275175 197736863 207572043 217979710
14291 217979710 229304496 240750555 252423648 265414047 278455281 292132521 306122214
14284 306122214 320628957 335350528 349719250 364318825 378763736 392772329 406136911
14277 406136911 418934626 430334658 440330510 447330054 450096857 450593295 450471202 451181054
14269 451181054 453016739 451486406 448195100 442795206 434436646 424826670 413280088 400336751
14261 400336751 386570757 372340085 357723347 342845047 328033369 313479838 299237118
14254 299237118 285764283 272940707 259663140 247688221 235439010 224027776 213466727
14247 213466727 203178200 193650860 184312696 176101420 167861459 160300499 152803520 145748406
14239 145748406 139218020 133278671 128036791 122333699 117227853 111831439 107962841 103548338
14231 103548338 99793333 95935701 92078538 88210781 85040361 81732034 78708448 75667609
14223 75667609 73158163 70667566 68582235 65956701 63782374 61863246 59110410 57512075
14215 57512075 56021706 54128309 52632851 51283827 49054466 47781502 46901608 45094938
14207 45094938 44035520 43275193 41700127 40394415 39245857 38198337 37406314 37006474
14199 37006474 35609634 34629419 33491820 32821801 31608311 31215445 30546350 29291479 28682363
14190 28682363 28307649 27389549 26900424 26214120 25744782 25013507 24359521 24099139 23703148
14181 23703148 23025023 22230996 21820854 21497146 20797388 20629985 20119962 19883788 19451512
14172 19451512 19163483 18786726 18497437 17686443 17416153 17138199 16791530 16899412 16601353
14163 16601353 15918745 16012991 15746288 14987847 15227645 14377593 14244212 14283939 14180706 13733336
14153 13733336 13432203 13350410 13279947 12784740 12470940 12479912 12013396 12067861 11978037 11685130
14143 11685130 11637814 11652060 10847071 11045662 10937443 10709142 10666189 9992462 10326821 10106693
14133 10106693 9991387 9960043 9549054 9367111 9364182 9560103 9129690 9006382 8955799 9294078
14123 9294078 8790220 8363635 8341100 8406480 8207474 8355338 7982630 7814037 8030524 7584281
14113 7584281 7822292 7241255 7565682 7568458 7051641 6921704 7156582 6773401 6975566 6599204
14103 6599204 6747294 6861382 6600224 6546033 6637836 6502007 6285789 6205654 6097924 6074587
14093 6074587 5899964 5804437 5900204 5890611 5971189 5405258 5758890 5489703 5648683 5283820
14083 5283820 5311674 5325193 5231635 5317048 5024194 5198821 4922687 5199968 4542541 5129041
14073 5129041 4785329 4908015 4777774 4693728 4722637 4558732 4711574 4499192 4452723 4419601
14063 4419601 4405540 4520160 4345474 4424353 4125854 4302189 4057532 4121833 4118700 4030855
14053 4030855 4103324 3914225 4189366 3820755 3975240 3969372 3691849 3879346 3333532 3759363
14043 3759363 3637414 3286538 3657621 3509807 3154174 3342373 3285987 3166680 3377386 3113144
14033 3113144 3397269 3158776 3370931 3360733 3265168 3473153 3495666 3241380 3036883 3121618
14023 3121618 2926575 2784953 3066609 2893018 3037455 2617763 2811374 2557944 2169589
14014 2169589 2741818 2710070 2973983 2578184 2687949 2391623 2338225 2245799 2322197 2493705
14004 2493705 2632819 2482470 2317408 2260179 2349596 2356584 2217707 1996103 2470552 1960913
13994 1960913 2382859 2222608 2326759 2866255 3035892 5050991 8954975 17076903 30746664
13985 30746664 43154453 25490943 13501450 8574182 5877246 5168382 4133038 3615536
13977 3615536 3813281 3223495 3300625 3130637 2984611 3117960 2596227 2643513 2981331 2835566
13967 2835566 2437245 2379731 2478101 2501023 2414113 2093238 2331567 2265150 2689187 2426129
13957 2426129 2066436 1947599 2244445 2120274 2069283 2039587 2046357 2082189 2063813 2001074 1838541
13946 1838541 2061174 2187855 1952551 1716365 1491092 2058382 1550619 1375917 2015742
13937 2015742 1775408 1743636 2112466 1767241 1654735 1723241 1641203 2088120 1628392 1695439
13927 1695439 1523532 1664724 1345045 1579982 1756497 1414177 1750239 1608948 1827535
13918 1827535 1457401 1622536 1842150 1582301 1834939 1498186 1640543 1238531 1357837
13909 1357837 1496254 1663318 1630728 1548017 1408156 1475525 1450140 1217710 1567637 1535327
13899 1535327 1446772 1403780 1506071 1529048 1393082 1632730 1447649 1671450 1145504 1264482
13889 1264482 1411058 1354205 1495892 1506377 1414360 1348577 1299637 1268936 1344186 1185725 1101574
13878 1101574 1231275 1204696 1430790 1143369 1267384 1327602 943513 1016349 938722 1411210
13868 1411210 891209 1379905 1425677 1240070 1256668 1366440 1027015 1306314 1019249 1156763
13858 1156763 1242901 883242 900920 1070995 1190541 1253127 1532980 1431196 709242 1085520
13848 1085520 926384 1045889 1090498 953004 1312909 1174410 1378716 874267 1357258 1020601
13838 1020601 1226366 946401 843789 1049759 1061589 1239749 1477499 1162575 730805 1056983
13828 1056983 1062506 857633 1146582 1051314 1014056 1125713 935704 1199040 963730 882753
13818 882753 699421 877987 939542 1026241 733700 897942 1051881 1142493 918975 543989
13808 543989 832720 446941 1001310 886823 920240 843628 991510 734331 982533 803823
13798 803823 813954 723521 650817 758170 988456 793687 863456 813414 628077 822847
13788 822847 665200 650937 583356 721521 1001248 973141 515169 1273159 1169345 954796
13778 954796 755447 859301 1209877 831068 1110026 764901 869917 690019 773691 757037
13768 757037 770873 704328 716549 695759 701402 511105 769760 864786 904884 623629 1064064
13757 1064064 730458 576201 795013 653467 642769 674829 908509 648844 710206 838885
13747 838885 593865 388846 897351 910067 814122 549361 671191 838913 640216 851362
13737 851362 772726 720603 890253 684521 862053 552355 673805 560607 998030 651024
13727 651024 707152 544609 541069 563035 752334 589065 473392 614409 516262 704143
13717 704143 867795 575129 593236 789376 538006 620470 625445 597881 298782 682176
13707 682176 487135 451482 769620 374960 805116 763426 176605 687692 679686 405491
13697 405491 793133 591163 411244 475183 568611 600036 513926 391104 725613 624246
13687 624246 299914 222623 941427 495956 380530 320862 244598 508540 705253 623510
13677 623510 358085 498681 460441 269910 272528 622562 504263 639182 520445 532259
13667 532259 612513 637743 776170 428777 527662 454248 607409 605312 256314 684197 785416
13656 785416 431391 572175 482776 720744 713876 560371 480382 481741 573147 197189 234268
13645 234268 404407 563124 529818 457373 780337 283730 369826 458438 640755 143525
13634 401369 375472 243913 318453 339981 667570 364260 355900 483240 293052 387774 175995
13622 279472 204141 537238 415636 381320 406907 467154 431995 240376 220003 435781 608020
13611 608020 562674 499026 583129 647628 467954 285734 310991 292034 432158 366225 320389
13600 320389 345658 534362 578485 25080 453065 508482 113886 416015 545023 393477
13590 393477 328211 558403 235894 216997 -174772 486366 478066 643802 453548 -22352
13579 384896 208378 425825 279702 263869 530267 308604 293320 305431 205218 169127
13569 169127 411167 330875 590524 398062 402982 622446 184516 398539 241440 314395
13559 314395 391203 475386 314124 254779 386441 292948 562796 118664 277290 261861
13549 261861 219947 331600 589692 499342 493574 -28154 492261 381348 307618 -18853 274294
13537 501861 581480 153566 359100 241404 347658 166744 361256 474868 336190 352130
13527 352130 486699 611579 508729 646523 268835 302879 -3245 146147 292310 120759
13516 613580 309543 465844 362708 180011 -190167 210731 615165 487470 243134 140726
13506 140726 328466 10598 363825 100437 386136 508337 223866 321306 590291 152674
13495 278576 295910 376469 289972 349447 450339 268198 297450 308257 211376 388315 92152
13483 413628 81118 195890 225032 96249 283488 501196 335045 581630 436715 132468
13472 405661 199181 646318 422049 316657 346588 358493 168557 437350 135704 60301
13461 301096 317525 80461 387527 323529 -15214 332447 425475 4932 194555 312285 258551
13450 258551 726978 -111472 663374 204515 177359 187282 194948 637483 386431 219925
13440 219925 7932 359868 173569 72949 -102035 126473 184439 290516 -110011 164037
13429 225841 -42204 227381 122063 136386 366313 -69663 50646 471205 38386 58413 408856
13418 408856 226012 344778 -65204 -180900 165307 240624 189427 429342 258122 -196947
13407 168921 99322 372698 342326 129144 479839 394273 155905 301417 369906 286676
13397 286676 198767 83 331600 -90343 319030 342580 403405 567313 -60842 60129 223190
13386 223190 239971 426121 72583 221678 221815 -116614 470225 412886 145660 470011 113751
13374 383868 364208 122484 384923 131198 122815 71675 358043 250310 -166400 300930
13363 91237 145190 684622 227882 39389 40670 -13646 8754 368806 345457 215661 563258
13352 563258 263542 158119 233021 -14728 292645 554900 654478 232646 397733 576944
13342 576944 348923 328877 261776 201509 183910 327332 317479 412018 31084 90373 179489
13331 179489 -58144 293232 326087 -67324 208191 145568 184863 148552 -32614 284937 159126
13320 159126 549992 279927 429940 278100 267078 182799 178682 468725 439864 -62940 331255
13308 495468 214221 255953 116890 237986 347500 348057 120598 -43732 -33697 83683 133473
13297 133473 370374 124748 -123713 151428 11370 -134530 324611 -73939 289188 -26673
13286 327859 33980 345058 119818 477933 89314 -244007 177800 256898 106675 548127
13276 548127 190823 297041 -16838 273857 -122550 -181101 -101233 -65938 205316 87452
13265 -133387 405183 -1826 16161 -73730 18533 213459 153012 28215 126312 350948 106572
13253 38381 315463 -172352 266848 382599 148591 271098 170071 114572 264639 52903
13242 78573 314270 -1693 201644 147811 79614 36169 163616 183015 103502 91344 288371
13231 288371 177223 42301 -164139 197698 36594 348618 100368 -98708 257870 658785
13221 658785 -68407 23232 159867 5949 -91738 -85860 61381 17064 232150 111118 438249
13210 438249 -31226 -47918 49472 84396 84270 -78353 216240 -179308 -2080 383118 260920
13199 260920 282952 75598 320242 68579 362578 -46294 185190 -147585 81966 87664 8303
13187 412765 -157792 101829 174766 20587 115860 347767 -34125 11013 203377 127085 195418
13176 195418 164888 13527 364084 266046 33967 232917 89910 21980 67386 95078 345977
13165 345977 224884 479839 -28048 28858 -12832 88413 202724 363684 156593 67098
13154 68543 376966 72800 230225 212144 169744 263941 -44336 111135 333279 24098 -40864
13142 177062 403698 -100943 -139694 128523 59160 169851 166659 63038 231630 -141297
13131 173721 -284912 140596 398111 39792 14353 -206164 347977 174832 52885 67077
13121 67077 -25823 347571 123758 129482 -247318 74979 178056 130074 542107 202857 65991
13109 108018 -19468 29240 -111675 -5290 166833 -66477 439577 21283 -42240 84749 192348
13098 192348 192600 120228 -189780 -270336 -420391 -127021 -14122 -25277 -183488 -119193 311788
13086 33756 -28343 -80393 -59461 287534 263784 -86149 203322 -156627 56852 191768 352971
13075 352971 -48860 313253 151465 232317 51784 83867 -10604 -247841 216084 394593
13065 394593 220616 138730 241481 193521 -177339 101034 -41293 6226 86896 191191 -56728
13053 172443 156966 239424 362652 97234 113739 25940 341803 -108476 109497 133807 95446
13042 95446 160390 105992 -3073 113173 81537 51297 335540 508861 -120205 262752 210170
13031 210170 -103391 125661 141620 248769 115512 -179643 -189666 195693 -181233 -275723
13021 -275723 440439 242058 103504 211283 243116 -216304 245379 272679 44513 77538
13011 77538 43438 127058 -79599 323790 156327 -74998 201078 -106551 180704 -139357
13000 37269 -19720 -54024 46328 245310 214419 -1142 198482 186131 -53933 116732 -9699
12988 102257 131820 57602 -102695 64050 254394 272866 -7292 65394 141389 154246 80670
12977 80670 362728 -107262 -107798 205634 76101 197128 120781 197913 152965 -146971 -188778
12966 -188778 81766 50818 -24089 -243792 -181800 217239 -57353 7610 172511 -91664 62717
12954 -116529 -186843 163746 -35223 -98616 67630 -197963 -59955 -172727 197518 167598 66908
12942 138575 -136068 253153 -13251 -186950 107655 -51467 -16169 92733 313155 231649
12932 231649 53530 -155390 -80857 -248592 212471 281177 188335 -33022 31558 23934 5899
12920 4787 73625 -91735 -25526 131175 61806 -66189 186727 -138452 -81362 17418 27538
12909 27538 226712 91436 -241463 244672 -124212 340976 -83830 8090 38859 -40558 -108482
12898 -108482 158033 -43675 68932 72444 84427 344918 213802 342457 -119446 48194 1187
12886 271514 81414 119825 238080 267867 -126599 -162762 144211 260298 100901 117531
12876 117531 48198 -59779 -129323 -87065 -50758 29091 114674 294808 212519 -12077 267424
12864 118720 116917 35875 86045 -134860 286801 -181136 111744 260291 408673 -154324
12853 51861 137730 210719 27118 319323 210089 287571 6531 445518 185788 -35792 22664
12841 72219 24313 397852 298106 -87518 -27512 -250518 -71505 143261 239281 183840 -202117
12829 113567 -170821 -99948 310355 3667 98559 55840 162720 1086 69405 42160 30306
12818 30306 202609 -194166 49016 163885 179593 -38286 117265 46996 135700 268389 -46432
12806 8061 25835 240991 117525 -19143 -41204 80479 -10449 -62080 -8413 47578 -222641
12794 -188568 145868 -226110 40065 -189694 -57045 81974 62788 288164 -248123 40391
12783 197922 -9329 173958 426690 -71742 -95347 -147533 94935 -82416 -278242 -332636 -161997
12771 92377 6836 -12873 132510 7126 -1255 73888 181295 229651 56463 210336 149589 -315567
12758 160651 -80304 71599 -29545 86818 20450 128146 155567 -134840 151930 283228 -198781
12746 97250 -275714 215047 353953 19897 239465 -31295 -64375 -173577 12878 -14866 -79472
12735 -79472 265063 -50504 81718 -110377 -21485 -59124 -26859 21247 -163138 183321 -12249
12723 -100338 213409 -215177 370221 27689 53025 362224 34527 166318 25761 203648
12713 203648 31362 -98314 156810 244676 -7234 421110 160423 200314 97554 176182 220152
12702 220152 -49420 275351 213142 160528 -114384 236635 62955 35802 -204294 34453 242731
12691 242731 143067 -30810 152264 50841 331011 17725 100991 41859 -277934 57082 360617
12680 360617 136026 224508 195601 48178 409829 4677 273649 -153676 -63568 204001 -15413
12668 -37039 -238298 105402 233915 291936 -51633 224463 121462 240435 14816 153239
12658 153239 -174281 247961 429068 239456 4663 509530 -97455 25915 -98653 44674 125402
12647 125402 55829 217524 30508 -254145 67129 -40973 200134 10998 69440 12934 -29002
12635 24347 -229350 186733 -113070 173728 -22310 282934 -102811 83714 336770 15991
12624 329181 129096 -32255 -3224 94789 370059 445426 61298 122392 -15015 3551 83623
12613 83623 236301 75815 -188875 60511 -221938 483665 144857 245206 -203830 77695
12602 -6842 -220980 17357 262667 194443 -162103 329628 -70436 -79321 -266100 -176974 -167454
12591 -167454 374399 363072 130320 34784 -30799 -372331 -161783 -49627 122130 38924
12580 -41869 131946 9319 97212 -1452 -47375 291852 176667 2521 -54313 241722 -373550
12568 297600 594256 -29286 -76991 -4915 -49746 13141 539640 -8562 235278 128895 280031
12557 280031 299574 -89362 406632 114583 -272058 262718 -117411 366724 -68400 237501
12546 14789 55570 296498 170110 -29702 -178033 103286 -19814 369906 -115719 217961
12535 42213 174913 235878 154293 144751 -154414 -54977 -273530 71863 -11213 21970 88265
12524 88265 685 -6765 -177673 -262966 -188806 32224 -49142 182064 270437 88185 -56509 -273978
12512 -273978 -217198 25506 -194031 67422 -34456 -48528 456462 103627 127241 -317401 -91467
12500 -285184 -210736 -96022 158495 -65447 -315520 -174451 -50887 61011 -238712 41996 219616
12489 219616 219058 5897 -7785 -160075 -96065 10843 -189776 -232284 105638 91334 10018 -171914
12476 98282 -66161 -136096 -61704 -62840 -11901 -85869 541 59822 3644 125882 181695 31273
12463 33974 110113 18295 173997 195335 -196474 -13696 -259264 -149189 71442 159880 401872
12452 401872 26075 46529 -163333 33189 191101 171709 -369336 142130 183886 -177965
12441 1144 129115 7202 -30148 116084 171036 283195 119339 -273485 151269 134176 -95037
12429 35590 31254 193310 -296727 -350591 -144159 -163986 131810 -226386 202897 142718 236517
12418 236517 -42594 -162904 206141 30600 41263 -239560 461498 149613 226162 -64355
12407 -82093 -240995 -178657 42603 -212097 222103 289062 13808 217136 -145489 198741
12396 -204633 -86536 -79410 84798 -149062 99229 110991 465908 155030 -47620 -216916 51553
12384 117727 -352309 -128381 -44086 10352 221249 3401 240368 154875 30710 308770 173238
12373 173238 100105 -166113 -154125 -251987 380714 -120969 292501 197988 -106116 -370110
12363 -370110 -83315 28024 186075 166571 335100 -82487 52627 368446 273353 115686 -253894
12351 10585 186108 112504 162146 -255162 40263 -101532 -327873 -160943 18688 124885
12341 124885 -252317 127837 -198156 141145 41268 34080 194568 251686 -119769 144901
12330 264582 -76226 83413 -8835 92495 85822 18751 160241 28897 26466 95363 -132988 -163835
12318 -163835 95599 150249 -202194 430651 -109007 124202 273343 -124365 -427909 -76573
12307 -119633 -26832 88875 103705 -132395 170200 -4321 14153 199413 -74187 162538 393756
12296 393756 -192762 417322 -211584 155031 376517 300217 -96578 -172155 141383 239182
12286 239182 59755 -77963 35048 239899 -50570 6694 281745 36102 -99959 121141 71207
12275 71207 21982 37611 197273 228349 105960 -11035 -33470 -454815 50913 -229394 272870
12263 -77600 55841 246008 -17968 130925 295282 -124229 -18062 304225 55419 127869 48621
12251 25069 -73745 -102224 434434 161211 -10988 41355 263759 41416 -104276 138278 -57839
12239 264406 29238 -196019 -54494 278211 243887 121605 146544 13707 448518 132574
12228 -235905 -5480 273847 -141742 134783 240416 310626 -298731 290674 374650 -138602
12217 147974 194205 506034 59589 391556 273175 340916 -11004 -88540 58734 426412 22568
12205 174527 -45959 453615 270596 183120 -48111 -53895 -25609 378349 69309 46857 236185
12194 236185 487540 340578 108274 307241 -61826 117434 160493 11205 115728 -4367
12183 45170 -216599 -59643 -115068 8848 52336 202027 6606 -86553 63476 70222 224838 279546
12171 279546 202544 55946 30218 499804 70135 378691 55819 189578 -71898 152883 -105428
12159 -198010 -165286 457378 83389 -35594 23557 -183476 -25556 -148427 170362 245291 108079
12147 62149 -65457 -28379 207199 -26174 -384932 -143069 59089 50160 321710 29780 315651
12136 315651 266676 -87572 185549 130610 99443 -51880 -51904 137692 -101130 4976 -276515
12124 146819 261089 107253 -104409 -16705 220963 -40204 -190834 404803 17379 -3873
12113 219684 -140353 -88604 -99231 -234226 21041 295862 257611 -147574 -64705 213053
12102 -105214 162141 -105311 -185411 -36935 -37864 -28851 135267 114904 -267374 341704 103962
12090 192482 31704 303 167255 331229 -47261 -91239 457182 -122150 -108536 -327621 -361865
12079 -361865 179139 173635 -247957 65136 -31014 32557 246564 109465 -105766 -63493 239118
12067 543750 661986 1464634 1430226 627108 -54531 333149 -1940 5841 40806 -47940 308668
12055 1526 51818 121406 146195 -104334 335496 -463127 -331083 -226218 -42991 163516 -114064
12043 -52493 160945 264615 28587 100999 -500823 60701 -53547 397481 53885 -254956 158607
12031 -323323 177606 -241457 -73956 -47584 -68491 -45323 -67795 -161151 -320749 98959 167780
12020 167780 -259737 -19004 -185660 147221 51866 373500 -1244 -116137 122089 150145
12010 150145 114177 143508 105523 147739 -36446 75487 114563 195576 57198 125644 -235603
11998 324161 -36970 -53422 -70771 -72398 -239450 -134162 75839 -130154 -483540 31478 -218343
11986 -94398 -234375 73391 -34436 -266467 100301 -335740 20941 40888 -89623 128036 343984
11975 343984 162621 -54605 -115628 87150 258290 197160 295935 -211071 -234619 -99686 87514
11963 37790 -305760 -36334 107385 -114824 116567 264988 -126618 222009 -519015 131563
11952 268246 67956 -1129 -239873 1464 -402523 -10625 168521 -14407 -152140 -189514 -68612
11940 34212 103310 21249 84697 -370038 -223323 36553 69613 152118 97502 27920 -101706
11928 11079 317896 310346 -67952 -131468 -268420 -46060 -25152 163124 -75670 88759 105940
11917 105940 -132700 61877 -66890 265202 -42314 -26593 116552 -112732 156229 -191065
11906 -71524 3781 -29439 -6871 -191398 186372 115535 209941 91098 201868 22485 68299
11895 68299 161204 179592 -18320 -178987 218364 128906 -422017 23138 193937 -241875 -74624
11883 -200225 -268865 -29442 -233121 -156108 -165298 -203704 46117 41631 250732 -89349 -87714 -67964
11871 -67964 189255 -282982 -326340 -242627 -320237 -146343 1187 -61174 107435 1605 -108577
11859 106619 -134344 -50951 117850 -85130 -263385 -404088 -136135 -282074 -259407 -33649
11848 -40243 93401 -77334 -302303 -77369 -225701 36567 -76924 -118225 -86260 -81955 51571
11836 154648 -85855 -110464 -114499 132937 -38587 -91687 123814 22424 -78240 -296721 -272453
11825 -272453 203589 -15681 -442627 -306262 -123521 -238161 -116745 -322592 -395956 155936
11814 -160839 -17772 74830 72411 -199162 160701 207831 29791 26122 -182617 124594 -196536
11802 -356896 -48935 -50939 -14121 239250 46376 -132741 -223072 -158958 -140730 -265543 289590
11790 -86866 93762 -128899 -191920 345232 -178188 34384 91801 -232904 -250820 -3419 131456
11778 210470 120211 -278619 -187351 100113 -49896 206765 -238971 -86775 -102973 8280 172742
11767 172742 63380 -59668 -156657 382635 57865 79608 -51694 -12133 -107670 -83640 46324
11755 39439 -59475 -18791 -237942 77881 130378 309362 -83079 -58756 -102262 -35805 -201085
11744 -201085 -94338 203208 -12411 -73617 -39453 29367 149001 220341 99385 67450 73332
11733 73332 144300 -299957 23537 -265611 129257 106371 -259196 -13567 208615 6945 192156
11722 192156 -96069 -47523 185836 -104462 359270 185328 31245 -49895 274994 -71741
11711 139097 -40026 -41265 -264947 -230028 139559 9836 62339 -74402 -193337 -196901 -189210 -83534
11698 -35325 168867 -34130 -80790 6451 -50021 -69380 38834 -209835 -83469 -294116 466040
11686 94524 -82564 -156708 86472 -55766 410368 170182 177814 196988 103115 86201 34321
11674 -154019 -129018 -97756 -115515 162107 69762 -143465 -24710 115209 -173193 35875 169064
11663 169064 148385 -80209 222994 78956 -263275 -6850 -26982 271811 33355 359925 289964
11652 289964 -145805 411398 -210388 303060 -42442 -109373 -152909 53462 -201703 18443
11641 -49370 -156099 -28551 311356 -65350 108007 60553 -239494 40508 100825 -150826 -175882
11630 -175882 17151 119819 130548 -11579 93266 -123611 80456 -99236 -51804 137198 -7932
11618 350401 29887 325817 -9627 -24402 84594 -130098 205448 -409536 -82308 351544 10865
11606 -123281 -86657 -181127 192099 271777 120160 -64820 -216604 56771 226744 136150 383408
11595 383408 257676 124195 256715 -13370 -204454 -66263 175789 -53439 149088 177090
11585 177090 -168075 281350 70225 -113564 304753 -25204 -95564 137278 -94723 107522
11574 81896 118101 -100240 233955 -50631 -48282 -129521 -318444 137077 -188174 -166050 202492
11562 -50255 -232968 82044 161928 176613 394513 -44120 430727 323798 72960 121902 -105526
11550 88098 -2724 350506 -55742 224057 891 -19027 518910 23100 55937 -152022 -181569
11539 -181569 -77631 34222 132708 -133333 75898 -110209 315946 -9217 -87260 204278 130023
11528 130023 139202 207857 196208 17386 210095 -211823 357095 -2635 156086 -106623 111395
11516 267860 371910 -370936 453485 87009 139262 418143 360031 98622 236423 72234
11505 110580 220619 264282 247014 122142 -43576 455075 -99568 197984 251684 301100 -191882
11493 417261 3260 -64525 15086 -81973 -245400 182934 -20096 91776 125540 556104 159270
11481 107121 60786 148997 314727 93531 -39842 179975 138248 451274 76760 194764 168420
11470 168420 -163213 -103876 164089 -137958 90066 -106409 23831 149963 207172 24196
11459 75564 112856 26624 123301 -124195 -71322 -375206 109670 -195552 191095 58807 52704
11448 52704 264288 350493 186691 255860 -12509 -16589 -13774 -112731 -115378 283528 162098
11437 162098 -105059 -142672 80276 13307 2257 354116 485539 209207 88735 229293 -140582
11425 9132 -244507 -6146 33895 110777 239089 99888 215638 183028 149126 -52179 9486 171158
11413 171158 123997 -57713 -50921 147454 -149780 137375 -294656 -144254 36298 11018 -16820
11401 144920 -257249 -142774 119208 89178 56062 -297393 260778 -236849 -146425 72854
11390 358474 175521 96648 -74651 91613 173947 128126 -27932 118690 -157047 -42887 542460
11378 -19036 153999 -233206 152469 125921 -173089 -35000 -84322 -19498 347682 374 -21850
11366 -178242 -49685 64823 -120331 147845 -20853 -162049 -15217 -171136 -71135 -143817 11040
11354 -99496 41969 -156934 -173 224391 266486 -147654 -221956 13530 81580 335574 -62763
11342 254891 305281 -116290 37328 -205167 -239535 61340 223066 -62713 89409 34356 270921
11331 270921 -92097 95460 113721 -45485 52273 -82811 -3089 200198 -63738 326960 -69342
11319 178566 -152623 -24976 -2753 43200 129333 12901 -22908 68455 -79753 -3476 89956 -63920
11306 -465142 -56150 64239 32693 -39466 -30938 72586 222607 110888 94773 184326 -262991
11294 131921 -84570 -289077 -47938 -271018 62336 -95970 -312 -296844 210383 -84982 -164608
11283 -164608 -268989 -127268 -166609 40774 199001 -316941 -89130 73399 149754 103093 -8701
11271 -132428 -179459 334376 214474 -60831 92381 -41838 225392 -118035 84387 -76322 239407
11259 4343 -160517 39943 -133760 97779 95941 171640 -3593 -191170 22924 -249718 -215249
11248 -215249 -92619 388519 50403 233058 -145567 -88656 123473 -372919 -169731 -97761
11238 -97761 -8801 125544 -37314 144720 -319213 -172845 98203 -60752 -148380 -1903 -91689
11227 -91689 -138823 -469398 -167576 -95748 65421 -6513 212877 -160086 93636 -31267 -159794
11216 -159794 -69047 -53411 -79441 59434 140262 22139 104294 241469 -222000 20649 -349199
11204 9248 15225 286184 -188574 -137574 100940 -147127 -8130 10165 -382915 175343 -159613
11192 -154854 -169240 -46835 -15006 -185560 -5199 311502 -154094 523139 145701 178638 36001
11180 -121641 6681 -23830 63946 -113945 518 228900 -306371 230080 -20390 -236702 155305
11168 169983 -282851 7117 1743 47312 114482 342314 -127186 -151837 137498 166435 339223
11157 339223 40489 -114693 -207828 7842 -147304 25546 228442 -26065 -54753 -85526 307902
11145 -275848 169018 195259 19781 -144283 326723 89226 -91558 -204900 39197 -5973 206337
11133 -49727 -57779 -156523 -146453 -108272 -110193 397936 -222098 168294 124700 -209842 -272581
11122 -272581 -334201 -213905 78281 153495 212790 132577 -390133 79288 -4190 109413 178192
11111 178192 105630 167790 17792 -202104 103059 163493 244200 32782 148897 253362 115634
11099 88468 43417 -95340 86205 -74593 -57085 200754 61026 -117895 212981 174876 359857
11088 359857 470577 84570 553756 46249 -130762 357346 -140535 194410 278421 -81443
11077 543913 147138 163759 431273 -62088 204777 229831 -39736 485813 187824 339467
11067 339467 327457 657288 665375 583432 463272 619488 393706 767965 709319 555601
11057 555601 451050 455926 759615 448080 843347 375724 564657 649868 680004 662808
11047 662808 436481 802975 677097 682125 731071 489628 937886 661660 1159462 320347
11036 606408 667962 973257 796311 632635 459800 683726 545110 732521 773165 458685
11026 458685 850862 505105 722410 802939 394558 673250 523820 425306 485682 1000411
11016 1000411 570848 288111 556917 768701 873069 226905 518839 868926 264520
11006 858904 267450 932944 453576 761124 504092 377135 790782 977016 610249 719481
10996 719481 757661 669536 900062 603808 1004196 411376 428864 1070143 625772 841396
10986 841396 991680 1005540 796521 1092823 887542 957095 1241385 1224050 1296375 1289329 1552363
10975 1552363 1943270 2299383 2343433 2591149 2820146 2456982 2734463 2708710 2058286 2186680
10965 2186680 1997241 1717099 1672804 1560638 1619201 1612531 1262116 1706537 1514308 1413423
10955 1413423 1587607 1290559 1032196 1175500 1242520 648586 863831 547665 407812 255638
10945 255638 515979 246293 463534 189533 422688 189842 255646 5197 473997 252056
10935 252056 -162061 332564 78867 -239305 15364 -265729 -292777 74939 73476 -263856 40428
10923 92842 -86380 348156 487221 -26705 -242790 -2365 -108905 -243939 -276488 -177059 -102017
10912 -102017 -38805 164987 -14667 -110616 -44658 85515 -11954 -14749 6035 206560 -5626 -202244
10900 -202244 29128 25528 146141 -161756 96306 -137391 -142400 -927 -8140 -20447 164233 -1303
10887 -107672 -107537 120777 -113166 34316 -159165 249394 -109776 -332971 13682 177466
10877 177466 17131 80971 39826 -2183 -344221 264271 -434485 -114212 -125726 -149387 4728
10865 -162272 104793 -14445 -208264 137730 -203723 104858 -39412 230348 -400867 148118
10854 -137896 -193803 -45233 85787 155706 -247650 193976 20149 56624 -277184 -249757 54771
10842 -126569 116071 -2555 281879 15652 154017 -282827 268906 -135327 -18291 -79801
10832 -79801 -230580 -51675 -127119 -240693 -78108 -157348 -239835 -158622 54918 97094 136027
10821 136027 68247 -503481 -129328 -181721 -265814 -167345 254378 -82277 -289059 -109011
10810 113920 139147 222941 27513 205275 -42854 -45392 -157884 -66109 -62229 279011 132277
10798 173666 259603 -176624 -261304 -166348 -103942 -380251 260414 -18601 302104 -148183
10787 -272346 167845 -112827 -60511 445589 -7443 17304 -153814 -179544 -94432 208315 -118372
10775 87594 59778 1596 152921 -163484 -219035 22625 138696 78264 -63546 168730 212938
10764 212938 12591 -151974 -30407 -52046 -76287 85741 59352 52483 -131622 65238 122427
10753 122427 -40948 -207774 -254842 -220851 79107 127707 166617 140131 -41893 -122870 139898
10741 156443 -90681 269071 222618 -18864 32149 286421 -68676 -75214 109922 75125 -100881
10729 -4256 465823 -304022 -65382 311577 -92269 -35952 208666 -141011 -162736 96604 90006
10718 90006 -57096 144263 -24924 -74510 100363 -147861 -396765 -17855 33126 -75474 20134
10706 -196708 -216117 -224007 -186170 267250 -180723 -69110 122844 389711 -217664 -172013 347521
10694 -14100 -2356 -12591 -43551 -241821 -4336 451317 -223279 161998 -75590 -148769 39827
10682 -220351 -171191 44997 174920 -252122 -171742 77546 -155741 160751 -110533 -165839
10672 -165839 278648 33189 -20085 -42579 148509 -359752 -372296 -52724 46083 -142654 298537
10660 -239003 197192 -133982 -99413 30663 -106460 73220 -461647 -227952 33321 -19362
10649 81123 -185135 -156696 70801 -44147 -106083 12470 -148969 -82173 -115281 -25385 -190118
10638 -190118 -122265 -38211 26095 1575 -372771 100571 -148881 -69863 -105526 -36749 -88465
10627 -88465 84413 -39200 -92057 -39575 -50297 85319 255793 -149012 -47163 61831 96117
10616 96117 44121 -45675 -76744 -74747 199229 -219754 -298890 -113685 -275007 339184 150724
10604 -140661 -13 88957 153197 224767 -216427 60528 186805 -317290 -55872 -7741 -75098 234894
10591 -208814 -45415 -59453 -157332 -25455 169799 -65322 80081 -327869 -9634 -13033 226616
10579 58726 149743 -178895 11862 152134 -49656 -100376 -106549 8618 -199636 -109333 -214436
10568 -214436 -441359 -192123 -322252 -109584 -163502 -259362 252150 584107 15085 -41027
10557 -10346 -52450 -192608 -183329 -99313 26729 277330 82905 247985 65282 -91442 624908
10545 -205423 -227455 -121799 -19442 -125019 67535 -124115 23375 116851 -33744 -124250 -18982
10533 -1070 -159600 38 -296700 252797 -276391 -171781 111849 -87393 80788 -22313 9109
10521 305568 52222 -620490 171753 184132 -164342 95016 -219112 -128795 101979 -143753
10510 175771 -98837 -90791 172760 -263726 116281 85590 120232 204849 -261958 -18284 -224389
10499 -224389 -243048 -128367 154924 -233082 -37588 -117047 14398 115751 -180886 155115
10488 -230544 15441 75248 15015 285450 268568 206888 137763 398279 632036 285064 186481
10477 186481 107286 150207 57976 25372 54230 -174911 -55990 -56181 519164 -120512 231400
10465 164093 -80177 252634 162157 31650 -12891 39359 124972 -262380 226313 -157073 129491
10453 257359 -4502 503074 -243525 34060 189016 19037 -67277 58850 40117 224976 85749
10441 -144074 351559 46531 36371 -42973 -27130 113704 -160681 74828 274779 -344979
10430 -146384 -19142 -167268 139024 -219010 -63338 -195820 -5722 207607 63913 70222 -191139
10418 20275 -222900 -104321 42786 -196030 221211 -28318 -191881 -229252 84820 -120219
10407 -42927 -37486 211674 -375958 -145045 66430 -123384 -89394 -103711 -17467 7261 25664
10396 25664 88731 -3913 -248964 -104374 99055 2322 -62235 360391 238915 123173 -28516
10384 392703 -52772 216422 243328 -68098 82529 -66547 290539 301898 237310 124553 206591
10373 206591 105931 458809 263737 122890 -86002 190627 492062 575369 279462 79328
10362 115368 404190 338868 -20012 578854 125742 292373 -182094 174847 291476 293452
10352 293452 319346 384043 278367 459536 550035 58379 128331 -17118 335400 277184 356767
10341 356767 40278 -41720 96370 409933 411415 214087 85196 11475 -71476 52477 174766
10330 174766 194354 334368 284048 71879 143372 -107472 74958 133038 554691 202755 50049
10318 108418 190634 -55663 94565 -63846 111835 69586 -32050 60181 301695 128612 134297
10307 134297 -178955 -119566 -59873 -55745 -260034 -188145 -12498 259759 132987 72543 270594
10296 270594 -438837 -156416 192672 -80827 112387 118131 93738 258546 314097 -196174
10285 137348 -108879 167533 -153285 27012 164679 -103049 -192295 239125 -143363 -302325
10275 -302325 -55682 -92147 217830 65447 160735 -87585 5271 -326584 5750 192832 -73498
10263 187187 98357 143304 201186 91398 219354 -164466 419954 -238342 169840 260229
10253 260229 327067 -183432 191630 -18948 -57505 103847 -34223 -83939 218609 -192514
10242 -98348 -212030 81935 -450003 101061 -167384 -73343 -88420 -322916 400541 -157311
10231 240920 37472 56886 -65546 7085 -139067 202008 172578 -181814 264711 217253 86969
10219 107318 -243554 -164389 -151652 326451 -97943 -332051 105503 -208175 -88894 193709
10208 346000 165361 -143019 92183 13438 -175371 -145018 275240 -113550 -266069 40128
10197 -282082 6566 -111832 -26386 97067 -25769 -301730 -312738 -156164 -88522 1057 24304
10186 24304 -283512 -133900 -84108 77471 -28980 -46261 -144571 36616 -167007 207575 -107185
10174 -480224 90984 -286117 25478 -245608 197165 -67127 230409 -74956 -31491 -15096 -74389
10163 -74389 -46142 187912 176433 125927 255250 -63972 82670 -81499 -99210 24195 -66119
10151 -127364 -109434 -133987 -236914 -66657 -355455 123495 -88998 -229432 45482 -77198 123509
10139 -41832 -268255 336314 48912 -20848 -117526 -70295 -150041 -30194 -118406 -398115 -735
10127 35106 -65731 -120129 -78538 -191 -66112 173543 -397381 -149343 104607 -311710 -149470
10115 150383 48739 -45326 120469 30386 -9313 -35839 -104351 -94 -105415 -124026 35976 41050
10103 41050 117580 25895 -104459 -113418 -186126 -74451 -142607 -87855 112722 65516 29214
10091 -258823 108914 33333 -536506 -26150 -311538 50061 -158176 28490 76561 85965 -5603
10079 30747 83128 9370 -259671 8988 -197029 -176306 -226558 -86832 13763 -127976 34198
10067 423283 -162369 246155 -139711 -166413 -132471 -189838 217509 68733 124543 -207 181991
10055 8465 -413271 -173182 -273421 163222 -90672 -136738 63725 -16276 -151897 -116995 -318100
10044 -318100 319326 66665 -59698 60575 -187591 -45458 -228394 -152252 56245 -88280 -164334
10033 -164334 -217828 -243572 -284924 -235718 178931 -290793 -171445 -185671 -29991 -297296 37691
10021 -24266 229791 3355 -70960 181739 -128983 -232805 -58857 -563 -72845 -218883 118186
10009 -66297 -129172 -52231 214069 -89739 -55240 189917 -245984 249449 -181633 122961
9998 -26090 192498 81993 97627 15165 85795 -264485 -40894 -359952 37917 351660 -133525
9986 62175 293879 -169579 307965 134299 -57838 -121682 437925 -290776 1100 -45659 -372697
9975 -372697 -193571 -224303 -126862 -42687 19269 124719 -84705 -86329 23407 108666 40829
9963 -97886 179317 -50974 -154999 -271053 -317287 274851 -100945 -113433 276561 238089 -231929
9951 -45459 -137670 56597 -58051 -95454 -203170 -218799 -46469 42854 -115732 187998 -176465
9939 -139792 -118438 202917 233758 274089 93885 -246031 30136 -126485 89794 -112366 -217826
9928 -217826 -300495 -141700 -118611 141849 5815 -45596 -259566 -255444 -299767 -54795 -130102
9917 -130102 -91860 -255544 153872 37124 196364 -245862 -371499 -161376 -47835 -314231
9907 -314231 82723 -8016 -130792 143775 -327827 -94023 22921 63501 -123150 -341942 -34079
9895 81729 231266 40043 51904 -45192 -80003 -171122 169826 -114701 -78254 10211 -32621
9883 -124689 -69672 -110165 90778 -105600 188744 -285275 -84953 -230028 -83714 -108322 33804
9871 -93592 128210 -313924 29292 -365177 147478 -169845 82991 -266938 -133728 -270461
9861 -270461 -275639 66554 -269157 -374183 -389991 134392 -240307 -167936 -255415 -398669 -60035
9849 129617 146396 -237616 20071 -439540 -158104 158492 78904 -186948 -77429 -106831 23880
9837 -83670 -43797 200943 44816 29537 17670 -258163 -245530 -194309 -189935 216241 -161808
9825 26532 77302 -254811 -2991 -177521 104134 -11971 38020 -156861 -24075 65256 256611
9814 256611 -214491 -180969 -208627 -191016 -181189 -420075 305473 45001 161310 143930 75900
9803 75900 116002 -87254 46516 -177205 103566 -296120 37641 -366841 35718 -142478 52230
9791 -188127 523074 10320 -227679 149708 -45074 -232941 -404882 -2023 -18572 -86197 -273224
9780 -273224 -87750 196560 182195 -192205 -306706 -314717 220945 -90888 -114473 102108 14182
9768 -10387 207774 153798 81795 -56306 -49011 138529 -92640 92512 -12769 -141801 58833
9756 198506 -169956 -142725 75793 -301744 249318 -253004 -122927 -207159 83253 185066
9746 185066 -95902 -205882 10832 -176239 -168312 -309730 -159663 128915 2191 109829 -99563
9734 -218348 -60724 -24467 -152050 -220001 -219144 -70719 -206654 121596 11902 -116540 81759
9722 -179886 347732 124018 347262 -338043 -201260 -101175 -61987 -206731 116305 183794
9712 183794 -12239 79707 146749 -214514 374896 -25278 -252118 -215286 37220 273656 -110473
9700 36596 159342 127554 -164048 44907 182467 -66609 -224322 -171609 -203890 -462825 -65914
9688 -141717 -138958 97566 128058 -12440 143859 55944 -324346 -547962 -225166 -21859 -315085
9677 -315085 -20809 93106 -102879 -63594 -7322 -181615 -24634 -281863 -255518 -444969 -11957
9665 119500 -209622 140260 -167288 -124642 -220124 -158749 -274922 -166953 -64982 -40037 -95672
9654 -95672 -98240 169853 -73584 -346917 29810 -80735 -208261 39420 12650 29476 -63770
9642 197625 -162043 -206156 -15432 164354 -32894 -203372 120421 192866 -155624 305356
9631 82033 -61401 -146767 -86858 -239579 97698 -46081 -138456 -311568 -202262 113508 42255
9619 -65245 -26246 -162799 -283215 -302841 175590 87855 -32553 -31916 135825 -59310 -35529
9608 -35529 -21437 -213152 -47736 130042 -233770 -183647 -292459 40507 -341891 308854 184195
9597 184195 -101623 166337 -158541 -170412 -34947 104240 82745 -247995 51287 -192173
9586 -76579 -114672 98856 -206950 -78487 -201696 158016 291544 -306559 68998 -12581 220394
9574 -128448 134191 -111849 -12993 -53057 -4497 -167612 -357919 -200123 -113230 -200243 -161628
9563 -161628 -92538 138270 65708 -159319 -6976 84417 177046 -177932 17505 216085 -186939
9551 -180470 195902 -77463 -137305 -6231 -402238 -215443 56207 -197674 -27850 -273223 -107847
9539 39378 -345165 307451 -105858 -235676 -117332 -8528 -145016 23297 -219429 10365 -40070
9527 -32483 -166567 -170472 38827 69297 52896 -176199 114578 -59951 -211301 -41900 -111988
9516 -111988 143788 -189632 -265921 -30415 127640 -276462 69968 -163438 -257021 107858
9505 41223 -168334 -42980 35111 -95834 -228742 39551 -111213 -286632 -9870 65893 -127256
9493 219046 -133544 80700 124348 -301972 -11461 -21335 -361883 -111075 -386434 -12490 -23961
9482 -23961 222695 -304871 38787 -46210 42069 7549 -254547 -205921 274597 -185103 -45253
9470 -24558 -317972 450056 -91634 36267 25858 60110 -5417 -240070 -168421 -332090 22451
9458 -341731 -164326 372495 -106805 150117 -32790 -72837 -24657 125655 -20992 -190150
9448 -190150 -154148 5081 -87833 -172078 -64335 -253145 -53015 135809 -361556 57445 -36206
9436 20684 -28987 242329 126767 78238 -174267 -293833 -61989 210235 -99059 -163356 -179404
9425 -179404 -419977 -27893 90801 247953 16912 -10932 122191 -74339 -71470 -38318 38480
9413 -62556 -322210 282250 -342019 -142137 -177189 -109881 -88030 -129243 113733 186240 -136290
9401 -451092 -472196 107029 201157 -90361 159327 -434507 40192 -62559 -221135 -349531 96677
9389 91111 -162610 34851 -199442 -484872 78756 70819 134775 -314061 -2321 53224 122081
9378 122081 -50325 284553 5781 -12851 -64347 -30171 122578 -187823 -87266 -250929 5990
9366 -326715 68591 -27372 -94386 25726 -301494 -98331 -267404 -19144 392323 -2212 -145522
9355 -145522 -434247 -158325 58491 41032 -297983 280343 -120371 -345899 -118060 -314708
9345 -314708 -86315 -37926 -310408 -32792 5974 3131 194698 25615 -231744 -68539 -130987
9334 -130987 -42399 -29174 -19231 -39092 11590 -121507 -183528 -102925 -610641 -184754 72590
9322 -288689 -5855 184284 -78124 -20326 -126045 -130002 -71651 42091 -70837 -212615 92401
9310 -273558 68239 -163919 -170328 -106877 -210619 304714 40296 -212311 -44254 -184698 -133793
9299 -133793 -187882 -226470 -75330 -118692 47487 -86582 -117050 22616 181838 -126345 -190625
9288 -190625 82828 -64963 -26524 -183211 293 -278734 -84097 134248 259060 148260 14975
9276 -59131 -297286 71045 -114146 -150470 -64885 -288705 -103104 -40234 -152206 61889 18761
9264 -317661 34748 53493 -248197 -63736 -85967 43020 158791 -48065 -350162 44175 58333
9253 58333 121215 -416747 -11032 333601 -268325 113738 160518 301983 -267291 -72694 187828
9241 -266944 -267952 125815 -227468 -98389 -17116 -50941 -198809 -105002 -113717 -233352 -236860
9230 -236860 183080 -168697 -48989 71911 37089 -402660 -263970 38481 -237207 -15039 24038
9218 -272822 -54079 -183463 276170 -232674 -163491 -97329 -62412 -102435 -64896 -83325 -209784
9207 -209784 -81929 105551 -133108 -80780 -15946 -52187 -171460 213262 -120816 -154841 -229097
9196 -229097 106121 115380 65928 -485276 -134669 -3520 -702649 -322781 -57009 -209706 -60042
9184 140273 -84781 -59443 308584 -95100 -26138 -133985 -3163 -141946 -59260 70829 251187
9173 251187 64862 142060 -272523 -339818 -79192 -167841 190573 -226103 145844 -53330 175526
9161 93162 153046 -89130 -51699 -289801 -40841 -69506 289289 -44501 89111 -286033 14052
9149 95094 83299 -525 -34315 17339 -29703 -223227 -89794 20121 -150471 30217 13454 254178
9137 254178 -29046 -310922 82454 -202560 -45707 100367 168502 -111387 -169014 114641 -152485
9125 -83851 212091 -248116 -144279 -253241 75559 89226 -6862 -20503 -120012 -238798 -85402
9113 -42768 31773 -251328 -109696 -243173 232343 -20688 87112 118206 -126789 -93693 -70393
9102 -70393 -265104 165458 -232838 -306822 -182351 -305363 -197138 304352 63192 -259870
9091 74169 -248699 -40194 -137794 -118704 -128274 -153353 -459875 -11563 7556 -195803 -194480 -107587
9079 -107587 -197511 150030 178787 -80566 -154891 175156 -202775 -59060 71919 -313998 -140840
9067 -3137 222417 -24220 312722 56780 152479 -192282 -287811 -343365 -424312 -89027 -25002
9055 385989 133058 -435834 -182916 160371 -139181 -73569 -143045 66586 -22471 34850 -302655
9043 309764 -175402 192639 35446 162105 -408226 -33244 340 -39166 -387767 20817 -12865
9031 48019 -304592 -61008 122392 -228642 -85145 -44178 283214 -34166 4687 -50753 -118801
9020 -118801 -181779 43126 -82996 -9288 92944 -497891 186959 97154 -197579 57065 -184298
9008 -41353 -283149 -182412 61417 100626 -60770 -193879 -120037 354184 -2049 -163659 -40220
8996 -31263 -50639 -7793 -55528 215948 -226768 -50676 -24611 -53386 170132 -99737 51469
8984 -298700 386293 336104 90950 263935 78235 -229725 -143341 19427 -92986 96150 -138345
8972 -139150 -313044 39426 -100847 -33725 155686 -287554 23382 -34693 -65361 -228341 -401048
8961 -401048 -99983 -62236 -156511 -196038 3321 -32942 -130748 -196540 -441094 -100327 -132860
8950 -132860 -119079 -60646 238811 -37604 228318 -46508 -114223 -109033 -13349 151169 -3640
8938 -137 135115 60627 147652 -482 530034 175539 -7066 370848 -101806 307264 -69092 388671
8925 533214 1007357 2060414 4820707 9873089 18019853 5862101 2147730 700918 739596
8916 739596 467176 148980 -103420 161883 -31225 -113893 186047 42581 269663 148061
8906 148061 62507 -375540 -58124 87745 95700 -328851 -380092 105784 -91311 -33056 109274
8894 9271 -219339 -121001 -35096 -20764 49534 -62192 -290493 -30357 -74561 203425 -100108
8882 -213091 -170973 -163786 -27119 -30316 -133176 116398 121746 -73235 -28003 284381 29907 300660
8870 300660 243373 -347481 192942 -120747 -176950 222341 -129163 7329 -435940 -129968
8859 131673 -639820 -365153 -284255 -151102 -1900 194927 -59343 -40747 -64520 218777 -68109
8847 -70234 -56119 51946 43991 -127110 -426100 -45566 394477 10727 -74700 131844 -34997
8835 -13932 -311277 -333342 288768 228469 41856 -94856 -138276 -103931 -98508 -188063 -215961 -100225
8822 -128423 -37193 -96027 -230719 -227579 -242328 -18389 292284 -128111 349306 -249260 27248
8810 -60650 159494 -100736 190203 -39618 -132912 69451 -179589 120756 -17375 28837 -276130
8798 -58881 -456197 -111683 -379518 -240723 29409 133365 -9210 2305 -184891 16691 199293
8787 199293 10352 193838 -50392 132132 164115 -31918 -171060 78959 182742 -53259 177521
8775 88046 -171044 -173998 -479976 89055 -283162 152912 195334 -35805 -27179 -234949 90536
8763 -122942 7767 -142469 71966 -156943 -1419 -49278 -15425 297904 -349486 -235707 -205811
8752 -205811 -281297 -108800 -57771 647 -191584 -268638 -44545 -121971 -45915 -26235 51920 -125212
8739 -165147 -267507 2208 -81364 -204037 -66368 -402091 -153727 -94266 88948 149328 155832
8728 155832 66705 90057 -221761 345704 38618 191743 -91546 -115992 -254777 -64580 -69143
8717 -69143 66564 169048 -97959 -102213 59954 76486 157364 -5667 286994 -121901 -164567 11896
8704 38295 -196595 -167921 -47647 -216454 -39818 259408 -71512 -209169 -265318 -102148 124355
8692 71652 -509363 -185268 -252714 -78609 14378 -355556 3986 -148216 197365 -86092 -73212
8681 -73212 -104501 -320210 -273894 -101268 282151 -159727 49187 -497627 -96792 23518 -71024
8669 99607 -339943 -171688 7803 -75603 161218 7275 -190383 138541 -165135 148355 172332
8658 172332 -163885 207281 -182110 39871 186405 -302244 -247310 170517 48109 -11681
8647 -92307 -68924 -187753 -129727 -437199 -295475 157362 -332092 -130227 -278376 -221575
8637 -221575 -140723 -194655 -57932 -416665 -192278 -490336 -222787 -68371 304001 68146 -232266
8625 -149370 178793 -127327 292799 -192444 -33146 24190 90911 -111836 -393119 217639
8614 179047 -105793 133542 -194608 -236723 -15006 -115914 -242611 -2656 -111190 -166781 38726
8602 -68401 203686 -154780 -142824 -56278 -207491 46728 -13973 266031 -49817 -117838 2978
8590 -485091 307942 -163362 -59516 -1139 -352901 -87447 115138 -28332 -160646 -14478 -93697
8579 -93697 -127086 -121976 281591 300927 -328235 -32784 -18758 59563 123288 -220628 -102257
8567 88362 245140 276532 261838 -170411 51852 -74247 -31574 -321456 -153659 -76770 239611
8555 167772 -51166 -209871 -63726 305621 173811 54846 -388910 -229030 -249682 20008 274430
8544 274430 96277 -169973 -121557 -459090 153603 152521 66379 -296644 55777 134319 -228352
8532 109915 -11098 -399839 140231 -181242 91578 -318763 393544 6765 77903 7288 -105866
8520 458172 -297546 93384 -350737 50950 -56978 -180047 -61741 5782 -72731 89777 254142
8509 254142 92240 36431 -173473 245946 -20088 -198390 -304511 -250925 195310 58979 100330
8498 100330 -12301 -59659 -50091 65214 -98880 -334995 -25915 47226 -177208 -118833 -141936
8487 -141936 -241950 -222199 -21379 -239617 114212 -38838 -170006 27380 -329374 -391741 77035
8475 52891 -322118 15606 31202 233855 -311295 85611 -151039 -230153 -218775 72758 -323922
8463 -175443 162446 -153274 13219 163459 -17511 -201005 236790 -21042 94679 -108820
8452 -260634 -253334 263603 -51518 12943 -237058 -388963 -190244 -200103 134605 194099 204427
8441 204427 -271069 11567 -225053 221894 -140155 34906 -82041 -209559 67805 -88491 -49454
8430 -49454 230477 114087 305799 -115587 81173 -159208 -128061 177295 -204673 103722
8419 21581 -161258 -117796 -273066 422537 166701 -373448 99691 -291709 -362959 -6678 84483
8407 -144384 304768 -395150 -218956 -153021 -86537 -216915 -138133 143951 21215 -137078
8396 -2999 -252180 111836 53174 24664 -119579 -144037 87635 -50445 -55750 -144550 58705 -100104
8383 -31822 125133 166252 233978 19726 -416276 -10802 24571 -322200 -43529 -275862 -247966
8372 -247966 -10901 60814 134667 -5704 224465 -99555 -42401 -129403 -147517 41751 -375346
8360 -292849 14767 -45758 233332 32301 -1675 -190416 64884 -294293 130420 -71221 451419
8348 -139488 872 -143171 239883 452 -221646 31651 79021 241030 -66291 -166696 -10352
8336 -86282 -305857 140158 -148143 209818 -15101 -56394 -154067 -332430 33495 -33532 -227444
8325 -227444 25636 -109788 28071 -65912 -58640 -55594 41332 91708 -168052 149970 -214920
8313 -35227 42834 -108466 -131414 171634 168604 -139562 -150789 67291 150777 -66044 61104
8301 -57676 -360553 -149995 -127084 41073 66605 -377601 22764 205488 -195834 -30188 -55900
8290 -55900 -65831 -503248 106835 -117130 126576 57350 -73527 -207250 111879 39246 -55151
8278 15846 -243850 -463056 -11572 138045 18282 443802 35335 -127226 132073 -112738
8267 281479 -202492 131297 130089 -32519 27978 22398 -342218 -39886 64718 51940 -279416
8255 -210382 -215882 -58500 -34147 -20255 92176 321188 -107694 -264376 204216 -103374 -137058
8244 -137058 122230 -110853 -194245 -145005 160568 7617 328138 -131366 118483 -401599
8233 -81132 -284649 -131932 -150285 -241353 -318359 -162651 31617 373616 -107025 -280824 -32197
8221 -294385 79351 -226588 264412 54170 -119754 317171 2006 -101171 100050 -69040 -107833
8210 -107833 251829 232299 -397816 18404 -27288 -176738 -3962 76672 -391736 -93521 130985
8198 15404 -41792 -14638 229057 50645 -237958 77150 150290 -139735 -148054 57065 -33901
8186 -384437 5015 -384366 15845 10588 -239778 106958 -81785 273396 -113014 157972 -5660
8174 -77319 130825 31015 -53188 -91705 -6416 57284 -235161 -84830 -149483 -150369 -85409 -40052
8161 -176833 224531 -127553 144031 -403834 162823 -213977 -174550 -63273 25548 -92681
8150 69146 -524635 55939 -149622 -180184 53137 -153292 60810 -311559 243790 -176179 242252
8138 -132557 197973 -4818 5249 353891 128992 -201767 -175818 -150521 99274 -11222 466345
8126 140265 -51333 -13173 -260520 1286 -81397 -134556 -307191 -100408 -115771 -300266 371634
8114 -309194 -350996 -57977 -238853 126448 126511 -158643 -123528 -183665 25209 -197992 48368
8102 -13556 22205 -192001 364304 300232 -56904 -28634 -27780 194106 83283 -129022 155141
8090 130732 8998 193461 7391 -212761 -35752 240212 309968 -194498 -74144 10269 -253205
8078 141249 -38085 -12682 -72684 188486 -373038 -127021 4233 -248724 -190447 -113097 -2232
8066 388520 -124511 239210 64832 -167563 -432861 -23723 -167970 69335 -118956 78186
8055 -198524 -59219 74971 -243721 170826 65326 48291 -198441 -44955 -57801 129382 -11410
8043 -68099 -156544 110688 202505 89155 37341 -290814 -68045 40607 -40943 -151310 -11168
8031 -235654 191777 -116403 67688 -235810 59754 -14711 -5319 -263185 -132252 -98789 -127382
8020 -127382 -96008 -5208 -12214 41008 156034 -152790 -138111 -188562 149767 130212 173122
8009 173122 104810 217602 8113 -112944 -31965 333095 82862 -310494 -1630 194833 -166090
7997 40824 -563164 -249680 -46318 -119970 -134536 129104 -304080 -21979 42207 -16566 6631
7985 -90280 -303438 -169610 -278823 76382 -261587 174487 -203317 -154778 -111013 55437 -86124
7973 45494 -62408 -275931 -101296 32779 -28194 -88373 -380970 -340076 -324404 111716 -12431
7961 -172364 30340 -75881 -135945 -380333 -481382 -65384 -53917 123293 -34179 -334479 -226608
7950 -226608 68219 146 -79900 -433600 -54946 -279711 -196625 45676 104260 53026 69225 -47873
7937 -140542 -298570 3598 62757 296762 96667 480466 -137446 186129 354242 -325264
7926 212601 4051 -126966 120637 -262966 223057 227182 -109678 79901 -15452 -219733 59478
7914 -261684 303789 131972 -188084 206264 6393 -81791 -235609 -64280 -35636 97693 -226611
7902 155701 -430552 -104839 -275721 -85288 -37973 15751 -59446 -346390 -241163 197301
7891 27493 -103685 -337738 -106913 -87192 -21596 -154151 -108266 -358672 -55874 113033 69637
7880 69637 67723 -9477 10100 23780 68455 66250 -87261 -82360 133377 105014 102589 -83314 -55795
7867 -55795 109804 -116281 -162260 136028 59728 -113724 -146063 203251 -184458 143553
7856 477259 118749 188197 167335 -21981 45245 34162 121429 -4014 186066 -158658 44644
7844 98801 -143285 -112554 -386000 75042 2606 -124831 -190682 -163224 -118277 58664 -23999
7832 82281 63589 -383727 -61005 128244 -46421 -268220 55459 -105119 -37257 -32169 278354
7820 177552 233019 -122044 -20723 -49172 -109317 -163495 -136421 -111934 32781 -83959 -111264
7809 -111264 -138440 -176896 123040 -82989 -48724 -20106 -140389 -108928 79192 61698 -243298
7797 -83788 310963 -97544 -154089 -173152 -31627 -259371 -467139 141511 -119727 -20431 -163516
7786 -163516 337877 -62586 -6798 -44145 80522 83831 -16497 219691 -112866 38389 116816
7775 116816 310917 59477 -72451 -144288 178811 -128896 -311887 342451 80478 -302656
7764 179303 -143679 -173406 115644 350937 26960 22576 -34084 62809 -11999 85101 -95804
7752 -213164 -276976 95022 -127773 321874 6272 83712 144169 -36084 -190825 47768 -48101
7740 -21511 -103422 -8672 -75229 -65098 -93324 -42977 50553 71996 6749 -372505 139426 -24599
7727 253753 147906 -136775 -33808 152515 -49558 -377754 -83932 305656 -424365 -203111
7716 -50837 -81306 -104601 -312053 133483 -162838 -162928 -89015 -96431 -16589 -160783 58279 -73278
7703 -138998 -217143 -216728 -187196 -199830 -273482 -276803 -142814 -22042 84729 121301 273461 70634
7690 -299759 -37981 -67595 -61276 -64296 -203452 299829 -207024 -79782 -201546 -14538 56765
7678 154421 -95335 206945 165249 -174602 -113792 -120354 -387752 251420 -182527 47438 -41272
7666 14094 -301812 37237 162299 198016 -32416 104453 28525 24867 19494 82597 -286197
7654 -165521 31243 46035 61167 -5083 314085 102125 -110215 -131178 -147906 -97216 -306264
7643 -306264 -10410 -6991 36356 148668 -40551 190162 -179085 224414 -63535 -62380 9725
7631 117272 -319865 -126277 -256344 -180621 163444 -169782 -88060 107370 -31860 -446536
7621 -446536 -81086 -130013 -28571 96305 125602 43052 -86828 -105724 -20302 -42312 -123784 232492
7608 -7579 134529 -338996 64380 -203600 62541 -35048 -38471 56249 -110149 71697 100968
7597 100968 -117896 170793 -91624 -94591 -25661 -278284 -231540 110305 -16479 10710 -188679
7585 270349 -79969 -9086 35337 -244652 217636 -80635 13948 275950 -87546 106018 -101763
7573 -303536 76262 -61275 -388125 150245 -59974 -118790 -251744 143039 -209832 53750 -49086
7561 -124436 48862 16546 3294 -123551 97473 266616 36852 -676814 -11887 -266357 -246095
7550 -246095 266908 -63094 203875 127799 -7433 -120874 60379 -130995 253694 12101 -123218
7538 -51176 232348 132857 191461 -344161 -226250 -254765 -67878 112937 71539 -109431 106992
7526 19363 -53699 335286 107984 73857 33838 110889 157579 -299262 -231385 75804 117277
7515 117277 -71606 -426970 59037 63116 122729 298654 148309 -389204 56464 27177 -238758
7503 -103865 10408 -93947 -84695 167773 182187 -216764 192265 -39630 119012 238094 36619
7491 224924 5349 30095 -50359 -98876 322847 212851 -188782 225784 199935 -95869 74631
7479 97061 -385863 57548 10355 -109070 1679 -246177 -98594 143249 171563 17774 -177569
7467 -310012 48733 -134947 -296475 148603 155761 38065 21357 31270 31009 -65563 5989 -38343
7454 -226217 -368093 -81490 186091 -147456 -110616 75432 -539050 196138 -99888 360669
7443 16537 71320 271173 188310 208446 -37886 -166610 -112058 179754 44542 -94506 73724
7431 -272811 -40210 -51255 -284024 -29157 -171926 -279135 -93352 400191 7461 -414569 52513
7419 13781 -160245 256112 -294181 305887 55405 -192982 120819 -139730 83999 195282
7409 195282 11170 207094 -32668 -135589 -187292 -208362 107442 -101472 318901 79 -208964
7397 -52491 110792 65358 162421 -211550 -70772 27544 201516 231731 -267554 -190144 82603
7385 -107011 -6944 -214369 102252 47083 -42349 158136 134359 -105384 155606 -309427 -195210
7374 -195210 -111442 176300 72666 79774 -58313 -38972 -193196 885 82721 -6360 -125664 -2865
7361 -139470 -218981 90263 -79224 -278297 -119189 -253140 18051 -54896 -90244 99747 -29985
7349 97923 217 -39584 53506 220377 -211695 -35775 159358 26346 297667 237357 -187770
7337 -189875 -72060 31146 -116857 -208851 -73145 58797 -141258 184217 -52827 115713 -159255
7325 -80647 -120100 -46111 26861 -221336 -170051 -300250 328654 -105342 -277358 -321661 139435
7313 137543 -83374 -282508 -49230 -58541 -259284 -63252 147854 8396 -51711 -207931 72165
7301 109780 282952 -196741 -226775 157646 32385 54065 184319 153222 -205927 26776 181773
7290 181773 -308735 105690 40345 -23338 -421782 -47047 -120421 117591 311490 118638
7279 79756 -96656 66135 94031 -130427 158234 76932 -189001 -219796 -55357 -5507 -16526
7268 -16526 345872 9112 -258024 94459 130650 47809 -174696 -89467 -85322 -209512 -114448
7257 -114448 -181336 -59476 232831 -73707 55828 -96062 27028 9537 229665 101622 223340
7246 223340 -226902 -336637 -261102 21107 26948 69764 274324 -151750 45631 220474 128700
7235 128700 28689 18703 -153359 -18418 136367 -111542 -192078 37549 -19153 7051 -93988
7223 -90631 -381261 -60295 -79859 -127588 -186423 -36790 -86114 7054 136899 54548 -57688 113017
7210 69090 -116416 -293463 -173149 147677 40939 -2097 -252638 -316840 22857 52734 -67767
7198 -70818 -39759 30796 -90494 -49522 74164 3320 -64764 -235429 399557 196671 35991
7186 -94777 153243 222290 15665 326341 -273171 -182154 -168482 -221914 240482 237453 -221567
7174 -228645 -197110 22881 -74059 -264150 -296194 -213952 -39911 -86769 19289 37833 140864
7163 140864 76120 -140282 -4450 -134865 159467 -157163 -95036 57811 -42777 -125211 25746
7151 -379008 -252985 -80615 -106256 -254129 174238 -98919 143175 359414 -182792 35670
7140 285079 25859 106101 39494 -181225 119089 154196 -353796 -152727 214006 -35172 -26540
7129 -26540 -138835 -175303 -92204 -308027 -231149 32434 253708 42906 -74402 -93075 154159
7117 353615 193312 -264559 194016 -102408 -273085 -178843 -85469 -146284 -57278 -187503
7107 -187503 -203783 155233 201508 -224519 290551 312314 -162663 -327307 -158011 108469
7096 43264 92254 -94567 239749 -11851 -397915 101502 118264 -257374 -99572 22415 -107784
7084 36678 408967 91205 -230069 29354 181852 -114476 -220533 46166 28772 259521 -437505
7072 154761 -243532 32881 -59144 -276036 172388 -43547 -50874 -288974 -234407 -101147 -236035
7061 -236035 90972 125284 61743 132699 -145171 -215219 1751 -45800 -138783 -32520 -191515
7050 -191515 62681 240057 44369 -31274 -11026 -62467 12547 75610 275884 138899 8416
7038 143456 268657 274243 131456 -286625 -75071 14941 -192973 -173926 77685 34498 60389
7027 60389 -79855 -103253 419559 -111172 -86847 6315 280794 13683 231921 -56255 -106601
7016 -106601 162780 9968 -30873 -107941 -302528 97018 -124218 -71314 518356 -134923 100837
7004 30721 -68680 269708 112473 149557 81302 -109147 56087 57028 -1165 149227 37659 352208
6992 352208 69087 59093 -287198 31357 -110448 -219578 -257944 -265752 42466 -229696 -245463
6981 -245463 181754 139820 -105370 -277224 125151 -13575 104378 -2649 -77200 -186396 213880
6969 58870 -146223 -203508 -236028 109150 -21586 183891 156614 -138504 208357 -123223 -77421
6958 -77421 -219572 -62922 -284556 47780 -109411 73488 191723 96446 -103071 -101502 -22484
6946 -222072 233652 90061 224777 -107908 297616 519616 -144691 -165485 -93979 -40604
6935 -234637 -138795 -17074 36310 274479 142319 -50597 -49300 192325 -17040 71209 -340924
6923 23123 -131154 -275665 63640 -222947 112436 108263 -194380 70585 -146205 176120 -231227
6911 161399 37875 69583 -137328 55083 7492 275470 -142705 29548 -128525 -26341 100382
6899 38229 -45416 -140475 75411 -256455 88256 -283440 85656 -8600 21005 -166294 -50187
6887 143231 -360884 -44246 351219 -238976 -206028 -69180 245020 258230 -313966 318863
6876 -20705 -356089 -6752 -114820 -86902 134898 -144697 -174523 -264212 -110847 -70626 -33710
6864 -243081 -116368 333044 -70276 -262870 -73007 -72983 55814 -102441 -48011 -6050 -55802 -51204
6852 -51204 -24309 51036 -210276 215196 -118579 14573 -116908 92146 -1823 -110875 104017
6840 -89463 139637 216852 -6073 -22585 -55274 -131 18463 140124 -275669 12076 227177 -190293
6827 -57470 -20340 100994 -177541 78199 232077 -42198 -250018 190989 -168188 195577
6816 254839 60672 -117727 -208497 -304532 -328873 319768 -219773 14316 217756 -377832 -2287
6804 -262099 -442774 119680 -14030 -144177 109846 399770 -380498 21079 -203481 208301
6793 -400989 -177345 24745 37657 8203 341057 4027 252705 -50592 -70097 153841 -313205
6781 -151191 -164061 -93302 -198155 81451 54028 -49953 -171579 136104 -235529 141870 -188505
6769 -50793 -49636 24868 -44718 -365 -11589 63767 -207817 -268930 118616 138399 312895 -153097
6756 -13692 -110453 161150 -107256 -274269 121860 147555 -94248 -269334 -18255 -144975 76694
6744 -262819 202727 163185 336016 -175635 -627 77115 -244436 213387 7361 -600 313284
6732 174751 112126 -29530 -235868 147401 -42654 -260155 -306533 75606 146301 -211897 89974
6720 103388 129611 58088 -76458 -71073 -42853 -160839 -313377 -326250 233142 -99056 -25102
6708 -58579 13704 -148653 40367 38699 -64579 -188163 -73316 72958 166232 -200479 171895
6696 185209 -26714 69437 -26097 -159868 -73708 247919 122937 16267 79819 180761 -157375
6684 136574 14791 102645 -169800 -205553 -37717 -250819 198265 143429 -351879 -185124 152231
6672 -187541 111536 -157772 207966 180277 142059 98798 -107074 43990 -87004 153716 134357
6661 134357 -42803 -318095 -63127 274183 183590 -226026 -42749 -101502 47277 -317143 1897
6649 -263699 134726 -33928 208111 -160651 9402 231496 -75607 108761 3339 -38261 -59522
6638 -59522 -146815 -62236 -24612 -61626 -86107 -237922 -74236 -244709 21415 -155789 151817
6626 121849 212450 -25245 31664 185224 222613 -50639 11619 91245 314141 32852 75589
6615 75589 -253475 52365 -239371 -303327 -100754 -132540 -106234 -168707 -128613 -44217 -138994
6604 -138994 47451 -124408 -157896 -95996 52888 -175305 47662 -139794 28799 -383737 -51562
6592 -313807 150861 -31190 88992 -287199 -160777 7407 327424 -217743 -63969 311454 -173980
6580 42838 396552 180652 -29390 -234044 135594 -410543 26996 -218937 -227128 34683 255
6568 5467 39041 -81914 -85329 -337046 159279 -108513 -266966 -39380 257410 71806 -152421
6556 114788 -109932 107437 97648 103617 -225094 114747 -75136 -395568 357214 268560 287549
6545 287549 -96086 -11752 110226 260629 133188 -349007 -3190 -260411 -56167 107600 -75279
6533 447335 205433 83769 199188 94229 -111637 -68914 51072 61649 -6829 -81546 263414
6521 81646 -82786 -25264 -156116 -36809 -364727 53519 -151447 -47316 -10489 101023 9739
6509 -173328 -154509 -61605 -106297 102255 98615 352518 -164235 -296667 256581 273266 -195186
6497 -28218 -18070 -123294 -55635 -120570 48371 -59761 -120534 -145517 -72555 179273 -237954
6485 -22030 125137 -215356 -36496 58559 4402 513013 156853 214146 132722 412206 360803
6474 360803 -80023 27610 -322507 174806 199755 9357 -103267 138943 -10703 -222429 24115
6462 214211 -60887 263187 -85820 -107943 181099 -4503 -57020 -77533 71337 221133 208843
6451 208843 -30336 -200338 -218323 -22397 554 243939 -103589 -137744 266835 -351960 -21541
6439 -158389 -353578 65135 -171958 46029 106083 -178431 57193 -163744 -161117 -410 15512
6427 300035 275720 108359 31901 102772 142417 -317014 46671 238033 199831 81671 -194789
6415 -67606 -94016 -143196 -143293 -3579 -147407 -10084 -80420 -72129 -72701 -208946 197869 112115 233964
6402 233964 -223003 189939 -52705 96543 99467 -92163 -9422 100670 49521 -173865 21857
6390 -396782 -98656 62914 -102921 -94061 -237281 150667 -79453 -266139 -262932 71564 -23435
6378 -351699 -208958 166829 -141240 -233130 139033 56572 19726 30540 51064 -20469 -120076
6367 -120076 80558 -82077 -63693 -295013 -119734 50540 378244 -63959 45618 -70929 -20724
6355 139617 -91193 -25274 4686 82167 -136433 252853 -73677 112933 47365 215985 101483
6343 -281908 -146558 -189901 -8257 -20890 149700 -48054 -122299 -67656 -137028 -189061 78699
6331 183814 64825 -88389 283741 -81939 94303 -93935 -122270 -366068 -134837 -164017 -74128
6319 -63671 -46168 -166785 -103168 54644 -96137 -68955 -37107 40956 192048 122360 112816 -304063
6306 229930 175360 -363245 -84452 -104085 -225451 -60144 -16852 63023 -266580 133172 -183263
6294 -56493 -264911 180643 113350 -152195 -149695 -179655 -7471 81554 -15699 -107488 34358 79790
6282 79790 -43124 256087 -123324 -190966 98775 -2764 -19039 75486 19281 -23015 -156257
6271 -156257 -97024 234648 -150618 -64080 -94086 -229532 -92972 -59796 87651 -131287 -35919
6259 174618 281431 -19924 -145694 -193998 -9644 -57059 34773 157446 -14517 -36520 -184282
6248 -184282 -458836 -84617 -218760 -157653 -173960 46043 -318197 -212189 93495 126318 39394
6236 -30328 -212724 93890 64966 -29566 -102531 -89307 127417 33463 157 -106763 106850
6224 73116 3113 61660 -173111 -361173 27409 -184741 -166174 216443 -287981 158671 -176404
6212 -147692 -11958 6625 30315 -192732 147824 -28594 1558 -135868 -92088 -28873 -114396
6201 -114396 68685 223721 -247982 101070 -32527 -257085 -46485 -200224 -104565 14638 29404
6190 29404 -124329 143742 -118041 -223144 405154 82033 73361 106721 176169 -121949 -274481
6179 -274481 58578 -113192 -70341 132873 139954 -269756 19733 -77582 -43647 43772 20514
6167 -137188 -129583 -142046 133725 -177224 152984 -36711 162241 -252057 32547 -57756 -90249
6156 -90249 9452 32602 231419 46629 -56067 -24100 -257431 410564 -140393 -242754 171655
6144 -30794 -75966 90720 99393 -205241 -76954 311021 91286 163766 -136389 -213967 29795
6132 38723 -91660 107895 -173196 -164211 -78553 -7603 -237509 194664 -210134 -39829 -42895
6121 -42895 5962 -28600 -239934 86114 106497 83481 -156114 -297953 138129 -153597 105021
6109 -81432 896 -55659 112482 46518 86619 -24436 76471 14381 -27629 144008 -222973 -55581
6096 82496 176820 78291 -20172 -2235 -122016 206824 274318 -462560 301140 -294959 80787
6084 137884 182178 -361366 62460 66739 458745 -95852 -40900 -233433 30864 -16045 -281623
6073 -281623 117197 41056 73891 -5036 303725 -120192 -91563 -3572 -57832 80853 -289904
6061 270618 -35372 242703 -45935 78349 -132054 113212 -315529 1583 -100844 -251001 117480
6049 74284 218096 -39355 -115528 -76625 123409 -26001 -400537 100653 120388 307403 -5605
6037 -233838 -140182 139332 83534 21610 177251 -38158 108147 -6913 15000 86914 123006
6026 123006 -227812 -8159 -62121 -143948 -93994 -4511 -198701 277134 -153968 -129035 213013
6014 -193021 -123896 3472 160026 -88957 -15408 -137801 95481 -18173 -187872 159944 -75205
6002 -226592 -144690 -60882 56255 -296780 34187 171946 81309 -102963 17691 -113880 122245
5990 43578 -57690 -316358 12040 172966 96013 -62289 74894 48037 70966 -28392 -201511
5979 -201511 134624 184936 150118 -19085 12511 -168182 -180682 -109211 109521 -58528 122176
5967 58026 -47191 74094 310468 -85323 56708 -28465 -99759 -55484 196125 -106140 18142
5955 -279207 182778 -112162 95820 -79914 -9714 223326 -53740 70157 11412 167403 63514
5943 -454105 178533 102660 212091 175153 -40630 -104644 -180838 -54572 -235829 -262674 4431
5931 58715 -203291 121368 122393 297565 -246656 -521276 -128214 -299925 -262862 -522390
5921 -522390 -108715 201192 -213037 88898 -81063 -110782 91988 108179 115513 37087 65480
5910 65480 -169733 -393213 45390 68432 247267 -124824 217382 -60173 129197 17469 -60161
5898 258296 157583 -451939 172751 77744 96373 -128554 71106 139347 -79328 -44228 -70501
5887 -70501 -7985 305893 69694 50571 -271967 21531 132351 113729 105661 -203091 -20194
5875 -237633 40688 -83182 356789 -117551 -227112 -207350 261794 112783 -72366 109683
5864 413105 -18684 -10919 -84746 250068 252464 56390 67045 340562 -72433 -73409 72143 89456
5852 89456 -39689 -20002 168978 105092 -914 -104871 275369 -124629 353024 4071 193245
5841 193245 -4017 -115622 11695 -26294 -22051 -46973 23100 -66932 -137388 -387317 61273 84666
5829 84666 132988 -377858 -232998 -17162 -240902 -132041 -301698 9922 -132734 -20403 -63110
5818 -63110 57957 367417 -169735 -107989 -413946 -266680 168599 27556 153395 72831 -26812
5806 13321 23379 -51218 80516 -58124 -64802 39447 -17041 196152 -94267 -8867 -311581 136160
5793 174941 -100532 50811 93893 -212171 -50998 70996 70035 30111 -1478 197343 -36073 -242658
5781 -242658 -176341 52100 -35438 -291645 -77295 -260102 -7254 168161 -83128 47901 21606
5769 -13411 54141 86801 139491 122693 -76831 -125723 104443 -108883 -169422 -134239 125350
5757 -65101 -212207 -247981 -313312 -169769 176342 187704 120638 -63795 23812 59073 264393
5746 264393 78591 103512 -225701 2884 29447 -233072 -156230 -26410 -238231 -149500 21516
5734 -243646 504611 26688 -67256 71012 142790 113130 -171968 -400126 155977 -359649 53142
5722 311972 -252652 -113174 -223355 316559 -239359 -54098 -101459 82486 -289791 142413
5711 269489 -199705 -141820 37493 186880 -248773 -162765 194397 -232759 -122283 333474
5700 -154052 -183050 176498 -120649 16280 21904 -216165 -121427 35532 -88201 147150 -31675
5688 149650 -33783 73984 17175 -219999 -175947 -218236 -317587 313063 -19096 -143102 20027
5676 -35448 69899 269854 244448 138968 185211 5233 -94328 89524 71963 193643 47328
5664 253961 18326 1589 -480641 66951 280769 218686 -6465 273469 15016 -298126 216037
5652 -227919 87335 163415 -77746 150808 119550 179676 -54157 -12183 -117888 -155912 -264657
5641 -264657 -105689 -17620 -99375 -6967 72078 -187202 67372 172430 -23015 59555 -99980
5629 -362770 236063 203586 290222 158994 23720 -96729 272244 -47695 -377966 -21187 -127542
5618 -127542 -64049 -9388 -15986 64514 -196409 200654 -20102 -237559 319204 -4862 225807
5606 -96813 44398 21647 188960 97957 -48735 -44561 135944 151437 -122136 56138 67806
5595 67806 165780 -224646 -35281 9567 10208 -172623 154967 -330398 -77219 -377871 -45134
5583 97080 -30479 253495 -60473 79285 -118700 217828 436566 -27334 -35358 -182945 206057
5571 -210020 298204 -109113 -219453 -263798 74428 -159069 3054 11641 -53415 37411 106815
5560 106815 277426 -64721 184358 55828 344603 -7537 -283787 327644 502237 -287380
5549 410682 -57842 17374 83439 -103686 -48623 156856 56779 -147524 -132772 70974 -213605
5537 202590 -7583 -235929 -26407 -134430 230737 -90508 -420029 144606 -63705 -310955 148030
5525 69648 -244096 101362 -279465 -40161 -10109 256046 -49963 -25521 227261 -95100 -217915
5514 -217915 -33773 -10706 21992 -26343 -145096 -206446 -14287 77823 -189435 218837 280377
5503 280377 -11848 261752 -19337 -186534 -394051 15571 147135 57273 -207167 26850 -282842
5491 -46064 -96442 36730 -49828 51598 261920 206333 53600 -394980 158693 50859 147690
5480 147690 178033 -2559 57966 -43633 -135480 -34073 150761 -303639 -21570 219423 142370
5469 142370 -95863 111166 208647 162686 241922 -27824 -137909 -115017 -124986 -213645 16058
5457 -249768 11246 6159 -68509 30126 56189 -20187 427410 40668 129696 -10305 -41712 -9701
5444 -194884 142192 131501 -146787 106873 -159377 302196 -56235 -333457 23183 125996
5434 125996 114921 -38346 138305 128064 -80127 128476 -97890 -166664 -402407 -151863 -181586
5423 -181586 -231200 10757 -43451 -112857 118040 -266900 60668 78991 197692 -365309 587806
5411 42874 128170 54665 194332 -158865 -227786 -73892 23476 75756 41503 -94306 -162469
5400 -162469 -259195 351820 -277270 15594 124313 137280 243017 35626 168894 -17172 157348
5388 -20667 148289 -107990 256948 181360 -261259 71167 -272242 -123769 -250364 -41013
5377 77604 -128357 279330 -83201 -9786 124698 42228 -137837 -4805 -156431 -8583 -200214
5366 -200214 68477 291873 -86073 32184 98624 23174 -345207 127974 68818 99092 116738
5355 116738 -49113 62274 297109 334564 62020 53891 327618 121483 171110 -172100 129049
5343 -105146 177425 -21410 -107421 245114 -222280 -78751 -139101 490239 39781 54565 184857
5332 184857 26750 -203577 -38247 201823 -140356 6324 2116 226161 -39105 -138041 6232
5320 -86126 -134404 -62348 70736 -27189 96830 -209148 -146857 -116309 -223632 -105034 475144
5308 95838 -16392 542294 -31031 -196344 118449 33492 118281 141711 -86822 97655 83866
5297 83866 -239398 -218752 204822 65235 -176635 121368 126840 100003 -139993 -177873 175426
5285 3376 -280052 -227889 -19604 356533 -70018 260798 158668 -4902 160184 -277273 -379162
5274 -379162 20855 -86778 126642 231129 19044 91291 -315745 -109802 -85667 -75532 56842
5262 -78802 -454092 108157 200922 20564 475407 -91522 72618 -363507 -122696 96554 147957
5251 147957 -95303 -49474 -127796 48650 -295843 397945 -59895 -144121 12562 251419 16150
5239 -148993 -184889 -94772 -104923 143258 67341 -209733 -275117 -50381 -133206 171257 -91987
5227 -43606 87504 -74457 -157566 158094 -189907 183388 202324 -216746 74980 52147 -174828
5215 344808 -177684 310221 105061 -53582 204145 -246775 167998 -146597 -51801 -84551
5205 -84551 118597 -299467 -108513 21625 1122 217172 12789 -154601 -126786 -328849 184094
5193 75489 136137 106317 189432 61644 309070 158208 94246 64554 -8241 -296726 515036
5181 -196250 -49698 74449 -184085 -270047 -110645 410315 -230273 127755 72157 40700 -48903
5169 62070 -176058 -33567 222068 187343 -138854 12328 265121 132338 45377 1571 -128650
5157 231464 -206811 -58070 -181221 -257582 -193573 -123552 230426 -223971 -266043 53455 -24507
5145 184686 186629 57518 8727 76855 -353320 202705 164289 -160251 162475 299598 -67954
5133 13639 -133574 -163698 187366 -55617 -27294 219614 -67529 -328459 319162 -51574 56613
5121 189449 146336 3025 -104681 -65657 27399 -46156 -336464 -70925 360868 -206744 198373
5109 32615 -5708 114443 -109247 -118261 -93553 144246 100249 -113000 240 119186 121164 -126095
5096 205184 -279033 -90015 96253 -49512 -18163 -266839 70098 -315307 -494795 51418 317124
5085 317124 -42819 -25107 89270 290650 301230 4387 -31253 317060 56463 -30322 382835
5073 384592 -151802 -116570 337829 -155282 237013 25782 -80037 171128 89663 -62733 -138155
5062 -138155 147121 142908 -154492 -90503 488802 123071 166376 315728 -493507 100829
5051 -375627 18168 36840 189154 -70342 -77072 48875 108949 -27970 173182 469349 -80850
5039 -69362 204561 122773 -11608 -19147 -219802 -101620 29174 -83367 282236 266851 -189734
5027 199493 -67890 -225311 -267599 -64346 -298776 115616 -146579 -57978 169113 110552 7069
5015 -67012 108588 -3307 -79400 -61126 -24843 56488 -40210 164721 -13380 4372 -1614 -4634
5003 -4634 -59222 -6509 40532 204133 59154 -77204 -84956 79564 202997 11095 -176394 -142387
4991 -142387 -143349 -84237 8665 242306 248192 181651 47474 77982 9843 -164925 136411 47777
4978 -82722 -111484 196595 109847 -39214 -174594 -38612 243420 83981 -195868 -151261 -200550
4967 -200550 195880 -2433 103883 -355590 227844 28032 245034 82079 60525 -236228 -13532
4955 -181298 -613058 -95453 -266486 170515 223120 -334545 195163 -200281 -71578 14855
4944 -385499 -90669 69832 -380351 -28471 -137781 351638 218876 119076 18566 151407 -10594
4932 -96634 -218373 196296 -9659 98645 -283103 -392733 -48562 -311457 118440 -6301 1777
4920 -407885 -10668 124029 161836 79196 125810 -104502 -1284 134217 380837 -62886 -344953
4909 -344953 202083 -34449 48880 159799 27317 -319672 48845 -416130 163384 75406 204190
4898 204190 231267 -190305 -115674 -217702 257072 -67413 26086 72063 78626 126003 -109676
4886 -248408 223838 -89851 197041 235188 -279088 87466 -109761 236248 146144 -23185 -153122
4875 -153122 -79516 -47924 48461 -272630 -74106 -34384 -211247 50793 -616 -251436 -157572
4864 -157572 -35975 167063 -370700 264370 -158757 -30733 195507 -15476 -82939 -75858 -40114
4853 -40114 34365 120009 143912 -348373 -43985 -451700 -25436 -154208 13498 -96684 -64017
4842 -64017 -4211 -92187 155898 234180 63453 -170990 26906 27541 -119340 -36277 290917 180896
4830 180896 277218 188139 20233 83091 148771 -10587 -187724 54231 5390 91487 -268465
4818 290729 -226805 218549 -73238 -126460 -88015 -114085 202235 -193243 -66195 101450 -254926
4806 -206502 -102209 354685 60171 -130847 -89137 -101961 82553 73732 110805 -226430 53143
4794 134263 -121022 350579 -151539 201808 14499 12698 52647 -76318 43776 -128755 -10882
4782 -213639 -171798 11756 -66785 131984 -4745 57940 -78559 -132035 -65908 -333246 246920
4770 223837 232177 92631 -119700 -8436 -354954 -6399 -67592 -40759 -54163 114260 207949 -2008
4757 -69125 154598 -20405 169639 5770 -223634 117058 -92277 -8377 -67619 -165538 -116692
4746 -116692 -150374 -262801 -69734 99754 -167924 164262 -61970 280335 33569 75029 -165962
4734 142531 -146624 -79518 194056 237117 63309 -120993 262592 -49848 175872 -928 -50005
4723 -50005 14130 174988 -83702 -60193 285306 236233 208712 151306 -34469 -226582 -228477
4712 -228477 -211296 -41932 31563 -417837 -90547 17266 137071 384051 -261480 98827 78458
4701 78458 -55956 -327890 -279693 138806 214968 -409004 344957 159838 -58729 3687 -49066
4689 -258048 -384167 -80227 -234735 249188 23977 153804 -31342 -70321 -134616 37341 -58858
4677 282599 405981 134441 -227065 -125702 221846 209088 -215079 133485 -204169 360028
4666 119666 63330 -2924 172183 120491 -24342 -99159 192233 -94124 -34906 388843 21680
4654 -26290 -249187 45144 -36188 -240260 -1117 40389 -15599 -121578 -47649 9870 -111447
4642 33702 47735 -76715 10568 -25565 -70253 203872 -35699 109974 243028 210074 185849
4631 185849 182429 -230290 35867 55686 177969 187607 36669 -56004 -379587 -132948 59000
4619 -107915 -91641 119481 -244802 -23428 -45278 -74418 -162536 115089 -79098 -75231 -131467
4608 -131467 34972 178777 64363 -79804 -100177 -179350 -33721 65466 -74615 162396 243055
4597 243055 59307 -4515 462988 -101374 -115687 44486 -321035 146698 99052 187406 -79802
4585 96837 -124820 343405 150517 149643 376345 46759 200618 -199015 22478 -68257 85735
4573 139193 64053 -41290 -34811 -66174 162530 26169 -139588 -19375 -85713 48888 -150731
4561 -63305 -171227 11034 169339 -74197 197048 -76397 -94164 -8207 22520 139120 30392
4549 -48407 -42035 -280207 339772 169566 200312 -118508 -21085 10469 -131404 198347 178268
4538 178268 -25904 -209342 -259610 -30813 -352328 -70098 -117543 194987 43363 -42096 95051
4526 9670 182381 122574 100117 -299781 165362 73363 23944 4457 -111622 92224 146350
4515 146350 357628 50996 223533 310270 -136060 -2273 -66552 83514 22416 14803 142208
4504 142208 -67910 161076 83974 -192121 -448957 148095 159983 44708 8975 -104481 202985
4492 -154627 -82878 -196514 278383 62691 -267566 124489 -6716 -37206 273945 -294421 279580
$$ [...]
##END NTUPLES=NMR SPECTRUM
##END=
