##TITLE=AC1478_ZPERCUS304_8101089_t9cD9gReun
##JCAMPDX= 6.0         $$ Bruker NMR JCAMP-DX V2.0
##DATA TYPE= NMR SPECTRUM
##DATA CLASS= NTUPLES
##ORIGIN= BRUKER
##OWNER= Administrator
$$ 1.72 TOPSPIN		Version 2.1
$$ 2013-07-31 18:13:11.971 -0700  Administrator@X
$$ Compression mode = diff/dup
##.OBSERVE FREQUENCY= 400.02188249412
##.OBSERVE NUCLEUS= ^1H
##.ACQUISITION MODE= SIMULTANEOUS (DQD)
##.ACQUISITION SCHEME= undefined
##.AVERAGES= 64
##.DIGITISER RES= 22
##SPECTROMETER/DATA SYSTEM= spect
##.PULSE SEQUENCE= noesygpps1d.comp
##.SOLVENT NAME= COFFEE_meoh
##.SHIFT REFERENCE= INTERNAL, COFFEE_meoh, 1, 14.96105
##AUDIT TRAIL= $$ (NUMBER, WHEN, WHO, WHERE, PROCESS, VERSION, WHAT)
$$ ##TITLE= Audit trail, TOPSPIN		Version 2.1
$$ ##JCAMPDX= 5.01
$$ ##ORIGIN= Bruker BioSpin GmbH
$$ ##OWNER= Administrator
$$ $$ E:\/data/COFFEE/nmr/AC1478_ZPERCUS304_8101089_t9cD9gReun/12/pdata/1/auditp.txt
$$ ##AUDIT TRAIL=  $$ (NUMBER, WHEN, WHO, WHERE, PROCESS, VERSION, WHAT)
(   1,<2013-07-31 18:13:07.049 -0700>,<Administrator>,<X>,<go>,<TOPSPIN 2.1>,
      <created by zg
	started at 2013-07-31 18:01:37.659 -0700,
	POWCHK enabled, PULCHK disabled,
       configuration hash MD5:
       C8 4E 4E 5D D3 5C D8 9E 9F 52 82 E0 59 8A DE 15
       data hash MD5: 64K
       55 35 1E DC D1 42 6B F3 36 BD D2 68 A1 0F 49 41>)
(   2,<2013-07-31 18:13:10.065 -0700>,<Administrator>,<X>,<proc1d>,<TOPSPIN 2.1>,
      <Start of raw data processing
       efp LB = 0.3 FT_mod = 6 PKNL = 1 PHC0 = 0 PHC1 = 0 SI = 128K 
       data hash MD5: 128K
       F5 F5 AC 5F 67 84 7B 7F 68 1A 2A 58 AC E6 04 BB>)
(   3,<2013-07-31 18:13:10.987 -0700>,<Administrator>,<X>,<proc1d>,<TOPSPIN 2.1>,
      <pk PHC0 = -78.71704 PHC1 = 0 
       data hash MD5: 128K
       8F F2 40 D4 0E 42 85 63 D6 46 2E 29 A7 3D 30 DC>)
(   4,<2013-07-31 18:13:11.409 -0700>,<Administrator>,<X>,<proc1d>,<TOPSPIN 2.1>,
      <abs ABSG = 1 
       data hash MD5: 128K
       A7 4D 23 EA F9 96 8B 1D F4 2C 6F 47 1C 11 A3 6A>)
(   5,<2013-07-31 18:13:11.518 -0700>,<Administrator>,<X>,<proc1d>,<TOPSPIN 2.1>,
      <abs ABSG = 2 
       data hash MD5: 128K
       31 8B 85 5A 87 F6 71 C4 6A 7C EF 8B 89 65 DB E6>)
(   6,<2013-07-31 18:13:11.628 -0700>,<Administrator>,<X>,<proc1d>,<TOPSPIN 2.1>,
      <abs ABSG = 3 
       data hash MD5: 128K
       4A 09 AC F1 BD 32 A5 1D 8E BE DF 9D C8 37 8A C1>)
(   7,<2013-07-31 18:13:11.737 -0700>,<Administrator>,<X>,<proc1d>,<TOPSPIN 2.1>,
      <abs ABSG = 4 
       data hash MD5: 128K
       58 2B F1 F7 6D AE A4 09 24 08 8C 46 81 16 C7 08>)
(   8,<2013-07-31 18:13:11.815 -0700>,<Administrator>,<X>,<proc1d>,<TOPSPIN 2.1>,
      <abs ABSG = 5 
       data hash MD5: 128K
       9C BA F3 10 9F A6 64 63 F4 DF CE E5 D0 32 D0 3D>)
$$ ##END=
$$ 
$$ $$ hash MD5
$$ $$ 3C 0A 78 E6 F4 DF 7B E5 AA 03 F8 BB 5A 9A 04 BC
##$RELAX= 
##$RELAX= 
##$RELAX= 
##$RELAX= 
##$RELAX= 
##$RELAX= 
##$RELAX= 
##$RELAX= 
$$ Bruker specific parameters
$$ --------------------------
##$DU= <E:\>
##$EXPNO= 12
$$ [...]
##$TP07= 0
##$TPNAME0= <>
##$TPNAME1= <>
##$TPNAME2= <>
##$TPNAME3= <>
##$TPNAME4= <>
##$TPNAME5= <>
##$TPNAME6= <>
##$TPNAME7= <>
##$TPOAL= (0..7)
0.5 0.5 0.5 0.5 0.5 0.5 0.5 0.5
##$TPOFFS= (0..7)
0 0 0 0 0 0 0 0
##$TUNHIN= 0
##$TUNHOUT= 0
##$TUNXOUT= 0
##$USERA1= <user>
##$USERA2= <user>
##$USERA3= <user>
##$USERA4= <user>
##$USERA5= <user>
##$V9= 5
##$VALIST= <valist>
##$VCLIST= <CCCCCCCCCCCCCCC>
##$VD= 0
##$VDLIST= <DDDDDDDDDDDDDDD>
##$VPLIST= <PPPPPPPPPPPPPPP>
##$VTLIST= <TTTTTTTTTTTTTTT>
##$WBST= 2048
##$WBSW= 25
##$XGAIN= (0..3)
0 0 0 0
##$XL= 0
##$YL= 0
##$YMAX_a= 6112683
##$YMIN_a= -13561735
##$ZGOPTNS= <>
##$ZL1= 120
##$ZL2= 120
##$ZL3= 120
##$ZL4= 120
##$ABSF1= 14.96105
##$ABSF2= -5.597132
##$ABSG= 5
##$ABSL= 3
##$ALPHA= 0
##$AQORDER= 0
##$ASSFAC= 0
##$ASSFACI= 0
##$ASSFACX= 0
##$ASSWID= 0
##$AUNMP= <proc_prof1d_extract.lims>
##$AXLEFT= 0
##$AXNAME= <>
##$AXNUC= <1H>
##$AXRIGHT= 0
##$AXTYPE= 0
##$AXUNIT= <>
##$AZFE= 0.1
##$AZFW= 0.1
##$BCFW= 0
##$BC_mod= 0
##$BYTORDP= 0
##$COROFFS= 0
##$CY= 15
##$DATMOD= 1
##$DC= 0
##$DFILT= <>
##$DTYPP= 0
##$F1P= 0
##$F2P= 0
##$FCOR= 0.5
##$FTSIZE= 131072
##$FT_mod= 6
##$GAMMA= 0
##$GB= 0
##$INTBC= 1
##$INTSCL= 1
##$ISEN= 128
##$LB= 0.3
##$LEV0= 0
##$LPBIN= 0
##$MAXI= 10000
##$MC2= 0
##$MEAN= 0
##$ME_mod= 0
##$MI= 0
##$NCOEF= 0
##$NC_proc= -2
##$NLEV= 6
##$NOISF1= 0
##$NOISF2= 0
##$NSP= 0
##$NTH_PI= 0
##$NZP= 0
##$OFFSET= 14.96105
##$PC= 1
##$PHC0= -78.71704
##$PHC1= 0
##$PH_mod= 1
##$PKNL= yes
##$PPARMOD= 0
##$PPDIAG= 0
##$PPIPTYP= 0
##$PPMPNUM= 2147483647
##$PPRESOL= 1
##$PSCAL= 4
##$PSIGN= 0
##$PYNMP= <proc.py>
##$REVERSE= no
##$SF= 400.020009615657
##$SI= 131072
##$SIGF1= 0
##$SIGF2= 0
##$SINO= 400
##$SIOLD= 131072
##$SPECTYP= <>
##$SREGLST= <1H.CDCl3>
##$SSB= 0
##$STSI= 131072
##$STSR= 0
##$SW_p= 8223.68421052631
##$SYMM= 0
##$S_DEV= 0
##$TDeff= 65536
##$TDoff= 0
##$TI= <>
##$TILT= no
##$TM1= 0
##$TM2= 0
##$TOPLEV= 0
##$USERP1= <user>
##$USERP2= <user>
##$USERP3= <user>
##$USERP4= <user>
##$USERP5= <user>
##$WDW= 1
##$XDIM= 131072
##$YMAX_p= 404791052
##$YMIN_p= -11356
##$CURPLOT= <Network HP LaserJet P1505>
##$CURPRIN= <$Network HP LaserJet P1505>
##$DFORMAT= <normdp>
##$LAYOUT= <+/1D_H.xwp>
##$LFORMAT= <normlp>
##$PFORMAT= <normpl>
##$SURQMSG= 1
$$ End of Bruker specific parameters
$$ ---------------------------------
##NTUPLES= NMR SPECTRUM
##VAR_NAME=  FREQUENCY,     SPECTRUM/REAL,   SPECTRUM/IMAG
##SYMBOL=    X,             R,               I
##VAR_TYPE=  INDEPENDENT,   DEPENDENT,       DEPENDENT
##VAR_FORM=  AFFN,          ASDF,            ASDF
##VAR_DIM=   131072,        131072,          131072
##UNITS=     HZ,            ARBITRARY UNITS, ARBITRARY UNITS
##FACTOR=    0.0627417313425164, 1,          1
##FIRST=     8223.62146879497, 763,          -63771
##LAST=      0,             2119,            -64014
##MIN=       0,             -11356,          0
##MAX=       8223.62146879497, 404791052,    0
$$ Real data points
##PAGE= N=1
##DATA TABLE= (X++(R..R)), XYDATA
$$ [...]
61637D88515K97L38L49N53P02K06j042k581l989n043n346m550l104k090k080k607
$$ 488515 488812 489150 489499 490052 490754 490960 489918 487337 483348 478305 472959 468409 465305 463215 461135 458528
61621D58528k887k608j868r57l78n22j101j387j139q24p67p46p18j212k498l983
$$ 458528 455641 453033 451165 450208 449830 449308 448207 446820 445681 444857 444090 443344 442626 441414 438916 434933
61605D34933m924n349n693o009o143o347o942p554p325n949m052k479j603j334
$$ 434933 430009 424660 418967 412958 406815 400468 393526 385972 378647 372698 368646 366167 364564 363230
61591C63230j460j835k432l221m012m498m560m362m047l557k916k394k153j975
$$ 363230 361770 359935 357503 354282 350270 345772 341212 336850 332803 329246 326330 323936 321783 319808
61577C19808j625j333j566k419l414l887l461k332j129l97j35j3K8k33o92q55
$$ 319808 318183 316850 315284 312865 309451 305564 302103 299771 298642 298245 298110 298097 298125 297892 297200 296345
61561B96345n35j60r5j20O5K80K19L0M2K12L44N46R90J359J203O76M12O15Q48
$$ 296345 295810 295650 295555 295435 295500 295780 295999 296029 296071 296283 296627 297173 298163 299522 300725 301401 301813 302428 303276
61542C03276P65N41M63N16O23R16J412J759J639J302J345J921K473K344J481K87
$$ 303276 304041 304582 305045 305561 306184 307100 308512 310271 311910 313212 314557 316478 318951 321295 322776 323063
61526C23063r61k151k900k678j697j121j773k925l121k116j186j331k008k068
$$ 323063 322102 319951 317051 314373 312676 311555 309782 306857 303736 301620 300434 299103 297095 295027
61512B95027j309m73j03l9P4L15N14M81K00q8j23k9k30q20j358j475j282r88n09
$$ 295027 293718 293245 293142 293103 293177 293492 294006 294487 294687 294599 294476 294447 294217 293397 292039 290564 289282 288294 287785
61493B87785J58N26J43o71j096p45J7O05P20L92o6j75L63J339K209K590K517K248
$$ 287785 287943 288469 288612 287941 286845 286100 286117 286722 287442 287834 287768 287593 287956 289295 291504 294094 296611 298859
61475B98859K024J929J904J880J862J780J351L87p58j384j180m94J35M24L33L5
$$ 298859 300883 302812 304716 306596 308458 310238 311589 311976 311218 309834 308654 308160 308295 308719 309052 309087
61459C09087l6M23J092J297R07M08O2l89r52j076m64L83R12J213J545J695J375
$$ 309087 309051 309474 310566 311863 312770 313178 313240 312851 311899 310823 310359 310742 311654 312867 314412 316107 317482
61442C17482P91L20mj73J36J036K008K565K950L525L936L611K802K275K185J985
$$ 317482 318273 318593 318589 318416 318552 319588 321596 324161 327111 330636 334572 338183 340985 343260 345445 347430
61426C47430J485J213J582K239K472J987J210R28J534K546L127L113L046L103
$$ 347430 348915 350128 351710 353949 356421 358408 359618 360546 362080 364626 367753 370866 373912 377015
61412C77015K747J751Q06M71K66m42j320j700j777k153k634k568k141k160k654
$$ 377015 379762 381513 382319 382790 383056 382614 381294 379594 377817 375664 373030 370462 368321 366161 363507
61397C63507k741k009j027l78K0M14P17P61N29P7l56l78m3m6o84j030j54J267
$$ 363507 360766 358757 357730 357352 357372 357786 358503 359264 359793 359870 359514 359136 359093 359047 358363 357333 357179 358446
61379C58446J748J194R54J655K325K062J344J039J177J311J307J184Q64O47J209
$$ 358446 360194 361388 362342 363997 366322 368384 369728 370767 371944 373255 374562 375746 376610 377257 378466
61364C78466K597L835M017L258K198J242P15J025K093L149L704M202N216O453
$$ 378466 381063 384898 388915 392173 394371 395613 396328 397353 399446 402595 406299 410501 415717 422170
61350D22170P206P343P260P276P537Q179R037R497R145Q299P482O706N746M754
$$ 422170 429376 436719 443979 451255 458792 466971 476008 485505 494650 502949 510431 517137 522883 527637
61336E27637M072L677L322K957K559J800M74r38j758k092k715l882m833m767l883
$$ 527637 531709 535386 538708 541665 544224 546024 546498 545560 543802 541710 538995 535113 530280 525513 521630
61321E21630l108k939k951k462j420l32N14J375K479L514M044M175M416N000N788
$$ 521630 518522 515583 512632 510170 508750 508418 508932 510307 512786 516300 520344 524519 528935 533935 539723
61306E39723O653P581Q439R126R836J0734J1494J1643J1241J0552R249O753L394
$$ 539723 546376 553957 562396 571522 581358 592092 603586 615229 626470 637022 646271 653024 656418
61293F56418L84j625l113m545n575n842n844o220o766o853o481o194o114n740
$$ 656418 656802 655177 652064 647519 641944 636102 630258 624038 617272 610419 603938 597744 591630 585890
61279E85890m730l438k521k258k256j819o39Q30J846K195K355K896M010N497O776
$$ 585890 581160 577722 575201 572943 570687 568868 568229 569059 570905 573100 575455 578351 582361 587858 594634
61264E94634P080O210N046M695N156N492N375N567O649Q144R235R647R394Q442
$$ 594634 601714 607924 612970 617665 622821 628313 633688 639255 645904 654048 663283 672930 682324 690766
61250F90766P072N832M683K922M69j634k705l494m894o352o721o163o013o877
$$ 690766 697838 703670 708353 711275 711744 710110 707405 703911 699017 692665 685944 679781 673768 666891
61236F66891p967q242p385n642l587k063j544j504j040j22N66R16J578K791L984
$$ 666891 658924 650682 643297 637655 634068 632005 630461 628957 627917 627795 628361 629277 630855 633646 637630
61221F37630M840N791O994P664P162O164N898O535P080O797O061N695N950O374
$$ 637630 642470 648261 655255 662919 670081 676245 682143 688678 695758 702555 708616 714311 720261 726635
61207G26635O360N678M630L859L812M276M616M570M663N534P082Q651J0057J1868
$$ 726635 732995 738673 743303 747162 750974 755250 759866 764436 769099 774633 781715 790366 800423 812291
61193H12291J4464J7176J8883J9256J9012J8931J9007J8620J7201J4704J1659
$$ 812291 826755 843931 862814 882070 901082 920013 939020 957640 974841 989545 1001204
61182A001204Q831O604M794L205K110J775J721J017o70k794m733o329p620q572
$$ 1001204 1010035 1016639 1021433 1024638 1026748 1028523 1030244 1031261 1030591 1027797 1023064 1016735 1009115 1000543
61168A000543r305j0155j1295j2654j4205j5909j7315j7927j8057j8624j9786
$$ 1000543 991238 981083 969788 957134 942929 927020 909705 891778 873721 855097 835311
61157H35311k0496j9819j8136j6507j5341j4272j2977j1463r747p775n664l674
$$ 835311 814815 794996 776860 760353 745012 730740 717763 706300 696553 688778 683114 679440
61145F79440k007q26l41o21j512k838m426n876o687o730o334n705m708l334j937
$$ 679440 677433 676607 676266 675645 674133 671295 666869 660993 654306 647576 641242 635537 630829 627495 625558
61130F25558o74P34K453M137N493O805Q546J0769J3255J5898J8590K1026K2936
$$ 625558 624884 625618 628071 632208 637701 644506 653052 663821 677076 692974 711564 732590 755526
61117G55526K4400K5680K7045K8774L0893L2796L3688L3600L3388L3482L3253
$$ 755526 779926 805606 832651 861425 892318 925114 958802 992402 1025790 1059272 1092525
61106A092525L2034L0081K8029K5870K3160J9817J6135J2337Q525M819J190k627
$$ 1092525 1124559 1154640 1182669 1208539 1231699 1251516 1267651 1279988 1288513 1293332 1294522 1291895
61094A291895o687j0725j4667j8797k3095k6938k9746l1452l2111l1743l0870
$$ 1291895 1285208 1274483 1259816 1241019 1217924 1190986 1161240 1129788 1097677 1065934 1035064
61083A035064l0446l0703l0715k9594k7486k5004k2529k0567j9782j9909j9537
$$ 1035064 1004618 973915 943200 913606 886120 861116 838587 818020 798238 778329 758792
61072G58792j7823j5600j3817j1933r067n958m193l917l795l041k052j079L44
$$ 758792 740969 725369 711552 699619 690552 684594 680401 676484 672689 669648 667596 666517 666861
61059F66861K382M420N859O628O835O740P052Q298R948J1069J1809J3237J5620
$$ 666861 669243 673663 679522 686150 692985 699725 706777 715075 725023 736092 747901 761138 776758
61046G76758J7940J9414K0532K2148K4235K6120K7449K8472K9664L1261L3016
$$ 776758 794698 814112 834644 856792 881027 907147 934596 963068 992732 1023993 1057009
61035A057009L4399L5260L6095L7353L8750L9772M0504M1468M2891M4706M6872
$$ 1057009 1091408 1126668 1162763 1200116 1238866 1278638 1319142 1360610 1403501 1448207 1495079
61024A495079M9207N1207N2686N4179N6135N8278O0525O3950O9869P8461Q9194
$$ 1495079 1544286 1595493 1648179 1702358 1758493 1816771 1877296 1941246 2011115 2089576 2178770
61013B178770J02147J17786J36010J56562J80199K08370K42213K82876L32077
$$ 2178770 2280917 2398703 2534713 2691275 2871474 3079844 3322057 3604933 3937010
61004C937010L91126M60109N39376O30575P34452Q49281R74297J112828J267920
$$ 3937010 4328136 4788245 5327621 5958196 6692648 7541929 8516226 9629054 10896974
60995A0896974J436210J611102J787466J946821K028821J934390J590187J030113
$$ 10896974 12333184 13944286 15731752 17678573 19707394 21641784 23231971 24262084
60987B4262084M06701r5523l69159m18048l08194j15624P1569J35006l7758m69500
$$ 24262084 24668785 24573262 24204103 23786055 23477861 23362237 23433806 23568812 23531054 23061554
60977B3061554j050535j596601j960475k098626k053085j893591j679184j450903
$$ 23061554 22011019 20414418 18453943 16355317 14302232 12408641 10729457 9278554
60969I278554j234439j041323q73070p28491o06953n06502m23256l54025k97617
$$ 9278554 8044115 7002792 6129722 5401231 4794278 4287776 3864520 3510495 3212878
60960C212878k52959k17780j89694j67180j48941j33457j19623j07062r5552q4855
$$ 3212878 2959919 2742139 2552445 2385265 2236324 2102867 1983244 1876182 1780630 1695775
60950A695775p5091o6568n9183n2590m6956m2899m0728m0061m0080l9842l8711
$$ 1695775 1620684 1554116 1494933 1442343 1395387 1352488 1311760 1271699 1231619 1191777 1153066
60939A153066l6853l4968l3265l1296k9075k7418k6618k5767k4188k2555k1532
$$ 1153066 1116213 1081245 1047980 1016684 987609 960191 933573 907806 883618 861063 839531
60928H39531k0311j7855j4894j3168j3014j3128j2577j1598j0471q989p327o233
$$ 839531 819220 801365 786471 773303 760289 747161 734584 722986 712515 703526 696199 689966
60916F89966n974n937n595n075m615m222m043m341m851m832m000k874k108k000
$$ 689966 683992 678055 672460 667385 662770 658548 654505 650164 645313 640481 636481 633607 631499 629499
60902F29499k602l678m501m375l505k801k775l128l405l418l132k686k572l071
$$ 629499 626897 623219 618718 614343 610838 608037 605262 602134 598729 595311 592179 589493 586921 583850
60888E83850l570l122j760n65l05o70r78j004q70o64m22r7N24J481K351K737K960
$$ 583850 580280 577158 575398 574833 574528 573858 572880 571876 571006 570342 569920 569823 570347 571828 574179 576916 579876
60871E79876L604M544N151N422O039P178Q158Q499Q553Q684Q713Q601Q926J0088
$$ 579876 583480 588024 593175 598597 604636 611814 619972 628471 637024 645708 654421 663022 671948 682036
60857F82036J1559J2543J2949J3172J3268J2917J2040J1004J0358J0561J1687
$$ 682036 693595 706138 719087 732259 745527 758444 770484 781488 791846 802407 814094
60846H14094J3163J4113J4290J4331J4790J5329J5361J5046J5063J5596J6162
$$ 814094 827257 841370 855660 869991 884781 900110 915471 930517 945580 961176 977338
60835I77338J6493J6900J7680J8613J9307J9692J9935K0074J9977J9561J8790
$$ 977338 993831 1010731 1028411 1047024 1066331 1086023 1105958 1126032 1146009 1165570 1184360
60824A184360J7505J5445J2486Q729M364m42n441j0274j4688j8682k2280k5242
$$ 1184360 1201865 1217310 1229796 1238525 1242889 1242447 1237006 1226732 1212044 1193362 1171082 1145840
60812A145840k7329k8750k9999l1129l1545l0783k9210k7591k6182k4634k2688
$$ 1145840 1118511 1089761 1059762 1028633 997088 966305 937095 909504 883322 858688 836000
60801H36000k0595j8721j7102j5562j4087j2910j2212j1826j1347j0494r386q312
$$ 836000 815405 796684 779582 764020 749933 737023 724811 712985 701638 691144 681758 673446
60789F73446p343o362n406m754m639n046n813o620o977o592n888n654o092o574
$$ 673446 666103 659741 654335 649581 644942 639896 634083 627463 620486 613894 608006 602352 596260 589686
60775E89686o575o282o077n900n586n347n448n670n645n450n357n264m917m484
$$ 589686 583111 576829 570752 564852 559266 553919 548471 542801 537156 531706 526349 521085 516168 511684
60761E11684m364m531m610m524m534m690m752m618m439m291m125l978l806l304
$$ 511684 507320 502789 498179 493655 489121 484431 479679 475061 470622 466331 462206 458228 454422 451118
60747D51118k310j254p41p24p13o02p08r62q31j92L47K33m19j191j814k056j623
$$ 451118 448808 447554 446813 446089 445376 444774 444066 443104 442273 442081 442428 442661 442242 441051 439237 437181 435558
60730D35558n61N82J260J325Q45k3p54n88N43J605J424n2j798k931l460l871m374
$$ 435558 434997 435579 436839 438164 439009 438986 438232 437644 438187 439792 441216 441164 439366 436435 432975 429104 424730
60713D24730m734m669m258l912l990m462m963n155m931m332l431k362j410r78
$$ 424730 419996 415327 411069 407157 403167 398705 393742 388587 383656 379324 375893 373531 372121 371143
60699C71143j366k431l464l653k874j906j602j925k083j495l82O36J171J228R95
$$ 371143 369777 367346 363882 360229 357355 355449 353847 351922 349839 348344 347962 348598 349769 350997 351992
60684C51992O73M84O17J086J669K063K201K319K619L013L322L577L803L697L025
$$ 351992 352665 353149 353766 354852 356521 358584 360785 363104 365723 368736 372058 375635 379438 383135 386160
60669C86160K303K414L381M163L967L151K465K033J734J913K850L891M022L242
$$ 386160 388463 390877 394258 398421 402388 405539 408004 410037 411771 413684 416534 420425 424447 427689
60655D27689K563K681L349M064M592M730M279L551L251L528L642K862J357j59
$$ 427689 430252 432933 436282 440346 444938 449668 453947 457498 460749 464277 467919 470781 472138 471979
60641D71979j276k132l049m176n394o401p020p313p336o892n826m409l105k078
$$ 471979 470703 468571 465522 461346 455952 449551 442531 435218 427882 420990 415164 410755 407650 405572
60627D05572j324j054j385j831j756j341j430k240k931k760k029j460j200q98
$$ 405572 404248 403194 401809 399978 398222 396881 395451 393211 390280 387520 385491 384031 382831 381933
60613C81933n26m65q68j348j380q70k23N4j03k41J12Q78J527J644J234N77O0K6
$$ 381933 381407 380942 380074 378726 377346 376476 376253 376307 376204 375963 376075 376953 378480 380124 381358 381935 381995 382021
60595C82021N19J160J559J759K010K300K386K187J789J227O52N11R39J216M94
$$ 382021 382540 383700 385259 387018 389028 391328 393714 395901 397690 398917 399569 400080 401019 402235 402729
60580D02729q90j585q91M11J207J358J536K157K977L562L832M196N236P003Q732
$$ 402729 401839 400254 399363 399774 400981 402339 403875 406032 409009 412571 416403 420599 425835 432838 441570
60565D41570R574R595R620J0120J0754J1006J0701R733P968N651L387J380p57
$$ 441570 451144 460739 470359 480479 491233 502239 512940 522673 530641 536292 539679 541059 540302
60552E40302l150n155o103o087n617m866l733k304p91P50K296L702M940O258P779
$$ 540302 537152 531997 525894 519807 514190 509324 505591 503287 502496 503246 505542 509244 514184 520442 528221
60537E28221R274J0561J1748J2759J3007J2061J0335Q589P000N159K885M96j611
$$ 528221 537495 548056 559804 572563 585570 597631 607966 616555 623555 628714 631599 632095 630484
60524F30484l269m377m767m359l291j968j026r47j509j909j706j332j327j378
$$ 630484 627215 622838 618071 613712 610421 608453 607427 606480 604971 603062 601356 600024 598697 597319
60510E97319p04Q00K324L150L444L936N184P182R480J1594J3469J5557J8250K1388
$$ 597319 596615 597415 599739 602889 606333 610269 615453 622635 632115 643709 657178 672735 690985 712373
60496G12373K4568K7832L1560L5651L9228M1455M2359M2550M2167M0382L6016
$$ 712373 736941 764773 796333 831984 871212 912667 955026 997576 1039743 1080125 1116141
60485A116141K8587J8761P728l778j5697k7721l8503m6279n0434n1964n2068n0753
$$ 1116141 1144728 1163489 1171217 1167439 1151742 1124021 1085518 1039239 988805 936841 884773 834020
60473H34020m7396m2396l7376l3462l0178k6556k2740j9701j7722j6089j4249
$$ 834020 786624 744228 706852 673390 643212 616656 593916 574215 556493 540404 526155
60462E26155j2334j0483q526o717n854o114o476o008n051m496m456m527m766n293
$$ 526155 513821 503338 494812 488095 482241 476127 469651 463643 458592 454096 449640 445113 440347 435054
60448D35054n384m183k260j249j744k671k967k775k492j835o43K59K3q57j106
$$ 435054 429670 425487 423227 421978 420234 417563 414596 411821 409329 407494 406851 407110 407133 406276 405170
60433D05170l68M45M87p7n36n21j91J20K33J87R3o0l43o92q85p90m50R3Q49J661
$$ 405170 404802 405247 405734 405657 405121 404600 404409 404529 404762 404949 405042 404982 404639 403947 403062 402272 401822 401915 402764 404425
60413D04425K155K012J294M05j61j40K84O55P98R70J355J648J551J314J322J369
$$ 404425 406580 408592 409886 410291 410130 409990 410274 410929 411727 412697 414052 415700 417251 418565 419887 421256
60397D21256R50J85k16P3O34J007J073Q33L87K61J029K402L331L227K505J766
$$ 421256 422206 422391 422175 422248 422882 423889 424962 425795 426182 426443 427472 429874 433205 436432 438937 440703
60381D40703J124O17N91J176J889K180J991J569J158J086J541K083J964J220Q07
$$ 440703 441827 442444 443035 444211 446100 448280 450271 451840 452998 454084 455625 457708 459672 460892 461699
60366D61699J227J745J479O09j06m44o45o70k14P12J819K898L768M115L845L326
$$ 461699 462926 464671 466150 466759 466653 466209 465564 464894 464680 465392 467211 470109 473877 477992 481837 485163
60350D85163K962K801K885L538M822O141O817O812O447N840M970L972K886J517
$$ 485163 488125 490926 493811 497349 502171 508312 515129 521941 528388 534228 539198 543170 546056 547573
60336E47573j05j550k676l952n563o785o813n840m643l617k863k680l083l241
$$ 547573 547468 545918 543242 539290 533727 526942 520129 514289 509646 506029 503166 500486 497403 494162
60322D94162k361q96m8j62n18n58m33l21q9K44M60P57J660L161M593N609O634
$$ 494162 491801 490905 490857 490695 490177 489619 489186 488865 488776 489020 489480 490237 491897 495058 499651 505260 511894
60305E11894Q107R765J1135J2250J3577J5389J7483J9279K0039J9247J6942J3618
$$ 511894 520001 529766 540901 553151 566728 582117 599600 618879 638918 658165 675107 688725
60293F88725R685N193O3n520j1002j5613j8684j9934j9442j7497j4625j1727r662
$$ 688725 698410 703603 703666 698146 687144 671531 652847 632913 613471 595974 581349 569622 559960
60280E59960q569p935p480p444p781p745o832n622n034n071n016m582m173m072
$$ 559960 551391 543456 535976 528532 520751 513006 506174 500552 495518 490447 485431 480849 476676 472604
60266D72604m081l930l530k821j884j107p96o98l96J6J24q7k60l03l62k45M80
$$ 472604 468523 464593 461063 458242 456358 455251 454455 453757 453361 453377 453501 453414 453154 452851 452489 452244 452724
60249D52724J693K606K572J686N12l01k76N16J271J127J36q35j131q23k41M20
$$ 452724 454417 457023 459595 461281 461793 461492 461216 461732 463003 464130 464266 463431 462300 461477 461236 461656
60233D61656R35J062Q93Q75J263J848K312K634K999L540M138M368L817K688J830
$$ 461656 462591 463653 464546 465421 466684 468532 470844 473478 476477 480017 484155 488523 492340 495028 496858
60218D96858J824K269K419K293K553L460M551N359N887O265O450O363N973N263
$$ 496858 498682 500951 503370 505663 508216 511676 516227 521586 527473 533738 540188 546551 552524 557787
60204E57787M424L962M164M610M721M616M844N342N369M558L392K434J696R44
$$ 557787 562211 566173 570337 574947 579668 584284 589128 594470 599839 604397 607789 610223 611919 612863
60190F12863J40o59j434k153k817l526m142m114l264k567l224m896n848n186l994
$$ 612863 613003 612344 610910 608757 605940 602414 598272 594158 590894 588327 585103 580207 574359 569173 565179
60175E65179l668m050m036l431l035l112k890j843o67m08j057j593j344p43n78
$$ 565179 561511 557461 553425 549994 546959 543847 540957 539114 538447 538039 536982 535389 534045 533302 532724
60160E32724q75r42l39O24J393J735J672J272Q14P53J189J655J786J883K380L081
$$ 532724 531849 530907 530568 531192 532585 534320 535992 537264 538078 538831 540020 541675 543461 545344 547724 550805
60144E50805L453L457L485L645L713L781M252N115N854O209O591P365Q165Q219
$$ 550805 554258 557715 561200 564845 568558 572339 576591 581706 587560 593769 600360 607725 615890 624109
60130F24109P239N766M683M319M074L128J571M31L44O60L47n71j166r26j94N88
$$ 624109 631348 637114 641797 646116 650190 653318 654889 655320 655664 656324 656671 656100 654934 654008 653814 654402
60114F54402J263J610J324N68k3j01M6M4j53n20j189k170l155l818m151m415m845
$$ 654402 655665 657275 658599 659167 659144 659043 659089 659133 658980 658460 657271 655101 651946 648128 643977 639562 634717
60097F34717n294n147l949k262j433j963k695k172m41J312K469L301L896L883
$$ 634717 629423 624276 620327 618065 616632 614669 611974 609802 609361 610673 613142 616443 620339 624222
60083F24222L404L229L605L870L538K933K413J725O38m52j143j716k738m327o149
$$ 624222 627626 630855 634460 638330 641868 644801 647214 648939 649577 649125 647982 646266 643528 639201 633052
60068F33052p793q789q733p827p004p063p830q451q346p617o613n441m054k737
$$ 633052 625259 616470 607737 599910 592906 585843 578013 569562 561216 553599 546986 541545 537491 534754
60054E34754k160k606l276k965j616m88m24p46m95N7J73K59J385L422N049N619
$$ 534754 532594 529988 526712 523747 522131 521643 521219 520473 519978 520035 520208 520467 521852 525274 530323 535942
60038E35942N838O374O916O945O392N301L720K208J476J189J36k026m191n410
$$ 535942 541780 548154 555070 562015 568407 573708 577428 579636 581112 582301 582437 580411 576220 570810
60024E70810o147p272q702r732j0152j0181r790q755p249n867n137n125n285m782
$$ 570810 564663 557391 548689 538957 528805 518624 508834 500079 492830 486963 481826 476701 471416 466634
60010D66634l333j640n50kN27Q77N13k09k90L42P06L81O1K36N36P29J145J661
$$ 466634 463301 461661 461111 461109 461636 462513 463026 462817 462527 462869 463575 463956 464017 464253 464789 465518 466663 468324
59992D68324J654J396K076L736M670L864K617K541L222L264K586K118J991J596
$$ 468324 469978 471374 473450 477186 481856 485720 488337 490878 494100 497364 499950 502068 504059 505655
59978E05655R66O39L89n31k005l091l334l118k782k297j756j297o82L30J330J747
$$ 505655 506621 507260 507649 507118 505113 502022 498688 495570 492788 490491 488735 487438 486756 487086 488416 490163
59962D90163J718J835K251K716L160L502L266K201J067Q80J533J970J566O08l73
$$ 490163 491881 493716 495967 498683 501843 505345 508611 510812 511879 512759 514292 516262 517828 518436 518063
59947E18063j086j344j187j058j273j522j412j209j537k515l766m866n358m815
$$ 518063 516977 515633 514446 513388 512115 510593 509181 507972 506435 503920 500154 495288 489930 485115
59933D85115l546k697k878l197k521j118j18J73K97M10K41R7O92J893K751K892
$$ 485115 481569 478872 475994 472797 470276 469158 469040 469213 469510 469920 470161 470258 470950 472843 475594 478486
59917D78486K908L292L858M383M928N416N588N623O002O689P081O876O355N760
$$ 478486 481394 484686 488544 492927 497855 503271 508859 514482 520484 527173 534254 541130 547485 553245
59903E53245N086M453M035L570K595J242R5p08j544k465k985k879k435j873j074
$$ 553245 558331 562784 566819 570389 572984 574226 574321 573613 572069 569604 566619 563740 561305 559432 558358
59888E58358kJ133K182K995L226K794K429K930M008M648M622M721N270N447M482
$$ 558358 558356 559489 561671 564666 567892 570686 573115 576045 580053 584701 589323 594044 599314 604761 609243
59873F09243K834J626J332J407Q82q29l419n808p002o892o017m779l366k161j545
$$ 609243 612077 613703 615035 616442 617324 616495 613076 607268 600266 593374 587357 582578 579212 577051 575506
59858E75506j385j307j332j617j706q90O57J940K439K683L312M300N314O303P383
$$ 575506 574121 572814 571482 569865 568159 567269 567926 569866 572305 574988 578300 582600 587914 594217 601600
59843F01600Q559R607R923Q678N736K309m5j010j410j628j119L77K081K987K700
$$ 601600 610159 619766 629689 638367 644103 646412 646367 645357 643947 642319 641200 641577 643658 646645 649345
59828F49345J191j471m680p222q227p973p446p415p978q598q491p384n954n080
$$ 649345 650536 649065 644385 637163 628936 620963 613517 606102 598124 589526 581035 573651 567697 562617
59814E62617m708m039k779j501p30l81k72m40p76r95j191j660k076j669n47M2
$$ 562617 557909 553870 551091 549590 548860 548479 548207 547767 546991 545996 544805 543145 541069 539400 538853 538895
59798E38895p46k337l750m901o165p275p507o730n606m701l980l147k219j582
$$ 538895 538149 535812 532062 527161 520996 513721 506214 499484 493878 489177 485197 482050 479831 478249
59784D78249j542j836j746r54j03n7p59j358j429j336j259p34M80J681J999J534
$$ 478249 476707 474871 473125 472171 472068 472011 471252 469894 468465 467129 465870 465136 465616 467297 469296 470830
59768D70830J204J548K132K141J349M40K48Q11J451J794K251L034L441K852J991
$$ 470830 472034 473582 475714 477855 479204 479644 479892 480703 482154 483948 486199 489233 492674 495526 497517
59753D97517K154L389M455M647M554M823N243N409N428N375M879L745K433J474
$$ 497517 499671 503060 507515 512162 516716 521539 526782 532191 537619 542994 547873 551618 554051 555525
59739E55525R41Q40J383K448L286L235K385J286M65L28R32J674J742J148O55N62
$$ 555525 556466 557306 558689 561137 564423 567658 570043 571329 571794 572122 573054 574728 576470 577618 578273 578835
59723E78835L41k60o43l61J73M52O56R84J029M63j99k86O7L35N36R61J388J313
$$ 578835 579176 578916 578273 577912 578085 578537 579193 580177 581206 581669 581470 581184 581251 581586 582122 583083 584471 585784
59705E85784P86L19J83K91O19J148J567J550J276J194J367J488J471J656K363
$$ 585784 586570 586889 587072 587363 587982 589130 590697 592247 593523 594717 596084 597572 599043 600699 603062
59690F03062L446M240M013K631Q24m90j062j165q23R8J105J267N08k33m33p25
$$ 603062 606508 610748 614761 617392 618216 617726 616664 615499 614676 614774 615879 617146 617654 617421 616988 616263
59674F16263j714k897l498l614l845m298m809n567o652p350o899n600m423l727
$$ 616263 614549 611652 608154 604540 600695 596397 591588 586021 579369 572019 565120 559520 555097 551370
59660E51370l123k443j974j756j439q81l11J62O69J144J259R39O00P47J510K425
$$ 551370 548247 545804 543830 542074 540635 539754 539443 539605 540274 541418 542677 543616 544216 544963 546473 548898
59644E48898K625J522m50k054k545k349k168j955j352o52n28r53j214q76k01M15
$$ 548898 551523 553045 552595 550541 547996 545647 543479 541524 540172 539520 538992 538039 536825 535949 535748 536163
59628E36163Q21R74R61J073J308R58o01k688l652k683o86Q17J142N41m92j476
$$ 536163 536984 537958 538919 539992 541300 542258 541657 538969 535317 532634 531948 532765 533907 534448 533956 532480
59612E32480j934j745j408j486j779j496l28J038J738J784J875K322K619K228
$$ 532480 530546 528801 527393 525907 524128 522632 522304 523342 525080 526864 528739 531061 533680 535908
59598E35908J302L21n93j537k259k296j659q85l44lJ99J74K9or4o88j690k286
$$ 535908 537210 537531 536938 535401 533142 530846 529187 528302 527958 527955 528154 528328 528357 528351 528257 527569 525879 523593
59580E23593j969j316j296k114l050l289k622j519p56q52j694k679l208k964j985
$$ 523593 521624 520308 519012 516898 513848 510559 507937 506418 505662 504810 503116 500437 497229 494265 492280
59565D92280p56k2mk7N78J419J547Q81K36L4p5k27L3Q07J483J733J975K467K732
$$ 492280 491524 491502 491498 491471 492049 493468 495015 495896 496132 496166 496091 495864 495897 496704 498187 499920 501895 504362 507094
59546E07094K519K451L128M279N400O519P730Q688R250R973J1302J2925J4566
$$ 507094 509613 512064 515192 519471 524871 531390 539120 547808 557058 567031 578333 591258 605824
59533F05824J6564J8707J9208J6101R520J836m251p178o833m429j841j06J304
$$ 605824 622388 641095 660303 676404 685924 687760 683509 676331 669498 665069 663228 663122 664426
59520F64426L133M785N058L985K770J956P93j354l946o011p309q365r628j0836
$$ 664426 667559 672344 677402 681387 684157 686113 686906 685552 681606 675595 668286 659921 650293 639457
59506F39457j1184j0245q757p976q137q179p301o000m927l663j670L12J067O96
$$ 639457 628273 618028 609271 601295 593158 584979 577678 571678 566751 563088 561418 561730 562797 563493
59492E63493L82O66J176J863L080M353M503L397K432K757M027N365O639Q093R542
$$ 563493 563875 564541 565717 567580 570660 575013 579516 582913 585345 588102 592129 597494 604133 612226 621768
59477F21768J0611J1369J2093J2798J3417J4058J4616J4455J2997J0385P297M220
$$ 621768 632379 643748 655841 668639 682056 696114 710730 725185 738182 748567 755864 760084
59465G60084J221j682m149n583n475l846j292J479M164O846R583J2263J4671J6528
$$ 760084 761305 759623 755474 749891 744416 740570 739278 740757 744921 751767 761350 773613 788284 804812
59451H04812J7575J7841J7679J7375J6949J6514J6390J6522J6091J4068R941L716
$$ 804812 822387 840228 857907 875282 892231 908745 925135 941657 957748 971816 981757 985473
59439I85473m121j2229j8568k1840k2524k1975k0862j9186j7267j5748j4763j4052
$$ 985473 981352 969123 950555 928715 906191 884216 863354 844168 826901 811153 796390 782338
59427G82338j3713j3937j4089j2974j0143o141j573L168P346J0211J2098J4130
$$ 782338 768625 754688 740599 727625 717482 711341 709768 712936 720282 730493 742591 756721
59415G56721J6589J8572J9634K0528K1817K2922K3360K3689K3811K1252J3112
$$ 756721 773310 791882 811516 832044 853861 876783 900143 923832 947643 968895 982007
59404I82007n2j3674k3035k6755k6264k3184j8287j2226n793M20N417O819K089
$$ 982007 981955 968281 945246 918491 892227 869043 850756 838530 832737 833157 838574 845393 847482
59391H47482q315k0005k8111l1267l1298k9763k6547k1746j6999j3880j2146j0527
$$ 847482 839167 819162 791051 759784 728486 698723 672176 650430 633431 619551 607405 596878
59379E96878q476o313m304k530j224m71J11P45J056Q22O56J220K223K935L229
$$ 596878 588402 582089 577785 575255 574031 573560 573671 574416 575472 576294 576950 578170 580393 583328 586557
59364E86557L503L960M619N545O474O787O541O838Q376J0293J1383J1764J2396
$$ 586557 590060 594020 598639 604184 610658 617445 623986 630824 639200 649493 660876 672640 685036
59351F85036J3524J4769J6126J7734J9113J9840K0489K1650K2592K2187K0715
$$ 685036 698560 713329 729455 747189 766302 786142 806631 828281 850873 873060 893775
59340H93775J9308J8046J6141J3600J0982P803L161k199o415r280j2421j6359
$$ 893775 913083 931129 947270 960870 971852 979655 982816 980617 974202 964922 952501 936142
59328I36142j9456k0520k0576k1051k1884k2391k2429k1704j9442j5979j3278
$$ 936142 916686 896166 875590 854539 832655 810264 787835 766131 746689 730710 717432
59317G17432j2509j2285j0720q229o675o621o885o432n239l554j565K77J572K572
$$ 717432 704923 692638 681918 673689 667014 660393 653508 647076 641837 638283 636718 636995 638567 641139
59303F41139L789N164O313P295Q480R831J0991J1855J2626J3488J4475J5097J3899
$$ 641139 644928 650092 656405 663700 672180 682011 693002 704857 717483 730971 745446 760543 774442
59290G74442R353J888n765j1055j3797j5142j5333j3825j0958q023n690l618j621
$$ 774442 783795 785683 779918 768863 755066 739924 724591 710766 699808 691785 686095 682477 680856
59277F80856q0J033K382M184N775O681P446Q865J0890J2709J3597J3342J2087
$$ 680856 680776 681809 684191 688375 694150 700831 708277 717142 728032 740741 754338 767680 779767
59264G79767J0123P783N312K786J49k634n435p874r642j0907j2205j3660j4638
$$ 779767 789890 797673 802985 805771 805920 803286 797851 789977 780335 769428 757223 743563 728925
59251G28925j4485j3396j2154j1124r912q112o012m348l450k849j811j19J789
$$ 728925 714440 701044 688890 677766 667854 659742 653730 649382 645932 643083 641272 641153 642942
59238F42942L434M756N865O685P135P411P650P481O478M929L618K760J699k12
$$ 642942 646376 651132 656997 663682 670817 678228 685878 693359 699837 704766 708384 711144 712843 712631
59224G12631k930n975q867j1127j2279j2259j1532j0719j0150r739q995p354m892
$$ 712631 709701 703726 694859 683732 671453 659194 647662 636943 626793 617054 608059 600705 595813
59211E95813k591j361r41l61O75J534J749J589J423J286J241J529K128K701L052
$$ 595813 593222 591861 590920 590559 591234 592768 594517 596106 597529 598815 600056 601585 603713 606414 609466
59196F09466L069K305N47j186j314K85J951K372K039J973K078J723J202J374K198
$$ 609466 612535 614840 615387 614201 612887 613172 615123 617495 619534 621507 623585 625308 626510 627884 630082
59181F30082K707K447K069K328L037L393L085K775L344M744N875N875N209N006
$$ 630082 632789 635236 637305 639633 642670 646063 649148 651923 655267 660011 665886 671761 676970 681976
59167F81976N587O346O911P605Q638R605J0000R608Q299O133L793K155J165j48
$$ 681976 687563 693909 700820 708425 717063 726668 736668 746276 754575 760708 764501 766656 767821 767673
59153G67673k390n202p978j0333j1731j1712j0817j0294j0429j0149q775p135
$$ 767673 765283 760081 752103 741770 730039 718327 707510 697216 686787 676638 667863 660728
59141F60728o302o133n832n202m508l803l138k902l233l542l265k616k114j860
$$ 660728 654426 648293 642461 637259 632751 628948 625810 622908 619675 616133 612868 610252 608138 606278
59127F06278j694j599j408p45L17J108J356J650K512L661M644N475O209O623O791
$$ 606278 604584 602985 601577 600832 601149 602257 603613 605263 607775 611436 616080 621555 627764 634387 641178
59112F41178P227P942Q224P900P797Q259Q327P216N702N011N148N346N339N141
$$ 641178 648405 656347 664571 672471 680268 688527 696854 704070 709772 714783 719931 725277 730616 735757
59098G35757M277K486O40j83k10n12j419k352k821k716j939q00k80r97k253l005
$$ 735757 740034 742520 743160 742977 742767 742255 740836 738484 735663 732947 731008 730208 729928 728931 726678 723673
59082G23673l374m234n717p129q032q477q432p954p620p872q196p822o924o242
$$ 723673 720299 716065 710348 703219 695187 686710 678278 670324 662704 654832 646636 638814 631890 625648
59068F25648n852n296m583m126l860l435l040l139l498l477l048k693k458k038
$$ 625648 619796 614500 609917 605791 601931 598496 595456 592317 588819 585342 582294 579601 577143 575105
59054E75105j619j688k068k018j249j58P51J070M66p09j226l20J086J481P36o1
$$ 575105 573486 571798 569730 567712 566463 566305 567056 568126 568592 567883 566657 566337 567423 568904 569640 569579
59038E69579l49m69n19j50M35N28J81L33J412K774L808M732N909P145Q075Q710
$$ 569579 569230 568761 568242 568092 568527 569055 569236 569569 570981 573755 577563 582295 588204 595349 603424 612134
59022F12134R280R917J0612J1194J1360J1015J0447R785Q672O834M640K589O95
$$ 612134 621414 631331 641943 653137 664497 675512 685959 695744 704416 711250 715890 718479 719174
59009G19174j097k410l003l272l455l036j710k36O80J693L711O132P550P849Q083
$$ 719174 718077 715667 712664 709392 705937 702901 701191 700955 701635 703328 707039 713171 720721 728570 736653
58994G36653Q522Q338P189N716M345K970J858J521J460M06j790l767m555m738
$$ 736653 745175 753513 760702 766418 770763 773733 775591 777112 778572 778978 777188 773421 768866 764128
58980G64128n187n732n679m867l544j815K32K311M205N971P752R649J1646J3339
$$ 764128 758941 753209 747530 742663 739119 737304 737536 739847 744052 750023 757775 767424 779070 792409
58966G92409J4035J3641J3022J2842J2683J2075J1621J1806J1447R005N060J726
$$ 792409 806444 820085 833107 845949 858632 870707 882328 894134 905581 914586 919646 921372
58954I21372l97k809o425j0128j2689j4409j5990j7108j7148j6349j5304j4096
$$ 921372 920975 918166 911741 901613 888924 874515 858525 841417 824269 807920 792616 778520
58942G78520j2661j1317j0246r066p557o137n155m336l391k542k004j577j177
$$ 778520 765859 754542 744296 735230 727673 721536 716381 712045 708654 706112 704108 702531 701354
58929G01354j173j755k567l262l847m199l965l277k870l093l365l040k232j442
$$ 701354 700181 698426 695859 692597 688750 684551 680586 677309 674439 671346 667981 664941 662709 661267
58915F61267q78m48L8Q52K097L302L877M044M646N913P057P378P185P393Q680
$$ 661267 660389 659941 659979 660831 662928 666230 670107 674151 678797 684710 691767 699145 706330 713723 722403
58900G22403J1096J4028J6442J7728J8267J8689J8856J8281J7275J6701J6686
$$ 722403 733499 747527 763969 781697 799964 818653 837509 855790 873065 889766 906452
58889I06452J6580J6226J6255J7021J8150J9302K0414K1059K0504J8596J5793
$$ 906452 923032 939258 955513 972534 990684 1009986 1030400 1051459 1071963 1090559 1106352
58878A106352J2230P668K469k408o503j0143j3551j6556j9241k1810k3787k4282
$$ 1106352 1118582 1126250 1128719 1126311 1119808 1109665 1096114 1079558 1060317 1038507 1014720 990438
58866I90438k3210k1235j8684j5692j3201j2322j2614j2472j1505j0853j0898
$$ 990438 967228 945993 927309 911617 898416 886094 873480 861008 849503 838650 827752
58855H27752j0490r142q221q892j0259j0777j0250r357q241o830n752n694o333
$$ 827752 817262 808120 799899 791007 780748 769971 759721 750364 742123 735293 729541 723847 717514
58842G17514o803o791o456n959n643o080p209q051p911p226o651o098n320m679
$$ 717514 710711 703920 697464 691505 685862 679782 672573 664522 656611 649385 642734 636636 631316 626637
58828F26637m509m350l613k509j639j037l30N37J290J791K141K522L097L756M008
$$ 626637 622128 617778 614165 611656 610017 608980 608650 609187 610477 612268 614409 616931 620028 623784 627792
58813F27792L683L531M324N476N614M540L411K821K058O97m10n24k37n43j534
$$ 627792 631475 635006 639330 644806 650420 654960 658371 661192 663250 663947 663537 663013 662776 662233 660699
58798F60699k695l725m371m304l694l278l418l834m426n352o018n231k933o22
$$ 660699 658004 654279 649908 645604 641910 638632 635214 631380 626954 621602 615584 610353 607420 606798
58784F06798N78J151J924K752L186L365L384K847J811J229J606K126J843P81p73
$$ 606798 607376 608527 610451 613203 616389 619754 623138 625985 627796 629025 630631 632757 634600 635381 634608
58769F34608k949n479p170p239o315n368m554l791l455l601l469k611j619r11
$$ 634608 631659 626180 619010 611771 605456 600088 595534 591743 588288 584687 581218 578607 576988 576077
58755E76077Q9J710L048L292L034L169L453L229K758K643K751K724K887L563M277
$$ 576077 576166 577876 580924 584216 587250 590419 593872 597101 599859 602502 605253 607977 610864 614427 618704
58740F18704M563M873N692O521O764O792P164P561P537P522P988Q350P817O717
$$ 618704 623267 628140 633832 640353 647117 653909 661073 668634 676171 683693 691681 700031 707848 714565
58726G14565N919N574N407N537O024O198N485M387L827M064M977O491P997Q367
$$ 714565 720484 726058 731465 737002 743026 749224 754709 759096 762923 766987 771964 778455 786452 794819
58712G94819P451O635O882P357O940N928M948L408N83k785n570q058j0965j3575
$$ 794819 802270 808905 815787 823144 830084 836012 840960 844368 844951 842166 836596 828538 817573 803998
58698H03998j4694j4953j6137j8449k0197k0237j9139j7769j6168j4159j1970
$$ 803998 789304 774351 758214 739765 719568 699331 680192 662423 646255 632096 620126
58687F20126r959q376p473p170o840o041n166m784m721m443l857l099k067q36
$$ 620126 610167 601791 594318 587148 580308 574267 569101 564317 559596 555153 551296 548197 546130 545294
58673E45294J40P73J558K536L060L198M110O114P791Q157Q363R732J1375J1478
$$ 545294 545434 546207 547765 550301 553361 556559 560669 566783 574574 582731 591094 600826 612201 623679
58659F23679R991Q102N934K778q68l446m468m842n166n185m923m896n114n025
$$ 623679 633670 641772 647706 650484 649616 646170 641702 636860 631694 626509 621586 616690 611576 606551
58645F06551m531m108l960l853l584l046k198j468j447j675p36J615L670M068
$$ 606551 602020 597912 593952 590099 586515 583469 581271 579803 578356 576681 575945 577560 581230 585298
58631E85298L635L701L946L477K785K807L011K303J044M36N93R28J681L289M902
$$ 585298 588933 592634 596580 600057 602842 605649 608660 610963 612007 612443 613036 613964 615645 618934 623836
58616F23836N403N299N840O903P531P888Q686R207Q044N409K881J119k82j166
$$ 623836 629239 634538 640378 647281 654812 662700 671386 680593 688637 694046 696927 698046 697764 696598
58602F96598j088q36j694l285m129m082m265m810m701l828l168k817j810o9J276
$$ 696598 695510 694674 692980 689695 685566 681484 677219 672409 667708 663880 660712 657895 656085 656016 657292
58587F57292J764K152K967M015N355P267R263J0560J1365J2244J2656J1741J0200
$$ 657292 659056 661208 664175 668190 673545 680812 690075 700635 712000 724244 736900 748641 758841
58574G58841R510R592R160Q154P839Q606R591J0491J1814J3401J4551J5599J7495
$$ 758841 768351 777943 787103 795257 803096 811702 821293 831784 843598 856999 871550 887149 904644
58561I04644J9926K1707K2881K4360K5585K4777K1549J7336J3036Q353L567k02
$$ 904644 924570 946277 969158 993518 1019103 1043880 1065429 1082765 1095801 1104154 1107721 1107519
58549A107519k830n281p539q444p878p223p256p483p836r057j1104j2952j4403
$$ 1107519 1104689 1099408 1091869 1083425 1075547 1068324 1061068 1053585 1045749 1036692 1025588 1012636 998233
58536I98233j6302j8678k0433k1053k0935j9966j7707j4948j3057j1716r396o215
$$ 998233 981931 963253 942820 921767 900832 880866 863159 848211 835154 823438 814042 807827
58524H07827l955l066k029j10J549K199K561L034L000K570K892L943M115K730
$$ 807827 803872 800806 798777 798667 800216 802415 804976 808010 811010 813580 816472 820415 824530 827260
58510H27260J041R4n04j037r78n82j165k911m262m326m041m257m416m047l791
$$ 827260 828301 828395 827891 826854 825876 825294 824129 821218 816956 812630 808589 804332 799916 795869 792078
58495G92078m086m336m105l721l171j901j65J012J443J934K694L266L999N644
$$ 792078 787992 783656 779551 775830 772659 770758 770593 771605 773048 774982 777676 780942 784941 790585
58481G90585P586Q549R006J0526J2781J3740J3121J2801J3402J3233J1324Q773
$$ 790585 798171 806720 815726 826252 839033 852773 865894 878695 892097 905330 916654 925427
58469I25427O227K740j785n523p330q179q949r046q199p388o879n500k805QK209
$$ 925427 931654 934394 932609 927086 919756 911577 902628 893582 885383 877995 871116 865616 862811 862819 865028
58454H65028M384O517P577P732Q504R830R548O867L715J538o62l776o592p909
$$ 865028 869412 875929 883506 891238 899742 909572 919120 925987 929702 931240 930578 926802 920210 912301
58440I12301q412q981r129q366p216n808l448m60J647K629L867N590O275N650
$$ 912301 903889 894908 885779 877413 870197 864389 860941 860481 862128 864757 868624 874214 880489 886139
58426H86139N573O966Q490R296J0299J1648J1793J0315Q865Q052O244K776n43
$$ 886139 891712 898678 907168 916464 926763 938411 950204 960519 969384 977436 983680 986456 985913
58413I85913k472m029n760o396n694n601o973q154q317r012j0712j1152r145o822
$$ 985913 983441 979412 973652 967256 961562 955961 948988 940834 932517 923505 912793 901641 892496 885674
58399H85674n985n354l613k050j796j435J98J742K044K350L424L512J648kL52
$$ 885674 879689 874335 870722 868672 866876 865441 865639 867381 869425 871775 875199 878711 880359 880357 880709
58384H80709J196Q37N17J702L090L237L378M847O274O250O152P532R143R373R169
$$ 880709 881905 882742 883259 884961 888051 891288 894666 899513 905787 912037 918189 925721 934864 944237 953406
58369I53406R809J0273R536Q947R684J0400J0036J0161J1843J3072J2239J1256
$$ 953406 963215 973488 983024 991971 1001655 1012055 1022091 1032252 1044095 1057167 1069406 1080662
58357A080662J2170J3475J2982J1538J0720R581O929M225L007K057K43o94O63
$$ 1080662 1092832 1106307 1119289 1130827 1141547 1151128 1158057 1162282 1165289 1167346 1167589 1166895 1167558
58344A167558K316K374K589M949P692Q500Q734J0605J2890J3447J3407J4854J6736
$$ 1167558 1169874 1172248 1174837 1179786 1187478 1195978 1204712 1215317 1228207 1241654 1255061 1269915 1286651
58331A286651J6986J6396J6660J6873J5627J4092J3553J2508R721P256O909O727
$$ 1286651 1303637 1320033 1336693 1353566 1369193 1383285 1396838 1409346 1419067 1426323 1433232 1439959
58319A439959M785L130L948N243M643M016N770P916P727P039Q843J1684J2605
$$ 1439959 1444744 1447874 1451822 1457065 1461708 1465724 1471494 1479410 1487137 1494176 1503019 1514703 1527308
58306A527308J2709J4572J6923J7187J6577J7526J8756J8090J7328J8959K0960
$$ 1527308 1540017 1554589 1571512 1588699 1605276 1622802 1641558 1659648 1676976 1695935 1716895
58295A716895K0280J8652J9318K0963K0636J9824K1674K4854K6166K6624K8958
$$ 1716895 1737175 1755827 1775145 1796108 1816744 1836568 1858242 1883096 1909262 1935886 1964844
58284A964844L1771L2161L1491L2540L3747L2390L0495L1315L3009L2340L1394
$$ 1964844 1996615 2028776 2060267 2092807 2126554 2158944 2189439 2220754 2253763 2286103 2317497
58273B317497L3887L7908L9331L9334M1450M4295M4704M4859M8699N4263N7283
$$ 2317497 2351384 2389292 2428623 2467957 2509407 2553702 2598406 2643265 2691964 2746227 2803510
58262B803510N9178O3644O8586O9775O9286P1793P5609P6101P4779P6149P8699
$$ 2803510 2862688 2926332 2994918 3064693 3133979 3205772 3281381 3357482 3432261 3508410 3587109
58251C587109P8272P7134Q0304Q6050Q9616R3002J01047J11220J17716J22315
$$ 3587109 3665381 3742515 3822819 3908869 3998485 4091487 4192534 4303754 4421470 4543785
58241D543785J30637J41077J48405J54694J65340J78021J87340J96375K11258
$$ 4543785 4674422 4815499 4963904 5118598 5283938 5461959 5649299 5845674 6056932
58232F056932K28555K41086K51909K68839K89539L06755L23801L49196L80150
$$ 6056932 6285487 6526573 6778482 7047321 7336860 7643615 7967416 8316612 8696762
58223H696762M07750M34511M69746N11563N51450N92830O46332P10349P76008
$$ 8696762 9104512 9539023 10008769 10520332 11071782 11664612 12310944 13021293 13797301
58214A3797301Q47579R37542J045431J163144J297098J462450J660646J887474
$$ 13797301 14644880 15582422 16627853 17790997 19088095 20550545 22211191 24098665
58206B4098665K158422K499548K919126L416772M012905M735170N581321O532179
$$ 24098665 26257087 28756635 31675761 35092533 39105438 43840608 49421929 55954108
58198E5954108P597396Q811353J0190245J1733470J3456560J5374944J7467984
$$ 55954108 63551504 72362857 82553102 94286572 107743132 123118076 140586060
58191A40586060J9711328K2118626K4675310K7252098K9643520L1552229L2250523
$$ 140586060 160297388 182416014 207091324 234343422 263986942 295539171 327789694
58184C27789694L0269231K3933866J2786582j399703j5271357k5781310l1625215
$$ 327789694 358058925 381992791 394779373 393379670 378108313 352327003 320701788
58177C20701788l3242960l1952311k9203805k6196565k3615309k1523794j9612118
$$ 320701788 287458828 255506517 226302712 200106147 176490838 154967044 135354926
58170A35354926j7622732j5544055j3492624j1564343r821234q311466p042023
$$ 135354926 117732194 102188139 88695515 77131172 67309938 58998472 51956449
58163E1956449n973898n070991m322504l711135l200322k765393k404389k109055
$$ 51956449 45982551 40911560 36589056 32877921 29677599 26912206 24507817 22398762
58155B2398762j855422j630717j441538j288041j155197j035209r34506q53026
$$ 22398762 20543340 18912623 17471085 16183044 15027847 13992638 13058132 12205106
58147A2205106p78872p08303o49729o03316n56906n06554m61863m26530l92102
$$ 12205106 11426234 10717931 10068202 9464886 8907980 8401426 7939563 7513033 7120931
58138G120931l55376l24250l01576k79804k56355k38692k29429k21060k09782
$$ 7120931 6765555 6441305 6139729 5859925 5603570 5364878 5135449 4914389 4704607
58129D704607k00638j94871j85808j71583j59105j51273j42414j30234j20405
$$ 4704607 4503969 4309098 4123290 3951707 3792602 3641329 3498915 3368681 3248276
58120C248276j15351j09838j01561r5292r2843q9353q2990p8341p6832p3621o7212
$$ 3248276 3132925 3023087 2921526 2826234 2733391 2644038 2561048 2482707 2405875 2332254 2265042
58109B265042o2541o1413n9346n4919n2834n4490n4734n1380m9049n0159n0725
$$ 2265042 2202501 2141088 2081742 2026823 1973989 1919499 1864765 1813385 1764336 1714177 1663452
58098A663452m8602m7479m9028m9173m5761m2405m1153l8773l3739k9730k8684
$$ 1663452 1614850 1567371 1518343 1469170 1423409 1381004 1339851 1301078 1267339 1237609 1208925
58087A208925k7255k3541k0624k0197j9292j6552j5267j6931j8034j6559j5613
$$ 1208925 1181670 1158129 1137505 1117308 1098016 1081464 1066197 1049266 1031232 1014673 999060
58076I99060j7307j8838j7951j6791j7216j7451j6321j5722j6285j5687j3515
$$ 999060 981753 962915 944964 928173 910957 893506 877185 861463 845178 829491 815976
58065H15976j2596j3392j2569r384p767r546j1253j0392r275r800r915q373p792
$$ 815976 803380 789988 777419 768035 760268 750722 739469 729077 719802 710002 700087 691714 683922
58052F83922r656j1197j0339r166r473r498p962o825p152o729m649l780n719p716
$$ 683922 674266 663069 652730 643564 634091 624593 616631 609806 602654 595925 591276 587496 581777 574061
58038E74061p459o656o973o800n066m026n097o008n147m695o413q218q144p884
$$ 574061 566602 559946 552973 546173 541107 537081 531984 525976 520829 516134 509721 501503 493359 485475
58024D85475r146j0237r422q195q052p498n347l588l830m216l007j916k704l691
$$ 485475 476329 466092 456670 448475 440423 432925 427578 423990 420160 415944 412937 411021 408317 404626
58010D04626k918j753k068k739k146j397j824k041o69N57k88j771j602m91k92
$$ 404626 401708 399955 397887 395148 393002 391605 389781 387740 387071 387628 387340 385569 383967 383476 383184
57995C83184m67N25K108K737K518K198J318k61r58R9J148M87q29j110p90r18r88
$$ 383184 382717 383242 385350 388087 390605 392803 394121 393860 392902 393001 394149 394636 393807 392697 391907 390989 390001
57978C90001m74m58j646k768k862k989l831l977k639j503j792j963o93N32J53
$$ 390001 389527 389069 387423 384655 381793 378804 374973 370996 368357 366854 365062 363099 362406 362938 363091
57963C63091n96j99L47j68n51L36R30k71j570q72N17J76j173j100K84Q94M52N13
$$ 363091 362495 362296 362643 362475 361924 362260 363190 362919 361349 360477 360994 361170 359997 358897 359181 360075 360527 361040
57945C61040J498K433L110M044M963N354N778O794P591P438P265Q010Q764Q369
$$ 361040 362538 364971 368081 372125 377088 382442 388220 395014 402605 410043 417308 425318 434082 442451
57931D42451P463P041O531N171L804L296K701R64j120k598m308p009r312r717
$$ 442451 449914 456955 463486 468657 472461 475757 478458 479422 478302 475704 471396 464387 455075 445358
57917D45358r131r166r501r231r137j0160j1032j0064p953o459n604m510l632
$$ 445358 436227 427061 417560 408329 399192 389032 378000 367936 359983 353524 347920 343410 339778
57904C39778l614l351j708M1L1j081j417j065j333j872j326m2N55N75J195K216
$$ 339778 336164 332813 331105 331146 331177 330096 328679 327614 326281 324409 323083 323041 323596 324171 325366 327582
57888C27582K496K231K442K854K462J598J229R83Lj063j121q46j538k665k971
$$ 327582 330078 332309 334751 337605 340067 341665 342894 343877 343880 342817 341696 340850 339312 336647 333676
57873C33676l091m498o555p288o609o140o263n961n275n274n618m759k672j047
$$ 333676 330585 326087 319532 312244 305635 299495 293232 287271 281996 276722 271104 266345 263673 262626
57859B62626n88k72N11J220J659K308K924K693J991K223L602M727M596L719K995
$$ 262626 262038 261766 262277 263497 265156 267464 270388 273081 275072 277295 280897 285624 290220 293939 296934
57844B96934K729K797K750J947M56o69r06j159k068k562j668n30p70j836k012
$$ 296934 299663 302460 305210 307157 307613 306944 306038 304879 302811 300249 298581 298051 297281 295445 293433
57829B93433j228p28n92J32J313J947K216L191M684N383N043M615M412L916L321
$$ 293433 292205 291477 290885 291017 292330 294277 296493 299684 304368 309751 314794 319409 323821 327737 331058
57814C31058L382L832L665K884K339J952P80j277l358n072o613p789q334q756
$$ 331058 334440 338272 341937 344821 347160 349112 349892 348615 345257 340185 333572 325783 317449 308693
57800C08693r457r565q198o205n035m568l807k922k708k710k003j191j463k286
$$ 308693 299236 289671 281473 275268 270233 265665 261858 258936 256228 253518 251515 250324 248861 246575
57786B46575k223j483j291j224K44K757M224M003L590L968M544M979N705O406
$$ 246575 244352 242869 241578 240354 240598 243355 247579 251582 255172 259140 263684 268663 274368 280774
57772B80774O083N002M607N187N563N245M865M379K934Q06o28j207k255m207n900
$$ 280774 286857 291859 296466 301653 307216 312461 317326 321705 324639 325445 324817 323610 321355 317148 311248
57757C11248o636o939o928n979m435l753m353n012m903m461m014l302k681k904
$$ 311248 304612 297673 290745 284766 280331 276578 272225 267213 262310 257849 253835 250533 247852 244948
57743B44948l466l024j795j445k331k949k616k427k921l029k221j601j833j953
$$ 244948 241482 238458 236663 235218 232887 229938 227322 224895 221974 218945 216724 215123 213290 211337
57729B11337j341r58j451j808j134k20n1j69K19P30O41J90j6m4k01l92n72j017
$$ 211337 209996 209038 207587 205779 204645 204425 204374 204205 204424 205154 205795 205985 205969 205925 205724 205332 204760 203743
57711B03743j602j731j403j341j747k016k010k305k880k837j930j069q31p58m87
$$ 203743 202141 200410 199007 197666 195919 193903 191893 189588 186708 183871 181941 180872 180041 179283 178796
57696A78796l33l23K4N64N38K0m4L66J17j049j870j565r13o18j52R55K139K971
$$ 178796 178463 178140 178164 178728 179266 179286 179242 179608 179725 178676 176806 175241 174328 173710 173558 174513 176652 179623
57678A79623M093O069Q514J1016J3834J6919J9473K1133K2658K4835K7738L1368
$$ 179623 183716 189785 198299 209315 223149 240068 259541 280674 303332 328167 355905 387273
57666C87273L5825M0382M3443M3630L9738K9979J3398p381k6821m0667m8205n0294
$$ 387273 423098 463480 506923 550553 590291 620270 633668 626287 599466 558799 510594 460300
57654D60300m7600m1638l5203l0029k5484k0671j6298j3219j0805q271o266n622
$$ 460300 412700 371062 335859 305830 280346 259675 243377 230158 219353 211082 204816 199194
57642A99194n657n117l951k935k318j929j775j662j053l1N02K16j35j21k65o94
$$ 199194 193537 188420 184469 181534 179216 177287 175512 173850 172797 172766 173268 173484 173349 173228 172963 172269
57626A72269o41n1j04j247k236k148j765j873j809r52j44k31n81m23l00p78j096
$$ 172269 171628 171577 171473 170226 167990 165842 164077 162204 160395 159443 159299 159068 158487 158064 157764 156986 155890
57609A55890n84j38p10j572j664j463j790j979j023L39O46P2q3L40L66k64r10
$$ 155890 155306 155168 154458 152886 151222 149759 147969 145990 144967 145306 145952 146024 145941 146281 146647 146383 145473
57592A45473j397k016k463k159j429j119j306j452j492j720j997k056k134k398
$$ 145473 144076 142060 139597 137438 136009 134890 133584 132132 130640 128920 126923 124867 122733 120335
57578A20335k346j708j232j499j753j115j96k10j113j916k326k694k824k177j098
$$ 120335 117989 116281 115049 113550 111797 110682 110486 110276 109163 107247 104921 102227 99403 97226 96128
57563I6128n77q81j370j481j116m45R3L0l35q4Q28J244O68K30P84J395J012L80
$$ 96128 95551 94670 93300 91819 90703 90258 90351 90381 90046 89962 90790 92034 92702 92932 93716 95111 96123 96503
57545I6503P43J660J872J470J391J492R97L19O17J752K431K259K027K012J542
$$ 96503 97246 98906 100778 102248 103639 105131 106128 106447 107064 108816 111247 113506 115533 117545 119087
57530A19087L61q94j665j909j603q32k19k64n74n74n03p17o73J57J013Q92L18
$$ 119087 119448 118554 116889 114980 113377 112545 112326 112062 111488 110914 110411 109694 109021 109178 110191 111083 111401
57513A11401N28J341J471P18K04M68P93O47M23N80J011J411J494R51nn16k83k57
$$ 111401 111929 113270 114741 115459 115663 116131 116924 117571 117994 118574 119585 120996 122490 123441 123436 122920 122637 122380
57495A22380j178k229k392k218k684l182k532j363j331k285k389j126o6l10j082
$$ 122380 121202 118973 116581 114363 111679 108497 105965 104602 103271 100986 98597 97471 97405 97095 96013
57480I6013j457j666k066k230j790j080m75n8r7p74j406j168n75q05j614j482
$$ 96013 94556 92890 90824 88594 86804 85724 85249 85191 85094 84320 82914 81746 81171 80366 78752 77270
57464G7270q3J075R04M1n44p75o48K48J641K283J597N35J14J04j0N5P23J618K113
$$ 77270 77187 78262 79166 79207 78663 77888 77240 77488 79129 81412 83009 83544 83658 83762 83752 83807 84530 86148 88261
57445H8261K126J838J214M11n9n4o5l90o58n35k42rK21L78K23p4k8K74K48j19
$$ 88261 90387 92225 93439 93850 93791 93737 93672 93282 92624 92089 91847 91838 92059 92437 92660 92586 92558 92832 93080 92961
57425I2961j48L50P82Q61J046J495J599R77P9o28j190j535j170n3J046J479J365
$$ 92961 92813 93163 93945 94806 95852 97347 98946 99923 100002 99374 98184 96649 95479 95426 96472 97951 99316
57408I9316J029N66K50M66R28Q60K78P2M67M97l68j217j147p13q92j349r61L68
$$ 99316 100345 100911 101161 101627 102555 103415 103693 103765 104232 104729 104361 103144 101997 101284 100392 99043 98082 98450
57390I8450J506J663J293J319J952K494K118Q23l66l82P25J874K202J782J185
$$ 98450 99956 101619 102912 104231 106183 108677 110795 111618 111252 110870 111595 113469 115671 117453 118638
57375A18638Q37R21J330J537J043J00m80l41N8K10J91L38P27J143J241P96O9k27
$$ 118638 119475 120396 121726 123263 124306 124406 123926 123585 123643 123853 124044 124382 125109 126252 127493 128289 128358 128131
57357A28131K31Q05P47K83J99N70P98P48Q74J329J751K016K357K632K337J434
$$ 128131 128362 129167 129914 130197 130396 130966 131764 132512 133386 134715 136466 138482 140839 143471 145808 147242
57341A47242M84q8k49pM03L28m17p68L35K130K755J734L62l85q36j267j080n1
$$ 147242 147726 147638 147389 147382 147785 148113 147696 146928 147263 149393 152148 153882 154244 153859 153023 151756 150676 150625
57323A50625Q99R60M80J72J71L75Q60J440J623J530J857K567K594J421On62m66
$$ 150625 151524 152484 152964 153136 153307 153682 154542 155982 157605 159135 160992 163559 166153 167574 167580 167018 166552
57306A66552n16q70j055p97j84N32R66Q79O34Q35J423J795J814J828J738J092
$$ 166552 166036 165166 164111 163314 163130 163662 164628 165507 166141 166976 168399 170194 172008 173836 175574 176666
57290A76666K12KM80P12M59N40J227J714J736K171L265L773K920J856K007L051
$$ 176666 176878 176880 177360 178072 178531 179071 180298 182012 183748 185919 189184 192957 195877 197733 199740 202791
57274B02791L775L937M008L969L650L557M049M335L548K310J994K745L460L417
$$ 202791 206566 210503 214511 218480 222130 225687 229736 234071 237619 239929 241923 244668 248128 251545
57260B51545K843K095J331R35J201J577J164N1n89NJ202J760J206K48r4M42J201
$$ 251545 254388 256483 257814 258749 259950 261527 262691 262742 262153 262158 263360 265120 266326 266574 266480 266922 268123
57243B68123J564J685J907J938J300M12J73N14M88n0j10P27J516J469J102J067
$$ 268123 269687 271372 273279 275217 276517 276929 277102 277616 278104 278054 277944 278671 280187 281656 282758 283825
57227B83825R61K51m83l51M59J065J253J510K127L082M390N883O960P275P362
$$ 283825 284786 285037 284554 284203 284662 285727 286980 288490 290617 293699 298089 303972 310932 318207 325569
57212C25569P912Q706Q873P987O568N580N697O652P322O893N975N795O354O426
$$ 325569 333481 342187 351060 359047 365615 371195 376892 383544 390866 397759 403734 409529 415883 422309
57198D22309N500M515M356M914O078Q282J1202J3291J3650J3284J3484J4043J4163
$$ 422309 427809 432324 436680 441594 447672 455954 467156 480447 494097 507381 520865 534908 549071
57185E49071J4083J4441J4855J4560J3829J3474J3416J2979J2247J1931J2198
$$ 549071 563154 577595 592450 607010 620839 634313 647729 660708 672955 684886 697084
57174F97084J2670J3323J4417J5800J7190J8816K0956K3097K4452K5028K5491
$$ 697084 709754 723077 737494 753294 770484 789300 810256 833353 857805 882833 908324
57163I08324K6247K7322K8775L0477L1918L2929L4133L6075L8394M0477M2340
$$ 908324 934571 961893 990668 1021145 1053063 1085992 1120125 1156200 1194594 1235071 1277411
57152A277411M4151M5530M6269M7068M8641N0566N1951N2843N4038N5857N7962
$$ 1277411 1321562 1367092 1413361 1460429 1509070 1559636 1611587 1664430 1718468 1774325 1832287
57141A832287O0065O2082O4011O6342P0092P5550Q1406Q5972Q8969R1288R3452
$$ 1832287 1892352 1954434 2018445 2084787 2154879 2230429 2311835 2397807 2486776 2578064 2671516
57130B671516R5046R5539R5025R4328R4659R6841J00617J05297J11104J18990
$$ 2671516 2766562 2862101 2957126 3051454 3146113 3242954 3343571 3448868 3559972 3678962
57120C678962J28960J39763J50732J62686J76473J91913K08984K28740K52180
$$ 3678962 3807922 3947685 4098417 4261103 4437576 4629489 4838473 5067213 5319393
57111E319393K79434L11013L48602L93581M46150N07136N79547O67068P72062
$$ 5319393 5598827 5909840 6258442 6652023 7098173 7605309 8184856 8851924 9623986
57102I623986Q96090J040981J207937J396460J605384J834405K084590K359427
$$ 9623986 10520076 11561057 12768994 14165454 15770838 17605243 19689833 22049260
57094B2049260K665830L010750L393882L804341M224603M634291N007979N312657
$$ 22049260 24715090 27725840 31119722 34924063 39148666 43782957 48790936 54103593
57086E4103593N510866N565081N439663N108038M568674L853792L014122K091828
$$ 54103593 59614459 65179540 70619203 75727241 80295915 84149707 87163829 89255657
57078H9255657J110972R2231r31778j919264k831424l637863m314964m845443
$$ 89255657 90366629 90458860 89527082 87607818 84776394 81138531 76823567 71978124
57070G1978124n219596n434584n493705n408595n200307m895258m519693m098338
$$ 71978124 66758528 61323944 55830239 50421644 45221337 40326079 35806386 31708048
57062C1708048l655455l213689k791376k401683k052985j748484j486576j263580
$$ 31708048 28052593 24838904 22047528 19645845 17592860 15844376 14357800 13094220
57054A3094220j076265r21399p94404o90057o04010n32692m72586m20590l74560
$$ 13094220 12017955 11096556 10302152 9612095 9008085 8475393 8002807 7582217 7207657
57045G207657l32884k94422k59334k28800k03113j81108j62018j46579j35465
$$ 7207657 6874773 6580351 6321017 6092217 5889104 5707996 5545978 5399399 5263934
57036E263934j27891j22611j19047j16559j13795j09803j04859r9344r2801q4699
$$ 5263934 5136043 5013432 4894385 4777826 4664031 4554228 4449369 4350025 4257224 4172525
57026D172525p5049o3804n0883l7050k3093q329P021J6783R999j9092o3290j07113
$$ 4172525 4097476 4033672 3982789 3945739 3922646 3914317 3921338 3938121 3948120 3929028 3865738 3758625
57014C758625j38588j54770j58192j52398j41228j28648j16870j05724r4663q4323
$$ 3758625 3620037 3465267 3307075 3154677 3013449 2884801 2767931 2662207 2567544 2483221
57004B483221p5608o8480o2323n6748n1547m6499m1743l7810l5065l3448l2755
$$ 2483221 2407613 2339133 2276810 2220062 2168515 2122016 2080273 2042463 2007398 1973950 1941195
56993A941195l2641l2359l1053k8478k5094k1444j7659j3514q817l892K51K526
$$ 1941195 1908554 1876195 1845142 1816664 1791570 1770126 1752467 1738953 1730136 1726244 1726495 1729021
56981A729021K585O60l249r236j6410k2834k7037k8946k9080k7737k5326k2667
$$ 1729021 1731606 1732266 1729017 1719781 1703371 1680537 1653500 1624554 1595474 1567737 1542411 1519744
56969A519744k0238j7778j5152j2876j1232r566p051l535O98N206R051J1229J2063
$$ 1519744 1499506 1481728 1466576 1453700 1442468 1432902 1425851 1422316 1423014 1428220 1437271 1448500 1460563
56956A460563J3111J4770J4842J0566J566r858k0649k8482l2272l2489l0770k8402
$$ 1460563 1473674 1488444 1503286 1513852 1515418 1505560 1484911 1456429 1424157 1391668 1360898 1332496
56944A332496k5475k1779j7792j4082j0545o996l831j216J679N749J0733J5698
$$ 1332496 1307021 1285242 1267450 1253368 1242823 1235827 1231996 1230780 1232459 1238208 1248941 1264639
56932A264639K0114K3703K5770K5541K2579J6309N984p755k1937l2986l9223m1118
$$ 1264639 1284753 1308456 1334226 1359767 1382346 1398655 1404639 1396884 1374947 1341961 1302738 1261620
56920A261620l9884l6785l3156k9836k6664k3268j9942j7160j4744j2376j0408
$$ 1261620 1221736 1184951 1151795 1121959 1095295 1072027 1052085 1034925 1020181 1007805 997397
56909I97397r317q852q432p931p344o366n089m336m397m198k781q74K00N19J165
$$ 997397 988080 979228 970796 962865 955521 949155 944066 939730 935333 931135 928354 927480 927680 928199 929364
56894I29364K400L693N195P620J0704J3192J4517J5424J6720J8270J9349J9059
$$ 929364 931764 935457 940652 948272 958976 972168 986685 1002109 1018829 1037099 1056448 1075507
56882A075507J6365J0652K659n690j2507j6785j8440j8069j6480j3946j0164n359
$$ 1075507 1091872 1102524 1105183 1099493 1086986 1070201 1051761 1033692 1017212 1003266 993102 987743
56870I87743p48K777N887R836J4736J9642K4027K8243L2745L7688M2926M7642
$$ 987743 986995 989772 995659 1005495 1020231 1039873 1063900 1092143 1124888 1162576 1205502 1253144
56858A253144N0100M8457M1624K9179J1525q935k7612m0239m5551m5013m0593
$$ 1253144 1303244 1351701 1393325 1422504 1434029 1425094 1397482 1357243 1311692 1266679 1226086
56847A226086l3845k6277j8869j1324k947N863J4039K1421K8750L6325M3840N1375
$$ 1226086 1192241 1165964 1147095 1135771 1132824 1138687 1152726 1174147 1202897 1239222 1283062 1334437
56835A334437N9314O7345P4491P9664Q0800P3871N4977K4479j1718m5538p0915
$$ 1334437 1393751 1461096 1535587 1615251 1696051 1769922 1824899 1849378 1837660 1792122 1721207
56824A721207q5351q9350q5403p6741o5928n4391m2932l2067k1900j2360l577
$$ 1721207 1635856 1546506 1461103 1384362 1318434 1264043 1221111 1189044 1167144 1154784 1151207
56813A151207M379J1999J9893K8071L6209M4256N1898N7611N8960N3720M0408
$$ 1151207 1155586 1167585 1187478 1215549 1251758 1296014 1347912 1405523 1464483 1518203 1558611
56802A558611J8810q582l6048n7337o9498p3533p1808o6106n7962m9091m0623
$$ 1558611 1577421 1568839 1532791 1475454 1405956 1332423 1260615 1194509 1136547 1087456 1046833
56791A046833l2655k4971j7636j0783m492J050N909J0748J6079K1314K5306K7611
$$ 1046833 1014178 989207 971571 960788 956296 957346 963255 974003 990082 1011396 1036702 1064313
56779A064313K8194K6134J9848Q825n534k0710l3926m2746m6224m5651m3216l9940
$$ 1064313 1092507 1118641 1138489 1147314 1141780 1121070 1087144 1044398 998174 952523 909307 869367
56767H69367l5741l1053k6888k3368j9715j5940j3188j1993j1493j0881j0358
$$ 869367 833626 802573 775685 752317 732602 716662 703474 691481 679988 669107 658749
56756F58749j0154r686q447o888n761n197m868m499l892l054k477k642l175l204
$$ 658749 648595 638909 630462 623574 617813 612616 607748 603249 599357 596303 593826 591184 588009 584805
56742E84805k631k190k199k240k184k466l018k966j938p78m79j034j744k042j706
$$ 584805 582174 579984 577785 575545 573361 570895 567877 564911 562973 562195 561716 560682 558938 556896 555190
56727E55190q86j54K3n5K48P71P36L3o03q50j202j865k200j727q87l79l88p15
$$ 555190 554304 554150 554173 554118 554366 555137 555873 555906 555303 554453 553251 551386 549186 547459 546572 546193 545805 545090
56709E45090j051r11l1J031J361Q72L27J39ok55l00j33j45k90m0N26O13m2p41
$$ 545090 544039 543128 543097 544128 545489 546361 546688 546827 546821 546566 546266 546133 545988 545698 545658 546184 546797 546755 546014
56690E46014r73j079j354j464j217j080j410j861j977j803j501j016m46j69l03
$$ 546014 545041 543962 542608 541144 539927 538847 537437 535576 533599 531796 530295 529279 528833 528664 528361
56675E28361n29o52p59q26p61q38j354j854j611q32m77p77r84o97m24n54p56p55
$$ 528361 527832 527180 526421 525595 524834 523996 522642 520788 519177 518345 517868 517091 516107 515410 514986 514432 513676 512921
56657E12921p72r01q34n02j54L45J396K658L143K583J791J421J269R90O70M03
$$ 512921 512149 511248 510414 509912 509758 510103 511499 514157 517300 519883 521674 523095 524364 525354 526024 526427
56641E26427J58J89P12J205R81L63J91K57m01j647k181j549p40m53k79L9p2p61
$$ 526427 526585 526774 527486 528691 529672 530035 530226 530483 530082 528435 526254 524705 523965 523512 523233 523272 523200 522439
56623E22439j336j604k273l391l844l095k145k025k555l256m132m770m132k241
$$ 522439 521103 519499 517226 513835 509991 506896 504751 502726 500171 496915 492783 488013 483881 481640
56609D81640p59q96j824k142j766j378j119q78r35j315j354p51j87j59j49L17
$$ 481640 480881 479985 478161 476019 474253 472875 471756 470878 469943 468628 467274 466523 466336 466177 466028 466345
56593D66345Q02R18J038J316J132L68r5N0k63j553k496j778j21Q65Q65N51J19
$$ 466345 467147 468065 469103 470419 471551 471919 471824 471874 471611 470058 467562 465784 465663 466528 467393 467944 468063
56576D68063m84o95n3Q19J112J035J110J105P35N63J047J529J357J178J890L110
$$ 468063 467579 466884 466831 467650 468762 469797 470907 472012 472747 473310 474357 475886 477243 478421 480311 483421
56560D83421L957M594N702P089Q016Q283P892O430L995J878J088R80N52J01K45
$$ 483421 487378 491972 497674 504763 512779 521062 528954 535384 539379 541257 542345 543325 543877 543978 544223
56545E44223K76p49k158k622k355k552l140l031k295k172k970l675l781l906m390
$$ 544223 544499 543750 541592 538970 536615 534063 530923 527892 525597 523425 520455 516780 512999 509093 504703
56530E04703m745m690m546m384l921l376l279l426l069k271j874k117k292j972
$$ 504703 499958 495268 490722 486338 482417 479041 475762 472336 469267 466996 465122 463005 460713 458741
56516D58741j515j234r90q09j033j637k091k037j545p54J68Q06Q23M44J06j20
$$ 458741 457226 455992 455002 454193 453160 451523 449432 447395 445850 445096 445264 446070 446893 447337 447443 447323
56500D47323l25l40j27j66p71j490j755j740j920k278k532k600k340j502n31m89
$$ 447323 446998 446658 446531 446365 445594 444104 442349 440609 438689 436411 433879 431279 428939 427437 426906 426417
56484D26417j412j821p61O00O78k25o96m07p1J89P74J309R60o9o97m64J94Q98
$$ 426417 425005 423184 422423 423023 423701 423476 422780 422373 422302 422491 423265 424574 425534 425465 424768 424304 424498 425396
56466D25396J399J162P2p96l57Q05J175M14m55p38p02p02p94j083j477j424p32
$$ 425396 426795 427957 428029 427233 426876 427681 428856 429270 428815 428077 427375 426673 425879 424796 423319 421895 421163
56449D21163j54k71m54k6L76p3p28m64L65N77J97J08L10K48L37J208J921J023
$$ 421163 421009 420738 420284 420258 420634 420561 419833 419369 419734 420311 420508 420616 420926 421174 421511 422719 424640 425663
56431D25663q58j738j450j779l128l551j861M39J363Q79J21m07p33o85k57P9J35
$$ 425663 424805 423067 421617 419838 416710 413159 411298 411737 413100 413979 414100 413693 412960 412275 412018 412097 412232
56414D12232L69R95J544J708J768J813J409M37n18r39q94n89j41R8k13p70q98
$$ 412232 412601 413596 415140 416848 418616 420429 421838 422275 421757 420818 419924 419335 419194 419292 419079 418309 417411
56397D17411n02p0J88M08M93K49m8k2R1p8k29N5M12L55L23R04J595J520R27O35
$$ 417411 416909 416839 417027 417435 417928 418177 418129 418107 418198 418120 417891 417946 418358 418713 419036 419940 421535 423055 423982 424617
56377D24617N45J65PP79J623J111l13q32o9O20O65R30J584J403j2j259j170l33
$$ 424617 425162 425327 425334 426113 427736 428847 428534 427702 427633 428253 428918 429848 431432 432835 432823 431564 430394 430061
56359D30061K16M78Q38J133J112R63Q63P31O59P16M16o05j521j174J17R58R70
$$ 430061 430277 430755 431593 432726 433838 434801 435664 436395 437054 437770 438186 437581 436060 434886 435003 435961 436931
56342D36931R92J214Q87P8L1J186K363K457J722R73O41R17J641J919J012l12n72
$$ 436931 437923 439137 440024 440102 440133 441319 443682 446139 447861 448834 449475 450392 452033 453952 454964 454652 454080
56325D54080L47J255J657K148K799K884K382K128K278K163J795J938K516K603
$$ 454080 454427 455682 457339 459487 462286 465170 467552 469680 471958 474121 475916 477854 480370 482973
56311D82973K108J882K059J958J620J678J797J205O44J614L609M589M319M647
$$ 482973 485081 486963 489022 490980 492600 494278 496075 497280 497924 499538 503147 507736 512055 516702
56297E16702N991O369M770K867K185K050J593J468K148K613K234K038K775L537
$$ 516702 522693 529062 533832 536699 538884 540934 542527 543995 546143 548756 550990 553028 555803 559340
56283E59340L710M293N840O984O657N968O303P171P614Q149R502J0839J1087J0849
$$ 559340 563050 567343 573183 580167 586824 592792 599095 606266 613880 622029 631531 642370 653457 664306
56269F64306J1282J2190J2846J3632J5227J7076J8276J9236K1001K3598K6361
$$ 664306 675588 687778 700624 714256 729483 746559 764835 784071 805072 828670 855031
56258H55031K9209L2426L5871L9482M3850M9320N5221O0976O7073P4068Q1423
$$ 855031 884240 916666 952537 992019 1035869 1085189 1140410 1201386 1268459 1342527 1423950
56247A423950Q8390R5205J02450J09787J16214J20988J23739J24295J22833J19529
$$ 1423950 1512340 1607545 1709995 1819782 1935996 2056984 2180723 2305018 2427851 2547380
56237B547380J13773J04723R2781P9270O4445M7167K7018N356j6094l6391n4690
$$ 2547380 2661153 2765876 2858657 2937927 3002372 3049539 3076557 3081913 3065819 3029428 2974738
56226B974738p0113q2797r3693j02828j09215j12762j14503j14639j12293j07731
$$ 2974738 2904625 2821828 2728135 2625307 2516092 2403330 2288827 2174188 2061895 1954164
56216A954164j02748r8076r2476q5285p7870p1546o5976o0593n5817n1692m7245
$$ 1954164 1851416 1753340 1660864 1575579 1497709 1426163 1360187 1299594 1243777 1192085 1144840
56205A144840m2227l7844l4788l2188k9377k6781k4412k1504j8473j6976j7023
$$ 1144840 1102613 1064769 1029981 997793 968416 941635 917223 895719 877246 860270 843247
56194H43247j6370j3879j1206r930r389q658q208q171p367n626m678n119m960
$$ 843247 826877 812998 801792 791862 782473 773815 765607 757436 750069 744443 739765 734646 729686
56181G29686k976j025j023j916j841j083p23l80N08J044O52N94J709K536J809
$$ 729686 726710 725685 724662 722746 720905 719822 719099 718719 719227 720271 720923 721517 723226 725762 727571
56166G27571Q69J439K859L757M506N857O920O898P032Q537J0215J0421R837J0106
$$ 727571 728440 729879 732738 736495 741001 746858 753778 760676 767708 776245 786460 796881 806718 816824
56152H16824J1312J2791J4826J7466J9493K0578K2581K6644L1012L3993L6924
$$ 816824 828136 840927 855753 873219 892712 913290 935871 962515 993527 1027520 1064444
56141A064444M1843M8235N4610O1319O9214P7390Q4852R2507J00822J07338J09195
$$ 1064444 1106287 1154522 1209132 1270451 1339665 1417055 1501907 1594414 1695236 1802574 1911769
56130A911769J06349R9903Q9484P5346O1032N0587M4391M0345L7366L4739K9915
$$ 1911769 2018118 2118021 2207505 2282851 2343883 2394470 2438861 2479206 2516572 2551311 2581226
56119B581226K0489P460o166j8690k9311l6460l9715m1996m6888n4898o4613p5498
$$ 2581226 2601715 2609175 2603009 2584319 2555008 2518548 2478833 2436837 2389949 2335051 2270438 2194940
56107B194940q6740r5342r8682r7525r3850q7483p7736o6374n5847m6276l7063
$$ 2194940 2108200 2012858 1914176 1816651 1722801 1635318 1557582 1491208 1435361 1389085 1352022
56096A352022k9430k4380k0246j5383j1136r037p515m736k144j541j209J097L751
$$ 1352022 1322592 1298212 1277966 1262583 1251447 1242410 1234895 1230159 1228015 1226474 1225265 1226362 1230113
56083A230113M132L419M230N681N392M397N310P383Q049P755Q673J0188J0255
$$ 1230113 1234245 1237664 1241894 1247575 1252967 1257364 1262674 1270057 1278106 1285861 1294534 1304722 1314977
56070A314977R734J0852J2848J3554J3725J5368J7475J7866J7580J8819K0472
$$ 1314977 1324711 1335563 1348411 1361965 1375690 1391058 1408533 1426399 1443979 1462798 1483270
56059A483270K0222J9172J9597K0283J9011J7411J8193J9796J9321J8322J9949
$$ 1483270 1503492 1522664 1542261 1562544 1581555 1598966 1617159 1636955 1656276 1674598 1694547
56048A694547K2642K2837K1741K2969K5451K5404K3574K3734K5517K5732K5252
$$ 1694547 1717189 1740026 1761767 1784736 1810187 1835591 1859165 1882899 1908416 1934148 1959400
56037A959400K7492L1260L2384L1460L2717L6066L7559L7026L7898M0143M0765
$$ 1959400 1986892 2018152 2050536 2081996 2114713 2150779 2188338 2225364 2263262 2303405 2344170
56026B344170M0695M3740M9124N2488N3748N6549O0588O2174O1830O3533O7002
$$ 2344170 2384865 2428605 2477729 2530217 2583965 2640514 2701102 2763276 2825106 2888639 2955641
56015B955641O8604O9155P2732P8476Q1930Q3728Q8390R5350J00053J03112J09087
$$ 2955641 3024245 3093400 3166132 3244608 3326538 3410266 3498656 3594006 3694059 3797171 3906258
56004C906258J17140J22541J26558J34683J45840J53879J59207J67977J80266
$$ 3906258 4023398 4145939 4272497 4407180 4553020 4706899 4866106 5034083 5214349
55995E214349J90373J98552K10671K26284K39183K49824K64806K84058L01460
$$ 5214349 5404722 5603274 5813945 6040229 6279412 6529236 6794042 7078100 7379560
55986G379560L18151L41538L71006L98852M25741M60189N02360N44172N86282
$$ 7379560 7697711 8039249 8410255 8809107 9234848 9695037 10197397 10741569 11327851
55977A1327851O38311P01251P67158Q37616R24180J029015J144437J273689J431857
$$ 11327851 11966162 12667413 13434571 14272187 15196367 16225382 17369819 18643508 20075365
55968B0075365J624562J847773K111385K440044K848257L339281L929853M646597
$$ 20075365 21699927 23547700 25659085 28099129 30947386 34286667 38216520 42863117
55960D2863117N493693O455000P534373Q763114J0163087J1735550J3486931J5424900
$$ 42863117 48356810 54811810 62346183 71109297 81272384 93007934 106494865 121919765
55952A21919765J7529693J9777562K2185567K4764065K7422294K9976800L2154549
$$ 121919765 139449458 159227020 181412587 206176652 233598946 263575746 295730295
55945B95730295L3308564L2045735K6546988J5880018J279452j4040529k6618212
$$ 295730295 329038859 361084594 387631582 403511600 404791052 390750523 364132311
55938C64132311l4513481l7726801l7394169l4843424l1162655k7130539k3218337
$$ 364132311 329618830 291892029 254497860 219654436 188491781 161361242 138142905
55931A38142905j9641763j6483183j3778684j1517678r641464q088603o820280
$$ 138142905 118501142 102017959 88239275 76721597 67080133 58991530 52171250
55924E2171250n794276m952313m249565l668447l191916k789786k441323k145901
$$ 52171250 46376974 41424661 37175096 33506649 30314733 27524947 25083624 22937723
55916B2937723j900521j688479j498704j335243j198826j077911r65717q68384
$$ 22937723 21037202 19348723 17850019 16514776 15315950 14238039 13272322 12403938
55908A2403938p88614p17599o49961n91310n44352n01961m60195m24471l96955
$$ 12403938 11615324 10897725 10247764 9656454 9112102 8610141 8149946 7725475 7328520
55899G328520l70783l42360l17089k97658k78531k57061k38612k25532k12133
$$ 7328520 6957737 6615377 6298288 6000630 5722099 5465038 5226426 5000894 4788761
55890D788761j95573j81128j71684j62133j49289j37751j30775j24272j14917
$$ 4788761 4593188 4412060 4240376 4078243 3928954 3791203 3660428 3536156 3421239
55881C421239j05845r9566r3034q4364p7242p4476p3928p4108p6929q1691q3407
$$ 3421239 3315394 3215828 3122794 3038430 2961188 2886712 2812784 2738676 2661747 2580056 2496649
55870B496649q0390p6914p5533p3549o9599o6657o5575o2703n6952n2414n1021
$$ 2496649 2416259 2339345 2263812 2190263 2120664 2054007 1988432 1925729 1868777 1816363 1765342
55859A765342m9335m5659m3445m4466m5250m3699m2765m4000m3818l9895l5432
$$ 1765342 1716007 1670348 1626903 1582437 1537187 1493488 1450723 1406723 1362905 1323010 1287578
55848A287578l3299l1617k8684k6778k7260k7178k4503k1829k1421k1268j9466
$$ 1287578 1254279 1222662 1193978 1167200 1139940 1112762 1088259 1066430 1045009 1023741 1004275
55837A004275j7844j7847j7494j5628j4696j5933j6317j3773j1097j1182j2361
$$ 1004275 986431 968584 951090 935462 920766 904833 888516 874743 863646 852464 840103
55826H40103j1932j0602j0037r570q524q475j0242j1859j2039j2395j3849j4417
$$ 840103 828171 817569 807532 797962 789438 780963 770721 758862 746823 734428 720579 706162
55814G06162j2974j1505j1252j0391p983o282o495o195l808j766k133k819j406
$$ 706162 693188 681683 670431 660040 652057 645775 639280 633085 629277 627511 625378 622559 621153
55801F21153Q16J846K655M624O319O141N259M905L609K60k964l818l612m606o301
$$ 621153 621969 623815 626470 631094 637413 643554 648813 653718 657327 657587 654623 650805 647193 642587 636286
55786F36286p207p789q734q734o823m736m284m654m686n337p225q347o932m188
$$ 636286 629079 621290 612556 603822 596999 592263 587979 583325 578639 573302 566077 557730 550798 546610
55772E46610j640J733O878J1854J4660J6393J8344J8149J2433J829r661j8954
$$ 546610 544970 546703 553581 565435 580095 596488 614832 632981 645414 647243 637582 618628
55760F18628k4973k7171k5989k3549k1401j8808j5151j2117j1159j0766q956o725
$$ 618628 593655 566484 540495 516946 495545 476737 461586 449469 438310 427544 418588 411863
55748D11863o229p041p094o087n283m984m588m221m137l567k089r07r54j173n84
$$ 411863 405634 398593 391499 385412 380129 375145 370557 366336 362199 358632 356543 355636 354682 353509 352925
55733C52925l95j943m153n281n620o249o624n816m742m716n097m675m113m616
$$ 352925 352530 350587 346434 341153 335533 329284 322660 316844 312102 307386 302289 297614 293501 288885
55719B88885n365m783l239k148j347K63K291L484M030N132O805Q012Q384Q064
$$ 288885 283520 278737 275498 273350 272003 272266 274557 278041 282071 287203 294008 302020 310404 318468
55705C18468O649L916Q37j624l829o208p949q428q611r330r616q451o770n899
$$ 318468 325117 329033 329870 328246 324417 318209 310260 301832 293221 283891 274275 265824 259054 253155
55691B53155n437m534l767l746l381j726q5qn66N1J456K015J785J987K562K534
$$ 253155 247718 243184 239417 235671 232290 230564 230479 230471 229905 229956 231412 233427 235212 237199 239761 242295
55675B42295K010J634R37n86j841j766j449k318l463l211k207k149k506j478M97
$$ 242295 244305 245939 246876 246290 244449 242683 241234 238916 235453 232242 230035 227886 225380 223902 224399
55660B24399J318Q20Q44J856K414K051J973K620L015K832K897L330L333K961L035
$$ 224399 225717 226537 227381 229237 231651 233702 235675 238295 241310 244142 247039 250369 253702 256663 259698
55645B59698L230K300L59j136j772k587l849m576m477m517n147n728n984o342
$$ 259698 262928 265228 265587 264451 262679 260092 256243 251667 247190 242673 237526 231798 225814 219472
55631B19472o672o273n317m717m476l737k549j895j953j954j818k207k921l013
$$ 219472 212800 206527 201210 196493 192017 188280 185731 183836 181883 179929 178111 175904 172983 169970
55617A69970k552k555k973k605j241j45m3l20n40j081j842j939j192m87k37O3
$$ 169970 167418 164863 161890 159285 158044 157899 157856 157536 156996 155915 154073 152134 150942 150455 150218 150281
55601A50281L87j08j437k374k212j628j232o83J03K83n42j377j161k42K52j27
$$ 150281 150668 150560 149123 146749 144537 142909 141677 140994 141097 141380 140838 139461 138300 138058 138310 138183
55585A38183q87j326j152o71n14p56o34L21J309J359R51J287K280K673K064J430
$$ 138183 137296 135970 134818 134147 133633 132877 132243 132564 133873 135232 136183 137470 139750 142423 144487 145917
55569A45917J485J831K015K157K260J995J514J411J602J282K23q27j341j646k066
$$ 145917 147402 149233 151248 153405 155665 157660 159174 160585 162187 163469 163692 162865 161524 159878 157812
55554A57812k391k466k473k381j934j337j143j292j145n98l32o77j069r50n20
$$ 157812 155421 152955 150482 148101 146167 144830 143687 142395 141250 140652 140320 139643 138574 137624 137104
55539A37104l14n25r65j260j082n20q6J2K21P94J166Q38L22L14M49j31j356k400
$$ 137104 136790 136265 135300 134040 132958 132438 132352 132364 132585 133379 134545 135383 135705 136019 136468 136337 134981 132581
55521A32581k858k853k321j326o25q07j195p69J67M44j83r36j433j906k137j564
$$ 132581 129723 126870 124549 123223 122598 121791 120596 119827 119994 120438 120255 119319 117886 115980 113843 112279
55505A12279l96N05Q25Q28M72l68j059q90l26l59q83j005o92o12o31o9P55Q55
$$ 112279 111883 112388 113213 114041 114513 114145 113086 112196 111870 111511 110628 109623 108931 108319 107688 107619 108374 109229
55487A09229L48K19L96r6r81p91N81J369O33l60k77L67M70J14J9K55M73O24P04
$$ 109229 109577 109796 110192 110096 109115 108324 108905 110274 110907 110547 110270 110637 111107 111221 111240 111495 111968 112592 113296
55468A13296N25J92O5l7o49j448j333j59P49L74p12j391j340q51k21J29k22r59
$$ 113296 113821 114013 114078 114041 113392 111944 110611 110452 111201 111575 110863 109472 108132 107281 107060 107189 106967 106008
55450A06008j164n50K12O38R07J038O32j87n94k93Q4J32K09M81N02J91J19L94
$$ 106008 104844 104294 104506 105144 106051 107089 107721 107534 106940 106647 106731 106863 107072 107553 108055 108246 108365 108759
55432A08759K79m90j127j091q92r84r03k21N15O31L47K36L65N59Q25J021P70J99
$$ 108759 109038 108548 107421 106330 105438 104454 103551 103330 103845 104476 104823 105059 105424 105983 106808 107829 108599 108798
55414A08798lL15M74J60O3O97J413J335N16l87r99j220j017o90p36j025q72k35
$$ 108798 108795 109110 109584 109744 109807 110504 111917 113252 113768 113381 112382 111162 110145 109455 108719 107694 106822 106587
55396A06587J0m82q14k83L85J10r03j526j235m47L41J012J548J876J965J813J505
$$ 106587 106597 106115 105301 105018 105403 105513 104610 103084 101849 101402 101743 102755 104303 106179 108144 109957 111462
55379A11462J343J480J497Q76n6l94J4L39J11q9K69P22N87L6l05l28n08j132j905
$$ 111462 112805 114285 115782 116658 116602 116208 116222 116561 116672 116583 116852 117574 118161 118197 117892 117564 117056 115924 114019
55360A14019k223j684n89J97J65k13k11R5J17j92m24n22o93p02k56J46j70q10
$$ 114019 111796 110112 109523 109720 109885 109672 109461 109556 109673 109481 109057 108535 107842 107140 106884 107030 106860 106050
55342A06050q66m85n41q77m37P44J352Q55J23k72p64j297q97M76J301P12j73j87
$$ 106050 105184 104699 104158 103281 102844 103588 104940 105795 105918 105646 104882 103585 102688 103164 104465 105177 105004 104817
55324A04817J03k38o49j7J348K060J468R4j194j690j096j3M01j73q32q53n87m99
$$ 104817 104920 104682 104033 104016 105364 107424 108892 108986 107792 106102 105006 104993 105394 105221 104389 103536 102949 102450
55306A02450l57j8J06n2J05N76L77p53j547j009J54Q91J297J697J514M57l65K3
$$ 102450 102093 102075 102181 102129 102234 102810 103187 102434 100887 99878 100032 100923 102220 103917 105431 105888 105523 105546
55288A05546P88P00K69Q39K164K658J721L04o27q75n55l2q7r62j577q27O99J443
$$ 105546 106334 107034 107303 108142 110306 112964 114685 114989 114362 113487 112932 112900 112813 111851 110274 109447 110146 111589
55270A11589J039M55K48K8l81n03j38K58L36K33J63K18N34J031J195P04j4l84
$$ 111589 112628 113083 113331 113359 112978 112475 112337 112595 112931 113164 113327 113545 114079 115110 116305 117009 116995 116611
55252A16611m63n40m53n8J83j11m74l51j31m63j058j117o69m16n36n63k71J26
$$ 116611 116148 115608 115155 115097 115280 115169 114695 114344 114213 113750 112692 111575 110906 110490 109954 109391 109120 109246
55234A09246M58N55J31o26p98M0R53Q28k1n05m12l34m05k55O2J98K80N10M08m33
$$ 109246 109704 110259 110390 109764 108966 109006 109959 110787 110766 110261 109849 109515 109110 108855 108917 109115 109395 109905 110313 109880
55214A09880j245r66P9O54M94M14P06P99N34L84L57p0p67q47m2R30J458J604J435
$$ 109880 108635 107669 107748 108402 108896 109310 110016 110815 111349 111733 112090 112020 111253 110406 110364 111294 112752 114356 115791
55195A15791R10L95L00J39q49k105k136p23O07P29K86K67M84K96j56l24k50k26
$$ 115791 116701 117096 117396 117535 116686 114581 112445 111722 112329 113058 113344 113611 114095 114391 114235 113911 113661 113435
55177A13435j00L55P42M78k85q01o89k80n0p6p8J01K50J23m2L03J135J585R89
$$ 113435 113335 113690 114432 114910 114625 113824 113135 112855 112805 112729 112651 112752 113002 113125 113083 113386 114521 116106 117095
55158A17095j74r36j067r58o70L8Q60J072O46L67O12Q04L97k31l58R1N06M10l8
$$ 117095 116921 115985 114918 113960 113290 113328 114188 115260 115906 116273 116885 117689 118086 117855 117497 117588 118094 118504 118466
55139A18466l33k17Q1K74M24P03Q27L47n12r51p02k76O4O34J307J234K89l25K06
$$ 118466 118133 117916 117997 118271 118695 119398 120225 120572 120060 119109 118407 118131 118195 118829 120136 121370 121659 121334 121540
55120A21540R73Q03M8l68p16j677k533j928j71R81Q02K55J57K19J70L39P78R98
$$ 121540 122513 123316 123364 122996 122280 120603 118070 116142 115971 116952 117754 118009 118166 118385 118555 118894 119672 120670
55102A20670R05Q98Q61K23p21q52J38J196J437J098O92K82p6j26j7j60k95L34
$$ 120670 121575 122473 123334 123557 122836 121984 122122 123318 124755 125853 126545 126827 126751 126625 126608 126448 126153 126487
55084A26487J603K360J959R45k0q10j244r67l38k50p42q73l72q5l88m26L31J051
$$ 126487 128090 130450 132409 133354 133334 132524 131280 130313 129975 129725 128983 128110 127738 127653 127265 126839 127170 128221
55066A28221R05L54K14L57K45o4k60m09n82n21k99m60r40p80L67J436J404O62
$$ 128221 129126 129480 129694 130051 130296 130232 129972 129563 128981 128460 128161 127701 126761 125981 126348 127784 129188 129850
55048A29850N5m15j035j383j024m42k50q9N30R75L20j024j774j541r75m22L11
$$ 129850 129905 129490 128455 127072 126048 125606 125356 125267 125797 126772 127092 126068 124294 122753 121778 121356 121667
55031A21667R87R75M52M15J173J685R32o35j578j162j30J44p12j511q92Q57J965
$$ 121667 122654 123629 124081 124496 125669 127354 128286 127651 126073 124911 124781 124925 124213 122702 121810 122667 124632
55014A24632J402J68j72M93J037Q69M27J30j03j90L54J524K346J889M58o73p08
$$ 124632 126034 126202 126030 126523 127560 128429 128856 128986 128883 128693 129047 130571 132917 134806 135264 134591 133883
54997A33883j22J25j62l55r4J35j30m27K4J071J763J633J124O94L03p2k58m21
$$ 133883 133761 133886 133724 133369 133275 133410 133280 132853 132877 133948 135711 137344 138468 139162 139465 139393 139135 138714
54979A38714r95j743j762p74L17O46L96J59K0r9P1O22J044R62P98J021J319J205
$$ 138714 137719 135976 134214 133440 133757 134403 134799 134958 134978 134879 134950 135572 136616 137578 138376 139397 140716 141921
54961A41921Q30M89j20j258k248k133r90K38R85J327J267O46k32p07n31n9L46
$$ 141921 142751 143240 143120 141862 139614 137481 136491 136729 137714 139041 140308 140954 140722 140015 139484 139425 139771
54944A39771N41M34N0k37n7M46Q28Q72O46K27k38m91n07n06l49M59J767K487K035
$$ 139771 140312 140746 140796 140559 140502 140948 141776 142648 143294 143521 143283 142792 142285 141779 141430 141889 143656 146143 148178
54925A48178J383J728K750L217K883K561K600K631K765L639N005N571M741L418
$$ 148178 149561 151289 154039 157256 160139 162700 165300 167931 170696 174335 179340 184911 189652 193070
54911A93070K550J872P39o43j704k550l643m793n304m931m090l265k718k661l067
$$ 193070 195620 197492 198231 197588 195884 193334 189691 184898 179594 174663 170573 167308 164590 161929 158862
54896A58862l329k736j401k87p1m04m88j40J69J08p5p0P2K53Q02K047L509M082
$$ 158862 155533 152797 151396 151109 151038 150634 150146 150006 150175 150283 150208 150138 150210 150463 151265 153312 156821 160903
54878A60903L323K143J853K710L817M365M505M845N381N322M029J833k53j589
$$ 160903 164226 166369 168222 170932 174749 179114 183619 188464 193845 199167 203196 205029 204776 203187
54864B03187k378l045l576l821m038m562n117n063m384l789l744l900l705l067
$$ 203187 200809 197764 194188 190367 186329 181767 176650 171587 167203 163414 159670 155770 152065 148998
54850A48998k195j310p29p59j195j394j125p95o30k83L12M30m18j498j688r70
$$ 148998 146803 145493 144764 144005 142810 141416 140291 139496 138866 138583 138895 139325 138907 137409 135721 134751
54834A34751k71r2p0J36L59M03L94M48N20O30R01J187J103N34j29m28l15r4n4
$$ 134751 134480 134388 134318 134454 134813 135216 135610 136058 136578 137208 138109 139296 140399 140933 140804 140376 140061 139967 139913
54815A39913k34l84k18K65O81O73K73j74l76k71rJ63J40J12L29O90Q62P96P26
$$ 139913 139679 139295 139077 139342 140023 140696 140969 140795 140419 140148 140139 140302 140442 140554 140883 141573 142435 143231 143957
54796A43957O65L88K6P8O06R91Q34N35N26N25P8n92r31q74p38n39p9N12Q27P07
$$ 143957 144622 145010 145036 145114 145720 146711 147545 148080 148606 149131 149209 148617 147686 146812 146074 145535 145456 145968 146795 147502
54776A47502L35l4l3P61K280L653M021L512K984K970L313L659L893M166M734N565
$$ 147502 147837 147803 147770 148531 150811 154464 158485 161997 164981 167951 171264 174923 178816 182982 187716 193281
54760A93281N961N140L443K310K456K750J626q83l429n122o061o463o350n990
$$ 193281 199242 204382 207825 210135 212591 215341 216967 216084 212655 207533 201472 195009 188659 182669
54746A82669n649m975l544j899j046r65p08m5K01l05p34m70n9j23k53J59P36P67
$$ 182669 177020 172045 168501 166602 165556 164591 163883 163838 164039 163734 163000 162530 162471 162348 162095 162254 162990 163757
54728A63757N04Q49J890K654K420J586J056J216J790K406L035L825M704N236M934
$$ 163757 164261 165110 167000 169654 172074 173660 174716 175932 177722 180128 183163 186988 191692 196928 201862
54713B01862L628J528r05l008m209m565m776n265n492m747l388k561k576k490
$$ 201862 205490 207018 206113 203105 198896 194331 189555 184290 178798 174051 170663 168102 165526 163036
54699A63036j580n21m10j191j805j710j407j396j349o94L77J043Q88K84k71p20
$$ 163036 161456 160935 160525 159334 157529 155819 154412 153016 151667 150973 151350 152393 153281 153565 153294 152574
54683A52574j181j396r95j46N16O71N85N65N33L58J46m6l63q06j051r10o31m73
$$ 152574 151393 149997 149002 148856 149372 150043 150628 151193 151726 152084 152230 152184 151821 151015 149964 149054 148423 147950
54665A47950l53k12k69n94q18p27o67q76q90k09P64J170Q10K39j21k71k23O5M13
$$ 147950 147597 147385 147116 146522 145704 144977 144310 143434 142544 142335 143099 144269 145079 145318 145197 144926 144703 144768 145181
54646A45181N81N75M21n3p04p75J28J148J130K72j61L18Q54O45p9p15j042r92
$$ 145181 145762 146337 146758 146705 146001 145226 145354 146502 147632 147904 147743 148061 148915 149560 149481 148766 147724 146732
54628A46732m39L20N97J52m16n32l83m57p94j007p82j63M50N41L1m52k46M80J035
$$ 146732 146293 146613 147210 147362 146946 146414 146031 145574 144780 143773 142991 142828 143278 143819 143850 143398 143152 143632 144667
54609A44667J156J043O24l17j273j272k88N38M64Q3K24P07Q66O41M69M92N50O25
$$ 144667 145823 146866 147490 147173 145900 144628 144340 144878 145342 145425 145649 146356 147222 147863 148332 148824 149374 149999
54591A49999P65P82N42L10L68N51M97J85j61m63p62r52r11o50k09M36J048J107
$$ 149999 150764 151546 152088 152398 152766 153317 153814 153999 153838 153375 152613 151661 150750 150100 149891 150327 151375 152482
54573A52482L85o09j136r85n48k95m24q14j067p72M8Q57J134Q86N90P27J331J873
$$ 152482 152867 152258 151122 150137 149589 149294 148870 148056 146989 146217 146265 147122 148256 149142 149732 150459 151790 153663
54555A53663J637N13p36j268j123r16q29n07J17O47J003J529K137K081J123J54
$$ 153663 155300 155813 155077 153809 152686 151770 150941 150434 150551 151198 152201 153730 155867 157948 159071 159225
54539A59225P6O05Q49O09M79P77J174J302J219J151J139J054P81L11k81r31j623
$$ 159225 159301 159906 160755 161364 161843 162620 163794 165096 166315 167466 168605 169659 170440 170751 170470 169539 167916
54522A67916k216k341j743o75K72O62L56n35j435j311K59K132K521J089p06j504
$$ 167916 165700 163359 161616 160941 161213 161875 162231 161696 160261 158950 159209 161341 163862 164951 164245 162741
54506A62741j497j539j697j442p68k87l79p61q63l59N47J233J254Q58N82L87j38
$$ 162741 161244 159705 158008 156566 155798 155511 155132 154371 153508 153149 153696 154929 156183 157041 157623 158010 157872
54489A57872p54o01M00J108O28m62j001p07j12L86O40M08l13r28q86l88J58Q93
$$ 157872 157118 156517 156917 158025 158653 158191 157190 156483 156371 156757 157397 157805 157492 156564 155678 155290 155448 156341
54471A56341J978K727K236P50m40m73L69J346J897J689P81j52l59O4L22J8m48
$$ 156341 158319 161046 163282 164032 163592 163119 163488 164834 166731 168420 169201 169049 168690 168754 169076 169094 168646
54454A68646o20n41l81j42R4%n72j321j742j535p08M19J305J567J334R78N95M9
$$ 168646 168026 167485 167104 166962 167056 167056 166484 165163 163421 161886 161178 161597 162902 164469 165803 166781 167376 167425
54436A67425n78j016j271j587j898j790j213o92n69m18K79J204J531J085O07O93
$$ 167425 166847 165831 164560 162973 161075 159285 158072 157380 156811 156393 156672 157876 159407 160492 161099 161792
54420A61792J045J124J097J475K030J903R07p2l32k82n06o80j83O54R98Q39Q12
$$ 161792 162837 163961 165058 166533 168563 170466 171373 171301 170969 170687 170181 169501 169318 169972 170970 171809 172621
54403A72621Q41K33q29j160k94P83J138J041J062J115J096J443K203K429J503
$$ 172621 173462 173695 172866 171706 171412 172195 173333 174374 175436 176551 177647 179090 181293 183722 185225
54388A85225K83j15K3k83r20r24j38N51N60J25m07q82j004o04j57j48j99K64P39
$$ 185225 185508 185393 185416 185133 184213 183289 183151 183702 184262 184387 183980 183098 182094 181490 181333 181185 180986 181250 181989
54369A81989K60q16r86J97J359J234L25n8M64J203J488J181N44M7l1N0j84n63
$$ 181989 182249 181433 180447 180644 182003 183237 183562 183504 183968 185171 186659 187840 188384 188431 188400 188450 188266 187703
54351A87703m07L35P76L65k31q0O70J063O70N0r6L19Q89J296J633K177K877L226
$$ 187703 187296 187631 188407 188772 188541 188461 189131 190194 190864 190914 190818 191137 192026 193322 194955 197132 200009 203235
54333B03235K866K182J919K164K168J295k50j761k726l003k769k494k586k848
$$ 203235 206101 208283 210202 212366 214534 215829 215579 213818 211092 208089 205320 202826 200240 197392
54319A97392k563j531n73o30j541k201j925j182q23r71r87m90P6N6m93r16r11
$$ 197392 194829 193298 192725 192095 190554 188353 186428 185246 184423 183452 182465 181975 182051 182107 181614 180698 179787
54302A79787q15q72p55k41K18N4n16p58m22O2K41O6k81n11l31J77M96M41O41J598
$$ 179787 178972 178100 177345 177104 177322 177376 176860 176102 175680 175742 175983 176049 175768 175257 174926 175103 175599 176040 176681 178279
54282A78279K591K386J002k06l32J41M89P49J120J140L47p65j202o93J07M66K36
$$ 178279 180870 183256 184258 184052 183720 183861 184350 185099 186219 187359 187706 186941 185739 185046 185153 185619 185855
54265A85855k10k96K80J116J346N86n59j176r74l13M46J137J568J542J091M42
$$ 185855 185645 185349 185629 186745 188091 188677 188118 186942 185968 185655 186101 187238 188806 190348 191439 191881
54249A91881k27p41q52m76R1M47N27M78K87j63p22j022j000j019j320j636j541
$$ 191881 191654 190913 190061 189585 189676 190123 190650 191128 191415 191252 190530 189508 188508 187489 186169 184533 182992
54232A82992j016m48j61j57k68l31k01J69N23M58o1m63j69P16J463J498Q34n3
$$ 182992 181976 181528 181367 181210 180942 180611 180410 180579 181102 181560 181499 181036 180867 181583 183046 184544 185378 185325
54214A85325n53k25P04J290Q32j63n88k61q5n11r14p73n34n32n5J421K834K625
$$ 185325 184772 184547 185251 186541 187373 187210 186622 186361 186276 185765 184851 184078 183544 183012 182957 184378 187212 189837
54196A89837R35n55q16l80l9Q8Q0j45k50L49J320J376N8j263j049L59J154K91
$$ 189837 190772 190217 189401 189021 188982 189070 189150 189005 188755 189104 190424 191800 191858 190595 189546 189905 191059 191350
54178A91350j491k783k928k205j165j68N47P30L24l11o70o92p53r90j065q31o81
$$ 191350 189859 187076 184148 181943 180778 180610 181157 181887 182211 181900 181230 180538 179785 178795 177730 176899 176218
54161A76218p69n63J88N91k62j683k055j023R0K28k05l56q3L08O58Q01N47J87
$$ 176218 175449 174886 175074 175665 175403 173720 171665 170642 170732 170960 170755 170399 170316 170624 171282 172083 172630 172817
54143A72817L31R29J225J008J004J594K050J676Q94M66L62J90Q5L40O14L74k11
$$ 172817 173148 174077 175302 176310 177314 178908 180958 182634 183528 183994 184356 184546 184631 184971 185585 185959 185748
54126A85748n14l47JL46O60Q21Q72J112J534J538Q26O9O1N77P67L75j81n84q25
$$ 185748 185234 184887 184888 185234 185894 186715 187587 188699 190233 191771 192597 192666 192727 193304 194071 194446 194265 193681 192856
54107A92856q34o20n36q00r84o24k0K06R1J05K33J29l1K51P86Q05J29n71p94o66
$$ 192856 192022 191402 190866 190066 189082 188458 188438 188644 188735 188840 189073 189202 189171 189422 190208 191013 191142 190571 189777 189111
54087A89111l31K87R06Q90K36k38n0J93k05q97r60j50Q98J548J666J358P59J42
$$ 189111 188780 189067 189973 190863 191099 190861 190811 191004 190799 189902 188942 188792 189690 191238 192904 194262 195021 195163
54069A95163p9K20P00R50R97J234J798K234J939Q54m29j180r40L12J964K929K565
$$ 195163 195084 195304 196004 196954 197951 199185 200983 203217 205156 206010 205581 204401 203461 203773 205737 208666 211231
54052B11231J609J492K534L519L441K885K976L717M236M307M468M908N315N916
$$ 211231 212840 214332 216866 220385 223826 226711 229687 233404 237640 241947 246415 251323 256638 262554
54038B62554P479R950J2068J2959J3270J3985J4731J4071J1243O860K076k282
$$ 262554 270033 279983 292051 305010 318280 332265 346996 361067 372310 379170 381246 378964
54026C78964n685p747q488q353p688o448m705l138k510k670k659k001j413j830
$$ 378964 373279 365532 357044 348691 341003 334555 329850 326712 324202 321532 318873 316872 315459 313629
54012C13629l110m278m808m978n002m622l821l150k959k805k177j384j216j979
$$ 313629 310519 306241 301433 296455 291453 286831 283010 279860 276901 274096 271919 270535 269319 267340
53998B67340l271m456n012m682l704k677j977j541j416j884k722k936j917l40
$$ 267340 264069 259613 254601 249919 246215 243538 241561 240020 238604 236720 233998 231062 229145 228805
53984B28805O93R78R76Q02K98k60m91o66j226j746j466o64m04r31j385j299j140
$$ 228805 229498 230476 231452 232254 232552 232292 231801 231135 229909 228163 226697 226033 225629 224698 223313 222014 220874
53967B20874j178j001o21p99j638j914p44J006J938J987J969J934J300L19Q4Q97
$$ 220874 219696 218695 218074 217275 215637 213723 212979 213985 215923 217910 219879 221813 223113 223432 223516 224413
53951B24413J751J801J466J618K338L025L234K939K292J631J563K449L792M612
$$ 224413 226164 227965 229431 231049 233387 236412 239646 242585 244877 246508 248071 250520 254312 258924
53937B58924M549M268M528N215N604N409N036M820M510L763K753J969J654J762
$$ 258924 263473 267741 272269 277484 283088 288497 293533 298353 302863 306626 309379 311348 313002 314764
53923C14764K257L087L993M707N239N722O111O356O694P336P991Q197Q050Q151
$$ 314764 317021 320108 324101 328808 334047 339769 345880 352236 358930 366266 374257 382454 390504 398655
53909C98655Q731R364R563R229Q359O771M380J452j604m414o522p493p343o681
$$ 398655 407386 416750 426313 435542 443901 450672 455052 456504 454900 450486 443964 436471 429128 422447
53895D22447o218o176o248n962n123m132l728m187m863m929m344l632k849j477
$$ 422447 416229 410053 403805 397843 392720 388588 384860 380673 375810 370881 366537 362905 360056 358579
53881C58579N89K655M150N312O715Q529J0567J2514J3713J3123R956M325k881
$$ 358579 359168 361823 365973 371285 378000 386529 397096 409610 423323 436446 446402 450727 447846
53868D47846j0372j6628k0329k1152j9959j7952j5849j3977j2529j1334r772p483
$$ 447846 437474 420846 400517 379365 359406 341454 325605 311628 299099 287765 277993 270510
53856B70510m958l018k007j765k052k535k700k325j882j928k267k241j725j280
$$ 270510 265552 262534 260527 258762 256710 254175 251475 249150 247268 245340 243073 240832 239107 237827
53842B37827j356j778k081j952j226K9J299J825J315L01l58k64L29R16J176J061
$$ 237827 236471 234693 232612 230660 229434 229463 230762 232587 233902 234203 233845 233581 233910 234826 236002 237063
53826B37063O22m8p56j231j374j311j115o79l6M21M24K95M59O87M70P8M03J618
$$ 237063 237685 237637 236881 235650 234276 232965 231850 231171 231135 231556 231980 232275 232734 233421 233891 233969 234372 235990
53808B35990K822L305L353L393L170K499K029K451L398M044M391M981N635N492
$$ 235990 238812 242117 245470 248863 252033 254532 256561 259012 262410 266454 270845 275826 281461 286953
53794B86953M340L012K335K360K712L008K859K147J389J211J420J243M81k84p39
$$ 286953 291293 294305 296640 299000 301712 304720 307579 309726 311115 312326 313746 314989 315470 315186 314447
53779C14447j227j903k398k650l171l981m146l098j705j181j484j743j806k289
$$ 314447 313220 311317 308919 306269 303098 299117 294971 291873 290168 288987 287503 285760 283954 281665
53765B81665l169l488k733j613j123j384j869k266k570k657k349j873j757k132
$$ 281665 278496 275008 272275 270662 269539 268155 266286 264020 261450 258793 256444 254571 252814 250682
53751B50682k418j981r59j70j69o11p88n31k60j89qM57P58M02m00j003j195j227
$$ 250682 248264 246283 245324 245154 244985 244374 243586 243055 242795 242606 242598 243055 243813 244215 243815 242812 241617 240390
53733B40390j116n59L91J174J487J714K202K545K154J221N55N32P33P21O81J022
$$ 240390 239274 238715 239106 240280 241767 243481 245683 248228 250382 251603 252158 252690 253423 254144 254825 255847
53717B55847J667K095J969J525J300J620K246K543K063J070L78N78J529K602L303
$$ 255847 257514 259609 261578 263103 264403 266023 268269 270812 272875 273945 274323 274901 276430 279032 282335
53702B82335L546L469L207K885K658K686K998L381L508L297L080L194L442L238
$$ 282335 285881 289350 292557 295442 298100 300786 303784 307165 310673 313970 317050 320244 323686 326924
53688C26924K361J232L43k29n61n49k75l28j141k169k412j755j131j195j477j248
$$ 326924 329285 330517 330860 330631 330070 329521 329246 328918 327777 325608 323196 321441 320310 319115 317638 316390
53672C16390n94j38r4k05m37j006j734j981j491q24o12p26n75j0M42L08k52p72
$$ 316390 315796 315658 315564 315359 314922 313916 312182 310201 308710 307886 307274 306548 305973 305963 306405 306713 306461 305689
53654C05689j033j083q67k63N31J064J162J101J098R57N34J91L78Q84J068P43
$$ 305689 304656 303573 302706 302443 302974 304038 305200 306301 307399 308356 308890 309081 309459 310343 311411 312154
53638C12154L84M08P10J016J268J446J436J270J206J331J458J541J773K079J990
$$ 312154 312538 312946 313656 314672 315940 317386 318822 320092 321298 322629 324087 325628 327401 329480 331470
53623C31470J414J063J539K401K728K422K257K724L503M122M495M615M343L755
$$ 331470 332884 333947 335486 337887 340615 343037 345294 348018 351521 355643 360138 364753 369096 372851
53609C72851L296L276L494L623L648L725L878M073M249M109L283J977J064J068
$$ 372851 376147 379423 382917 386540 390188 393913 397791 401864 406113 410222 413505 415482 416546 417614
53595D17614J378J086L39J34Q17J590J672J291R98O96K2p35q69l72j05n86j283
$$ 417614 418992 420078 420417 420551 421368 422958 424630 425921 426919 427615 427637 426902 426033 425661 425556 424970 423687
53578D23687j355o73K54R94J381J280P18K46O35K034L688M594M310L113J618K91
$$ 423687 422332 421659 421913 422907 424288 425568 426286 426532 427167 429201 432889 437483 441793 444906 446524 446815
53562D46815q19j971l224m129m208l633l107k975k883k443j855j583j711j926
$$ 446815 445996 444025 440801 436672 432464 428831 425724 422749 419866 417423 415568 413985 412274 410348
53548D10348j960j734j186l23O14J370K023K818L660M158M238M325M785N431N878
$$ 410348 408388 406654 405468 405145 405759 407129 409152 411970 415630 419788 424026 428351 433136 438567 444445
53533D44445O126O442O789O857O725O992Q023R373J0369J1043J1941J3055J3653
$$ 444445 450571 457013 463802 470659 477384 484376 492399 501772 512141 523184 535125 548180 561833
53520E61833J3397J3050J3571J4860J5966J6356J6448J6858J7749J8979K0436
$$ 561833 575230 588280 601851 616711 632677 649033 665481 682339 700088 719067 739503
53509G39503K1947K3188K3936K4248K4307K4254K4196K4098K3728K2991K2289
$$ 739503 761450 784638 808574 832822 857129 881383 905579 929677 953405 976396 998685
53498I98685K2097K2233K2001K1196K0425K0171K0097J9622J8805J8125J7747
$$ 998685 1020782 1043015 1065016 1086212 1106637 1126808 1146905 1166527 1185332 1203457 1221204
53487A221204J7439J7043J6629J6274J6017J5866J5702J5247J4443J3626J3085
$$ 1221204 1238643 1255686 1272315 1288589 1304606 1320472 1336174 1351421 1365864 1379490 1392575
53476A392575J2689J2124J1289J0181Q706O855M834K734M15k011m041n549p206
$$ 1392575 1405264 1417388 1428677 1438858 1447564 1454419 1459253 1461987 1462402 1460391 1456350 1450801 1443595
53463A443595r513j1901j3425j4085j4629j5310j5732j5847j6225j7156j8257
$$ 1443595 1434082 1422181 1408756 1394671 1380042 1364732 1349000 1333153 1316928 1299772 1281515
53452A281515j9180j9995k0674k0845k0311j9340j8157j6835j5743j5463j5886
$$ 1281515 1262335 1242340 1221666 1200821 1180510 1161170 1143013 1126178 1110435 1094972 1079086
53441A079086j6055j5302j3909j2309j0334p869n610m383m017l595k556r54J010
$$ 1079086 1063031 1047729 1033820 1021511 1011177 1003308 997698 993315 989298 985703 983147 982193 983203
53428I83203L029M542N289N891P186Q973J0289J0909J1746J3460J5406J6539J6862
$$ 983203 986232 990774 996063 1001954 1009140 1018113 1028402 1039311 1051057 1064517 1079923 1096462 1113324
53415A113324J7375J8785K0792K2663K4145K5577K7297K9124L0575L1553L2513
$$ 1113324 1130699 1149484 1170276 1192939 1217084 1242661 1269958 1299082 1329657 1361210 1393723
53404A393723L3801L5117L6058L6943L8557M1027M3586M5612M7332M9132N0768
$$ 1393723 1427524 1462641 1498699 1535642 1574199 1615226 1658812 1704424 1751756 1800888 1851656
53393A851656N1798N2408N3111N3806N3883N3256N2588N2254N1723N0372M8449
$$ 1851656 1903454 1955862 2008973 2062779 2116662 2169918 2222506 2274760 2326483 2376855 2425304
53382B425304M6619M4818M2202L8394L4238L0949K8744K6641K3570J9326J4396
$$ 2425304 2471923 2516741 2558943 2597337 2631575 2662524 2691268 2717909 2741479 2760805 2775201
53371B775201R221L965j152n820j0179j4919k0526k6616l2448l7805m2844m7199
$$ 2775201 2784422 2788387 2787235 2781415 2771236 2756317 2735791 2709175 2676727 2638922 2596078 2548879
53359B548879n0028n1275n2056n3333n4674n4979n4057n2708n1478n0149m8510
$$ 2548879 2498851 2447576 2395520 2342187 2287513 2232534 2178477 2125769 2074291 2024142 1975632
53348A975632m6822m5297m3740m2015m0430l9335l8695l8284l7867l7046l5382
$$ 1975632 1928810 1883513 1839773 1797758 1757328 1717993 1679298 1641014 1603147 1566101 1530719
53337A530719l2985l0577k8548k6437k3723k0740j8245j6391j4747j3130j1803
$$ 1530719 1497734 1467157 1438609 1412172 1388449 1367709 1349464 1333073 1318326 1305196 1293393
53326A293393j0853j0038r276q850r013r731j0865j2164j2994j2575j0745q243
$$ 1293393 1282540 1272502 1263226 1254376 1245363 1235632 1224767 1212603 1199609 1187034 1176289 1168046
53314A168046o059m661l905l389k705j581l9J603K992M000M761N526O516P815
$$ 1168046 1161987 1157326 1153421 1150032 1147327 1145746 1145707 1147310 1150302 1154302 1159063 1164589 1171105 1178920
53300A178920R356J1052J2877J4720J6336J7566J8549J9575K0809K2220K3570
$$ 1178920 1188276 1199328 1212205 1226925 1243261 1260827 1279376 1298951 1319760 1341980 1365550
53289A365550K4432K4490K4082K4036K4622K4894K3687K1114J8491J6792J5680
$$ 1365550 1389982 1414472 1438554 1462590 1487212 1512106 1535793 1556907 1575398 1592190 1607870
53278A607870J4194J1885R022O074L302O70k070n100q348j1613j4719j7353j9060
$$ 1607870 1622064 1633949 1642971 1649045 1652347 1653017 1650947 1645847 1637499 1625886 1611167 1593814 1574754
53265A574754j9869k0695k2476k4929k6824k7564k7779k8140k8437k8284k8085
$$ 1574754 1554885 1534190 1511714 1486785 1459961 1432397 1404618 1376478 1348041 1319757 1291672
53254A291672k8526k9440k9938k9523k8523k7422k6350k5269k4283k3570k3192
$$ 1291672 1263146 1233706 1203768 1174245 1145722 1118300 1091950 1066681 1042398 1018828 995636
53243I95636k3093k3100k2993k2665k2205k1623k0663j9063j7042j5319j4430
$$ 995636 972543 949443 926450 903785 881580 859957 839294 820231 803189 787870 773440
53232G73440j4146j3598j2117r976q157p347p297p366p437p913q872r754j0006
$$ 773440 759294 745696 733579 723603 715446 708099 700802 693436 685999 678086 669214 659460 649454
53219F49454r695r313r293r817j0741j1544j1723j1380j1133j1245j1337j1047
$$ 649454 639759 630446 621153 611336 600595 589051 577328 565948 554815 543570 532233 521186
53207E21186j0533r974r140p942o970o897p538q119q273q249q199p939p461p127
$$ 521186 510653 500679 491539 483597 476627 469730 462192 454073 445800 437551 429352 421413 413952 406825
53193D06825p138p262p217p047o772o037m516k620j440j721l006m004l899l083
$$ 406825 399687 392425 385208 378161 371389 365352 360836 358216 356776 355055 352049 348045 344146 341063
53179C41063k463k338k298k087j936j954j767j072j89L47M22K43n4l88n48m87
$$ 341063 338600 336262 333964 331877 329941 327987 326220 325148 324959 325306 325728 325971 325917 325529 324981 324494
53163C24494n46r87j511j634j422j376j679j970j809j150l82j69r31k278l152
$$ 324494 323948 322961 321450 319816 318394 317018 315339 313369 311560 310410 310028 309859 308928 306650 303498
53148C03498k942k163j674j583j518j547j999k526k271j117pK54r4l40k10J20
$$ 303498 300556 298393 296719 295136 293618 292071 290072 287546 285275 284158 284151 284405 284311 283971 283761 283881
53132B83881M42O10N26K53n9m97j204j828j708q03Q6L37K59M53Q82J104J099J250
$$ 283881 284323 284933 285459 285712 285653 285156 283952 282124 280416 279613 279699 280036 280295 280748 281630 282734 283833 285083
53114B85083J645J853J489O84o3l62k24J5Q9M2j8k87j039k050k698k662k176j538
$$ 285083 286728 288581 290070 290754 290691 290329 290105 290120 290209 290251 290233 289946 288907 286857 284159 281497 279321 277783
53096B77783q73m85p96j601k029j622j012r60j254j152m88L52J223K189K868K647
$$ 277783 276910 276425 275629 274028 271999 270377 269365 268405 267151 265999 265511 265863 267086 269275 272143 274790
53080B74790J644P52N82Q83J083Q90L14l54n12K01J180J284K70p92q21N2R48J333
$$ 274790 276434 277186 277768 278651 279734 280624 280938 280584 280072 280273 281453 282737 283007 282215 281394 281446 282394 283727
53062B83727J160M65n29j191j091p11r07j640j944j293l08J57J56L33Q37J121
$$ 283727 284887 285352 284823 283632 282541 281830 280923 279283 277339 276046 275738 275895 276051 276384 277221 278342
53046B78342Q20K70J0Rk70j102k020k271j635p19l61q14j584j999j793j173m62
$$ 278342 279162 279432 279442 279451 279181 278079 276059 273788 272153 271434 271073 270259 268675 266676 264883 263710 263248
53029B63248J38N23O61O13N37M93L62L6l48m73k74j16l96r46j055k38J110J993
$$ 263248 263386 263909 264570 265183 265720 266213 266575 266611 266263 265790 265516 265400 265004 264058 263003 262765 263875 265868
53011B65868J810R56L37L49N35K90l14o09j94N53R63Q09L99R3P5M92J312J976
$$ 265868 267678 268634 268971 269320 269855 270145 269831 269222 269028 269581 270544 271353 271752 271845 271920 272412 273724 275700
52993B75700J666L15r62j024r6N34K55j68J59R10J072M64m5J85P45R02O10M23
$$ 275700 277366 277681 276719 275695 275599 276133 276388 276220 276379 277289 278361 278825 278780 278965 279710 280612 281222 281645
52975B81645O76J159J557J798J972K119K193K149K008J853J795J842J838J588
$$ 281645 282321 283480 285037 286835 288807 290926 293119 295268 297276 299129 300924 302766 304604 306192
52961C06192J041M18J32M65J179J519Q78m94j645j917j581j413j826k591l202
$$ 306192 307233 307651 307783 308248 309427 310946 311824 311330 309685 307768 306187 304774 302948 300357 297155
52946B97155l306k879k209j627j145n12K86P94O44O5m74r04j435j942k010j582
$$ 297155 293849 290970 288761 287134 285989 285477 285763 286557 287201 287266 286792 285888 284453 282511 280501 278919
52930B78919j049o40j67M65R24R14O10L22K2n46j404k234k601k221j198j01N00
$$ 278919 277870 277230 277063 277528 278452 279366 279976 280298 280320 279774 278370 276136 273535 271314 270116 270015 270515
52913B70515O23P09P95M19m37r41m81M06P47N40N46R50J026L56m47n02K83J225
$$ 270515 271138 271847 272642 273061 272624 271683 271202 271608 272355 272895 273441 274391 275417 275773 275326 274824 275107 276332
52895B76332J588J111J73m70m14j27l35r16r76j69P97J225J248J166O74m18j361
$$ 276332 277920 279031 279204 278734 278320 278193 277858 276942 275966 275797 276594 277819 279067 280233 280907 280489 279128
52878B79128j257m67k16q68j489j262m95P6K63L15L71M52O66J011J269J372J581
$$ 279128 277871 277404 277188 276320 274831 273569 273074 273150 273413 273728 274099 274551 275217 276228 277497 278869 280450
52861B80450J978K141J665Q03K44L35P90J046P33o8q96j400j780k462l283l525
$$ 280450 282428 284569 286234 287037 287281 287616 288406 289452 290185 290117 289221 287821 286041 283579 280296 276771
52845B76771k968k354k363k648k428j664r70o10l60j86l56q06j106j134j140j089
$$ 276771 273803 271449 269086 266438 264010 262346 261376 260766 260406 260220 259864 259058 257952 256818 255678 254589
52829B54589n49N09J424J657J346Q52K27m42p54n14j49j46l97m77l45k71l65n15
$$ 254589 254040 254549 255973 257630 258976 259828 260055 259613 258859 258345 258196 258050 257653 257176 256831 256560 256195 255680
52811B55680o00m04M04J809L142L733L655L381K945K017O87m66j165j680k203
$$ 255680 255080 254676 255080 256889 260031 263764 267419 270800 273745 275762 276449 275983 274818 273138 270935
52796B70935k478k298j966j911k144k315k194j849j456j096p29l40r3j95m94m60
$$ 270935 268457 266159 264193 262282 260138 257823 255629 253780 252324 251228 250499 250159 250066 249871 249377 248917
52780B48917J82R21R77K94l49l14J97N71N65M46M89O43O21K82j17j91O5K25J33
$$ 248917 249099 250020 250997 251291 250942 250628 250825 251396 251961 252407 252896 253539 254160 254442 254325 254134 254199 254424 254557
52761B54557K26Q07J247P05n13j060k73R94J581J387R85N56n8o02n66k2L93L44
$$ 254557 254783 255590 256837 257542 257029 255969 255696 256690 258271 259658 260643 261199 261141 260539 259973 259951 260344 260688
52743B60688P1j78m24n14q5P77J345J140O46O71J214J516J197P72Q37J163J083
$$ 260688 260759 260581 260157 259643 259558 260335 261680 262820 263466 264137 265351 266867 268064 268836 269673 270836 271919
52726B71919N24K16O43J297J245K88q40j364j159n50J34O23O81L27j03l34m46
$$ 271919 272443 272659 273302 274599 275844 276132 275292 273928 272769 272219 272353 272976 273657 273984 273881 273547 273101
52709B73101n91o74n37k96j81k13k82m17p10j052j260j281j029l14P15J260O79
$$ 273101 272510 271836 271299 271003 270822 270609 270327 269910 269200 268148 266888 265607 264578 264264 264979 266239 266918
52692B66918m97j024m79L16N79N71R12J566K034K170K131J801R81K3l70n9L27
$$ 266918 266421 265397 264918 265234 265813 266384 267296 268862 270896 273066 275197 276998 277979 278002 277632 277573 277900
52675B77900K17k78o68o61k80K67O37N84K75J69M43P83R01R13J022J069P66K12
$$ 277900 278117 277839 277171 276510 276230 276497 277134 277718 277993 278162 278605 279388 280289 281202 282224 283293 284059 284271
52657B84271j33J6M87R38J236J497J812K022J804J094L33K0N0k44j217k334k771
$$ 284271 284138 284154 284641 285579 286815 288312 290124 292146 293950 295044 295377 295397 295447 295203 293986 291652 288881
52640B88881k328j436m89M03J056J144O83L02O64J753K874L388L301L191L539
$$ 288881 286553 285117 284628 285031 286087 287231 287914 288216 288880 290633 293507 296895 300196 303387 306926
52625C06926M227M732M711M223L266J585p85l047m254m368m242m475m793m716
$$ 306926 311153 315885 320596 324819 328085 329670 328885 325838 321584 317216 312974 308499 303706 298990
52611B98990m272l720k960j747l06O82P99L01k24l79j86P8J90K20L90O77P74N80
$$ 298990 294718 290998 288038 286291 285985 286667 287466 287767 287543 287164 286978 287056 287246 287466 287856 288533 289307 289887
52593B89887M70P89J306J478J206Q88O88K09q31j893k002q86O27J456J403J169
$$ 289887 290357 291146 292452 293930 295136 296024 296712 296921 296090 294197 292195 291309 291936 293392 294795 295964
52577B95964J323J606J403O56q9m11m12l54l00k78l99o01n78k22J18J26%Q2K09
$$ 295964 297287 298893 300296 300952 300863 300452 300040 299686 299386 299108 298709 298108 297530 297308 297426 297552 297552 297634 297843
52558B97843j00q86j528j394m58O86J260P85m81j657k005j523p09J53J016J642
$$ 297843 297743 296857 295329 293935 293477 294163 295423 296208 295727 294070 292065 290542 289833 289986 291002 292644
52542B92644J648J087N12K85J22m34j383k268k612k202j176k1O62O78M57N75J108
$$ 292644 294292 295379 295891 296176 296298 295864 294481 292213 289601 287399 286223 286202 286864 287542 287999 288574 289682
52525B89682J542J346N67j79l09J94Q62J293J432J372J175J033J260J866K386
$$ 289682 291224 292570 293137 292958 292649 292843 293705 294998 296430 297802 298977 300010 301270 303136 305522
52510C05522K437K209K026J755J178P20J090K121K674J940L18j219k172k597k625
$$ 305522 307959 310168 312194 313949 315127 315847 316937 319058 321732 323672 323990 322771 320599 318002 315377
52495C15377k325j873j442j068q40j009j648k316k415j812r30k05L01P11R41P74
$$ 315377 313052 311179 309737 308669 307829 306820 305172 302856 300441 298629 297699 297494 297795 298506 299447 300221
52479C00221L05J24O98J615J907J281N94P23J395J730J562J506J850K230K434
$$ 300221 300526 300650 301348 302963 304870 306151 306745 307468 308863 310593 312155 313661 315511 317741 320175
52464C20175K707L070L109K711K364K330K161J429L61o55j625k569l095l001k827
$$ 320175 322882 325952 329061 331772 334136 336466 338627 340056 340417 339762 338137 335568 332473 329472 326645
52449C26645l176l804l931l226k045r43l89o26j373j868j635r90n01k97k67m00
$$ 326645 323469 319665 315734 312508 310463 309520 309131 308505 307132 305264 303629 302639 302138 301841 301574 301174
52433C01174m71N3J154J831J292J46l94j17J98J74J28J50j27o97r92p30j91M09
$$ 301174 300703 300756 301910 303741 305033 305179 304785 304668 304866 305040 305168 305318 305191 304494 303502 302772 302581 302990
52415C02990J148J844K125K163K622L633M573N070N490O118O675O972P369Q120
$$ 302990 304138 305982 308107 310270 312892 316525 321098 326168 331658 337776 344451 351423 358792 366912
52401C66912Q901R334R317Q497O100K014k584o255q561r803j0049r162p481n775
$$ 366912 375813 385147 394464 402961 409061 411075 408491 402236 393675 383872 373823 364661 357180 351405
52387C51405m569l943l685l350k438j051L0K96K38N61J154J431J365J417J714
$$ 351405 346836 342893 339208 335858 333420 332369 332399 332695 332933 333494 334648 336079 337444 338861 340575
52372C40575K045K546L510M631N156M912M471M239M008L498K687J525J6j272j570
$$ 340575 342620 345166 348676 353307 358463 363375 367846 372085 376093 379591 382278 383803 383819 382547 380977
52357C80977j000n72p46q01j15O68N61k65p45l99L00R12J514K165K590K666K707
$$ 380977 379977 379405 378659 377858 377743 378411 378972 378707 377962 377563 377863 378775 380289 382454 385044 387710 390417
52340C90417L002L477L929M291M504M507M512M903N700O486P062P785Q934J0127
$$ 390417 393419 396896 400825 405116 409620 414127 418639 423542 429242 435728 442790 450575 459509 469636
52326D69636J0776J0907J1067J1611J2468J3522J4684J5635J5962J5679J5257
$$ 469636 480412 491319 502386 513997 526465 539987 554671 570306 586268 601947 617204
52315F17204J4987J4691J4221J3905J4184J5088J6315J7638J8894J9697J9612
$$ 617204 632191 646882 661103 675008 689192 704280 720595 738233 757127 776824 796436
52304G96436J8703J7645J7108J7129J7208J6890J6100J5009J3770J2492J1263
$$ 796436 815139 832784 849892 867021 884229 901119 917219 932228 945998 958490 969753
52293I69753R983Q231N685K715K00j505k989m809o499p149o815o527o839p203
$$ 969753 979736 987967 993652 996367 996567 995062 992073 987264 980765 973616 966801 960274 953435 946232
52279I46232p010o483o016n319l954k254r10P3J238K647L775M507N414O862Q418
$$ 946232 939222 932739 926723 921404 917450 915196 914286 914359 915597 918244 922019 926526 931940 938802 947220
52264I47220R435R781R736R600R580R814J0225J0656J1221J2151J3195J3625J3097
$$ 947220 956655 966436 976172 985772 995352 1005166 1015391 1026047 1037268 1049419 1062614 1076239 1089336
52251A089336J2146J1527J1337J1075J0266Q724O442L661R06j371l213m979o816
$$ 1089336 1101482 1113009 1124346 1135421 1145687 1154411 1160853 1164514 1165420 1164049 1160836 1155857 1149041
52238A149041q560j0121j1643j3202j4486j5023j4743j4234j4192j4614j4746
$$ 1149041 1140481 1130360 1118717 1105515 1091029 1076006 1061263 1047029 1032837 1018223 1003477
52227A003477j4018j2881j2360j2787j3408j3313j2392j1163j0005q975q132p614
$$ 1003477 989459 976578 964218 951431 938023 924710 912318 901155 891150 882175 874043 866429
52215H66429p334o866n801m068j903L64K284L294L090K170J633K081K830K761
$$ 866429 859095 852229 846428 842360 840457 840821 843105 846399 849489 851659 853292 855373 858203 860964
52201H60964J882J365J848K497K387K002K487L753M563M386M010M072M091L467
$$ 860964 862846 864211 866059 868556 870943 872945 875432 879185 883748 888134 892144 896216 900307 903774
52187I03774K553J959J558R34L14K14M41J78j022k891m919o651p651p740p289
$$ 903774 906327 908286 909844 910778 911092 911306 911747 911925 910903 908012 903093 896442 888791 881051 873762
52172H73762o855o580o255n757n047l977k541j194l66K44J296K770L874M117L971
$$ 873762 866907 860327 854072 848315 843268 839291 836750 835556 835190 835434 836730 839500 843374 847491 851462
52157H51462M183M801N173M748L650K544J988J919J842J513J277J549K207K889
$$ 851462 855645 860446 865619 870367 874017 876561 878549 880468 882310 883823 885100 886649 888856 891745
52143H91745L591M562N610O047N477M274L186K593K323K019J646J674K671M627
$$ 891745 895336 899898 905508 911555 917032 921306 924492 927085 929408 931427 933073 934747 937418 942045
52129I42045O843Q682J0232J1957J3956J5949J7800J9645K1488K3088K4277K5046
$$ 942045 948888 957570 967802 979759 993715 1009664 1027464 1047109 1068597 1091685 1115962 1141008
52117A141008K5418K5471K5479K5542K5245K4098K2313K0647J9470J8442J7138
$$ 1141008 1166426 1191897 1217376 1242918 1268163 1292261 1314574 1335221 1354691 1373133 1390271
52106A390271J5527J3749J1964J0525R764R400Q670P363O177N749N653M867K916
$$ 1390271 1405798 1419547 1431511 1442036 1451800 1461200 1469870 1477233 1483410 1489159 1494812 1499679 1502595
52093A502595K09k499m703o401q072j0302j3145j6019j8358k0049k1091k1234
$$ 1502595 1502804 1500305 1495602 1489201 1481129 1470827 1457682 1441663 1423305 1403256 1382165 1360931
52081A360931k0386j8957j7339j5229j2163q575n724m366l961l441k333q82O39
$$ 1360931 1340545 1321588 1304249 1289020 1276857 1268282 1262558 1258192 1254231 1250790 1248457 1247575 1248214
52068A248214K339M408O767R040J0755J1652J1886J1966J2308J2772J2836J2343
$$ 1248214 1250553 1254961 1261728 1270768 1281523 1293175 1305061 1317027 1329335 1342107 1354943 1367286
52056A367286J1852J1971J2469J2509J1799J0936J0453J0005Q941P268N386L231
$$ 1367286 1379138 1391109 1403578 1416087 1427886 1438822 1449275 1459280 1468221 1475489 1480875 1484106
52044A484106M25k805n719q133j0561j3031j4660j4925j4635j4867j5506j5615
$$ 1484106 1484531 1481726 1476007 1467874 1457313 1444282 1429622 1414697 1400062 1385195 1369689 1354074
52032A354074j5003j4430j4382j4474j4284j4073j4274j4742j4954j4720j4345
$$ 1354074 1339071 1324641 1310259 1295785 1281501 1267428 1253154 1238412 1223458 1208738 1194393
52021A194393j4167j4249j4507j4888j5288j5350j4611j3023j1228j0019r490
$$ 1194393 1180226 1165977 1151470 1136582 1121294 1105944 1091333 1078310 1067082 1057063 1047573
52010A047573r042q258p385o807o501o397o828q024r463j0365j0727j1247j2199
$$ 1047573 1038531 1030273 1022888 1016081 1009580 1003183 996355 988331 978868 968503 957776 946529 934330
51997I34330j3077j3453j3515j3500j3125j2002j0245q314o613n486n276n995
$$ 934330 921253 907800 894285 880785 867660 855658 845413 837099 830486 825000 819724 813729
51985H13729p144q218r121r914j0450j0611j0630j0780j0976j1067j1195j1501
$$ 813729 806585 798367 789246 779332 768882 758271 747641 736861 725885 714818 703623 692122
51973F92122j1727j1614j1412j1364j0897r139o228l351j315K57K070M182O219
$$ 692122 680395 668781 657369 646005 635108 625969 619741 616390 615075 615332 617402 621584 627803
51960F27803P872Q748Q382O946N469M673M015K555L65j714l376m954o346o874
$$ 627803 635675 644423 652805 659751 665220 669893 673908 676463 676828 675114 671738 666784 660438 653564
51946F53564o423n765n323m391k159J004L910N814O887P692Q676R970J1182J1569
$$ 653564 647141 641376 636053 631662 629503 630507 634417 640231 647118 654810 663486 673456 684638 696207
51932F96207J0692Q836O579M193J675r97l857o891r717j1684j2715j3578j4834
$$ 696207 706899 715735 722314 726507 728182 727185 723328 716437 706720 695036 682321 668743 653909
51919F53909j5928j5976j5070j4065j3294j2275j0684q788o888n003l238j779
$$ 653909 637981 622005 606935 592870 579576 567301 556617 547829 540941 535938 532700 530921
51907E30921m41J119K694L731M345N305O829Q277R340J0570J2130J3000J2281
$$ 530921 530480 531599 534293 538024 542369 547674 554503 562780 572120 582690 594820 607820 620101
51894F20101J0565R073P923O338M242K546J912K213L211M841O547P126N733K549
$$ 620101 630666 639739 647662 654000 658242 660788 662700 664913 668124 672965 679512 686638 692371 694920
51880F94920j632n946r487j1429j1577j0378q209n117j520J433K784K732K205
$$ 694920 693288 687342 677855 666426 654849 644471 636262 631145 629625 631058 633842 636574 638779
51867F38779J635O43j204l766o417q431r313r136q660q750r478r876q797o075
$$ 638779 640414 641057 639853 636087 629670 621239 611926 602790 594130 585380 575902 566026 557229 551154
51853E51154k708jJ455J912J863J543J039N00p0j017k622m514n812o018n494m949
$$ 551154 548446 548445 549900 551812 553675 555218 556257 556757 556687 555670 553048 548534 542722 536704 531210 526261
51837E26261m731m755m832m805m494l772k707j446o8J277K225K398J799P98l09
$$ 526261 521530 516775 511943 507138 502644 498872 496165 494719 494651 495928 498153 500551 502350 503148 502839
51822E02839j524k861m000m500m300l770l169k334j127L0N25M49O16J507K578
$$ 502839 501315 498454 494454 489954 485654 481884 478715 476381 475254 475284 475809 476258 476874 478381 480959
51807D80959K936K371J321J57r73j785k055k132k668l630m162l620k337j034k5
$$ 480959 483895 486266 487587 487744 486771 484986 482931 480799 478131 474501 470339 466719 464382 463348 463323
51792D63323O99J003P50J17o00j319j964k204j845j281j056j109r50n47m41q55
$$ 463323 464022 465025 465775 465892 465292 463973 462009 459805 457960 456679 455623 454514 453564 453017 452576 451721
51776D51721j199p81K84J226J552J575J956K905L972M678N236O306Q022R556R971
$$ 451721 450522 449741 450025 451251 452803 454378 456334 459239 463211 467889 473125 479431 487453 497009 506980
51761E06980R241Q102P058N951M407K254n23l738o776q816r518r310q863q458
$$ 506980 516221 524323 531381 537332 541739 543993 543470 539732 532956 524140 514622 505312 496449 487991
51747D87991p989p252o107m536k722r90M94J733K672L166L327L579M289N481O978
$$ 487991 480002 472750 466643 462107 459385 458395 458889 460622 463294 466460 469787 473366 477655 483136 490114
51732D90114Q508R603R792R100Q064O968N495L420J272j63p13p28m41o4l22j980
$$ 490114 498622 508225 518017 527117 535181 542149 547644 551064 552336 552173 551460 550732 550291 550227 549905 547925
51716E47925m680o877p334o288m786l422k180j167p73j055j462j380p11K64J402
$$ 547925 543245 536368 529034 522746 517960 514538 512358 511191 510418 509363 507901 506521 505810 506074 507476
51701E07476K833M662O614Q030Q157O595L615J97k434l482l010j681j35J370K665
$$ 507476 510309 514971 521585 529615 537772 544367 547982 548179 545745 542263 539253 537572 537437 538807 541472
51686E41472L234K416J4l323o475q552r237q678p276n525l888k549j334L5J504
$$ 541472 544706 547122 547136 543813 537338 528786 519549 510871 503595 498070 494182 491633 490299 490334 491838
51671D91838K530K523J508K28m82l67J99P92J412K339L583M615M772L883K418
$$ 491838 494368 496891 498399 498627 498145 497778 497977 498769 500181 502520 506103 510718 515490 519373 521791
51656E21791R08n50k050l305l661k724o56K093N030P559R188R904R925Q837N629
$$ 521791 522699 522149 520099 516794 513133 510409 509753 511846 516876 524435 533623 543527 553452 562289 567918
51641E67918J10o117j0823j3079j3506j2959j1798j0388r239q292o824m587k466
$$ 567918 568028 561911 551088 538009 524503 511544 499746 489358 480119 471827 465003 460416 457950
51628D57950j505j607j716j045L02J746K833L456L773L909L644K615R17p86j937
$$ 457950 456445 454838 453122 452077 452379 454125 456958 460414 464187 468096 471740 474355 475272 474486 472549
51613D72549k613l138l543l695l700l812m076m321m329l777k411n18J115K102
$$ 472549 469936 466798 463255 459560 455860 452048 447972 443651 439322 435545 433134 432616 433731 435833
51599D35833K945M164N386N984O274P234R062J0915J2129J2872J3292J2811J0795
$$ 435833 438778 442942 448328 454312 460586 467820 476882 487797 499926 512798 526090 538901 549696
51586E49696P463L722M44j735k437j848p26L43J540L310N603Q067J0738J3935
$$ 549696 557159 560881 561325 559590 557153 555305 554579 554922 556462 559772 565375 573442 584180 598115
51572E98115J7466K0533K2602K3931K5023K5961K6646K7367K8620L0254L1244
$$ 598115 615581 636114 658716 682647 707670 733631 760277 787644 816264 846518 877762
51561H77762L0665K8836K7238K7336K9562L3382L7918M2315M5656M6808M4469
$$ 877762 908427 937263 964501 991837 1021399 1054781 1092699 1135014 1180670 1227478 1271947
51550A271947L7566K6048J1491l462j6738k7874l7347m5231n1034n4531n6050
$$ 1271947 1309513 1335561 1347052 1343590 1326852 1298978 1261631 1216400 1165366 1110835 1054785
51539A054785n5937n4345n1666m8506m4995m0686l5468l0082k5373k1414j7882
$$ 1054785 998848 944503 892837 844331 799336 758650 723182 693100 667727 646313 628431
51528F28431j4865j2788j1685j1047j0241q891p025n242m440m877n688n853n431
$$ 628431 613566 600778 589093 578046 567805 558914 551889 546647 542207 537330 531642 525789 520358
51515E20358n227n385n084l870k503k048k519l042l079k950l131l545l761l619
$$ 520358 515131 509746 504662 500792 498289 496241 493722 490680 487601 484651 481520 477975 474214 470595
51501D70595l348l142k880k389j742j092l19P81J922K417K086J769K426L933N202
$$ 470595 467247 464105 461225 458836 457094 456002 455683 456464 458386 460803 462889 464658 467084 471017 476219
51486D76219N538N362N430N754N580M324K201k9j809l221m578n721o053n459m857
$$ 476219 481757 487119 492549 498303 503883 508207 510408 510379 508570 505349 500771 495050 488997 483538 478681
51471D78681n283o560p509p523p195p152p005o017m382l051k487k287j964j492
$$ 478681 473398 466838 459329 451806 444611 437459 430454 424437 420055 417004 414517 412230 410266 408774
51457D08774r86l69L48R27J265J593K102K693L302M178N574P296Q877J0065J0941
$$ 408774 407788 407419 407767 408694 409959 411552 413654 416347 419649 423827 429401 436697 445574 455639 466580
51442D66580J1744J2800J4481J6915J9603K1433K1139J7984J2408O066R52j968
$$ 466580 478324 491124 505605 522520 542123 563556 584695 602679 615087 621153 622105 620137
51430F20137l110l380l300l262l967n968q877j1622j3459j4195j3667j1787r227
$$ 620137 617027 613647 610347 607085 603118 597150 588273 576651 563192 548997 535330 523543 514316
51417E14316p247o447o203n678m880m280l880l277k349j309k21R92K115K730K821
$$ 514316 507069 500622 494419 488741 483861 479581 475701 472424 470075 468766 468545 469537 471652 474382 477203
51402D77203K867L208L633L723L441L252L698M846O173P042P391P760Q757J0626
$$ 477203 480070 483278 486911 490634 494075 497327 501025 505871 512044 519086 526477 534237 542994 553620
51388E53620J3328J6502J9365K1275K2741K5296K9822L5477M0824M5513N0113
$$ 553620 566948 583450 602815 624090 646831 672127 701949 737426 778250 823763 873876
51377H73876N4745N8832O2073O4700O6635O7186O5672O1616N4335M3221K8835
$$ 873876 928621 987453 1049526 1114226 1180861 1248047 1313719 1375335 1429670 1472891 1501726
51366A501726J2937k864j7940l1937m4171n4208o2283o8538p2366p3230p1542
$$ 1501726 1514663 1511799 1493859 1461922 1417751 1363543 1301260 1232722 1160356 1087126 1015584
51355A015584o8148o3354n7270n0707m4855m0026l5418l0236k4566j9186j4969
$$ 1015584 947436 884082 826812 776105 731250 691224 655806 625570 601004 581818 566849
51344E66849j2441j1451j1126j0474r145p504o063n121m764m917n290n556n494
$$ 566849 554408 542957 531831 521357 512212 504708 498645 493524 488760 483843 478553 472997 467503
51331D67503m925l716k094o98L4L46O97J022Q60J14p81j444j922k364k687k720
$$ 467503 462578 458862 456768 456070 456104 456450 457147 458169 459029 459143 458362 456918 454996 452632 449945 447225
51315D47225k516k360k411k381j750m80O32P56J96J03Q40J331N26j044j883j355
$$ 447225 444709 442349 439938 437557 435807 435327 435959 436715 436911 437014 437854 439185 439711 438667 436784 435429
51299D35429j87O59Q83O93L47pm49j184k012k187j256J60J130J685K551L789M581
$$ 435429 435242 435901 436784 437477 437824 437817 437368 436184 434172 431985 430729 430889 432019 433704 436255 440044 444625
51282D44625M550M322M407M279L287J842J043J291J845J734O99p30j869k421k565
$$ 444625 449175 453497 457904 462183 465470 467312 468355 469646 471491 473225 473924 473194 471325 468904 466339
51267D66339k533k268j578n30N45J341J694J505Q43M1o09j155j760k311k601k727
$$ 466339 463806 461538 459960 459430 459975 461316 463010 464515 465358 465399 464790 463635 461875 459564 456963 454236
51251D54236k824k659j996j290j308j975k292j552j95P96Q84K54m74n99R1R40
$$ 454236 451412 448753 446757 445467 444159 442184 439892 438340 438145 438941 439825 440079 439605 439006 439097 440037
51235D40037R73Qj145j636j236j60J167K021J836J002N38O80N78k76j056p36M28
$$ 440037 441010 441018 439873 438237 437001 436841 438008 440029 441865 442867 443405 444085 444663 444387 443331 442595 443023
51218D43023J264J119K88o42j256j346j098r78j056p29M11J773K495K569K614
$$ 443023 444287 445406 445694 445052 443796 442450 441352 440374 439318 438589 439000 440773 443268 445837 448451
51203D48451K755K584K151K158K940L877M093L330K054R27L49K28J14k34n38l94
$$ 448451 451206 453790 455941 458099 461039 464916 469009 472339 474393 475320 475669 475897 476011 475777 475239 474845
51187D74845J65P72J235J536J558J145L82n10j412k112k181j569j040j430k521
$$ 474845 475010 475782 477017 478553 480111 481256 481638 481128 479716 477604 475423 473854 472814 471384 468863
51172D68863l350l538l611l890l866l002j524m0J161J961K083J457P17P02J480
$$ 468863 465513 461975 458364 454474 450608 447606 446082 446042 447203 449164 451247 452704 453421 454123 455603
51157D55603K258K314J759J280J349J805K119J958J450R50O30L55q9o97j257j604
$$ 455603 457861 460175 461934 463214 464563 466368 468487 470445 471895 472845 473475 473830 473741 473044 471787 470183
51141D70183j901k523l521m249l901k495j062n73r49j304r28K30J783L144L714
$$ 470183 468282 465759 462238 457989 454088 451593 450531 449958 449009 447705 446777 447007 448790 451934 455648
51126D55648L328K463J708J120M57j08j03M35Q85Q92P98R69J151Q66J83k79qR59
$$ 455648 458976 461439 463147 464267 464724 464616 464513 464948 465833 466725 467523 468492 469643 470509 470692 470413 470405 471364
51108D71364K136K953L139K878K557K313K005J622J503J915K622L059K940K544
$$ 471364 473500 476453 479592 482470 485027 487340 489345 490967 492470 494385 497007 500066 503006 505550
51094E05550K347K447K459J984J119L07k18n14n05N3R18J210M28p69j349j229
$$ 505550 507897 510344 512803 514787 515906 516213 515995 515481 514976 515029 515947 517157 517585 516816 515467 514238
51078E14238j098j171r78m48k80q83j644j745j134k80N77J420K104K512K849L396
$$ 514238 513140 511969 510991 510543 510263 509380 507736 505991 504857 504577 505154 506574 508678 511190 514039 517435
51062E17435M174N152O447P982R269J0035J0762J1979J3226J3302J1661R086O903
$$ 517435 521609 526761 533208 541190 550459 560494 571256 583235 596461 609763 621424 630510 637413
51049F37413O011O731R037J2455J5907J8081J8291J6940J5073J3295J1212Q063
$$ 637413 643424 650155 659192 671647 687554 705635 723926 740866 755939 769234 780446 788509
51037G88509L866l76l675n887p406q529r492j0804j2894j5520j7921j9558k0244
$$ 788509 792375 791999 788324 782437 775031 766502 757010 746206 733312 717792 699871 680313 660069
51024F60069j9706j7604j4214j0580p661n492l463j220R27K512L549M575N942
$$ 660069 640363 622759 608545 597965 590304 584812 581349 580129 581056 583568 587117 591692 597634
51011E97634P294P919P695P350P585Q253Q718Q876R247J0112J1060J1503J1352
$$ 597634 604928 612847 620542 627892 635477 643730 652448 661324 670571 680683 691743 703246 714598
50998G14598J1049J1178J2101J3640J5143J6134J6816J7565J7997J7247J5313
$$ 714598 725647 736825 748926 762566 777709 793843 810659 828224 846221 863468 878781
50987H78781J3387J2459J2182J1611J0542R431Q489P686P462Q387J0092J1312
$$ 878781 892168 904627 916809 928420 938962 948393 956882 964568 972030 980417 990509 1001821
50975A001821J1319J0677J0304J0426J0918J2077J4375J7757K1828K6534L2083
$$ 1001821 1013140 1023817 1034121 1044547 1055465 1067542 1081917 1099674 1121502 1148036 1180119
50964A180119L8204M4022M8923N3076N6887O0272O2715O3905O4016O3421O2245
$$ 1180119 1218323 1262345 1311268 1364344 1421231 1481503 1544218 1608123 1672139 1735560 1797805
50953A797805O0274N7094N2375M6117L8745L1006K3536J6423R257J804n367j1247
$$ 1797805 1858079 1915173 1967548 2013665 2052410 2083416 2106952 2123375 2132632 2134436 2129069 2117822
50941B117822j5409j8396k0847k2680k3574k4048k5428k8481l2526l6047l7885
$$ 2117822 2102413 2084017 2063170 2040490 2016916 1992868 1967440 1938959 1906433 1870386 1832501
50930A832501l7782l6247l4296l3006l2812l3234l3587l3807l4354l5390l6520
$$ 1832501 1794719 1758472 1724176 1691170 1658358 1625124 1591537 1557730 1523376 1487986 1451466
50919A451466l7312l7658l7554l6894l5712l4360l3074l1624k9622k7193k4955
$$ 1451466 1414154 1376496 1338942 1302048 1266336 1231976 1198902 1167278 1137656 1110463 1085508
50908A085508k3216k1510j9160j6251j3762j2577j2467j2266j1083r209p716p274
$$ 1085508 1062292 1040782 1021622 1005371 991609 979032 966565 954299 943216 934007 926291 919017
50896I19017p516p503o656n238l986l370l181k859k176j424q89l48O17J968L279
$$ 919017 911501 903998 897342 892104 888118 884748 881567 878708 876532 875108 874219 873871 874488 876456 879735
50881H79735M431N754P257Q177P788O509N723O403Q255J0215J1499J2064J2381
$$ 879735 884166 889920 897177 905354 913142 919651 925374 931777 940032 950247 961746 973810 986191
50868I86191J2964J4052J5523J7202J9195K1678K4344K6509K8053K9939L3287
$$ 986191 999155 1013207 1028730 1045932 1065127 1086805 1111149 1137658 1165711 1195650 1228937
50857A228937L8109M3403M8400N3253N8518O4481P1199P8703Q6928R5644J04691
$$ 1228937 1267046 1310449 1358849 1412102 1470620 1535101 1606300 1685003 1771931 1867575 1972266
50846A972266J13895J22676J30182J36106J40942J45050J47873J48606J47203
$$ 1972266 2086161 2208837 2339019 2475125 2616067 2761117 2908990 3057596 3204799
50837C204799J44070J38856J30268J17212R9722P8838N6043L2782J0031j1826
$$ 3204799 3348869 3487725 3617993 3735205 3834927 3913765 3969808 4002590 4012621 4000795
50827D000795l2369n0632o5688p7550q6689r2734r4567r1999q6451p9564p1967
$$ 4000795 3968426 3917794 3852106 3774556 3687867 3595133 3500566 3408567 3322116 3242552 3170585
50816C170585o3919n6379n0543m6790m4941m5164m7786n2373n7809o3251o8465
$$ 3170585 3106666 3050287 2999744 2952954 2908013 2862849 2815063 2762690 2704881 2641630 2573165
50805B573165p3249p7255q0358q2599q3777q3625q2253p9769p5646o9278o1316
$$ 2573165 2499916 2422661 2342303 2259704 2175927 2092302 2010049 1930280 1854634 1785356 1724040
50794A724040n3547m7040m1123l4674k7784k1551j6544j2256p911l390P04L590
$$ 1724040 1670493 1623453 1582330 1547656 1519872 1498321 1481777 1469521 1461610 1458220 1458924 1462514
50782A462514M941N150M951M642L869K284J77j745l104m171n522p506r901j2059
$$ 1462514 1467455 1472605 1477556 1482198 1486067 1488351 1488528 1486783 1483679 1479508 1473986 1466480 1456579 1444520
50768A444520j3566j4781j6414j8529k0341k1302k1916k2959k4188k4481k3295
$$ 1444520 1430954 1416173 1399759 1381230 1360889 1339587 1317671 1294712 1270524 1246043 1222748
50757A222748k1375j9773j8642j7282j5073j1965q298m580j371J067L160N705
$$ 1222748 1201373 1181600 1162958 1145676 1130603 1118638 1110340 1105760 1104389 1105456 1108616 1114321
50745A114321Q978J2452J5601J8593K1857K5317K8599L1834L5588L9968M4452
$$ 1114321 1123299 1135751 1151352 1169945 1191802 1217119 1245718 1277552 1313140 1353108 1397560
50734A397560M8760N3289N8317O3404O8048P2376P6527P9904Q1802Q2478Q2690
$$ 1397560 1446320 1499609 1557926 1621330 1689378 1761754 1838281 1918185 1999987 2082465 2165155
50723B165155Q2273Q0196P6090P0863O5394N9346N1706M1906K9973J6107P23j5302
$$ 2165155 2247428 2327624 2403714 2474577 2539971 2599317 2651023 2692929 2722902 2739009 2739732 2724430
50711B724430l0856m4905n6427o4436o8618o9698o8790o6359o2187n6188m8890
$$ 2724430 2693574 2648669 2592242 2527806 2459188 2389490 2320700 2254341 2192154 2135966 2087076
50700B087076m1184l3862k7494k2477j9058j7348j7345j8970k2064k6311l1070
$$ 2087076 2045892 2012030 1984536 1962059 1943001 1925653 1908308 1889338 1867274 1840963 1809893
50689A809893l5413l8690m0933m2470m3124m2241l9521l5414l0589k5431k0197
$$ 1809893 1774480 1735790 1694857 1652387 1609263 1567022 1527501 1492087 1461498 1436067 1415870
50678A415870j5138j0130m635J633Q265J4697K0775K6408L1146L4665L7405L9992
$$ 1415870 1400732 1390602 1385967 1387600 1395865 1410562 1431337 1457745 1488891 1523556 1560961 1600953
50666A600953M2221M3152M2245L9799L6261L1770K6688K1960J8450J6121J4249
$$ 1600953 1643174 1686326 1728571 1768370 1804631 1836401 1863089 1885049 1903499 1919620 1933869
50655A933869J2407J0816R742Q948Q009P026O599P012P819Q506R305J0941J3595
$$ 1933869 1946276 1957092 1966834 1975782 1983791 1990817 1997416 2004428 2012247 2020753 2030058 2040999 2054594
50642B054594J6669J9614K2523K5825K9729L4194L8914M3158M6052M7424M7960
$$ 2054594 2071263 2090877 2113400 2139225 2168954 2203148 2242062 2285220 2331272 2378696 2426656
50631B426656M8195M7803M6337M4215M2254M0602L8934L7575L7249L7169L3930
$$ 2426656 2474851 2522654 2568991 2613206 2655460 2696062 2734996 2772571 2809820 2846989 2880919
50620B880919K3276L556k2153m7246o5237p3197p2359o5883n6346m5297l4187
$$ 2880919 2904195 2907751 2885598 2838352 2773115 2699918 2627559 2561676 2505330 2460033 2425846
50609B425846k4578j7278j2011q265o097n850p557j0987j6038k2719l0731l9332
$$ 2425846 2401268 2383990 2371979 2363714 2357617 2351767 2344210 2333223 2317185 2294466 2263735 2224403
50597B224403m7630n4958o1018o5735o8895p0116o9173o6355o2336n7811n3364
$$ 2224403 2176773 2121815 2060797 1995062 1926167 1856051 1786878 1720523 1658187 1600376 1547012
50586A547012m9403m5826m1938l7112l1628k6435k2120j8478j5152j2172r636
$$ 1547012 1497609 1451783 1409845 1372733 1341105 1314670 1292550 1274072 1258920 1246748 1237112
50575A237112p351n110l089j608o67l4M37Q67J571K849M568O239P569Q763J0239
$$ 1237112 1229761 1224651 1221562 1219954 1219287 1219253 1219690 1220557 1222128 1224977 1229545 1235784 1243353 1252116 1262355
50560A262355J2233J4680J7409K0320K3433K6725K9936L2684L4879L6871L8915
$$ 1262355 1274588 1289268 1306677 1326997 1350430 1377155 1407091 1439775 1474654 1511525 1550440
50549A550440M0583M1058M0153L8649L7312L5825L3265K9630K6286K4702K5173
$$ 1550440 1591023 1632081 1672234 1710883 1748195 1784020 1817285 1846915 1873201 1897903 1923076
50538A923076K7132L0182L4207L8737M3127M7465N2486N8410O4453O9890P4965
$$ 1923076 1950208 1980390 2014597 2053334 2096461 2143926 2196412 2254822 2319275 2389165 2464130
50527B464130Q0177Q5308Q9827R3926R8318J03032J07089J09431J09639J07707
$$ 2464130 2544307 2629615 2719442 2813368 2911686 3014718 3121807 3231238 3340877 3448584
50517C448584J03727R7871R0237Q0515O8187N3325L6780J9445J686j6316l3964
$$ 3448584 3552311 3650182 3740419 3820934 3889121 3942446 3979226 3998671 4000357 3984041 3950077
50506C950077n0380o4976p7575q8003r5710r9851r9798r5646q8198p8303o6331
$$ 3950077 3899697 3834721 3757146 3669143 3573433 3473582 3373784 3278138 3189940 3111637 3045306
50495C045306n2412l7128k1573o815O404J7403K5488L0333L2017L0405K4664J3848
$$ 3045306 2992894 2955766 2934193 2927378 2933782 2951185 2976673 3007006 3039023 3069428 3094092 3107940
50483C107940j955k1136m1286o0365p7323r1768j03273j11244j15415j16183j14268
$$ 3107940 3105985 3084849 3043563 2983198 2905875 2814107 2710834 2599590 2484175 2367992 2253724
50472B253724j10269j04722r8279r1460q4409p7227p0340o3999n7730n0894m3850
$$ 2253724 2143455 2038733 1940454 1848994 1764585 1687358 1617018 1553019 1495289 1444395 1400545
50461A400545l7826l3465l0110k6770k3175j9569j6023j2476r124o194l566r89
$$ 1400545 1362719 1329254 1299144 1272374 1249199 1229630 1213607 1201131 1192007 1185813 1182247 1181258
50449A181258J489L631N388O809P798Q369Q958J0036J1507J2849J3867J4843J5866
$$ 1181258 1182747 1186378 1191766 1198575 1206373 1214742 1223700 1233736 1245243 1258092 1271959 1286802 1302668
50436A302668J6446J5963J4286J1806R072O522M466L059K308K177K705L914N648
$$ 1302668 1319114 1335077 1349363 1361169 1370241 1376763 1381229 1384288 1386596 1388773 1391478 1395392 1401040
50423A401040P606R653J1967J4713J7565J9879K1541K3418K6595L1267L6607M1638
$$ 1401040 1408646 1418299 1430266 1444979 1462544 1482423 1503964 1527382 1553977 1585244 1621851 1663489
50411A663489M5852M9147N1704N4061N6785N9706O1792O2078O0475N7434N3207
$$ 1663489 1709341 1758488 1810192 1864253 1921038 1980744 2042536 2104614 2165089 2222523 2275730
50400B275730M7821M1524L4768K7781K0479J2750M522m444j4383k5053l5651m5276
$$ 2275730 2323551 2365075 2399843 2427624 2448103 2460853 2465375 2460931 2446548 2421495 2385844 2340568
50388B340568n3364n9690o4176o6846o7725o6662o3282n7351m9303m0272l1419
$$ 2340568 2287204 2227514 2163338 2096492 2028767 1962105 1898823 1841472 1792169 1751897 1720478
50377A720478k3123j5036o923O84O935J1421J4189J5131J3908J0520N386j293
$$ 1720478 1697355 1682319 1675396 1676080 1683015 1694436 1708625 1723756 1737664 1748184 1753570 1752277
50365A752277r706j9581k9627l8282m4849m9440n2122n2666n1223m8653m5964
$$ 1752277 1742571 1722990 1693363 1655081 1610232 1560792 1508670 1456004 1404781 1356128 1310164
50354A310164m3576m1282l8786l6199l3959l2335l1018k9361k7062k4394k1720
$$ 1310164 1266588 1225306 1186520 1150321 1116362 1084027 1053009 1023648 996586 972192 950472
50343I50472j9065j6385j3967j2110j0597q884o798m694k887j242M80K180L466
$$ 950472 931407 915022 901055 888945 878348 869464 862666 857972 855085 853843 854323 856503 859969
50330H59969M136M427M829N590O502P214P767Q654J0190J2115J3952J5533J6962
$$ 859969 864105 868532 873361 878951 885453 892667 900434 909088 919278 931393 945345 960878 977840
50317I77840J8266J9397K0359K0953K0458J7925J2935N870k274j0065j5877j8656
$$ 977840 996106 1015503 1035862 1056815 1077273 1095198 1108133 1114003 1111729 1101664 1085787 1067131
50305A067131j8676j7115j4873j2195r426p369o413n880m802l195j937j571j691
$$ 1067131 1048455 1031340 1016467 1004272 994846 987477 981064 975184 970382 967187 965250 963679 961988
50292I61988j572r48j05N06N11j78j279k313k900k878k224j125n0M86K88n60j997
$$ 961988 960416 959468 959363 959869 960380 960202 958923 956610 953710 950832 948608 947483 947433 947919 948207 947647 945650
50275I45650l836n419n871n007l565k279j101L17J753K643K948L168L432L227
$$ 945650 941814 936395 930524 925517 921952 919673 918572 918889 920642 923285 926233 929401 932833 936060
50261I36060K221R03J04J47P32J394J897K317K853L392L298J982k13k171l158
$$ 936060 938281 939184 939288 939435 940167 941561 943458 945775 948628 952020 955318 957300 957087 954916 951758
50246I51758l423l426l113k348j526j111q98k93Q47K291L972N911P699Q957J0186
$$ 951758 948335 944909 941796 939448 937922 936811 935913 935620 936467 938758 942730 948641 956340 965297 975483
50231I75483J2350J5457J8345K0096K1064K2154K3661K5254K6536K7148K6602
$$ 975483 987833 1003290 1021635 1041731 1062795 1084949 1108610 1133864 1160400 1187548 1214150
50220A214150K4669K1842J9117J7217J6130J5348J4469J3570J2895J2101J0126
$$ 1214150 1238819 1260661 1279778 1296995 1313125 1328473 1342942 1356512 1369407 1381508 1391634
50209A391634O156N29n801j2405j9317k5969l1139l4161l5401l5239l3379k9711
$$ 1391634 1397790 1398319 1392518 1380113 1360796 1334827 1303688 1269527 1234126 1198887 1165508 1135797
50197A135797k5070k0481j6155j1843p925n525n740r086j5151k2308k8174l1151
$$ 1135797 1110727 1090246 1074091 1062248 1054323 1048798 1043058 1033972 1018821 996513 968339 937188
50185I37188l1406l0078k7912k5207k2486k0257j8235j5696j2632r856p923o625
$$ 937188 905782 875704 847792 822585 800099 779842 761607 745911 733279 723423 715500 708875
50173G08875n676n146m987m675l773k551j571r40k18R07K185L079L396L491L811
$$ 708875 703199 698053 693066 688391 684618 682067 680496 679556 679338 680245 682430 685509 688905 692396 696207
50158F96207M426N109N794O552P248P686Q111R028J0392J1491J1807J1396J0284
$$ 696207 700633 705742 711536 718088 725336 733022 741133 750161 760553 772044 783851 795247 805531
50145H05531Q251N621L409K091R19r02k989m504n403n975n831m447k343n17J032
$$ 805531 813782 819403 822812 824903 825822 824920 821931 817427 812024 806049 800218 795771 793428 792911 793943
50130G93943L014N211O495O580O482P068Q159R332J0567J1777J2714J3679J5364
$$ 793943 796957 802168 808663 815243 821725 828793 836952 846284 856851 868628 881342 895021 910385
50117I10385J7661J9682K1316K3677K7449L1840L5962M0127M4894M9662N3330
$$ 910385 928046 947728 969044 992721 1020170 1052010 1087972 1128099 1172993 1222655 1275985
50106A275985N5708N7282N7995N7321N5254N2413M9366M6634M4971M4712M4870
$$ 1275985 1331693 1388975 1446970 1504291 1559545 1611958 1661324 1707958 1752929 1797641 1842511
50095A842511M3729M0349L4745K6763J5806K044j2875k6833l8701m8510n6517
$$ 1842511 1886240 1926589 1961334 1988097 2003903 2005947 1993072 1966239 1927538 1879028 1822511
50084A822511o2547o6179o7306o6345o3904o0429n6212n1577m6715m1442l5653
$$ 1822511 1759964 1693785 1626479 1560134 1496230 1435801 1379589 1328012 1281297 1239855 1204202
50073A204202l0004k5623k2951k1372k0141j9150j8516j8103j7862j8012j8344
$$ 1204202 1174198 1148575 1125624 1104252 1084111 1064961 1046445 1028342 1010480 992468 974124
50062I74124j7920j6201j3949j2333j1462j0590r397q256p395o635n920n348m765
$$ 974124 956204 940003 926054 913721 902259 891669 882272 874016 866621 859986 854066 848718 843953
50049H43953l993l412l507l906l604k293p22M02J226K241L681N576P832R892J0892
$$ 843953 839960 836548 833041 829135 825531 823238 822516 822918 824144 826385 830066 835642 843474 853366 864258
50034H64258J0522R414Q511Q321Q832R654J0101R720Q846Q230Q014P624O721N511
$$ 864258 874780 884194 892705 901026 909858 919512 929613 939333 948179 956409 964423 972047 978768 984279
50020I84279L948J596j304l480m052l672l478l598l519l473m263n846p079p114
$$ 984279 988227 989823 988519 985039 980987 977315 973837 970239 966720 963247 958984 953138 946059 938945
50006I38945o189m918l453j746J0J654L407N604Q306J1431J5025J9136K3572K7968
$$ 938945 932756 927838 924385 922639 922649 924303 927710 933314 941620 953051 968076 987212 1010784 1038752
49992A038752L1914L4977L6823L7503L7356L6586L5187L3362L1536K9644K6877
$$ 1038752 1070666 1105643 1142466 1179969 1217325 1253911 1289098 1322460 1353996 1383640 1410517
49981A410517K2623J7490J2887R656P569O114N126M359K939k10n519j2568k0632
$$ 1410517 1433140 1450630 1463517 1473173 1480742 1486856 1491982 1496341 1499280 1499070 1493551 1480983 1460351
49968A460351k9107l7437m4906n0567n3455n3132n0218m6152m2042l7858l3037
$$ 1460351 1431244 1393807 1348901 1298334 1244879 1191747 1141529 1095377 1053335 1015477 982440
49957I82440k7700k2712j8521j4642j0533o375k582R35M337P119Q614R114R635
$$ 982440 954740 932028 913507 898865 888332 881957 879375 880310 884647 891766 900380 909494 919129
49944I19129J0365J0213Q229M956J826l19j585k429l340m876p261r968j2288j4317
$$ 919129 929494 939707 947936 952892 954718 954399 952814 950385 947045 942169 934908 924940 912652 898335
49930H98335j6772j9761k2295k3351k2855k1347j9208j6632j3975j1535r208o805
$$ 898335 881563 861802 839507 816156 793301 771954 752746 736114 722139 710604 701396 694591
49918F94591m541k758j273L76K126L371L842M001M339M740M877M868N270O544
$$ 694591 690050 687292 686019 686395 688521 691892 695734 699735 704074 708814 713691 718559 723829 730373
49904G30373Q683J1165J3148J4069J4304J4898J6358J8003J8801J8512J7523J5841
$$ 730373 739056 750221 763369 777438 791742 806640 822998 841001 859802 878314 895837 911678
49892I11678J3025R159N206K037m40k868n551q391j1361j4396j6875j7887j7390
$$ 911678 924703 933862 939068 941105 940665 937797 932246 923855 912494 898098 881223 863336 845946
49879H45946j6610j6826j7942j8795j8719j8184j7697j6822j4926j2373j0199
$$ 845946 829336 812510 794568 775773 757054 738870 721173 704351 689425 677052 666853
$$ [...]
##END NTUPLES=NMR SPECTRUM
##END=
