##TITLE=AC1478_ZPERCUS304_8101089_t9cD9gReun
##JCAMPDX= 6.0         $$ Bruker NMR JCAMP-DX V2.0
##DATA TYPE= NMR SPECTRUM
##DATA CLASS= NTUPLES
##ORIGIN= BRUKER
##OWNER= Administrator
$$ 1.72 TOPSPIN		Version 2.1
$$ 2013-08-15 17:29:42.334 -0700  Administrator@X
$$ Compression mode = diff/dup
##.OBSERVE FREQUENCY= 400.02188249412
##.OBSERVE NUCLEUS= ^1H
##.ACQUISITION MODE= SIMULTANEOUS (DQD)
##.ACQUISITION SCHEME= undefined
##.AVERAGES= 8
##.DIGITISER RES= 22
##SPECTROMETER/DATA SYSTEM= spect
##.PULSE SEQUENCE= zg30
##.SOLVENT NAME= COFFEE_meoh
##.SHIFT REFERENCE= INTERNAL, COFFEE_meoh, 1, 14.98509
##AUDIT TRAIL= $$ (NUMBER, WHEN, WHO, WHERE, PROCESS, VERSION, WHAT)
$$ ##TITLE= Audit trail, TOPSPIN		Version 2.1
$$ ##JCAMPDX= 5.01
$$ ##ORIGIN= Bruker BioSpin GmbH
$$ ##OWNER= Administrator
$$ $$ E:\/data/COFFEE/nmr/AC1478_ZPERCUS304_8101089_t9cD9gReun/20/pdata/1/auditp.txt
$$ ##AUDIT TRAIL=  $$ (NUMBER, WHEN, WHO, WHERE, PROCESS, VERSION, WHAT)
(   1,<2013-08-15 17:29:35.756 -0700>,<Administrator>,<X>,<go>,<TOPSPIN 2.1>,
      <created by zg
	started at 2013-08-15 17:28:30.099 -0700,
	POWCHK enabled, PULCHK disabled,
       configuration hash MD5:
       C8 4E 4E 5D D3 5C D8 9E 9F 52 82 E0 59 8A DE 15
       data hash MD5: 64K
       F0 AD 95 25 1C A8 67 FE 66 E9 E2 90 A0 69 B8 0C>)
(   2,<2013-08-15 17:29:38.584 -0700>,<Administrator>,<X>,<proc1d>,<TOPSPIN 2.1>,
      <Start of raw data processing
       efp LB = 0 FT_mod = 6 PKNL = 1 PHC0 = 0 PHC1 = 0 SI = 32K 
       data hash MD5: 32K
       1F 8B AF 2F 19 5E C4 5E 5A D3 7E FF 3A C1 DF 08>)
(   3,<2013-08-15 17:29:38.881 -0700>,<Administrator>,<X>,<proc1d>,<TOPSPIN 2.1>,
      <pk PHC0 = 96.41602 PHC1 = 0 
       data hash MD5: 32K
       DA 8E 08 E2 35 09 17 E5 7F 96 FB FE 6E 7D 61 BC>)
(   4,<2013-08-15 17:29:38.974 -0700>,<Administrator>,<X>,<proc1d>,<TOPSPIN 2.1>,
      <abs ABSG = 1 
       data hash MD5: 32K
       86 12 A3 79 5B 94 41 6D DD 39 D6 9B 86 3E 3E 27>)
(   5,<2013-08-15 17:29:39.131 -0700>,<Administrator>,<X>,<proc1d>,<TOPSPIN 2.1>,
      <abs ABSG = 2 
       data hash MD5: 32K
       97 02 11 89 4F B2 A3 D6 BE A0 DC 98 C1 F8 C6 A1>)
(   6,<2013-08-15 17:29:39.209 -0700>,<Administrator>,<X>,<proc1d>,<TOPSPIN 2.1>,
      <abs ABSG = 3 
       data hash MD5: 32K
       12 59 50 65 ED 9A 75 9D C7 13 8A 30 0E B0 25 5C>)
(   7,<2013-08-15 17:29:39.256 -0700>,<Administrator>,<X>,<proc1d>,<TOPSPIN 2.1>,
      <abs ABSG = 4 
       data hash MD5: 32K
       5E C1 31 88 68 27 36 5A 9D 41 20 E3 67 BE 59 D8>)
(   8,<2013-08-15 17:29:39.349 -0700>,<Administrator>,<X>,<proc1d>,<TOPSPIN 2.1>,
      <abs ABSG = 5 
       data hash MD5: 32K
       CD 8A F9 55 21 E0 B1 CD 0F 93 B5 6E DB 4D B7 E8>)
$$ ##END=
$$ 
$$ $$ hash MD5
$$ $$ D6 33 70 6D 72 08 E7 FA F3 24 53 9B AD 5D 3A 1F
##$RELAX= 
##$RELAX= 
##$RELAX= 
##$RELAX= 
##$RELAX= 
##$RELAX= 
##$RELAX= 
$$ Bruker specific parameters
$$ --------------------------
##$DU= <E:\>
##$EXPNO= 20
##$NAME= <AC1478_ZPERCUS304_8101089_t9cD9gReun>
$$ [...]
##$TP= (0..7)
150 150 150 150 150 150 150 150
##$TP07= 0
##$TPNAME0= <>
##$TPNAME1= <>
##$TPNAME2= <>
##$TPNAME3= <>
##$TPNAME4= <>
##$TPNAME5= <>
##$TPNAME6= <>
##$TPNAME7= <>
##$TPOAL= (0..7)
0.5 0.5 0.5 0.5 0.5 0.5 0.5 0.5
##$TPOFFS= (0..7)
0 0 0 0 0 0 0 0
##$TUNHIN= 0
##$TUNHOUT= 0
##$TUNXOUT= 0
##$USERA1= <user>
##$USERA2= <user>
##$USERA3= <user>
##$USERA4= <user>
##$USERA5= <user>
##$V9= 5
##$VALIST= <valist>
##$VCLIST= <CCCCCCCCCCCCCCC>
##$VD= 0
##$VDLIST= <DDDDDDDDDDDDDDD>
##$VPLIST= <PPPPPPPPPPPPPPP>
##$VTLIST= <TTTTTTTTTTTTTTT>
##$WBST= 1024
##$WBSW= 4
##$XGAIN= (0..3)
0 0 0 0
##$XL= 0
##$YL= 0
##$YMAX_a= 638660
##$YMIN_a= -541972
##$ZGOPTNS= <>
##$ZL1= 120
##$ZL2= 120
##$ZL3= 120
##$ZL4= 120
##$ABSF1= 14.98509
##$ABSF2= -5.573092
##$ABSG= 5
##$ABSL= 3
##$ALPHA= 0
##$AQORDER= 0
##$ASSFAC= 0
##$ASSFACI= 0
##$ASSFACX= 0
##$ASSWID= 0
##$AUNMP= <proc_prof1d_extract_pilot.lims>
##$AXLEFT= 0
##$AXNAME= <>
##$AXNUC= <1H>
##$AXRIGHT= 0
##$AXTYPE= 0
##$AXUNIT= <>
##$AZFE= 0.1
##$AZFW= 0.1
##$BCFW= 0
##$BC_mod= 0
##$BYTORDP= 0
##$COROFFS= 0
##$CY= 15
##$DATMOD= 1
##$DC= 0
##$DFILT= <>
##$DTYPP= 0
##$F1P= 0
##$F2P= 0
##$FCOR= 0.5
##$FTSIZE= 32768
##$FT_mod= 6
##$GAMMA= 0
##$GB= 0
##$INTBC= 1
##$INTSCL= 1
##$ISEN= 128
##$LB= 0
##$LEV0= 0
##$LPBIN= 0
##$MAXI= 10000
##$MC2= 0
##$MEAN= 0
##$ME_mod= 0
##$MI= 0
##$NCOEF= 0
##$NC_proc= -8
##$NLEV= 6
##$NOISF1= 0
##$NOISF2= 0
##$NSP= 0
##$NTH_PI= 0
##$NZP= 0
##$OFFSET= 14.98509
##$PC= 1
##$PHC0= 96.41602
##$PHC1= 0
##$PH_mod= 1
##$PKNL= yes
##$PPARMOD= 0
##$PPDIAG= 0
##$PPIPTYP= 0
##$PPMPNUM= 2147483647
##$PPRESOL= 1
##$PSCAL= 4
##$PSIGN= 0
##$PYNMP= <proc.py>
##$REVERSE= no
##$SF= 400.02
##$SI= 32768
##$SIGF1= 0
##$SIGF2= 0
##$SINO= 400
##$SIOLD= 32768
##$SPECTYP= <>
##$SREGLST= <1H.CDCl3>
##$SSB= 0
##$STSI= 32768
##$STSR= 0
##$SW_p= 8223.68421052631
##$SYMM= 0
##$S_DEV= 0
##$TDeff= 65536
##$TDoff= 0
##$TI= <>
##$TILT= no
##$TM1= 0
##$TM2= 0
##$TOPLEV= 0
##$USERP1= <user>
##$USERP2= <user>
##$USERP3= <user>
##$USERP4= <user>
##$USERP5= <user>
##$WDW= 1
##$XDIM= 32768
##$YMAX_p= 448507513
##$YMIN_p= -659847
##$CURPLOT= <Network HP LaserJet P1505>
##$CURPRIN= <$Network HP LaserJet P1505>
##$DFORMAT= <normdp>
##$LAYOUT= <+/1D_H.xwp>
##$LFORMAT= <normlp>
##$PFORMAT= <normpl>
##$SURQMSG= 1
$$ End of Bruker specific parameters
$$ ---------------------------------
##NTUPLES= NMR SPECTRUM
##VAR_NAME=  FREQUENCY,     SPECTRUM/REAL,   SPECTRUM/IMAG
##SYMBOL=    X,             R,               I
##VAR_TYPE=  INDEPENDENT,   DEPENDENT,       DEPENDENT
##VAR_FORM=  AFFN,          ASDF,            ASDF
##VAR_DIM=   32768,         32768,           32768
##UNITS=     HZ,            ARBITRARY UNITS, ARBITRARY UNITS
##FACTOR=    0.250966925370066, 1,           1
##FIRST=     8223.43324360094, -4561,        86211
##LAST=      0,             -164817,         -76874
##MIN=       0,             -659847,         0
##MAX=       8223.43324360094, 448507513,    0
$$ Real data points
##PAGE= N=1
##DATA TABLE= (X++(R..R)), XYDATA
$$ [...]
$$ plain form
19529 -129436 101017 132158 19373 -92723 -15879 72198 -310014 -407058 -130867 177078 -125210
19517 105048 143735 -163840 19064 -158204 854 -105131 -25982 -210881 -78530 -16304 -164298
19506 -164298 154931 179704 -124158 -189643 109198 63323 85684 -277691 -412889 22297
19495 -189433 -25049 83814 -221953 17412 286522 255851 -64369 -305192 -36483 -11832 -35787
19484 -35787 -221429 84839 40840 39033 -215706 -106932 -174173 33657 -158820 -42922 -117747
19473 -117747 -8517 -25824 -151810 -218312 189738 149189 -197224 92505 -51566 -181401 -345328
19462 -345328 129960 -253390 64607 -38852 -146856 -163947 -9704 26374 194686 -309534 -110653
19450 78814 -308635 -10695 -287136 -61646 91541 -153102 -31523 78596 -106384 35651 -109778
$$ packed form
19529a29436A01017L1141A9373i2723a5879G2198c10014r7044a30867A77078a25210
19517A05048L8687a63840A9064a58204H54a05131b5982j84899g8530a6304j47994
19506a64298A54931K4773a24158o5485A09198m5875K2361b77691j35198B2297
19495a89433b5049H3814b21953A7412K69110l0671f4369k40823c6483a1832k3955
19484c5787j85642H4839D0840j807b15706a06932o7241C3657a58820d2922p4825
19473a17747h517j7307j25986o6502A89738m0549a97224I2505e1566j29835j63927
19462c45328A29960b53390F4607c8852j08004j7091i704B6374J68312c09534a10653
19450G8814c08635a0695k76441f1646I1541a53102c1523G8596a06384C5651a09778
$$ plain form
19438 58697 -132471 -18860 804 108809 334732 -48480 203008 157900 -255205 -371433 23786
19426 -124256 -208352 -169299 -4999 -147321 -473624 43874 157254 -36251 -149885 157453 -93478
19414 -341647 -172431 -99402 -208871 -55597 -482156 -78746 -335838 159955 58627 -163466
19403 177713 70818 13573 -145544 118387 -211799 -337221 -315794 -530281 -239670 39732
19392 -36101 159680 14173 7568 34455 -108742 34982 -218517 126407 21871 -358937 318297
19380 50512 -106399 180920 -95774 192898 -270505 -311320 -168444 -326034 65024 127470
19370 127470 -40275 -63425 -414868 195536 145800 -218779 -24023 -377427 -19563 -321232
19360 -321232 121215 -451509 -64583 -86276 3309 -182383 177410 -198356 185657 -257947
$$ packed form
19438E8697a32471a8860H04J08005K25923d8480B03008m5108b55205j16228B3786
19426a24256q4096L9053d999j42322l26303D3874J13380c6251j13634A57453i3478
19414c41647J69216P3029j09469e5597m26559g8746k57092A59955E8627a63466
19403A77713G0818A3573a45544A18387b11799j25422K1427k14487b39670C9732
19392c6101A59680A4173o605K6887a08742C4982b18517A26407B1871c58937C18297
19380E0512a06399A80920i5774A92898b70505m0815J42876j57590F5024O2446
19370A27470d0275k3150l51443A95536m9736b18779b4023l53404a9563l01669
19360c21232A21215d51509f4583k1693C309a82383A77410a98356A85657b57947
$$ plain form
19349 -254110 45161 -85577 -338700 5341 -95791 -180376 -137872 -110118 119318 -88966 -168531
19338 -168531 -59865 -221098 -123966 -170126 59370 46578 -346637 30428 113724 34640 159557
19327 159557 25108 -85129 221575 -313033 17542 28701 -103340 52455 127330 -186041 -259544
19316 -259544 81329 -123919 -135813 -288113 103366 311388 9256 -59234 29188 135791 -11570
19304 -270567 -104430 -369114 -70782 409731 -345973 133537 -359362 -35419 -363069 161720
19293 -111218 -19969 57397 -269826 113938 -131588 281555 -387640 -432722 191146 -44900
19282 125250 -139701 19243 -56401 282968 -49528 -199473 343552 42022 242676 91621
19271 -320905 236506 -169959 -287152 28698 40846 75900 89658 67144 -140781 274857
$$ packed form
19349b54110D5161h5577k53123E341i5791q4585M2504K7754A19318h8966p9565
19338a68531e9865j61233R7132m6160E9370j2792c46637C0428Q3296C4640J24917
19327A59557B5108h5129B21575c13033A7542J1159a03340E2455P4875a86041p3503
19316b59544H1329a23919j1894j52300A03366K08022I256e9234B9188J06603a1570
19304b70567a04430k64684g0782D09731c45973A33537c59362c5419l27650A61720
19293a11218a9969E7397b69826A13938a31588B81555c87640m5082A91146d4900
19282A25250a39701A9243e6401B82968d9528j49945C43552D2022K00654I1621
19271c20905B36506a69959j17193B8698J2148L5054J3758k2514a40781B74857
$$ plain form
19260 55103 78834 -191693 86723 290049 -22375 -163855 -259333 68140 -194300 67035 -240004
19248 -172768 -106187 -164799 -111646 -100255 -98310 -149419 151862 17754 475 -118538 -93739 -237830
19236 -237830 -295409 -360717 -190139 -82325 -327189 53564 -66920 35542 -90479 -84359 -222347
19225 -222347 50389 109837 108843 183739 123765 225394 270334 134611 -46417 -166947 182484
19213 -18875 -185392 -32733 36598 -494895 154964 -128084 -264973 -13438 155364 -64029
19202 33312 -110128 -250309 -158772 -404975 -126173 -218724 -144707 -183260 -2954 -157638 -93658
19191 -93658 -122205 142411 -64958 -36841 -236859 -337487 -12972 -306950 40145 -183468 -112520
19180 -112520 -36053 135098 98175 -110617 238882 -67112 -151577 149056 -239999 -96622
$$ packed form
19260E5103K3731a91693H6723K03326b2375j41480r5478F8140a94300F7035b40004
19248a72768O6581n8612N3153J1391J945n1109A51862A7754D75a18538K4799j44091
19236b37830n7579o5308J70578h2325k44864E3564f6920C5542i0479O120j37988
19225b22347E0389N9448r94P4896n9974J01629M4940A34611d6417j20530A82484
19213a8875j66517c2733C6598d94895A54964a28084j36889a3438A55364f4029
19202C3312a10128j40181R1537k46203a26173r2551P4017l8553b954j54684O3980
19191i3658k8547A42411f4958K8117k00018j00628a2972k93978D0145a83468P0948
19180a12520c6053A35098l6923a10617B38882f7112q4465A49056b39999i6622
$$ plain form
19169 -282769 -246609 41449 164814 -201102 115549 -504758 -69305 34762 -331110 -235344
19159 -235344 -149821 101411 -158490 204311 -223395 -4519 -126042 -159788 -148612 -327901
19149 -327901 252425 -17495 -424828 -163400 176036 35587 -234191 164031 -342270 148293
19138 -86719 -516265 343088 11934 110295 -176885 -266707 57081 92594 -8275 -13914 -100006
19127 -100006 -92363 135834 -73391 67233 203460 -123285 -42082 -345769 -206357 -249602 114007
19115 72381 -68608 -145259 -457964 63396 -338344 17877 -13085 -251919 -135698 -151448 -159808
19104 -159808 43962 67341 160177 -297286 -49198 -177638 306706 -60091 69713 -95904 -250881
19093 -250881 21242 70093 31031 -120617 -192048 137792 366765 -56869 352939 -218540
$$ packed form
19169b82769L6160D1449J23365b01102A15549e04758f9305C4762c31110R5766
19159b35344Q5523A01411a58490B04311b23395d519j21523l3746J1176j79289
19149c27901B52425a7495m07333a63400A76036C5587b34191A64031c42270A48293
19138h6719m29546C43088A1934R8361a76885q9822E7081L5513h275n639q6092
19127a00006P643A35834g3391F7233J36227a23285d2082l03687J39412m3245A14007
19115G2381f8608p6651l12705F3396c38344A7877a3085k38834J16221j5750q360
19104a59808D3962K3379R2836b97286d9198j28440C06706f0091F9713i5904j54977
19093b50881B1242M8851C1031a20617p1431A37792K28973e6869C52939b18540
$$ plain form
19082 -90658 -92301 -6841 178504 462806 -108420 110886 78482 118202 -211737 141801 -156310
19070 397813 39268 -47428 27309 -46731 -27003 -276352 12849 -7651 181167 -189858 128467
19058 -291546 152876 -84844 -156369 -264889 -75846 -279166 -152840 79341 -143445 321161
19047 263236 -69516 120697 96438 -3803 -347258 -139950 275768 -202693 -236239 -112044
19036 228684 -221485 -126329 397251 -64742 -234710 -61128 143652 -105431 294616 -80969
19025 163988 -16952 -78800 39713 322407 -75014 386519 10965 -133051 -181606 76269 -222919
19013 -148843 -248440 189169 -10516 111414 -200957 -53274 -188808 96114 -173597 -249116
19003 -249116 -236551 -45839 -89950 238665 -97136 56708 100870 -27920 -380959 49423 132419
$$ packed form
19082i0658j643f841A78504K84302a08420A10886l2404L9720b11737A41801a56310
19070C97813C9268d7428B7309d6731J9728k49349A2849g651A81167a89858A28467
19058b91546A52876h4844p1525j08520g5846k03320J26326G9341a43445C21161
19047B63236f9516A20697k4259c803l43455a39950B75768b02693l3546a12044
19036B28684b21485R5156C97251f4742j69968f1128A43652a05431B94616h0969
19025A63988a6952o1848C9713K82694g5014C86519A0965a33051m8555G6269b22919
19013a48843r9597A89169a0516A11414b00957e3274j35534I6114a73597p5519
19003b49116J2565d5839m4111B38665i7136E6708M4162b7920l53039D9423Q2996
$$ plain form
18992 132419 -474125 188933 106056 -417331 111984 -297460 87065 -506574 -230253 425120
18981 -68278 12670 -33645 13435 -40788 -244825 -37503 -383110 -259448 93319 -341399 42708
18969 295384 -235459 73819 29629 -261849 -40812 175555 -152618 -70446 -320157 -79772
18958 -99359 134796 25284 -103969 137055 -287572 -52962 -61700 15196 -156421 -175968 45656
18946 37401 193823 58239 287714 -116837 158680 118567 -152457 -226442 58526 75194 3746
18934 -126291 -51978 74483 88901 -391116 -40182 75625 -62924 -94211 95260 23836 -76961
18922 213153 -83624 -99968 -259867 -78470 -309400 -158268 183716 -379217 -6175 -459775
18912 -459775 47129 -162440 -52181 -201300 -287628 -55007 -147378 109109 -115416 -94415 -183105
$$ packed form
18992A32419d74125A88933q2877d17331A11984b97460H7065e06574b30253D25120
18981f8278A2670c3645A3435d0788k04037c7503l45607J23662I3319c41399D2708
18969B95384b35459G3819B9629b61849d0812A75555a52618g0446k49711g9772
18958i9359A34796B5284a03969A37055b87572e2962q738A5196a56421j9547D5656
18946C7401J56422E8239K29475a16837A58680m0113a52457p3985E8526J6668C746
18934a26291e1978G4483J4418c91116d0182G5625f2924l1287I5260B3836g6961
18922B13153h3624j6344j59899g8470k30930J51132A83716c79217f175m53600
18912d59775D7129a62440e2181j49119q6328e5007r2371A09109a15416K1001q8690
$$ plain form
18901 -183105 -120152 -42460 43942 -62003 -475104 -153702 118437 273240 -4504 6362 -323788
18889 -92935 -124771 57601 -17794 -198637 -187211 40685 -207993 -317911 -8598 -47187 -7201
18877 -90094 159746 41391 -126886 60656 190722 107971 -59418 -55251 155521 5911 235630
18866 235630 -228722 74109 10338 -308370 -437359 67228 95705 105026 33965 -189069 108341
18854 367924 147029 -116446 80498 18334 -14098 -143917 -174230 -19160 233019 281528 -174311
18842 31775 -164822 -81574 -210297 24965 -152025 3916 -179273 330445 336202 -54792 -109937
18831 -109937 46753 -103897 -157086 -136411 -32513 -196686 -40235 -124852 -191052 -174564 257547
18819 -429090 43972 -231105 -59182 57588 317633 -52394 159689 470824 148487 217628
$$ packed form
18901a83105O2953d2460D3942f2003m13101a53702A18437J54803d504F362c23788
18889i2935l1836E7601a7794j80843J1426D0685b07993j09918h598l8589g201
18877i0094A59746D1391a26886F0656J30066q2751e9418M167A55521E911K29719
18866B35630b28722G4109A0338c08370j28989F7228K8477R321C3965a89069A08341
18854C67924A47029a16446H0498A8334a4098j29819l0313a9160B33019M8509a74311
18842C1775a64822h1574j28723B4965a52025C916a79273C30445N757e4792n5145
18831a09937D6753a03897n3189K0675c2513j64173d0235q4617o6200J6488B57547
18819d29090D3972b31105e9182E7588K60045e2394A59689L11135A48487O9141
$$ plain form
18809 217628 -75676 159580 226134 -288421 528726 64522 -182753 -34749 -36348 -334383 -192786
18798 -192786 -108308 -12916 87390 -30719 -137831 78167 148138 -32028 -50628 265072 199265
18787 199265 60073 -24591 -53000 -175727 -390273 337059 117687 -90138 -108514 -357976
18777 -357976 118590 -11147 43222 176312 24699 89724 -156196 13292 -65457 -167700 -346202
18766 -346202 -460241 -21463 179614 -288966 173835 -66615 -104385 -66522 -8143 1719 -374238
18754 116830 130863 -89413 -177872 -154348 -235628 -82512 -105133 -211197 -106969 -240500 104608
18742 -421949 97692 290862 -212526 -11079 36123 42344 -187933 123108 43307 -119333 -7489
18730 63317 171547 79433 -86880 -67909 -154786 24401 223730 -379374 43126 65964 117730
$$ packed form
18809B17628g5676A59580O6554b88421E28726F4522a82753c4749j599k98035J41597
18798a92786Q4478a2916H7390c0719j07112G8167O9971c2028j8600B65072o5807
18787A99265F0073b4591k8409j22727k14546C37059A17687i0138j8376k49462
18777c57976A18590a1147D3222J33090B4699O5025a56196A3292f5457j02243j78502
18766c46202j14039b1463A79614b88966A73835f6615l7770L7863h143A719c74238
18754A16830J4033h9413q8459K3524q1280h2512k2621j06064J04228j33531A04608
18742d21949I7692J93170b12526a1079C6123O221a87933A23108D3307a19333g489
18730F3317J08230G9433h6880J8971q6877B4401J99329c79374D3126K2838N1766
$$ plain form
18719 117730 -382906 -7915 -161426 -58721 -7495 -281436 -301806 -209820 83709 -82018 2819
18707 -189291 -6252 138346 -2185 198913 -400041 -113482 -105644 44311 172643 -216675 -136724
18696 -136724 -271075 131199 157163 -14444 -133890 65574 -114417 -179448 -382781 151301
18685 -164092 -256180 -286087 177372 -142936 36469 -62940 -238456 -506 -174905 -29486 -87113
18674 -87113 -125821 16295 166578 -110610 -52230 79489 165743 88346 -29082 -54919 -232658
18663 -232658 -415128 241149 211562 -149785 -44780 -104545 69731 -152183 -122951 82570 217785
18652 217785 61077 -558 77216 -30718 -135592 216136 276273 -103089 74032 -144535 197744
18640 -343216 -357784 -429837 -69431 33310 -191801 -66978 66102 -96550 280340 12467 -220146
$$ packed form
18719A17730c82906g915j53511e8721g495k73941k0370R1986H3709h2018B819
18707a89291f252A38346b185A98913d00041a13482P838D4311J28332b16675P9951
18696a36724j34351A31199K5964a4444j19446F5574a14417o5031k03333A51301
18685a64092r2088k9907A77372a42936C6469f2940j75516e06j74399b9486n7627
18674h7113l8708A6295J50283a10610e2230G9489Q6254p7397b9082k5837j77739
18663b32658j82470B41149k9587a49785d4780n9765F9731a52183K9232H2570J35215
18652B17785F1077e58G7216c0718j04874B16136O0137a03089G4032a44535A97744
18640c43216j4568p2053f9431C3310a91801f6978F6102i6550B80340A2467b20146
$$ plain form
18628 -447615 67148 260356 26305 214544 -286857 -32435 -23733 21187 47888 -10997 -313475
18617 -313475 45378 -235219 -327448 -42199 -54054 157988 -101842 80606 -373165 -933 -254987
18606 -254987 239144 -159464 156887 -71267 22837 195722 -222348 -66180 -5266 -7410 156514
18594 195134 -80523 -170742 211507 -109988 -85857 223920 -232590 -110769 -89762 376930
18583 -43408 -66015 453205 -165211 71343 136729 -353704 84609 -58903 -89347 -239602 162982
18571 -275800 197874 38008 -202671 -73075 -164597 -57744 33543 210046 -131610 26412 54269
18560 54269 34368 -169548 -316037 -91180 187949 -290412 146189 -246475 -53871 91079
18549 -15651 67901 35022 -204710 -169949 -91678 -21070 -9924 234707 249975 -120013 207533
$$ packed form
18628d47615F7148J93208B6305J88239b86857c2435Q702B1187K6701a0997l02478
18617c13475D5378b35219r2229d2199j1855A57988a01842H0606c73165i33k54054
18606b54987B39144a59464A56887g1267B2837J72885b22348f6180e266k144A56514
18594A95134h0523r0219B11507a09988K4131B23920b32590a10769K1007C76930
18583d3408k2607D53205a65211G1343O5386c53704H4609e8903l0444j50255A62982
18571b75800A97874C8008b02671g3075r1522e7744C3543J76503a31610B6412K7857
18560E4269j9901a69548j46489i1180A87949b90412A46189b46475e3871I1079
18549a5651F7901l2879b04710L4761P8271b1070i924B34707J5268a20013B07533
$$ plain form
18537 -135302 -240501 -189865 194442 -75004 -127100 -127776 18777 -108772 39015 -11806 137632
18525 -135229 -51628 23200 -230889 66414 -38332 -301961 114489 68061 87455 -45455 78873
18513 244209 140956 234680 69366 36464 -276521 -234825 211058 -254946 -138815 -307388
18503 -307388 -32092 -114988 -48345 100970 83951 104397 -186428 182495 -159589 118470
18492 211599 -7933 -119554 123519 56209 -244940 -90852 -147064 23566 -18651 -450620 -91078
18480 8227 -273194 45709 203713 211851 -43396 -73818 -553819 -284860 101017 63609 154307
18469 154307 -90962 -85769 111810 93828 52257 -254129 -106481 19258 29223 20928 -249477
18457 -173294 -93186 -369974 -81097 -425297 285939 -55643 -162851 146640 -45045 -48541 395013
$$ packed form
18537a35302j05199N0636A94442g5004n2096o76A8777a08772C9015a1806A37632
18525a35229e1628B3200b30889F6414c8332k63629A14489m6428J9394d5455G8873
18513B44209j03253R3724F9366l2902b76521M1696B11058b54946J16131j68573
18503c07388c2092q2896d8345A00970j7019K0446a86428A82495a59589A18470
18492B11599g933j11621A23519E6209b44940i0852n6212B3566a8651m31969i1078
18480H227b73194D5709J58004Q138d3396l0422m80001K68959A01017l7408R0698
18469A54307i0962N193A11810j7982m1571b54129a06481A9258R965q295b49477
18457a73294Q0108k76788h1097l44200B85939e5643j07208A46640d5045l496C95013
$$ plain form
18445 -279903 -7718 106054 -182285 259605 13332 305601 216399 -102317 -47962 17024 -184228
18433 -97326 -15079 170050 -58375 148254 -241670 106612 135876 -40890 -270030 -155693
18423 -155693 176397 96820 38057 53629 -129256 221220 -16656 59048 -172304 129311
18412 -243479 -158992 -127609 77145 41876 -74332 44879 254603 295621 -107107 94743 90488
18401 90488 99 44009 -145297 70132 29613 -189612 -258394 177673 186223 -141560 -10881 -64681
18389 -64681 -23793 78784 87680 68959 -133447 164249 244219 -7634 -316675 -175018 -155118
18378 -155118 -66995 -263674 -199365 89663 -205241 -108438 -74240 -28902 -245756 401561 -2932
18366 122283 52753 -94164 113539 166355 -135540 9707 70325 -35726 -42920 -54915 14080
$$ packed form
18445b79903g718A06054a82285B59605A3332K92269q9202a02317d7962A7024a84228
18433i7326a5079A70050e8375A48254b41670A06612K9264d0890k29140J14337
18423a55693A76397p9577C8057J5572a29256B21220a6656E9048a72304A29311
18412b43479Q4487L1383G7145l5269g4332D4879K09724M1018a07107I4743m255
18401I0488I9M3910a45297G0132B9613a89612o8782A77673Q550a41560a0881n3800
18389f4681b3793G8784Q896j8721a33447A64249P9970g634l09041J41657J9900
18378a55118f6995j96679O4309H9663b05241R6803L4198b8902k16854D01561b932
18366A22283E2753i4164A13539N2816a35540I707O0618c5726p194j1995A4080
$$ plain form
18354 -141116 -176257 233373 22832 -75745 -260050 160165 -199664 -8919 -116438 -150032 -251788
18343 -251788 62615 2904 151720 36949 -85676 260285 -98405 119118 -108701 216944 171268
18332 171268 -168016 127713 -407290 -125579 -181618 -66251 -52160 285553 -76257 47843
18321 -226306 256009 -5919 -239396 -145157 -20904 -124975 78522 -195407 -107252 -160931 40627
18309 -19009 -358962 -191481 194299 -188503 -286621 -208187 -106609 148600 -107319 -132495
18299 -132495 78330 -45583 -210530 261234 -45820 239534 -215013 -292803 103486 97240 47330
18287 -29180 145885 -47108 247435 82892 76219 -16427 114616 -117164 196037 -166734 61562
18275 -313020 -407489 -47136 122415 -151041 -2197 42742 -17391 -47501 -185628 -290118 65382
$$ packed form
18354a41116l5141B33373B2832g5745j84305A60165a99664h919j07519l3594j01756
18343b51788F2615B904J48816C6949h5676B60285i8405A19118a08701B16944m5676
18332A71268a68016A27713d07290a25579n6039f6251J4091B85553g6257D7843
18321b26306B56009e919k33477R4239b0904j04071G8522a95407Q8155n3679D0627
18309a9009l39953J67481A94299a88503r8118P8434J01578A48600a07319k5176
18299a32495G8330d5583j64947B61234d5820B39534b15013p7790A03486o246D7330
18287b9180A45885d7108B47435H2892o673a6427A14616a17164A96037a66734F1562
18275c13020r4469d7136A22415a51041b197D2742a7391l0110j38127j04490F5382
$$ plain form
18263 484421 -208311 15154 -106468 -335001 -167690 -74461 86899 28256 111598 228763
18253 228763 -141164 115230 199733 -410691 -107186 -96903 -376496 217802 -146993 -174759
18243 -174759 -31105 -477126 -17054 -199222 -222271 -152240 -309647 270219 -91266 -85794 55723
18231 -197145 220090 57195 -93315 -85260 -133715 132350 -267986 -114173 -53413 494822 -98720
18219 18032 -21126 -161173 -157 -77075 -45490 -250805 -120044 291206 459695 64094 -161422
18207 -67689 48713 111397 148446 106767 -150105 11262 1600 -359075 -123533 308811 118671
18195 -9348 -61420 -290726 105530 -263860 -213970 41414 62301 -1079 -23401 -234591 -16498
18183 49964 84959 -172655 336953 84730 -187801 97706 -138071 -37892 -5964 -200454 -230181
$$ packed form
18263D84421b08311A5154a06468k28533J67311g4461H6899B8256Q3342J17165
18253B28763a41164A15230Q4503d10691a07186J0283k79593B17802a46993k7766
18243a74759c1105m46021a7054j82168k3049P0031j57407B70219i1266N472E5723
18231a97145B20090E7195i3315Q055m8455A32350b67986a14173e3413D94822i8720
18219A8032b1126j40047a57p6918L1585k05315a20044B91206J68489F4094a61422
18207f7689D8713O2684L7049m1679a50105A1262A600c59075a23533C08811A18671
18195i348n2072k29306A05530b63860M9890D1414K0887a079k2322k11190a6498
18183D9964L4995a72655C36953H4730a87801I7706a38071c7892e964j94490k9727
$$ plain form
18172 -230181 65716 -238219 87082 -240732 83418 -346261 -372121 -93713 -104310 31137 -93013
18160 167172 208386 22622 -238024 112890 106245 54150 -16100 -219980 -133722 -117944 -406110
18149 -406110 -26880 163977 -8906 -154318 -43274 -87021 -108909 -92972 71738 -112124 -156306
18138 -156306 3522 -38514 -458523 -69962 -10846 82286 60963 -174733 107884 -204809 -67701
18126 -55963 -2053 26110 -66742 236880 55702 -285963 -17478 -37733 -232964 277049 53865
18114 94247 -283040 -281383 71329 -319395 -155652 -400799 -195245 -381124 62748 -22090 75351
18102 -95874 121679 121448 159108 231744 141192 -192127 286575 -32427 13741 -103035 -264735
18091 -264735 71547 174821 -252261 108928 -61839 -200125 147062 76846 -185743 167884
$$ packed form
18172b30181F5716b38219H7082b40732H3418c46261k5860i3713j0597C1137i3013
18160A67172M1214B2622b38024A12890o645n2095a6100k03880Q6258J5778k88166
18149d06110b6880A63977h906j45412d3274m3747k1888J5937G1738a12124m4182
18138a56306C522c8514m20009f9962a0846H2286k1323a74733A07884b04809f7701
18126e5963b053B6110f6742B36880E5702b85963a7478k0255j95231B77049E3865
18114I4247b83040J657G1329c19395a55652k45147a95245j85879F2748b2090G5351
18102i5874A21679k31L7660P2636r0552a92127B86575c2427A3741a03035j61700
18091b64735G1547J03274b52261A08928f1839j38286A47062p0216a85743A67884
$$ plain form
18080 -58219 319495 -188668 -91864 33119 31192 -28618 -231107 -65147 -345383 -97368 23206
18068 -82358 162232 9415 -82182 114689 -6567 -388099 -416451 3330 -63564 -77521 -151406 -25154
18055 -71827 19440 188579 62563 -237541 -261216 125533 -489653 14987 -99969 -120849 -80727
18044 -80727 -85653 274280 -111488 163141 -247769 -16357 99806 5123 -4871 84674 -201171
18032 -64101 -72209 -178118 -82640 -196015 -140000 -48956 -161301 213469 -236305 195216 -263647
18020 128686 93935 -137797 60468 60672 -111741 433530 354194 -112377 -71380 69499 -110718
18008 15734 -156865 65075 7669 214509 -50358 -237553 268587 63608 -12015 -295460 -93997
17996 -43849 -84407 -97500 -90440 -188650 -110599 314304 41547 -93357 40836 118666 79430 -4036
$$ packed form
18080e8219C19495a88668i1864C3119j927b8618k02489f5147k80236i7368B3206
18068h2358A62232I415h2182A14689f567l81532k8352C330f3564j3957p3885b5154
18055g1827A9440J69139F2563b37541k3675A25533d89653A4987i9969k0880M0122
18044h0727m926B74280a11488A63141b47769a6357I9806E123d871H4674b01171
18032f4101q108j05909h2640j13375N6015d8956j12345B13469b36305A95216b63647
18020A28686l4751a37797F0468K04a11741D33530p9336a12377M0997F9499a10718
18008A5734a56865F5075G669K06840e0358j87195B68587F3608a2015k83445i3997
17996d3849m0558j3093P060r8210P8051C14304D1547i3357D0836P7830l9236d036
$$ plain form
17983 -257648 -164242 -53881 -329201 30385 173600 119866 -109920 176169 -106898 36327
17972 -184 -447769 278646 -41972 -229038 -197012 137917 -161163 96244 -3292 -5942 181638
17960 49258 -126841 -351670 35216 81259 260770 -31541 -236975 -38056 -49150 -189277 -79223
17948 18371 -73100 200247 -86923 86754 -80962 3524 -33575 -99084 95421 -262239 173896
17936 -24822 207816 309587 -88399 -114173 143736 -94786 -386439 -184975 -7970 133738 62656
17924 252559 71230 -317466 -17847 -108250 157074 -91686 147426 143217 128935 38331 -103488
17912 -119929 -91128 244388 32053 -139069 -354147 62184 -116041 -45190 79288 165240 -269155
17900 -41259 42575 -33974 -73680 -7451 142863 140015 70046 -346647 73590 -173135 -103064
$$ packed form
17983b57648R3406e3881k75320C0385J43215n3734a09920A76169a06898C6327
17972a84m47585B78646d1972j87066L2026A37917a61163I6244c292k650A81638
17960D9258a26841k24829C5216M6043J79511c1541k05434c8056j1094j40127g9223
17948A8371g3100B00247h6923H6754h0962C524c3575o5509I5421b62239A73896
17936b4822B07816J01771h8399k5774A43736i4786k91653a84975g970A33738F2656
17924B52559G1230c17466a7847r0403A57074i1686A47426m209j4282C8331a03488
17912a19929K8801B44388C2053a39069k15078F2184a16041d5190G9288Q5952b69155
17900d1259D2575c3974l9706g451A42863k848o9969c46647G3590a73135P0071
$$ plain form
17889 -103064 -9752 77774 -7206 -226967 243933 64260 -149956 -158735 57759 159010 -12456
17877 -161703 -35322 162780 190709 -132364 -107740 -174969 -50947 -105325 -98711 28834 51512
17866 51512 -42611 -186417 -64798 17517 -276213 -53303 27077 125765 -109958 -97726 -22497
17854 -11682 86210 174095 490306 -317236 250004 -232468 -53626 -190030 111179 -80649
17843 -2588 61799 29810 -88100 -76090 -111555 -123930 -177961 -3973 130450 235780 -100299
17831 -65833 111715 -49336 10612 -233243 -58967 32975 -140866 111440 -64704 -126790 163461
17819 176841 -237189 139086 -56778 104528 182642 270310 37293 -79942 -339088 95800 -93108
17807 199222 41411 -335971 -206239 274131 201120 -25656 46231 202876 18481 -207746
$$ packed form
17889a03064i752G7774g206k19761B43933F4260a49956q779E7759J01251a2456
17877a61703c5322A62780K7929a32364K4624o7229e0947n4378O614B8834K2678
17866E1512d2611j43806f4798A7517b76213e3303B7077R8688a09958J2232b2497
17854a1682H6210Q7885L16211c17236B50004b32468e3626j36404A11179h0649
17843b588F1799B9810h8100J2010l5465j2375n4031c973A30450J05330a00299
17831f5833A11715d9336A0612b33243e8967C2975a40866A11440f4704o2086A63461
17819A76841b37189A39086e6778A04528P8114Q7668C7293g9942k59146I5800i3108
17807A99222D1411c35971J29732B74131p3011b5656D6231J56645A8481b07746
$$ plain form
17796 -113134 -11555 -17756 -163532 26129 -142184 53961 -132457 118283 44135 -171626 -46113
17784 86076 202718 217051 17122 159656 8931 56937 7200 -48560 -267632 252031 149818
17773 149818 195837 129615 -77675 172056 -60450 189068 -68768 253436 82314 117745 4749
17761 95010 61762 150669 259907 221692 169502 -360742 242511 46014 -23486 -197047 -25516
17749 111477 -144545 -196566 50653 -114430 -11570 -136406 184449 -22319 72353 88876 -84007
17737 -71752 143929 262800 -247108 122028 298544 -202894 -201850 129700 35307 14111
17726 230871 -53649 -36975 90271 -258624 -216607 442599 31832 -120952 14644 -209492 171913
17714 27252 136451 69295 -61355 -171025 -27404 86918 -254276 -276818 45794 811 270527
$$ packed form
17796a13134a1555o201j45776B6129a42184E3961a32457A18283D4135a71626d6113
17784H6076J16642J4333A7122J42534H931M8006G200d8560k19072B52031j02213
17773A49818M6019o6222g7675A72056f0450A89068f8768B53436H2314L5431D749
17761I5010l3248Q8907J09238l8215n2190c60742B42511D6014b3486j73561b5516
17749A11477a44545n2021E0653a14430a1570j24836A84449b2319G2353J6523h4007
17737g1752A43929J18871b47108A22028J76516b02894J044A29700C5307A4111
17726B30871e3649J6674I0271b58624M2017D42599C1832a20952A4644b09492A71913
17714B7252J09199o7156f1355j09670b7404H6918b54276k2542D5794H11K69716
$$ plain form
17703 270527 14357 -566732 134787 10993 244515 -27054 -55714 -99164 22508 68870 -101354
17691 -54363 -79740 2295 -40154 -37869 285583 266212 9351 -497728 124456 10507 1040 38544
17679 38544 69654 -161312 58523 331995 -168590 -334718 83237 -221678 -3790 -52871 -144668
17668 -144668 -57171 65215 -57768 43278 -159626 107416 119901 -7121 17305 436567 -35702
17656 156804 61384 -222917 416467 -10079 9901 -43701 81793 77942 89269 161676 -136911
17644 -138937 119434 354251 -285464 276103 -302834 -110250 10381 223499 134651 50052
17633 36179 76579 166962 -157695 -2995 -156609 -20686 -172016 50041 65154 60570 -77545
17621 -13744 -37795 -10016 230180 141239 -269911 184183 -303424 -133790 238304 -37246
$$ packed form
17703B70527A4357e66732A34787A0993K33522b7054k8660m3450B2508M6362a01354
17691e4363k5377B295d0154K285B85583j9371I351d97728A24456A0507A040L7504
17679C8544L1110a61312E8523K73472a68590j66128H3237b21678c790m9081r1797
17668a44668e7171F5215e7768D3278a59626A07416J2485g121A7305M19262c5702
17656A56804F1384b22917D16467a0079I901d3701H1793l851J1327P2407a36911
17644a38937A19434K34817b85464B76103c02834a10250A0381K13118q8848E0052
17633C6179M0400R0383a57695b995j53614b0686j51330E0041J5113m584g7545
17621a3744k4051a0016B30180q8941b69911A84183c03424a33790B38304c7246
$$ plain form
17610 -39160 -137266 -172092 121596 -107034 -60640 161196 146838 151012 159744 -102177 129233
17598 220620 -61067 -74413 -15210 -94142 -69187 -68644 -2539 301283 47786 -87747 71406 72905
17586 72905 -110695 -146284 -236411 320742 -153986 283216 314807 -123608 -45561 -103535 97136
17574 148213 30065 203851 243938 -189557 330602 -29944 306216 -136753 99324 -83504
17563 108901 20004 98016 -221597 170306 213785 -40821 -157267 64087 169556 153736 -87175
17551 -120664 -228375 -21580 -290833 61015 216749 133223 -257312 233616 292649 204662
17541 204662 41056 39550 -72627 158649 -10160 -228940 405229 222345 -12932 245343 259728
17530 259728 -116462 192513 -18042 178383 180859 472171 -239138 -97807 52288 149633 143344
$$ packed form
17610c9160r8106l4826A21596a07034M6394A61196j4358M174Q732a02177A29233
17598B20620f1067j3346a5210p8932K4955N43b539C01283D7786h7747G1406J499
17586G2905a10695l5589r0127C20742a53986B83216L1591a23608d5561n7974I7136
17574A48213C0065J73786M0087a89557C30602b9944C06216a36753I9324h3504
17563A08901B0004P8012b21597A70306M3479d0821j16446F4087J05469j5820h7175
17551a20664j07711b1580k69253F1015J55734q3526b57312B33616N9033q7987
17541B04662D1056j506g2627A58649a0160k18780D05229j82884a2932B45343J4385
17530B59728a16462A92513a8042A78383K476K91312b39138i7807E2288R7345o289
$$ plain form
17519 143344 226490 522123 215118 -7930 -165586 -94585 -21923 -125019 -7547 318432 3874
17507 253964 61422 351828 324436 -256475 -186656 123431 -5451 -33484 -150720 155080 42777
17495 -149892 -95314 184255 -22995 211574 295585 359628 39571 50924 358106 -289959 -220858
17484 -220858 229509 97266 -65934 164651 -7902 531489 188528 134630 419104 253188
17474 253188 345852 11211 213516 39364 247996 232132 369230 206685 273090 36677 207849
17463 207849 100764 -326360 10623 207157 336625 68876 59574 411664 109959 -25322
17452 357097 349789 144427 250942 69546 268749 326514 299779 334179 55071 203708 518983
17441 518983 248234 517550 423623 74410 523323 159862 36488 206230 369325 175012
$$ packed form
17519A43344Q3146K95633B15118g930j57656P1001b1923j03096g547C18432C874
17507B53964F1422K90406k7392b56475O9819A23431e451k8033j17236A55080D2777
17495a49892N4578A84255b2995B11574Q4011O4043C9571J1353L07182b89959O9101
17484b20858B29509I7266f5934A64651g902E31489A88528n3898K84474j65916
17474B53188R2664A1211K02305C9364K08632j5864J37098j62545O6405C6677J71172
17463B07849A00764c26360A0623J96534J29468F8876r302L52090A09959b5322
17452C57097p308A44427J06515F9546J99203N7765k6735L4400E5071J48637L15275
17441E18983B48234K69316r3927G4410M48913A59862C6488J69742J63095A75012
$$ plain form
17430 -8884 89229 147081 10639 -17947 353703 490470 297493 366214 66506 445711 95762
17418 189875 559047 63184 59792 120596 -52265 -256621 -42308 204117 88478 132901 431682
17407 431682 89969 291055 -165757 176010 103228 -58350 111942 367769 123010 456021
17397 456021 137142 221374 74031 237564 156022 189092 379233 249158 247860 -214588 -157112
17386 -157112 -156368 239950 276586 84558 206044 265810 -53344 135821 312798 244392 328263
17375 328263 142065 51376 97447 109447 91112 -99320 13413 -52209 -98725 -156539 635805
17363 172369 -271955 332960 -150826 -15525 101970 -82186 46957 194067 -324140 75367
17352 -145241 203282 142520 27551 427601 206318 298503 -371786 160494 -180397 140721
$$ packed form
17430h884H9229N7852A0639a7947C53703J36767j92977O8721F6506L79205I5762
17418A89875L69172F3184l392O0804e2265k04356d2308B04117H8478M4423K98781
17407D31682H9969K01086a65757A76010p2782e8350A11942K55827A23010L33011
17397D56021A37142Q4232G4031J63533q1542L3070J90141j30075j298b14588N7476
17386a57112P44B39950L6636H4558J21486N9766e3344A35821J76977o8406Q3871
17375C28263A42065E1376M6071J2000j8335i9320A3413e2209m6516n7814F35805
17363A72369b71955C32960a50826a5525A01970h2186D6957J47110c24140G5367
17352a45241B03282o0762B7551M00050B06318R2185c71786A60494a80397A40721
$$ plain form
17341 319530 151496 21838 146694 247138 190914 76665 114399 143866 191093 53284 177918
17330 177918 -43659 -53847 107079 168825 319998 203047 351685 -156730 176179 257556
17320 257556 140047 378765 371589 -36867 22959 343039 -113785 252066 -269374 122109
17309 -16063 219925 310382 270719 123472 122652 314112 185839 195268 382157 34643 56849
17298 56849 386413 75739 -8199 46523 71329 144619 159926 128536 257188 29609 352885
17287 352885 52002 -5235 -300369 470568 240804 356790 87663 37525 33408 -28271 294322
17275 398118 36815 105248 524303 51823 337499 -25354 217156 259574 -131101 -77801 -2906
17263 177111 72223 97177 348051 141004 6763 150557 76621 330347 418487 368495 389979
$$ packed form
17341C19530A51496B1838J24856J00444n6224G6665L7734K9467M7227E3284J24634
17330A77918d3659j0188A07079O1746J51173j16951J48638a56730A76179Q1377
17320B57556j17509K38718p176c6867B2959L20080a13785B52066b69374A22109
17309a6063B19925R0457l9663A23472q20J91460j28273R429J86889C4643K2206
17298E6849L29564G5739h199D6523K4806P3290J5307l1390J28652B9609L23276
17287C52885E2002e235k95134D70568k29764J15986H7663C7525m117b8271B94322
17275C98118C6815O8433M19055E1823K85676b5354B17156M2418a31101N3300b906
17263A77111G2223K4954K50874A41004F763J43794p3936K53726Q8140m9992K1484
$$ plain form
17252 389979 335869 -15480 323550 122976 439627 285393 194984 445418 237772 303283
17242 303283 311044 55345 -5775 147501 33405 309220 198021 213478 173008 -61757 210157
17230 -31142 182729 14604 38635 236093 390298 260038 447629 137878 377381 260685
17220 260685 -7055 247826 1000 -62242 381965 -69774 62839 240215 193997 564908 46207
17208 -7459 448467 258883 68489 501209 63955 303067 658509 435580 169473 457747
17198 457747 224779 274880 160788 291600 390502 367022 104703 247151 -45354 195318
17187 87845 48229 265018 192421 169119 262122 217171 221871 255307 374891 181306 258372
17176 258372 275231 329917 452474 339130 167249 -217247 344598 173745 191428 75587
$$ packed form
17252C89979n4110a5480C23550A22976L16651j54234r0409K50434k07646O5511
17242C03283P761E5345e775A47501C3405K75815j11199J5457m0470f1757B10157
17230c1142A82729A4604K4031J97458J54205j30260J87591A37878K39503j16696
17220B60685g055B47826A000f2242C81965f9774F2839J77376m6218L70911D6207
17208g459D48467j89584F8489M32720F3955K39112L55442k22929A69473K88274
17198D57747B24779N0101j14092J30812R8902k3480A04703J42448d5354A95318
17187H7845l9616K16789p2597k3302R3003m4951M700L3436J19584A81306P7066
17176B58372J6859N4686J22557j13344A67249b17247C44598j70853J7683G5587
$$ plain form
17165 40689 329806 588024 379423 353623 115314 228350 281804 357655 256149 251448 215316
17154 215316 359160 238587 274600 378550 594583 190571 258291 366911 386461 619918
17144 619918 210332 271842 634345 188675 246307 -165848 413690 242694 465246 239144
17134 239144 224483 164418 121211 495363 328203 591782 139902 253421 165816 942525
17124 942525 188898 26584 116333 543596 600875 291460 419919 298335 318201 326690 429980
17113 429980 293183 565643 535536 361502 338142 464537 331243 376484 426499 300305
17103 300305 438513 558307 258954 136325 367866 513331 223426 502530 541314 672169
17093 672169 293185 458962 666849 459609 318303 457455 41630 142986 494542 416102
$$ packed form
17165D0689K89117K58218k08601k5800A15314J13036N3454P5851j01506m701l6132
17154B15316J43844j20573L6013J03950K16033A90571O7720J08620J9550K33457
17144F19918B10332O1510L62503A88675N7632a65848D13690j70996K22552k26102
17134B39144j4661o0065m3207L74152j67160K63579A39902J13519q7605P76709
17124I42525A88898B6584Q9749M27263N7279B91460J28459j21584J9866Q489J03290
17113D29980j36797K72460l0107j74034k3360J26395j33294M5241N0015j26194
17103C00305J38208J19794B58954j22629K31541J45465B23426K79104L8784J30855
17093F72169B93185J65777K07887k07240j41306J39152D1630J01356L51556p8440
$$ plain form
17083 416102 255848 355138 363673 285433 755223 642215 503124 579200 429655 632839
17073 632839 381769 350907 329816 351367 604283 514445 819184 371249 1302 545314 328865
17062 328865 234849 231001 355018 493642 492925 590871 477907 620379 726135 381325 510453
17051 510453 709364 347425 632349 810202 831511 775212 791555 603656 665397 454408
17041 454408 674571 479105 872279 529920 741132 470361 517774 490275 636565 455504
17031 455504 629205 427607 190374 668071 681244 329638 1143825 670902 601483 599817
17021 599817 607900 749552 325494 609104 478390 773520 705559 577363 677316 992482
17011 992482 547931 593937 542407 592576 942277 611001 760026 779891 535464 765556
$$ packed form
17083D16102j60254R9290Q535p8240M69790j13008j39091P6076j49545K03184
17073F32839k51070l0862k1091K1551K52916q9838L04739C71249A302N44012k16449
17062C28865r4016l848J24017J38624p17R7946j12964J42472J05756l44810J29128
17051E10453J98911C47425K84924J77853K1309n6299J6343j87899O1741k10989
17041D54408K20163j95466L93174l42359K11212k70771M7413k7499J46290j81061
17031D55504J73701k01598A90374M77697J3173C29638Q14187m72923o9419j666
17021E99817Q083J41652C25494K83610j30714K95130o7961j28196R9953L15166
17011I92482m44551M6006n1530N0169L49701l31276J49025J9865k44427K30092
$$ plain form
17001 765556 417682 901936 542891 914723 712004 681752 731229 1006997 1030907 727195
16991 727195 649135 1218658 787775 986004 1107099 956643 1105961 990625 1127560 1219916
16981 1219916 760147 714488 692755 807529 626176 836731 829424 777309 970314 704009
16971 704009 710303 775056 1075082 1283819 945751 1291694 1184701 1223676 1016213 691262
16961 691262 796568 1026983 1045157 1038089 1185330 1199933 1496273 1334887 1100849 1047918
16951 1047918 1140291 1039638 1180539 1033974 1184690 941241 1205328 1078420 1345877 889851
16941 889851 1162011 1163178 1390499 1245073 1089981 1427428 1242247 1537310 1640173 1105382
16931 1105382 1345440 1451216 1314630 1272821 1365858 1483195 1579031 1264823 1381481 1474824
$$ packed form
17001G65556l47874M84254l59045L71832k02719l0252M9477K75768K3910l03712
16991G27195p8060N69523m30883J98229J21095j50456J49318j15336J36935R2356
16981A219916m59769m5659k1733J14774j81353K10555p307n2115J93005k66305
16971G04009O294O4753L00026K08737l38068L45943j06993L8975k07463l24951
16961F91262J05306K30415J8174p068J47241J4603K96340j61386k34038n2931
16951A047918R2373j00653J40901j46565J50716k43449K64087j26908K67457m56026
16941H89851K72160J167K27321j45426j55092L37447j85181K95063J02863n34791
16931A105382K40058J05776j36586m1809R3037J17337R5836l14208J16658R3343
$$ plain form
16921 1474824 1443677 1615210 1874030 1509141 1598462 1475875 1651458 1280696 1625671 1631109
16911 1631109 1692166 1715276 1673610 1789343 1885629 1824754 1614662 1430763 1958441 1748433
16901 1748433 1821194 1922534 1871157 1865454 1922003 2008927 2093395 2040341 1859429 1990941 1835741
16890 1835741 1936798 1861079 2030701 2231259 2258259 2105187 1916398 2170924 2362707 2198985
16880 2198985 2149244 2459546 2131165 2548163 2416463 2445394 2403452 2795503 2637024 2510279
16870 2510279 2732830 2599952 2973944 2336874 2926500 2666428 2750855 2909295 2834195 3178508
16860 3178508 3026656 3290334 3145484 3267298 3184596 3063013 3375560 3320518 3320313 3768661
16850 3768661 3537751 3560414 3620259 3871762 3356255 3528447 3835361 3624653 3780734 3938318
$$ packed form
16921A474824l1147J71533K58820l64889Q9321j22587J75583l70762L44975N438
16911A631109O1057K3110m1666J15733R6286o0875k10092j83899N27678k10008
16901A748433P2761J01340n1377n703N6549Q6924Q4468n3054j80912J31512j55200
16890A835741J01057p5719J69622K00558K7000j53072j88789K54526J91783j63722
16880B198985m9741L10302l28381M16998j31700K8931m1942L92051j58479j26745
16870B510279K22551j32878L73992o37070N89626k60072Q4427J58440p5100L44313
16860C178508j51852K63678j44850J21814q2702j21583L12547n5042k05M48348
16850C768661k30910K2663N9845K51503n15507J72192L06914k10708J56081J57584
$$ plain form
16840 3938318 4031294 4107827 3978905 4159640 4206343 4273809 4437756 4587171 4338399 4583098
16830 4583098 4934347 4856882 5054508 5194263 4795501 5345755 5361330 4964347 5651297 5947931
16820 5947931 5668337 5620016 6120914 5624800 5912239 6122075 6143041 6373475 6467996 6757793
16810 6757793 6711792 7027411 7214895 7340600 7379926 7648220 7462297 7882069 8085084 8167346
16800 8167346 8141490 8467971 8719968 9262488 9304793 9311409 9846173 9893038 9919314 10519538
16790 10519538 10865039 10902153 11529066 11435787 11599369 12210721 12290319 12847632 13127210 13504086
16780 13504086 14093963 14370767 14644088 14747581 15697241 16259311 16610982 17269855 17809817
16771 17809817 18465179 18766760 19483153 20355300 21114904 21699242 21966820 23157865 24152744
$$ packed form
16840C938318R2976P6533j28922J80735M6703O7466J63947J49415k48772K44699
16830D583098L51249p7465J97626J39755l98762N50254J5575l96983O86950K96634
16820E947931k79594m8321N00898m96114K87439K09836K0966K30434R4521K89797
16810F757793m6001L15619J87484J25705L9326K68294j85923M19772K03015Q2262
16800H167346k5856L26481K51997N42520M2305O616N34764M6865K6276O00224
16790A0519538L45501L7114O26913r3279J63582O11352P9598N57313K79578L76876
16780A3504086N89877K76804K73321J03493R49660N62070L51671O58873N39962
16771A7809817O55362L01581P16393Q72147P59604N84338K67578J191045R94879
$$ plain form
16762 24152744 24873995 25819293 26906679 27926349 28816758 29955723 31401108 33104367
16754 33104367 34326203 35746922 37385875 39362491 40755627 42704445 44584757 46425484
16746 46425484 48858298 51518634 53969346 56845028 59621216 62753600 66478066 69902950
16738 69902950 73622624 77707987 82118526 86743294 91632801 97053533 102311450 108088214
16730 108088214 113818016 120409270 126827108 133453793 139959326 146285739 152660763 158872357
16722 158872357 164419477 169552816 173739192 177225686 179489059 180922959 181095656 180606650
16714 180606650 178074745 175276950 171537811 166505809 161121964 155361104 149319574 142520898
16706 142520898 136633268 129398137 123070555 116595177 110648002 104285567 98720432 93051349
$$ packed form
16762B4152744P21251R45298J087386J019670Q90409J138965J445385J703259
16754C3104367J221836J420719J638953J976616J393136J948818J880312J840727
16746D6425484K432814K660336K450712K875682K776188L132384L724466L424884
16738F9902950L719674M085363M410539M624768M889507N420732N257917N776764
16730A08088214N729802O591254O417838O626685O505533O326413O375024O211594
16722A58872357N547120N133339M186376L486494K263373J433900J72697m89006
16714A80606650k531905k797795l739139n032002n383845n760860o041530o798676
16706A42520898n887630p235131o327582o475378n947175o362435n565135n669083
$$ plain form
16698 93051349 87948897 83135200 78326211 73887765 69866078 66188347 62563571 59121843
16690 59121843 56235459 53026451 50189466 47879833 45524164 43223099 40987177 38968448
16682 38968448 37131029 35599962 33709552 32662381 30822155 29723149 28435388 27207761
16674 27207761 26232202 25151451 23961675 23249828 22160672 20975178 20649109 19803297 19016912
16665 19016912 18289576 17973877 16919683 16572518 16189930 15585758 14828648 14307773 14128443
16656 14128443 13612368 13246886 12920854 12116593 12154275 11911050 11388670 10620774 10768951
16647 10768951 10514038 10143380 9988411 9691268 9492232 9342989 9059790 8861104 8519201
16638 8519201 8553344 7916967 7949686 7579388 7537443 7316910 6957491 6879063 6654318 6455208
$$ packed form
16698I3051349n102452m813697m808989m438446m021687l677731l624776l441728
16690E9121843k886384l209008k836985k309633k355669k301065k235922k018729
16682C8968448j837419j531067j890410j047171j840226j099006j287761j227627
16674B7207761r75559j080751j189776p11847j089156j185494l26069q45812p86385
16665A9016912p27336l15699j054194l47165l82588o04172p57110n20875j79330
16656A4128443n16075l65482l26032q04261L7682k43225n22380p67896J48177
16647A0768951k54913l70658j54969k97143j99036j49243k83199j98686l41903
16638H519201L4143o36377L2719l70298m1945k20533l59419p8428k24745j99110
$$ plain form
16628 6455208 6371532 6284532 6025570 5855442 6040615 5883727 5624558 5568632 5712508 5159361
16618 5159361 5200171 4821639 4918705 5078490 5067336 4559878 4553444 4823864 4404685 4401796 4231887
16607 4231887 4407659 4220705 3859732 3898705 3611618 3865082 3912285 3739249 4022075 3853657
16597 3853657 3590891 3511173 3233981 3405443 3302250 3075261 3233783 3256697 3139881 3001745
16587 3001745 3374184 2703687 2808105 2780798 2554771 2793162 2571003 2591018 2369259 2521020
16577 2521020 2549211 2091392 2351974 2685605 2258227 2532983 2392072 2443397 2392178 1910660
16567 1910660 2575260 2236023 2214771 2288130 2223464 2163156 2040354 2122592 1429075 1933636
16557 1933636 1582740 1880212 1961924 1653451 1492033 1849488 1700901 1619954 1875568 1815566
$$ packed form
16628F455208q3676q7000k58962j70128J85173j56888k59169n5926J43876n53147
16618E159361M0810l78532R7066J59785j1154n07458o434K70420m19179k889j69909
16607D231887J75772j86954l60973L8973k87087K53464M7203j73036K82826j68418
16597C853657k62766p9718k77192J71462j03193k26989J58522K2914j16816j38136
16587C001745L72439o70497J04418k7307k26027K38391k22159K0015k21759J51761
16577B521020K8191m57819K60582L33631m27378K74756j40911N1325n1219m81518
16567A910660O64600l39237k1252P3359o4666o0308j22802Q2238o93517N04561
16557A933636l50896K97472Q1712l08473j61418L57455j48587q0947K55614o0002
$$ plain form
16547 1815566 1567315 1950464 1579124 1616778 1275484 1634729 1487092 1476996 1471450 1593362
16537 1593362 1339112 1340020 1545626 1203660 1603025 1376172 1428122 1418435 1511984 1426492 1570753
16526 1570753 1081997 1509001 1349658 1144046 1462743 1113641 1456904 1150097 1230967 1096752
16516 1096752 1189065 1259281 1169270 1058398 1139711 1259341 1069033 1159808 1172852 904581
16506 904581 1034372 969004 1081031 879950 1033082 1240833 1213635 1042048 1267276 1137375
16496 1137375 996733 830817 814002 929215 1011857 1058185 1031411 939037 808074 1194415
16486 1194415 957084 989612 839506 1117973 878666 786601 882407 805948 875731 905770
16476 905770 697830 948227 561237 678718 718632 387550 886101 777363 484692 992438
$$ packed form
16547A815566k48251L83149l71340L7654l41294L59245j47637j0096n546J21912
16537A593362k54250R08K05606l41966L99365k26853N1950r687R3549q5492J44261
16526A570753m88756M27004j59343k05612L18697l49102L43263l06807Q0870j34215
16516A096752R2313P0216r0011j10872Q1313J19630j90308R0775J3044k68271
16506I04581J29791o5368J12027k01081J53132K07751k7198j71587K25228j29901
16496A137375j40642j65916j6815J15213Q2642M6328k6774r2374j30963L86341
16486A194415k37331L2528j50106K78467k39307r2065R5806p6459O9783L0039
16476I05770k07940K50397l86990J17481L9914l31082M98551j08738k92671N07746
$$ plain form
16466 992438 995787 852268 679438 653900 892018 608391 611557 683944 688909 676744 769925
16455 769925 596414 761617 355355 670257 548491 967456 751670 524722 329808 505072
16445 505072 726315 654217 423873 503185 321730 877669 646454 513385 610738 543884
16435 543884 392513 374368 431127 733409 540384 772603 723898 555582 545439 722551
16425 722551 253427 378467 478800 649318 478807 939313 415494 332421 326744 362398
16415 362398 487648 346133 149404 403515 288408 347344 436226 482548 421004 580530
16405 580530 257942 411862 487066 451167 349570 361810 497148 480054 520282 73633 408329
16394 408329 516559 417786 777072 311949 563481 487693 90426 809762 207390 70617
$$ packed form
16466I92438L349j43519j72830k5538K38118k83627L166P2387M965j2165R3181
16455G69925j73511J65203C55355L14902j21766M18965k15786k26948j94914J75264
16445E05072K21243p2098k30344P9312j81455N55939k31215j33069R7353o6854
16435E43884j51371j8145N6759L02282j93025K32219m8705j68316j0143J77112
16425G22551B53427J25040J00333J70518j70511M60506D15494q3073n677L5654
16415C62398J25250j41515A49404K54111j15107N8936Q8882M6322o1544J59526
16405E80530B57942J53920P5204l5899j01597J2240J35338j7094M0228G3633L34696
16394D08329J08230r8773L59286C11949K51532p5788I0426P19336B07390G0617
$$ plain form
16383 401626 238962 406145 348658 232762 262355 162186 565707 513647 341419 173172
16373 173172 333763 -9417 417203 369518 205278 99616 416058 -42280 619552 412591
16363 412591 360295 225770 449073 441326 272244 199071 552813 594424 133355 65144 346220
16352 346220 442700 484974 409591 261622 311057 228131 411241 324536 172723 205843 93927
16340 164326 241324 427669 403466 383874 -160828 428376 600460 184071 358388 220157
16330 220157 264123 114165 265474 308745 321764 257764 325670 67725 169243 113483 454257
16319 454257 549971 146325 108510 36752 208996 309671 516142 -195804 354854 173393
16308 -9534 413007 483555 72363 391917 150096 147245 31348 97578 245254 62059 363266
$$ packed form
16383D01626j62664J67183n7487j15896K9593j00169M03521n2060j72228j68247
16373A73172J60591i417D17203m7685j64240I9616L16442d2280F19552k06961
16363D12591n2296j34525K23303p747j69082p3173L53742M1611A33355F5144K81076
16352C46220R6480M2274p5383j47969M9435q2926J83110q6705j51813L3120I3927
16340A64326P6998J86345k4203j9592a60828D28376J72084A84071J74317j38231
16330B20157M3966A14165J51309M3271J3019o4000O7906F7725J01518n5760L40774
16319D54257R5714A46325l7815C6752J72244J00675K06471a95804C54854A73393
16308i534D13007P0548G2363L19554A50096k851C1348O6230J47676F2059L01207
$$ plain form
16297 363266 -105365 -66418 337047 161333 321351 135128 -14379 181525 86760 173518
16287 173518 110218 199110 -70874 136802 193245 208626 -60849 172806 411816 224610 204899
16276 204899 169689 56625 419786 88793 23921 99873 -229368 -96054 186401 751069 327052
16264 -87752 415665 146241 320922 -18117 55461 191343 7424 -33777 -1047 -138390 117572
16252 124057 280707 30727 211149 30681 171242 305373 270178 98237 281973 250687
16242 250687 196737 97890 155962 24090 411623 -154859 207817 -24789 403806 150506
16231 295963 134938 -206482 98778 1005 260177 167604 -114666 154711 125272 205630 -101161
16219 317615 464898 119791 -235612 55927 -316267 -100505 -165656 279978 398024 74144
$$ packed form
16297C63266a05365L8947C37047A61333J60018A35128a4379A81525H6760Q6758
16287A73518o3300Q8892g0874A36802N6443J5381f0849A72806K39010j87206j9711
16276B04899l5210E6625L63161H8793B3921P5952b29368i6054A86401N64668C27052
16264h7752D15665A46241J74681a8117E5461J35882G424c3777a047j37343A17572
16252A24057J56650C0727J80422C0681J40561J34131l5195I8237J83736l1286
16242B50687n3950I7890N8072B4090L87533a54859B07817b4789D03806A50506
16231B95963A34938b06482I8778A005K59172r2573a14666A54711k9439Q0358a01161
16219C17615J47283A19791b35612E5927c16267a00505o5151B79978J18046G4144
$$ plain form
16208 183445 75605 82380 301354 -267664 190678 306813 -96400 76532 -297415 252641
16197 79503 -50701 244337 137200 -192329 -33602 168901 -112462 79204 133473 246647
16187 246647 -242313 21199 76668 343733 224313 133504 92201 -110204 111441 -230431
16176 -140012 -36114 83047 58895 41530 355231 94910 119120 27954 195342 193277 182839
16165 182839 -325425 199940 -62545 -274097 237636 -77787 112039 -148839 92373 -31915
16154 156353 -256608 98718 84985 -253633 33328 171423 115743 314038 231356 44508 229336
16143 229336 131597 -256099 -124089 281367 -325503 -61768 203943 -110753 -60979 -42086
16133 -42086 118627 357354 146332 -285319 -16703 -25739 -33940 22895 154599 -65129 73161
$$ packed form
16208A83445G5605O775K18974b67664A90678J16135i6400G6532b97415B52641
16197G9503e0701B44337j07137a92329c3602A68901a12462G9204N4269J13174
16187B46647b42313B1199N5469K67065j19420r0809m1303a10204A11441b30431
16176a40012c6114H3047k4152j7365L13701I4910K4210B7954J67388k065j0438
16165A82839c25425A99940f2545k11552B37636g7787A12039a48839I2373c1915
16154A56353b56608I8718j3733b53633C3328J38095n5680J98295q2682D4508J84828
16143B29336r7739b56099a24089B81367c25503f1768B03943a10753M9774J8893
16133d2086A18627K38727A46332b85319a6703r036q201B2895J31704f5129G3161
$$ plain form
16121 2532 78114 -248130 -89789 -234178 -129638 80729 -33982 -141211 -180 -225631 33460
16109 20873 -65394 8574 -51678 206688 407048 323794 64926 50236 381151 252740 25816
16097 192071 220074 256078 30529 4823 112093 -154227 -125811 87416 110275 143910 -228669
16085 -142531 380613 65400 179614 -140236 133840 -28833 -196137 -136147 551810 -286121
16074 -454825 109702 268244 -52112 144720 19427 83790 10606 -123559 -76436 -53952 125795
16062 87012 -413756 198604 -425237 -198026 173002 -10649 -123601 19926 -85737 61690
16051 -193948 176522 28098 302416 -141970 -39130 -133186 -285440 56772 126502 -49988 301867
16039 -91717 67152 -195470 -108332 71614 -42775 82592 213406 149709 207153 -108576 131352
$$ packed form
16121B532P5582b48130h9789j44389J04540H0729c3982j07229a80k25451C3460
16109B0873f5394H574e1678B06688K00360q3254F4926j4690L30915j28411B5816
16097A92071K8003L6004C0529D823J07270a54227K8416H7416K2859L3635b28669
16085a42531C80613F5400J14214a40236A33840b8833j67304N9990E51810b86121
16074d54825A09702J58542e2112A44720A9427O4363A0606a23559M7123K2484A25795
16062H7012d13756A98604d25237a98026A73002a0649j12952A9926h5737F1690
16051a93948A76522B8098K74318a41970c9130r4056j52254E6772O9730d9988C01867
16039i1717F7152a95470Q7138G1614d2775H2592J30814o3697N7444a08576A31352
$$ plain form
16027 -154255 -195278 114729 -38886 -19787 -9503 -141697 77112 135562 120377 -103177 -198332
16016 -198332 226671 89750 -100694 87620 50981 -49465 308955 -220335 -89369 426203
16005 263937 -95180 -16686 156319 18479 118979 151002 69154 -260473 -272834 220973 228346
15994 228346 -56690 155792 63892 227286 -278919 -236001 130600 250516 379173 161269
15983 93334 -151753 301632 56269 190413 48500 -258036 -82916 -35034 -165569 -126518 -133249
15972 -133249 22256 -275335 -210941 -77518 -24822 -65658 -194209 -177755 36265 -134816 -120167
15961 -120167 140401 28617 -154086 149029 -726 -74496 -115984 -64078 42224 -111819 3688
15949 -159510 -71451 -44460 -407163 152979 12471 237590 156882 -169623 -60156 81708 -94850
$$ packed form
16027a54255m1023A14729c8886J9099i503j32194G7112N8450j5185a03177r5155
16016a98332B26671H9750a00694H7620l6639d9465C08955b20335h9369D26203
16005B63937i5180a6686A56319A8479J00500L2023F9154b60473j2361B20973P373
15994B28346e6690A55792F3892J63394b78919M2918A30600J19916J28657A61269
15983I3334a51753C01632E6269J34144D8500b58036h2916c5034j30535L9051o731
15972a33249B2256b75335O4394g7518b4822m0836j28551J6454C6265a34816J4649
15961a20167A40401B8617a54086A49029g26p3770m1488N1906D2224a11819C688
15949a59510g1451K6991l62703A52979A2471K25119q0708a69623f0156H1708i4850
$$ plain form
15937 36844 -118422 -269048 -79827 14100 -319649 8160 16275 -190020 -5634 -142771 -58714
15925 -103887 227566 -188499 -256870 71178 46125 -254015 -348432 94960 204491 65574 -328572
15913 -230232 -51566 -138261 56484 -164359 -98777 20565 158455 72587 -346059 -99654 -187636
15902 -187636 -112909 -41330 -9701 -321741 -183843 172566 68599 -180731 -134893 42312 21434
15891 21434 -67519 -161873 -143233 86818 -19394 60038 62501 -93558 179038 -500591 148767
15879 18941 363462 -178327 121915 297082 -300039 37310 -244492 -30664 -127115 -205910
15869 -205910 -159519 29659 -170626 -300272 -146900 -194932 96748 178665 146801 -400845 -331144
15858 -331144 -155684 -284235 166563 -261299 -134303 93515 235945 238183 24503 -272734
$$ packed form
15937C6844a18422j50626g9827A4100c19649H160Q115a90020e634j37137e8714
15925a03887B27566a88499o8371G1178k5053b54015r4417I4960J09531F5574c28572
15913b30232e1566q6695E6484a64359O5582B0565J37890G2587c46059i9654q7982
15902a87636P4727d1330i701l12040J37898A72566F8599a80731M5838D2312k0878
15891B1434f7519r4354J8640H6818a9394F0038K463i3558A79038e00591A48767
15879A8941L44521a78327A21915J75167c00039C7310b44492c0664r6451p8795
15869b05910M6391B9659a70626j29646a46900m8032I6748Q1917l1864d00845O9701
15858c31144a55684j28551A66563b61299J26996I3515J42430K238B4503b72734
$$ plain form
15847 -216853 284366 9978 -141367 20311 130234 -158610 -179032 -197527 46443 -138610 284007
15835 -304425 90515 -304918 -56402 -239850 -249370 -33298 -207993 154660 132533 202740 -13364
15823 162459 74606 -106047 78692 -33892 -492605 -270788 129818 -9002 -102088 -7710 135742
15811 -202537 -14888 169210 250048 387773 32871 64066 -212775 60254 -332985 -119471
15800 88941 175270 135770 18227 -120549 -23474 -186626 275161 -426378 20860 335606 135278
15788 -23083 109969 -74882 -11738 -225143 -38993 -101607 -91607 74890 -159024 -75736 -1042
15776 192346 41931 -98636 299815 48775 -78827 7843 47713 51912 136783 -231376 -32271
15764 -26219 21002 334220 -380096 -98904 -136756 69548 -174372 114668 175118 -78576 72909
$$ packed form
15847b16853B84366I978a41367B0311J09923a58610k0422j8495D6443a38610B84007
15835c04425I0515c04918e6402j83448r520c3298j74695A54660k2127P0207a3364
15823A62459G4606a06047G8692c3892m58713K21817A29818i002r3086g710A35742
15811b02537a4888A69210Q0838J37725C2871L1195b12775F0254c32985a19471
15800H8941Q6329l9500A8227a20549b3474j63152B75161d26378B0860L14746A35278
15788b3083A09969g4882a1738k13405c8993o2614J0000G4890a59024g5736a042
15776A92346D1931i8636B99815D8775g8827G843L9870M199Q4871b31376c2271
15764b6219B1002L13218c80096i8904l7852F9548a74372A14668O0450g8576G2909
$$ plain form
15752 -95326 -64824 167242 28739 89848 -170376 111271 141108 -59506 52236 48864 -53432
15740 -209597 246265 -263064 -19874 -105791 -72561 -210814 -202789 44984 24654 -294125 -191598
15729 -191598 84290 -386613 22484 -170661 194664 63822 181959 12725 -59169 -209770
15719 -209770 -230969 118636 -167625 212534 -278136 -113230 -47630 -46624 244504 -100199
15708 -174788 74956 51959 -167790 -575 177551 -230636 -20238 -152543 300929 61258 -356279
15696 53572 163550 60155 167468 51701 -37991 381525 -245002 160302 -141430 -106666
15686 -106666 -267404 173357 146456 -76403 132614 -14426 -112070 134142 102609 -122557
15675 255504 -112093 298903 -1385 43738 -64906 -196934 -130296 29300 -121705 -40344 -30823
$$ packed form
15752i5326L0502A67242B8739O1109a70376A11271K9837e9506E2236l372e3432
15740b09597B46265b63064a9874q5917L3230j38253Q025D4984k0330b94125J02527
15729a91598H4290c86613B2484a70661A94664F3822J18137A2725e9169j50601
15719b09770k1199A18636a67625B12534b78136a13230d7630J006B44504a00199
15708a74788G4956k2997a67790e75A77551b30636b0238j32305C00929F1258c56279
15696E3572J09978F0155J07313E1701c7991C81525b45002A60302a41430L4764
15686a06666j60738A73357k6901g6403A32614a4426r7644A34142l1533a22557
15675B55504a12093B98903a385D3738f4906j32028O6638B9300a21705d0344R521
$$ plain form
15664 -30823 -91528 67792 -80995 -347729 -134738 -106937 -383983 -199880 -159884 -10344 -61378
15653 -61378 65454 -111138 53975 -73464 -87858 496392 -293306 -105570 212030 147736 -104144
15641 112044 108222 -50065 -223680 105547 -138466 -284083 -37226 -146097 -81358 242402
15630 104595 135101 -352076 -243911 -197723 141871 46174 -400629 -345765 43954 17005 -99377
15618 337691 36159 273527 237856 -329379 152236 -251387 57212 -166127 -72835 171504
15607 -13570 46993 31959 -89205 -216133 212683 129056 -35304 -255895 93125 -55432 11312
15595 93225 -59226 -107861 -108177 -42193 282775 -23282 -434450 46380 -299604 -97909 -76770
15584 -76770 218987 -109789 38941 -9964 -118234 -44277 -114394 246916 -110059 172339 -301944
$$ packed form
15664c0823o0705F7792h0995k66734a34738K7801k77046J84103L9996a0344n1034
15653f1378F5454a11138E3975g3464j4394D96392b93306a05570B12030o4294a04144
15641A12044l822e0065j73615A05547a38466j45617c7226j08871O4739B42402
15630A04595L0506c52076J08165M6188A41871D6174d00629N4864D3954A7005i9377
15618C37691C6159K37368l5671c29379A52236b51387E7212a66127g2835A71504
15607a3570D6993j5034h9205j26928B12683q3627c5304k20591I3125e5432A1312
15595I3225e9226m8635l16d2193B82775b3282m11168D6380b99604i7909K1139
15584g6770B18987a09789C8941i964j08270d4277p0117B46916a10059A72339c01944
$$ plain form
15572 25132 -100938 -411687 76195 -66517 144736 64102 -51784 284191 -143524 10951 23182
15561 23182 -440543 -51721 34890 83232 62076 -30218 80336 -119010 138816 24764 -273916
15549 -97444 -91122 -143820 -126654 125572 159484 -41781 -87105 -184230 -206228 -34481 58761 -30503
15536 91716 63807 -62945 195102 -25909 -96503 93933 -57102 -25543 -242106 -196972 -91946
15524 -431986 94371 -307083 30043 -363175 -74837 -1032 23610 51260 -145768 3153 12348
15513 12348 -117401 59959 143407 281839 182517 -160300 -22625 -293081 80379 -229978 65550
15501 -43457 -15488 -131002 159381 -20456 -135393 -48932 38596 -279329 75666 -148561 -273605
15490 -273605 -16650 110829 385880 -71497 271565 -169771 159779 140906 -331004 22915
$$ packed form
15572B5132a00938l10749G6195f6517A44736F4102e1784B84191a43524A0951J2231
15561B3182d40543e1721C4890M8342k1156c0218H0336a19010A38816B4764b73916
15549i7444O322n2698J7166A25572L3912d1781m5324r7125k1998c4481E8761c0503
15536I1716k7909f2945A95102b5909p0594I3933e7102b5543k16563M5134i1946
15524d31986I4371c07083C0043c63175g4837a032B3610K7650a45768C153R195
15513A2348a17401E9959Q3448J38432r9322a60300b2625k70456H0379b29978F5550
15501d3457a5488j15514A59381b0456j14937d8932C8596b79329G5666a48561j25044
15490b73605a6650A10829K75051g1497B71565a69771A59779j8873c31004B2915
$$ plain form
15479 44298 12913 -123484 313770 250942 78766 165448 -47015 156101 -51717 -121467 21972
15467 -51570 31685 -463199 -2921 92567 -133852 -219965 395507 203780 -75420 125146 280214
15456 280214 209926 -137391 -141145 199724 -364951 -137111 -79151 189086 48223 -17365 -172151
15445 -172151 -181359 67021 -103688 264617 122903 -17812 -126331 102779 -148513 37459
15434 25790 -252179 252658 107551 -154066 -315905 76980 -53716 -19087 171993 -34899
15423 205484 131113 -192164 144733 171885 -207421 163688 -54189 -145466 -70941 -71312 -164973
15412 -164973 436170 -229389 379631 205796 204936 253018 250837 164024 -95793 -295291 -44202
15400 -17744 -316506 157586 -166022 403187 46132 100001 -4485 103546 73554 -44023 93738
$$ packed form
15479D4298A2913a23484C13770o2828G8766Q6682d7015A56101e1717o9750B1972
15467e1570C1685d63199b921I2567a33852q6113C95507j91727g5420A25146J55068
15456B80214p0288a37391l754A99724c64951a37111N7960A89086D8223a7365j54786
15445a72151r208F7021a03688B64617A22903a7812j08519A02779a48513C7459
15434B5790b52179B52658A07551a54066j61839G6980e3716a9087A71993c4899
15423B05484p4371a92164A44733K7152b07421A63688e4189r1277g0941l71r3661
15412a64973D36170b29389C79631j73835q60M8082k181q6813i5793j99498d4202
15400a7744k98762A57586a66022D03187D6132N3869d485A03546k9992d4023I3738
$$ plain form
15388 271120 -25811 -170319 -290721 36047 166711 -7793 267778 28616 24523 95015 59618
15377 59618 3422 -202569 66524 215272 155221 -29234 -518158 -89355 -30488 75890 120137
15366 120137 55140 -212797 -202736 -180365 -24044 -28569 194010 -333174 -174800 74712 140070
15355 140070 -118381 -26370 78312 -119029 -80143 15721 15441 133228 -18327 -222157 4997
15343 228757 237348 55584 362917 -231505 4204 -40133 36191 -122705 -78372 -147450 -105139
15332 -105139 3788 63664 -111070 343280 37777 133254 -160036 -154115 100410 -7293 -72404
15321 -72404 -59134 -99682 -4522 23803 -225073 -6059 -318763 65338 -281098 -161928 390958
15309 182645 220025 -35257 -143460 375025 347954 87239 -54496 241967 104025 88866 -120498
$$ packed form
15388B71120b5811j44508j20402C6047J30664g793B67778B8616m093P0492l5397
15377E9618C422b02569F6524J48748o0051b9234m88924h9355c0488G5890M4247
15366A20137E5140b12797J0061K2371b4044m525A94010c33174J58374G4712O5358
15355A40070a18381b6370G8312a19029L8886A5721k80J17787a8327k03830D997
15343B28757Q591E5584L07333b31505D204d0133C6191a22705M4333o9078M2311
15332a05139C788N9876a11070C43280C7777R5477a60036N921A00410g293o5111
15321g2404J3270m0548d522B3803b25073f059l12704F5338b81098J19170C90958
15309A82645L7380c5257j08203C75025k7071H7239e4496B41967A04025j5159a20498
$$ plain form
15297 190726 -274463 285529 -146987 37166 199186 69564 -13517 265546 -262020 80336
15286 -34740 16157 -239059 -134652 345986 -221514 295090 133408 -365032 13728 48261
15276 48261 317022 72951 -95352 -145100 142188 203940 177366 228052 -231002 -39330 159852
15264 39194 -231982 -2951 359295 171229 -9614 190779 57388 141740 24340 73322 -66016
15252 -63928 332691 144494 398945 916707 1314282 1472745 1352812 1064107 986099 363771
15241 246681 144625 22203 292577 100381 -140802 -359450 81140 -198863 286550 316101
15231 316101 25112 -87072 162366 211547 238800 107335 266870 376828 311600 -109873
15220 26353 -74682 -292078 -7260 -105602 141088 591783 -132874 142924 -215296 180829
$$ packed form
15297A90726b74463B85529a46987C7166J62020F9564a3517B65546b62020H0336
15286c4740A6157b39059J04407C45986b21514B95090A33408c65032A3728L4533
15276D8261K68761G2951i5352m9748A42188O1752k6574N0686b31002c9330A59852
15264C9194b31982b951C59295A71229i614A90779E7388Q4352B4340M8982f6016
15252f3928C32691A44494K54451N17762L97575J58463j19933k88705p8008C63771
15241B46681j02056B2203K70374A00381a40802k18648H1140a98863B86550K9551
15231C16101B5112h7072A62366M9181K7253A07335J59535J09958o5228a09873
15220B6353g4682k17396g260r8342A41088M50695a32874A42924b15296A80829
$$ plain form
15209 -12547 -64986 77504 268522 96874 306947 24500 -59972 138725 244220 -80851 35336
15197 153313 198300 -136274 -91024 125349 193269 46605 44528 75427 29177 10480 -126338
15185 -41964 53511 345253 78529 356995 296935 16954 -180986 212556 299344 343288 288477
15174 288477 -22515 389751 -163693 85071 66679 358366 462874 367303 -82536 259 298701
15163 298701 324379 170430 207145 -9392 140447 17323 180116 673488 24599 98869 170085
15152 170085 240538 -4144 -1726 70033 17786 224835 5960 -10832 359596 -138119 -75362
15141 -75362 -219046 46360 -107147 -43327 189021 320099 196199 -201869 41196 135960
15131 135960 104127 193777 243639 174715 8200 27699 -18567 102688 -11835 218080 303023
$$ packed form
15209a2547n2439G7504J91018I6874K10073B4500e9972A38725J05495h0851C5336
15197A53313M4987a36274M5250A25349O7920D6605k077L0899B9177A0480a26338
15185d1964E3511K91742G8529K78466o0060A6954a80986B12556Q6788M3944n4811
15174B88477b2515C89751a63693H5071j8392K91687J04508r5571h2536B59K98442
15163B98701K5678j53949L6715i392A40447A7323J62793M93372B4599P4270P1216
15152A70085P0453d144a726G0033A7786K07049E960a0832C59596a38119O2757
15141g5362j43684D6360a07147d3327A89021J31078j23900b01869D1196R4764
15131A35960l1833Q9650M9862o8924H200J9499a8567A02688a1835B18080Q4943
$$ plain form
15120 303023 197956 151896 328691 284991 -38468 -262614 -100890 241234 274602 261998
15110 261998 145125 254259 128908 -65728 69100 305058 238214 77564 -37130 95327 -395492
15098 337880 113526 246775 9954 -9635 37950 180241 -93482 92745 221923 99699 347657
15087 347657 19351 114775 142395 116766 342409 289886 -2881 178937 334760 52463 410295
15076 410295 356668 255880 28576 495235 -11014 74807 53089 176283 209935 123578 125833
15065 125833 64332 301346 305855 128380 -8668 80170 -120380 241836 219640 122375 166494
15054 166494 366663 331828 -104082 -178948 237803 288732 423196 -97128 146177 117697
15044 117697 317550 651981 330657 38770 114599 -23307 129034 346869 66082 167708
$$ packed form
15120C03023j05067m6060J76795m3700c8468k24146a00890B41234L3368j2604
15110B61998j16873J09134j25351f5728F9100K35958o6844G7564c7130I5327c95492
15098C37880A13526J33249I954i635C7950J42291i3482I2745J29178I9699K47958
15087C47657A9351R5424K7620k5629K25643n2523b881A78937J55823E2463L57832
15076D10295n3627j00788B8576M66659a1014G4807k1718J23194L3652q6357K255
15065A25833o1501K37014M509A28380h668H0170a20380B41836k2196r7265M4119
15054A66494K00169l4835a04082p4866B37803N0929J34464i7128A46177k8480
15044A17697J99853L34431l21324C8770P5829b3307A29034K17835F6082J01626
$$ plain form
15034 167708 229408 370564 232160 197205 204469 437780 155711 350311 -69944 365701
15023 231294 148859 154225 143500 300107 209338 115520 402979 -30961 148499 154580 -16936
15011 460570 413183 221125 369993 261617 126485 516295 137883 -52837 416889 207819
15000 436935 29228 525274 413251 -135988 306036 -217637 428317 220800 51989 232967
14990 232967 98536 173217 -65311 309800 402278 90809 87893 79543 73232 332515 199291
14979 199291 401809 147034 307117 457774 -142193 56174 169685 457003 505374 -147995
14968 347864 485437 95584 231782 11766 361848 -43143 271478 458770 401907 478130
14958 478130 217642 328550 288963 351377 307735 351759 248256 38504 353499 150624
$$ packed form
15034A67708O1700J41156j38404l4955P264K33311A55711J94600f9944C65701
15023B31294q2435N366j0725J56607r0769r3818K87459c0961A48499O081a6936
15011D60570m7387j92058J48868j08376A26485L89810A37883e2837D16889B07819
15000D36935B9228M96046j12023a35988C06036b17637D28317k07517E1989J80978
14990B32967I8536P4681f5311C09800R2478I0809k916q350o311K59283j33224
14979A99291K02518A47034J60083J50657a42193E6174J13511K87318M8371a47995
14968C47864J37573I5584J36198A1766L50082d3143B71478J87292n6863P6223
14958D78130B17642J10908l9587O2414m3642M4024j03503C8504L14995A50624
$$ plain form
14947 279009 144661 326103 422695 -39027 351502 232541 296995 330934 427059 300015
14937 300015 311859 207025 73233 99586 312131 399167 230590 388952 361526 26074 502822
14926 502822 668701 545590 106886 233279 350787 316709 350790 332817 287759 -65889
14915 478976 569664 258045 311496 558347 317049 -9663 173635 235380 123695 83071 208578
14904 208578 405606 212702 640552 179072 500175 289988 614623 596483 188638 134630
14894 134630 687789 212401 258053 157380 593785 407247 470363 465842 251902 123219
14883 697616 99121 291627 610994 230170 551928 138831 345602 189364 324850 294515
14873 294515 619739 571160 302751 449711 198910 213732 407968 491027 784907 681339
$$ packed form
14947B79009j34348J81442R6592c9027C51502j18961O4454L3939R6125j27044
14937C00015J1844j04834G3233K6353K12545Q7036j68577J58362k7426B6074M76748
14926E02822J65879j23111A06886J26393J17508l4078L4081j7973m5058f5889
14915D78976R0688B58045N3451K46851k41298i663A73635O1745j11685m0624J25507
14904B08578J97028j92904M27850A79072L21103k10187L24635j8140A88638n4008
14894A34630N53159B12401M5652j00673M36405j86538O3116m521k13940A23219
14883F97616I9121J92506L19367B30170L21758A38831K06771j56238J35486l0335
14873B94515L25224m8579k68409J46960A98910J4822J94236Q3059K93880j03568
$$ plain form
14863 681339 324487 425932 850661 107818 504503 223693 157430 302376 333813 438265
14853 438265 496589 652688 116208 573896 -5373 249098 586509 315968 231104 372767
14843 372767 225324 412355 232768 466956 296659 301345 563395 223230 556987 427652
14833 427652 524793 358466 503882 166655 610699 155971 338383 123966 102686 504744
14823 504744 792733 369037 160580 355877 692852 807414 211925 503254 388198 828214
14813 828214 231395 110449 752233 709036 357717 430630 493441 514053 558037 1030240
14803 1030240 535756 632229 597731 240274 594267 430376 391746 307794 358379 360563 871053
14792 871053 440347 557308 553718 632368 812609 612072 763365 809995 565075 885170
$$ packed form
14863F81339C24487J01445M24729A07818L96685B23693o6263J44946L1437J04452
14853D38265N8324J56099A16208M57688e373B49098L37411k70541q4864J41663
14843C72767j47443J87031j79587K34188j70297M686K62050B23230L33757j29335
14833D27652R7141j66327J45416A66655M44044A55971J82412A23966k1280M02058
14823E04744K87989C69037A60580J95297L36975J14562B11925K91329j15056M40016
14813H28214B31395A10449O41784m3197l51319P2913O2811K0612M3984M72203
14803A030240m94484R6473l4498B40274L53993j63891l8630q3952N0585K184N10490
14792H71053m30706J16961l590P8650J80241k00537J51293M6630k44920L20095
$$ plain form
14782 885170 599554 583808 509204 885678 474295 816603 329505 626248 701471 461581
14772 461581 474072 579472 495054 596445 351875 602144 598732 720951 545050 929906
14762 929906 710605 785214 511592 441025 880999 617578 851390 668064 800444 872446
14752 872446 696904 789566 445144 603913 575030 854561 665489 900930 558388 842755
14742 842755 681421 462909 694521 704162 716563 906485 953882 773943 1022901 878611
14732 878611 836804 804594 585750 623702 788786 895436 989294 630045 776205 735550
14722 735550 1104989 1153407 893129 961406 713203 1026662 1056657 690330 938450 682207
14712 682207 721287 1002358 906083 1041272 887221 937839 1034078 1114330 733049 816728 625880
$$ packed form
14782H85170k85616j5746p4604L76474m11383L42308C29505K96743P5223k39890
14772D61581J2491J05400q4418J01391k44570K50269l412J22219j75901L84856
14762I29906k19301P4609k73622p0567M39974k63421K33812j83326J32380P2002
14752H72446j75542R2662l44422J58769k8883K79531j89072K35441l42542K84367
14742H42755j61334k18512K31612R641J2401J89922M7397j79939K48958j44290
14732H78611m1807l2210k18844L7952J65084J06650R3858l59249J46160m0655
14722G35550L69439M8418k60278O8277k48203L13459K9995l66327K48120k56243
14712F82207L9080K81071r6275J35189j54051N0618R6239Q0252l81281Q3679j90848
$$ plain form
14701 625880 929132 572006 997016 710986 1039442 1188869 1056643 922745 976264 956234
14691 956234 992959 789476 1099886 985598 912105 993820 863450 1095848 904802 1100063
14681 1100063 1427164 721441 785370 940941 1026786 1029126 916356 1042549 1255329 856853
14671 856853 1149776 821547 1216386 1214258 991661 1248251 1201458 1186519 1260105 1065619
14661 1065619 1032838 983885 1170428 1099189 1156807 893674 1287373 1456818 1545424 1202604
14651 1202604 1252937 1281766 1312311 1030102 1340814 1254410 952108 1179805 1370534 1456147
14641 1456147 1154968 1530474 1401232 1407122 1389939 1046273 1298081 1522182 1327473 1349495
14631 1349495 1425325 1304839 1428924 1492014 1517780 1513601 1344666 1530839 1597593 1365209
$$ packed form
14701F25880L03252l57126M25010k86030L28456J49427j32226j33898N3519k0030
14691I56234L6725k03483L10410j14288p3493Q1715j30370K32398j91046J95261
14681A100063L27101p05723O3929J55571Q5845K340j12770J26193K12780l98476
14671H56853K92923l28229L94839k128k22597K56590m6793j4939P3586j94486
14661A065619l2781m8953J86543p1239N7618k63133L93699J69445Q8606l42820
14651A202604N0333K8829L0545k82209L10712q6404l02302K27697J90729Q5613
14641A456147l01179L75506j29242N890j7183l43666K51808K24101j94709K2022
14631A349495P5830j20486J24085O3090K5766m179j68935J86173O6754k32384
$$ plain form
14621 1365209 1098964 1433544 1463123 1530285 1769438 1662673 1770629 1412351 1443829 1336062
14611 1336062 1498466 1589988 1778497 2110725 1809715 1797541 1979606 1795803 1592634 1405039
14601 1405039 1612906 1856527 1646038 1869752 1924879 1793601 1607146 2010105 1947254 1966314
14591 1966314 1917681 1739201 1817087 2058785 1888582 1813456 2296615 1859707 1956135 1911504
14581 1911504 1816010 2046866 2304215 2111139 2421649 1836217 2104787 2315250 2393587 2417170
14571 2417170 2273982 2428863 2327625 2560588 2506564 2528102 2475647 2890663 2599551 2736283
14561 2736283 2888159 2856584 3318146 3433198 3539997 3422720 3398089 3880648 4260947 4608552
14551 4608552 5216839 6726219 8802103 12393835 19537509 30118602 31376858 23011103
$$ packed form
14621A365209k66245L34580K9579O7162K39153j06765J07956l58278L1478j07767
14611A336062J62404R1522J88509L32228l01010j2174J82065j83803k03169j87595
14601A405039K07867K43621k10489K23714N5127j31278j86455M02959o2851J9060
14591A966314m8633j78480P7886K41698j70203p5126M83159m36908R6428m4631
14581A911504r5494K30856K57349j93076L10510n85432K68570K10463P8337K3583
14571B417170j43188J54881j01238K32963n4024K1538n2455M15016k91112J36732
14561B736283J51876l1575M61562J15052J06799j17277k4631M82559L80299L47605
14551D608552O08287J509380K075884L591732P143674J0581093J258256q365755
$$ plain form
14543 23011103 13018713 6807420 4865387 4237460 3401095 2816255 2695913 2675206 2735264
14534 2735264 2326397 2608842 2403396 2679610 2435152 2357980 2490462 2565391 2385462 2598538
14524 2598538 2766268 2716188 2745442 2695026 2552957 2843100 3198659 2715190 3057174 2983426
14514 2983426 3071139 2763556 2781813 3098303 3083187 2724148 3048780 3160237 2996353 3197565
14504 3197565 3354939 3247048 3479212 3135495 3433215 3190310 3648558 3808134 3511853
14495 3511853 3375977 3414714 3693532 3759796 3654632 3770937 3663188 3575958 3845139 3653286
14485 3653286 4004963 4104164 4035967 4003099 4133986 4115218 4395617 4116428 4437806 4177583
14475 4177583 4463008 4450174 4596524 4115309 4598173 4415831 4459643 4494334 4744052 5010794
$$ packed form
14543B3011103r992390o211293j942033o27927q36365n84840j20342k0707O0058
14534B735264m08867K82445k05446K76214k44458p7172J32482P4929j79929K13076
14524B598538J67730n0080K9254n0416j42069K90143L55559m83469L41984p3748
14514B983426Q7713l07583J8257L16490j5116l59039L24632J11457j63884K01212
14504C197565J57374j07891K32164l43717K97720k42905M58248J59576k96281
14495C511853j35876L8737K78818O6264j05164J16305j07749q7230K69181j91853
14485C653286L51677R9201o8197l2868J30887j8768K80399k79189L21378k60223
14475D177583K85425j2834J46350m81215M82864j82342M3812L4691K49718K66742
$$ plain form
14465 5010794 4660427 4936195 5105085 5227421 5303941 5045597 4804567 5406485 5387543 5662329
14455 5662329 5214694 5442134 5655447 5468242 5637634 5959994 5942747 6007052 5848801 5692783
14445 5692783 6043076 6349271 6223369 6496427 6412264 6466479 6679802 6297349 6724484 6712649
14435 6712649 7138966 7197677 6983856 6887208 7576104 7094761 7446705 7619686 7827038 7710692
14425 7710692 8113279 7904345 8241536 8403486 8289281 8248368 8417635 8627997 8962619 8790037
14415 8790037 8986372 9191234 8933473 9489342 9645054 9752776 10028001 9957630 10520569 10348299
14405 10348299 10803874 10654437 10805617 11168049 11082779 11753440 11524174 11743045 11983304
14396 11983304 12015532 12380941 12631066 12510990 12680777 12860044 13060679 13463310 13596961
$$ packed form
14465E010794l50367K75768J68890J22336P6520k58344k41030O01918j8942K74786
14455E662329m47635K27440K13313j87205J69392L22360j7247O4305j58251j56018
14445E692783L50293L06195j25902K73058q4163N4215K13323l82453M27135j1835
14435F712649M26317N8711k13821r6648O88896m81343L51944J72981K07352j16346
14425G710692M02587k08934L37191J61950j14205m0913J69267K10362L34622j72582
14415H790037J96335K04862k57761N55869J55712J07722K75225p0371N62939j72270
14405A0348299M55575j49437J51180L62432q5270O70661k29266K18871K40259
14396A1983304L2228L65409K50125j20076J69787J79267K00635M02631J33651
$$ plain form
14387 13596961 14063359 13937999 14249371 14391273 14692777 15302787 15471316 16073810 15915802
14378 15915802 16164144 16755924 16800046 17129747 17445331 17786298 18234075 18539394 19063579
14369 19063579 19204574 19315625 19869882 20399307 20488502 21584402 21416814 22438615 22817958
14360 22817958 23105929 23266874 24216460 24447775 25448539 25399427 26349002 27158688 27283488
14351 27283488 28255794 28891527 29631049 30398290 30661933 31700810 32642211 33344522 33898047
14342 33898047 35361626 36247351 37186916 38173678 39052299 40401838 41252974 42471072 43800592
14333 43800592 45045870 46434585 47796884 48789508 50514738 52242962 53856175 55540968
14325 55540968 57209636 59140588 61171937 62663530 65178736 67653070 69612320 72276672
$$ packed form
14387A3596961M66398j25360L11372J41902L01504O10010J68529O02494j58008
14378A5915802K48342N91780M4122L29701L15584L40967M47777L05319N24185
14369A9063579J40995J11051N54257N29425Q9195J095900j67588J021801L79343
14360B2817958K87971J60945R49586K31315J000764m9112R49575Q09686J24800
14351B7283488R72306O35733P39522P67241K63643J038877R41401P02311N53525
14342C3898047J463579Q85725R39565R86762Q78621J349539Q51136J218098J329520
14333D3800592J245278J388715J362299R92624J725230J728224J613213J684793
14325E5540968J668668J930952K031349J491593K515206K474334J959250K664352
$$ plain form
14317 72276672 75021522 77603826 80426112 83893106 86800400 90046155 93548000 97242416
14309 97242416 100942523 105044459 109455273 113886222 118490142 123211515 129016739 134806493
14301 134806493 140844767 146871356 153640184 160856876 168101133 176314759 184565608 193176829
14293 193176829 202477434 212572563 222796089 233541197 244936546 256788917 268932623
14286 268932623 282430379 295523193 309435577 323733096 337600157 352075615 366380149
14279 366380149 380414790 394051062 407159863 419221448 429640521 438402103 444357572
14272 444357572 446511977 448007899 448507513 440552039 436427061 434714401 428398710 418331215
14264 418331215 406990687 395130458 382441427 369492085 356708650 343953228 331045094
$$ packed form
14317G2276672K744850K582304K822286L466994K907294L245755L501845L694416
14309I7242416L700107M101936M410814M430949M603920M721373N805224N789754
14301A34806493O038274O026589O768828P216692P244257Q213626Q250849Q611221
14293A93176829R300605J0095129J0223526J0745108J1395349J1852371J2143706
14286B68932623J3497756J3092814J3912384J4297519J3867061J4475458J4304534
14279C66380149J4034641J3636272J3108801J2061585J0419073Q761582N955469
14272D44357572K154405J495922M99614p955474m124978j712660o315691j0067495
14264D18331215j1340528j1860229j2689031j2949342j2783435j2755422j2908134
$$ plain form
14257 331045094 317669510 304243177 290905280 278106207 265242390 252346486 239909464
14250 239909464 227854974 216492543 205968010 195546917 186118765 177196397 168780060
14243 168780060 160798323 153372951 146101125 139485958 132942512 127628271 121850954 116640478
14235 116640478 112011047 107060202 102206825 98860287 95069951 91204732 87668414 83859981
14227 83859981 80428196 77829774 75133748 72021500 69665925 67001815 64755145 62523328
14219 62523328 60370995 58731598 56776511 54538798 52916937 51611517 50259535 48595541
14211 48595541 47057766 45495541 44452774 42936982 42382965 41056544 40144704 38370523
14203 38370523 37404343 36428546 35851151 34971093 33753867 32922559 32033003 31191450 30533042
$$ packed form
14257C31045094j3375584j3426333j3337897j2799073j2863817j2895904j2437022
14250B39909464j2054490j1362431j0524533j0421093r428152q922368q416337
14243A68780060p981737p425372p271826o615167o543446n314241n777317n210476
14235A16640478m629431m950845m853377l346538l790336l865219l536318l808433
14227H3859981l431785k598422k696026l112248k355575k664110k246670k231817
14219F2523328k152333j639397j955087k237713j621861j305420j351982j663994
14211D8595541j537775j562225j042767j515792n54017j326421r11840j774181
14203C8370523r66180r75797n77395q80058j217226q31308q89556q41553o58408
$$ plain form
14194 30533042 30009672 28820134 28086950 27593040 27046727 26104519 25702223 25257113 24761307
14185 24761307 23940944 23754511 22986902 22343404 22361563 21843563 21092391 20855736 20078789
14176 20078789 19903702 19234846 19130438 18644482 18442487 17826928 17624735 17037023 16959548
14167 16959548 16425883 16098378 15469739 15597505 15396110 15128718 14862554 14493752 14141857
14158 14141857 14269461 13765776 13424883 13263295 13473596 13072746 12857998 12473020 12488496
14149 12488496 12017200 11582206 11817240 11747028 11516611 10844120 10993660 10629131 10297576
14140 10297576 10377261 10311995 10183159 9858151 9699904 9711061 9702484 9506549 9326623 9290986
14130 9290986 9423401 9107640 8803651 8728263 8440440 8210994 8295585 8217781 8128943 8061861
$$ packed form
14194C0533042n23370j189538p33184m93910n46313r42208m02296m45110m95806
14185B4761307q20363j86433p67609o43498J8159n18000p51172k36655p76947
14176B0078789j75087o68856j04408m85956k01995o15559k02193n87712p7475
14167A6959548n33665l27505o28639J27766k01395k67392k66164l68802l51895
14158A4141857J27604n03685l40893j61588K10301m00850k14748l84978J5476
14149A2488496m71296m34994K35034p0212k30417o72491J49540l64529l31555
14140A0297576P9685o5266j28836l25008j58247J1157q577j95935j79926l5637
14130I290986J32415l15761l03989p5388k87823k29446Q4591p7804q8838o7082
$$ plain form
14120 8061861 8420408 7681430 7846071 7911882 7513373 7429247 7400217 7316454 7126423 6912838
14110 6912838 6986136 6642929 6756048 6569984 6544161 6683139 6252599 6553020 6306089 6384840
14100 6384840 6410162 5939857 5817681 5732575 5670805 5816425 5727988 5840727 5528533 5526330
14090 5526330 5617873 5680103 5543930 5421072 5104513 5569367 5102064 4846573 4967467 5265221
14080 5265221 5315749 5130033 4649549 4626754 4663166 4949968 4694475 4583146 4766413 4219616
14070 4219616 4436193 4426508 4148154 4360905 4454986 4152305 4102835 4331199 4254365 4174771
14060 4174771 3951333 4181881 4223539 3795024 4040590 4064260 4220334 3842028 3850218 3326733
14050 3326733 3910255 3467929 3627539 3413850 3467219 3545257 3550249 3704646 3478834 3024019
$$ packed form
14120H061861L58547p38978J64641O5811l98509q4126k9030q3763j90031k13585
14110F912838P3298l43207J13119j86064k5823J38978m30540L00421k46931P8751
14100F384840K5322m70305j22176q5106o1770J45620q8437J12739l12194k203
14090E526330R1543O2230j36173j22858l16559M64854m67303k55491J20894K97754
14080E265221N0528j85716m80484k2795L6412K86802k55493j11329J83267n46797
14070D219616K16577r685k78354K12751R4081l02681m9470K28364p6834p9594
14060D174771k23438K30548M1658m28515K45566K3670J56074l78306Q190n23485
14050C326733N83522m42326J59610k13689N3369P8038M992J54397k25812m54815
$$ plain form
14040 3024019 3346050 3555402 3008418 3398981 3267349 3197169 3053276 3552015 3218217 3387340
14030 3387340 3196781 3287722 3319998 3062179 3148263 2825794 2835724 2827537 2908335 2618774 3060933
14019 3060933 2921115 2638666 2697440 2662435 2625691 2459868 2446068 2690832 2403403 2663023
14009 2663023 2511588 2376473 2279448 2365548 2728547 2218065 2415764 2139533 2540200 2354483
13999 2354483 2308431 2506730 2355318 2712725 2535638 2493092 2524459 2902921 3349846 3645480
13989 3645480 4797680 8325707 13923524 26009062 30108201 25852654 15377822 9795408
13981 9795408 7229619 6006391 4775814 4358650 3977209 3616685 3491763 3216408 3398115
13972 3398115 2872749 2954253 2761966 2721866 2790606 2581919 2505467 2371100 2352031 2303838
$$ packed form
14040C024019L22031K09352n46984L90563j31632p0180j43893M98739l33798J69123
14030C387340j90559R0941L2276k57819Q6084l22469R930q187Q0798k89561M42159
14019C060933j39818k82449N8774l5005l6744j65823j3800K44764k87429K59620
14009B663023j51435j35115r7025Q6100L62999n10482J97699k76231M00667j85717
13999B354483m6052J98299j51412L57407j77087m2546L1367L78462M46925K95634
13989C645480J152200L528027N597817J2085538M099139m255547j0474832n582414
13981I795408k565789j223228j230577m17164l81441l60524j24922k75355J81707
13972C398115n25366Q1504j92287m0100O8740k08687p6452j34367j9069m8193
$$ plain form
13962 2303838 2207280 2432584 2473125 2004729 2145488 2324486 1997400 1791916 1786560 1838601
13952 1838601 2467188 2024786 1890099 1994653 1736658 1971202 1856418 1927706 1827655 1816803
13942 1816803 1991979 1730397 1634915 1571185 2285883 1925151 1701530 1818375 1592302 2069080
13932 2069080 1835019 1802712 1676444 1513685 1867062 1865237 1633071 1915622 1573518 1669635
13922 1669635 1588479 1603425 1404061 1723090 1543182 1733150 1431295 1724333 1330727 1445617
13912 1445617 1300328 1323297 1256675 1469622 1722031 1315512 1260992 1561339 1178267 1747046
13902 1747046 1633166 1780815 1337200 1532263 1522030 1494985 1501962 1537830 1355724 1478423
13892 1478423 1140553 1302124 1339823 1488004 1270821 1117249 1188249 1532660 1195779 1179057
$$ packed form
13962B303838r6558K25304M0541m68396J40759J78998l27086k05484n356N2041
13952A838601O28587m42402j34687J04554k57995K34544j14784P1288j00051j0852
13942A816803J75176k61582r5482o3730P14698l60732k23621J16845k26073M76778
13932B069080k34061l2307j26268j62759L53377j825k32166K82551l42104R6117
13922A669635q1156J4946j99364L19029j79908J89968l01855K93038l93606J14890
13912A445617j45289K2969o6622K12947K52409m06519n4520L00347l83072N68779
13902A747046j13880J47649m43615J95063j0233k7045O977L5868j82106J22699
13892A478423l37870J61571L7699J48181k17183j53572P1000L44411l36881j6722
$$ plain form
13882 1179057 934785 1195248 1318480 1261686 1079808 1365173 1193543 1110970 1080964 1533943
13872 1533943 1626479 1265472 1023888 1056202 1354484 1227003 690444 812713 802028 1312372
13862 1312372 1013964 1171196 1049656 1041323 950375 675050 956546 1002399 1109643 1102917
13852 1102917 1034336 990671 1498582 1372508 843289 1053179 1000555 1048153 892220 1167521
13842 1167521 915813 842152 685088 1054357 766946 911422 909816 1355011 1099917 1013681
13832 1013681 1085741 931042 1225497 849548 744075 913863 1032094 864995 884995 919108
13822 919108 929229 1145139 764080 1132811 953300 524238 1092377 680221 908953 498313
13812 498313 811647 843870 928686 1201610 687545 1185869 1180107 876486 774039 781488 542830
$$ packed form
13882A179057k44272K60463J23232n6794j81878K85365j71630q2573l0006M52979
13872A533943R2536l61007k41584L2314K98282j27481n36559J22269j0685N10344
13862A312372k98408J57232j21540q333r0948k75325K81496M5853J07244o726
13852A102917o8581m3665N07911j26074n29219K09890n2624M7598j55933K75301
13842A167521k51708p3661j57064L69269k87411J44476j606M45195k55094q6236
13832A013681P2060j54699K94455l75949j05473J69788J18231j67099K0000L4113
13822I19108J0121K15910l81059L68731j79511m29062N68139m12156K28732m10640
13812D98313L13334L2223Q4816K72924n14065M98324n762l03621j02447P449k38658
$$ plain form
13801 542830 913380 732313 991774 836648 886881 814429 745538 525274 702436 1026216
13791 1026216 787306 583135 730951 678416 506208 612311 754222 668853 654263 875817
13781 875817 811620 851129 750478 819416 843944 844728 310276 1000941 794543 781588 401106
13770 401106 710506 772917 547456 448722 667080 464321 718721 619744 422941 871405
13760 871405 566031 869840 890393 670736 593201 435275 492935 662001 826476 713225
13750 713225 613019 730765 441408 645315 632692 509106 683225 600035 750507 831874
13740 831874 503808 557152 794413 395599 459843 701758 634084 614205 939542 560336
13730 560336 508225 845784 381669 563698 571634 849733 237933 146423 527799 560943
$$ packed form
13801E42830L70550j81067K59461j55126N0233p2452o8891k20264J77162L23780
13791A026216k38910k04171J47816n2535j72208J06103J41911q5369j4590K21554
13781H75817o4197L9509j00651O8938K4528P84C10276O90665k06398j2955l80482
13770D01106L09400O2411k25461r8734K18358k02759K54400r8977j96803M48464
13760H71405l05374L03809K0553k19657p7535j57926N7660J69066J64475j13251
13750G13225j00206J17746k89357K03907j2623j23586J74119q3190J50472Q1367
13740H31874l28066N3344K37261C95599O4244K41915o7674j9879L25337l79206
13730E60336n2111L37559C81669J82029P936K78099B37933r1510L81376L3144
$$ plain form
13720 560943 437484 503370 685819 472127 865188 331609 660169 280545 349531 645455
13710 645455 458806 482049 605236 548215 749451 491133 907307 364291 501469 650989
13700 650989 416003 330542 198352 614758 728753 594289 955668 699528 713119 481521
13690 481521 344932 754979 488554 510813 632405 260875 58980 346654 431621 519028
13680 519028 511695 218779 615920 596838 374545 438634 320329 505076 218073 371217
13670 371217 450308 744981 292890 513038 236815 556319 454437 453865 92499 417184
13660 417184 550961 643383 489691 464174 448709 247428 536989 547280 485581 460498 626611
13649 626611 70374 413192 553428 249714 419860 464814 303751 315716 483449 484728
$$ packed form
13720E60943j23459O5886J82449k13692L93061C31609L28560B80545O8986K95924
13710F45455j86649K3243J23187n7021K01236k58318M16174C64291J37178J49520
13700F50989k34986q5461j32190M16406J13995j34464L61379k56140J3591k31598
13690D81521j36589M10047k66425K2259J21592B60875E8980K87674Q4967Q7407
13680E19028p333B18779L97141j9082k22293O4089j18305J84747B18073J53144
13670C71217P9091K94673B92890K20148B36815L19504j01882n72I2499L24685
13660D17184J33777R2422j53692k5517j5465k01281K89561J0291o1699k5083J66113
13649F26611G0374L42818J40236B49714J70146M4954j61063J1965J67733J279
$$ plain form
13639 484728 625050 283869 119449 477840 649006 336141 418974 90206 438518 630408
13629 630408 487528 176446 473460 340649 425118 255538 383738 222280 509976 445601
13619 445601 263980 357457 284990 639944 452750 485596 524555 600771 587576 393750 552802
13608 552802 196100 498813 486198 415398 318252 454660 238175 165181 526602 249236
13597 606114 550245 412497 155885 450198 648513 436532 199052 424951 421154 500676
13587 500676 350285 377558 129837 224560 564421 265640 495147 462881 172738 466492
13577 466492 239830 311263 -234061 350963 25888 209034 351308 249086 463814 493712
13567 493712 257598 276232 567079 178612 540688 507635 173226 517134 118913 159780
$$ packed form
13639D84728J40322B83869A19449L58391J71166l12865Q2833I0206L48312J91890
13629F30408j42880A76446K97014j32811Q4469j69580J28200j61458K87696o4375
13619D45601j81621R3477p2467L54954j87194L2846L8959P6216j3195j93826J59052
13608E52802A96100L02713j2615p0800r7146J36408k16485p2994L61421B49236
13597F06114n5869j37748A55885K94313J98315k11981A99052K25899l797P9522
13587E00676j50391K7273A29837R4723L39861B65640K29507l2266A72738K93754
13577D66492k26662P1433b34061C50963B5888J83146J42274j02222K14728K9898
13567D93712k36114J8634K90847A78612L62076l3053A73226L43908A18913M0867
$$ plain form
13557 159780 108301 138967 -53625 498929 508358 545380 116999 193604 20089 233835 307304
13546 307304 339145 391115 612953 500190 305003 549140 231280 536770 95581 303712
13536 303712 269180 304697 398782 192757 392781 327109 274829 244382 487023 69171 199768
13525 199768 503276 238181 206820 20235 101041 52502 186162 228464 36610 368911 -5715
13513 212421 445546 146356 185379 307017 509132 -47882 322063 300234 318492 535988
13503 535988 238537 265420 277910 224376 36697 292540 267044 311979 289365 194075 556040
13492 556040 261313 623227 116286 225119 113875 241320 181471 150381 217159 6168
13481 334548 691454 453029 135051 243587 32700 198462 78198 23430 332825 29928
$$ packed form
13557A59780n1479L0666e3625D98929R429L7022A16999P6605B0089K13746P3469
13546C07304L1841N1970K21838j12763j95187K44137B31280L05490I5581K08131
13536C03712l4532L5517R4085A92757K00024o5672n2280l0447K42641F9171J30597
13525A99768L03508B38181l1361B0235Q0806m8539J33660M2302C6610L32301e715
13513B12421K33125A46356L9023J21638K02115d7882C22063k1829J8258K17496
13503E35988B38537K6883J2490n3534C6697K55843k5496M4935k2614r5290L61965
13492E56040B61313L61914A16286J08833j11244J27445n9849l1090O6778F168
13481C34548L56906k38425A35051J08536C2700J65762G8198B3430L09395B9928
$$ plain form
13470 161828 298080 112407 401036 297900 39794 303699 545348 63999 118025 41286
13459 111161 -8422 408148 185330 28137 382381 456158 330033 92393 238524 238844 175480
13448 175480 -17629 -19579 410616 369520 170144 270830 390836 -55894 248403 175540 463322
13437 463322 41251 149436 281442 486231 -90969 306122 455214 367438 188472 473591
13427 473591 58440 239071 41299 256939 95619 215916 134769 196259 200914 90353 238747
13416 238747 183077 435942 131451 42830 45146 132408 73073 347189 345134 340778 185040
13405 185040 213209 373078 542756 191797 285048 136925 5647 225788 588834 140885
13394 -159859 360499 41963 -38396 119354 284982 398308 605775 64370 191519 444213
$$ packed form
13470A61828J36252A12407K88629j03136C9794K63905K41649F3999N4026D1286
13459A11161h422D08148A85330B8137L54244P3777j26125I2393J46131L20o3364
13448A75480a7629j950D10616m1096A70144J00686J20006e5894B48403p2863K87782
13437D63322D1251J08185J32006K04789i0969C06122J49092q7776j78966K85119
13427D73591E8440J80631D1299K15640I5619J20297q1147O1490M655I0353J48394
13416B38747n5670K52865A31451D2830K316Q7262n9335K74116k055m356j55738
13405A85040K8169J59869J69678A91797R3251A36925E647K20141L63046A40885
13394a59859C60499D1963c8396A19354J65628J13326K07467F4370J27149K52694
$$ plain form
13384 444213 20222 -11557 191534 246436 101351 211034 387433 4709 42202 312933 207461
13373 207461 441948 300575 238739 236949 14880 340602 181245 85666 268729 530188
13363 530188 156853 -155498 277992 277885 78787 281836 354161 271936 300925 146726 -85806
13351 174551 61539 111300 -17558 198697 435971 182447 99298 332829 519440 376715
13341 376715 310836 150365 314300 135139 67131 57709 130068 294480 173229 -5280 189004
13329 -102830 120523 212556 247675 358350 103044 184442 207792 147092 105430 79094 212709
13318 212709 393826 44923 375140 132999 257072 56167 233687 578213 166485 193051
13308 193051 199919 271752 267427 388354 -94168 162571 209924 336838 347606 244275 111176
$$ packed form
13384D44213B0222a1557A91534N4902A01351J09683J76399D709L7493K70731j05472
13373B07461K34487j41373o1836j790A4880L25722j59357H5666J83063K61459
13363E30188A56853a55498B77992j07G8787K03049P2325q2225K8989A46726h5806
13351A74551F1539M9761a7558A98697K37274A82447q3149K33531J86611j42725
13341C76715o5879A50365J63935A35139F7131r422P2359J64412j21251e280A89004
13329a02830A20523R2033L5119J10675A03044Q1398K3350o0700m1662k6336J33615
13318B12709J81117D4923L30217A32999J24073E6167J77520L44526A66485K6566
13308A93051O868P1833m325J20927i4168A62571M7353J26914J0768j03331A11176
$$ plain form
13296 99693 344278 273339 111908 440059 474248 88064 110394 -16468 274612 146772 226250
13285 226250 378917 -22340 67946 458125 96727 136587 -207835 301392 308579 299817 -36329
13273 -15188 46840 184562 67042 56407 216195 126500 410729 517328 203964 228809 208857
13262 208857 -230873 -186512 -55710 517549 413150 95140 362309 271896 59851 -88009 21573
13250 328740 253159 263307 125035 114206 108667 85258 201753 173474 162411 -16397 358631
13238 218020 134139 -225749 206422 23090 -17821 31957 -32033 -143760 282740 79375 -31699
13226 112671 16391 227935 153419 93171 111549 322578 24226 -90281 597089 155450 -65928
13214 231136 148702 -68950 -29010 65300 -124998 79475 64093 162330 463077 196179 68927
$$ packed form
13296I9693K44585p0939A11908L28151L4189H8064K2330a6468B74612j27840P9478
13285B26250J52667b2340F7946L90179I6727L9860b07835C01392P187q762c6329
13273a5188D6840J37722F7042j0635J59788q9695K84229J06599B03964K4845j9952
13262B08857b30873M4361e5710E17549j04399I5140K67169r0413E9851h8009B1573
13250C28740p5581J0148A25035j0829n539k3409J16495k8279j1063a6397C58631
13238B18020q3881b25749B06422B3090a7821C1957c2033j11727B82740G9375c1699
13226A12671A6391K11544p4516o0248J8378K11029B4226i0281E97089A55450f5928
13214B31136q2434f8950b9010F5300a24998G9475j5382R8237L00747A96179F8927
$$ plain form
13202 -337977 273982 -174307 53726 330883 145365 -84440 -466468 484199 145787 -37589
13191 77480 -46130 -45644 260178 310774 38839 -115091 174830 -338348 167187 111108 -211191
13179 499839 92466 178680 17818 -130801 -109913 -59304 222093 82913 106866 -22986 -56493
13168 -56493 -291952 -84361 251078 -117298 102275 196201 116401 -161005 221581 45380
13157 137903 99358 25115 -168836 272256 459720 371946 454933 -79688 58020 35437 -72392
13145 511467 275718 -189330 297525 477984 152785 155654 -48950 -146597 258258 -17634
13134 392332 -63817 645349 92858 81358 -85534 165913 167088 376214 284832 104146 -15438
13122 -4012 4472 125998 30651 188773 84633 96374 391320 114284 136706 33631 147192
$$ packed form
13202c37977B73982a74307E3726K77157A45365h4440l82028D84199A45787c7589
13191G7480d6130M86B60178N0596C8839a15091A74830c38348A67187n6079b11191
13179D99839I2466Q6214A7818a30801K0888N0609B22093H2913K3953b2986l3507
13168e6493k35459h4361B51078a17298A02275R3926p9800a61005B21581D5380
13157A37903l8545B5115a68836B72256J87464q7774Q2987g9688E8020k2583g2392
13145E11467k35749a89330B97525J80459A52785K869d8950r7647B58258a7634
13134C92332f3817F45349I2858j1500h5534A65913J175K09126r1382A04146a5438
13122d012D472J21526C0651J58122H4633J1741K94946A14284K2422C3631J13561
$$ plain form
13111 147192 285360 78366 -158113 226226 133582 526650 -242858 301292 127329 141089
13101 141089 -35618 145909 76272 91406 257846 -13046 3371 -198373 -19362 6172 284517
13090 284517 -20067 -91540 -109872 -72152 68635 334737 -73547 64732 42474 229743 -271522
13078 80325 -2217 139038 122616 6531 172021 -163134 64421 385627 104606 212613 61215
13066 52237 69161 -77568 69385 -149967 9763 67526 124440 153493 347564 371726 272020
13055 272020 89405 -3710 147341 80666 58633 -73495 -181511 289494 156508 -311012 81882
13043 430376 127836 464823 -271388 -26295 163807 -268357 34443 -72767 -258564 84651
13032 75763 91361 211022 -15797 -147387 7452 -44599 628289 119050 150797 -129292 128887
$$ packed form
13111A47192J38168G8366a58113B26226r2644L93068b42858C01292A27329J3760
13101A41089c5618A45909o9637J5134J66440a3046C371a98373a9362F172K78345
13090B84517b0067p1473j8332L7720F8635K66102g3547F4732k2258J87269b71522
13078H0325b217A39038j6422F531J65490a63134F4421L21206A04606J08007F1215
13066E2237J6924g7568F9385a49967I763N7763N6914K9053J94071K4162r9706
13055B72020H9405c710A47341o6675k2033g3495j08016B89494j32986c11012H1882
13043D30376A27836L36987b71388b6295A63807b68357C4443g2767j85797H4651
13032G5763J5598J19661a5797j31590G452d4599F28289A19050L1747a29292A28887
$$ plain form
13020 -42040 76786 349625 30443 -516 45387 118536 348685 156959 -82260 315425 207522
13009 207522 175213 155365 224219 229793 446822 -177661 140122 -268473 53109 -44685 161758
12997 312127 380161 47788 9393 -81403 185573 282751 -27994 -63561 83325 134827 69453
12986 69453 3951 219120 -30284 1498 -154691 18190 -61307 -8695 52461 69385 211830 -156600
12973 13330 -65812 154787 216595 87445 57162 104973 -20982 20215 -280395 158869 36235
12961 9177 232538 -186391 156210 30771 97772 -372943 377149 -131087 -19085 -236511
12951 -236511 130996 71529 53137 -12736 -293050 35998 282493 253730 -35061 34918 152933
12940 152933 128135 139741 274396 124812 120703 253754 29144 447965 -41545 -102409 235704
$$ packed form
13020d2040G6786K72839C0443e16D5387P3149K30149A56959h2260C15425j07903
13009B07522l2309j9848O8854N574K17029a77661A40122b68473E3109d4685A61758
12997C12127O8034D7788I393h1403A85573R7178b7994l5567H3325N1502o5374
12986F9453C951K15169c0284A498a54691A8190f1307h695E2461J6924J42445a56600
12973A3330f5812A54787O1808H7445l0283M7811b0982B0215b80395A58869C6235
12961I177K23361a86391A56210C0771O7001c72943C77149a31087a9085k17426
12951b36511A30996n9467j8392a2736k80314C5998K46495k8763c5061C4918J18015
12940A52933k4798J1606J34655A24812m109J33051B9144M18821d1545o0864B35704
$$ plain form
12928 132356 380139 93851 156226 -31444 -51850 292635 272335 -78649 155331 -115195 72876
12916 81651 112135 228264 -81836 -59583 162862 96757 471900 58714 92917 111388 -175907
12904 -164670 142196 -421005 51898 -190817 -7647 219894 51993 309941 206996 48817
12893 -137312 186923 116650 10447 -304025 75527 135530 -127518 190865 85222 39635 -98086
12881 287814 -42595 -33316 -147353 -102425 367040 87944 289088 -143108 -274737 113443
12870 -91916 -31308 526039 -5284 197269 10833 196087 -43476 -291731 197905 56195 307194
12859 307194 2349 4853 336964 94792 -110278 122139 -32388 -29491 13330 -32391 39358
12847 -127097 8039 32209 -43838 -98439 -235365 112649 51883 11741 -21968 161199 244402
$$ packed form
12928A32356K47783I3851O2375c1444k0406B92635k0300g8649A55331a15195G2876
12916H1651L0484J16129h1836K2253A62862o6105L75143E8714L4203J8471a75907
12904a64670A42196d21005E1898a90817g647B19894E1993K57948j02945D8817
12893a37312A86923p0273A0447c04025G5527O0003a27518A90865H5222C9635i8086
12881B87814d2595R279j14037M4928C67040H7944K01144a43108j31629A13443
12870i1916c1308E26039e284A97269A0833J85254d3476k48255A97905E6195K50999
12859C07194B349K504L32111I4792a10278A22139c2388K897A3330c2391C9358
12847a27097H039K4170d3838n4601j36926A12649E1883A1741b1968A61199Q3203
$$ plain form
12836 244402 157079 170192 438664 70216 14219 268718 -82119 -28614 -574389 167272 200458
12825 200458 -49241 357900 -107018 -281199 -205331 256706 43067 62505 -61106 109355
12814 -172215 328547 -16519 112568 -115315 -7869 40455 -18406 20139 -356072 91143 -1634
12802 -18620 266686 365849 128925 -104852 291695 178542 86343 -62154 77553 114950 -279530
12790 -7110 27150 201609 138850 163494 -65924 -247017 31155 24297 -74889 188757 -179807
12778 97073 -116108 -245114 111700 93231 293358 250375 206708 -308037 154431 212680
12768 212680 -35787 -91997 -9941 41798 134089 -179075 -297882 184303 -132844 -44759 69487
12756 76936 -98396 -47397 110078 115763 -130203 22425 55686 252139 386609 242402 -71005
$$ packed form
12836B44402q7323J3113K68472G0216A4219K54499h2119b8614n45775A67272L3186
12825B00458d9241C57900a07018j74181P5868B56706D3067J9438f1106A09355
12814a72215C28547a6519A12568a15315g869D0455a8406B0139c56072I1143a634
12802a8620B66686R9163A28925a04852B91695j13153H6343f2154G7553L7397b79530
12790g110B7150J74459o2759K4644f5924j81093C1155o858g4889A88757a79807
12778I7073a16108j29006A11700j8469K00127m2983m3667c08037A54431N8249
12768B12680c5787n6210i941D1798R2291a79075j18807A84303a32844d4759F9487
12756G6936i8396d7397A10078N685a30203B2425L3261J96453J34470j44207g1005
$$ plain form
12744 154887 22898 141689 -12978 76091 -123525 -186971 289175 -184204 124759 145907
12734 145907 136984 271317 -209314 -8521 193478 -1219 238702 118575 295912 299131 184530
12723 184530 -102095 190534 155461 -142364 15083 -252993 -150157 11930 -27894 -264620
12713 -264620 124958 -235865 2708 -91291 336944 -45794 211631 311659 190883 -54977
12702 86282 -86105 258966 391341 86099 -61291 -147706 279532 -196895 481755 -13206 31519
12690 29772 -221120 133003 205247 58263 175925 61672 6477 -54808 -53773 283859 235045
12679 235045 2999 129882 -21505 250712 232372 292750 231188 406690 -107869 156623 174586
12668 174586 -154661 89663 -173715 -5505 195985 -5930 -30922 161040 63783 113820 127537
$$ packed form
12744A54887B2898J18791a2978G6091a23525o3446B89175a84204A24759K1148
12734A45907q923J34333b09314h521A93478a219B38702A18575J77337L219j14601
12723A84530a02095A90534l5073a42364A5083b52993J02836A1930b7894k36726
12713b64620A24958b35865B708i1291C36944d5794B11631J00028j20776e4977
12702H6282h6105B58966J32375H6099f1291q6415B79532a96895D81755a3206C1519
12690B9772b21120A33003P2244E8263J17662F1672F477e4808J035B83859m8814
12679B35045B999J26883b1505B50712j8340O0378o1562J75502a07869A56623J7963
12668A74586a54661H9663a73715e505A95985e930k4992A61040F3783N0037J3717
$$ plain form
12657 127537 31070 51378 53144 -61140 131308 179198 402548 -71153 -185720 134654 -30173
12645 501754 231201 -276992 -28642 132970 -84404 -227864 94161 -2009 180188 66891 -124543
12633 290216 -61390 217983 183419 216751 197655 438256 71661 713324 207348 32735 129949
12622 129949 -39804 280490 158061 159758 -249321 187629 29259 29382 108798 58108 309743
12611 309743 -13514 -194975 47079 128089 560076 -40319 231958 16992 -211878 81275 126148
12600 126148 -56105 -5157 369662 369837 14338 -77933 92639 -245646 377863 -200855 -58908
12588 -265856 71452 -64593 -354822 -136546 268647 136107 -97172 27728 131678 -41663
12577 -132776 -83757 -74281 62874 173284 124552 -214357 163221 190135 107884 -142791 36389
$$ packed form
12657A27537C1070K0308J766f1140A31308M7890K23350g1153j14567A34654c0173
12645E01754B31201b76992b8642A32970h4404j43460I4161b009A80188F6891a24543
12633B90216f1390B17983l4564L3332j9096K40601G1661O41663B07348C2735R7214
12622A29949c9804B80490j22429J697b49321A87629B9259J23P9416n0690K51635
12611C09743a3514j81461D7079Q1010M31987d0319B31958A6992b11878H1275M4873
12600A26148e6105e157C69662J75A4338g7933I2639b45646C77863b00855e8908
12588b65856G1452f4593k90229a36546B68647j32540i7172B7728J03950d1663
12577a32776M9019R476F2874J10410m8732b14357A63221K6914q2251a42791C6389
$$ plain form
12565 -42244 350 -22889 -47063 -54329 181447 -90590 153435 51974 -218735 16805 124292
12554 124292 69490 -147461 325401 189994 -105872 129366 165942 198009 206605 199733 -385936
12542 -24262 173102 51984 188667 -2697 39522 118884 284188 -119600 12102 43693 54563
12531 54563 47855 46943 158359 92714 -104721 71961 121811 75149 94784 -73316 125822 -121058
12518 -66829 74010 70739 271098 92292 94720 202090 -203181 95050 -22844 -73626 -131996
12507 -131996 -55315 -59713 -119844 -3025 -42543 52165 191770 4063 23708 258268 339226 188446
12495 188446 45817 85169 -168949 226124 118907 222979 148024 239375 54787 12125 178531
12484 178531 371727 199827 -72915 -88718 -298256 108133 -100769 -54944 -188237 68567
$$ packed form
12565d2244C50b2889k4174p266A81447i0590A53435E1974b18735A6805J07487
12554A24292n4802a47461C25401j35407a05872A29366L6576L2067Q596o872c85936
12542b4262A73102E1984J36683b697C9522P9362J65304a19600A2102L1591J0870
12531E4563o708r12J11416o5645a04721G1961M9850m6662J9635g3316A25822a21058
12518f6829G4010l271K00359I2292K428J07370b03181I5050b2844n0782n8370
12507a31996e5315m398o0131c025l9518E2165J39605D063J9645K34560Q0958j50780
12495A88446D5817L9352a68949B26124j07217J04072p4955R1351E4787A2125J66406
12484A78531J93196j71900g2915j5803k09538A08133a00769M5825j33293F8567
$$ plain form
12473 -88234 -251858 -2636 89415 39465 190010 -62660 -97340 -156273 -118706 8564 -288407
12461 171222 -138848 30879 -104203 -91839 122815 206881 18779 -13091 -98468 32166 -191551
12449 151804 100170 6277 156002 -173064 10396 270861 -203259 120796 -6696 4625 171369
12438 171369 2661 -298983 273049 -376574 305561 327590 54204 -216224 -248873 -80503 -129857
12427 -129857 -24061 -37844 -66166 -59231 47636 215197 194674 -12942 -13042 153616 -312265
12415 -68140 -111898 219313 22577 147948 60914 -312697 -296361 320514 6227 -362109 59711
12403 66683 -74573 -265432 -182782 -193730 294647 276104 205453 62631 37519 -36205 -4200
12391 -123642 222809 -29371 -6451 -252746 17646 51835 -26478 361827 -127274 146554 -174654
$$ packed form
12473h8234j63624b636H9415C9465J50545f2660l4680n8933L7567H564b88407
12461A71222a38848C0879a04203J2364A22815Q4066A8779a3091q5377C2166a91551
12449A51804n1634F277J49725a73064A0396K60465b03259A20796f696D625J66744
12438A71369B661b98983B73049c76574C05561K2029E4204b16224l2649h0503m9354
12427a29857b4061j3783k8322O935D7636J67561k0523a2942j00A53616c12265
12415f8140m3758B19313B2577J25371F0914c12697J6336C20514F227c62109E9711
12403F6683g4573j90859Q2650j0948B94647j8543p0651F2631k5112c6205d200
12391a23642B22809b9371f451k46295A7646L4189b6478C61827a27274A46554a74654
$$ plain form
12379 -22479 -101661 -227789 70840 259338 -181499 -175702 -142609 86298 81154 435571 49694
12367 56384 162398 87055 102748 -88870 114825 -75961 194680 152484 126126 82617 177688
12356 177688 7999 -64673 259390 -127518 51577 316366 -92704 190985 203882 -117724 -1193
12344 10773 80013 109449 12087 -105326 -59480 -316130 -62423 -209080 -210677 -388889 107092
12332 -47578 -142295 -77570 -107421 -6251 172368 121647 -221117 -69891 -485032 44818 48328
12321 48328 52935 239137 94211 7045 417057 -126446 -120253 -36798 -27015 -89567 237094 -169782
12308 171326 102308 -32184 102077 -169795 58898 -135672 116230 -331775 149203 43782
12297 -45001 30961 43044 31456 -122484 387202 13571 -155645 132593 288566 -82574 -89192
$$ packed form
12379b2479p9182j26128G0840J88498a81499N797L3093H6298n144L54417D9694
12367E6384J06014p5343J5693h8870A14825g5961A94680m2196k6358m3509R5071
12356A77688G999f4673B59390a27518E1577K64789i2704A90985J2897a17724a193
12344A0773O9240K9436A2087a05326M5846k56650f2423j46657j597j78212A07092
12332d7578r4717O4725k9851f251A72368n0721b21117f9891m15141D4818L510
12321D8328M607J86202I4211G045M10012a26446O193c6798R783o2552B37094a69782
12308A71326o9018c2184A02077a69795E8898a35672A16230c31775A49203D3782
12297d5001C0961J2083j1588a22484C87202A3571a55645A32593J55973h2574o618
$$ plain form
12286 -89192 101742 -427891 89408 27201 -46276 258183 238162 290840 124898 49650 198156
12275 198156 82198 -28683 11677 89930 294528 566008 41379 -135024 22748 109434 -35998
12263 -119030 144652 293894 -131033 20836 439993 -308468 107730 140595 -194736 -194805 148128
12251 421918 61124 4066 71330 57730 31357 156473 -58577 -70234 84689 571316 -92401
12239 1957 47740 -316577 545247 -107788 45260 141734 140545 307711 216206 301906 499375
12228 499375 393634 337077 -147943 320635 -274729 235738 95876 235051 311856 475543
12218 475543 -312294 119611 -40044 132488 257553 291121 278959 176249 300057 30305
12207 88503 57345 139105 173358 193532 215623 212730 228735 74642 -105922 309862 167341
$$ packed form
12286h9192A01742d27891H9408B7201d6276B58183k0021N2678A24898D9650J48506
12275A98156H2198b8683A1677P8253K04598K71480D1379a35024B2748Q6686c5998
12263a19030A44652J49242a31033B0836M19157c08468A07730L2865a94736o9A48128
12251D21918F1124D066O7264j3600k6373J25116e8577j1657H4689M86627i2401
12239A957M5783c16577E45247a07788D5260R6474j189J67166r1505Q5700J97469
12228D99375j05741n6557a47943C20635b74729B35738I5876J39175P6805J63687
12218D75543c12294A19611d0044A32488J25065L3568j2162j02710J23808C0305
12207H8503l1158Q1760L4253K0174K2091k893J6005G4642a05922C09862j42521
$$ plain form
12196 167341 -71981 234953 291484 2185 126268 218937 299959 240025 181977 180750 191257
12185 191257 180424 139105 118831 239115 -60089 194750 -263774 -235709 332779 179015
12175 179015 206181 38173 50149 -197693 -76985 184817 173785 353015 179142 682756
12165 682756 209986 173602 232903 -51404 519323 206023 26988 -16811 184560 -278653
12154 305446 -304320 227854 -42862 -73804 91836 17781 -271432 -92563 -82088 163010 69574
12142 -39126 -78587 167528 -82498 -8766 53760 43138 139553 46902 138625 245858 270601
12131 270601 137453 -10982 264981 -105742 402372 171843 -75318 108814 256359 104984
12120 -123754 -12555 -29743 130968 42339 -286499 323017 251448 -201287 -236047 -39816 -101230
$$ packed form
12196A67341g1981B34953N6531B185J24083R2669Q1022n9934n8048j227J0507
12185A91257j0833m1319k0274J20284f0089A94750b63774K8065C32779j53764
12175A79015K7166C8173J1976a97693g6985A84817j1032J79230j73873N03614
12165F82756B09986l6384N9301e1404E19323B06023B6988a6811A84560b78653
12154C05446c04320B27854d2862l0942I1836A7781b71432i2563J0475A63010F9574
12142c9126l9461A67528h2498h766E3760j0622R6415D6902R1723J07233K4743
12131B70601j33148a0982B64981a05742D02372A71843g5318A08814J47545A04984
12120a23754a2555j7188A30968D2339b86499C23017p1569b01287l4760c9816o1414
$$ plain form
12109 -101230 -278427 467216 -446824 -161210 -139274 83250 -154293 -110668 -11553 -141690
12099 -141690 -171643 98098 -19715 421971 128180 -24772 -5040 -191017 -216209 -148455 5234
12087 -290077 8247 154699 -154849 207077 293976 -108200 358714 337953 -122221 34109
12076 25338 -124701 -211657 161349 303120 85885 -134343 19740 -335296 104428 11105
12065 -79052 204899 -167938 120402 182886 756650 1118049 1238360 849718 192768 6271
12054 -169871 123208 491479 33794 134783 278617 170194 47950 -142656 -54695 -114406
12044 -114406 27452 319969 -197283 75273 -190238 -15489 -208629 -210333 162928 -66424 488025
12032 -61518 313 249367 71694 -12054 -90346 -90695 -14145 -506662 173350 -107849 191664
$$ packed form
12109a01230j77197D67216d46824a61210K1936H3250a54293M3625a1553j30137
12099a41690k9953I8098a9715D21971A28180b4772e040j85977k5192O7754E234
12087b90077H247J46452a54849B07077Q6899a08200C58714k0761a22221C4109
12076B5338a24701q6956A61349J41771H5885a34343A9740c35296A04428A1105
12065g9052B04899a67938A20402O2484N73764L61399J20311l88642A92768F271
12054a69871A23208L68271C3794J00989J43834j08423D7950a42656e4695n9711
12044a14406B7452K92517a97283G5273a90238a5489j93140j704A62928f6424D88025
12032f1518C13K49054G1694a2054p8292l49a4145m92517A73350a07849A91664
$$ plain form
12020 -35673 58971 -205920 -78279 135697 313492 109731 171300 -322344 -182989 -100409
12010 -100409 19708 -2724 22717 30642 350741 66540 -89701 37259 -47174 100189 -154020
11998 43284 166907 -219423 -85804 56006 40227 5849 75155 -106678 -20478 -36056 83740
11986 -43766 -91530 208646 -40220 -55615 -165324 77375 -232142 -183522 -35206 -262316 93640
11974 -129535 296374 89434 -301164 -156290 11751 139799 -19665 -186656 -36106 -203663
11964 -203663 -261546 -269357 -213174 -74965 -171972 276653 125148 153856 -215481 -252870 -17428
11952 82968 -307739 -9697 -59133 -122454 -288939 347544 184707 -88132 229980 82475 -155405
11940 -106356 224803 23636 191266 -345402 -168530 124770 26923 -26436 43270 127198
$$ packed form
12020c5673E8971b05920g8279A35697J77795A09731O1569c22344J39355Q2580
12010a00409A9708b724B2717P925L20099F6540h9701C7259d7174A00189a54020
11998D3284J23623b19423h5804E6006j5779E849O9306a06678b0478j5578H3740
11986d3766m7764B08646d0220j5395j09709G7375b32142M8620c5206k27110I3640
11974a29535B96374H9434c01164J44874A1751J28048a9665j66991c6106j67557
11964b03663n7883p811N6183g4965r7007B76653A25148K8708b15481l7389a7428
11952H2968c07739i697m9436o3321j66485C47544j62837h8132B29980H2475a55405
11940a06356B24803B3636J67630c45402a68530A24770B6923b6436D3270Q3928
$$ plain form
11930 127198 -97949 74705 139160 -71887 96827 -240640 -36432 108211 168626 -374514 -46548
11918 -29016 -201482 -41729 54610 -60253 187512 111057 -16402 79029 86144 -51328 -201774
11907 -201774 225416 -341470 -206763 331734 -34498 -89627 246158 -81455 -213612 74268
11896 -73753 153983 124209 367472 -243839 -207976 67500 140245 269323 389780 209356
11886 209356 71645 -239838 -393992 27836 -181998 -139611 39272 -93274 -464454 -17449 158934
11874 -255035 74034 202044 -127769 29223 174283 -226654 -91744 -174154 -39362 -24309 9309
11862 -87618 -227676 29723 166643 77780 -20032 212893 -215163 -27153 -391908 -68660 259549
11850 -25454 74110 135299 9565 -155863 -6713 47765 -131645 -340095 -111049 -235378 -264303
$$ packed form
11930A27198i7949G4705O4455g1887I6827b40640c6432A08211O0415c74514d6548
11918b9016j72466d1729E4610f0253A87512p6455a6402G9029P115e1328j50446
11907b01774B25416c41470J34707C31734c4498n5129B46158h1455j32157G4268
11896g3753A53983k9774K43263b43839L5863F7500P2745J29078J20457j80424
11886B09356G1645b39838j54154B7836a81998M2387C9272i3274l71180a7449A58934
11874b55035G4034J28010a27769B9223J45060b26654i1744q2410c9362J5053I309
11862h7618j40058B9723J36920G7780b0032B12893b15163b7153l64755f8660B59549
11850b5454G4110O1189I565a55863f713D7765a31645k08450a11049j24329k8925
$$ plain form
11839 -264303 65933 -198626 -159073 -46526 -88619 179385 -219411 -190817 17970 -119353 -174909
11828 -174909 76318 -67188 -47944 -131473 -69413 -33084 42334 -200051 346239 -289860 -258855
11817 -258855 48586 220820 -9894 -37301 95833 -112172 164914 -165378 -37916 -9909 -352951
11806 -352951 176837 -2542 291711 30872 -226625 -25031 -72860 -243705 -61183 324158 241181
11795 241181 40003 481633 -82780 -58701 269268 -117988 -199271 -174821 -279548 80455 100968
11784 100968 13982 -106718 169814 48600 79064 -297437 -192431 -152392 -106411 -223098
11774 -223098 -70524 -23635 58186 -35343 222174 171116 244301 -130352 164714 102703 86105
11763 86105 79981 96226 -202579 -34873 -233648 -32363 36761 187234 -231196 -240588 101093
$$ packed form
11839b64303F5933a98626L9553d6526m2093A79385b19411K8594A7970a19353n5556
11828a74909G6318f7188J9244q3529O2060c3084D2334b00051C46239b89860L1005
11817b58855D8586J72234i894k7407I5833a12172A64914a65378c7916i909l43042
11806c52951A76837b542B91711C0872b26625b5031m7829j70845f1183C24158q2977
11795B41181D0003M41630h2780K4079B69268a17988q1283K4450j04727H0455K0513
11784A00968A3982a06718A69814D8600L0464b97437J05006M0039M5981j16687
11774b23098g0524b3635E8186c5343B22174n1058P3185a30352A64714o2011j6598
11763H6105o124J6245b02579c4873j98775c2363C6761J50473b31196r392A01093
$$ plain form
11751 40534 68156 -124932 -421213 88871 -44333 97214 85168 -240191 -261563 247070 -328261
11739 -30019 29728 372415 39112 -91831 47252 54082 78571 78445 73024 -47055 195454 55297
11726 284450 -115277 396052 -303532 -414970 156674 203136 -12688 325596 107507 14027
11715 -7256 -345445 -27247 235131 222628 419066 -60467 50466 -20604 62385 -2004 78481
11703 53738 14178 176643 3826 269050 117103 36334 286566 182938 -246323 23210 213209
11692 213209 380838 -64272 94949 -102028 -72181 63522 -1492 -270259 364009 -33942 -125866
11681 -125866 -149620 -102491 -132715 -265017 115638 -62893 -186792 442320 -156880 132576
11670 -242365 -116463 -63537 135722 10638 -239672 -89772 -93903 75873 316061 -150579 -77271
$$ packed form
11751D0534K7622a24932k96281H8871d4333I7214j2046b40191k1372B47070c28261
11739c0019B9728L42687C9112i1831D7252O830K4489j26n421d7055A95454E5297
11726B84450a15277C96052c03532j11438A56674M6462a2688C25596A07507A4027
11715g256l38189b7247B35131j2503J96438f0467E0466b0604F2385b004G8481
11703E3738A4178J62465C826K65224A17103C6334K50232j03628b46323B3210J89999
11692B13209J67629f4272I4949a02028K9847F3522a492k68767C64009c3942r1924
11681a25866k3754M7129l0224j32302A15638f2893j23899D42320a56880A32576
11670b42365a16463N2926A35722A0638b39672h9772m131G5873K40188a50579P3308
$$ plain form
11659 -77271 350785 155397 185152 -233081 196126 92521 485477 40366 -53462 167305
11648 -141800 -19186 -128279 122049 104280 97754 -62026 219817 130822 -30498 132075 86716
11637 86716 -52671 -136737 195607 -124057 -108838 51595 -242782 225750 389570 73642 -235371
11625 -47856 -263576 167284 135510 282885 332136 291934 15687 -120096 165586 67053 -361853
11613 -305333 77831 -55895 -166481 190050 248819 19662 -16145 -154638 11314 137927 33536
11601 118573 123878 44204 116545 -195604 307129 -116232 -148576 30224 -150824 358257 209571
11590 209571 157134 -81962 130571 340331 136625 403595 149378 -37379 -100239 31268
11579 -43988 -167090 -11937 41394 -46044 -76852 86935 -302130 26186 224198 125782 11647
$$ packed form
11659g7271C50785A55397K9755b33081A96126I2521L92956D0366e3462A67305
11648a41800a9186j09093A22049j7769o526f2026B19817q8995c0498A32075m5359
11637H6716e2671q4066A95607a24057J5219E1595b42782B25750J63820G3642b35371
11625d7856k15720A67284l1774J47375M9251m0202A5687a20096A65586F7053c61853
11613c05333G7831e5895j10586A90050N8769A9662a6145j38493A1314J26613C3536
11601A18573N305D4204P2341a95604C07129a16232l2344C0224a50824C58257j48686
11590B09571n2437h1962A30571K09760A36625K66970A49378c7379o2860C1268
11579d3988j23102a1937D1394d6044l0808H6935c02130B6186J98012r8416A1647
$$ plain form
11567 63043 -286448 -107844 59774 -394975 -2321 93933 -224203 18200 58931 -120743 327834
11555 12600 -86128 -171782 382711 135065 202099 -471295 85891 143952 -74615 205783 111199
11544 111199 -124646 191613 247051 -10980 162547 -132625 -32230 -76473 126893 73475
11534 73475 78263 191770 -116264 6659 -140484 72487 91171 373901 145637 198173 2753
11522 -4555 -14648 99607 228241 -45158 161281 342358 207990 102669 -319779 183708
11511 -66396 78823 263022 -93177 131558 113911 441479 -50800 139368 352678 222532
11501 222532 393965 162183 132873 351641 -15811 117926 318606 228678 436864 589657
11491 589657 330245 73036 115298 291673 -124745 -51377 252391 168114 -29538 347071
$$ packed form
11567F3043b86448a07844E9774c94975b321I3933b24203A8200M0731a20743C27834
11555A2600h6128q5654C82711A35065O7034d71295H5891N8061g4615B05783r4584
11544A11199a24646A91613N5438a0980A62547a32625c2230m4243A26893n3418
11534G3475M788J13507a16264F659a40484G2487J8684K82730A45637N2536B753
11522d555j0093I9607J28634d5158A61281J81077j34368A02669c19779A83708
11511f6396G8823J84199i3177A31558j7647L27568e0800A39368K13310j30146
11501B22532J71433A62183k9310K18768a5811A17926K00680q9928K08186J52793
11491E89657k59412G3036M2262J76375a24745e1377B52391q4277b9538C47071
$$ plain form
11480 320460 85499 -220178 211546 448526 -10417 -124789 239553 464423 149589 394700
11470 394700 -222809 -54453 441002 -60346 132853 42788 255599 50625 64482 -253757
11459 103153 535577 291339 305890 74208 -11118 -8257 -303985 -33383 252921 -12397 98000
11447 165470 -24379 217066 146047 127694 249553 194294 580186 -12021 122338 246625
11437 246625 316643 103360 -265037 -24125 -12346 -109340 136780 -263958 -99487 45517 -10021
11425 288026 -65738 -215263 120152 262179 -90098 -108505 135955 -196025 294992 189153
11415 189153 -76224 202114 32733 -37147 -416237 -136216 34887 206088 -104137 418252
11404 127354 159449 -234586 227119 120763 -213134 33677 -91353 -101538 -209942 105280
$$ packed form
11480C20460H5499b20178B11546K36980a0417j14372B39553K24870A49589K45111
11470C94700b22809e4453D41002f0346A32853D2788K12811E0625J3857b53757
11459A03153M32424k44238J4551G4208a1118K861k95728c3383B52921a2397I8000
11447A65470b4379B17066p1019j8353J21859n5259L85892a2021A22338J24287
11437B46625P0018A03360b65037b4125J1779r6994A36780b63958i9487D5517a0021
11425B88026f5738j49525A20152J42027i0098j8407A35955a96025B94992j05839
11415A89153g6224B02114C2733c7147l79090a36216C4887J71201a04137D18252
11404A27354L2095b34586B27119j06356b13134C3677i1353j0185j08404A05280
$$ plain form
11393 -193256 174674 -310 56484 -25787 226219 61874 -275436 229675 188415 47164 -122143
11381 -132679 -361895 -114339 -25467 92553 -57775 339532 -117627 -168882 107512 -152848
11370 308935 -97949 -16031 68136 -155481 180938 80981 -247447 92548 -297000 101352
11359 -310651 -192400 -56708 119754 -16348 207255 119430 -121099 -231168 -122532 -104671
11349 -104671 -26241 228266 180354 -330733 -44250 49686 -34791 -169960 -340114 163957
11338 -123729 333085 118560 -144885 176633 44390 -6799 157664 -60944 186753 59596
11327 -175823 -316735 48936 129382 -136856 169870 274282 -173782 -57822 -29262 178399
11316 -154219 -107018 -251292 23190 -5448 164313 15803 474944 -185540 -85669 34820 -84970
$$ packed form
11393a93256A74674c10E6484b5787B26219F1874b75436B29675m1260D7164a22143
11381a32679k29216a14339b5467I2553e7775C39532a17627n1255A07512a52848
11370C08935i7949a6031F8136a55481A80938H0981b47447I2548b97000A01352
11359c10651J18251e6708A19754a6348B07255q7825a21099j10069J08636J7861
11349a04671b6241B28266m7912c30733d4250D9686c4791j35169j70154A63957
11338a23729C33085A18560a44885A76633D4390f799A57664f0944A86753E9596
11327a75823j40912D8936Q0446a36856A69870J04412a73782e7822K8560A78399
11316a54219M7201j44274B3190e448A64313A5803M59141a85540h5669C4820h4970
$$ plain form
11304 177318 -371771 -179372 -19543 78634 -143554 -18194 123705 59357 -199475 331301
11293 -141390 -134379 -158958 -109696 33316 -19537 33950 -68828 167995 74313 -324194 -108407
11281 62101 -64188 86277 -166739 243841 -4251 23380 -88072 -58871 245330 -15236 153141
11269 -66570 -18397 390768 163070 -132058 137577 -56160 -299842 -74034 101955 22488
11258 -80040 140968 -337179 -207367 118024 32020 -166282 -292290 -86133 86513 -106740
11247 100206 -31168 17551 -136639 -259998 -190417 -244017 59422 98575 269259 77529 -155699
11235 231969 -209585 -44314 -24033 40913 276956 162036 -195897 3473 53253 -22939 204371
11223 -102581 -132772 -172472 157045 -207058 109775 -54926 -12420 -85784 -75410 -61884 -10495
$$ packed form
11304A77318c71771a79372a9543G8634a43554a8194A23705E9357a99475C31301
11293a41390P011k4579M9262C3316a9537C3950f8828A67995G4313c24194a08407
11281F2101f4188H6277a66739B43841d251B3380h8072K9201B45330a5236A53141
11269f6570a8397C90768A63070a32058A37577e6160k43682g4034A01955B2488
11258h0040A40968c37179J29812A18024C2020a66282j26008h6133H6513a06740
11247A00206c1168A7551a36639j23359O9581n3600E9422L9153J70684G7529a55699
11235B31969b09585d4314K0281D0913K36043j14920a95897C473M9780b2939B04371
11223a02581l0191l9700A57045b07058A09775e4926a2420p3364J0374J3526a0495
$$ plain form
11211 34017 -43275 -231777 -227478 -30411 -225663 -128200 -123 -181768 -120319 229716 -406728
11199 -290158 20632 281863 13371 65281 -149153 -119272 172821 403446 -88392 -164547 -197059
11188 -197059 -264252 -211408 -83904 159224 124514 91619 65403 -176718 73567 149778 -197693
11176 133731 -339152 11249 -79565 194477 -246829 90360 -174642 -124566 -171592 -3488 -142585
11165 -142585 91876 -63148 93309 654 151026 -177620 230769 168724 22097 -114031 -114892
11154 -114892 30353 7142 -37776 44121 -190008 9013 215327 -364575 302979 111691 -73461
11142 362113 -55068 -37811 -356507 -93729 -45933 37986 -88136 239385 133031 88546 258513
11131 258513 -135133 2601 357063 91364 -53366 142768 -235541 147883 -159301 33563
$$ packed form
11211C4017d3275j88502M299c0411j95252R7463a23j81645O1449B29716d06728
11199b90158B0632K61231A3371N1910a49153K9881A72821K30625h8392p6155l2512
11188a97059o7193N2844h3904A59224l4710l2895k6216a76718G3567P6211a97693
11176A33731c39152A1249g9565A94477b46829I0360a74642N0076m7026c488j39097
11165a42585I1876f3148I3309F54J50372a77620B30769o2045B2097a14031q61
11154a14892C0353G142c7776D4121a90008I013K06314c64575C02979A11691g3461
11142C62113e5068J7257l18696i3729d5933C7986h8136B39385j06354m4485J69967
11131B58513a35133B601L54462I1364e3366A42768b35541A47883a59301C3563
$$ plain form
11120 141833 -72464 -258696 667898 -134847 -86293 205350 -45035 197332 534911 48970
11109 -316701 -137319 31251 90711 150845 3983 30517 100821 212987 80130 -178964 50963
11097 -136179 339918 76783 122431 299458 -160007 108203 262 165055 75391 59033 208543
11086 208543 129115 140702 591921 183958 190791 288868 419270 610542 246280 159595 -54135
11074 317807 306673 531736 400248 576623 205507 352374 589735 624660 190841 458839
11064 458839 514881 212130 418146 667166 624705 901589 403662 554848 927024 406146
11053 638952 697445 736947 975119 674490 656281 714280 905651 714060 747355 1068130
11043 1068130 452391 431911 706893 515114 1084241 518678 724308 985399 1066354 710804
$$ packed form
11120A41833g2464j86232F67898a34847M8554B05350d5035A97332L37579D8970
11109c16701a37319C1251N9460O0134C983K6534P0304J12166H0130a78964E0963
11097a36179C39918G6783M5648J77027a60007A08203B62J64793G5391j6358J49510
11086B08543p9428J1587M51219A83958O833R8077J30402J91272B46280q6685e4135
11074C17807j1134K25063j31488J76375B05507J46867K37361L4925A90841K67998
11064D58839N6042B12130K06016K49020m2461K76884D03662J51186L72176D06146
11053F38952N8493L9502K38172l00629j8209N7999J91371j91591L3295L20775
11043A068130D52391k0480K74982j91779N69127E18678K05630K61091Q0955l55550
$$ plain form
11033 710804 990531 682923 638268 394030 651226 379457 616316 1013215 1008767 809052
11023 809052 512387 713552 499465 494955 919320 453556 685513 301634 568514 820845
11013 820845 736141 255668 620962 519731 608436 635513 801380 606124 549643 801219
11003 801219 1018534 330621 642964 727064 222218 747184 549534 822288 335487 808151
10993 808151 418469 849463 264637 671049 931793 716771 931260 1111798 1124919 930750
10983 930750 985943 1094888 1155974 1388582 1454985 1679213 1819952 2153012 2333564 2288956
10973 2288956 2593249 3064944 2824974 2726896 2947123 2703414 2471914 2156262 2215848 1854522
10963 1854522 1585903 1343937 1351095 1385264 1603848 1732317 1762679 1619347 1605544 1250471
$$ packed form
11033G10804K79727l07608m4655k44238K57196k71769K36859L96899m448j99715
11023H09052k96665K01165k14087m510M24365D53556K31957C01634K66880K52331
11013H20845q4704B55668L65294j01231Q8705K7077J65867j95256n6481K51576
11003H01219K17315C30621L12343Q4100B22218N24966j97650K72754C35487M72664
10993H08151l89682M30994B64637M06412K60744k15022K14489J80538J3121j94169
10983I30750N5193J08945O1086K32608O6403K24228J40739L33060J80552m4608
10973B288956L04293M71695k39970r8078K20227k43709k31500l15652N9586l61326
10963A854522k68619k41966P158L4169K18584J28469L0362j43332j3803l55073
$$ plain form
10953 1250471 1417552 1201812 919857 665604 781967 583296 404129 703725 469402
10944 469402 109639 520985 358079 -34387 70739 269414 -52942 240224 459526 424128
10934 424128 282004 200820 320323 266027 361829 226924 -225571 32128 -171410 200632
10923 -136270 -21145 17694 168627 143998 -28265 86865 141141 122335 -300056 -123336 147339
10911 18063 -137921 -89855 109146 -315053 179092 36072 55209 369369 66971 -188649
10900 156509 -373097 -260218 37001 -141007 -62396 -186442 -158298 470458 -134132 -219742
10890 -219742 92928 -486454 67031 354910 28174 -178204 -194693 -139416 253390 61021 107491
10879 107491 127915 -124332 116556 -20548 -45564 113147 191323 104207 -110683 -29383 -38488
$$ packed form
10953A250471J67081k15740k81955k54253J16363j98671j79167K99596k34323
10944D69402A09639M11346j62906c4387G0739J98675e2942B40224K19302l5398
10934D24128j42124q1184J19503n4296R5802j34905b25571C2128a71410B00632
10923a36270b1145A7694J50933k4629b8265H6865N4276j8806c00056a23336A47339
10911A8063a37921M8066A09146c15053A79092C6072J9137L14160F6971a88649
10900A56509c73097J12879C7001a41007f2396j24046K8144D70458a34132q5610
10890b19742I2928d86454F7031K87879B8174a78204j6489N5277B53390F1021M6470
10879A07491K0424a24332A16556b0548k5016A13147P8176q7116a10683b9383r105
$$ plain form
10868 -38488 124829 -141950 102400 -138337 -77420 115112 -220774 -102770 -99473 -269534
10858 -269534 -120631 -160778 -76474 343102 10186 -124207 124999 105243 -51090 -187384
10848 -187384 -56432 191874 77515 161594 -71796 100141 -158698 218692 -10755 362033
10837 -438045 -25388 343624 -137573 -124241 89981 -29668 120167 -208760 272505 -55033
10826 -239017 97667 -247229 -95115 -113076 -357141 -230239 -329855 131088 133743 62661 -275
10814 -84560 86011 16468 -143991 -48245 90149 232610 109084 -173476 41884 46966 -235336
10802 -273935 101678 -94441 -121936 -259403 -63746 14313 63984 -190881 -16905 125425 94098
10791 94098 -189887 100222 107845 39834 -62005 -35411 -133678 -177370 -142380 177929 -133678
$$ packed form
10868c8488A24829a41950A02400a38337O0917A15112b20774a02770L297j70061
10858b69534a20631m0147g6474C43102A0186a24207A24999j9756e1090j36294
10848a87384e6432A91874G7515Q4079g1796A00141a58698B18692a0755C62033
10837d38045b5388C43624a37573J3332H9981b9668A20167b08760B72505e5033
10826b39017I7667b47229i5115j7961k44065J26902r9616A31088K655F2661b75
10814h4560H6011A6468a43991d8245I0149J42461A09084a73476D1884N082b35336
10802b73935A01678i4441k7495j37467f3746A4313M9671a90881a6905A25425l1327
10791I4098a89887A00222P623C9834f2005K6594r8267m3692L4990A77929a33678
$$ plain form
10779 -73023 189310 -155505 -262511 294446 207838 -26466 166068 55460 -310242 -195947
10769 -195947 -26657 240493 -332636 -253915 121966 430840 -137513 -125645 197759 -42728
10758 72499 40127 -20368 256727 56285 -55628 -84980 -107146 95674 92369 137790 89117 32471
10745 79535 7206 -42673 35255 153069 156092 -4097 -467106 298186 386013 -386831 -100893
10733 -278296 -436250 -400164 -35942 -101287 -264824 -27841 71949 391863 45536 -153893 -280570
10722 -280570 -126707 -234727 -238029 -205691 -9459 -127205 -325119 -120206 -11349 -36648 -236679
10711 -236679 -22975 -194219 -422321 -292939 -187796 163790 -206221 361157 108903 -26639
10700 -289449 -326712 172871 109159 135201 -226907 313865 -50441 -140948 -327177 -570007
$$ packed form
10779g3023A89310a55505j07006B94446q6608b6466A66068E5460c10242J14295
10769a95947b6657B40493c32636P8721A21966L08874a37513J1868A97759d2728
10758G2499l2372b0368B56727E6285e5628k9352k2166I5674l305M5421m8673C2471
10745G9535G206d2673C5255J17814L023d097m63009B98186Q7827c86831a00893
10733b78296j57954L6086c5942o5345j63537b7841G1949L19914D5536a53893j26677
10722b80570a26707j08020l302L2338i459j17746j97914a20206a1349k5299k00031
10711b36679b2975j71244k28102J29382J05143A63790b06221C61157A08903b6639
10700b89449l7263A72871o3712K6042b26907C13865e0441r0507j86229k42830
$$ plain form
10690 -570007 -298375 -129329 -189689 243768 497536 -41407 142371 201079 146414 293383
10680 293383 142407 -109120 184518 -141450 -139006 69235 -201456 -252758 118611 -343678
10669 223076 -44675 37799 -223531 -66873 180901 -447103 100489 211987 -298619 53374
10658 31875 -262788 183656 105495 -127123 30112 -108014 -180457 -199437 93917 32957 41778
10647 41778 -89358 -167627 -10120 46070 -195996 -482984 22633 73744 -199217 -397359 327136
10635 -291314 34956 196804 -280817 -91306 -70407 -141661 -108337 -104246 -178229 59768 -52993
10623 -113621 -54220 -39778 -213539 -391832 29315 179045 -100942 179897 -80797 -80331 84501
10611 -21197 169629 -157492 -145177 -385972 243088 -335616 6609 -88832 -112692 87064 -14585
$$ packed form
10690e70007K71632a29329o0360B43768K53768d1407A42371N8708n4665J46969
10680B93383A42407a09120A84518a41450K444F9235b01456n1302A18611c43678
10669B23076d4675C7799b23531f6873A80901d47103A00489J11498b98619E3374
10658C1875b62788A83656p8161a27123C0112a08014p2443j8980I3917C2957Q821
10647D1778h9358p8269a0120D6070a95996k86988B2633N1111a99217j98142C27136
10635b91314C4956J61848b80817i1306K0899p1254L3324M091p3983E9768e2993
10623a13621e4220J4442j73761j78293B9315J49730a00942A79897h0797M66H4501
10611b1197A69629a57492J2315k40795B43088c35616F609h8832k3860H7064a4585
$$ plain form
10599 148879 -231539 114012 38193 -84488 -247566 361145 193635 219256 12332 -183032
10588 144166 -104769 -135738 -136703 -96036 222868 -136082 156892 5916 -37912 -71065 -79122
10577 -79122 -83227 -216872 -18441 74494 66287 272930 167385 -44694 -225087 135534 355663
10566 355663 -156486 -102393 -225265 12101 19723 -286724 -132451 -355979 -299997 53835 -185406
10554 -80948 24401 -173878 -359987 411255 -136920 254710 65526 -191114 10014 24943
10544 24943 -63234 -134844 -388147 -344222 3847 386967 142633 42529 102416 84860 -102653
10532 242591 -224952 23540 -115752 -271268 179691 226080 243276 -13976 -164571 3871 -231455
10520 96994 25490 254162 203988 -312641 -172109 143170 -83244 20930 135903 -101716
$$ packed form
10599A48879b31539A14012C8193h4488j63078C61145j67510K5621A2332a83032
10588A44166a04769l0969r65M0667B22868a36082A56892E916c7912l3153q057
10577g9122m105j33645a8441G4494q207K06643j05545d4694j80393A35534K20129
10566C55663a56486N4093j22872A2101P622b86724a32451k23528N5982E3835a85406
10554h0948B4401a73878j86109D11255a36920B54710F5526a91114A0014J4929
10544B4943f3234p1610k53303M3925C847L83120A42633D2529N9887j7556a02653
10532B42591b24952B3540a15752j55516A79691M6389J7196a3976j50595C871b31455
10520I6994B5490K28672n0174c12641J40532A43170h3244B0930J14973a01716
$$ plain form
10509 294954 -220315 160603 -17666 -54946 -22010 -45286 276254 -47906 -41364 44147 -88267
10497 80764 -101354 -23356 -25103 -182381 207189 1723 -310128 3730 108844 -10340 -181473
10486 -181473 206072 -140586 86318 -186024 201885 201176 299817 237074 510753 415496 187939
10474 -52374 -3584 179431 85990 328628 206003 251504 -103089 -292081 89070 137293 2746
10462 140632 17939 66214 78714 159389 10522 -96055 61309 235385 188982 -235648 -173887
10451 -173887 -73032 -68228 66366 -198744 58735 377915 -71807 -82151 -262480 -99030 -227133
10440 -227133 161848 128273 -74441 18870 10087 -20260 -360433 -67747 -14987 13205 268206
10429 268206 -9608 -323048 93678 121213 254226 -231111 -117534 -22840 -94135 -92827 44888
$$ packed form
10509B94954b20315A60603a7666l7280b2010k3276B76254d7906O542D4147h8267
10497H0764a01354b3356j747j57278B07189A723c10128C730J05114a0340j71133
10486a81473B06072a40586H6318a86024B01885p09R8641o2743K73679r5257A87939
10474e2374c584A79431H5990K42638j22625M5501a03089j88992H9070M8223B746
10462A40632A7939M8275J2500Q0675A0522i6055F1309J74076m6403b35648O1761
10451a73887g3032M804F6366a98744E8735L19180g1807j0344j80329i9030j28103
10440b27133A61848l3575g4441A8870q783b0260l40173f7747a4987A3205K55001
10429B68206i608l13440I3678K7535J33013b31111J13577b2840p1295J308D4888
$$ plain form
10417 -4081 202368 372233 17808 -83406 126064 363952 -59885 -287800 228653 41790 -208712
10405 -304241 36520 -91556 386805 173454 96691 -137853 102126 145498 -165439 -87743
10395 -87743 -25590 93833 -125862 351599 94186 122942 -46677 47988 60416 -49688 100816
10383 -162349 49820 100734 86966 -94003 60937 260062 116452 174610 94548 148438 195250
10372 195250 20362 218241 47663 514969 563298 272878 117179 458161 463266 445375 493001
10361 493001 28504 -94544 194652 158556 274672 334882 47990 287171 486259 382594
10351 382594 415588 374334 295557 106963 307430 513495 70275 292144 696879 6662 115128
10340 115128 -27728 159598 73748 247079 114856 97930 176490 263505 195935 172652 166207
$$ packed form
10417d081B02368J69865A7808h3406A26064K37888e9885k27915B28653D1790b08712
10405c04241C6520i1556C86805A73454p6763a37853A02126M3372a65439P7696
10395h7743b5590I3833a25862C51599I4186K8756d6677D7988J2428d9688A00816
10383a62349D9820N0914j3768i4003F0937J99125A16452N8158q0062N3890M6812
10372A95250B0362J97879D7663M67306M8329B72878A17179L40982N105j7891M7626
10361D93001B8504i4544A94652l6096J16116O0210D7990K39181J99088j03665
10351C82594L2994m1254p8777A06963K00467K06065G0275K21869M04735F662J08466
10340A15128b7728A59598G3748J73331A14856j6926P8560Q7015o7570k3283o445
$$ plain form
10329 166207 291532 -219239 -100721 129712 -71007 220726 392976 321401 119808 446738
10319 446738 -224590 -153522 334255 346692 520921 -119468 108120 -15692 15054 -171261
10308 -233635 103427 -110461 232645 -8635 94227 153905 27769 -49734 70889 325370 70590
10296 867 -41430 -11889 -82489 -62627 40315 67889 415269 312066 -202430 103184 296106
10285 296106 43827 -255169 -159033 -121657 67600 179823 -181828 -927 -125091 221107 -27764
10273 -104311 9052 -148336 -123080 22347 351449 -214064 22872 88122 22014 -110561 108632
10261 120644 262377 61790 354448 324772 -28412 120535 46519 61031 19096 109034 48974
10249 -291792 -352306 -115499 -23823 129658 -127939 13937 -191837 78113 -264949 -258146 113156
$$ packed form
10329A66207J25325b19239a00721A29712g1007B20726J72250p1575A19808L26930
10319D46738b24590P1068C34255J2437J74229a19468A08120a5692A5054a71261
10308b33635A03427a10461B32645h635I4227N9678B7769d9734G0889K54481G0590
10296H67d1430a1889p0600J9862D0315K7574L47380j03203b02430A03184J92922
10285B96106D3827b55169R6136L7376F7600J12223a81828i27j24164B21107b7764
10273a04311I052a48336K5256B2347L29102b14064B2872O5250B2014a10561A08632
10261A20644J41733F1790K92658k9676b8412A20535D6519J4512A9096Q9938D8974
10249b91792o0514a15499b3823A29658a27939A3937a91837G8113b64949O803A13156
$$ plain form
10237 -217211 -205944 -38930 -109068 43418 50602 204865 -217038 161363 -142428 -149255 -46305
10225 -111047 79540 194681 -169805 -118325 -77987 -51322 -6411 -38391 -128387 -312527 -14925
10213 -60729 -244306 155087 122625 -19503 -103169 39909 -238116 32338 217991 179808 240099
10202 240099 32565 296246 -125637 119016 -84671 -137071 -319659 -31715 56902 -196244
10191 -142129 -3037 -85344 -318910 3193 30669 -148832 217096 76089 256581 -290444 -231827
10180 -231827 100883 198316 151306 -177687 -207621 -53539 -31725 -190077 -20463 -28323 -268592
10169 -268592 -152422 -202443 -116343 -14237 -114606 -226391 151862 333415 -94674 4470 100592
10158 100592 75583 -66090 -51088 -125526 -403419 -325771 -100793 30730 34658 74113 -330374
$$ packed form
10237b17211J1267c8930p0138D3418P184J54263b17038A61363a42428o827d6305
10225a11047G9540J15141a69805N1480M0338K6665f411l1980q9996j84140a4925
10213f0729j83577A55087l2462a9503q3666C9909b38116C2338J85653l8183O0291
10202B40099C2565K63681a25637A19016h4671n2400j82588c1715E6902a96244
10191a42129c037q2307k33566C193K7476a48832B17096G6089J80492b90444N8617
10180b31827A00883R7433m7010a77687k9934e3539K1814j58352b0463p860k40269
10169b68592J16170n0021Q6100a4237j00369j11785A51862J81553i4674D470R6122
10158A00592k5009f6090J5002p4438k77893P7648a00793C0730L928L9455c30374
$$ plain form
10146 -597029 38321 -263585 -304304 -60068 -56809 1510 1364 48504 -13553 -107090 92070 132026
10134 132026 41406 -101275 -3910 96522 -193632 -176151 -61865 -25071 97395 102063 213219
10123 213219 171855 -29964 -370144 -352146 -88484 -54737 -42607 -143146 206269 -280034 29484
10111 38323 51014 -33265 -270924 -61236 -112803 -79815 -29054 -84708 -203028 -85359 21613
10099 -374014 -29733 -76383 -258710 -81537 -33972 34683 -283550 41719 -430730 -149141 -82505
10088 -82505 181237 181326 -126358 -29920 -200036 -202820 -487039 -199793 99311 -144048 166005
10076 -24327 -195852 -250157 105432 16473 332557 -5090 15779 -371917 50951 -313987 -61158
10064 -163649 -88380 48514 -106643 137170 105652 33817 -94656 -34390 -56634 -121303 -15153
$$ packed form
10146e97029C8321b63585m0719f0068L259A510j46M7140a3553r3537I2070L9956
10134A32026D1406a01275c910I6522a93632J7481f1865b5071I7395M668J11156
10123B13219m1364b9964l40180J7998h8484L3747J2130j00539B06269b80034B9484
10111C8323J2691c3265k37659f1236n1567L2988b9054n5654j18320h5359B1613
10099c74014b9733m6650j82327h1537c3972C4683b83550D1719d30730a49141O6636
10088h2505A81237Q9a26358b9920j70116k784k84219a99793I9311a44048A66005
10076b4327j71525n4305A05432A6473L16084e090A5779c71917E0951c13987f1158
10064a63649P5269D8514a06643A37170l1518C3817i4656c4390k2244o4669a5153
$$ plain form
10052 71936 -91845 -2001 -197610 -105506 -245814 137488 112105 -651309 -187261 112796 -211805
10040 -194871 -139677 -7523 -215946 -191379 123314 -8910 -28827 -307297 47290 -162090 -133637
10029 -133637 -158565 -80635 57023 -82960 200550 -10740 -354684 -20963 115848 -100573 -114381
10018 -114381 65037 -152144 141078 -177802 -7159 -260882 7480 -13333 -461654 -206992 -439973
10007 -439973 -134326 78974 -395584 -12164 80860 180610 -208549 105590 139713 50343 -74034
9995 213740 -2976 129715 -174742 -36200 -509 -38868 -146413 75120 -123559 161594 -59087
9983 -128226 -40923 97181 -188444 -315422 -48150 -329129 166176 13677 -225809 85946 -21018
9971 -60405 3257 -160831 -161402 159723 163800 3921 -229010 -130652 -5582 349593 -37695 75463
$$ packed form
10052G1936i1845b001j95609R2104j40308A37488k5383f51309a87261A12796b11805
10040a94871N5194g523k08423K4567A23314h910j9917k78470D7290a62090K8453
10029a33637k4928P7930E7023h2960B00550a0740l43944b0963A15848a00573j3808
10018a14381F5037a52144A41078a77802g159k53723G480a3333m48321b06992k32981
10007d39973a34326G8974c95584a2164H0860R9750b08549A05590L4123E0343g4034
9995B13740b976A29715a74742c6200e09l8359j07545G5120a23559A61594e9087
9983a28226d0923I7181a88444j26978d8150k80979A66176A3677b25809H5946b1018
9971f0405C257a60831n71A59723M077C921b29010R8358e582C49593c7695G5463
$$ plain form
9958 106867 -73475 -224539 126372 -109812 47849 32297 -147505 181621 -100735 -120089
9948 -120089 84347 -126332 -67810 86157 75223 -40990 -330272 -20050 57769 -28912 -54070
9937 -54070 20361 -341329 -223237 -109374 -261664 -48941 8806 -143514 -45232 148478 7913
9925 89880 -93872 -28597 509794 -385421 -240289 -30494 -206113 -238528 318521 -12949 309010
9913 -84976 -128995 -235248 -62607 -257282 -33095 -184324 -88526 39869 21455 -49241 83443
9901 260096 253386 -171242 -115503 -92443 -261043 -81468 -134361 39338 -19705 -282296 211056
9889 -73463 -383850 20505 23900 -30181 -71328 362878 -52507 37860 -197656 -259236 -223199
9878 -223199 -235978 -344236 -126626 44964 445575 235885 -24920 85320 -198474 248273
$$ packed form
9958A06867g3475j51064A26372a09812D7849j5552a47505A81621a00735j9354
9948a20089H4347a26332N8522H6157j0934d0990k89282b0050E7769b8912k5158
9937e4070B0361c41329J18092a09374j52290d8941H806a43514d5232A48478G913
9925H9880i3872b8597E09794c85421J45132c0494j75619l2415C18521a2949C09010
9913h4976m4019j06253f2607j94675c3095j51229h8526C9869j8414d9241H3443
9901B60096o710a71242N5739K3060j68600h1468n2893C9338a9705k62591B11056
9889g3463l10387B0505L395c0181m1147C62878e2507C7860a97656o1580L6037
9878b23199j2779j08258a26626D4964M00611k09690b4920H5320a98474B48273
$$ plain form
9867 -68171 13899 -21883 64094 -21099 183931 125636 63516 -211 379385 126225 -360121
9855 -83756 -337086 -150020 -317764 -78154 -36581 -499982 -99863 89232 -146404 343 13845
9844 13845 -326545 -36624 339182 -33689 76710 186035 -80508 76854 73690 -36624 -95667
9833 -95667 89725 -25600 -319249 -182552 213696 11007 210641 124786 -118455 35144 120102
9822 120102 -114509 -206692 35596 254891 -295771 75129 -41902 8742 -449192 -81068 -359302
9811 -359302 -234597 -407045 -109323 105098 -184454 -139583 -142797 -87742 16102 -51044 -292316
9800 -292316 -189649 41800 52904 -21201 -564328 -71103 -349602 -96125 142137 -266434 -169629
9789 -169629 -239902 173438 125430 -36314 -43300 82824 -157084 39041 -174941 -74696 -116972
$$ packed form
9867f8171A3899b1883F4094b1099A83931n8295o2120b11C79385A26225c60121
9855h3756k53330a50020j67744g8154c6581m63401i9863H9232a46404C43J3502
9844A3845c26545c6624C39182c3689G6710J09325h0508G6854l164c6624n9043
9833i5667H9725b5600k93649J36697B13696A1007J99634q5855a18455C5144Q4958
9822A20102a14509r2183C5596K19295b95771G5129d1902H742d49192h1068k78234
9811c59302J24705j72448a09323A05098a84454M4871l214N5055A6102e1044k41272
9800b92316J02667D1800J1104b1201n43127g1103k78499i6125A42137b66434R6805
9789a69629p0273A73438m8008c6314o986H2824a57084C9041a74941g4696m2276
$$ plain form
9778 -116972 -181836 -233958 -345588 -23761 51206 -257126 -321459 -146466 301087 -194966 -33944
9766 -288983 72316 624 220729 -128498 269991 -279849 -69207 -90578 -233130 197407 178421
9755 178421 -78931 -128161 185513 36222 -294937 -335180 -334403 -366172 -83155 -32438 322794
9743 -35726 -60846 3360 -166919 -202749 -194168 -119246 -40155 -306625 -19668 -231496 -41989 181180
9730 -9468 -30969 -37267 364838 -227538 97076 -156724 -349654 -45265 10230 51456 -19346
9718 -138681 -210060 -99154 -247412 129013 56969 59269 -126222 -197104 -172665 57968 -281328
9706 -49422 -148622 45318 83502 47863 21963 -174475 -185449 -458917 -99260 -57527 250188
9694 -226923 113561 -31211 -123352 -107402 -83696 -253432 -123277 -206880 -497880 80818 -57983
$$ packed form
9778a16972o4864n2122j11630b3761E1206b57126o4333a46466C01087a94966c3944
9766b88983G2316F24K20105a28498B69991b79849f9207k1371j42552A97407j8986
9755A78421g8931m9230A85513C6222b94937m0243P77l1769h3155c2438C22794
9743c5726k5120C360a66919l5830Q581P4922d0155k66470a9668k11828d1989A81180
9730i468k1501o298C64838b27538I7076a56724j92930d5265A0230M1226a9346
9718a38681p1379i9154j48258A29013E6969K300a26222p0882K4439E7968b81328
9706d9422r9200D5318L8184l5639B1963a74475j0974k73468i9260M1733B50188
9694b26923A13561c1211r2141J5950K3706j69736a23277q3603k91000H0818e7983
$$ plain form
9682 -365361 -138016 -21275 -107205 45830 57119 107850 -65919 -113196 102303 -316199 -79286
9670 -43363 -215306 -173607 -94204 18026 318102 -7629 16773 -330843 152414 87203 237662
9659 237662 -34904 -401077 -159106 110221 -523012 -13826 -240424 150018 -14588 50067
9648 -117311 -183499 20799 -220533 -10750 -26073 -101348 -90076 -292521 -163596 -84887 -185601
9637 -185601 -111423 -238063 32492 187794 -126190 117544 -59011 304936 396651 -49106 136838
9625 -105355 29748 -204127 152195 98564 -52802 -331564 370811 -114359 -118717 -117452 124792
9613 -43758 -475122 144142 -201036 -161930 -253685 148215 163667 98412 -217414 -29633 378987
9601 328510 40203 94926 -564801 -134350 -229864 -99236 -81284 -85895 -190811 149168 119005
$$ packed form
9682c65361a38016b1275q5930D5830J1289N0731f5919m7277A02303c16199g9286
9670d3363j71943M1699P9403A8026L00076g629A6773c30843A52414o5211J50459
9659B37662c4904l66173a59106A10221e23012a3826k26598A50018a4588E0067
9648a17311o6188B0799b20533a0750j5323p5275J1272k02445J28925P8709j00714
9637a85601P4178j26640C2492J55302a26190A17544e9011C04936R1715d9106A36838
9625a05355B9748b04127A52195n3631e2802k78762C70811a14359m358J265A24792
9613d3758m31364A44142b01036L9106r1755A48215J5452o5255b17414b9633C78987
9601C28510D0203N4723e64801a34350r5514i9236J7952m611j04916A49168l0163
$$ plain form
9590 119005 -206644 -253887 -116387 -74323 -351623 -252615 -308914 -26607 176 -101785 -219997
9579 -219997 -169997 -107800 -268648 113006 234327 -112826 -245763 -218491 -63942 59311 -101551
9567 116089 -199951 -7841 -321913 -118994 9252 117032 -89357 -165884 -23220 -3435 -107314
9556 -107314 61917 -252683 112402 1695 -364275 -160950 -5906 100497 -414658 -85133 -211474
9545 -211474 115107 -166859 -52461 56635 64113 -14502 -141700 -191479 -171580 8127 -156991
9533 -71042 -81870 152740 -33784 -101712 -314175 56145 -71484 -321974 134227 -279222 -98269
9521 -129513 -42885 -64380 -294275 -187934 -74716 -46301 22462 -112902 -40080 -117465 -59921
9510 -59921 -25579 250852 54255 -102931 -539828 -38386 212128 261505 41311 81490 -50119
$$ packed form
9590A19005b06644m7243a16387M2064k77300R9008n6299b6607A76a01785j18212
9579b19997N0000O2197j60848A13006J21321a12826j32937K7272f3942E9311a01551
9567A16089a99951g841l14072a18994I252J07780h9357p6527b3220c435j03879
9556a07314F1917b52683A12402A695c64275a60950e906A00497d14658h5133j26341
9545b11474A15107a66859e2461E6635P478a4502j27198m9779J9899H127a56991
9533g1042j0828A52740c3784o7928k12463E6145g1484k50490A34227b79222i8269
9521a29513d2885k1495k29895J06341g4716K8415B2462a12902d0080p7385N7544
9510e9921b5579B50852E4255a02931m36897c8386B12128M9377D1311M0179e0119
$$ plain form
9498 -96020 -35249 -145132 93024 -139626 -45460 -315517 -335104 -271195 -10348 -173627 -79805
9486 -151602 -48456 -148357 -63440 -72332 -168089 -93898 -190557 22919 -128816 -200782 -68103 54010
9473 20617 -233937 -187364 -152639 -55361 -230850 -161962 -100565 219009 -107864 -246159 -114653
9461 20927 234552 -383800 4843 -42522 -247391 234707 -50200 -386430 62944 104546 -69228
9449 64714 7264 14662 103645 -470868 -206461 -158883 -305231 -112001 72768 -303649 -75325
9437 -106221 -152575 -57653 72891 4344 75741 23659 -67908 -430647 182186 50158 -121852
9425 226237 100153 -406217 6259 -136275 -231631 -11838 -88914 -167147 -5266 -7391 -224607
9414 -224607 -167663 234919 -36814 -211793 283145 18461 -332559 64729 -52355 -142395 229056
$$ packed form
9498i6020c5249j09883I3024a39626d5460k70057j9587O3909a0348j63279g9805
9486a51602d8456r9901f3440q892r5757P4191r6659B2919a28816p1966f8103E4010
9473B0617b33937M6573L4725e5361j75489O8888O1397B19009a07864j38295a14653
9461B0927K13625c83800D843d2522k04869B34707e0200l36230F2944M1602f9228
9449F4714G264P398Q8983d70868b06461M7578j46348a12001G2768c03649g5325
9437a06221m6354e7653G2891D344P1397B3659f7908l62739A82186E0158a21852
9425B26237A00153d06217F259a36275r5356a1838p7076p8233e266k125k17216
9414b24607N6944B34919c6814j74979B83145A8461c32559F4729e2355r0040B29056
$$ plain form
9402 -105498 -101250 217588 189630 124383 -357028 -157892 39365 1562 -54362 -93210 -120682
9391 -120682 -281834 379102 152276 252890 77352 46746 -216577 -350643 537510 -228094
9380 -64141 -98072 34271 15200 66502 -168202 112895 -92931 -105671 -86520 -226488 -128251
9369 -128251 -120878 -49950 -609340 145913 -11441 -123417 -122772 -229199 -140365 -86219 -162945
9358 -162945 -109990 -304959 61533 -228171 153182 -9999 70158 44347 83535 -326794 -233032
9347 -233032 -432359 467041 2332 -218551 -25249 -232678 52956 -212046 51470 197972 -42474
9335 -51455 -111185 93957 65187 -232651 -7767 128803 -79703 -147978 -281567 -49354 -186832
9324 -186832 66656 -80005 250465 329756 181556 93107 370648 -90584 179367 56721 -234985
$$ packed form
9402a05498M248B17588k7958o5247c57028a57892C9365A562e4362l8848k7472
9391a20682j61152C79102A52276J00614G7352l0606b16577j34066E37510b28094
9380f4141l3931C4271A5200N1302a68202A12895i2931j2740J9151j39968R8237
9369a28251P373d9950n59390A45913a1441j11976O45j06427Q8834N4146p6726
9358a62945N2955j94969F1533b28171A53182i999G0158k5811L9188c26794R3762
9347b33032j99327D67041B332b18551b5249k07429E2956b12046E1470J46502d2474
9335e1455n9730I3957k8770b32651g767A28803g9703o8275j33589d9354j37478
9324a86832F6656h0005B50465P9291j48200q8449K77541i0584A79367E6721b34985
$$ plain form
9312 -140097 -355117 -233310 53966 -294665 -129152 273475 -131610 43183 -316162 102791
9301 32245 -240747 -136391 -173531 -159835 -94991 -69446 84483 140787 -18919 148423 30701
9289 -26877 154985 -109842 -30770 -301610 -106619 3749 -117764 -149131 -154235 -433264 -118119
9277 -48514 -75015 71620 -231645 114769 84051 -219664 109139 -229882 -1016 -198754 -36735
9265 -19054 -63428 -320973 -106128 -102704 113508 -248963 -98855 -171760 355405 -58528 20622
9253 -360073 -120685 -15499 213065 19501 -103058 -284830 -312955 3479 -232837 5951 -278397
9241 -57123 -263354 72064 37038 274934 78554 -197529 -299831 83973 -291011 41938 -46835
9229 -311119 -396449 21830 -380853 79468 -136458 159675 105123 -196916 349195 71904 28064
$$ packed form
9312a40097k15020J21807E3966b94665a29152B73475a31610D3183c16162A02791
9301C2245b40747J04356l7140J3696O4844K5545H4483N6304a8919A48423C0701
9289b6877A54985a09842c0770k70840a06619C749a17764l1367n104k79029a18119
9277d8514k6501G1620b31645A14769l0718b19664A09139b29882a016j97738c6735
9265a9054m4374k57545a06128L424A13508b48963i8855p2905C55405e8528B0622
9253c60073a20685a5499B13065A9501a03058j81772k8125C479b32837E951b78397
9241e7123k06231G2064l5026K37896G8554a97529j02302H3973b91011D1938d6835
9229c11119q5330B1830c80853G9468a36458A59675n4552a96916C49195G1904B8064
$$ plain form
9217 -57920 6464 -58494 2607 46271 -81994 348486 -115164 -110958 -298463 -58596 -261542 -38770
9204 158859 58423 -90484 229883 156125 173167 -325630 83747 -75127 304559 171777 -207736
9192 -22104 -240129 -293807 -149889 -296382 -330163 -7614 -372291 -246362 -135843 196315 -348664
9180 -246952 -84710 -64519 104504 112296 10616 -103309 -386189 -78206 -340861 -37049 -142555
9169 -142555 -128761 -139394 266339 -65216 -165782 -135931 -192145 -152365 4289 -102829 186137
9157 10633 5908 98553 125673 35705 210075 -325623 -83178 101966 -165905 64052 156455
9146 156455 -197775 310307 27239 -239677 66025 7732 -4516 -418599 8055 -216721 40925
9134 -108595 110318 156933 -83767 -166808 297423 -109618 171656 -71276 -16854 22022 211158
$$ packed form
9217e7920F464e8494B607M3664h1994C48486a15164M206j87505e8596k02946c8770
9204A58859E8423i0484B29883p3758J7042c25630H3747g5127C04559j32782b07736
9192b2104k18025n3678J43918j46493l3781g614l64677J25929J10519A96315c48664
9180b46952h4710K0191A04504P792A0616a03309k82880g8206k62655c7049j05506
9169a42555J3794j0633B66339f5216j00566K9851n6214L9780D289a02829A86137
9157A0633m725R2645K7120C5705J74370c25623h3178A01966a65905F4052R2403
9146A56455a97775C10307B7239b39677F6025G732d516m14083H055b16721D0925
9134a08595A10318M6615h3767q3041B97423a09618A71656g1276a6854B2022J89136
$$ plain form
9123 211158 14658 -161733 253545 100674 -16389 228320 13898 4929 -309653 -241609 71454
9111 -47755 131682 -184310 91604 -185035 -108344 -198973 -153978 157486 -120555 195075 -93017
9099 81080 393761 -55404 -103053 10609 -82716 27969 -89834 -4925 -28165 -42508 69638 130768
9087 130768 121859 40304 -359265 -150632 -120234 -162827 -88113 282282 161689 -323717 -5056
9075 133679 -186469 176139 -225908 155211 -92588 346499 513768 -266985 -33403 -1720
9064 116436 -46067 -500406 -255932 -27516 43881 -84616 204886 -240629 -457642 40345 -198859
9052 -109197 22280 -34784 -209654 -241930 65380 -32755 -267571 -52523 410643 -99754 -55074
9041 -55074 37962 66095 101316 191204 -156509 119273 -202482 121550 80697 -201096 -42844
$$ packed form
9123B11158A4658a61733B53545A00674a6389B28320A3898D929c09653O8044G1454
9111d7755A31682a84310I1604a85035P6691r0629M4995A57486a20555A95075i3017
9099H1080L12681e5404m7649A0609h2716B7969h9834d925k3240j4343F9638O1130
9087A30768q909D0304c59265a50632L0398m2593P4714B82282j20593c23717e056
9075A33679a86469A76139b25908A55211i2588C46499J67269b66985c3403a720
9064A16436d6067m54339K44474b7516D3881h4616B04886b40629k17013D0345a98859
9052a09197B2280c4784j74870l2276F5380c2755k34816e2523D10643i9754M4680
9041e5074C7962K8133L5221Q9888a56509A19273b02482A21550m0853b01096d2844
$$ plain form
9029 246447 235270 -93806 99182 -102291 -257950 -228323 103371 -3577 350902 -185776 -513307
9018 -513307 11002 -185338 166047 110292 -113345 -298872 187235 13095 66689 204540
9008 204540 181937 -85397 -34884 -421644 277927 -361757 -7077 -99383 -219803 -184619 -262440
8997 -262440 206685 -202332 80957 -243971 139943 16038 -202541 140793 -116413 -266315
8987 -266315 106433 -192258 -28691 -368727 154034 116446 -216919 272260 -42094 111166
8976 -146783 -38891 -142061 -365630 49782 -136500 44671 -182057 -261212 -170935 -542598 -76572
8964 -77952 -46623 -124757 -14389 -197816 -96515 -117985 102093 -144377 -71901 22116 -151670
8952 5368 63006 297905 -20076 391530 -209451 -97473 -36590 -191215 -123582 192859 -92026
$$ packed form
9029B46447j1177i3806I9182a02291j55659K9627A03371c577C50902a85776l27531
9018e13307A1002a85338A66047n5755a13345j85527A87235A3095N3594J37851
9008B04540k2603h5397c4884l86760B77927c61757g077r2306j20420L5184p7821
8997b62440B06685b02332H0957b43971A39943A6038b02541A40793a16413j49902
8987b66315A06433a92258b8691l40036A54034l7588b16919B72260d2094A11166
8976a46783c8891j03170k23569D9782a36500D4671a82057p9155R0277l71663g6572
8964g7952L1329p8134a4389j83427i6515k1470A02093a44377g1901B2116a51670
8952E368N7638K34899b0076C91530b09451i7473c6590j54625O7633A92859i2026
$$ plain form
8940 23195 172066 244498 -45168 65751 254041 593427 597101 237394 165383 -121305 -102703
8929 -102703 366599 243747 391391 623438 1267549 2340375 5088571 10171760 10940611
8920 10940611 5885422 2222709 1277717 1148211 797308 359912 94517 -116599 126526
8910 93865 -61631 306941 377499 210987 -138065 116800 -224439 -482344 104848 249461
8900 249461 -299397 -102947 -198309 -54242 -328771 -3833 51199 -18673 -41418 42422 -111261
8888 60654 155330 166147 -220663 99794 2651 287954 241852 -96370 94578 191399 6974 -16007
$$ packed form
8940B3195J48871P2432d5168F5751J88290L39386L674B37394p2011a21305J8602
8929a02703C66599j22852J47644K32047O44111J072826K748196N083189P68851
8920A0940611n055189B222709r44992j29506l50903C59912I4517a16599A26526
8910I3865f1631C06941P0558j66512a38065A16800b24439k57905A04848J44613
8900B49461b99397a02947r5362e4242k74529c833E1199a8673k2745D2422a11261
8888F0654R4676J0817b20663I9794B651K85303m6102i6370I4578R6821F974a6007
$$ [...]
##END NTUPLES=NMR SPECTRUM
##END=
