##TITLE=AC1478_ZPERCUS304_8101089_t9cD9gReun
##JCAMPDX= 6.0         $$ Bruker NMR JCAMP-DX V2.0
##DATA TYPE= NMR SPECTRUM
##DATA CLASS= NTUPLES
##ORIGIN= BRUKER
##OWNER= Administrator
$$ 1.72 TOPSPIN		Version 2.1
$$ 2013-08-15 17:42:41.226 -0700  Administrator@X
$$ Compression mode = diff/dup
##.OBSERVE FREQUENCY= 400.02188249412
##.OBSERVE NUCLEUS= ^1H
##.ACQUISITION MODE= SIMULTANEOUS (DQD)
##.ACQUISITION SCHEME= undefined
##.AVERAGES= 64
##.DIGITISER RES= 22
##SPECTROMETER/DATA SYSTEM= spect
##.PULSE SEQUENCE= noesygpps1d.comp
##.SOLVENT NAME= COFFEE_meoh
##.SHIFT REFERENCE= INTERNAL, COFFEE_meoh, 1, 14.96091
##AUDIT TRAIL= $$ (NUMBER, WHEN, WHO, WHERE, PROCESS, VERSION, WHAT)
$$ ##TITLE= Audit trail, TOPSPIN		Version 2.1
$$ ##JCAMPDX= 5.01
$$ ##ORIGIN= Bruker BioSpin GmbH
$$ ##OWNER= Administrator
$$ $$ E:\/data/COFFEE/nmr/AC1478_ZPERCUS304_8101089_t9cD9gReun/22/pdata/1/auditp.txt
$$ ##AUDIT TRAIL=  $$ (NUMBER, WHEN, WHO, WHERE, PROCESS, VERSION, WHAT)
(   1,<2013-08-15 17:42:36.351 -0700>,<Administrator>,<X>,<go>,<TOPSPIN 2.1>,
      <created by zg
	started at 2013-08-15 17:31:06.694 -0700,
	POWCHK enabled, PULCHK disabled,
       configuration hash MD5:
       C8 4E 4E 5D D3 5C D8 9E 9F 52 82 E0 59 8A DE 15
       data hash MD5: 64K
       AF 2B 31 47 7A 46 47 E0 1D D5 8E 0E 6E 49 8D 5A>)
(   2,<2013-08-15 17:42:39.320 -0700>,<Administrator>,<X>,<proc1d>,<TOPSPIN 2.1>,
      <Start of raw data processing
       efp LB = 0.3 FT_mod = 6 PKNL = 1 PHC0 = 0 PHC1 = 0 SI = 128K 
       data hash MD5: 128K
       A4 49 92 DD 1D B5 16 D0 AE D3 CA DD 15 F1 25 F7>)
(   3,<2013-08-15 17:42:40.273 -0700>,<Administrator>,<X>,<proc1d>,<TOPSPIN 2.1>,
      <pk PHC0 = -81.3208 PHC1 = 0 
       data hash MD5: 128K
       EE 4D E7 2D 31 FA 0C 70 27 CE 48 3E D7 26 A3 18>)
(   4,<2013-08-15 17:42:40.664 -0700>,<Administrator>,<X>,<proc1d>,<TOPSPIN 2.1>,
      <abs ABSG = 1 
       data hash MD5: 128K
       0A C4 30 95 D5 B1 0D D4 EE F2 AC B9 BE 2D 80 51>)
(   5,<2013-08-15 17:42:40.773 -0700>,<Administrator>,<X>,<proc1d>,<TOPSPIN 2.1>,
      <abs ABSG = 2 
       data hash MD5: 128K
       EB 6E 26 5D 6C F2 88 2E 3A B8 4F 45 4E 6F 3A B2>)
(   6,<2013-08-15 17:42:40.851 -0700>,<Administrator>,<X>,<proc1d>,<TOPSPIN 2.1>,
      <abs ABSG = 3 
       data hash MD5: 128K
       E4 F5 E1 D2 D2 8B EF BE FC D3 14 4B 97 06 E6 36>)
(   7,<2013-08-15 17:42:40.929 -0700>,<Administrator>,<X>,<proc1d>,<TOPSPIN 2.1>,
      <abs ABSG = 4 
       data hash MD5: 128K
       41 39 CE BE A6 D8 20 5B 67 D8 A2 B9 91 1A 26 26>)
(   8,<2013-08-15 17:42:41.054 -0700>,<Administrator>,<X>,<proc1d>,<TOPSPIN 2.1>,
      <abs ABSG = 5 
       data hash MD5: 128K
       F3 DE 56 DB DF 0A 49 17 F0 D2 6B AC E3 1F 27 6B>)
$$ ##END=
$$ 
$$ $$ hash MD5
$$ $$ D0 B1 1D E6 EC 72 6E AB F3 2C AC 51 4B 46 B3 71
##$RELAX= 
##$RELAX= 
##$RELAX= 
##$RELAX= 
##$RELAX= 
##$RELAX= 
##$RELAX= 
##$RELAX= 
$$ Bruker specific parameters
$$ --------------------------
##$DU= <E:\>
##$EXPNO= 22
$$ [...]
150 150 150 150 150 150 150 150
##$TP07= 0
##$TPNAME0= <>
##$TPNAME1= <>
##$TPNAME2= <>
##$TPNAME3= <>
##$TPNAME4= <>
##$TPNAME5= <>
##$TPNAME6= <>
##$TPNAME7= <>
##$TPOAL= (0..7)
0.5 0.5 0.5 0.5 0.5 0.5 0.5 0.5
##$TPOFFS= (0..7)
0 0 0 0 0 0 0 0
##$TUNHIN= 0
##$TUNHOUT= 0
##$TUNXOUT= 0
##$USERA1= <user>
##$USERA2= <user>
##$USERA3= <user>
##$USERA4= <user>
##$USERA5= <user>
##$V9= 5
##$VALIST= <valist>
##$VCLIST= <CCCCCCCCCCCCCCC>
##$VD= 0
##$VDLIST= <DDDDDDDDDDDDDDD>
##$VPLIST= <PPPPPPPPPPPPPPP>
##$VTLIST= <TTTTTTTTTTTTTTT>
##$WBST= 1024
##$WBSW= 4
##$XGAIN= (0..3)
0 0 0 0
##$XL= 0
##$YL= 0
##$YMAX_a= 6418341
##$YMIN_a= -14427180
##$ZGOPTNS= <>
##$ZL1= 120
##$ZL2= 120
##$ZL3= 120
##$ZL4= 120
##$ABSF1= 14.96091
##$ABSF2= -5.597272
##$ABSG= 5
##$ABSL= 3
##$ALPHA= 0
##$AQORDER= 0
##$ASSFAC= 0
##$ASSFACI= 0
##$ASSFACX= 0
##$ASSWID= 0
##$AUNMP= <proc_prof1d_extract.lims>
##$AXLEFT= 0
##$AXNAME= <>
##$AXNUC= <1H>
##$AXRIGHT= 0
##$AXTYPE= 0
##$AXUNIT= <>
##$AZFE= 0.1
##$AZFW= 0.1
##$BCFW= 0
##$BC_mod= 0
##$BYTORDP= 0
##$COROFFS= 0
##$CY= 15
##$DATMOD= 1
##$DC= 0
##$DFILT= <>
##$DTYPP= 0
##$F1P= 0
##$F2P= 0
##$FCOR= 0.5
##$FTSIZE= 131072
##$FT_mod= 6
##$GAMMA= 0
##$GB= 0
##$INTBC= 1
##$INTSCL= 1
##$ISEN= 128
##$LB= 0.3
##$LEV0= 0
##$LPBIN= 0
##$MAXI= 10000
##$MC2= 0
##$MEAN= 0
##$ME_mod= 0
##$MI= 0
##$NCOEF= 0
##$NC_proc= -2
##$NLEV= 6
##$NOISF1= 0
##$NOISF2= 0
##$NSP= 0
##$NTH_PI= 0
##$NZP= 0
##$OFFSET= 14.96091
##$PC= 1
##$PHC0= -81.3208
##$PHC1= 0
##$PH_mod= 1
##$PKNL= yes
##$PPARMOD= 0
##$PPDIAG= 0
##$PPIPTYP= 0
##$PPMPNUM= 2147483647
##$PPRESOL= 1
##$PSCAL= 4
##$PSIGN= 0
##$PYNMP= <proc.py>
##$REVERSE= no
##$SF= 400.020009673987
##$SI= 131072
##$SIGF1= 0
##$SIGF2= 0
##$SINO= 400
##$SIOLD= 131072
##$SPECTYP= <>
##$SREGLST= <1H.CDCl3>
##$SSB= 0
##$STSI= 131072
##$STSR= 0
##$SW_p= 8223.68421052631
##$SYMM= 0
##$S_DEV= 0
##$TDeff= 65536
##$TDoff= 0
##$TI= <>
##$TILT= no
##$TM1= 0
##$TM2= 0
##$TOPLEV= 0
##$USERP1= <user>
##$USERP2= <user>
##$USERP3= <user>
##$USERP4= <user>
##$USERP5= <user>
##$WDW= 1
##$XDIM= 131072
##$YMAX_p= 316046885
##$YMIN_p= -10574
##$CURPLOT= <Network HP LaserJet P1505>
##$CURPRIN= <$Network HP LaserJet P1505>
##$DFORMAT= <normdp>
##$LAYOUT= <+/1D_H.xwp>
##$LFORMAT= <normlp>
##$PFORMAT= <normpl>
##$SURQMSG= 1
$$ End of Bruker specific parameters
$$ ---------------------------------
##NTUPLES= NMR SPECTRUM
##VAR_NAME=  FREQUENCY,     SPECTRUM/REAL,   SPECTRUM/IMAG
##SYMBOL=    X,             R,               I
##VAR_TYPE=  INDEPENDENT,   DEPENDENT,       DEPENDENT
##VAR_FORM=  AFFN,          ASDF,            ASDF
##VAR_DIM=   131072,        131072,          131072
##UNITS=     HZ,            ARBITRARY UNITS, ARBITRARY UNITS
##FACTOR=    0.0627417313425164, 1,          1
##FIRST=     8223.62146879497, -229,         -71030
##LAST=      0,             1528,            -71678
##MIN=       0,             -10574,          0
##MAX=       8223.62146879497, 316046885,    0
$$ Real data points
##PAGE= N=1
##DATA TABLE= (X++(R..R)), XYDATA
$$ [...]
63831A344493n3059n1612m9999m9534n0017m9949m8512m6405m4501m2558l9880
$$ 1344493 1291434 1239822 1189823 1140289 1090272 1040323 991811 945406 900905 858347 818467
63820H18467l6635l3785l1806l0168k8154k5717k3314k1198j9248j7412j5980
$$ 818467 781832 748047 716241 686073 657919 632202 608888 587690 568442 551030 535050
63809E35050j5202j4808j4180j3044j1722j0587r537q324p146o491o435o517o419
$$ 535050 519848 505040 490860 477816 466094 455507 445970 437646 430500 424009 417574 411057 404638
63796D04638o395o770p330p471o840n628m346l469l179l242l235l023k957l390
$$ 404638 398243 391473 384143 376672 369832 364204 359858 356389 353210 349968 346733 343710 340753 337363
63782C37363m081m369l916l064k385k099k072k117k153k140k109k173k351k426
$$ 337363 333282 328913 324997 321933 319548 317449 315377 313260 311107 308967 306858 304685 302334 299908
63768B99908k145j583j043o63l26l5m5m87j067j364j225p51o2O47J042R31M80
$$ 299908 297763 296180 295137 294474 294148 294113 294068 293581 292514 291150 289925 289174 289112 289759 290801 291732 292212
63751B92212j23q78j605j674p60L49N04k33n81J65J226J610J475J510J642J271
$$ 292212 292089 291211 289606 287932 287172 287521 288025 287792 287211 287376 288602 290212 291687 293197 294839 296110
63735B96110N21K67R33K019K877L363L647L872M156M462M433L870L297L455M154
$$ 296110 296631 296898 297831 299850 302727 306090 309737 313609 317765 322227 326660 330530 333827 337282 341436
63720C41436M361L640K838K877L454L555K840J910J342J017M62n06j591k311k466
$$ 341436 345797 349437 352275 355152 358606 362161 365001 366911 368253 369270 369732 369226 367635 365324 362858
63705C62858k356k402k550k282j399l93J56K90L88M70K30k55l99J86J189J956
$$ 362858 360502 358100 355550 353268 351869 351476 351632 351922 352310 352780 353010 352755 352356 352542 353731 355687
63689C55687K238K331K622L072L218K696J721R68R43J538K251K651K601K205J742
$$ 355687 357925 360256 362878 365950 369168 371864 373585 374553 375496 377034 379285 381936 384537 386742 388484
63674C88484J477J376J135O69L81P20J597K451K847K719K212J517Q88M49l4r04
$$ 388484 389961 391337 392472 393141 393522 394242 395839 398290 401137 403856 406068 407585 408473 408922 408888 407984
63658D07984k132l245l813l737l142k308j724j765k141k088j402q90j344k343
$$ 407984 405852 402607 398794 395057 391915 389607 387883 386118 383977 381889 380487 379597 378253 375910
63644C75910k722k089j241r15p90j15J185K524L534M259M676M595M190M077M592
$$ 375910 373188 371099 369858 368943 368153 368038 369223 371747 375281 379540 384216 388811 393001 397078 401670
63629D01670N412O112O752P570Q416Q848Q703Q275Q081Q614J0006J1697J2810
$$ 401670 407082 413194 419946 427516 435932 444780 453483 461758 469839 478453 488459 500156 512966
63616E12966J3241J4024J6028J8687K0712K1827K2940K4548K6021K6709K6884
$$ 512966 526207 540231 556259 574946 595658 617485 640425 664973 690994 717703 744587
63605G44587K7003K6755K5507K3222K0345J7146J3767J0558P792N271K711K88
$$ 744587 771590 798345 823852 847074 867419 884565 898332 908890 916682 921953 924664 924952
63593I24952j686l316m912o505q127j0173j2741j4953j5873j5883j6334j7777
$$ 924952 923266 919950 915038 908533 900406 890233 877492 862539 846666 830783 814449 796672
63581G96672j9403k0279k0212j9289j7522j5341j3613j2637j1757j0294q282n955
$$ 796672 777269 756990 736778 717489 699967 684626 671013 658376 646619 636325 628043 622088
63569F22088l336p75R12J563K193L590N059N513N254N545O702P815Q441R350J1221
$$ 622088 618752 617977 618889 620452 622645 626235 631294 636807 642061 647606 654308 662123 670564 679914 691135
63554F91135J3598J5673J7478J9594K2129K4660K7048K9824L3559L7931M1504
$$ 691135 704733 720406 737884 757478 779607 804267 831315 861139 894698 932629 974133
63543I74133M2487L9997L4684K8017K1122J4354P799J648l874q587j2202j4537
$$ 974133 1016620 1056617 1091301 1119318 1140440 1154794 1162593 1164241 1160367 1151780 1139578 1125041
63531A125041j5806j6408j6428j5819j5095j5229j6655j8816k0999k3084k5123
$$ 1125041 1109235 1092827 1076399 1060580 1045485 1030256 1013601 994785 973786 950702 925579
63520I25579k6742k7514k7723k8076k8726k8982k8059k5829k2867k0080j8245
$$ 925579 898837 871323 843600 815524 786798 757816 729757 703928 681061 660981 642736
63509F42736j7482j7144j6392j5027j3559j2475j1681j0787r720q781q153p593
$$ 642736 625254 608110 591718 576691 563132 550657 538976 528189 518469 509688 501535 493942
63497D93942o779n812n139m963m934m577l811k873j956j206q28q15p04j03O44
$$ 493942 487163 481351 476212 471249 466315 461738 457927 455054 453098 451892 451064 450249 449545 449442 450086
63482D50086Q41M85K84O09J106J567K341L498M316M242L718L349K788J385m20
$$ 450086 450927 451412 451696 452305 453411 454978 457319 460817 465133 469375 473093 476442 479230 480615 480195
63467D80195j381j107n58p56j674k533k660j910q38m36j136k058j903o15N60Q14
$$ 480195 478814 477707 477149 476393 474719 472186 469526 467616 466778 466342 465206 463148 461245 460630 461190 462004
63451D62004P32J205K229L314M430N850P509R091J0582J2143J3713J5205J6881
$$ 462004 462736 463941 466170 469484 473914 479764 487273 496364 506946 519089 532802 548007 564888
63438E64888J9135K2057K5585K9789L4504L8752M1118M0777L7987L3689K8802
$$ 564888 584023 606080 631665 661454 695958 734710 775828 816605 854592 888281 917083
63427I17083K3822J8818J3803R114N230K227p9j359p74J890N704R723J3950J8362
$$ 917083 940905 959723 973526 982640 987870 990097 990018 988659 987885 989775 995479 1005202 1019152 1037514
63413A037514K1721K2563K1112J9017J7010J4221J0109N823K732M75k355o047
$$ 1037514 1059235 1081798 1102910 1121927 1138937 1153158 1163267 1169090 1171822 1172297 1169942 1163895
63401A163895r366j1283j2196j3153j4580j6234j8003k0155k2802k5486k7518
$$ 1163895 1154529 1143246 1131050 1117897 1103317 1087083 1069080 1048925 1026123 1000637 973119
63390I73119k8586k8900k8779k8306k7500k6521k5464k4034k1824j8921j5985
$$ 973119 944533 915633 886854 858548 831048 804527 779063 755029 733205 714284 698299
63379F98299j3578j1643r692p397m876k560p77O04K043L668M974N571O122P857
$$ 698299 684721 673078 663386 655989 651113 648553 647776 648380 650423 654091 659065 664636 670758 678615
63365F78615J0997J4263J6300J7167J7989J9491K1519K3760K6180K8656L0664
$$ 678615 689612 703875 720175 737342 755331 774822 796341 820101 846281 874937 905601
63354I05601L1685L1683L0961K9737K8010K5672K2593J8717J4205R503N099J229
$$ 905601 937286 968969 999930 1029667 1057677 1083349 1105942 1124659 1138864 1148367 1153466 1154695
63342A154695k171n212p767r559j0557j1237j2312j4165j6593j9137k1489k3497
$$ 1154695 1152524 1147312 1139545 1129986 1119429 1108192 1095880 1081715 1065122 1045985 1024496 1000999
63330A000999k5009k5865k6019k5485k4223k2262j9851j7227j4230j0438n918
$$ 1000999 975990 950125 924106 898621 874398 852136 832285 815058 800828 790390 784472
63319G84472j727O38L56k156n738r382j2631j5375j7622j9476k1032k2166k2559
$$ 784472 782745 783383 783739 781583 775845 766463 753832 738457 720835 701359 680327 658161 635602
63306F35602k2106k1115j9929j8501j6637j4527j2625j1036r445p808o660o377
$$ 635602 613496 592381 572452 553951 537314 522787 510162 499126 489681 481873 475213 468836
63294D68836o487o167n318m645m664n018n038m624m287m365m546m257l384k413
$$ 468836 462349 456182 450864 446219 441555 436537 431499 426875 422588 418223 413677 409420 406036 403623
63280D03623j910j962k168k079j562q56l57k96n04n90l85r4J29M76J046J377R16
$$ 403623 401713 399751 397583 395504 393942 393086 392729 392433 391929 391339 390954 390860 390989 391465 392511 393888 394804
63263C94804Ok73N58J664J948J374Q29R49J608K348K812K786K396K291L091M494
$$ 394804 394810 394537 395095 396759 398707 400081 400910 401859 403467 405815 408627 411413 413809 416100 419191 423685
63247D23685N444N340M754M663N379O496P542Q293Q685Q860R226J0056J1059J1738
$$ 423685 429129 434469 439223 443886 449265 455761 463303 471596 480281 489141 498367 508423 519482 531220
63233E31220J2162J3012J4631J6359J7158J6780J6046J5931J6596J7445J7896
$$ 531220 543382 556394 571025 587384 604542 621322 637368 653299 669895 687340 705236
63222G05236J7909J7731J7421J6871J6211J5873J6051J6303J5987J5016J3876
$$ 705236 723145 740876 758297 775168 791379 807252 823303 839606 855593 870609 884485
63211H84485J2834J1487R328O508L655J049j640m721p973j0923j3421j5639j7630
$$ 884485 897319 908806 918134 924642 928297 929346 927706 922985 915012 904089 890668 875029 857399
63198H57399j9049j9404j8507j6822j5313j4652j4388j3171j0155o067k588p28
$$ 857399 838350 818946 800439 783617 768304 753652 739264 726093 715938 709871 707283 706555
63186G06555j11L03J263L013N460Q157J0414J1781J2342J2484J2511J2624J2961
$$ 706555 706444 706747 708010 711023 716483 724640 735054 746835 759177 771661 784172 796796 809757
63173H09757J3410J3586J3271J2704J2187J1618J0735R602Q408O921M647J667
$$ 809757 823167 836753 850024 862728 874915 886533 897268 906870 915278 922199 926846 928513
63161I28513j254l627n970r175j3299j7359k0280k1808k2406k2546k2300k1592
$$ 928513 927259 923632 917662 908487 895188 877829 857549 835741 813335 790789 768489 746897
63149G46897k0624j9879j9618j9483j8761j7103j4918j3007j1856j1308j0838
$$ 746897 726273 706394 686776 667293 648532 631429 616511 603504 591648 580340 569502
63138E69502j0088r099q125p240o217m909l622k930k906k844k025o76K19J98o8
$$ 569502 559414 550315 542190 534950 528733 523824 520202 517272 514366 511522 509497 508821 509040 509238 509170
63123E09170K42R28J161Q51Q61J636K413K295J539J112J288J502J439J432J684
$$ 509170 509412 510340 511501 512352 513213 514849 517262 519557 521096 522208 523496 524998 526437 527869 529553
63108E29553J871J787J719J849J832J397Q33M64J42k89m14J39R52J354J427J758
$$ 529553 531424 533211 534930 536779 538611 540008 540841 541305 541447 541158 540744 540883 541835 543189 544616 546374
63092E46374K338K535K152J682J401J019N17N31J384K356K532J966J469J512J968
$$ 546374 548712 551247 553399 555081 556482 557501 558018 558549 559933 562289 564821 566787 568256 569768 571736
63077E71736K686L650M599N078N037M998N430O336P440Q514R306R520R191Q925
$$ 571736 574422 578072 582671 587749 592786 597784 603214 609550 616990 625504 634810 644330 653521 662446
63063F62446R459J0956J2877J4559J5817J7000J8566K0611K2797K4711K6326K8022
$$ 662446 671905 682861 695738 710297 726114 743114 761680 782291 805088 829799 856125 884147
63051H84147L0078L2274L4120L5445L6501L7491L8272L8708L9121M0008M1330
$$ 884147 914225 946499 980619 1016064 1052565 1090056 1128328 1167036 1206157 1246165 1287495
63040A287495M2432M2735M2254M1338M0282L9315L8711L8500L8223L7281L5468
$$ 1287495 1329927 1372662 1414916 1456254 1496536 1535851 1574562 1613062 1651285 1688566 1724034
63029A724034L2867K9380K4788J9294J3541P871J891m950j2539k0081k6756l2243
$$ 1724034 1756901 1786281 1811069 1830363 1843904 1851775 1853666 1848716 1836177 1816096 1789340 1757097
63017A757097l6661m0238m3032m4854m5442m4718m2833l9986l6294l1902k7043
$$ 1757097 1720436 1680198 1637166 1592312 1546870 1502152 1459319 1419333 1383039 1351137 1324094
63006A324094k1959j6913j2211q018l999M40N311R719J2748J4555J6165J8220
$$ 1324094 1302135 1285222 1273011 1264993 1260994 1261434 1266745 1276464 1289212 1303767 1319932 1338152
62994A338152K0386K1975K2767K3029K3124K3291K3542K3529K2734K1049J8939
$$ 1338152 1358538 1380513 1403280 1426309 1449433 1472724 1496266 1519795 1542529 1563578 1582517
62983A582517J6794J4354J1119P049K485k462p878j3487j8766k3679k8662l3668
$$ 1582517 1599311 1613665 1624784 1631833 1634318 1631856 1623978 1610491 1591725 1568046 1539384 1505716
62971A505716l7831m0503m2084m3297m4139m4133m3290m2079m0584l8491l5875
$$ 1505716 1467885 1427382 1385298 1342001 1297862 1253729 1210439 1168360 1127776 1089285 1053410
62960A053410l3278l0945k8676k6530k4935k3821k2441k0556j9030j8627j8746
$$ 1053410 1020132 989187 960511 933981 909046 885225 862784 842228 823198 804571 785825
62949G85825j8161j6652j5094j4142j3660j3371j3242j3018j2158j0677r438r148
$$ 785825 767664 751012 735918 721776 708116 694745 681503 668485 656327 645650 636212 627064
62937F27064r420r269q395p414o933o812o553o086n802n852n797n194m292l721
$$ 627064 617644 608375 599980 592566 585633 578821 572268 566182 560380 554528 548731 543537 539245 535524
62923E35524l543l100k013r38p97j548k175j909j000k83l08j009j931k516k400
$$ 535524 531981 528881 526868 525930 525133 523585 521410 519501 518501 518218 517910 516901 514970 512454 510054
62908E10054j614n48L40P65O86K94o7j15K30Q27J364J486J099O27O51J174J546
$$ 510054 508440 507892 508232 508997 509683 509977 509910 509795 510025 510852 512216 513702 514801 515428 516079 517253 518799
62891E18799J297O92J73k96r01j376j270o07K48J138J969K278J703P83N25J095
$$ 518799 520096 520788 520961 520665 519764 518388 517118 516511 516759 517897 519866 522144 523847 524630 525155 526250
62875E26250J636J476Q97M46K27J22J33J62p7n52q44q10q18j022j004n70l36r45
$$ 526250 527886 529362 530259 530705 530932 531054 531187 531349 531272 530720 529876 529066 528248 527226 526222 525652 525316 524371
62857E24371k019k523j975q12K26P12O55M65O13J067J289J026P29Q51J121J115
$$ 524371 522352 519829 517854 517042 517268 517980 518635 519100 519713 520780 522069 523095 523824 524675 525796 526911
62841E26911J091J590K392K629J987J071N08K76J78L39Q19J189R65L51P1N12J302
$$ 526911 528002 529592 531984 534613 536600 537671 538179 538455 538633 538972 539791 540980 541945 542296 542367 542879 544181
62824E44181J825J860J637J454J450J665K030K299K271K144K383L055L591L559
$$ 544181 546006 547866 549503 550957 552407 554072 556102 558401 560672 562816 565199 568254 571845 575404
62810E75404L320L455L820L817L490L539M138M579M428M325N030O283P216P522
$$ 575404 578724 582179 585999 589816 593306 596845 600983 605562 609990 614315 619345 625628 632844 640366
62796F40366P614P916Q542R554J0914J2340J3628J5009J6802J8882K0901K2937
$$ 640366 647980 655896 664438 673992 684906 697246 710874 725883 742685 761567 782468 805405
62784H05405K5425K8541L2051L5657L9175M2509M5750M9159N2648N5557N7387
$$ 805405 830830 859371 891422 927079 966254 1008763 1054513 1103672 1156320 1211877 1269264
62773A269264N8513N9577O0382N9964N7739N3963M9109M3367L6838K9652K1716
$$ 1269264 1327777 1387354 1447736 1507700 1565439 1619402 1668511 1711878 1748716 1778368 1800084
62762A800084J2829L253o279j5252k3728l1852l9364m5785n0795n4324n6522n7734
$$ 1800084 1812913 1816166 1809887 1794635 1770907 1739055 1699691 1653906 1603111 1548787 1492265 1434531
62750A434531n8187n7680n5910n3144n0228m7793m5741m3627m1162l8283l5020
$$ 1434531 1376344 1318664 1262754 1209610 1159382 1111589 1065848 1022221 981059 942776 907756
62739I07756l1529k8055k4774k1814j9425j7826j6825j5850j4487j2797j1070
$$ 907756 876227 848172 823398 801584 782159 764333 747508 731658 717171 704374 693304
62728F93304r481q059o771n524m297l191k256j303j61J016J932K604L290M090
$$ 693304 683823 675764 668993 663469 659172 655981 653725 652422 652261 653277 655209 657813 661103 665193
62714F65193M902N708O606P593Q664R974J1618J3404J5212J7352K0050K2873K5231
$$ 665193 670095 675803 682409 690002 698666 708640 720258 733662 748874 766226 786276 809149 834380
62701H34380K7361K9986L3113L5931L8059M0052M2399M4746M6499M7579M8195
$$ 834380 861741 891727 924840 960771 998830 1038882 1081281 1126027 1172526 1220105 1268300
62690A268300M8338M7889M6740M4503M0614L5066K8574K1683J4229O040k368j0295
$$ 1268300 1316638 1364527 1411267 1455770 1496384 1531450 1560024 1581707 1595936 1601976 1599608 1589313
62678A589313j7631k4621l1275l7414m2899m7308m9853n0271m9482m8691m8037
$$ 1589313 1571682 1547061 1515786 1478372 1435473 1388165 1338312 1288041 1238559 1189868 1141831
62667A141831m6754m4501m1852l9497l7500l5475l3017k9911k6306k2814k0131
$$ 1141831 1095077 1050576 1008724 969227 931727 896252 863235 833324 807018 784204 764073
62656G64073j8462j7408j6378j5014j3383j2018j1497j1697j1682j0716r216q217
$$ 764073 745611 728203 711825 696811 683428 671410 659913 648216 636534 625818 616602 608385
62644F08385q033p928p162n852m706m162m007l633k647j330m44m28r05j212j269
$$ 608385 600352 592424 585262 579410 574704 570542 566535 562902 560255 558925 558481 558053 557148 555936 554667
62629E54667j482j927k131j836j504j733k352k537j797n76L09N88O40P81R06R97
$$ 554667 553185 551258 549127 547291 545787 544054 541702 539165 537368 536792 537101 537689 538329 539110 540016 541013
62613E41013J514K779M231M931M811M731N218N891O327O812P667Q513Q946R419
$$ 541013 542527 545306 549537 554468 559279 564010 569228 575119 581446 588258 595925 604438 613384 622803
62599F22803J0722J2763J4620J5760J6559J7623J9172K1134K3321K5369K6929
$$ 622803 633525 646288 660908 676668 693227 710850 730022 751156 774477 799846 826775
62588H26775K7943K8501K8446K7543K5914K3790K0961J6974J1998O887K249k104
$$ 826775 854718 883219 911665 939208 965122 988912 1009873 1026847 1038845 1045732 1047981 1045877
62576A045877o516j0826j4634j7900k0885k3638k5852k7135k7381k6899k6247
$$ 1045877 1039361 1028535 1013901 996001 975116 951478 925626 898491 871110 844211 817964
62565H17964k5756k5213k4187k2604k0764j8864j6891j5048j3816j3323j2983
$$ 817964 792208 766995 742808 720204 699440 680576 663685 648637 634821 621498 608515
62554F08515j2078j0561q998p819o886n821m593l628l340l534l394k285n24Q17
$$ 608515 596437 585876 576878 569059 562173 556352 551759 548131 544791 541257 537863 535578 535054 535871
62540E35871J026N05K72P74J434J441P75K19L60R54J477J886K434L019L356L761
$$ 535871 536897 537402 537674 538448 539882 541323 542098 542317 542677 543631 545108 546994 549428 552447 555803 559564
62524E59564M921O699P965Q105P983Q819J0641J2670J4643J6830J9069K0860K2412
$$ 559564 564485 571184 579149 587254 595237 604056 614697 627367 642010 658840 677909 698769 721181
62511G21181K4481K7017K8936K9591K9599K9690K9595K8623K6749K4411K1680
$$ 721181 745662 772679 801615 831206 860805 890495 920090 948713 975462 999873 1021553
62500A021553J8371J4677J1046P497L688l25l884o392p811q511q806q773q285
$$ 1021553 1039924 1054601 1065647 1073144 1076832 1076507 1072623 1066231 1058420 1049909 1041103 1032330 1024045
62487A024045p190n542l638j707M01L032O198R279J1356J1914J1257J0145Q989
$$ 1024045 1016855 1011313 1007675 1005968 1006369 1009401 1015599 1024878 1036234 1048148 1059405 1069550 1078539
62474A078539P505N290K418q48m620r119j3868j7852k0700k3167k6057k9141l1527
$$ 1078539 1086044 1091334 1093752 1092904 1088284 1079165 1065297 1047445 1026745 1003578 977521 948380 916853
62461I16853l2703l2752l1908l0430k8818k7488k6274k4661k2526k0229j7937
$$ 916853 884150 851398 819490 789060 760242 732754 706480 681819 659293 639064 621127
62450F21127j5385j2541j0020q463p716p019n944m756l819l085k338j655j238
$$ 621127 605742 593201 583181 574718 567002 559983 554039 549283 545464 542379 540041 538386 537148
62437E37148r68n18N9L04J3m34o55p93j154j624j893k003k223k531k742k974l449
$$ 537148 536180 535662 535721 536025 536038 535604 534949 534156 533002 531378 529485 527482 525259 522728 519986 517012 513563
62420E13563l884l700k935k269k040j857j491j434k086k887k992k430j978j992
$$ 513563 509679 505979 503044 500775 498735 496878 495387 493953 491867 488980 485988 483558 481580 479588
62406D79588k024j644j088q92j153j473j454j105p13l96P2R14J948K773L284L673
$$ 479588 477564 475920 474832 473940 472787 471314 469860 468755 468042 467646 467718 468632 470580 473353 476637 480310
62390D80310L912L694L051K608K936L878M833N370N365M873M257M180M989O240
$$ 480310 484222 487916 490967 493575 496511 500389 505222 510592 515957 520830 525087 529267 534256 540496
62376E40496P206P741Q239Q946R742J0559J1563J2792J3962J4736J5083J5373
$$ 540496 547702 555443 563682 572628 582370 592929 604492 617284 631246 645982 661065 676438
62364F76438J6243J8136K0732K3069K4608K6083K8721L2740L7012M0367M2698
$$ 676438 692681 710817 731549 754618 779226 805309 834030 866770 903782 944149 986847
62353I86847M4639M6557M8129M8624M7338M4033L9200L3757K8260K2575J6425
$$ 986847 1031486 1078043 1126172 1174796 1222134 1266167 1305367 1339124 1367384 1389959 1406384
62342A406384J0008L763k230q220j4190j9673k4263k8054l1334l4069l5953l6822
$$ 1406384 1416392 1420155 1417925 1409705 1395515 1375842 1351579 1323525 1292191 1258122 1222169 1185347
62330A185347l6860l6335l5363l3961l2202l0254k8425k7104k6407k5857k4703
$$ 1185347 1148487 1112152 1076789 1042828 1010626 980372 951947 924843 898436 872579 847876
62319H47876k2846k1079k0163j9870j9290j8002j6442j5216j4473j3971j3389
$$ 847876 825030 803951 783788 763918 744628 726626 710184 694968 680495 666524 653135
62308F53135j2503j1355j0290r494q605p250n820n117n153n021m178l084k348
$$ 653135 640632 629277 618987 609493 600888 593638 587818 582701 577548 572527 568349 565265 562917
62295E62917j905j545j489j814j907j226j33P22J425K403L393L770L650L723M085
$$ 562917 561012 559467 557978 556164 554257 553031 552898 553620 555045 557448 560841 564611 568261 571984 576069
62280E76069M168L861L725L980M197M232M565N279N626N198M798N467P135Q905
$$ 576069 580237 584098 587823 591803 596000 600232 604797 610076 615702 620900 625698 631165 638300 647205
62266F47205J0291J1483J2729J4161J6112J8904K2263K5474K8279L1163L4617
$$ 647205 657496 668979 681708 695869 711981 730885 753148 778622 806901 838064 872681
62255H72681L8436M1985M4845M6986M8386M8780M7894M5763M2642L8642L3635
$$ 872681 911117 953102 997947 1044933 1093319 1142099 1189993 1235756 1278398 1317040 1350675
62244A350675K7623K0983J4116O990o35q599j6214k2862k8411l3075l7022m0218
$$ 1350675 1378298 1399281 1413397 1420387 1419752 1411153 1394939 1372077 1343666 1310591 1273569 1233351
62232A233351m2519m3806m4152m3760m2690m0838l8395l6002l4045l1999k9136
$$ 1233351 1190832 1147026 1102874 1059114 1016424 975586 937191 901189 867144 835145 806009
62221H06009k5716k2834k1017j9661j8000j5998j3966j2005j0273r176q791q543
$$ 806009 780293 757459 736442 716781 698781 682783 668817 656812 646539 637363 628572 620029
62209F20029p987p431p292p209o509n241m122l541l229k816k171j291l19L81O49
$$ 620029 612042 604611 597319 590110 583601 578360 574238 570697 567468 564652 562481 561190 560871 561252 561901
62194E61901R03J660K856M128N542P314Q869R187Q247P346P594Q659R459R529
$$ 561901 562804 564464 567320 571448 576990 584304 593173 602360 610607 617953 625547 634206 643665 653194
62180F53194R260R177R416R735R672R019Q267Q269R167J0196J0903J1978J4288
$$ 653194 662454 671631 681047 690782 700454 709473 717740 726009 735176 745372 756275 768253 782541
62167G82541J7558K0799K3713K6793L0176L3300L5790L7782L9133L9146L7511
$$ 782541 800099 820898 844611 871404 901580 934880 970670 1008452 1047585 1086731 1124242
62156A124242L4830L1693K7901K3180J8124J3571R429M951K1m643q536j1817j4625
$$ 1124242 1159072 1190765 1218666 1241846 1259970 1273541 1282970 1287921 1287942 1283299 1274763 1262946 1248321
62143A248321j6753j8283j9787k1448k2584k2515k1429j9906j8076j5902j3947
$$ 1248321 1231568 1213285 1193498 1172050 1149466 1126951 1105522 1085616 1067540 1051638 1037691
62132A037691j2962j2822j2581j1708j0641r944r463q597p089n163l216j521p6
$$ 1037691 1024729 1011907 999326 987618 976977 967033 957570 948973 941884 936721 933505 931984 931908
62119I31908J424L292N326O844P365O973N939M297K143L0j342j814j869k066k607
$$ 931908 933332 936624 941950 948794 956159 963132 969071 973368 975511 975541 974199 972385 970516 968450 965843
62104I65843l431m482n677o725p132o579n309l989l026k210j161M2J122K290M106
$$ 965843 962412 957930 952253 945528 938396 931817 926508 922519 919493 917283 916122 916164 917286 919576 923682
62089I23682O492Q515R463R664R884J0353J0812J1142J1350J1355J1277J1761
$$ 923682 930174 938689 948152 957816 967700 978053 988865 1000007 1011357 1022712 1033989 1045750
62077A045750J3236J5034J6005J6004J6059J6988J8547K0095K1313K1925K1574
$$ 1045750 1058986 1074020 1090025 1106029 1122088 1139076 1157623 1177718 1199031 1220956 1242530
62066A242530K0525J9837K0130K0706K0640K0256K0534K1307K1168J9329J6551
$$ 1242530 1263055 1282892 1303022 1323728 1344368 1364624 1385158 1406465 1427633 1446962 1463513
62055A463513J3927J1559R041O431M008J472j795n815r994j4013j8118k2457k6683
$$ 1463513 1477440 1488999 1498040 1504471 1508479 1509951 1508156 1502341 1492347 1478334 1460216 1437759 1411076
62042A411076l0326l3249l5553l7344l8715l9700m0147l9916l9199l8319l7160
$$ 1411076 1380750 1347501 1311948 1274604 1235889 1196189 1156042 1116126 1076927 1038608 1001448
62031A001448l5237l2521k9793k7830k6520k5078k2966k0365j7919j6228j5404
$$ 1001448 966211 933690 903897 876067 849547 824469 801503 781138 763219 746991 731587
62020G31587j4882j3945j2574j1492j1076j0738r820q708q296q594q674p945o727
$$ 731587 716705 702760 690186 678694 667618 656880 647060 638352 630056 621462 612788 604843 598116
62007E98116n462m163k912k088j697j089J19J325J836J978K647L889M710M243
$$ 598116 592654 588491 585579 583491 581794 580705 580824 582149 583985 585963 588610 592499 597209 601452
61993F01452K632O32j077k142k592k912l717n088o388o961o797o369n966n468
$$ 601452 604084 604716 603639 601497 598905 595993 592276 587188 580800 573839 567042 560673 554707 549239
61979E49239m746m017l652l719l904l818l299k475j646j136j006q57j82R05J668
$$ 549239 544493 540476 536824 533105 529201 525383 522084 519609 517963 516827 515821 514964 514782 515687 517355
61964E17355J698J562J958K623K769K395K326K881L445L587L684M028M144L746
$$ 517355 519053 520615 522573 525196 527965 530360 532686 535567 539012 542599 546283 550311 554455 558201
61950E58201L507M123N161N831O369P616R545J1293J2524J3737J5137J6299J7132
$$ 558201 561708 565831 570992 576823 583192 590808 600353 611646 624170 637907 653044 669343 686475
61937F86475J8170J9615K0823K1180K0741J9781J8453J7239J6864J7236J7169
$$ 686475 704645 724260 745083 766263 787004 806785 825238 842477 859341 876577 893746
61926H93746J5718J3267J0731Q263N470K428k07j994k999l510l849m256m554m182
$$ 893746 909464 922731 933462 941725 947195 949623 949416 947422 944423 940913 937064 932808 928254 924072
61912I24072k917j261K76J908M123O824R414J1449J2740J3154J2769J1921J0686
$$ 924072 921155 919894 920170 922078 926201 933025 942439 953888 966628 979782 992551 1004472 1015158
61899A015158Q658N741K597k67l298o973j0562j2898j4017j4954j6069j6791j6997
$$ 1015158 1023816 1029557 1032154 1031887 1028589 1021616 1011054 998156 984139 969185 953116 936325 919328
61886I19328j7328j7883j7825j6748j5413j4520j3740j2560j1234j0197r268q187
$$ 919328 902000 884117 866292 849544 834131 819611 805871 793311 782077 771880 762612 754425
61874G54425p266o729o033m713l363k891l132l070k224r23N47K204L860N126O048
$$ 754425 747159 740430 734397 729684 726321 723430 720298 717228 715004 714081 714628 716832 720692 725818 731866
61859G31866P117Q575J0266J2117J4204J6396J8452K0464K2735K5227K7640K9871
$$ 731866 738983 747558 757824 769941 784145 800541 818993 839457 862192 887419 915059 944930
61847I44930L1863L3204L3575L3421L3342L2868L0866K7226K3224J9824J6537
$$ 944930 976793 1009997 1043572 1076993 1110335 1143203 1174069 1201295 1224519 1244343 1260880
61836A260880J2463P688L052q90l915n709o065n310l950k131J58K628M933P100
$$ 1260880 1273343 1281031 1284083 1283193 1279278 1273569 1267504 1262194 1258244 1256113 1256271 1258899 1263832 1270932
61822A270932R201J0800J1213J0241Q217N390J684k959q234j3536j8259k2206
$$ 1270932 1280133 1290933 1302146 1312387 1320604 1325994 1327678 1324719 1316485 1302949 1284690 1262484
61810A262484k5719k9202l2410l4632l5645l5950l5827l4827l2707l0286k8559
$$ 1262484 1236765 1207563 1175153 1140521 1104876 1068926 1033099 998272 965565 935279 906720
61799I06720k7414k5994k4078k2213k0606j8816j6708j4846j3626j2690j1533
$$ 906720 879306 853312 829234 807021 786415 767599 750891 736045 722419 709729 698196
61788F98196j0236r207q542p958p151o024m760l796l464l612l811l914m067m164
$$ 698196 687960 678753 670211 662253 655102 649078 644318 640522 637058 633446 629635 625721 621654 617490
61774F17490l808k993k367k476k976l011k245j235q12j216j883k019j379m33K31
$$ 617490 613682 610689 608322 605846 602870 599859 597614 596379 595567 594351 592468 590449 589070 588637 588868
61759E88868M80N64O93Q60R08O84K50M7M81J243J546J269J221J811K253J848J269
$$ 588868 589348 589912 590605 591465 592373 593057 593307 593354 593835 595078 596624 597893 599114 600925 603178 605026 606295
61742F06295J502K061J722P81Q80K368L517K978J661J210J773K431K890L540M306
$$ 606295 607797 609858 611580 612361 613241 615609 619126 622104 623765 624975 626748 629179 632069 635609 639915
61727F39915M617M311L753L184K656K345K359K427K295K013J521M96p77j173j93
$$ 639915 644532 648843 652596 655780 658436 660781 663140 665567 667862 669875 671396 671892 671115 669942 669749
61712F69749R61P99n33j768k472l172l856l895l456l612m612n319m927m136l937
$$ 669749 670710 671509 670976 669208 666736 663564 659708 655813 652357 648745 644133 638814 633887 629751 625814
61697F25814m224m325m179m118m011l450k580j976j895k073k211k173j902j474
$$ 625814 621590 617265 613086 608968 604957 601507 598927 596951 595056 592983 590772 588599 586697 585223
61683E85223j231j413j773j789j337q83r70j621k312k576k542k700l066k972j933
$$ 585223 583992 582579 580806 579017 577680 576797 575827 574206 571894 569318 566776 564076 561010 558038 556105
61668E56105n15J55l58j458k308k556k289j799j475j540j755j702j340r70o88
$$ 556105 555590 555745 555387 553929 551621 549065 546776 544977 543502 541962 540207 538505 537165 536195 535507
61653E35507l43L3J79O0p2p5j6Q3K19K34J65M99J488K418K347J483Q62P30L12
$$ 535507 535164 535197 535376 535436 535364 535289 535273 535356 535575 535809 535974 536473 537961 540379 542726 544209 545071 545801 546113
61634E46113o76j426j427j308j702k259k489k722l336l841l667l273l436l903
$$ 546113 545437 544011 542584 541276 539574 537315 534826 532104 528768 524927 521260 517987 514551 510648
61620E10648l766k858j845j078l17M11N85l6j015j769k090k138k208k529l024
$$ 510648 506882 504024 502179 501101 500784 501195 501780 501744 500729 498960 496870 494732 492524 489995 486971
61605D86971l451l896m708n701o013n300m431m350m767m741m114l502l207l099
$$ 486971 483520 479624 474916 469215 463202 457902 453471 449121 444354 439613 435499 431997 428790 425691
61591D25691l259l766m083l616k787k495k679k550k148k374l218l380k205p92
$$ 425691 422432 418666 414583 410967 408180 405685 403006 400456 398308 395934 392716 389336 387131 386339
61577C86339m46r96j462j574j665j736j566j412j679k126k122j622j200j154j223
$$ 386339 385893 384897 383435 381861 380196 378460 376894 375482 373803 371677 369555 367933 366733 365579 364356
61562C64356j130r26p18n19l86m38o85j036j436j710j499o31M85J186J273J118
$$ 364356 363226 362300 361582 361063 360677 360239 359554 358518 357082 355372 353873 353242 353727 354913 356186 357304
61546C57304J033R09N36M4k04n2K81M83N24O76J176J972K776L302L352K858J967
$$ 357304 358337 359246 359782 359826 359622 359570 359851 360334 360858 361534 362710 364682 367458 370760 374112 376970 378937
61529C78937J017K43l63p90q57n60l36n94j177j644j962k340k552k106j149n12
$$ 378937 379954 380197 379834 379044 378187 377627 377291 376697 375520 373876 371914 369574 367022 364916 363767 363255
61513C63255o52j105j275j204j176j071o67k02j56o15j213j577j526j039l34J38
$$ 363255 362603 361498 360223 359019 357843 356772 356105 355903 355747 355132 353919 352342 350816 349777 349443 349581
61497C49581O0m56j007j185p42J38O84K32p73j043j13Q78O83l37p81j82N58O66
$$ 349581 349641 349185 348178 346993 346251 346389 347073 347305 346532 345489 345376 346254 346937 346600 345819 345637 346195 346861
61479C46861M89O30R06P20J38n7O14J600J882J116N0l41M1M74M99N02R77J669
$$ 346861 347350 347980 348886 349606 349744 349687 350301 351901 353783 354899 354949 354608 354649 355123 355622 356124 357101 358770
61461C58770J912J586J204J167J332J319Q71r0j362k337k314j195L21J361J586
$$ 358770 360682 362268 363472 364639 365971 367290 368161 368071 366709 364372 362058 360863 361184 362545 364131
61446C64131J343J213J450J758J693J275J074J490K190K521K324J967J710J461
$$ 364131 365474 366687 368137 369895 371588 372863 373937 375427 377617 380138 382462 384429 386139 387600
61432C87600J202J245J863K875L768M113L791L006K161J684J804K403L004L011
$$ 387600 388802 390047 391910 394785 398553 402666 406457 409463 411624 413308 415112 417515 420519 423530
61418D23530K182J001L79P83J764K461K361J555M94k82m60l01m46j095j717j850
$$ 423530 425712 426713 427092 427875 429639 432100 434461 436016 436510 436228 435768 435467 435021 433926 432209 430359
61402D30359j819k192k824l089k861k628k624k543k226j970j945j816j234l53
$$ 430359 428540 426348 423524 420435 417574 414946 412322 409779 407553 405583 403638 401822 400588 400235
61388D00235M00P62O64K48LM30J368J950J618Q22M14O08R43J072J160J487J956
$$ 400235 400635 401397 402061 402309 402312 402742 404110 406060 407678 408500 408914 409522 410465 411537 412697 414184 416140
61371D16140K146J812J196P86P57Q28P98R56J600K396K692K488K438K883L474
$$ 416140 418286 420098 421294 422080 422837 423665 424463 425419 427019 429415 432107 434595 437033 439916 443390
61356D43390L917M471N281N852N754N462N837P019Q402R513J0351J0961J1229
$$ 443390 447307 451778 457059 462911 468665 474127 479964 486983 495385 504898 515249 526210 537439
61343E37439J1195J1066J0838J0354R759R450R341Q668O866M368K251J135P33
$$ 537439 548634 559700 570538 580892 590651 600101 609442 618110 624976 629344 631595 632730 633463
61330F33463L58l72j336k168k658k937l328l968m599m811m483l856l160k358j404
$$ 633463 633821 633449 632113 629945 627287 624350 621022 617054 612455 607644 603161 599305 596145 593787 592383
61315E92383n72j63K6N30J367J870J669J451K113L445M363M454M560N574P199
$$ 592383 591811 591648 591674 592204 593571 595441 597110 598561 600674 604119 608482 612936 617496 623070 630269
61300F30269Q386Q487P667O401N047L768K528J228m2j101k055l234m512n209n019
$$ 630269 638655 647142 654809 661210 666257 670025 672553 673781 673739 672638 670583 667349 662837 657628 652609
61285F52609m618m748n106m749l483k101j268q39l79K62J134K386L870N009N341
$$ 652609 647991 643243 638137 633388 629905 627804 626536 625697 625318 625580 626714 629100 632970 637979 643320
61270F43320N030M584M290M189M346M816N488O197O921P715Q555R351J0022J0493
$$ 643320 648350 652934 657224 661413 665759 670575 676063 682260 689181 696896 705451 714802 724824 735317
61256G35317J0731J0920J1346J1964J2310J1970J1033R783Q202O122L771J772
$$ 735317 746048 756968 768314 780278 792588 804558 815591 825374 833576 839698 843469 845241
61244H45241M12p87k566n028p449q927r149q506p585o690n944n580n847o455o513
$$ 845241 845653 844866 842300 837272 829823 820896 811747 803241 795656 788966 783022 777442 771595 765140 758627
61229G58627n359l407j781j048o78Q0J174K003K425K882L561L997L842L510L557
$$ 758627 753268 749861 748080 747032 746354 746434 747608 749611 752036 754918 758479 762476 766318 769828 773385
61214G73385L777L502K701K167K458L156L429L036K457K311K770L473L929M110
$$ 773385 777162 780664 783365 785532 787990 791146 794575 797611 800068 802379 805149 808622 812551 816661
61200H16661M624N972P747R018R602J0356J1988J4207J6371J8386K0292K1542
$$ 816661 821285 827257 835004 844022 853624 863980 875968 890175 906546 924932 945224 966766
61188I66766K1542K0639J9745J9084J8149J6790J5486J4361J2858J0744Q694P343
$$ 966766 988308 1008947 1028692 1047776 1065925 1082715 1098201 1112562 1125420 1136164 1144858 1152201
61176A152201O425N252L657J885M9j781l357m651o211q440j0822j2514j3508j4553
$$ 1152201 1158626 1163878 1167535 1169420 1169469 1167688 1164331 1159680 1153469 1145029 1134207 1121693 1108185 1093632
61162A093632j5922j7125j7886j8649j9700k0426k0039j8701j7334j6435j5603
$$ 1093632 1077710 1060585 1042699 1024050 1004350 983924 963885 945184 927850 911415 895812
61151H95812j4260j2390j0377q432o549m809l433k459j646r09o07j147k332l397
$$ 895812 881552 869162 858785 850353 843804 838995 835562 833103 831457 830548 829941 828794 826462 823065
61137H23065l784l648l447l307k959k206j166p1J000K194L734N681P749R517J0962
$$ 823065 819281 815633 812186 808879 805920 803714 802548 802477 803477 805671 809405 815086 822835 832352 843314
61122H43314J2614J4949J7748K0359K2479K4351K6194K7871K9182L0143L0774
$$ 843314 855928 870877 888625 908984 931463 955814 982008 1009879 1039061 1069204 1099978
61111A099978L0985L0909L0979L1282L1105K9614K6928K4083K1865K0142J8366
$$ 1099978 1130963 1161872 1192851 1224133 1255238 1284852 1311780 1335863 1357728 1377870 1396236
61100A396236J6224J3521R898N194Mm642q238j1170j4143j7482k1032k4363k6926
$$ 1396236 1412460 1425981 1435879 1441073 1441077 1436435 1428197 1417027 1402884 1385402 1364370 1340007 1313081
61087A313081k8326k8725k8822k9187k9723k9901k9398k8327k6880k5118k3072
$$ 1313081 1284755 1256030 1227208 1198021 1168298 1138397 1108999 1080672 1053792 1028674 1005602
61076A005602k0899j8845j7108j5725j4490j3086j1376r536p744n939m061k380
$$ 1005602 984703 965858 948750 933025 918535 905449 894073 884537 876793 870854 866793 864413
61064H64413j241n69M9P59J372J907K802M337O181P760Q869R667J0334J1049J2098
$$ 864413 863172 862603 862652 863411 864783 866690 869492 873829 880010 887770 896639 906306 916640 927689 939787
61049I39787J3657J5546J7454J9319K1255K3191K4952K6604K8393L0332L2156
$$ 939787 953444 968990 986444 1005763 1027018 1050209 1075161 1101765 1130158 1160490 1192646
61038A192646L3710L5124L6514L7793L8925M0058M1282M2463M3494M4539M5846
$$ 1192646 1226356 1261480 1297994 1335787 1374712 1414770 1456052 1498515 1542009 1586548 1632394
61027A632394M7402M9018N0580N2075N3490N4968N7005O0233O4826P0288P5974
$$ 1632394 1679796 1728814 1779394 1831469 1884959 1939927 1996932 2057165 2121991 2192279 2268253
61016B268253Q1844Q8622R7260J08226J21335J36367J53832J75064K01598K34571
$$ 2268253 2350097 2438719 2535979 2644205 2765540 2901907 3055739 3230803 3432401 3666972
61006C666972K74800L23168L80691M48361N27037O17300P19226Q33041R60298
$$ 3666972 3941772 4264940 4645631 5093992 5621029 6238329 6957555 7790596 8750894
60997H750894J101646J247802J369757J423134J373500J225688J027277Q37120
$$ 8750894 9852540 11100342 12470099 13893233 15266733 16492421 17519698 18356818
60989A8356818O86370N69016M65846L68747K76962J77144M1584j45857l66094
$$ 18356818 19043188 19612204 20078050 20446797 20723759 20900903 20942487 20796630 20430536
60980B0430536n75018p39914q63594r72396j084237j190675j266545j291505j261941
$$ 20430536 19855518 19115604 18252010 17279614 16195377 15004702 13738157 12446652 11184711
60971A1184711j187897j084326r65500q43383p27072o22255n31329m54378l90212
$$ 11184711 9996814 8912488 7946988 7103605 6376533 5754278 5222949 4768571 4378359
60962D378359l37008k92690k55275k23297j96050j73374j55009j40146j27601
$$ 4378359 4041351 3748661 3493386 3270089 3074039 2900665 2745656 2605510 2477909
60953B477909j16353j05928r6325q7768q0434p4282o9120o4813o1312n8439n5956
$$ 2477909 2361556 2255628 2159303 2071535 1991101 1916819 1847699 1782886 1721574 1663135 1607179
60942A607179n3778n1939n0164m8030m5673m3873m2944m2050m0237l7809l5840
$$ 1607179 1553401 1501462 1451298 1403268 1357595 1313722 1270778 1228728 1188491 1150682 1114842
60931A114842l4494l2878l0548k8249k6742k5719k4409k2688k0991j9608j8536
$$ 1114842 1080348 1047470 1016922 988673 961931 936212 911803 889115 868124 848516 829980
60920H29980j7644j6576j4847j2518j0433r324q910q342p295o131n249m631l967
$$ 829980 812336 795760 780913 768395 757962 748638 739728 731386 724091 717960 712711 708080 704113
60907G04113k950j657p64r34j798k110j409p56j192k121k222j475j103j664k450
$$ 704113 701163 699506 698742 697808 696010 693900 692491 691735 690543 688422 686200 684725 683622 681958 679508
60892F79508k897l470m675o077o858o798o299n873n892o454p152p332o751n779
$$ 679508 676611 673141 668466 662389 655531 648733 642434 636561 630669 624215 617063 609731 602980 597201
60878E97201m881m322m312m841n351n147m246l245k324j151J16O41J30n44m28
$$ 597201 592320 587998 583686 578845 573494 568347 564101 560856 558532 557381 557497 558138 558268 557724 557296
60863E57296M21J428K363L202L735L974M422N254N828N693N480N972O722O664
$$ 557296 557717 559145 561508 564710 568445 572419 576841 582095 587923 593616 599096 605068 611790 618454
60849F18454N721M831M420L973L163K451K207K065J552P85J08n00j252k073k640
$$ 618454 624175 629006 633426 637399 640562 643013 645220 647285 648837 649622 649730 649230 647978 645905 643265
60834F43265k741k436k082k198l014m076m638m512m207m160m248m185m019l926
$$ 643265 640524 638088 636006 633808 630794 626718 622080 617568 613361 609201 604953 600768 596749 592823
60820E92823l854l647l327l021k749k553k618l041l546l661l157k213j192l50
$$ 592823 588969 585322 581995 578974 576225 573672 571054 568013 564467 560806 557649 555436 554244 553894
60806E53894K46O82J047J349J523J559J574J739K150K723L218L465L587L930M717
$$ 553894 554140 554822 555869 557218 558741 560300 561874 563613 565763 568486 571704 575169 578756 582686 587403
60791E87403N799O777P282P236P005P192P999Q814Q921Q582Q869J0148J1434J1745
$$ 587403 593202 599979 607261 614497 621502 628694 636693 645507 654428 663010 671879 682027 693461 705206
60777G05206J1513J1919J3195J4465J5080J5231J5204J4930J4536J4573J5211
$$ 705206 716719 728638 741833 756298 771378 786609 801813 816743 831279 845852 861063
60766H61063J5911J6236J6533J7212J7881J7794J6913J5925J5278J4784J4225
$$ 861063 876974 893210 909743 926955 944836 962630 979543 995468 1010746 1025530 1039755
60755A039755J3796J3708J3625J2885J1248R189P324N699L868J626o47k555m266
$$ 1039755 1053551 1067259 1080884 1093769 1105017 1114206 1121530 1127229 1131097 1132723 1132076 1129521 1125255
60742A125255o154q135r839j1315j2976j4803j6207j6966j7683j8890k0140k0533
$$ 1125255 1119101 1110966 1101127 1089812 1076836 1062033 1045826 1028860 1011177 992287 972147 951614
60730I51614j9965j9207j8833j8557j7868j6846j6013j5536j5012j4076j2941
$$ 951614 931649 912442 893609 875052 857184 840338 824325 808789 793777 779701 766760
60719G66760j2051j1407j0596r539q737q569q684q410p566o494n541m925m901
$$ 766760 754709 743302 732706 723167 714430 705861 697177 688767 681201 674707 669166 664241 659340
60706F59340n582o548p252p696q224q637q244o971n753n445n842o177o159o041
$$ 659340 653758 647210 639958 632262 624038 615401 607157 600186 594433 588988 583146 576969 570810 564769
60692E64769o033o114o306o615o835o641n918m860l895l491l697l841l151j812
$$ 564769 558736 552622 546316 539701 532866 526225 520307 515447 511552 508061 504364 500523 497372 495560
60678D95560r25j126j802k005j601r92k70N82J052N33o42j379j151n48l44n89
$$ 495560 494635 493509 491707 489702 488101 487109 486839 487421 488473 489006 488364 486985 485834 485286 484942 484353
60662D84353q52q98q57q91r64q62m39J41N33P00J017J732K545L033L233L457L761
$$ 484353 483501 482603 481746 480855 479891 479029 478590 478731 479264 479964 480981 482713 485258 488291 491524 494981 498742
60645D98742L970M024L917L506K853K428K494K546J973J031M64L94L32K03L65
$$ 498742 502712 506736 510653 514159 517012 519440 521934 524480 526453 527484 527948 528342 528674 528877 529242
60630E29242O20K35p62j316p97M5J28p16k019l406m379m152k635j065p14j255
$$ 529242 529862 530097 529335 528019 527222 527267 527395 526679 524660 521254 516875 512723 510088 509023 508309 507054
60614E07054j391q73p81j746k950l353l103l082l540l774l165j993j156j216j856
$$ 507054 505663 504790 504009 502263 499313 495960 492857 489775 486235 482461 479296 477303 476147 474931 473075
60599D73075k343k389k275k112j471j24J234J656J186P61Q63J015P64L79K30J32
$$ 473075 470732 468343 466068 463956 462485 462361 463595 465251 466437 467198 468061 469076 469840 470219 470449 470581
60583D70581j43l13j92l39j258k214j870j39J521J991J803K105K974L540L387
$$ 470581 470438 470125 469933 469594 468336 466122 464252 464113 465634 467625 469428 471533 474507 478047 481434
60568D81434L038L137L810M929O333P642Q298Q117P493O833O036M788L150J597
$$ 481434 484472 487609 491419 496348 502681 510323 518621 526738 534231 541064 547100 551888 555038 556635
60554E56635N44j0l95r13j530j886j687j093m65P6O06J019J176J412K313L794
$$ 556635 557179 557169 556774 555861 554331 552445 550758 549665 549200 549276 549882 550901 552077 553489 555802 559596
60538E59596M993N336N179N070M987M793M766M941M547L005J125K16K07j97j458
$$ 559596 564589 569925 575104 580174 585161 589954 594720 599661 604208 607213 608338 608554 608761 608564 607106
60523F07106k503k361j425o07j79n5l22p52n29O32J760J877J490J835K936L550
$$ 607106 604603 602242 600817 600210 600031 599976 599654 598902 598373 599005 600765 602642 604132 605967 608903 612453
60507F12453L033K249K331L280M242M669M854N532P154R415J1562J3300J5172
$$ 612453 615486 617735 620066 623346 627588 632257 637111 642643 649797 659212 670774 684074 699246
60494F99246J7646K0154K1683K2106K2167K2106K1171J8745J5151J0925O014L14
$$ 699246 716892 737046 758729 780835 803002 825108 846279 865024 880175 891100 897114 897428
60482H97428n528j0643j4962j8962k2544k4876k5515k5048k4304k3424k2004j9953
$$ 897428 891900 881257 866295 847333 824789 799913 774398 749350 725046 701622 679618 659665
60470F59665j7771j6009j4757j3693j2485j1001r335p777o761o560o880o906o017
$$ 659665 641894 625885 611128 597435 584950 573949 564614 556837 550076 543516 536636 529730 523713
60457E23713m439l040k470k625k940l001k804k534k313k131k000k040k298k464
$$ 523713 519274 516234 513764 511139 508199 505198 502394 499860 497547 495416 493416 491376 489078 486614
60443D86614k059j046o5J84k99r57j387j564j435q81k00r1q28j771k066j629j081
$$ 486614 484555 483509 483444 483628 483329 482372 480985 479421 477986 477105 476905 476814 475986 474215 472149 470520 469439
60426D69439q93r17p25j62N55J061J169J037R68J017R16M59j53m48j13P13J474
$$ 469439 468546 467629 466904 466742 467297 468358 469527 470564 471532 472549 473465 473924 473771 473323 473210 473923 475397
60409D75397J589J010M06M56R67J165Q56P73J428K276K470K083J803J768J438
$$ 475397 476986 477996 478402 478858 479825 480990 481846 482619 484047 486323 488793 490876 492679 494447 495885
60394D95885O20j26k65J37Q01J613K390K678K252J466R00Q48J361K379L498L985
$$ 495885 496505 496379 496114 496251 497052 498665 501055 503733 505985 507451 508351 509199 510560 512939 516437 520422
60378E20422L494K609K242K592L055L090K771K467K361K483K862L421L864L899
$$ 520422 523916 526525 528767 531359 534414 537504 540275 542742 545103 547586 550448 553869 557733 561632
60364E61632L540L032K542K098J801J878K344K804K759K123J311Q32R10J449K184
$$ 561632 565172 568204 570746 572844 574645 576523 578867 581671 584430 586553 587864 588696 589606 591055 593239
60349E93239K851L385M037N040O229P231Q027Q837R358Q760O840M566K894J558
$$ 593239 596090 599475 603512 608552 614781 622012 630039 638876 648234 656994 663834 668400 671294 672852
60335F72852j86k102l277l729m449n705o465o006n069m686m753m558m086l843
$$ 672852 672666 670564 667287 663558 659109 653404 646939 640933 635864 631178 626425 621867 617781 613938
60321F13938l851l762l720m103m559m231l000j719r95m62M82J769K874L534L983
$$ 613938 610087 606325 602605 598502 593943 589712 586712 584993 583998 583536 584018 585787 588661 592195 596178
60306E96178M627N673O981Q295R596J0989J2207J2649J2243J1720J1490J0803
$$ 596178 600805 606478 613459 621754 631350 642339 654546 667195 679438 691158 702648 713451
60294G13451Q815O031L771K363R69q53k589l896n132o362o965o734o555p204q312
$$ 713451 722266 728297 732068 734431 735400 734547 731958 728062 722930 716568 709603 702869 696314 689110 680798
60279F80798r134r617r935r750q780p660p258p492p554p097o381n560m619l828
$$ 680798 671664 662047 652112 642362 633582 625922 618664 611172 603618 596521 590140 584580 579961 576133
60265E76133l480l280k710j882j357j266j292j391j756k070j720q15k55m49p43
$$ 576133 572653 569373 566663 564781 563424 562158 560866 559475 557719 555649 553929 553114 552859 552410 551667
60250E51667m47K27O06M79J39j37k62j96K2K01J34k29p19r41m82O23J665J909
$$ 551667 551220 551447 552053 552532 552671 552534 552272 552076 552098 552299 552433 552204 551485 550544 550062 550685 552350 554259
60232E54259J380P17L35K18L75R55J803K467K760K933L192L465L697L905L915
$$ 554259 555639 556356 556691 556909 557284 558239 560042 562509 565269 568202 571394 574859 578556 582461 586376
60217E86376L568L195L281L628L563L142L292M419N671O146O068O120O205N817
$$ 586376 589944 593139 596420 600048 603611 606753 610045 614464 620135 626281 632349 638469 644674 650491
60203F50491N145M884N050M951M373L982M229M504L862K242N45l66m61l52n31
$$ 650491 655636 660520 665570 670521 674894 678876 683105 687609 691471 693713 694258 693892 693431 693079 692548
60188F92548r16j118j023r16j096j535k024k462k942l538m101m242l670k671k041
$$ 692548 691632 690514 689491 688575 687479 685944 683920 681458 678516 674978 670877 666635 662965 660294 658253
60173F58253k166k437k082j405j437k230k508j423R7N50j39p00k86P29J592K016
$$ 658253 656087 653650 651568 650163 648726 646496 643988 642565 642662 643212 643073 642373 642087 642816 644408 646424
60157F46424K001J629J248J339J817J925J225L32K52J138K137K469K265K210K659
$$ 646424 648425 650054 651302 652641 654458 656383 657608 657940 658192 659330 661467 663936 666201 668411 671070
60142F71070L415M214N017N744O158O297O626P388Q065Q016P383O822O450N841
$$ 671070 674485 678699 683716 689460 695618 701915 708541 715929 723994 732010 739393 746215 752665 758506
60128G58506M893L965L009J553k57j500j794j835k136k187j592j058j251j461
$$ 758506 763399 767364 770373 771926 771669 770169 768375 766540 764404 762217 760625 759567 758316 756855
60114G56855o57P21J344R86O38P18N63k44j248k094k963l710l723l012k477k572
$$ 756855 756198 756919 758263 759249 759887 760605 761168 760924 759676 757582 754619 750909 747186 744174 741697 739125
60098G39125k616k016j264j070j220j077o32k84l6M62J351K608M247N971O963
$$ 739125 736509 734493 733229 732159 730939 729862 729230 728946 728910 729372 730723 733331 737578 743549 750512
60083G50512O665N510M454M008M136M611M935M318K464J20j793l309m986o601
$$ 750512 757177 762687 767141 771149 775285 779896 784831 789149 791613 791733 789940 786631 781645 775044
60069G75044p283o982o895p936r510j0284r852q986q516q441q256p723p005o246
$$ 775044 767761 760779 753884 745948 736438 726154 716302 707316 698800 690359 682103 674380 667375 661129
60055F61129n373m384l575l219l195l183l085k945k552j658n24K60O74J422K879
$$ 661129 655756 651372 647797 644578 641383 638200 635115 632170 629618 627960 627436 627696 628370 629792 632671
60040F32671M390N073M935M706M826N024M761L721K030L11o54p16o06j097k158
$$ 632671 637061 642134 647069 651775 656601 661625 666386 670107 672137 672448 671794 671078 670472 669375 667217
60025F67217l301m441n786p155q019q302q468q777q943q647p964p160o481o221
$$ 667217 663916 659475 653689 646534 638515 630213 621745 612968 604025 595378 587414 580254 573773 567552
60011E67552o471o647n810l783j561k53P3J68N65J202J873K526L064L259L033
$$ 567552 561081 554434 548624 544841 543280 543027 543100 543268 543833 545035 546908 549434 552498 555757 558790
59996E58790K567K070J607J278J377K083L061L614L403K888K906L756M792N022
$$ 558790 561357 563427 565034 566312 567689 569772 572833 576447 579850 582738 585644 589400 594192 599214
59982E99214M016K279P02k07n79p26p81q80j451k746m099m312l107j709j378j837
$$ 599214 603230 605509 606211 606004 605425 604699 603918 603038 601587 598841 594742 590430 587323 585614 584236 582399
59966E82399j899j321j001j334j462o51N37J118J056J004J188J308J287J370J516
$$ 582399 580500 579179 578178 576844 575382 574731 575268 576386 577442 578446 579634 580942 582229 583599 585115
59951E85115J377Q23J28l58m20p8K66R4m44n40M4L52m63j753k235j820j516j728
$$ 585115 586492 587315 587443 587085 586665 586587 586853 586947 586503 585963 586007 586359 585896 584143 581908 580088 578572 576844
59933E76844j898j823k036k661l019k769k405k166j556m93P6m30j128q48K39J092
$$ 576844 574946 573123 571087 568426 565407 562638 560233 558067 556511 556018 556094 555664 554536 553688 553927 555019
59917E55019J345J486J819K220K624L022L158K965L023L796M731M945M551M383
$$ 555019 556364 557850 559669 561889 564513 567535 570693 573658 576681 580477 585208 590153 594704 599087
59903E99087M547M346L615L074L104L170K861K587K727K928K828K848L442M138
$$ 599087 603634 607980 611595 614669 617773 620943 623804 626391 629118 632046 634874 637722 641164 645302
59889F45302M080L302K652K621K911L170L478L920M212M047L574L249L321L568
$$ 645302 649382 652684 655336 657957 660868 664038 667516 671436 675648 679695 683269 686518 689839 693407
59875F93407L496K836J878J194R40O15k87j553k572l208l970n155o314o780o391
$$ 693407 696903 699739 701617 702811 703751 704366 704079 702526 699954 696746 692776 687621 681307 674527 668136
59860F68136n434m195k979k322k541l034k618q37J419K917L370L415L589L938
$$ 668136 662702 658507 655528 653206 650665 647631 645013 644176 645595 648512 651882 655297 658886 662824
59846F62824M471N381O559P376P321O566N605M631L591K611J993J756J603J246
$$ 662824 667295 672676 679235 686611 693932 700498 706103 710734 714325 716936 718929 720685 722288 723534
59832G23534N79l90j411j956j720j272j663l250n256o786p792q679r288q966p653
$$ 723534 724113 723723 722312 720356 718636 717364 715701 712451 707195 700409 692617 683938 674650 665684 658031
59817F58031o324n970o459o753o209n260m756m923n227n113m547l771k906j973
$$ 658031 651707 645737 639278 632525 626316 621056 616300 611377 606150 601037 596490 592719 589813 587840
59803E87840j165p60p78r93j249j579j954k152j983j525j079r57j234j624j645
$$ 587840 586675 585915 585137 584144 582895 581316 579362 577210 575227 573702 572623 571666 570432 568808 567163
59788E67163j160o97q63j497j819j526j213j431j784j524p15k19n36j224j522
$$ 567163 566003 565306 564443 562946 561127 559601 558388 556957 555173 553649 552934 552715 552179 550955 549433
59773E49433j153m09K43N68P76J353K410L277L198K381J834K121K760L110L179
$$ 549433 548280 547871 548114 548682 549458 550811 553221 556498 559696 562077 563911 566032 568792 571902 575081
59758E75081L262L290L053K729K596K567K494K685L484M469M806M403M032M203
$$ 575081 578343 581633 584686 587415 590011 592578 595072 597757 601241 605710 610516 614919 618951 623154
59744F23154M542M501M116L691L274K790K410K314K345K207J835J308O77Q8j69
$$ 623154 627696 632197 636313 640004 643278 646068 648478 650792 653137 655344 657179 658487 659164 659252 659083
59729F59083l9J62K29L46N48L99k74p50k98N84P02p1n52J4R16J131P23L93K75
$$ 659083 659044 659206 659435 659781 660329 660728 660454 659704 659406 659990 660692 660621 660069 660083 660999 662130 662853 663246 663521
59710F63521J1k53P7J031J829J850J345R46Q94R45P88L78N4K67J036J721J696
$$ 663521 663532 663279 663356 664387 666216 668066 669411 670357 671251 672196 672984 673362 673416 673683 674719 676440 678136
59693F78136J157Q54R83R46L53l37n33l98m92q62j045q40n34m33n75q87j235j360
$$ 678136 679293 680147 681130 682076 682429 682092 681559 681161 680669 679807 678762 677922 677388 676955 676380 675493 674258 672898
59675F72898j157r93j363k182k860l081l122l225l241l064l027l458m135m507
$$ 672898 671741 670748 669385 667203 664343 661262 658140 654915 651674 648610 645583 642125 637990 633483
59661F33483m246l432k352j442j098j237j203m14R90K365L201L342K903K318K214
$$ 633483 629237 625805 623453 622011 620913 619676 618473 618059 619049 621414 624615 627957 630860 633178 635392
59646F35392K713L005K159L44j264j861j805j855k153k278k009j621j466j536
$$ 635392 638105 641110 643269 643613 642349 640488 638683 636828 634675 632397 630388 628767 627301 625765
59632F25765j512j164o48l01j61J17P43J403J626J327P20q8r74j535j470j098
$$ 625765 624253 623089 622441 622140 621979 622096 622839 624242 625868 627195 627915 627827 626853 625318 623848 622750
59616F22750r84j063q44l91l40p56p99K1J019J336J246J681K748L488L059J684
$$ 622750 621766 620703 619859 619468 619128 618372 617573 617594 618613 619949 621195 622876 625624 629112 632171 633855
59600F33855L53j27K62Q11Q03K02m83r60j358j648j486r11o33j063j623j551j018
$$ 633855 634208 634081 634343 635154 635957 636159 635676 634716 633358 631710 630224 629313 628680 627617 625994 624443 623425
59583F23425q05j196j806k285k531k435k073j934k342k793k566j830j400j503
$$ 623425 622620 621424 619618 617333 614802 612367 610294 608360 606018 603225 600659 598829 597429 595926
59569E95926j578j318j073j070j060r13q39p27J4J472K743K904K134J406J354
$$ 595926 594348 593030 591957 590887 589827 588914 588075 587348 587362 588834 591577 594481 596615 598021 599375
59554E99375J822K247K255K018K126K878L701L731K987K454K835L792M676N377
$$ 599375 601197 603444 605699 607717 609843 612721 616422 620153 623140 625594 628429 632221 636897 642274
59540F42274O133P025Q139R766J1838J3475J3623J2126R841P820O582N964N451
$$ 642274 648407 655432 663571 673337 685175 698650 712273 724399 734240 742060 748642 754606 760057
59527G60057M661L681K845K276J950K084K867L828M071L424K691K448K163R52
$$ 760057 764718 768399 771244 773520 775470 777554 780421 784249 788320 791744 794435 796883 799046 799998
59513G99998j246l766n999p597q332q318q165q420q980r369r305q742p744o627
$$ 799998 798752 794986 788987 781390 773058 764740 756575 748155 739175 729806 720501 711759 704015 697388
59499F97388n888n604n287m649m007l578k963j840o69m7R8J37R5P7O97K241L826
$$ 697388 691500 685896 680609 675960 671953 668375 665412 663572 662903 662856 662954 663091 663186 663263 663960 666201 670027
59482F70027M430M299M421M971N410N803O733Q008Q771Q961R366J0009R800Q312
$$ 670027 674457 678756 683177 688148 693558 699361 706094 714102 722873 731834 741200 751209 761009 769321
59468G69321O620N699N091L938K432J364R29Q66J201K072L261M614O479Q978J1314
$$ 769321 775941 781640 786731 790669 793101 794465 795394 796260 797461 799533 802794 807408 813887 822865 834179
59453H34179J2607J3065J3519J4152J4547J4731J5133J5414J4381J1437P438L703
$$ 834179 846786 859851 873370 887522 902069 916800 931933 947347 961728 973165 980603 984306
59441I84306O37k213n199q128j0663j2684j4215j5209j5535j5163j4198j2805
$$ 984306 984943 982730 977531 969403 958740 946056 931841 916632 901097 885934 871736 858931
59429H58931j1076r185p513o415n714m641k556L95L473O132Q441J0769J3248J5588
$$ 858931 847855 838670 831157 824742 819028 814387 811831 812226 815699 821831 830272 841041 854289 869877
59415H69877J7366J8481J9295K0201K1029K0895J8756J4243Q087J852l048o361
$$ 869877 887243 905724 925019 945220 966249 987144 1005900 1020143 1028230 1030082 1027034 1020673
59403A020673q955j1528j3581j4029j2695j0669r127q436q469r223j0636j2305
$$ 1020673 1011718 1000190 986609 972580 959885 949216 940089 931653 923184 913961 903325 891020
59391H91020j3847j5335j6956j8397j9024j8565j7365j5987j4724j3458j1828
$$ 891020 877173 861838 844882 826485 807461 788896 771531 755544 740820 727362 715534
59380G15534r749p737o469n873n054l373j272L01R62J085J155J356J589J617J285
$$ 715534 705785 698048 691579 685706 680652 677279 676007 676308 677270 678355 679510 680866 682455 684072 685357
59365F85357Q87J010J844K873L598M196N102O296P538Q882J0399J1661J2251J2602
$$ 685357 686244 687254 689098 691971 695569 699765 704867 711163 718701 727583 737982 749643 761894 774496
59351G74496J3558J5170J6684J7801J9008K0509K1667K1948K1700K1490K1181
$$ 774496 788054 803224 819908 837709 856717 877226 898893 920841 942541 964031 985212
59340I85212K0241J8512J6108J2956R065N034J561j456m738q492j2075j4854j6893
$$ 985212 1005453 1023965 1040073 1053029 1062094 1067128 1068689 1067233 1062495 1054003 1041928 1027074 1010181
59327A010181j8585k0049k1145k1748k1711k0914j9580j8251j7120j5703j3590
$$ 1010181 991596 971547 950402 928654 906943 886029 866449 848198 831078 815375 801785
59316H01785j1222r405q279p425o821o797o890n763k960Q1J607J711J927L054
$$ 801785 790563 781158 772879 765454 758633 751836 744946 739183 736223 736304 737911 739622 741549 744603
59302G44603M512N824P401R471J1254J1924J1595J0659Q852N818K180q84k910
$$ 744603 749115 754939 762340 771811 783065 794989 806584 817243 826095 831913 834093 833209 830299
59289H30299m263n266n942o438o851o721n557l799k483j773p67R94K706L537L925
$$ 830299 826036 820770 814828 808390 801539 794818 789261 785462 782979 781206 780439 781433 784139 787676 791601
59274G91601M949O893R080J0819J1854J2115J1709J1154J1012J1144J0719R132
$$ 791601 796550 803443 812523 823342 835196 847311 859020 870174 881186 892330 903049 912181
59262I12181O600L757R72j735m276o365p811q795r722j0807j1888j2618j2797
$$ 912181 918781 922538 923510 921775 917499 911134 903323 894528 884806 873999 862111 849493 836696
59249H36696j2366j1302r732q102o911o153n232l654j629J97J493K501L634M985
$$ 836696 824330 813028 803296 795194 788283 782130 776898 773244 771615 771812 773305 775806 779440 784425
59235G84425O291P191P463P162O552N861M970L480J207j406l600n069o194p385
$$ 784425 790716 797907 805370 812532 819084 824945 829915 833395 834602 833196 829596 824527 818333 810948
59221H10948q433q935r086r518j0307j0793j0627j0348j0451j0418r376p439n570
$$ 810948 802515 793580 784494 774976 764669 753876 743249 732901 722450 712032 702656 695217 689647
59208F89647m262l177k179j823k409l206l183k190r52j66M9LJ36P46J762K799
$$ 689647 685385 682208 680029 678206 675797 672591 669408 667218 666266 666100 666149 666152 666288 667034 668796 671595
59192F71595L643M401N137N582N537N241N105N188N231N002M441L656L009K947
$$ 671595 675238 679639 684776 690358 695895 701136 706241 711429 716660 721662 726103 729759 732768 735715
59178G35715L484M040M137M021M224M714M972M900N108O145P772R187R835R892
$$ 735715 739199 743239 747376 751397 755621 760335 765307 770207 775315 781460 789232 798419 808254 818146
59164H18146J0003J0531J1031J0631R050P088N712M879L615J309j500l785n197
$$ 818146 828149 838680 849711 860342 869392 876480 882192 887071 890686 891995 890495 886710 881513
59151H81513o324p918j0015j1866j2685j2443j1769j1100j0187q701p020o008
$$ 881513 875189 867271 857256 845390 832705 820262 808493 797393 787206 778505 771485 765477
59139G65477o027o580o942o786o131n087l904k987k636k754k917k688j887p46
$$ 765477 759450 752870 745928 739142 733011 727924 724020 721033 718397 715643 712726 710038 708151 707405
59125G07405K38Q10J295K105L005L345L161L478N059P227Q555Q550Q108Q153Q504
$$ 707405 707643 708453 709748 711853 714858 718203 721364 724842 729901 737128 745683 754233 762341 770494 778998
59110G78998Q406P774P296P412P743P770P577P488P240O199M460L095K887L317
$$ 778998 787404 795178 802474 809886 817629 825399 832976 840464 847704 853903 858363 861458 864345 867662
59096H67662L253K377J300M64l31j232j882j983j785j654j597j571j812k460l138
$$ 867662 870915 873292 874592 875056 874725 873493 871611 869628 867843 866189 864592 863021 861209 858749 855611
59081H55611l433l595m251n554p067q331r149r430r201q715q105p105n586m212
$$ 855611 852178 848583 844332 838778 831711 823380 814231 804801 795600 786885 778780 771675 766089 761877
59067G61877l897m563n192n156m824m565m081l170k414k358k544k169j343r09
$$ 761877 757980 753417 748225 743069 738245 733680 729599 726429 724015 721657 719113 716944 715601 714692
59053G14692j200j770k236k552k476j674n73j98p69j225o72L44O81K52KN14J381
$$ 714692 713492 711722 709486 706934 704458 702784 702211 702013 701244 700019 699347 699691 700372 700624 700626 701140 702521
59036G02521K019K351K552K645K684K985L776M797N476N581N516N931P022Q241
$$ 702521 704540 706891 709443 712088 714772 717757 721533 726330 731806 737387 742903 748834 755856 764097
59022G64097Q886Q966R243J0224J1389J1753J0966R472P728N816L845K201J115
$$ 764097 772983 781949 791192 801416 812805 824558 835524 844996 852724 858540 862385 864586 865701
59009H65701M08j32m03l12j02o7p4L09J329K881M643O176P124P590Q178R212J0127
$$ 865701 866109 865977 865574 865262 865160 865093 865019 865328 866657 869538 874181 880357 887481 895071 903249 912461 922588
58992I22588J0018Q818P369O287N213L564J558nq42j571k883m640o000o293n651
$$ 922588 932606 941424 948793 955080 960293 963857 965415 965410 964568 962997 960114 955474 949474 943181 937530
58977I37530m792m275l985l328j997l97Q17J546K409L962O073Q158R819J0947
$$ 937530 932738 928463 924478 921150 919153 918756 919573 921119 923528 927490 933563 941721 951540 962487
58963I62487J1435J1265J0856J0800J1042J0762R333P051M587K097o84l675o413
$$ 962487 973922 985187 996043 1006843 1017885 1028647 1037980 1045031 1049618 1051715 1051031 1047356 1040943
58950A040943q706j0764j2617j3946j4632j4972j5132j4842j3944j2812j1863
$$ 1040943 1032237 1021473 1008856 994910 980278 965306 950174 935332 921388 908576 896713
58939H96713j0954r718q217o862n812m829l699k529j634j344j766k542l060l079
$$ 896713 885759 876041 867824 860962 855150 850321 846622 844093 842459 841115 839349 836807 833747 830668
58925H30668k995l214l570l709l745m001m312m136l312k215j146j39P12J283J892
$$ 830668 827673 824459 820889 817180 813435 809434 805122 800986 797674 795459 794313 794174 794886 796169 798061
58910G98061L043M573N668O011O307P260Q642R843J0839J1998J3271J4310J5150
$$ 798061 801104 805677 811345 817356 823663 830923 839565 849408 860247 872245 885516 899826 914976
58897I14976J6123J7127J7692J7785J8006J8728J9628K0265K0752K1562K2885
$$ 914976 931099 948226 965918 983703 1001709 1020437 1040065 1060330 1081082 1102644 1125529
58886A125529K4486K5955K6852K6769K5589K3639K1394J8973J5946J1798O515
$$ 1125529 1150015 1175970 1202822 1229591 1255180 1278819 1300213 1319186 1335132 1346930 1353445
58875A353445P30m766r678j4234j8545k2117k4253k4887k4698k4395k4097k3513
$$ 1353445 1354175 1349409 1339731 1325497 1306952 1284835 1260582 1235695 1210997 1186602 1162505 1138992
58863A138992k2438k0957j9333j7893j6854j6113j5320j4291j3268j2585j2243
$$ 1138992 1116554 1095597 1076264 1058371 1041517 1025404 1010084 995793 982525 969940 957697
58852I57697j1936j1466j0882j0252r519q663p824p202o886o839o971p120p131
$$ 957697 945761 934295 923413 913161 903642 894979 887155 879953 873067 866228 859257 852137 845006
58839H45006o978o821o804o865o886o877o915o851o346n313m117l238k794k616
$$ 845006 838028 831207 824403 817538 810652 803775 796860 790009 783663 778350 774233 770995 768201 765585
58825G65585k586k614k376j498j64Q69J148J190J838L111M082M008L194K549K495
$$ 765585 762999 760385 758009 756511 756347 757216 758364 759554 761392 764503 768585 772593 775787 778336 780831
58810G80831K617K328J685J356J810K627K848J999O24m04r15j456k342l099l037
$$ 780831 783448 785776 787461 788817 790627 793254 796102 798101 798725 798321 797406 795950 793608 790509 787472
58795G87472k162j205q16r56j129r99o36j56N73J673K812L408L392L376L849M500
$$ 787472 785310 784105 783289 782333 781204 780205 779569 779413 779986 781659 784471 787879 791271 794647 798496 802996
58779H02996M788M770M903N117M846M030L317K972K343R46n37j056p18o67j538
$$ 802996 807784 812554 817457 822574 827420 831450 834767 837739 840082 841028 840491 839435 838717 838050 836512
58764H36512k768l506l576l292k860k312j681r14J39J374K310K604K502K484K604
$$ 836512 833744 830238 826662 823370 820510 818198 816517 815603 815742 817116 819426 822030 824532 827016 829620
58749H29620K558K345K447L167M048M340L981L767M407N592O340O155N521N164
$$ 829620 832178 834523 836970 840137 844185 848525 852506 856273 860680 866272 872612 878767 884288 889452
58735H89452N240N457N688O046O511O958P454Q156Q852R053Q659Q142P848P527
$$ 889452 894692 900149 905837 911883 918394 925352 932806 940962 949814 958867 967526 975668 983516 991043
58721I91043O815N934N467N671O311P133Q023Q712Q721P886O690N799N278M553
$$ 991043 997858 1003792 1009259 1014930 1021241 1028374 1036397 1045109 1053830 1061716 1068406 1074205 1079483 1084036
58707A084036L161J342k59j460k844n148q468j2085j5014j6668j7214j7351j7716
$$ 1084036 1087197 1088539 1088280 1086820 1083976 1078828 1070360 1058275 1043261 1026593 1009379 992028 974312
58694I74312j8287j8492j7939j6874j5730j4531j3058j1463j0225r448q660p519
$$ 974312 956025 937533 919594 902720 886990 872459 859401 847938 837713 828265 819605 812086
58682H12086o321n531n106m597l805k984k411j997j454o68K18J067J996L196M592
$$ 812086 805765 800234 795128 790531 786726 783742 781331 779334 777880 777212 777430 778497 780493 783689 788281
58667G88281N843O844P951R457J1005J1864J1690J0733R326P601N741M071K715
$$ 788281 794124 800968 808919 818376 829381 841245 852935 863668 872994 880595 886336 890407 893122
58654H93122J480J58j227k591l844m734n041m996n086n295n030m086l169k992
$$ 893122 894602 894760 893533 890942 887098 882364 877323 872327 867241 861946 856916 852830 849661 846669
58640H46669l228k912j670o3J187J894K316K747L235L586L581L283K947K638K206
$$ 846669 843441 840529 838859 838796 839983 841877 844193 846940 850175 853761 857342 860625 863572 866210 868416
58625H68416J714J466J514J537J525K035L427N262O919Q419J0029J1499J2289
$$ 868416 870130 871596 873110 874647 876172 878207 881634 886896 893815 902234 912263 923762 936051
58612I36051J2400J2302J2212J1928J1287J0193Q408N879L127P62j269l303n079
$$ 936051 948451 960753 972965 984893 996180 1006373 1014781 1020660 1023787 1024549 1023280 1019977 1014898
58599A014898o027o305o684p351p673p269o492n672m670l488k530j809o11J546
$$ 1014898 1008871 1002566 995882 988531 980858 973589 967097 961425 956755 953267 950737 948928 948317 949863
58585I49863M156O442Q302J0013J1461J2248J2308J1910J1254J0464R804R491
$$ 949863 954019 960461 968763 978776 990237 1002485 1014793 1026703 1037957 1048421 1058225 1067716
58573A067716R387R139Q580P841P324P620R150J1665J4301J6367J7832J9008K0103
$$ 1067716 1077103 1086242 1094822 1102663 1109987 1117607 1126757 1138422 1152723 1169090 1186922 1205930 1226033
58560A226033K1201K2263K2926K2660K1297J9095J6227J2753R173O334M435K667
$$ 1226033 1247234 1269497 1292423 1315083 1336380 1355475 1371702 1384455 1393628 1399962 1404397 1407064
58548A407064L42k216m322n944p455q772r519r847j0446j1706j3313j4669j5432
$$ 1407064 1407406 1405190 1400868 1394924 1387469 1378697 1369178 1359331 1348885 1337179 1323866 1309197 1293765
58535A293765j5696j5846j6112j6157j5372j3714j1816j0066q183o022m186l150
$$ 1293765 1278069 1262223 1246111 1229954 1214582 1200868 1189052 1178986 1170803 1164781 1160595 1157445
58523A157445k294o15J813L853M738M823M859N108N325N327N252N420N877O130
$$ 1157445 1155151 1154536 1156349 1160202 1164940 1169763 1174622 1179730 1185055 1190382 1195634 1201054 1206931 1213061
58509A213061N593M337L001J893P10o54j670k004k154k739l652m481n238o018
$$ 1213061 1218654 1222991 1225992 1227885 1228595 1227941 1226271 1224267 1222113 1219374 1215722 1211241 1206003 1199985
58495A199985o500o563o844p762q465p804o082m707m255l916k888j217Q03L063
$$ 1199985 1193485 1186922 1180078 1172316 1163851 1156047 1149965 1145258 1141003 1137087 1134199 1132982 1133785 1136848
58481A136848N193O656P617Q882J0702J2314J2924J2453J1100Q983O509M374K792
$$ 1136848 1142041 1148697 1156314 1165196 1175898 1188212 1201136 1213589 1224689 1233672 1240181 1244555 1247347
58468A247347J320l70k103l780n555p123p630o735n132l632k341j112m6R45K332
$$ 1247347 1248667 1248297 1246194 1242414 1236859 1229736 1222106 1215371 1210239 1206607 1204266 1203154 1203108 1204053 1206385
58453A206385M177N746O461O609O515N779M084K174J009L75o74k216l302l415
$$ 1206385 1210562 1216308 1222769 1229378 1235893 1241672 1245756 1247930 1248939 1249314 1248640 1246424 1243122 1239707
58439A239707l072k792k338j341r3Q59J509K277L273M180M828N597O990Q990J1025
$$ 1239707 1236635 1233843 1231505 1230164 1230071 1230930 1232439 1234716 1237989 1242169 1246997 1252594 1259584 1268574 1279599
58424A279599J2496J3115J2787J1573J0030R142R417J0050R594P472M492J809
$$ 1279599 1292095 1305210 1317997 1329570 1339600 1348742 1358159 1368209 1377803 1385275 1389767 1391576
58412A391576j12j438k404l161l900m776n783o781p520p653p060o168n602n480
$$ 1391576 1391464 1390026 1387622 1384461 1380561 1375785 1370002 1363221 1355701 1348048 1340988 1334820 1329218 1323738
58398A323738n354m838l958k843j586m69J48L33N86J153J721J891J630J125O16
$$ 1323738 1318384 1313546 1309588 1306745 1305159 1304690 1304838 1305171 1305757 1306910 1308631 1310522 1312152 1313277 1313893
58383A313893M13P05J247J674K072K781L698M385M833N425O092O363O402P050
$$ 1313893 1314306 1315011 1316258 1317932 1320004 1322785 1326483 1330868 1335701 1341126 1347218 1353581 1359983 1367033
58369A367033Q536J0016J0842J1403J2246J3156J3825J4585J5730J6697J6786
$$ 1367033 1375569 1385585 1396427 1407830 1420076 1433232 1447057 1461642 1477372 1494069 1510855
58358A510855J6261J5887J5738J5222J4027J2395J0576Q745P294O655O750O985
$$ 1510855 1527116 1543003 1558741 1573963 1587990 1600385 1610961 1619706 1627000 1633655 1640405 1647390
58346A647390O796O096N466N845P577R676J0650J0345J0178J1310J3324J5212
$$ 1647390 1654186 1660282 1665748 1671593 1679170 1688846 1699496 1709841 1720019 1731329 1744653 1759865
58334A759865J6708J8002J8922J9323J9651K0249K0618K0063J8640J6798J4719
$$ 1759865 1776573 1794575 1813497 1832820 1852471 1872720 1893338 1913401 1932041 1948839 1963558
58323A963558J2700J1540J1511J1570J0557Q823P698P825Q867J0334J1754J2498
$$ 1963558 1976258 1987798 1999309 2010879 2021436 2030259 2037957 2045782 2054649 2064983 2076737 2089235
58311B089235J2562J3038J4735J6805J7960J8522J9792K1754K3041K3178K3187
$$ 2089235 2101797 2114835 2129570 2146375 2164335 2182857 2202649 2224403 2247444 2270622 2293809
58300B293809K3837K4649K5093K5428K5910K6300K6632K7406K8641K9640L0080
$$ 2293809 2317646 2342295 2367388 2392816 2418726 2445026 2471658 2499064 2527705 2557345 2587425
58289B587425L0381L0694L0660L0502L1355L3781L6879L9451M1294M2771M3844
$$ 2587425 2617806 2648500 2679160 2709662 2741017 2774798 2811677 2851128 2892422 2935193 2979037
58278B979037M4278M4293M4418M4956M5926M7182M8391M9394N0675N2955N6121
$$ 2979037 3023315 3067608 3112026 3156982 3202908 3250090 3298481 3347875 3398550 3451505 3507626
58267C507626N9211O1673O3991O6802P0024P3178P6099P8885Q1536Q3902Q5885
$$ 3507626 3566837 3628510 3692501 3759303 3829327 3902505 3978604 4057489 4139025 4222927 4308812
58256D308812Q7570Q9326R1542R4033R6087R7520R9232J02115J06022J10508J15901
$$ 4308812 4396382 4485708 4577250 4671283 4767370 4864890 4964122 5066237 5172259 5282767 5398668
58245E398668J22553J29653J36167J42506J49882J58281J66632J74812J83844
$$ 5398668 5521221 5650874 5787041 5929547 6079429 6237710 6404342 6579154 6762998
58236F762998J94073K04782K15772K27758K41017K55245K70874K88789L08493
$$ 6762998 6957071 7161853 7377625 7605383 7846400 8101645 8372519 8661308 8969801
58227H969801L28429L48632L71161L97287M26143M56864M90209N27087N67285
$$ 8969801 9298230 9646862 10018023 10415310 10841453 11298317 11788526 12315613 12882898
58218A2882898O10822O59147P14104P77111Q49890R34224J030311J137384J256600
$$ 12882898 13493720 14152867 14866971 15644082 16493972 17428196 18458507 19595891 20852491
58209B0852491J391154J543188J713991J908724K137470K409372K729295L103445
$$ 20852491 22243645 23786833 25500824 27409548 29547018 31956390 34685685 37789130
58201C7789130L545518M074488M710508N477652O406211P523822Q843445J0363660
$$ 37789130 41334648 45409136 50119644 55597296 62003507 69527329 78370774 88734434
58193H8734434J2077240J3974500J6047424J8299945K0718030K3136886K5063890
$$ 88734434 100811674 114786174 130833598 149133543 169851573 192988459 218052349
58186B18052349K5681586K4206838K0439921J5026097R098632L541462j478708
$$ 218052349 243733935 267940773 288380694 303406791 312505423 316046885 314568177
58179C14568177o301591j1148736j5729186j9412384k1705591k2546824k2224943
$$ 314568177 308266586 297117850 281388664 261976280 240270689 217723865 195498922
58172A95498922k1125063j9559536j7745116j5836642j3947848j2159004j0523585
$$ 195498922 174373859 154814323 137069207 121232565 107284717 95125713 84602128
58165H4602128r071014p807105o720941n795709n013215m353022l794747l322594
$$ 84602128 75531114 67724009 61003068 55207359 50194144 45841122 42046375 38723781
58157C8723781k924810k589636k305296k063226j857799j683203j533377j404376
$$ 38723781 35798971 33209335 30904039 28840813 26983014 25299811 23766434 22362058
58149B2362058j293729j197728j111978j034158r63703q99227q38713p81910p29878
$$ 22362058 21068329 19870601 18758623 17724465 16760762 15861535 15022822 14240912 13511034
58140A3511034o82314o37742n96120n58790n25802m95553m67119m40840m16536
$$ 13511034 12828720 12190978 11594858 11036068 10510266 10014713 9547594 9106754 8690218
58131H690218l93337l71371l51440l32849l13790k94249k76332k61050k46845
$$ 8690218 8296881 7925510 7574070 7241221 6927431 6633182 6356850 6095800 5848955
58122E848955k32135k17448k03962j91604j79791j68778j59044j50246j41716
$$ 5848955 5616820 5399372 5195410 5003806 4824015 4655237 4496193 4345947 4204231
58113D204231j33381j25510j18201j11609j05936j00811r5392q9450q3665p8640
$$ 4204231 4070850 3945340 3827139 3715530 3609594 3508783 3413391 3323941 3240276 3161636
58103C161636p4382p0909o8348o6195o3525o0411n8122n7348n7109n6012n3863
$$ 3161636 3087254 3016345 2947997 2881802 2818277 2757866 2699744 2642396 2585287 2529275 2475412
58092B475412n1349m8823m6124m3161m0087l7092l4384l2149l0381k9021k8250
$$ 2475412 2424063 2375240 2329116 2285955 2245868 2208776 2174392 2142243 2111862 2082841 2054591
58081B054591k8096k7893k6827k5131k3894k3517k3165k2151k0996k0631k1073
$$ 2054591 2026495 1998602 1971775 1946644 1922750 1899233 1876068 1853917 1832921 1812290 1791217
58070A791217k1473k1111j9932j8385j7065j6288j5842j5332j4672j3943j2983
$$ 1791217 1769744 1748633 1728701 1710316 1693251 1676963 1661121 1645789 1631117 1617174 1604191
58059A604191j1672j0479j0009j0082j0014r737r822j0359j0701j0489j0038r543
$$ 1604191 1592519 1582040 1572031 1561949 1551935 1542198 1532376 1522017 1511316 1500827 1490789 1481246
58047A481246q848q190q157q593q482p464o489o367o625o527o346o649p074o845
$$ 1481246 1472398 1464208 1456051 1447458 1438976 1431512 1425023 1418656 1412031 1405504 1399158 1392509 1385435 1378590
58033A378590o163o031o838p869q264p858p073o498o549p229q084q593q470p693
$$ 1378590 1372427 1366396 1359558 1351689 1343425 1335567 1328494 1321996 1315447 1308218 1300134 1291541 1283071 1275378
58019A275378o505n446m920m652m071l320l141l622l851l228k380k090k040j424
$$ 1275378 1268873 1263427 1258507 1253855 1249784 1246464 1243323 1239701 1235850 1232622 1230242 1228152 1226112 1224688
58005A224688l45K80J9n76p15j11R81K088K908L505L978L956L048J804J460K264
$$ 1224688 1224343 1224623 1224642 1224066 1223351 1223240 1224221 1226309 1229217 1232722 1236700 1240656 1243704 1245508 1246968 1249232
57989A249232K939K382J162N90Q99J326J395J203P36l0n86l35M82J086J227J167
$$ 1249232 1252171 1254553 1255715 1256305 1257204 1258530 1259925 1261128 1261864 1261834 1261248 1260913 1261395 1262481 1263708 1264875
57973A264875Q31kp80n01Q71K211K681K611K667K935L168L289L263K996K666K660
$$ 1264875 1265706 1265704 1264924 1264423 1265294 1267505 1270186 1272797 1275464 1278399 1281567 1284856 1288119 1291115 1293781 1296441
57957A296441K976L106K722K026J300O11J05k2ol76j089j446j139o88m76r5Q13
$$ 1296441 1299417 1302523 1305245 1307271 1308571 1309182 1309287 1309265 1309259 1308883 1307794 1306348 1305209 1304521 1304045 1303950 1304763
57940A304763J738K113K359L334N018O616P743Q618R153Q847P882P430Q203R303
$$ 1304763 1306501 1308614 1310973 1314307 1319325 1325941 1333684 1342302 1351455 1360302 1368184 1375614 1383817 1393120
57926A393120R179P490N363L912L113K265R77o25k320l911n056n356m757l571
$$ 1393120 1402299 1409789 1415152 1419064 1422177 1424442 1425419 1424794 1422474 1418563 1413507 1408151 1403394 1399823
57912A399823k224j140q03j457k582l078k305q14K12J02q73j967k654k920l103
$$ 1399823 1397599 1396459 1395656 1394199 1391617 1388539 1386234 1385420 1385632 1385734 1384861 1382894 1380240 1377320 1374217
57897A374217l436l724l685l552l859m448m287k776p52M96R20J527K707L650L642
$$ 1374217 1370781 1367057 1363372 1359820 1355961 1351513 1347226 1344450 1343698 1344194 1345114 1346641 1349348 1352998 1356640
57882A356640L052K600K356K034J743J785J969J708P75n01j641k280k141j262
$$ 1356640 1359692 1362292 1364648 1366682 1368425 1370210 1372179 1373887 1374662 1374161 1372520 1370240 1368099 1366837
57868A366837k07L48L67M52J004J735K154K234K320K616L073L711M656N775O610
$$ 1366837 1366630 1366978 1367345 1367797 1368801 1370536 1372690 1374924 1377244 1379860 1382933 1386644 1391300 1397075 1403685
57853A403685O935P193Q021R358J0381J0453R868R381R207Q882Q047P027O392
$$ 1403685 1410620 1417813 1425834 1435192 1445573 1456026 1465894 1475275 1484482 1493364 1501411 1508438 1514830
57840A514830O214N990N269M166L189K618K297J994J845K139K760L194L183L024
$$ 1514830 1521044 1527034 1532303 1536469 1539658 1542276 1544573 1546567 1548412 1550551 1553311 1556505 1559688 1562712
57826A562712L041L071K837K575K815L585M231M162L532L053L299M207N107N208
$$ 1562712 1565753 1568824 1571661 1574236 1577051 1580636 1584867 1589029 1592561 1595614 1598913 1603120 1608227 1613435
57812A613435M255K736J384N50J15k06o76j446k296k704k468k084k090k124j305
$$ 1613435 1617690 1620426 1621810 1622360 1622475 1622269 1621593 1620147 1617851 1615147 1612679 1610595 1608505 1606381 1605076
57797A605076M80K262L138L202L093L150L354L686M115M477M729N129N788O264
$$ 1605076 1605556 1607818 1610956 1614158 1617251 1620401 1623755 1627441 1631556 1636033 1640762 1645891 1651679 1657943
57783A657943O037N292M807N064N760O287O423O407O572P036P696Q317Q594Q280
$$ 1657943 1663980 1669272 1674079 1679143 1684903 1691190 1697613 1704020 1710592 1717628 1725324 1733641 1742235 1750515
57769A750515P425O434N723N253M637L700K683J692M56j064k177k231j603j249
$$ 1750515 1757940 1764374 1770097 1775350 1779987 1783687 1786370 1788062 1788518 1787454 1785277 1783046 1781443 1780194
57755A780194j286q83L02J462J809J718K034K748L103K816K468K695L468M297
$$ 1780194 1778908 1778025 1778327 1779789 1781598 1783316 1785350 1788098 1791201 1794017 1796485 1799180 1802648 1806945
57741A806945M763M748M396M007L867M112M648N109N012M278L577L751M742N601
$$ 1806945 1811708 1816456 1820852 1824859 1828726 1832838 1837486 1842595 1847607 1851885 1855462 1859213 1863955 1869556
57727A869556N695N457N574O001O291O417O656O929O917O704O655O752O622O248
$$ 1869556 1875251 1880708 1886282 1892283 1898574 1904991 1911647 1918576 1925493 1932197 1938852 1945604 1952226 1958474
57713A958474N977N891N673N268N064N264N581N776N994O352O564O398O121O169
$$ 1958474 1964451 1970342 1976015 1981283 1986347 1991611 1997192 2002968 2008962 2015314 2021878 2028276 2034397 2040566
57699B040566O532O831O825O629O485O615P139P964Q696Q898Q422P473O375N361
$$ 2040566 2047098 2053929 2060754 2067383 2073868 2080483 2087622 2095586 2104282 2113180 2121602 2129075 2135450 2140811
57685B140811M629M450N085O445P969R070R757J0586J1959J3790J5981J8790K2374
$$ 2140811 2145440 2149890 2154975 2161420 2169389 2178459 2188216 2198802 2210761 2224551 2240532 2259322 2281696
57672B281696K6304K9978L3331L6754M0379M3783M6118M6132M2436L4623K4209
$$ 2281696 2308000 2337978 2371309 2408063 2448442 2492225 2538343 2584475 2626911 2661534 2685743
57661B685743J3766M856k774r992j6879k2660k6456k7832k7075k5068k2537j9397
$$ 2685743 2699509 2704365 2701591 2691599 2674720 2652060 2625604 2597772 2570697 2545629 2523092 2503695
57649B503695j5416j1336q440o830n200k777m71O41J065K069L806N396O425P152
$$ 2503695 2488279 2476943 2468503 2461673 2456473 2453696 2453225 2453866 2454931 2457000 2460806 2466202 2472627 2479779
57635B479779P470O926N898N515O141O901P057O979P248P705P915P961Q084Q051
$$ 2479779 2487249 2494175 2500073 2505588 2511729 2518630 2525687 2532666 2539914 2547619 2555534 2563495 2571579 2579630
57621B579630P474O553N939O066O900Q065Q962R130Q779Q638Q989R304R150Q887
$$ 2579630 2587104 2593657 2599596 2605662 2612562 2620627 2629589 2638719 2647498 2656136 2665125 2674429 2683579 2692466
57607B692466Q954R080Q886Q769R281R997R927Q984Q115P915Q042Q126Q390R022
$$ 2692466 2701420 2710500 2719386 2728155 2737436 2747433 2757360 2766344 2774459 2782374 2790416 2798542 2806932 2815954
57593B815954R663R924R803R333Q460P609P601Q517R285R073Q449Q492R194R649
$$ 2815954 2825617 2835541 2845344 2854677 2863137 2870746 2878347 2886864 2896149 2905222 2913671 2922163 2931357 2941006
57579B941006R454R062Q837Q619Q284Q091Q292Q893R738J0440J0432R690R175
$$ 2941006 2950460 2959522 2968359 2976978 2985262 2993353 3001645 3010538 3020276 3030716 3041148 3050838 3060013
57566C060013R792J1036J1528J0923J0288J0462J0986J1133J0987J0904J0753
$$ 3060013 3069805 3080841 3092369 3103292 3113580 3124042 3135028 3146161 3157148 3168052 3178805
57555C178805J0442J0474J1217J2124J2552J2833J3588J4402J4263J3214J2450
$$ 3178805 3189247 3199721 3210938 3223062 3235614 3248447 3262035 3276437 3290700 3303914 3316364
57544C316364J2667J3243J3384J3193J3211J3519J3822J3959J3883J3415J2498
$$ 3316364 3329031 3342274 3355658 3368851 3382062 3395581 3409403 3423362 3437245 3450660 3463158
57533C463158J1553J1190J1636J2519J3188J3193J2599J1946J1765J2075J2568
$$ 3463158 3474711 3485901 3497537 3510056 3523244 3536437 3549036 3560982 3572747 3584822 3597390
57522C597390J3092J3698J4249J4394J4104J3820J3927J4306J4555J4408J3944
$$ 3597390 3610482 3624180 3638429 3652823 3666927 3680747 3694674 3708980 3723535 3737943 3751887
57511C751887J3547J3719J4595J5615J5970J5507J4880J4734J5059J5525J5965
$$ 3751887 3765434 3779153 3793748 3809363 3825333 3840840 3855720 3870454 3885513 3901038 3917003
57500C917003J6331J6471J6268J5831J5319J4785J4326J4121J4169J4268J4381
$$ 3917003 3933334 3949805 3966073 3981904 3997223 4012008 4026334 4040455 4054624 4068892 4083273
57489D083273J4721J5260J5523J5199J4608J4241J4092J3847J3525J3474J3857
$$ 4083273 4097994 4113254 4128777 4143976 4158584 4172825 4186917 4200764 4214289 4227763 4241620
57478D241620J4514J5293J6134J6805J6950J6491J5814J5428J5513J5846J6073
$$ 4241620 4256134 4271427 4287561 4304366 4321316 4337807 4353621 4369049 4384562 4400408 4416481
57467D416481J6093J6163J6511J6937J7041J6837J6780J7028J7166J6922J6773
$$ 4416481 4432574 4448737 4465248 4482185 4499226 4516063 4532843 4549871 4567037 4583959 4600732
57456D600732J7283J8176J8593J8212J7620J7508J7873J8164J7943J7380J7144
$$ 4600732 4618015 4636191 4654784 4672996 4690616 4708124 4725997 4744161 4762104 4779484 4796628
57445D796628J7739J8782J9230J8567J7463J6898J6947J6987J6869J7130J7993
$$ 4796628 4814367 4833149 4852379 4870946 4888409 4905307 4922254 4939241 4956110 4973240 4991233
57434D991233J8884J9175J8875J8324J7696J7133J7025J7622J8676J9672K0307
$$ 4991233 5010117 5029292 5048167 5066491 5084187 5101320 5118345 5135967 5154643 5174315 5194622
57423E194622K0485K0162J9481J8876J8746J9000J9236J9214J9045J8950J9000
$$ 5194622 5215107 5235269 5254750 5273626 5292372 5311372 5330608 5349822 5368867 5387817 5406817
57412E406817J9057J8847J8273J7708J7774J8596J9518J9814J9579J9523J9998
$$ 5406817 5425874 5444721 5462994 5480702 5498476 5517072 5536590 5556404 5575983 5595506 5615504
57401E615504K0503K0347J9474J8536J8214J8640J9403K0007K0252K0244K0152
$$ 5615504 5636007 5656354 5675828 5694364 5712578 5731218 5750621 5770628 5790880 5811124 5831276
57390E831276K0051K0035K0265K0760K1270K1447K1251K1027K1147K1598K1945
$$ 5831276 5851327 5871362 5891627 5912387 5933657 5955104 5976355 5997382 6018529 6040127 6062072
57379F062072K1776K1152K0597K0524K0762K0757K0296J9789J9728K0043K0242
$$ 6062072 6083848 6105000 6125597 6146121 6166883 6187640 6207936 6227725 6247453 6267496 6287738
57368F287738K0105J9907J9915J9959J9693J9177J8846J8940J9182J9220J9162
$$ 6287738 6307843 6327750 6347665 6367624 6387317 6406494 6425340 6444280 6463462 6482682 6501844
57357F501844J9480K0361K1402K2060K2233K2155K1882K1155J9883J8497J7641
$$ 6501844 6521324 6541685 6563087 6585147 6607380 6629535 6651417 6672572 6692455 6710952 6728593
57346F728593J7540J7881J8266J8609J9000J9425J9731J9722J9155J7860J6189
$$ 6728593 6746133 6764014 6782280 6800889 6819889 6839314 6859045 6878767 6897922 6915782 6931971
57335F931971J5149J5557J6951J7889J7575J6710J6275J6159J5745J5394J6152
$$ 6931971 6947120 6962677 6979628 6997517 7015092 7031802 7048077 7064236 7079981 7095375 7111527
57324G111527J7876J8930J8281J6917J6368J6632J6551J5764J5062J4933J4881
$$ 7111527 7129403 7148333 7166614 7183531 7199899 7216531 7233082 7248846 7263908 7278841 7293722
57313G293722J4468J4084J4267J4926J5644J6208J6495J6248J5467J4644J4245
$$ 7293722 7308190 7322274 7336541 7351467 7367111 7383319 7399814 7416062 7431529 7446173 7460418
57302G460418J4193J4130J3909J3524J2924J2263J1998J2414J3180J3764J4044
$$ 7460418 7474611 7488741 7502650 7516174 7529098 7541361 7553359 7565773 7578953 7592717 7606761
57291G606761J4186J4180J3924J3621J3575J3742J3857J3933J4156J4324J4003
$$ 7606761 7620947 7635127 7649051 7662672 7676247 7689989 7703846 7717779 7731935 7746259 7760262
57280G760262J3252J2660J2465J2204J1545J0950J1048J1673J2067J1908J1616
$$ 7760262 7773514 7786174 7798639 7810843 7822388 7833338 7844386 7856059 7868126 7880034 7891650
57269G891650J1613J1797J1828J1596J1105J0261R026P681O654O103N856N765
$$ 7891650 7903263 7915060 7926888 7938484 7949589 7959850 7968876 7976557 7983211 7989314 7995170 8000935
57257H000935N866O158O434O467O303O225O359O453O127N343M512M022L866L863
$$ 8000935 8006801 8012959 8019393 8025860 8032163 8038388 8044747 8051200 8057327 8062670 8067182 8071204 8075070 8078933
57243H078933M154N041O342P307P468P160O900O644O170N825O130O700O497N248
$$ 8078933 8083087 8088128 8094470 8101777 8109245 8116405 8123305 8129949 8136119 8141944 8148074 8154774 8161271 8166519
57229H166519L834K850J735q0j833k308j592r67j126j468j358j164j593k582l432
$$ 8166519 8170353 8173203 8174938 8174858 8173025 8170717 8169125 8168158 8167032 8165564 8164206 8163042 8161449 8158867 8155435
57214H155435l706l614l621l932m323m444m361m709n978p735r016r558j0124j1390
$$ 8155435 8151729 8148115 8144494 8140562 8136239 8131795 8127434 8122725 8116747 8109012 8099996 8090438 8080314 8068924
57200H068924j2978j3892j3524j1860r100n605k019J034L438N403O957P995Q804
$$ 8068924 8055946 8042054 8028530 8016670 8007570 8001965 7999946 8000980 8004418 8009821 8016778 8024773 8033577
57187H033577R937J1409J2393J2131J0939R896R615R710R631R601J0304J1870
$$ 8033577 8043514 8054923 8067316 8079447 8090386 8100282 8109897 8119607 8129238 8138839 8149143 8161013
57175H161013J3589J4685J4977J4698J4033J3100J2014J0677Q692N825K325j469
$$ 8161013 8174602 8189287 8204264 8218962 8232995 8246095 8258109 8268786 8277478 8283303 8285628 8284159
57163H284159n676j0651j6375k2382k8083l2983l6727l9343m1245m2745m3803
$$ 8284159 8278483 8267832 8251457 8229075 8200992 8168009 8131282 8091939 8050694 8007949 7964146
57152G964146m4560m5672m7493m9265m9882m9321m8600m8409m8497m8433m8165
$$ 7964146 7919586 7873914 7826421 7777156 7727274 7677953 7629353 7580944 7532447 7484014 7435849
57141G435849m7733m7166m6745m6709m6609m5768m4481m3873m4292m4687m3987
$$ 7435849 7388116 7340950 7294205 7247496 7200887 7155119 7110638 7066765 7022473 6977786 6933799
57130F933799m2262m0070l7464l4331l0991k7787k4524k0978j7548j4804j2757
$$ 6933799 6891537 6851467 6814003 6779672 6748681 6720894 6696370 6675392 6657844 6643040 6630283
57119F630283j1135j0066r935j0730j1891j2525j1432p239J020J3450K9379M7593
$$ 6630283 6619148 6609082 6599147 6588417 6576526 6564001 6552569 6545330 6546350 6559800 6589179 6636772
57107F636772O6503Q4791J02220J19586J38104J59356J85575K18952K60639L11204
$$ 6636772 6703275 6788066 6890286 7009872 7147976 7307332 7492907 7711859 7972498 8283702
57097H283702L72004M45036N31559O31891P46005Q72352J006119J140647J271318
$$ 8283702 8655706 9100742 9632301 10264192 11010197 11882549 12888668 14029315 15300633
57088A5300633J397103J519249J640641J765327J896526K040694K224264K504766
$$ 15300633 16697736 18216985 19857626 21622953 23519479 25560173 27784437 30289203
57080C0289203K943692L544598M213072M786226N105271N061560M593791L681889
$$ 30289203 33232895 36777493 40990565 45776791 50882062 55943622 60537413 64219302
57072F4219302K373001Q07693q05470k262383l426389m243088m719346m897100
$$ 64219302 66592303 67399996 66594526 64332143 60905754 56662666 51943320 47046220
57064D7046220m834861m594887m235393l808059l356817k915142k504625k137055
$$ 47046220 42211359 37616472 33381079 29573020 26216203 23301061 20796436 18659381
57056A8659381j817071j543232j309758j110398r41117p99194o81261n83448n02466
$$ 18659381 16842310 15299078 13989320 12878922 11937805 11138611 10457350 9873902 9371436
57047I371436m35475l79564l32293k92347k58991k31249k08121j89036j73538
$$ 9371436 8935961 8556397 8224104 7931757 7672766 7441517 7233396 7044360 6870822
57038F870822j60804j49958j40587j32763j26767j22843j20871j20076j19454
$$ 6870822 6710018 6560060 6419473 6286710 6159943 6037100 5916229 5796153 5676699
57029E676699j18398j16589j13528j08772j02722r6809r3052r3621r9886j10794
$$ 5676699 5558301 5441712 5328184 5219412 5116690 5019881 4926829 4833208 4733322 4622528
57019D622528j22656j31930j38361j44293j50946j56770j59578j58862j55427
$$ 4622528 4499872 4367942 4229581 4085288 3934342 3777572 3617994 3459132 3303705
57010C303705j50018j43127j35305j26883j17953j09070j01123r4162q7202p9792
$$ 3303705 3153687 3010560 2875255 2748372 2630419 2521349 2420226 2326064 2238862 2159070
57000B159070p2801o6981o1714n6145n0758m6711m4097m1850l9139l5992l2754
$$ 2159070 2086269 2019288 1957574 1901429 1850671 1803960 1759863 1718013 1678874 1642882 1610128
56989A610128k9763k7320k5360k3293k0728j8106j6043j4491j3145j2255j2216
$$ 1610128 1580365 1553045 1527685 1504392 1483664 1465558 1449515 1435024 1421879 1409624 1397408
56978A397408j2690j2956j2869j2733j2465j1803j1140j1126j1375j0580q187
$$ 1397408 1384718 1371762 1358893 1346160 1333695 1321892 1310752 1299626 1288251 1277671 1269484
56967A269484n114k520n61J243L096M819O205P133P664Q232R272J0432J0554Q808
$$ 1269484 1264370 1261850 1261289 1262532 1265628 1270447 1276652 1283785 1291449 1299681 1308953 1319385 1329939 1338747
56953A338747N501J586k202n448p830r419j0886j2797j4707j5463j4441j2222
$$ 1338747 1344248 1345834 1343632 1338184 1330354 1320935 1310049 1297252 1282545 1267082 1252641 1240419
56941A240419r892p945n997l507n55K200M319O140Q283J0662J2381J2636J1419
$$ 1240419 1230527 1222582 1216585 1213078 1212523 1214723 1219042 1225182 1233465 1244127 1256508 1269144 1280563
56928A280563R108N850J746k639o542r871j3221j6838j9964k1642k1841k1419
$$ 1280563 1289671 1295521 1297267 1294628 1288086 1278215 1264994 1248156 1228192 1206550 1184709 1163290
56916A163290k0983k0285j8836j6710j4469j2542j0982r693q542p345o106n200
$$ 1163290 1142307 1122022 1103186 1086476 1072007 1059465 1048483 1038790 1030248 1022903 1016797 1011597
56904A011597m976n127m849l774k333j093j36O41J084J172J478K594M196N345
$$ 1011597 1006621 1001494 996645 992871 990538 989445 989309 989950 991034 992206 993684 996278 1000474 1005819
56890A005819N809O419P862R685J0893J1156J0832J0064Q524O116L357P84j668
$$ 1005819 1011628 1018047 1025909 1035594 1046487 1057643 1068475 1078539 1087063 1093179 1096536 1097320 1095652
56877A095652m257o632p939p829o937o042n039l136J8L869P657J1108J4207J6821
$$ 1095652 1091395 1084763 1076824 1068995 1062058 1056016 1050977 1047841 1047859 1051728 1059385 1070493 1084700 1101521
56863A101521J9098K1894K5966L0630L3770L3579L0005K4387J8066J1672N315
$$ 1101521 1120619 1142513 1168479 1199109 1232879 1266458 1296463 1320850 1338916 1350588 1355903
56852A355903j079p561j3767j8743k1563k2108k0922j8318j4129q444k001M433
$$ 1355903 1354824 1347263 1333496 1314753 1293190 1271082 1250160 1231842 1217713 1209269 1207268 1211701
56840A211701J0760J7184K3583K9688L5670M1871M7853N2114N2825M8764L9867
$$ 1211701 1222461 1239645 1263228 1292916 1328586 1370457 1418310 1470424 1523249 1572013 1611880
56829A611880K7532J4262K117q820j9785l0922m0306m5939m7890m7593m5591m1215
$$ 1611880 1639412 1653674 1655791 1646971 1627186 1596264 1555958 1510019 1462129 1414536 1368945 1327730
56817A327730l4311k6055j7763r859k419M241J0107J5902K2145K8088L2116L2981
$$ 1327730 1293419 1267364 1249601 1239742 1237323 1241564 1251671 1267573 1289718 1317806 1349922 1382903
56805A382903L0315K4367J5933O329l210j2117k0298k7524l3427l7763m0265m0504
$$ 1382903 1413218 1437585 1453518 1459847 1456637 1444520 1424222 1396698 1363271 1325508 1285243 1244739
56793A244739l8475l5042l1202k7054k2129j6644j1617p532l607J121O417J0965
$$ 1244739 1206264 1171222 1140020 1112966 1090837 1074193 1062576 1055044 1051437 1052558 1058975 1069940
56781A069940J3602J4126J2962J0436O521J290m567j0044j4719j8944k2894k5896
$$ 1069940 1083542 1097668 1110630 1121066 1127587 1128877 1124310 1114266 1099547 1080603 1057709 1031813
56769A031813k7264k7390k7226k6885k5649k3289k0536j7987j5498j2958j0859
$$ 1031813 1004549 977159 949933 923048 897399 874110 853574 835587 820089 807131 796272
56758G96272r562q701p833p105o770o617o425o414o642o572n881n130m868m666
$$ 796272 786710 778009 770176 763071 756301 749684 743259 736845 730203 723631 717750 712620 707752 703086
56744G03086l906l026k866l122k755j780j383k025k746k731k451k603k898k738
$$ 703086 699180 696154 693288 690166 687411 685631 684248 682223 679477 676746 674295 671692 668794 666056
56730F66056k342k332k610k464j641o43j04k77r83j691j875j632j597j995k172
$$ 666056 663714 661382 658772 656308 654667 654024 653920 653643 652660 650969 649094 647462 645865 643870 641698
56715F41698j581p23m33o23n33p6j3p22j563j760j328p66l62q4R1J41Q8q4m64
$$ 641698 640117 639394 638961 638338 637805 637729 637716 636994 635431 633671 632343 631577 631215 631131 631222 631363 631451 631367 630903
56696F30903r83j378j484j421j358j279j133j027j102j295j418j378j261j198
$$ 630903 629920 628542 627058 625637 624279 623000 621867 620840 619738 618443 617025 615647 614386 613188
56682F13188j288j546j930k348k696k864k791k563k319k038j525p66j21N0j48
$$ 613188 611900 610354 608424 606076 603380 600516 597725 595162 592843 590805 589280 588514 588393 588443 588295
56667E88295k83j25J81M07M15J49l27p41q79q18p00m54o4P2l89j028j020l31J19
$$ 588295 588012 587887 588068 588475 588890 589039 588712 587971 587092 586274 585574 585120 585056 585128 584739 583711 582691 582360 582479
56648E82479k07o42k62Q26J711J882J615J282R31N39K42J27P5m8k34l86l85j08
$$ 582479 582272 581630 581368 582194 583905 585787 587402 588684 589615 590154 590396 590523 590598 590550 590316 589930 589545 589437
56630E89437L72O79M27l14j044j381j400j351j268j058q54r99j565k102k119j770
$$ 589437 589809 590488 590915 590601 589557 588176 586776 585425 584157 583099 582245 581246 579681 577579 575460 573690
56614E73690j706k200k706k630k159j873j792j440q63p85j473k098j763p49k06
$$ 573690 571984 569784 567078 564448 562289 560416 558624 557184 556321 555536 554063 551965 550202 549453 549247
56599E49247p55j904k684k498j516n19k83p46j000m73J68j83j520k593k417j350
$$ 549247 548492 546588 543904 541406 539890 539371 539088 538342 537342 536869 537037 536854 535334 532741 530324 528974
56583E28974n00m62q99j117p55o2L99L38P0J15N69J077J327J322J183R96Q63R08
$$ 528974 528474 528012 527113 525996 525241 525179 525578 525916 525986 526101 526670 527747 529074 530396 531579 532575 533438 534346
56565E34346J203J835K952M457N833O580O804O915O901O362N296M302L830L715
$$ 534346 535549 537384 540336 544793 550626 557206 564010 570925 577826 584188 589484 593786 597616 601331
56551F01331L665L702L859L772L065J910Q55J96j55l89o07q88j289j735k049k124
$$ 601331 604996 608698 612557 616329 619394 621304 622159 622355 622200 621811 621204 620316 619027 617292 615243 613119
56535F13119k061k163k726l663m432m628m578m989n866o340n791m705m009l899
$$ 613119 611058 608895 606169 602506 598074 593446 588868 583879 578013 571673 565882 561177 557168 553269
56521E53269l832l552l447l882m597m972m615l549k109q38k83o11j438k159k467
$$ 553269 549437 545885 542438 538556 533959 528987 524372 520823 518714 517876 517593 516982 515544 513385 510918
56506E10918k438k290k187k266k572k841k595j687p08m79j116j867j990j508r02
$$ 510918 508480 506190 504003 501737 499165 496324 493729 492042 491334 490855 489739 487872 485882 484374 483472
56491D83472m21l1J36j63q21j312j262q39m69m18o54r77j107q82l91Q7K81P1m54
$$ 483472 483051 483020 483156 482993 482172 480860 479598 478759 478290 477872 477218 476241 475134 474252 473861 473948 474229 474300 473846
56472D73846r24r22n23l46p56j214r35k4N96L71k75o14l49L76J158J367N86p10
$$ 473846 472922 472000 471477 471131 470375 469161 468226 468202 468798 469169 468894 468280 467931 468307 469465 470832 471418 470708
56454D70708j392q80K24R72J034O37L4n51q64r01r52j048q02r4M93L47m38j367
$$ 470708 469316 468436 468660 469632 470666 471303 471337 470786 469922 469021 468069 467021 466219 466125 466618 466965 466527 465160
56436D65160k090k272j460K26J677J898J259Q67R54P34r7p30l91O03J350J349
$$ 465160 463070 460798 459338 459564 461241 463139 464398 465265 466219 466953 466856 466126 465735 466338 467688 469037
56420D69037P29j73j012j530j677j489q61K30J169R47o28k337k689j535j91J58
$$ 469037 469766 469593 468581 467051 465374 463885 463024 463254 464423 465370 464742 462405 459716 458181 457990 458148
56404D58148k58k61O99J808J900R10j21l87j84j72l54k75M3R9k15l62P6Q57J526
$$ 458148 457890 457629 458328 460136 462036 462946 462825 462438 462254 462082 461728 461453 461496 461595 461380 461018 461094 461951 463477
56385D63477J945K124J845R10m03j369j406n19P05J562J699J297P90M60L41L90
$$ 463477 465422 467546 469391 470301 469898 468529 467123 466604 467309 468871 470570 471867 472657 473117 473458 473848
56369D73848N59Q14J178J686K062J766O22o62j129p29l44n54q54m67M65R64N13
$$ 473848 474407 475221 476399 478085 480147 481913 482535 481873 480744 480015 479671 479117 478263 477796 478261 479225 479738
56352D79738k54k95N72J438J353L70n70o92l2Q75J567J783J492J068J108J656
$$ 479738 479484 479189 479761 481199 482552 482922 482352 481660 481628 482503 484070 485853 487345 488413 489521 491177
56336D91177J958J346K01n45n60k36K41J053J985K313J843J388J656K235K276
$$ 491177 493135 494481 494682 494137 493577 493341 493582 494635 496620 498933 500776 502164 503820 506055 508331
56321E08331J805J615J938K026J254Q2m69q6N25N47k5n00l41L01R10J204J305
$$ 508331 510136 511751 513689 515715 516969 517051 516582 516496 517021 517568 517543 517043 516702 517003 517913 519117 520422
56304E20422J439J677J961K287K732L272L592L295K420J647J618K119K299J894
$$ 520422 521861 523538 525499 527786 530518 533790 537382 540677 543097 544744 546362 548481 550780 552674
56290E52674J601K054K912L459L686M101M687M790M106L132K591K816L745N049
$$ 552674 554275 556329 559241 562700 566386 570487 575174 579964 584070 587202 589793 592609 596354 601403
56276F01403O132O511O387O469P124Q008Q619Q836Q856Q937R346J0181J1216J2153
$$ 601403 607535 614046 620433 626902 634026 642034 650653 659489 668345 677282 686628 696809 708025 720178
56262G20178J3052J4069J5032J5761J6773J8880K1951K4826K6726K8144L0027
$$ 720178 733230 747299 762331 778092 794865 813745 835696 860522 887248 915392 945419
56251I45419L2741L6168M0220M4663M8951N2718N6028N8834O0701O1522O1886
$$ 945419 978160 1014328 1054548 1099211 1148162 1200880 1256908 1315742 1376443 1437965 1499851
56240A499851O2095O1440N9162N5615N1578M6834M0425L2220K3184J4112N005
$$ 1499851 1561946 1623386 1682548 1738163 1789741 1836575 1877000 1909220 1932404 1946516 1951521
56229A951521m130j2790k0647k7934l4787m0759m5435m8925n1413n2647n2446
$$ 1951521 1947391 1934601 1913954 1886020 1851233 1810474 1765039 1716114 1664701 1612054 1559608
56218A559608n1376n0331m9539m8402m6317m3331m0073l7244l5116l3349l1411
$$ 1559608 1508232 1457901 1408362 1359960 1313643 1270312 1230239 1192995 1157879 1124530 1093119
56207A093119k9238k7325k5921k4505k2362j9584j6984j5051j3395j1447r305
$$ 1093119 1063881 1036556 1010635 986130 963768 944184 927200 912149 898754 887307 878002
56196H78002p650o967p070p270o910n799m391l427l248l515l699l663l507l079
$$ 878002 870352 863385 856315 849045 842135 836336 831945 828518 825270 821755 818056 814393 810886 807807
56182H07807k091p01N15J320J991K567K490J549O61R31K082K712K213J605K087
$$ 807807 805716 805015 805530 806850 808841 811408 813898 815447 816108 817039 819121 821833 824046 825651 827738
56167H27738L502M821N685O585P682Q297P910P088O934P828R110J0008J0473J1013
$$ 827738 831240 836061 841746 848331 856013 864310 872220 879308 886242 894070 903180 913188 923661 934674
56153I34674J2019J3483J5223J6974J8346J9084J9519K0501K2616K5701K9330
$$ 934674 946693 960176 975399 992373 1010719 1029803 1049322 1069823 1092439 1118140 1147470
56142A147470L3502L8507M4230N0054N5555O0975O6886P3495Q0293Q6241R0307
$$ 1147470 1180972 1219479 1263709 1313763 1369318 1430293 1497179 1570674 1650967 1737208 1827515
56131A827515R2014R1510Q9184Q5410Q0731P5861P1120O6061O0011N2771M4516
$$ 1827515 1919529 2011039 2100223 2185633 2266364 2342225 2413345 2479406 2539417 2592188 2636704
56120B636704L5333K5497J6005P994J469m854j2184k0603k9482l8311m6780n4438
$$ 2636704 2672037 2697534 2713539 2721533 2723002 2718148 2705964 2685361 2655879 2617568 2570788 2516350
56108B516350o0834o5888o9847p2960p5237p6380p5829p3103o8265o1999n5210
$$ 2516350 2455516 2389628 2319781 2246821 2171584 2095204 2019375 1946272 1878007 1816008 1760798
56097A760798m8654m2701l7119l1292k5097j9392j5188j2390r978p407n102l431
$$ 1760798 1712144 1669443 1632324 1601032 1575935 1556543 1541355 1528965 1518987 1511580 1506478 1503047
56085A503047k031m97R40J875K460L126M008N071O418Q037R515J0502J1234J2160
$$ 1503047 1501016 1500519 1501459 1503334 1505794 1508920 1512928 1517999 1524417 1532454 1541969 1552471 1563705 1575865
56071A575865J3247J4034J4317J4448J4915J5839J6898J7665J8054J8419J9121
$$ 1575865 1589112 1603146 1617463 1631911 1646826 1662665 1679563 1697228 1715282 1733701 1752822
56060A752822K0108K1183K2373K3735K4859K5205K4881K4559K4533K4433K4004
$$ 1752822 1772930 1794113 1816486 1840221 1865080 1890285 1915166 1939725 1964258 1988691 2012695
56049B012695K3601K3691K4323K5346K6644K8027K9234L0313L1578L3108L4604
$$ 2012695 2036296 2059987 2084310 2109656 2136300 2164327 2193561 2223874 2255452 2288560 2323164
56038B323164L5798L6598L6923L6862L6954L7658L8642L9291L9877M1332M3923
$$ 2323164 2358962 2395560 2432483 2469345 2506299 2543957 2582599 2621890 2661767 2703099 2747022
56027B747022M6963M9941N2962N5972N8578O0907O3582O6593O9132P0895P2537
$$ 2747022 2793985 2843926 2896888 2952860 3011438 3072345 3135927 3202520 3271652 3342547 3415084
56016C415084P4558P6823P9468Q3085Q7566R1973R6061J00663J06013J11080J15358
$$ 3415084 3489642 3566465 3645933 3729018 3816584 3908557 4004618 4105281 4211294 4322374 4437732
56005D437732J19943J25819J32302J38244J43774J49825J56836J64829J73812
$$ 4437732 4557675 4683494 4815796 4954040 5097814 5247639 5404475 5569304 5743116
55996E743116J83289J92402K01314K11270K22740K34861K47454K61755K78182
$$ 5743116 5926405 6118807 6320121 6531391 6754131 6988992 7236446 7498201 7776383
55987G776383K95294L12417L31410L54150L80078M07953M38249M71912N08514
$$ 7776383 8071677 8384094 8715504 9069654 9449732 9857685 10295934 10767846 11276360
55978A1276360N47951N92211O43251P00831P64950Q38356R23770J020492J127039
$$ 11276360 11824311 12416522 13059773 13760604 14525554 15363910 16287680 17308172 18435211
55969A8435211J245361J379095J529962J700588J899263K136895K420405K754904
$$ 18435211 19680572 21059667 22589629 24290217 26189480 28326375 30746780 33501684
55961C3501684L151889L629578M206022M899113N733108O735159P920721R287687
$$ 33501684 36653573 40283151 44489173 49388286 55121394 61856553 69777274 79064961
55953G9064961J0825541J2522388J4366371J6356908J8499523K0707905K2615654
$$ 79064961 89890502 102412890 116779261 133136169 151635692 172343597 194959251
55946A94959251K3489973K2482837J9170835J3957934P914854K119242k939928
$$ 194959251 218449224 240932061 260102896 274060830 281975684 284094926 281154998
55939B81154998p388848j1495460j5224685j8220832k0117818k0800988k0417641
$$ 281154998 273766150 262270690 247046005 228825173 208707355 187906367 167488726
55932A67488726j9239318j7552745j5620268j3656475j1803718j0133356q672531
$$ 167488726 148249408 130696663 115076395 101419920 89616202 79482846 70810315
55925G0810315p424806o374453n492574m750859m127954l604612l161550k784479
$$ 70810315 63385509 57011056 51518482 46767623 42639669 39035057 35873507 33089028
55917C3089028k465186k195515j965153j766460j596310j451329j325708j215266
$$ 33089028 30623842 28428327 26463174 24696714 23100404 21649075 20323367 19108101
55909A9108101j119286j036397r62461q94422q32777p78185p28672o82087o38536
$$ 19108101 17988815 16952418 15989957 15095535 14262758 13484573 12755901 12073814 11435278
55900A1435278n98556n61371n26606m95274m67365m40742m14012l88434l65395
$$ 11435278 10836722 10275351 9748745 9253471 8786106 8345364 7931352 7542918 7177523
55891G177523l44083l23201l03043k84298k66593k49692k34406k20860k07543
$$ 7177523 6833440 6510239 6207196 5922898 5656305 5406613 5172207 4951347 4743804
55882D743804j93562j80294j69348j60400j52346j45089j38737j32578j26272
$$ 4743804 4550242 4369948 4200600 4040200 3887854 3742765 3604028 3471450 3345178
55873C345178j20815j16858j13334j09027j04178r9331r3953q7760q2013p7918
$$ 3345178 3224363 3107505 2994171 2885144 2780966 2681635 2587682 2499922 2417909 2339991
55863B339991p4758p1133o7051o3334n9935n6427n3281n1173m9691m8010m6163
$$ 2339991 2265233 2194100 2127049 2063715 2003780 1947353 1894072 1842899 1793208 1745198 1699035
55852A699035m4390m2106l8913l5829l4096l3401l2621l1636l1005l0495k9408
$$ 1699035 1654645 1612539 1573626 1537797 1503701 1470300 1437679 1406043 1375038 1344543 1315135
55841A315135k8021k7189k6867k6270k5250k4303k3433k2233k0891j9994j9451
$$ 1315135 1287114 1259925 1233058 1206788 1181538 1157235 1133802 1111569 1090678 1070684 1051233
55830A051233j8596j7269j5870j4531j3090j1773j1054j0995j1347j2059j3069
$$ 1051233 1032637 1015368 999498 984967 971877 960104 949050 938055 926708 914649 901580
55819I01580j3926j4286j4312j4111j3318j1913j0702j0210r778q674p356o587
$$ 901580 887654 873368 859056 844945 831627 819714 809012 798802 789024 780350 772994 766407
55807G66407o007m765l083j938j549j253o25L14J604L051L768L126J708L98r95
$$ 766407 760400 755635 752552 750614 749065 747812 747187 747501 749105 752156 755924 759050 760758 761156 760161
55792G60161l006n063o162o628p629r109r833r419q861q841r062r432j0373j1530
$$ 760161 757155 752092 745930 739302 731673 722564 712731 703312 694451 685610 676548 667116 656743 645213
55778F45213j1627j0281q768q328q671q842q489p639o153m210k673k161k270k283
$$ 645213 633586 623305 614537 606209 597538 588696 580207 572568 566415 562205 559532 557371 555101 552818
55764E52818k187k422l149m276n777p417q518q620q083p578p216o662n954n593
$$ 552818 550631 548209 545060 540784 535007 527590 519072 510452 502369 494791 487575 480913 474959 469366
55750D69366n826o234o217n729n302n344n641n705n537n535n696n462m692m109
$$ 469366 463540 457306 451089 445360 440058 434714 429073 423368 417831 412296 406600 401138 396446 392337
55736C92337m227m401l737k532j829j849j839j491j468k244l333m028m253m236
$$ 392337 388110 383709 379972 377440 375611 373762 371923 370432 368964 366720 363387 359359 355106 350870
55722C50870l998l562l254l276l367l159k624j935j187m93j10j40l11k34J92P89
$$ 350870 346872 343310 340056 336780 333413 330254 327630 325695 324508 324015 323905 323765 323454 323220 323412 324201
55706C24201J267J432J235P44l9j164k409l208l201k754k558k877l426l831l934
$$ 324201 325468 326900 328135 328879 328840 327676 325267 322059 318858 316104 313546 310669 307243 303412 299478
55691B99478l740l379k968k351j289o5N02J36l20J09J332K510L141L184K557J350
$$ 299478 295738 292359 289391 287040 285751 285686 286188 286324 286004 286113 287445 289955 293096 296280 298837 300187
55675C00187K02l11m94r54j561j766j660j778k057j983j643j544j553j018K5Q66
$$ 300187 300389 300078 299584 298630 297069 295303 293643 291865 289808 287825 286182 284638 283085 282067 282092 282958
55659B82958J322J792K121J720R16Q18J533J864J291Q86J547K552K770K174J313
$$ 282958 284280 286072 288193 289913 290829 291647 293180 295044 296335 297221 298768 301320 304090 306264 307577
55644C07577J88j283k521l039l332m043m851n092m941n055n432n579n436n274
$$ 307577 307765 306482 303961 300922 297590 293547 288696 283604 278663 273608 268176 262597 257161 251887
55630B51887m997m358l582k988k335j340n12n87j323j742j406o76J27R22J321
$$ 251887 246890 242532 238950 235962 233627 232287 231775 231188 229865 228123 226717 226041 226168 227090 228411
55615B28411P81n38j791k454k687k673k332j801j548j719j912j813j618j565j476
$$ 228411 229192 228654 226863 224409 221722 219049 216717 214916 213368 211649 209737 207924 206306 204741 203265
55600B03265j123o90n70q44j113r69n29m41j167k229k537j653l41L76M18M48Q58
$$ 203265 202142 201452 200882 200038 198925 197956 197427 196986 195819 193590 191053 189400 189059 189435 189853 190301 191159
55583A91159J464J923J953J337K74l96K4J159K002K249K560L434M543N373N897
$$ 191159 192623 194546 196499 197836 198110 197714 197738 198897 200899 203148 205708 209142 213685 219058 224955
55568B24955O286O422O126N514M750L741K381R64j26r55j933l151m171m614m711
$$ 224955 231241 237663 243789 249303 254053 257794 260175 261139 261013 260058 258125 254974 250803 246189 241478
55553B41478m979n468n626n086m260l857l943l926l466k893k570k332j905j408
$$ 241478 236499 231031 225405 220319 216059 212202 208259 204333 200867 197974 195404 193072 191167 189759
55539A89759j054p39m12m53j112j803j631n82M43P92O79N60M82K69j75q60j686
$$ 189759 188705 187966 187554 187101 185989 184186 182555 181973 182416 183208 183887 184447 184929 185198 185023 184163 182477
55522A82477k257k210j803j653j717j248j38M09o71k617l491k564j141q12j594
$$ 182477 180220 178010 176207 174554 172837 171589 171451 171860 171189 168572 165081 162517 161376 160564 158970
55507A58970k319k335k038j874j544o27N52J136P82O4k50m6J70o6o74j174j108
$$ 158970 156651 154316 152278 150404 148860 148233 148785 149921 150703 150767 150517 150471 150641 150575 149901 148727 147619
55490A47619m85J81L11j27n59m41R3L86oq26j351j079j97O13Q48O35M57M57K88
$$ 147619 147134 147315 147626 147499 146940 146499 146592 146978 146972 146146 144795 143716 143519 144132 144980 145615 146072 146529 146817
55471A46817k67q85j089q53n35l19n8L06M94K76j02r3N11J247J416Q77K16O7L81
$$ 146817 146550 145665 144576 143723 143188 142869 142811 143117 143611 143887 143785 143692 144203 145450 146866 147743 147959 148026 148407
55452A48407N54K08m25q81r59p39m23k66m02n91l23N21J317J324N30l54p11o00
$$ 148407 148961 149169 148744 147863 146904 146165 145742 145476 145074 144483 144160 144681 145998 147322 147852 147498 146787 146187
55434A46187m58m81m31m9M77O16J75l36k73L14P91Q38P75Q76R04P09P48J453K345
$$ 146187 145729 145248 144817 144768 145245 145861 146036 145700 145427 145741 146532 147370 148145 149021 149925 150634 151382 152835 155180
55415A55180K491J807J239J455J961J823Q75k03q54j127j242j152q12o21j087
$$ 155180 157671 159478 160717 162172 164133 165956 166831 166628 165774 164647 163405 162253 161441 160820 159733
55400A59733k091k888k988k694k512k396j942j090k01M49P72O81K80J24O27J216
$$ 159733 157642 154754 151766 149072 146560 144164 142222 141132 140931 141380 142152 142833 143113 143237 143864 145080
55384A45080Q52m67j481j284m31J0j75m56n10m46m47o84j256j754j381q1R98Q52
$$ 145080 145932 145465 143984 142700 142269 142279 142104 141648 141138 140692 140245 139561 138305 136551 135170 135089 136087 136939
55366A36939J7k04M61J099J050N31j07q11j402j500j104o44k96J09M55L37j88
$$ 136939 136956 136752 137213 138312 139362 139893 139786 138975 137573 136073 134969 134325 134029 134138 134593 134930 134742
55349A34742n07l56j71k43k12K20O74O33J54l82q30j159j187q20l61j62j92k62
$$ 134742 134235 133879 133708 133465 133253 133473 134147 134780 134934 134552 133722 132563 131376 130556 130195 130033 129841 129579
55331A29579l96o39p43l90K82P70P51L75L9LK00L18J69q8j84j56j87j69J43N19
$$ 129579 129183 128544 127801 127411 127693 128463 129214 129589 129628 129631 129831 130149 130318 130230 130046 129890 129703 129534 129677 130196
55311A30196L54l99q80l52P60J353R55J13m61o53o96n63Q1J195J995J576L9j387
$$ 130196 130550 130151 129271 128919 129679 131032 131987 132100 131639 130986 130290 129727 129808 131003 132998 134574 134613 133226
55293A33226j622q87k17p6k7K85N54M51J84J00J58J46Q8P5K2j23j59N2L23M32
$$ 133226 131604 130717 130500 130424 130397 130682 131236 131687 131871 131971 132129 132275 132363 132438 132460 132337 132178 132230 132553 132985
55273A32985L87J95k60p69o71L26J454J607O66m23q24o22m05m80o68o30k75J28
$$ 132985 133372 133567 133307 132538 131867 132193 133647 135254 135920 135497 134673 134051 133646 133166 132498 131868 131593 131721
55255A31721K32M5q9n1j46m96o52k60J99k4p50r14J6J288J806J369O14N5l43p39
$$ 131721 131953 131998 131909 131858 131712 131216 130564 130304 130503 130479 129729 128815 128831 130119 131925 133294 133908 133963 133620 132881
55235A32881j008q57k20N97J112J062N65m2n47r04j031q15l79j06k08l76j53M51
$$ 132881 131873 131016 130796 131393 132505 133567 134132 134090 133543 132639 131608 130793 130414 130308 130100 129724 129571 130022
55217A30022R11Q84N95M04K22k62r06j128p40k86k29j73N81J818K383J505k75
$$ 130022 130933 131817 132412 132816 133038 132776 131870 130742 130002 129716 129487 129314 129895 131713 134096 135601 135326
55200A35326j722k068j332M5J431K028J336k47j593j870j247n33k36j74R7O94
$$ 135326 133604 131536 130204 130249 131680 133708 135044 134797 133204 131334 130087 129554 129318 129144 129241 129935
55184A29935J279J432J004K08n52r22q37n44k99m7M10R33J028M86j92l85j42N
$$ 129935 131214 132646 133650 133858 133306 132384 131547 131003 130704 130657 131067 132000 133028 133514 133322 132937 132795 132800
55166A32800j52k92j56R5K77N07R37J411J600J321O30j97p43p07k28L05O95R84
$$ 132800 132648 132356 132200 132295 132572 133079 134016 135427 137027 138348 138978 138781 138038 137331 137103 137408 138103 139087
55148A39087J107Q63L03k98q69j519k044j931j134k51K89P17J185J223N45j02
$$ 139087 140194 141057 141360 141062 140193 138674 136630 134699 133565 133314 133603 134320 135505 136728 137273 137171
55132A37171K47J333J848J082l23j412j957k224k220j746q74RN93Q15O89K24m48
$$ 137171 137418 138751 140599 141681 141358 139946 137989 135765 133545 131799 130925 130934 131527 132342 133031 133255 132807
55115A32807r93j047m97L57J002J139Q73N62M43N31O62O67N11L44K60O5m88j188
$$ 132807 131814 130767 130270 130627 131629 132768 133641 134203 134646 135177 135839 136506 137017 137361 137621 137686 137198 136010
55097A36010j376p49J94P11O68M98N07O30P96J069J333J228N98j52m72k90p7k52
$$ 136010 134634 133885 134079 134790 135458 135956 136463 137093 137889 138958 140291 141519 142117 141965 141493 141203 141126 140874
55079A40874o80q62n78j75j15l90n81m54k52k85m43k59N70J777K613K432J327
$$ 140874 140194 139332 138754 138579 138464 138074 137493 137039 136787 136502 136059 135800 136370 138147 140760 143192 144519
55062A44519J09n13o35p72j010j019q01q08j125j134l77O78J136O93j39o11l31
$$ 144519 144628 144115 143480 142708 141698 140679 139878 139070 137945 136811 136434 137112 138248 138941 138802 138191 137860
55045A37860M19P82J14j097j566p27N22J017O86K35Jj79k66J0N57R41R34O31J21
$$ 137860 138279 139061 139175 138078 136512 135785 136307 137324 138010 138245 138246 138067 137801 137811 138368 139309 140243 140874 140995
55026A40995m53p32n51k76k32r0M76R06M29o02j027n32O4L00O49J265J293K45
$$ 140995 140542 139810 139259 138983 138751 138661 139137 140043 140472 139870 138843 138311 138375 138675 139324 140589 141882 142127
55008A42127q89q64P0O27L46k4J48N68P29O61O11N00J64j77q7N11J247J759J990
$$ 142127 141238 140374 140444 141071 141417 141393 141541 142109 142838 143499 144110 144610 144774 144597 144510 145021 146268 148027 150017
54989A50017J907J325K36q18j186q72n59o96r85r15m15L03J104J759J817J163
$$ 150017 151924 153249 153485 152667 151481 150609 150050 149354 148369 147454 147039 147342 148446 150205 152022 153185
54973A53185M03J47K53K86L38O91R28L94o25j094p09j89j8J60N60P26M63L75Q35
$$ 153185 153588 153735 153988 154274 154612 155303 156231 156625 156000 154906 154197 154008 153990 154150 154710 155436 155899 156274 157109
54954A57109J186P40p9k87K99J056J435J261N18m64q77k66O75Q18K4p48p01m9
$$ 157109 158295 159035 158956 158669 158968 160024 161459 162720 163238 162774 161897 161631 162306 163124 163148 162400 161699 161650
54936A61650M02J28p12j394j230l00N87Q78Q92J134J503J687J987K928M233M986
$$ 161650 162052 162180 161468 160074 158844 158544 159131 160009 160901 162035 163538 165225 167212 170140 174373 179359
54920A79359M853M452M386M516M344L620K367Q00o29j439j627j649j835k091k257
$$ 179359 184212 188664 193050 197566 201910 205530 207897 208697 208068 206629 205002 203353 201518 199427 197170
54905A97170k411k664k970l189l193k938k578k414k452k231j496q14r17j521j540
$$ 197170 194759 192095 189125 185936 182743 179805 177227 174813 172361 170130 168634 167820 166903 165382 163842
54890A63842n48O61J201J170J186J471J839K202K533K657K544K582L113L838M156
$$ 163842 163294 163955 165156 166326 167512 168983 170822 173024 175557 178214 180758 183340 186453 190291 194447
54875A94447L934L528L150K673K103J743J721J689J212K47r33k054k962l566l919
$$ 194447 198381 201909 205059 207732 209835 211578 213299 214988 216200 216447 215514 213460 210498 206932 203013
54860B03013m217m542m611m044k925j892j539j856k399k772k807k367j397k37
$$ 203013 198796 194254 189643 185599 182674 180782 179243 177387 174988 172216 169409 167042 165645 165408
54846A65408M52K72n30j376j888j999j765j353j004q03o03l51k64m40n85m72m30
$$ 165408 165860 166132 165602 164226 162338 160339 158574 157221 156217 155414 154811 154460 154196 153756 153171 152699 152269
54829A52269q37j296r43L08J459J641J082O00N39O90Q93J201J477J377P87Ln80
$$ 152269 151432 150136 149193 149501 150960 152601 153683 154283 154822 155512 156405 157606 159083 160460 161247 161250 160670
54812A60670p75n72r3L40L37j75q18j160j159j092j096r49l74N32J338J704J661
$$ 160670 159895 159323 159230 159570 159907 159732 158914 157754 156595 155503 154407 153458 153084 153616 154954 156658 158319
54795A58319J447J220J049R98J010P96P4r48j608j410n48L64R19J106J011O35
$$ 158319 159766 160986 162035 163033 164043 164839 164913 163965 162357 160947 160399 160763 161682 162788 163799 164434
54779A64434J46l0M09J197J770J968K187K728L251L230K799K703L385M519N537
$$ 164434 164580 164550 164959 166156 167926 169894 172081 174809 178060 181290 184089 186792 190177 194696 200233
54764B00233O243O598O312N140L508K301J858J580P15o89j958k741l359m107m590
$$ 200233 206476 213074 219386 224526 228034 230335 232193 233773 234488 233799 231841 229100 225741 221634 217044
54749B17044m214l275k945l868n210n623m900l996l456k781j553l68J5j51o8L92
$$ 217044 212830 209555 206610 202742 197532 191909 187009 183013 179557 176776 175223 174855 174870 174719 174651 175043
54733A75043P21P84R23J138J081Q91J156J856K255K188K530L761M872M585L195
$$ 175043 175764 176548 177471 178609 179690 180581 181737 183593 185848 188036 190566 194327 199199 203784 206979
54718B06979K226K429L019K936K011O66p70k031k752k916l092l759m553m718m179
$$ 206979 209205 211634 214653 217589 219600 220266 219496 217465 214713 211797 208705 204946 200393 195675 191496
54703A91496l581l295k922k053r89k93k4P7q6p68j627j847j269o95p96j256j388
$$ 191496 187915 184620 181698 179645 178656 178363 178339 178416 178330 177562 175935 174088 172819 172124 171328 170072 168684
54686A68684j132q80p47n82m19l36r2M74Q78N04m00r42p67l75k22k13j98k77l88
$$ 168684 167552 166672 165925 165343 164924 164588 164496 164970 165848 166352 165952 165010 164243 163868 163646 163433 163235 162958 162570
54667A62570k41J14K89L30P86J653K065J468M92j8j02k15k53R1L66j96j390k090
$$ 162570 162329 162443 162732 163062 163848 165501 167566 169034 169526 169508 169406 169191 168938 169029 169395 169199 167809 165719
54649A65719j678p46j75j27j60M8L76M68J54k97m28k48k99q24j219p58M07J427
$$ 165719 164041 163295 163120 162993 162833 162881 163257 163725 163879 163582 163154 162906 162607 161783 160564 159806 160213 161640
54631A61640J724J241R8j329k146j707n88rk20k56M63J233J198O08K38K05L8l44
$$ 161640 163364 164605 164703 163374 161228 159521 158933 158924 158704 158448 158911 160144 161342 161950 162188 162393 162431 162087
54613A62087n23l11NJ73K47L08K97K27K77N47R14J157J130Q13L40m4j82j97l70
$$ 162087 161564 161253 161258 161431 161678 161986 162283 162510 162787 163334 164248 165405 166535 167348 167688 167644 167462 167265 166895
54594A66895p68j112j046n49L2L97O30R63J307J268P47J42k51o50j281j753j544
$$ 166895 166127 165015 163969 163420 163452 163849 164479 165442 166749 168017 168764 168906 168655 168005 166724 164971 163427
54577A63427q50l41j63J31O43Q57N23J47J93M08L34M7p8R2N01J095J561J380O00
$$ 163427 162577 162236 162073 162204 162847 163704 164227 164374 164567 164975 165309 165356 165278 165370 165871 166966 168527 169907 170507
54558A70507O2L05O38J53p93j001k31M18R3p42j151r24m96j28K68P55J211J443
$$ 170507 170569 170874 171512 171665 170872 169871 169640 170058 170151 169409 168258 167334 166838 166710 166978 167733 168944 170387
54540A70387J316Q74M82N25R43J289J349J375J498J399P88n3n73o22m75l51j62
$$ 170387 171703 172577 173059 173584 174527 175816 177165 178540 180038 181437 182225 182172 181599 180977 180502 180151 179989
54523A79989K37P00Q23L18n40j001o08J40L51o1k49L06J042J146O77K10j64o97
$$ 179989 180226 180926 181749 182067 181527 180526 179918 180058 180409 180348 180099 180405 181447 182593 183270 183480 183316 182619
54505A82619j112p60K37Q01K70p25j132q13m15l18k85j23p1m10r77j329j174n39
$$ 182619 181507 180747 180984 181785 182055 181330 180198 179385 178970 178652 178367 178244 178173 177763 176786 175457 174283 173744
54487A73744L05J036J462J577J470J218R12P45Q05R02P44L38mj08r3n5J23M45
$$ 173744 174049 175085 176547 178124 179594 180812 181724 182469 183274 184176 184920 185258 185254 185146 185053 184998 185121 185566
54469A85566N86L11q7j29J62L21J77J08M17Q15Q18L78j11l27k77j90k94o62j092
$$ 185566 186152 186463 186376 186247 186409 186730 186907 187015 187432 188247 189065 189443 189332 189005 188728 188538 188244 187582 186490
54450A86490j236r87o18l83k26lJ78J93K28N28R07R19M65q4m30n85n81l61p1r2
$$ 186490 185254 184267 183649 183266 183040 183037 183215 183408 183636 184164 185071 185990 186455 186371 185941 185356 184775 184414 184343 184251
54430A84251n11r01q33l69Q3K34L9l42n28j42P46J578J870J599R23l9r07r80l5
$$ 184251 183740 182839 182006 181637 181720 181954 181993 181651 181123 180981 181727 183305 185175 186774 187697 187658 186751 185771 185736
54411A85736J099J310M58n70r83p78l48J04N33Q52R79R31Q07P45Q65J030Q10j
$$ 185736 186835 188145 188603 188033 187050 186272 185924 186028 186561 187413 188392 189323 190130 190875 191740 192770 193580 193579
54393A93579r47j295q87k12L46Q17J231J306Q96K88j37l14l14l5N54J151J347
$$ 193579 192632 191337 190450 190238 190584 191401 192632 193938 194834 195122 194985 194671 194357 194322 194876 196027 197374
54376A97374J077O29K42n0k92m34l47N5N88P77L08m15n65J71J093J259N00n20
$$ 197374 198451 199080 199322 199272 198980 198546 198199 198254 198842 199619 199927 199512 198947 199118 200211 201470 201970 201450
54358B01450j109j128q41m47J20R63J811J998J091m21j444j385p50m42p14j056
$$ 201450 200341 199213 198372 197925 198045 199008 200819 202817 203908 203487 202043 200658 199908 199466 198752 197696
54342A97696q91j92N68Q54N48N8j58j36k68o34q44o61l11KM40J071J542J581J416
$$ 197696 196805 196613 197181 198035 198583 198641 198483 198347 198079 197445 196601 195940 195629 195631 196071 197142 198684 200265 201681
54323B01681J247P85j05p22k52J043K038K122J665J230J009J065J347J368N59
$$ 201681 202928 203713 203608 202886 202634 203677 205715 207837 209502 210732 211741 212806 214153 215521 216080
54308B16080q39j889k117j972j865j564q71k00L0Ql6m34j464k481k526j567m97
$$ 216080 215241 213352 211235 209263 207398 205834 204963 204763 204793 204801 204765 204331 202867 200386 197860 196293 195796
54291A95796P1K88L79J77m37j128j473j357q35J03J315K267K353J515L62l60m17
$$ 195796 195867 196155 196534 196711 196274 195146 193673 192316 191481 191584 192899 195166 197519 199034 199396 199036 198619
54274A98619j68j02l15n00m04j34M6N2M1J42K93L08J29m3L9L05L71J14n3K28O12
$$ 198619 198451 198349 198034 197534 197130 196996 197042 197094 197135 197277 197570 197878 198007 197964 198003 198308 198679 198793 198740 198968 199580
54253A99580N53K45L71Q58P92p7o53J3J255J668R77Q5m47q51j179j039m87k30
$$ 199580 200133 200378 200749 201607 202399 202322 201669 201682 202937 204605 205582 205667 205220 204369 203190 202151 201664 201434
54235B01434m82n33O1O00K88n19q46n44l07m97o59k91M65J014Q52j6r01q46L63
$$ 201434 200952 200419 200480 201080 201368 200849 200003 199459 199152 198655 197996 197705 198170 199184 200036 200020 199119 198273 198636
54216A98636J713J992J197L32o6m04r79j298r65m91n77j024j089o33k07r0LK42
$$ 198636 200349 202341 203538 203870 203804 203400 202421 201123 200158 199667 199090 198066 196977 196344 196137 196047 196050 196292
54198A96292L57K05P1J48K30J46J03K62L60J51j23j38n6k89p89j053p21J03R29
$$ 196292 196649 196854 196925 197073 197303 197449 197552 197814 198174 198325 198202 198064 198008 197719 196930 195877 195156 195259 196188
54179A96188J056L8j529k131r15J020J770R74P2J71P19P59M24L88N99N42L01L58
$$ 196188 197244 197282 195753 193622 192707 193727 195497 196471 196543 196714 197433 198192 198616 199004 199603 200145 200446 200804
54161B00804M80n0j156j780j275k39L30J84k46n56o22m88l21l47n72o92m77l7
$$ 200804 201284 201234 200078 198298 197023 196784 197114 197298 197052 196496 195874 195386 195065 194718 194146 193454 192977 192940
54143A92940L72N88N28J93j88l02j40N8K81P69J393J519R13K96M82J166J240K43
$$ 192940 193312 193900 194428 194621 194433 194131 193991 194049 194330 195099 196492 198011 198924 199220 199702 200868 202108 202351
54125B02351j006j358m93R71K172K629K405J941J576J253Q09M44M89P02L69o08
$$ 202351 201345 199987 199494 200465 202637 205266 207671 209612 211188 212441 213250 213694 214183 214885 215254 214646
54109B14646j244o71N26R06M8r35r75l69o7k16k43l6j88r04j492j275n10N4J45
$$ 214646 213402 212731 213257 214163 214211 213276 212301 211932 211865 211649 211406 211370 211182 210278 208786 207511 207001 207055 207200
54090B07200kk45o26r86r71n88k63k52k70P1O86J084R67N23K04K86P06J222J663
$$ 207200 207198 206953 206327 205341 204370 203782 203519 203267 202997 203068 203754 204838 205805 206328 206532 206818 207524 208746 210409
54071B10409J944J958J607R77L31j26l93n02m14j77OK1M5K92P09J041J076P20
$$ 210409 212353 214311 215918 216895 217226 217100 216707 216205 215791 215614 215620 215641 215686 215978 216687 217728 218804 219524
54053B19524O2m85l89L39J029J230J428K351L723M401L783K504J633J630K273
$$ 219524 219586 219101 218712 219051 220080 221310 222738 225089 228812 233213 236996 239500 241133 242763 245036
54038B45036L090L568L384K807K642L406M705N588N431M393L205K619K774L076
$$ 245036 248126 251694 255078 257885 260527 263933 268638 274226 279657 284050 287255 289874 292648 295724
54024B95724K865K237J799J638J159J34o61m33M92J109J039P84P64Q05P05P18
$$ 295724 298589 300826 302625 304263 305422 305556 304895 304462 304954 306063 307102 307886 308650 309455 310160 310878
54008C10878J122J667J844J643J677K518M132O071Q048R974J1503J1998J1189
$$ 310878 312000 313667 315511 317154 318831 321349 325481 331552 339600 349574 361077 373075 384264
53995C84264R544P624N379K553m86l051n172p503j0003j1601j1616j0780j0268
$$ 384264 393808 401432 406811 409364 408878 405827 400655 393152 383149 371548 359932 349152 338884
53982C38884j0226r980r211q173p059n886m936m523m407l994l179k463k250k467
$$ 338884 328658 318678 309467 301294 294235 288349 283413 278890 274483 270489 267310 264847 262597 260130
53968B60130k867l192l079k311j175j62O40J365J748J373N52J72M98Q04M97q4
$$ 260130 257263 254071 250992 248681 247506 247344 247984 249349 251097 252470 253022 253194 253692 254496 254993 254909
53952B54909l12j90r8r7M2L73Q36J511K416L182L355K972K551K570L050L593L677
$$ 254909 254597 254407 254309 254212 254254 254627 255463 256974 259390 262572 265927 268899 271450 274020 277070 280663 284340
53935B84340L117K357K108K541L132L388L421L547L663L402K695J903J425J426
$$ 284340 287457 289814 291922 294463 297595 300983 304404 307951 311614 315016 317711 319614 321039 322465
53921C22465J776K135K270K347K701L207L329K969K708K881K995K617K311K812
$$ 322465 324241 326376 328646 330993 333694 336901 340230 343199 345907 348788 351783 354400 356711 359523
53907C59523L626L412J893L19k03j6p2n48r43j110j324j561j477j173j343k339
$$ 359523 363149 366561 368454 368773 368570 368554 368482 367934 366991 365881 364557 362996 361519 360346 359003 356664
53891C56664l600m337m494m589m758m526l651k726k535k973l178k708k158k223
$$ 356664 353064 348727 344233 339644 334886 330360 326709 323983 321448 318475 315297 312589 310431 308208
53877C08208k668k667k020j418j424j704j594j053o53p75j191j464j451j318j204
$$ 308208 305540 302873 300853 299435 298011 296307 294713 293660 293007 292232 291041 289577 288126 286808 285604
53862B85604j013n95p4J02m24j400k097k065j596j216r28l88L07N31P3l27J65
$$ 285604 284591 283996 283922 284024 283600 282200 280103 278038 276442 275226 274298 273910 274217 274748 274821 274494 274659
53845B74659J340K247K426K302K294K237K019K179L246M819N965O468P129Q722
$$ 274659 275999 278246 280672 282974 285268 287505 289524 291703 294949 299768 305733 312201 319330 328052
53831C28052J1162J3840J6316J8336J9479J9198J7232J3882R983O451L568O95
$$ 328052 339214 353054 369370 387706 407185 426383 443615 457497 467480 473931 477499 478194
53819D78194k872o712r471j0470j0450j0308r773q154n913m388m015l899l383
$$ 478194 475322 468610 459139 448669 438219 427911 418138 409984 404071 399683 395668 391769 388386
53806C88386l063l654m705n232n056m682m215l421k659k747l633m092l209j572
$$ 388386 385323 381669 376964 371732 366676 361994 357779 354358 351699 348952 345319 341227 338018 336446
53792C36446m21j49k29k73l94n87n26j04K71J81l68j149j997k670k834k513k242
$$ 336446 336025 335876 335647 335374 334980 334393 333867 333763 334034 334215 333847 332698 330701 328031 325197 322684 320442
53775C20442k443k814k724k083j356r41r18j379k372l474l911l481k890k795k889
$$ 320442 317999 315185 312461 310378 309022 308081 307163 305784 303412 299938 296027 292546 289656 286861 283972
53760B83972k411j395p63j101j835j957j273n38m19p33q31m83o0P6k2j43k58l44
$$ 283972 281561 280166 279403 278302 276467 274510 273237 272699 272280 271547 270716 270233 270173 270249 270227 270084 269826 269482
53742B69482j09O34J521J907J660J217R05O02K45J51M95R17J037J038J311J703
$$ 269482 269373 270007 271528 273435 275095 276312 277217 277819 278064 278215 278710 279627 280664 281702 283013 284716
53726B84716J660J008J93k48j60K04L74k5p64j017k70R33J674J901K276K876K968
$$ 284716 286376 287384 287577 287329 287169 287373 287747 287722 286958 285941 285671 286604 288278 290179 292455 295331 298299
53709B98299K295J691J883K369K273J734J610K108K541K433K034J692J402J185
$$ 298299 300594 302285 304168 306537 308810 310544 312154 314262 316803 319236 321270 322962 324364 325549
53695C25549J285J714K093K209K311K531K554K233K026K274K449J833P13J28L50
$$ 325549 326834 328548 330641 332850 335161 337692 340246 342479 344505 346779 349228 351061 351774 351902 352252
53680C52252M34m08j596j938j198k79l0m29r90j411j572j331p25j36K3k25n62
$$ 352252 352686 352278 350682 348744 347546 347267 347237 346808 345818 344407 342835 341504 340779 340643 340666 340441 339879
53663C39879q34j059j039m01Q19J891K024J158n4r43j253j042n06M3K93K76L37
$$ 339879 339045 337986 336947 336546 337365 339256 341280 342438 342384 341441 340188 339146 338640 338683 338976 339252 339589
53646C39589O54R65R81Q40Q32Q77P17N47Q74J652K104J793J320J407J734J400
$$ 339589 340243 341208 342189 343029 343861 344738 345455 346002 346876 348528 350632 352425 353745 355152 356886 358286
53630C58286M34r1M29J322J711J691J846K166K201K053K267K849L138K832K461
$$ 358286 358720 358629 359058 360380 362091 363782 365628 367794 369995 372048 374315 377164 380302 383134 385595
53615C85595K557K900K995K882K980L420L876M017L746L166K600K452K769L041
$$ 385595 388152 391052 394047 396929 399909 403329 407205 411222 414968 418134 420734 423186 425955 428996
53601D28996K765K140J822K062K404K314J784J193Q18O77O34N40L16J9k51m79
$$ 428996 431761 433901 435723 437785 440189 442503 444287 445480 446298 446975 447609 448149 448465 448484 448233 447754
53585D47754o88p99p17n32m40m64m59m27n45p93q31m99j69l73j143j949k233j832
$$ 447754 447066 446267 445550 445018 444578 444114 443655 443228 442683 441890 441059 440560 440391 440018 438875 436926 434693 432861
53567D32861r53L5P62J069J098J165J465J910K187K028J513J155J399K019K309
$$ 432861 431908 431943 432705 433774 434872 436037 437502 439412 441599 443627 445140 446295 447694 449713 452022
53552D52022K044J857K344L134L417L142L067L607M404N078N780O624P236P388
$$ 452022 454066 455923 458267 461401 464818 467960 471027 474634 479038 484116 489896 496520 503756 511144
53538E11144P531Q127Q861R108Q944Q937R117Q922Q182P429P065O846O476O183
$$ 511144 518675 526802 535663 544771 553715 562652 571769 580691 588873 596302 603367 610213 616689 622872
53524F22872O326O893P731Q908J0391J1696J2396J2768J3467J4605J5647J6270
$$ 622872 629198 636091 643822 652730 663121 674817 687213 699981 713448 728053 743700 759970
53512G59970J6895J8058J9573K0668K1025K1295K2308K3841K4683K4176K3244
$$ 759970 776865 794923 814496 835164 856189 877484 899792 923633 948316 972492 995736
53501I95736K3332K4496K5298K4708K3323K2386K2245K2354K2260K1863K1036
$$ 995736 1019068 1043564 1068862 1093570 1116893 1139279 1161524 1183878 1206138 1228001 1249037
53490A249037J9784J8677J8423J8974J9573J9720J9495J8962J7945J6594J5559
$$ 1249037 1268821 1287498 1305921 1324895 1344468 1364188 1383683 1402645 1420590 1437184 1452743
53479A452743J5217J5169J4843J4155J3287J2151J0553Q693P079N941M913L389
$$ 1452743 1467960 1483129 1497972 1512127 1525414 1537565 1548118 1556811 1563890 1569831 1574744 1578133
53467A578133J077j685m211o107p547q819r868j0626j1545j3112j4988j6303j6937
$$ 1578133 1579210 1577525 1573314 1567207 1559660 1550841 1540973 1530347 1518802 1505690 1490702 1474399 1457462
53454A457462j7637j8670j9186j8573j7627j7567j8393j9114j9256j9149j8892
$$ 1457462 1439825 1421155 1401969 1383396 1365769 1348202 1329809 1310695 1291439 1272290 1253398
53443A253398j8016j6392j4648j3378j2473j1541j0464r320q143p013o053n079
$$ 1253398 1235382 1218990 1204342 1190964 1178491 1166950 1156486 1147166 1139023 1132010 1125957 1120878
53431A120878l690j805J86J984L669N260O445P103P680Q670R964J1099J2033J3194
$$ 1120878 1117188 1115383 1115569 1117553 1121222 1126482 1132927 1140030 1147710 1156380 1166344 1177443 1189476 1202670
53417A202670J4875J6881J8758K0218K1364K2615K4329K6402K8321K9767L0924
$$ 1202670 1217545 1234426 1253184 1273402 1294766 1317381 1341710 1368112 1396433 1426200 1457124
53406A457124L2100L3348L4671L6251L8134L9988M1651M3605M6292M9024N0410
$$ 1457124 1489224 1522572 1557243 1593494 1631628 1671616 1713267 1756872 1803164 1852188 1902598
53395A902598N0102M9491N0191N2210N4160N4922N4510N3504N2310N1184N0384
$$ 1902598 1952700 2002191 2052382 2104592 2158752 2213674 2268184 2321688 2373998 2425182 2475566
53384B475566M9843M9015M7407M5139M2662M0081L7167L3872L0420K6860K2992
$$ 2475566 2525409 2574424 2621831 2666970 2709632 2749713 2786880 2820752 2851172 2878032 2901024
53373B901024J8858J4907J1415Q065M299j70n376j1199j7216k2804k7817l2797
$$ 2901024 2919882 2934789 2946204 2954269 2958568 2958398 2953022 2941823 2924607 2901803 2873986 2841189
53361B841189l8004m2691m5957m8041m9907n1743n2803n2805n2450n2235n1719
$$ 2841189 2803185 2760494 2714537 2666496 2616589 2564846 2512043 2459238 2406788 2354553 2302834
53350B302834n0558m9407m8993m8981m8512m7452m6288m5164m3911m2728m1916
$$ 2302834 2252276 2202869 2153876 2104895 2056383 2008931 1962643 1917479 1873568 1830840 1788924
53339A788924m1087l9532l7352l5384l3908l2362l0442k8561k6900k4930k2330
$$ 1788924 1747837 1708305 1670953 1635569 1601661 1569299 1538857 1510296 1483396 1458466 1436136
53328A436136j9715j7817j6570j5556j4808j4481j4199j3422j2276j1359j0862
$$ 1436136 1416421 1398604 1382034 1366478 1351670 1337189 1322990 1309568 1297292 1285933 1275071
53317A275071j0386r568q384o966n515m296l322k206p73M74J080J551K883N164
$$ 1275071 1264685 1255117 1246733 1239767 1234252 1229956 1226634 1224428 1223655 1224129 1225209 1226760 1229643 1234807
53303A234807P430Q971J0048J1072J1837J2142J2556J3959J6453J9245K1464K2790
$$ 1234807 1242237 1251208 1261256 1272328 1284165 1296307 1308863 1322822 1339275 1358520 1379984 1402774
53291A402774K3371K3530K3569K3609K3610K3571K3537K3298K2399K0669J8547
$$ 1402774 1426145 1449675 1473244 1496853 1520463 1544034 1567571 1590869 1613268 1633937 1652484
53280A652484J6575J4708J2511R958P585N785M251K320k66l185o031q708j1289
$$ 1652484 1669059 1683767 1696278 1706236 1713821 1719606 1723857 1726177 1725911 1722726 1716695 1707987 1696698
53267A696698j3637j5486j6940j8554k0625k2644k3860k4336k4932k6167k7603
$$ 1696698 1683061 1667575 1650635 1632081 1611456 1588812 1564952 1540616 1515684 1489517 1461914
53256A461914k8595k9154k9640l0070l0220l0201l0317l0487l0261k9454k8312
$$ 1461914 1433319 1404165 1374525 1344455 1314235 1284034 1253717 1223230 1192969 1163515 1135203
53245A135203k7146k6188k5772k6013k6355k5961k4739k3463k2676k2035k1072
$$ 1135203 1108057 1081869 1056097 1030084 1003729 977768 953029 929566 906890 884855 863783
53234H63783k0024j9350j8793j7532j5316j2940j1485j1328j1942j2463j2374
$$ 863783 843759 824409 805616 788084 772768 759828 748343 737015 725073 712610 700236
53223G00236j1801j1173j0730j0482j0509j0981j1700j2116j1954j1558j1316
$$ 700236 688435 677262 666532 656050 645541 634560 622860 610744 598790 587232 575916
53212E75916j1058j0506r900r649r554q974p825o771o309o204o027n814n829o052
$$ 575916 564858 554352 544452 534803 525249 516275 508450 501679 495370 489166 483139 477325 471496 465444
53198D65444o195o115n908n754n819o202o745p064o912o433n891n376m888m495
$$ 465444 459249 453134 447226 441472 435653 429451 422706 415642 408730 402297 396406 391030 386142 381647
53184C81647m197l771l041k233j706j487j310j152j298j768j985j441m71j9n02
$$ 381647 377450 373679 370638 368405 366699 365212 363902 362750 361452 359684 357699 356258 355787 355768 355266
53169C55266j288j514j141q14q33q20m31O3K52J92J23o1n14q49n17K23M40k00
$$ 355266 353978 352464 351323 350509 349676 348856 348425 348488 348740 348932 349055 348994 348480 347631 347114 347337 347777 347577
53151C47577q82p56l2M06J10o56j464k022k102j634r14l94k44l12l80l09q0J48
$$ 347577 346695 345939 345907 346313 346423 345767 344303 342281 340179 338545 337631 337237 336993 336681 336301 335992 335912 336060
53133C36060J56L1J38N03N89Lq86j448j631j749j765j390p71l62j80J51N43M06
$$ 336060 336216 336247 336385 336888 337477 337480 336594 335146 333515 331766 330001 328611 327840 327478 327298 327449 327992 328398
53115C28398l20p91l12P12J290R46Kq83j207r48o66r70j739k217k075j792j780
$$ 328398 328078 327287 326975 327687 328977 329923 329925 329042 327835 326887 326221 325251 323512 321295 319220 317428 315648
53098C15648j688j104m29m73j329k244k366j374L53J794J895O81o05r23n77m02
$$ 315648 313960 312856 312427 311954 310625 308381 306015 304641 304994 306788 308683 309364 308759 307836 307259 306857
53082C06857l68Q1P09P05N1l64k28k29p07r93o17j79l46p41p23n34p11r03k90
$$ 306857 306489 306570 307279 307984 308035 307671 307443 307214 306507 305514 304897 304718 304372 303631 302908 302374 301663 300760 300470
53063C00470R99J893J832J323R90Q74Q48R79J171J063P08P45J466K158J924Q99
$$ 300470 301469 303362 305194 306517 307507 308381 309229 310208 311379 312442 313150 313895 315361 317519 319443 320342
53047C20342R2J13O27J062J297J421J249N78k94q21r73j314k034k433j790n03
$$ 320342 320434 320547 321174 322236 323533 324954 326203 326781 326487 325666 324693 323379 321345 318912 317122 316619
53031C16619K57rp05j207j628k151k297j581m59P7k54q43j139j047m67O92J844
$$ 316619 316876 316867 316162 314955 313327 311176 308879 307298 306839 306916 306662 305819 304680 303633 303166 303858 305702
53014C05702J885N48r85j383p22j51l40q50r46m55K86Q68J053Q24L78r1n37r08
$$ 305702 307587 308135 307150 305767 305045 304894 304554 303704 302758 302303 302589 303457 304510 305334 305712 305621 305084 304176
52996C04176r65n53K2K11j09m87n18k84l4K97R14J647J926J353J91p97r95m06
$$ 304176 303211 302658 302680 302891 302782 302295 301777 301493 301459 301756 302670 304317 306243 307596 307787 306990 305995 305589
52978C05589M36R83J089J000J045J372J929K479K694K317J436N04mO2M96R40J132
$$ 305589 306025 307008 308097 309097 310142 311514 313443 315922 318616 320933 322369 322873 322869 322931 323427 324367 325499
52961C25499J014P69O67P93R04O97J89l62q66j500k246k607k095r22J35N54M40
$$ 325499 326513 327282 327949 328742 329646 330343 330532 330170 329304 327804 325558 322951 320856 319934 320069 320623 321063
52944C21063Np26j567j864j196r6M10No86j052j133j135q93k61L63M12j29p67
$$ 321063 321068 320342 318775 316911 315715 315619 316029 316034 315348 314296 313163 312028 311135 310874 311237 311649 311520 310753
52926C10753j132j222j114q57o34n60l68L29J318J707Q78o90j787j585l30R81
$$ 310753 309621 308399 307285 306428 305794 305234 304866 305195 306513 308220 309098 308408 306621 305036 304706 305687
52910C05687J467J041L28o7j46k84n64o56l76j2P4l7QL83R68J581K067K223J905
$$ 305687 307154 308195 308523 308456 308310 308026 307462 306806 306430 306418 306492 306455 306463 306846 307814 309395 311462 313685 315590
52891C15590J227N41J51J20K76L37J05l43p46r97j273j690j996j854j348q80o33
$$ 315590 316817 317358 317509 317629 317905 318242 318347 318004 317258 316261 314988 313298 311302 309448 308100 307220 306587
52874C06587l98n0J39j19o39r35p78l36J40N30O95M56j06m38L4J173K055J872
$$ 306587 306189 306139 306278 306159 305520 304585 303807 303471 303611 304141 304836 305292 305186 304748 304782 305955 308010 309882
52856C09882Q76J46L12P57M26p71j729j528n95j04m54r08p81m64q21j913k831
$$ 309882 310758 310904 311216 311973 312399 311628 309899 308371 307776 307672 307218 306310 305529 305065 304244 302331 299500
52839B99500k812k049j237p27m35k78l02l54j16M13P64N45l8m40m66m24n68o81
$$ 299500 296688 294639 293402 292675 292240 291962 291660 291306 291190 291603 292367 292912 292874 292434 291968 291544 290976 290295
52821B90295l50M00J007R70L95j27j80J03L38L67L10K89L70P38J548K464K687
$$ 290295 289945 290345 291352 292322 292717 292590 292410 292513 292851 293218 293528 293817 294187 294925 296473 298937 301624
52804C01624J777L11o76q08o30p19j036j303j617k185k656k306j027L06P18J80
$$ 301624 303401 303712 303036 302228 301598 300879 299843 298540 296923 294738 292082 289776 288749 289055 289773 289953
52788B89953n11p60p01p59r74j035p96m66k81j55J50N72P15L68p3j9N28Q98O55
$$ 289953 289442 288682 287981 287222 286248 285213 284417 283951 283670 283515 283665 284237 284952 285320 285247 285228 285756 286654 287309
52769B87309K17K30N50M10m09j136r42Q1J178J759J644Q73j95q54p01k20j62m59
$$ 287309 287526 287756 288306 288716 288307 287171 286229 286310 287488 289247 290891 291764 291569 290715 290014 289794 289632 289173
52751B89173l72K26N19K1n48k56O92J283J127Q80J181J856K324K357K170K029
$$ 289173 288801 289027 289546 289567 289019 288763 289455 290738 291865 292745 293926 295782 298106 300463 302633 304662
52735C04662J997J976J846J545J101O02K07K01P19J378J414N16p01j383j455j532
$$ 304662 306659 308635 310481 312026 313127 313729 313936 314137 314856 316234 317648 318164 317463 316080 314625 313093
52719C13093j923k243k061j501r59o00l42r7J38L03K77O6l1K59O50N09k77j054
$$ 313093 311170 308927 306866 305365 304406 303806 303464 303367 303505 303808 304085 304151 304120 304379 305029 305538 305261 304207
52701C04207j266j106j037j012o57j0M51M22N8l11m53k53K61R01J473J816J660
$$ 304207 302941 301835 300798 299786 299129 299119 299570 299992 300050 299739 299286 299033 299294 300195 301668 303484 305144
52684C05144P62n18j201p12L00P90O70P29J280J702J542J219J318J723J919J725
$$ 305144 305906 305388 304187 303475 303775 304565 305235 305964 307244 308946 310488 311707 313025 314748 316667 318392
52668C18392J270O69J30L4M34P36M08k48n36l37r4J3K22N91R34J322J994K581
$$ 318392 319662 320331 320461 320495 320929 321665 322073 321825 321289 320952 320858 320871 321093 321684 322618 323940 325934 328515
52650C28515K203O96q47j345j035r08j209j277p57j34O3j9mL6j73m61l57J84O88
$$ 328515 330718 331414 330567 329222 328187 327279 326070 324793 324036 323902 323965 323946 323942 323978 323805 323344 322987 323171 323859
52631C23859Q48R99J637K695L565L795L516L091K620J975J178M61j10p58j609
$$ 323859 324707 325706 327343 330038 333603 337398 340914 344005 346625 348600 349778 350239 350129 349371 347762
52616C47762k332k491k160j895k036k254k068j592j475k028k673k476j171M96
$$ 347762 345430 342939 340779 338884 336848 334594 332526 330934 329459 327431 324758 322282 321111 321607
52602C21607J470J320M84k46l82pM16M61J44l6L95J256J772J404M72k02k53j3
$$ 321607 323077 324397 324881 324635 324253 324246 324662 325123 325267 325231 325626 326882 328654 330058 330530 330328 330075 330062
52584C30062J08J53L59P07R59J045J079J073R01N49K31J69M08P99J061R05L15
$$ 330062 330170 330323 330682 331389 332348 333393 334472 335545 336446 336995 337226 337395 337803 338602 339663 340568 340883
52567C40883k72l04K80R36J061N80j06n99q08r26j183j602j909j792j280o83j65
$$ 340883 340611 340307 340587 341523 342584 343164 343058 342459 341651 340725 339542 337940 336031 334239 332959 332276 332111
52550C32111M20J110J532J319P35M16N62O66K35n49j094j174j078j062r34l61
$$ 332111 332531 333641 335173 336492 337227 337643 338205 338871 339106 338557 337463 336289 335211 334149 333215 332854
52534C32854N19J114J027M83J2j85k88m09m17k83k30l03j20N78J323J361O54l0
$$ 332854 333373 334487 335514 335997 336009 335824 335536 335127 334710 334427 334197 333894 333774 334352 335675 337036 337690 337660
52516C37660j23R8J19M3L67J171J983K419K570K641K596K324J964J711J394N77
$$ 337660 337537 337635 337754 337797 338164 339335 341318 343737 346307 348948 351544 353868 355832 357543 358937 359514
52500C59514q22k223k917k779k273j789j359r83q97j184j424j122l47M00Q79J244
$$ 359514 358692 356469 353552 350773 348500 346711 345352 344369 343472 342288 340864 339742 339395 339795 340674 341918
52484C41918J528J450R43M37L35N59P69Q26P46N57M12O05J127J525J500J359J485
$$ 341918 343446 344896 345839 346276 346611 347170 347939 348765 349511 350068 350480 351085 352212 353737 355237 356596 358081
52467C58081J601J237O65O90J468K186K156J603J087O24q3q86j235r40m50k89
$$ 358081 359682 360919 361584 362274 363742 365928 368084 369687 370774 371398 371315 370429 369194 368254 367804 367515
52451C67515n55j055j711k505l118k969j870n92l01j263k442k692k037j304q28
$$ 367515 366960 365905 364194 361689 358571 355602 353732 353140 352839 351576 349134 346442 344405 343101 342273
52436C42273k78L32M38l7k50L15Q63L12j091k004j707p47J01P57J480K215K661
$$ 342273 341995 342327 342765 342728 342478 342793 343656 343968 342877 340873 339166 338419 338520 339277 340757 342972 345633
52419C45633K625K081J168L86L91J299K425L020L132L406M173N082N679O065O759
$$ 345633 348258 350339 351507 351893 352284 353583 356008 359028 362160 365566 369739 374821 380500 386565 393324
52404C93324P939R032R197Q211O642N109L626J900rj739l225m750o301p352p471
$$ 393324 401263 410295 419492 427703 434345 439454 443080 444980 444971 443232 440007 435257 428956 421604 414133
52389D14133o848n938m948l881k895k183j710j264p82l71o9K58Q03J639K582L221
$$ 414133 407285 401347 396399 392518 389623 387440 385730 384466 383684 383313 383244 383502 384305 385944 388526 391747
52373C91747L309L158L308L730L795L253K721K786L044K709J828J154R34O59J36
$$ 391747 395056 398214 401522 405252 409047 412300 415021 417807 420851 423560 425388 426542 427476 428135 428271
52358D28271j37K4l1p29j317p98N69J554J601J359J480J713J588J351J635K433
$$ 428271 428134 428158 428127 427398 426081 425283 425852 427406 429007 430366 431846 433559 435147 436498 438133 440566
52342D40566L053L027K635K429K586K943L432M152N095O008O639O969P208P610
$$ 440566 443619 446646 449281 451710 454296 457239 460671 464823 469918 475926 482565 489534 496742 504352
52328E04352Q363R489J0741J1680J2079J2191J2439J2893J3227J3249J3152J3150
$$ 504352 512715 522204 532945 544625 556704 568895 581334 594227 607454 620703 633855 647005
52316F47005J3075J2701J2257J2313J3086J4093J4617J4371J3667J3049J2859
$$ 647005 660080 672781 685038 697351 710437 724530 739147 753518 767185 780234 793093
52305G93093J3067J3422J3669J3681J3407J2896J2361J2050J1845J1187R705P840
$$ 793093 806160 819582 833251 846932 860339 873235 885596 897646 909491 920678 930383 938223
52293I38223O452N730M916L294J121p42j866k587l393m357n179n444m858l558
$$ 938223 944675 950405 955321 958615 959736 958994 957128 954541 951148 946791 941612 936168 931310 927752
52279I27752k209j511j474j420q76j06M29Q23J543K687L884M931O045P379Q589
$$ 927752 925543 924032 922558 921138 920262 920156 920585 921408 922951 925638 929522 934453 940498 947877 956466
52264I56466R227R291R173R194R439R852J0313J0627J0753J0918J1260J1455J1039
$$ 956466 965693 974984 984157 993351 1002790 1012642 1022955 1033582 1044335 1055253 1066513 1077968 1089007
52251A089007J0116R320Q958Q650P987P091O097M605K223m81k370l036l137l286
$$ 1089007 1099123 1108443 1117401 1126051 1134038 1141129 1147226 1151831 1154054 1153573 1151203 1148167 1145030 1141744
52237A141744l339l091l035l772n105o293o990p293p128o292n106m342m236m184
$$ 1141744 1138405 1135314 1132279 1128507 1123402 1117109 1110119 1102826 1095698 1089406 1084300 1079958 1075722 1071538
52223A071538l616k743k090j776j584j444j438j487j416j203q67l28M47J329K302
$$ 1071538 1067922 1065179 1063089 1061313 1059729 1058285 1056847 1055360 1053944 1052741 1051874 1051546 1051993 1053322 1055624
52208A055624L530M795N277M492L225K787L338L743L269K663L011M143M960M938
$$ 1055624 1059154 1063949 1069226 1073718 1076943 1079730 1083068 1086811 1090080 1092743 1095754 1099897 1104857 1109795
$$ [...]
##END NTUPLES=NMR SPECTRUM
##END=
