##TITLE=AC1479_ZINDOMA305_8101045_lMus8BbtgM
##JCAMPDX= 6.0         $$ Bruker NMR JCAMP-DX V2.0
##DATA TYPE= NMR SPECTRUM
##DATA CLASS= NTUPLES
##ORIGIN= BRUKER
##OWNER= Administrator
$$ 1.72 TOPSPIN		Version 2.1
$$ 2013-07-31 17:39:40.049 -0700  Administrator@X
$$ Compression mode = diff/dup
##.OBSERVE FREQUENCY= 400.02188249412
##.OBSERVE NUCLEUS= ^1H
##.ACQUISITION MODE= SIMULTANEOUS (DQD)
##.ACQUISITION SCHEME= undefined
##.AVERAGES= 64
##.DIGITISER RES= 22
##SPECTROMETER/DATA SYSTEM= spect
##.PULSE SEQUENCE= noesygpps1d.comp
##.SOLVENT NAME= COFFEE_meoh
##.SHIFT REFERENCE= INTERNAL, COFFEE_meoh, 1, 14.96099
##AUDIT TRAIL= $$ (NUMBER, WHEN, WHO, WHERE, PROCESS, VERSION, WHAT)
$$ ##TITLE= Audit trail, TOPSPIN		Version 2.1
$$ ##JCAMPDX= 5.01
$$ ##ORIGIN= Bruker BioSpin GmbH
$$ ##OWNER= Administrator
$$ $$ E:\/data/COFFEE/nmr/AC1479_ZINDOMA305_8101045_lMus8BbtgM/12/pdata/1/auditp.txt
$$ ##AUDIT TRAIL=  $$ (NUMBER, WHEN, WHO, WHERE, PROCESS, VERSION, WHAT)
(   1,<2013-07-31 17:39:35.128 -0700>,<Administrator>,<X>,<go>,<TOPSPIN 2.1>,
      <created by zg
	started at 2013-07-31 17:28:05.596 -0700,
	POWCHK enabled, PULCHK disabled,
       configuration hash MD5:
       C8 4E 4E 5D D3 5C D8 9E 9F 52 82 E0 59 8A DE 15
       data hash MD5: 64K
       26 B5 FA FA D5 38 71 0A 9B 26 02 F2 CA 27 F6 F7>)
(   2,<2013-07-31 17:39:38.096 -0700>,<Administrator>,<X>,<proc1d>,<TOPSPIN 2.1>,
      <Start of raw data processing
       efp LB = 0.3 FT_mod = 6 PKNL = 1 PHC0 = 0 PHC1 = 0 SI = 128K 
       data hash MD5: 128K
       37 A4 E2 CC 09 F0 46 1A 04 94 56 0D 3C 93 48 CE>)
(   3,<2013-07-31 17:39:39.065 -0700>,<Administrator>,<X>,<proc1d>,<TOPSPIN 2.1>,
      <pk PHC0 = -79.56299 PHC1 = 0 
       data hash MD5: 128K
       5F FD 71 88 A3 BE 86 99 74 87 57 D5 8B 1D 2F B2>)
(   4,<2013-07-31 17:39:39.503 -0700>,<Administrator>,<X>,<proc1d>,<TOPSPIN 2.1>,
      <abs ABSG = 1 
       data hash MD5: 128K
       48 14 49 39 F8 AC F7 7A 54 B9 81 1B 4C 04 AF CD>)
(   5,<2013-07-31 17:39:39.596 -0700>,<Administrator>,<X>,<proc1d>,<TOPSPIN 2.1>,
      <abs ABSG = 2 
       data hash MD5: 128K
       87 5D B1 42 55 4A A9 8E 58 9A 3C 27 19 DC FA 41>)
(   6,<2013-07-31 17:39:39.690 -0700>,<Administrator>,<X>,<proc1d>,<TOPSPIN 2.1>,
      <abs ABSG = 3 
       data hash MD5: 128K
       2E E4 33 A9 E2 C7 53 02 DD 26 BA 32 9B F9 62 EF>)
(   7,<2013-07-31 17:39:39.784 -0700>,<Administrator>,<X>,<proc1d>,<TOPSPIN 2.1>,
      <abs ABSG = 4 
       data hash MD5: 128K
       DF BE A4 70 07 BD 07 6D 6D 69 4F C2 CA 5E 58 5F>)
(   8,<2013-07-31 17:39:39.862 -0700>,<Administrator>,<X>,<proc1d>,<TOPSPIN 2.1>,
      <abs ABSG = 5 
       data hash MD5: 128K
       55 22 A9 0B D6 01 CD 85 FB AC 36 F8 D1 BD C8 A2>)
$$ ##END=
$$ 
$$ $$ hash MD5
$$ $$ 09 D8 AF 19 03 C9 1F C1 56 16 37 24 F6 ED E5 D5
##$RELAX= 
##$RELAX= 
##$RELAX= 
##$RELAX= 
##$RELAX= 
##$RELAX= 
##$RELAX= 
##$RELAX= 
$$ Bruker specific parameters
$$ --------------------------
##$DU= <E:\>
##$EXPNO= 12
$$ [...]
##$TP07= 0
##$TPNAME0= <>
##$TPNAME1= <>
##$TPNAME2= <>
##$TPNAME3= <>
##$TPNAME4= <>
##$TPNAME5= <>
##$TPNAME6= <>
##$TPNAME7= <>
##$TPOAL= (0..7)
0.5 0.5 0.5 0.5 0.5 0.5 0.5 0.5
##$TPOFFS= (0..7)
0 0 0 0 0 0 0 0
##$TUNHIN= 0
##$TUNHOUT= 0
##$TUNXOUT= 0
##$USERA1= <user>
##$USERA2= <user>
##$USERA3= <user>
##$USERA4= <user>
##$USERA5= <user>
##$V9= 5
##$VALIST= <valist>
##$VCLIST= <CCCCCCCCCCCCCCC>
##$VD= 0
##$VDLIST= <DDDDDDDDDDDDDDD>
##$VPLIST= <PPPPPPPPPPPPPPP>
##$VTLIST= <TTTTTTTTTTTTTTT>
##$WBST= 2048
##$WBSW= 25
##$XGAIN= (0..3)
0 0 0 0
##$XL= 0
##$YL= 0
##$YMAX_a= 6554956
##$YMIN_a= -14088871
##$ZGOPTNS= <>
##$ZL1= 120
##$ZL2= 120
##$ZL3= 120
##$ZL4= 120
##$ABSF1= 14.96099
##$ABSF2= -5.597192
##$ABSG= 5
##$ABSL= 3
##$ALPHA= 0
##$AQORDER= 0
##$ASSFAC= 0
##$ASSFACI= 0
##$ASSFACX= 0
##$ASSWID= 0
##$AUNMP= <proc_prof1d_extract.lims>
##$AXLEFT= 0
##$AXNAME= <>
##$AXNUC= <1H>
##$AXRIGHT= 0
##$AXTYPE= 0
##$AXUNIT= <>
##$AZFE= 0.1
##$AZFW= 0.1
##$BCFW= 0
##$BC_mod= 0
##$BYTORDP= 0
##$COROFFS= 0
##$CY= 15
##$DATMOD= 1
##$DC= 0
##$DFILT= <>
##$DTYPP= 0
##$F1P= 0
##$F2P= 0
##$FCOR= 0.5
##$FTSIZE= 131072
##$FT_mod= 6
##$GAMMA= 0
##$GB= 0
##$INTBC= 1
##$INTSCL= 1
##$ISEN= 128
##$LB= 0.3
##$LEV0= 0
##$LPBIN= 0
##$MAXI= 10000
##$MC2= 0
##$MEAN= 0
##$ME_mod= 0
##$MI= 0
##$NCOEF= 0
##$NC_proc= -2
##$NLEV= 6
##$NOISF1= 0
##$NOISF2= 0
##$NSP= 0
##$NTH_PI= 0
##$NZP= 0
##$OFFSET= 14.96099
##$PC= 1
##$PHC0= -79.56299
##$PHC1= 0
##$PH_mod= 1
##$PKNL= yes
##$PPARMOD= 0
##$PPDIAG= 0
##$PPIPTYP= 0
##$PPMPNUM= 2147483647
##$PPRESOL= 1
##$PSCAL= 4
##$PSIGN= 0
##$PYNMP= <proc.py>
##$REVERSE= no
##$SF= 400.020009641636
##$SI= 131072
##$SIGF1= 0
##$SIGF2= 0
##$SINO= 400
##$SIOLD= 131072
##$SPECTYP= <>
##$SREGLST= <1H.CDCl3>
##$SSB= 0
##$STSI= 131072
##$STSR= 0
##$SW_p= 8223.68421052631
##$SYMM= 0
##$S_DEV= 0
##$TDeff= 65536
##$TDoff= 0
##$TI= <>
##$TILT= no
##$TM1= 0
##$TM2= 0
##$TOPLEV= 0
##$USERP1= <user>
##$USERP2= <user>
##$USERP3= <user>
##$USERP4= <user>
##$USERP5= <user>
##$WDW= 1
##$XDIM= 131072
##$YMAX_p= 403849623
##$YMIN_p= -27571
##$CURPLOT= <Network HP LaserJet P1505>
##$CURPRIN= <$Network HP LaserJet P1505>
##$DFORMAT= <normdp>
##$LAYOUT= <+/1D_H.xwp>
##$LFORMAT= <normlp>
##$PFORMAT= <normpl>
##$SURQMSG= 1
$$ End of Bruker specific parameters
$$ ---------------------------------
##NTUPLES= NMR SPECTRUM
##VAR_NAME=  FREQUENCY,     SPECTRUM/REAL,   SPECTRUM/IMAG
##SYMBOL=    X,             R,               I
##VAR_TYPE=  INDEPENDENT,   DEPENDENT,       DEPENDENT
##VAR_FORM=  AFFN,          ASDF,            ASDF
##VAR_DIM=   131072,        131072,          131072
##UNITS=     HZ,            ARBITRARY UNITS, ARBITRARY UNITS
##FACTOR=    0.0627417313425164, 1,          1
##FIRST=     8223.62146879497, -1369,        -72540
##LAST=      0,             1254,            -73090
##MIN=       0,             -27571,          0
##MAX=       8223.62146879497, 403849623,    0
$$ Real data points
##PAGE= N=1
##DATA TABLE= (X++(R..R)), XYDATA
$$ [...]
$$ plain form
63840 1758955 1731844 1697928 1657953 1613132 1564593 1513023 1458886 1402961 1346443 1290333 1234880
63829 1234880 1179977 1126207 1075109 1028112 985286 945337 906714 868584 830905 793986 758174
63818 758174 723793 691150 660433 631618 604545 579120 555382 533327 512815 493773 476374
63807 476374 460789 446859 434215 422689 412370 403284 395272 388180 381909 376253 370991 366142 361794
63794 361794 357627 353023 347836 342735 338487 335089 331791 327815 322944 317649 312812 309113 306481 304282
63780 304282 302114 300182 298786 297790 296802 295572 293956 291840 289415 287283 285911 285139 284520 283887 283280 282524
63764 282524 281339 279768 278127 276661 275577 275185 275535 275988 275687 274478 272952 271562 270180 268581 266928
63749 266928 265595 264876 265011 266120 267899 269644 270777 271223 271273 271371 272069 273697 275907 277917 279469 281163
$$ packed form
63840A758955k7111l3916l9975m4821m8539n1570n4137n5925n6518n6110n5453
63829A234880n4903n3770n1098m6997m2826l9949l8623l8130l7679l6919l5812
63818G58174l4381l2643l0717k8815k7073k5425k3738k2055k0512j9042j7399
63807D76374j5585j3930j2644j1526j0319r086q012p092o271n656n262m849m348
63794C61794m167m604n187n101m248l398l298l976m871n295m837l699k632k199
63780C04282k168j932j396r96r88j230j616k116k425k132j372p72o19o33o07p56
63764B82524j185j571j641j466j084l92L50M53l01j209j526j390j382j599j653
63749B66928j333p19J35J109J779J745J133M46N0R8O98J628K210K010J552J694
$$ plain form
63733 281163 283534 286180 288270 289652 290982 292826 295088 297381 299581 301908 304655 307951 311671 315613
63719 315613 319814 324612 330208 336289 342321 348057 353442 358137 361605 363721 364863 365275 364788 363362 361464
63704 361464 359514 357308 354537 351629 349448 348102 346628 344142 340934 338180 336841 337102 338584 340714
63690 340714 342978 345219 347740 350901 354591 358252 361435 364155 366708 369325 371974 374266 375567 375475 374333
63675 374333 373087 372499 372602 372983 373391 373959 374984 376667 378924 381312 383275 384686 386060 387934 390069
63660 390069 391584 391918 391404 390746 390132 389067 386942 383537 379069 374064 369237 365165 361821 358547 354737
63645 354737 350530 346684 343814 342013 341178 341354 342487 344088 345497 346474 347288 348329 349876 352235 355689
63630 355689 360096 364716 368741 371998 375094 378901 383898 389869 396119 402085 407835 413980 421169 429798
$$ packed form
63733B81163K371K646K090J382J330J844K262K293K200K327K747L296L720L942
63719C15613M201M798N596O081O032N736N385M695L468K116J142M12m87j426j898
63704C61464j950k206k771k908k181j346j474k486l208k754j339K61J482K130
63690C40714K264K241K521L161L690L661L183K720K553K617K649K292J301r2j142
63675C74333j246n88J03L81M08N68J025J683K257K388J963J411J374J874K135
63660C90069J515L34n14o58o14j065k125l405m468n005m827m072l344l274l810
63645C54737m207l846k870j801q35J76J133J601J409R77Q14J041J547K359L454
63630C55689M407M620M025L257L096L807M997N971O250N966N750O145P189Q629
$$ plain form
63616 429798 440138 452325 466068 480632 495514 511034 528002 546833 567287 589112 612611
63605 612611 638389 666658 696924 728234 759513 789618 817252 841036 859818 873027 880789 883806
63593 883806 883147 880076 875844 871427 867277 863219 858535 852311 843928 833278 820427 805200 787388
63580 787388 767373 746206 724856 703678 682823 662876 644628 628309 613487 599818 587616
63569 587616 577631 570520 566479 565070 565279 566061 567027 568404 570338 572665 575524 579702 585864 593650 602056
63554 602056 610655 619958 630633 642882 656736 672502 690680 711837 736898 767273 804265 848408
63542 848408 899404 956015 1015145 1071098 1116846 1147067 1160488 1159660 1148962 1132744 1114384 1096039
63530 1096039 1078869 1063564 1050587 1039816 1030246 1020511 1009684 997308 982757 965077 943624 918588
$$ packed form
63616D29798J0340J2187J3743J4564J4882J5520J6968J8831K0454K1825K3499
63605F12611K5778K8269L0266L1310L1279L0105K7634K3784J8782J3209P762L017
63593H83806o59l071m232m417m150m058m684o224q383j0650j2851j5227j7812
63580G87388k0015k1167k1350k1178k0855j9947j8248j6319j4822j3669j2202
63569E87616r985p111m041j409K09P82R66J377J934K327K859M178O162P786Q406
63554F02056Q599R303J0675J2249J3854J5766J8178K1157K5061L0375L6992M4143
63542H48408N0996N6611N9130N5953M5748L0221J3421q28j0698j6218j8360j8345
63530A096039j7170j5305j2977j0771r570r735j0827j2376j4551j7680k1453k5036
$$ plain form
63518 918588 890703 860702 829264 797206 765402 734457 704646 676172 649376 624663 602272
63507 602272 582095 563689 546505 530233 514954 501001 488705 478194 469317 461687 454851 448498
63495 448498 442514 436932 431843 427311 423306 419819 417159 415921 416356 417753 418802 418678 417671 416740 416708
63480 416708 417935 420359 423547 426920 430262 434021 438861 444840 451134 456558 460371 462671 464105 465130
63466 465130 465547 464868 463099 460826 458462 455743 452249 448128 443902 439781 435663 431763 428679 426615 424961
63451 424961 422951 420561 418453 417239 417069 417915 419908 423301 428242 434744 442748 452160 462916 475198
63437 475198 489560 506695 527092 551221 580230 616179 660983 714658 774314 834604 889151
63426 889151 932246 960461 973520 973765 964621 949493 931773 914919 901671 893222 889677 891302 898876
$$ packed form
63518I18588k7885l0001l1438l2058l1804l0945k9811k8474k6796k4713k2391
63507F02272k0177j8406j7184j6272j5279j3953j2296j0511q877p630o836o353
63495D48498n984n582n089m532m005l487k660j238M35J397J049j24j007r31l2
63480D16708J227K424L188L373L342L759M840N979O294N424L813K300J434J025
63466D65130M17o79j769k273k364k719l494m121m226m121m118l900l084k064j654
63451D24961k010k390k108j214j70Q46J993L393M941O502Q004R412J0756J2282
63437D75198J4362J7135K0397K4129K9009L5949M4804N3675N9656O0290N4547
63426H89151M3095K8215J3059K45r144j5128j7720j6854j3248q449l545J625P574
$$ plain form
63413 898876 912839 932626 957027 984683 1013873 1042193 1067073 1086763 1100691 1108955 1111736 1109386
63401 1109386 1102858 1093820 1084081 1074745 1065828 1056666 1046564 1034952 1021076 1003956 982926 958071
63389 958071 930007 899409 867001 833893 801541 771136 743094 717190 693070 670576 649749
63378 649749 630798 614113 600073 588626 579148 571017 564369 560055 558685 559846 562476 565859 570007
63365 570007 575179 581461 588986 598234 609797 623914 640441 659211 680355 704299 731525 762094
63353 762094 795285 829922 865330 901776 939507 977381 1012839 1043362 1067661 1085470 1096758
63342 1096758 1101648 1100907 1096091 1089110 1081631 1074567 1067772 1060350 1051472 1040733 1027597 1011039 990416
63329 990416 966469 940709 913908 886002 857572 830429 806226 785290 767519 753790 745648 744032
$$ packed form
63413H98876J3963J9787K4401K7656K9190K8320K4880J9690J3928Q264K781k350
63401A109386o528r038r739r336q917r162j0102j1612j3876j7120k1030k4855
63389I58071k8064l0598l2408l3108l2352l0405k8042k5904k4120k2494k0827
63378F49749j8951j6685j4040j1447r478q131o648m314j370J161K630L383M148
63365E70007N172O282P525R248J1563J4117J6527J8770K1144K3944K7226L0569
63353G62094L3191L4637L5408L6446L7731L7874L5458L0523K4299J7809J1288
63342A096758M890p41m816o981p479p064o795p422q878j0739j3136j6558k0623
63329I90416k3947k5760k6801k7906k8430k7143k4203k0936j7771j3729q142j616
$$ plain form
63317 744032 749056 760295 775673 789914 795770 788217 767570 738358 705707 673013 641966 613323
63305 613323 587243 563500 541894 522543 505759 491654 479789 469293 459484 450377 442342 435329
63293 435329 428834 422655 417085 412133 407105 401383 395245 389458 384372 379892 376030 372938 370538 368640
63279 368640 367255 366311 365157 363049 360164 357624 356311 356079 356257 356462 356716 357139 357775 358554 359257 359694 359968
63262 359968 360373 361041 361921 363075 364571 366102 367144 367664 368237 369324 370879 372901 375827 379924 384686
63247 384686 389382 393967 398916 404302 409687 414968 420775 427765 435905 444719 454014 464059 475213 487635
63233 487635 501280 516010 531707 548389 566211 585258 605293 625740 645918 665378 684160
63222 684160 702765 721743 741249 761028 780836 800692 820695 840815 861042 881512 902198
$$ packed form
63317G44032N024J1239J5378J4241N856p553k0647k9212l2651l2694l1047k8643
63305F13323k6080k3743k1606j9351j6784j4105j1865j0496r809r107q035p013
63293D35329o495o179n570m952n028n722o138n787n086m480l862l092k400j898
63279C68640j385r44j154k108k885k540j313k32J78K05K54M23O36P79P03M37K74
63262C59968M05O68Q80J154J496J531J042N20N73J087J555K022K926M097M762
63247C84686M696M585M949N386N385N281N807O990Q140Q814R295J0045J1154J2422
63233D87635J3645J4730J5697J6682J7822J9047K0035K0447K0178J9460J8782
63222F84160J8605J8978J9506J9779J9808J9856K0003K0120K0227K0470K0686
$$ plain form
63211 902198 922577 941868 959522 975162 988094 997317 1002100 1002144 997127 986647 970949 951271 928986
63198 928986 904817 879342 853746 829262 806019 783426 761792 742693 727410 715701 706559 699559
63186 699559 694959 692972 693534 696468 701437 708027 716305 726893 739939 754446 769294 784656 801594
63173 801594 820355 839851 858944 877500 895921 914210 931907 948540 963812 977458 989122
63162 989122 998240 1004045 1005955 1003928 998177 988554 974621 956343 934315 909244 881655 852281 822254
63149 822254 792524 763329 734532 706334 679472 654835 633015 614026 597312 582174 568235
63138 568235 555402 543462 532133 521598 512576 505604 500398 496100 491982 487824 483871 480598 478315
63125 478315 476861 475789 474927 474485 474576 474957 475421 476158 477522 479570 482010 484401 486356 487793 489082 490751
$$ packed form
63211I02198K0379J9291J7654J5640J2932R223M783M4n017j0480j5698j9678k2285
63198I28986k4169k5475k5596k4484k3243k2593k1634j9099j5283j1709r142p000
63186F99559m600j987N62K934M969O590Q278J0588J3046J4507J4848J5362J6938
63173H01594J8761J9496J9093J8556J8421J8289J7697J6633J5272J3646J1664
63162I89122R118N805J910k027n751r623j3933j8278k2028k5071k7589k9374l0027
63149H22254k9730k9195k8797k8198k6862k4637k1820j8989j6714j5138j3939
63138E68235j2833j1940j1329j0535r022o972n206m298m118m158l953l273k283
63125D78315j454j072q62m42R1L81M64P37J364K048K440K391J955J437J289J669
$$ plain form
63109 490751 492954 495482 498233 501243 504181 506354 507531 508324 509419 510753 511813 512402 512713 512889 512986 513214
63093 513214 513863 515050 516781 519057 521677 524133 526036 527477 528773 530078 531477 533049 534488 535087 534646
63078 534646 534083 534522 536001 537740 539482 541790 545010 548795 552942 557921 564173 571356 578811 586477 594919
63063 594919 604652 615725 627834 640604 653917 668233 684490 703471 725291 749554 775876 804188
63051 804188 834716 867839 903849 942689 983970 1027251 1072272 1118908 1167072 1216643 1267282
63040 1267282 1318317 1369019 1419083 1468676 1518031 1567259 1616550 1666216 1716329 1766518 1816226
63029 1816226 1864886 1911653 1955232 1994232 2027506 2053919 2071945 2079887 2076543 2061644 2035805 2000263
63017 2000263 1956550 1906162 1850500 1791206 1730317 1669797 1610892 1554092 1499809 1449020 1403309
$$ packed form
63109D90751K203K528K751L010K938K173J177P93J095J334J060N89L11J76R7K28
63093E13214O49J187J731K276K620K456J903J441J296J305J399J572J439N99m41
63078E34646n63M39J479J739J742K308L220L785M147M979O252P183P455P666Q442
63063E94919R733J1073J2109J2770J3313J4316J6257J8981K1820K4263K6322K8312
63051H04188L0528L3123L6010L8840M1281M3281M5021M6636M8164M9571N0639
63040A267282N1035N0702N0064M9593M9355M9228M9291M9666N0113N0189M9708
63029A816226M8660M6767M3579L9000L3274K6413J8026P942l344j4899k5839l5542
63017B000263m3713n0388n5662n9294o0889o0520n8905n6800n4283n0789m5711
$$ plain form
63006 1403309 1364265 1332704 1308303 1290087 1277386 1270265 1269057 1273760 1284010 1299269 1318712 1341189
62994 1341189 1365744 1392121 1420368 1450074 1480453 1511124 1542237 1573745 1605089 1635871 1666299
62983 1666299 1696469 1725488 1751735 1773802 1790837 1802105 1806707 1803770 1792671 1773185 1745724 1711320
62971 1711320 1671039 1625414 1574809 1520296 1463735 1406898 1350800 1295930 1242761 1191852 1143745
62960 1143745 1098912 1057496 1019062 982927 948935 917520 888899 862617 838131 815343 794118
62949 794118 773778 753719 734261 716251 699866 684407 669247 654428 640293 627106 615108
62938 615108 604388 594532 584898 575414 566617 558707 551160 543563 536233 529536 523105 516438 509953 504716
62924 504716 501176 498732 496536 494185 491655 489144 487160 486208 486148 486213 485850 485115 484073 482379 479911 477422
$$ packed form
63006A403309l9044l1561k4401j8216j2701p121j208M703J0250J5259J9443K2477
62994A341189K4555K6377K8247K9706L0379L0671L1113L1508L1344L0782L0428
62983A666299L0170K9019K6247K2067J7035J1268M602k937j1099j9486k7461l4404
62971A711320m0281m5625n0605n4513n6561n6837n6098n4870n3169n0909m8107
62960A143745m4833m1416l8434l6135l3992l1415k8621k6282k4486k2788k1225
62949G94118k0340k0059j9458j8010j6385j5459j5160j4819j4135j3187j1998
62938F15108j0720r856r634r484q797p910p547p597p330o697o431o667o485n237
62924E04716l540k444k196k351k530k511j984r52o0O5l63p35j042j694k468k489
$$ plain form
62908 477422 475902 475378 474950 474002 472831 471934 471262 470517 469830 469662 470219 471352 472870 474579 476120 477256
62892 477256 478324 479893 481831 483193 483357 482823 482531 482737 483054 483362 483998 485037 485975 486342 486297 486442 487266
62875 487266 488869 490878 492523 493130 492811 492444 492753 493622 494422 494732 494438 493382 491379 488509 485090 481373
62859 481373 477602 474380 472469 471971 471975 471472 470567 470393 471689 473778 475229 475376 474842 474646 475282 476734 478900
62842 478900 481509 483897 485370 485874 485961 486090 486246 486227 485989 485593 485085 484578 484312 484542 485388 486722 488069 488807
62824 488807 488759 488499 488749 489595 490657 491890 493646 495909 498137 500109 502418 505667 509508 512932 515388
62809 515388 517329 519719 523168 527437 531647 535073 537790 540473 543720 547842 553123 559687 567060 574505
62795 574505 582048 590593 600768 612214 624346 637161 650822 665133 680169 696999 716920 740190
$$ packed form
62908D77422j520n24m28r48j171q97o72p45o87j68N57J133J518J709J541J136
62892D77256J068J569J938J362J64n34k92K06L17L08O36J039R38L67m5J45Q24
62875D87266J603K009J645O07l19l67L09Q69Q00L10k94j056k003k870l419l717
62859D81373l771l222j911m98Mn03r05j74J296K089J451J47n34j96O36J452K166
62842D78900K609K388J473N04Q7J29J56j9k38l96n08n07k66K30Q46J334J347P38
62824D88807m8k60K50Q46J062J233J756K263K228J972K309L249L841L424K456
62809E15388J941K390L449M269M210L426K717K683L247M122N281O564P373P445
62795E74505P543Q545J0175J1446J2132J2815J3661J4311J5036J6830J9921K3270
$$ plain form
62783 740190 766288 795258 827971 865108 906744 953072 1004727 1062015 1124432 1191430 1263173
62772 1263173 1339957 1421030 1504379 1587665 1669092 1747434 1821512 1889744 1950107 2000405 2038698
62761 2038698 2063727 2075159 2073438 2059261 2033143 1995598 1947700 1891231 1828211 1760468 1689619
62750 1689619 1617157 1544293 1471876 1400533 1330786 1263097 1198149 1137072 1080880 1029534 981981
62739 981981 937405 896011 858463 825021 795522 769615 746609 725614 706311 689083 674003
62728 674003 660300 647480 636324 627884 621884 617015 612522 608606 605469 602955 601162 600514 601085 602617
62714 602617 605243 609418 615020 621272 627790 635127 644154 655487 669535 686404 705653 726888 750670
62701 750670 778129 809589 844392 882173 923372 968162 1015875 1066100 1119580 1177375 1239607
$$ packed form
62783G40190K6098K8970L2713L7137M1636M6328N1655N7288O2417O6998P1743
62772A263173P6784Q1073Q3349Q3286Q1427P8342P4078O8232O0363N0298L8293
62761B038698K5029J1432j721j4177k6118l7545m7898n6469o3020o7743p0849
62750A689619p2462p2864p2417p1343o9747o7689o4948o1077n6192n1346m7553
62739I81981m4576m1394l7548l3442k9499k5907k3006k0995j9303j7228j5080
62728F74003j3703j2820j1156q440o000m869m493l916l137k514j793o48N71J532
62714F02617K626M175N602O252O518P337R027J1333J4048J6869J9249K1235K3782
62701G50670K7459L1460L4803L7781M1199M4790M7713N0225N3480N7795O2232
$$ plain form
62690 1239607 1305513 1374052 1443884 1513221 1580346 1643937 1702432 1753534 1794888 1824965 1842962
62679 1842962 1848346 1841067 1821822 1791602 1751292 1702190 1646458 1586385 1523364 1458079 1391465 1324989
62667 1324989 1260149 1198129 1139657 1084794 1033064 984241 938749 896964 858543 823006 790556
62656 790556 761647 736002 712815 691702 672679 655261 638538 622373 607753 595509 585200
62645 585200 575678 566338 557353 548928 540855 532880 525270 518826 514310 511817 510666 509928 509084 508184 507478
62630 507478 506953 506231 504865 502818 500581 498724 497327 496025 494543 492967 491472 490110 488966 488206 487892
62615 487892 487959 488421 489321 490435 491470 492636 494563 497468 500840 504240 507914 512305 517424 523111 529560
62600 529560 537152 546056 556392 568510 582726 599115 617865 639465 664116 691436 721170 753686
$$ packed form
62690A239607O5906O8539O9832O9337O7125O3591N8495N1102M1354L0077J7997
62679A842962N384p279j9245l0220m0310m9102n5732o0073o3021o5285o6614o6476
62667A324989o4840o2020n8472n4863n1730m8823m5492m1785l8421l5537l2450
62656G90556k8909k5645k3187k1113j9023j7418j6723j6165j4620j2244j0309
62645E85200r522r340q985q425q073p975p610o444m516k493j151p38q44r00p06
62630E07478n25p22j366k047k237j857j397j302j482j576j495j362j144p60l14
62615D87892O7M62R00J114J035J166J927K905L372L400L674M391N119N687O449
62600E29560P592Q904J0336J2118J4216J6389J8750K1600K4651K7320K9734L2516
$$ plain form
62588 753686 789174 826825 865567 905168 945665 985901 1023619 1056951 1084956 1106723 1121129
62577 1121129 1127918 1128169 1123060 1112654 1096334 1073993 1046433 1015018 981401 947247 913678 880933
62565 880933 848769 817086 786134 756388 728384 702496 678709 656763 636535 618096 601389
62554 601389 586212 572539 560547 550218 541182 533021 525411 517980 510485 503214 496792 491429 486830
62541 486830 483051 480905 481052 482986 485336 487013 487791 488075 488507 489540 490990 492134 492648 493313 495327 498966
62525 498966 503381 507747 512192 517427 523897 531671 540916 552063 565436 580900 598031 616643 637140
62512 637140 660316 686713 716204 748250 782474 818770 856857 896058 935666 975198 1013926
62501 1013926 1050393 1082948 1110813 1134120 1152725 1165535 1171465 1170703 1164569 1154333 1140727 1124506
$$ packed form
62588G53686L5488L7651L8742L9601M0497M0236L7718L3332K8005K1767J4406
62577A121129O789K51n109j0406j6320k2341k7560l1415l3617l4154l3569l2745
62565H80933l2164l1683l0952k9746k8004k5888k3787k1946k0228j8439j6707
62554F01389j5177j3673j1992j0329r036q161p610p431p495p271o422n363m599
62541D86830l779k146J47J934K350J677P78K84M32J033J450J144N14O65K014L639
62525D98966M415M366M445N235O470P774R245J1147J3373J5464J7131J8612K0497
62512F37140K3176K6397K9491L2046L4224L6296L8087L9201L9608L9532L8728
62501A013926L6467L2555K7865K3307J8605J2810N930p62o134j0236j3606j6221
$$ plain form
62489 1124506 1106842 1089043 1072314 1057821 1046427 1038187 1032652 1029896 1030788 1035946 1044901 1056668 1070635
62476 1070635 1086293 1102346 1116782 1127918 1135132 1138691 1139141 1136619 1130310 1118576 1100010 1074556
62464 1074556 1043596 1009142 973010 936309 899257 861566 823312 785330 748647 713892 681557
62453 681557 652307 626464 603481 582607 563942 548225 535734 526008 518497 512764 508064 503528
62441 503528 498963 494886 491618 488960 486872 485760 485798 486591 487817 489568 491661 493320 494137 494779 495988
62426 495988 497217 497042 494827 491314 487564 484006 480598 477270 473873 470135 466118 462467 459742 457602
62412 457602 455026 451424 447234 443263 439827 436787 434180 432307 431175 430325 429376 428325 427196 425809 424267
62397 424267 423216 423113 423544 423852 424242 425621 428329 431671 434816 437633 440382 443067 445471 447626 449942
$$ packed form
62489A124506j7664j7799j6729j4493j1394q240n535k756Q92N158Q955J1767J3967
62476A070635J5658J6053J4436J1136P214L559M50k522o309j1734j8566k5454
62464A074556l0960l4454l6132l6701l7052l7691l8254l7982l6683l4755l2335
62453F81557k9250k5843k2983k0874j8665j5717j2491r726p511n733m700m536
62441E03528m565m077l268k658k088j112L8P93J226J751K093J659Q17O42J209
62426D95988J229j75k215l513l750l558l408l328l397l738m017l651k725k140
62412D57602k576l602m190l971l436l040k607j873j132q50r49j051j129j387j542
62397D24267j051j03M31L08L90J379K708L342L145K817K749K685K404K155K316
$$ plain form
62382 449942 452905 456655 460800 464735 468423 472715 478524 485746 493405 500754 507710 514273 520255 525891
62368 525891 532099 539699 548682 558543 568975 580007 591922 605418 621515 640793 662984 687717
62356 687717 715441 747129 783223 823329 866976 914197 965182 1019516 1075818 1132025 1185926
62345 1185926 1235575 1279298 1315580 1343279 1362102 1372744 1376454 1374490 1367775 1356619 1340555 1318798
62333 1318798 1291183 1258615 1222515 1184098 1144323 1104187 1064685 1026519 990074 955553 922931
62322 922931 891995 862781 835852 811779 790235 769867 749249 727902 706396 685582 665897
62311 665897 647357 629934 613658 598405 583967 570525 558769 549231 541675 535412 530039 525465
62299 525465 521453 517711 514391 511929 510240 508597 506478 504065 501741 499594 497672 496283 495659 495646 496026
$$ packed form
62382D49942K963L750M145L935L688M292N809P222P659P349O956O563N982N636
62368E25891O208P600Q983R861J0432J1032J1915J3496J6097J9278K2191K4733
62356F87717K7724L1688L6094M0106M3647M7221N0985N4334N6302N6207N3901
62345A185926M9649M3723L6282K7699J8823J0642L710j964o715j1156j6064k1757
62333A318798k7615l2568l6100l8417l9775m0136l9502l8166l6445l4521l2622
62322I22931l0936k9214k6929k4073k1544k0368k0618k1347k1506k0814j9685
62311F65897j8540j7423j6276j5253j4438j3442j1756r538p556o263n373m574
62299E25465m012l742l320k462j689j643k119k413k324k147j922j389o24j3L80
$$ plain form
62284 496026 496848 498205 499999 502179 504893 508066 511174 513751 515891 518044 520604 523932 528290 533346
62270 533346 538143 542062 545552 549464 553979 558814 564291 571483 581266 593778 608907 626775 647532
62257 647532 671104 697510 727252 761154 799888 843747 892725 946516 1004234 1064145 1123823
62246 1123823 1180819 1233182 1279359 1317995 1348318 1370668 1385981 1394503 1395413 1387916 1372236 1349266
62234 1349266 1319775 1284442 1244263 1200364 1153650 1105078 1056007 1007780 961145 916543 874691
62223 874691 836330 801557 770016 741591 716301 693569 672354 652219 633740 617632 603894
62212 603894 591967 581251 571275 561734 552720 544630 537631 531353 525275 519262 513580 508544 504286 500739
62198 500739 497796 495574 494490 494910 496702 499383 502710 506941 512400 518999 526265 533732 541217 548793
$$ packed form
62284D96026Q22J357J794K180K714L173L108K577K140K153K560L328M358N056
62270E33346M797L919L490L912M515M835N477P192R783J2512J5129J7868K0757
62257F47532K3572K6406K9742L3902L8734M3859M8978N3791N7718N9911N9678
62246A123823N6996N2363M6177L8636L0323K2350J5313Q522R10p497j5680k2970
62234A349266k9491l5333m0179m3899m6714m8572m9071m8227m6635m4602m1852
62223H74691l8361l4773l1541k8425k5290k2732k1215k0135j8479j6108j3738
62212F03894j1927j0716r976r541r014q090o999o278o078o013n682n036m258l547
62198E00739k943k222j084M20J792K681L327M231N459O599P266P467P485P576
$$ plain form
62184 548793 556609 564762 573396 582765 592928 603316 612984 621504 629379 637245 644898 651487 656523 660380
62170 660380 663962 668241 674036 681825 691801 704378 720499 741099 766326 795666 828696 865193
62158 865193 904575 945715 987367 1028282 1066875 1101302 1130188 1153053 1170037 1181575 1188320 1190830
62146 1190830 1188995 1182149 1169948 1152932 1132100 1108314 1082372 1055351 1028604 1003510 981246 962463
62134 962463 947067 934642 925205 919243 916906 917609 920631 925624 932225 939637 947140 954797 963128 972178
62120 972178 981339 990056 998304 1006374 1014536 1022985 1031788 1040573 1048256 1053189 1053826 1049611 1041442 1031127
62106 1031127 1020195 1009243 998456 988353 979584 972069 964775 956559 947173 937453 928713 922041 918011
62093 918011 916808 918402 922498 928428 935390 942871 950689 958533 965816 972284 978577 985747 994226 1003617
$$ packed form
62184E48793P816Q153Q634R369J0163J0388R668Q520P875P866P653O589N036L857
62170F60380L582M279N795P789R976J2577J6121K0600K5227K9340L3030L6497
62158H65193L9382M1140M1652M0915L8593L4427K8886K2865J6984J1538O745K510
62146A190830j835o846j2201j7016k0832k3786k5942k7021k6747k5094k2264j8783
62134I62463j5396j2425r437n962k337P03L022M993O601P412P503P657Q331R050
62120I72178R161Q717Q248Q070Q162Q449Q803Q785P683M933O37m215q169j0315
62106A031127j0932j0952j0787j0103q769p515p294q216r386r720q740o672m030
62093I18011j203J594M096N930O962P481P818P844P283O468O293P170Q479R391
$$ plain form
62079 1003617 1013636 1024839 1038134 1053769 1071164 1089670 1109143 1129656 1150942 1172373 1193402
62068 1193402 1213719 1232982 1250690 1266606 1281203 1295479 1310213 1325546 1341361 1357958 1376082
62057 1376082 1396219 1417992 1440399 1462497 1483576 1502692 1518528 1530162 1537805 1542346 1544115 1542445
62045 1542445 1536417 1525549 1509553 1487869 1460010 1426312 1388006 1346511 1302796 1257298 1210153
62034 1210153 1161521 1111929 1062415 1014304 968815 926817 888714 854401 823451 795492 770372
62023 770372 747923 727854 709978 694251 680359 667552 655158 643008 631061 618982 606595
62012 606595 594511 583718 574549 566534 559195 552490 546528 541437 537630 535600 535265 535955 537261 539417
61998 539417 542629 546542 550722 555202 560048 564694 568273 570485 571669 572005 571114 568637 564883 560652 556401
$$ packed form
62079A003617J0019J1203J3295J5635J7395J8506J9473K0513K1286K1431K1029
62068A193402K0317J9263J7708J5916J4597J4276J4734J5333J5815J6597J8124
62057A376082K0137K1773K2407K2098K1079J9116J5836J1634P643M541J769j670
62045A542445o028j0868j5996k1684k7859l3698l8306m1495m3715m5498m7145
62034A210153m8632m9592m9514m8111m5489m1998l8103l4313l0950k7959k5120
62023G70372k2449k0069j7876j5727j3892j2807j2394j2150j1947j2079j2387
62012F06595j2084j0793r169q015p339o705n962n091l807k030l35O90J306K156
61998E39417L212L913M180M480M846M646L579K212J184L36q91k477l754m231m251
$$ plain form
61983 556401 551692 545578 537594 528363 519067 510353 501938 493321 484614 476481 469521 463941 459689 456550
61969 456550 454071 451733 449381 447418 446432 446627 447653 448966 450295 451722 453376 455229 457292 459916 463656
61954 463656 468711 474581 480449 485987 491700 498298 505819 513607 521295 529439 538792 549294 560411 572408
61940 572408 586484 603360 622449 642879 664603 687831 711935 735906 759671 784014 809181
61929 809181 834375 858722 881891 903591 923283 940782 956441 970178 980833 987040 988471 985895
61917 985895 980351 972647 963344 952804 941458 930290 920794 914100 910363 909296 911013 916008 924596
61904 924596 936868 952919 972473 994148 1015588 1034639 1050263 1062285 1070518 1074403 1073416 1067589
61892 1067589 1057385 1043174 1025153 1003987 981207 958459 936340 914311 891772 868848 846132
$$ packed form
61983E56401m709o114p984r231r296q714q415q617q707q133o960n580m252l139
61969D56550k479k338k352j963r86J95J026J313J329J427J654J853K063K624L740
61954D63656N055N870N868N538N713O598P521P788P688Q144R353J0502J1117J1997
61940E72408J4076J6876J9089K0430K1724K3228K4104K3971K3765K4343K5167
61929H09181K5194K4347K3169K1700J9692J7499J5659J3737J0655O207J431k576
61917I85895n544p704r303j0540j1346j1168r496o694l737j067J717M995Q588
61904I24596J2272J6051J9554K1675K1440J9051J5624J2022Q233L885r87n827
61892A067589j0204j4211j8021k1166k2780k2748k2119k2029k2539k2924k2716
$$ plain form
61881 846132 824175 803436 784223 766363 749193 732253 715798 700487 686791 674891 664782
61870 664782 656246 649009 643227 639522 638232 638877 640594 642867 645574 648729 652579 657713 664646 673506
61856 673506 684411 697868 714303 733405 754494 777485 803048 831802 863778 898685 936303
61845 936303 976401 1018465 1061529 1104196 1145028 1183212 1218737 1251559 1280629 1304047 1320219
61834 1320219 1328695 1330094 1325574 1316435 1303904 1289184 1273771 1259537 1248252 1241011 1238275 1240249 1247035
61821 1247035 1258569 1274598 1294420 1316305 1337528 1355535 1368992 1377326 1379549 1374317 1361048 1340224
61809 1340224 1312550 1278667 1239972 1198783 1157015 1115118 1072933 1031122 991074 953652 918789
61798 918789 886228 855927 827619 800673 774833 750701 729125 710299 693723 678818 665269
$$ packed form
61881H46132k1957k0739j9213j7860j7170j6940j6455j5311j3696j1900j0109
61870F64782q536p237n782l705j290O45J717K273K707L155L850N134O933Q860
61856F73506J0905J3457J6435J9102K1089K2991K5563K8754L1976L4907L7618
61845I36303M0098M2064M3064M2667M0832L8184L5525L2822K9070K3418J6172
61834A320219Q476J399m520r139j2531j4720j5413j4234j1285p241k736J974O786
61821A247035J1534J6029J9822K1885K1223J8007J3457Q334K223n232j3269k0824
61809A340224k7674l3883l8695m1189m1768m1897m2185m1811m0048l7422l4863
61798I18789l2561l0301k8308k6946k5840k4132k1576j8826j6576j4905j3549
$$ plain form
61787 665269 652962 642005 632712 625131 618536 611812 604543 597426 591390 586612 582595 578924 575497 572227
61773 572227 569013 565999 563480 561492 559823 558402 557284 556233 554777 552852 551028 549829 549191 548802 548643
61758 548643 548978 550010 551749 553951 556055 557519 558406 559275 560287 560870 560526 559496 558280 557072 556111 555997
61742 555997 556876 557757 557523 556437 555764 556019 556537 556856 557525 559169 561635 564574 568164 572634 577574 582368
61726 582368 586966 591624 596169 600268 604307 609281 615610 622530 628887 634180 638626 642576 646275 650066
61712 650066 654326 658960 663125 665742 666277 664915 662001 657642 651966 645506 638981 632722 626537 620157
61698 620157 613616 607234 601368 596195 591586 587199 582820 578589 574756 571342 568231 565453 563057 560754
61684 560754 558054 554829 551468 548417 545878 543997 542886 542229 541245 539409 537095 535166 534064 533548 533244
$$ packed form
61787F65269j2307j0957r293p581o595o724p269p117o036m778m017l671l427l270
61773E72227l214l014k519j988j669j421j118j051j456j925j824j199o38l89j59
61758E48643L35J032J739K202K104J464Q87Q69J012N83l44j030j216j208r61j14
61742E55997Q79Q81k34j086o73K55N18L19O69J644K466K939L590M470M940M794
61726E82368M598M658M545M099M039M974O329O920O357N293M446L950L699L791
61712F50066M260M634M165K617N35j362k914m359n676o460o525o259o185o380
61698F20157o541o382n866n173m609m387m379m231l833l414l111k778k396k303
61684E60754k700l225l361l051k539j881j111o57r84j836k314j929j102n16l04
$$ plain form
61669 533244 533108 533343 534143 535561 537394 539128 540190 540417 540164 539875 539653 539348 538845 538072 536908 535426 534210
61652 534210 533992 534749 535498 535314 534372 533700 534067 535483 537621 540137 542563 544478 546089 548237 551490 555471
61636 555471 559294 562324 564278 564970 564407 562931 560871 558187 554738 550702 546397 541852 536880 531428 525598
61621 525598 519584 513878 509170 505614 502576 499658 497545 497082 497787 498245 497869 497273 496762 495531 492781 488754
61605 488754 484138 479201 474160 469661 466025 462464 457911 452422 446992 442107 437297 432157 427073 422634
61591 422634 418815 415070 410983 406616 402381 398669 395471 392401 389261 386489 384667 383591 382186 379558
61577 379558 375925 372369 369825 368380 367354 365856 363389 360176 356969 354499 353001 352127 351271 350018 348410
61562 348410 346810 345502 344550 344062 344330 345437 346865 347812 347903 347346 346438 345329 344336 344007 344525 345343 345772
$$ packed form
61669E33244j36K35Q00J418J833J734J062K27k53k89k22l05n03p73j164j482j216
61652E34210k18P57P49j84r42o72L67J416K138K516K426J915J611K148L253L981
61636E55471L823L030J954O92n63j476k060k684l449m036m305m545m972n452n830
61621E25598o014n706m708l556l038k918k113m63P05M58l76n96n11j231k750m027
61605D88754m616m937n041m499l636l561m553n489n430m885m810n140n084m439
61591D22634l819l745m087m367m235l712l198l070l140k772j822j076j405k628
61577C79558l633l556k544j445j026j498k467l213l207k470j498q74q56j253j608
61562C48410j600j308r52m88K68J107J428R47R1n57r08j109r93l29N18Q18M29
$$ plain form
61545 345772 345779 345868 346317 346929 347504 348129 348890 349649 350308 351070 352299 354270 357110 360612 364016 366385 367499
61528 367499 368111 368992 370016 370528 370306 369613 368470 366545 363847 361002 358647 356884 355387 353692 351328
61513 351328 348177 344858 342307 340788 339736 338705 337918 337645 337575 337245 336577 335611 334191 332450 331111 330641
61497 330641 330443 329582 328055 326646 325767 325191 324763 324515 324041 322621 320232 317753 315980 315039 314971 316125 318475
61480 318475 321041 322569 322656 321984 321695 322660 324951 327741 329994 331381 332248 332704 332435 331620 331230 331824 332664
61463 332664 332812 332655 333417 335320 337203 338156 338626 339420 340310 340334 339217 337783 336916 336664 336619 336769 337559 339214
61445 339214 341369 343436 345053 346088 346500 346454 346440 346999 348333 350292 352615 355088 357635 360457 363908 367913
61429 367913 371695 374438 376252 378133 380933 384569 388203 390880 392127 392339 392674 394264 397452 401911 407227
$$ packed form
61545C45772PQ9M49O12N75O25P61P59O59P62J229J971K840L502L404K369J114
61528C67499O12Q81J024N12k22o93j143j925k698k845k355j763j497j695k364
61513C51328l151l319k551j519j052j031p87k73p0l30o68r66j420j741j339m70
61497C30641j98q61j527j409q79n76m28k48m74j420k389k479j773r41o8J154K350
61480C18475K566J528Q7o72k89R65K291K790K253J387Q67M56k69q15l90N94Q40
61463C32664J48j57P62J903J883R53M70P94Q90K4j117j434q67k52m5J50P90J655
61445C39214K155K067J617J035M12m6j4N59J334J959K323K473K547K822L451M005
61429C67913L782K743J814J881K800L636L634K677J247K12L35J590L188M459N316
$$ plain form
61414 407227 412861 417789 420993 422506 423354 424232 424806 424512 423339 421360 418228 413819 409007 405031 402267
61399 402267 400187 398322 396604 394841 392537 389456 385954 382624 379917 378075 377012 376149 374737 372577
61385 372577 370233 368505 367884 368471 370043 372026 373692 374659 375165 375784 376935 378636 380536 382134 383162
61370 383162 383807 384447 385149 385669 386008 386632 387888 389422 390587 391378 392612 395053 398667 402889 407323 411871
61354 411871 416355 420466 424160 427806 431857 436709 443007 451589 462691 475384 488261 500625 512627
61341 512627 524353 535326 545115 554012 562733 571615 580298 588046 594182 598384 600813 601957 602235 601747
61327 601747 600477 598548 596109 593046 589104 584387 579569 575379 571895 568548 564911 561312 558496 556825
61313 556825 556028 555623 555312 555014 554866 555218 556323 558093 560557 564409 570407 578129 586165 593910 602321 612250
$$ packed form
61414D07227N634M928L204J513Q48Q78N74k94j173j979l132m409m812l976k764
61399D02267k080j865j718j763k304l081l502l330k707j842j063q63j412k160
61385C72577k344j728o21N87J572J983J666R67N06O19J151J701J900J598J028
61370C83162O45O40P02N20L39O24J256J534J165P91J234K441L614M222M434M548
61354D11871M484M111L694L646M051M852O298Q582J1102J2693J2877J2364J2002
61341E12627J1726J0973R789Q897Q721Q882Q683P748O136M202K429J144K78m88
61327F01747j270j929k439l063l942m717m818m190l484l347l637l599k816j671
61313E56825p97m05l11k98j48L52J105J770K464L852N998P722Q036P745Q411R929
$$ plain form
61297 612250 622772 631972 638770 643113 645015 644639 642959 641005 638450 634137 628089 621803 616368 611499
61283 611499 606766 602545 599085 595740 591870 587771 584036 580765 578053 576509 576519 577657 579505 582403 586667
61268 586667 591795 597319 603783 611820 620761 629221 636723 643710 650290 656253 662281 669891 679883 691765
61254 691765 704974 719703 736032 752975 768948 782796 794041 802574 808566 812415 814428 814602 812836
61241 812836 809177 803762 796738 788356 778970 768915 758589 748670 740009 733100 727683 722867 717700 711865
61227 711865 705998 701171 697924 695948 694818 694637 695628 697426 699271 700782 702185 703914 706316 709591 713559
61212 713559 717545 720918 723767 726757 730312 734214 737920 740991 743279 744998 746599 748395 750379 752561
61198 752561 755273 759010 764231 771562 781750 794991 810590 827791 846734 868078 891861 917195
$$ packed form
61297F12250J0522R200O798M343J902l76j680j954k555m313o048o286n435m869
61283F11499m733m221l460l345l870m099l735l271k712j544J0J138J848K898M264
61268E86667N128N524O464Q037Q941Q460P502O987O580N963O028P610R992J1882
61254F91765J3209J4729J6329J6943J5973J3848J1245Q533N992L849K013J74j766
61241H12836l659n415p024q382r386j0055j0326r919q661o909n417m816n167n835
61227G11865n867m827l247j976j130j81R91J798J845J511J403J729K402L275L968
61212G13559L986L373K849K990L555L902L706L071K288J719J601J796J984K182
61198G52561K712L737N221P331J0188J3241J5599J7201J8943K1344K3783K5334
$$ plain form
61186 917195 942946 968182 992085 1013986 1033544 1050589 1064916 1076683 1086819 1096397 1105546 1113481
61174 1113481 1119573 1123954 1126978 1128600 1128470 1126345 1122275 1116558 1109543 1101307 1091611 1080263 1067272 1052499
61160 1052499 1035565 1016519 996172 975339 954091 932318 910609 889868 870354 851900 834890
61149 834890 820131 807801 797352 788566 781849 777315 774271 771870 769688 767422 764563 760593 755147
61136 755147 747985 739325 730252 722152 715569 710115 705488 701972 699885 699279 700456 704109 710654 719909
61122 719909 731589 745609 761727 779509 798886 820207 843569 868706 895714 925145 957023
61111 957023 990316 1023855 1057304 1090996 1125328 1160517 1196265 1231204 1263361 1291696 1316781
61100 1316781 1339591 1360201 1378077 1392873 1404135 1410679 1411268 1405889 1395697 1381672 1363851 1341913
$$ packed form
61186I17195K5751K5236K3903K1901J9558J7045J4327J1767J0136R578R149P935
61174A113481O092M381L024J622j30k125m070n717p015q236r696j1348j2991j4773
61160A052499j6934j9046k0347k0833k1248k1773k1709k0741j9514j8454j7010
61149H34890j4759j2330j0449q786o717m534l044k401k182k266k859l970n446
61136G55147p162q660r073q100o583n454m627l516k087o06J177L653O545R255
61122G19909J1680J4020J6118J7782J9377K1321K3362K5137K7008K9431L1878
61111I57023L3293L3539L3449L3692L4332L5189L5748L4939L2157K8335K5085
61100A316781K2810K0610J7876J4796J1262O544N89n379j0192j4025j7821k1938
$$ plain form
61088 1341913 1315974 1286682 1254888 1221481 1187354 1153243 1119494 1086051 1052887 1020531 989884
61077 989884 961329 934330 908373 883960 861983 842315 823932 806482 790810 777605 766358
61066 766358 756209 747067 739266 732677 726952 722323 719485 718703 719483 721027 722754 724541 726817 730313
61052 730313 735500 742379 750811 760694 771743 783540 796046 809664 824655 840992 859049 879865
61040 879865 904249 931914 961792 992869 1024533 1056619 1089469 1123601 1158999 1195150 1231976
61029 1231976 1270176 1310241 1351683 1393735 1436378 1480136 1525147 1570832 1616278 1660708 1704046
61018 1704046 1747459 1793124 1843260 1899667 1964047 2037892 2121657 2214864 2317652 2432031 2561785
61007 2561785 2712348 2891288 3107858 3371313 3690429 4075350 4539482 5100142 5779798
$$ packed form
61088A341913k5939k9292l1794l3407l4127l4111l3749l3443l3164l2356l0647
61077I89884k8555k6999k5957k4413k1977j9668j8383j7450j5672j3205j1247
61066G66358j0149r142p801o589n725m629k838p82P80J544J727J787K276L496
61052G30313N187O879Q432R883J1049J1797J2506J3618J4991J6337J8057K0816
61040H79865K4384K7665K9878L1077L1664L2086L2850L4132L5398L6151L6826
61029A231976L8200M0065M1442M2052M2643M3758M5011M5685M5446M4430M3338
61018A704046M3413M5665N0136N6407O4380P3845Q3765R3207J02788J14379J29754
61007B561785J50563J78940K16570K63455L19116L84921M64132N60660O79656
$$ plain form
60998 5779798 6608193 7621988 8860906 10362045 12146514 14186123 16358152 18432866
60990 18432866 20138253 21283395 21854154 22006907 21975216 21971798 22141238 22543826 23130304
60981 23130304 23721209 24046712 23860924 23061606 21725947 20044695 18219986 16400866 14674237
60972 14674237 13082228 11639055 10343160 9187452 8164755 7266867 6482680 5799925
60964 5799925 5207803 4696563 4255671 3874077 3541958 3251260 2995144 2768051 2566115
60955 2566115 2386635 2227150 2085426 1959912 1849517 1752970 1668725 1595223 1530803 1473502
60945 1473502 1421248 1372171 1324775 1278312 1233198 1190514 1150682 1113032 1076901 1042525 1010317
60934 1010317 979796 949979 920602 892320 865753 840887 817419 795292 774692 755706 738024
$$ packed form
60998E779798Q28395J013795J238918J501139J784469K039609K172029K074714
60990A8432866J705387J145142N70759J52753l1691l418J69440M02588N86478
60981B3130304N90905L25503j85788p99318j335659j681252j824709j819120j726629
60972A4674237j592009j443173j295895j155708j022697q97888p84187o82755
60964E799925n92122n11240m40892l81594l32119k90698k56116k27093k01936
60955B566115j79480j59485j41724j25514j10395r6547q4245p3502o4420n7301
60945A473502n2254m9077m7396m6463m5114m2684l9832l7650l6131l4376l2208
60934A010317l0521k9817k9377k8282k6567k4866k3468k2127k0600j8986j7682
$$ plain form
60923 738024 721000 704241 688210 673920 661807 651200 641141 631422 622543 615013 609072 604754
60911 604754 601677 598943 595829 592631 590389 589689 590067 590662 591135 591808 593142 595266 597905 600619 603109
60896 603109 605299 607125 608347 608667 607984 606484 604527 602508 600650 598779 596383 593045 588728 583551 577440
60881 577440 570296 562471 554741 547660 541067 534397 527417 520545 514480 509620 505849 502713 499729 496659
60867 496659 493675 491259 489814 489349 489633 490590 492321 494848 498145 502486 508258 515167 521993 527605 532052
60852 532052 536268 540911 545932 551159 556677 562495 568347 574044 579693 585287 590370 594340 596949 598385
60838 598385 599034 599282 599261 598603 596627 593094 588666 584373 580616 576934 572792 568346 564285 561006 558246
60823 558246 555561 552934 550668 548782 546797 544096 540243 535025 528623 521910 516116 511768 508195 504363
$$ packed form
60923G38024j7024j6759j6031j4290j2113j0607j0059r719q879p530n941m318
60911F04754l077k734l114l198k242p00L78N95M73O73J334K124K639K714K490
60896F03109K190J826J222L20o83j500j957k019j858j871k396l338m317n177o111
60881E77440p144p825p730p081o593o670o980o872o065m860l771l136k984l070
60867D96659k984k416j445m65K84R57J731K527L297M341N772O909O826N612M447
60852E32052M216M643N021N227N518N818N852N697N649N594N083L970K609J436
60838E98385O49K48k1o58j976l533m428m293l757l682m142m446m061l279k760
60823E58246k685k627k266j886j985k701l853n218o402o713n794m348l573l832
$$ plain form
60809 504363 500035 495750 491937 488473 485073 481712 478678 476473 475537 475790 476507 476958 477066 477174 477404 477675
60793 477675 478149 479088 480321 481412 482356 483624 485474 487739 490372 493672 497806 502564 507750 513372 519314
60778 519314 525315 531434 538018 544983 551660 557756 563913 570854 578346 585600 592461 599604 607654 616607
60764 616607 626198 636341 646942 657547 667448 676200 683949 691204 698375 705645 713294 721811 731387
60751 731387 741462 751200 760433 769789 779856 790635 801894 813585 825701 838049 850416 862691
60739 862691 874650 886005 896913 908103 920100 932556 944727 956392 967910 979470 990710
60728 990710 1001094 1010343 1018435 1025389 1031114 1035368 1037882 1038631 1037854 1035644 1031612 1025247 1016559 1006157
60714 1006157 994699 982551 970011 957489 945161 932563 918931 904013 888369 872740 857384
$$ packed form
60809E04363m328m285l813l464l400l361l034k205r36K53P17M51J08J08K30K71
60793D77675M74R39J233J091R44J268J850K265K633L300M134M758N186N622N942
60778E19314O001O119O584O965O677O096O157O941P492P254O861P143Q050Q953
60764F16607R591J0143J0601J0605R901Q752P749P255P171P270P649Q517R576
60751G31387J0075R738R233R356J0067J0779J1259J1691J2116J2348J2367J2275
60739H62691J1959J1355J0908J1190J1997J2456J2171J1665J1518J1560J1240
60728I90710J0384R249Q092O954N725M254K514P49p77k210m032o365q688j0402
60714A006157j1458j2148j2540j2522j2328j2598j3632j4918j5644j5629j5356
$$ plain form
60703 857384 842210 827322 812967 798970 784676 769688 754352 739334 725035 711605 699064
60692 699064 687050 674771 661742 648402 635600 623655 612380 601762 592022 583072 574536 566284
60680 566284 558404 550675 542750 534984 528421 523740 520651 518399 516253 513387 509106 503700 498475 494494
60666 494494 491658 489370 487472 486015 484608 482766 480640 478778 477293 475863 474467 473602 473718 474883 476915
60651 476915 479443 481817 483422 484267 485077 486734 489655 493558 497594 500807 502782 503898 504822 505799 506567
60636 506567 506793 506410 505639 504904 504622 504886 505488 506382 507847 509910 511895 513044 513543 514388 516078 517828 518372
60619 518372 517328 515462 513713 512250 510542 508080 504836 501102 497168 493235 489431 485786 482347 479395
60605 479395 477325 476094 475084 473781 472340 471076 469702 467639 464959 462296 459840 457176 454311 452066
$$ packed form
60703H57384j5174j4888j4355j3997j4294j4988j5336j5018j4299j3430j2541
60692F99064j2014j2279j3029j3340j2802j1945j1275j0618r740q950q536q252
60680E66284p880p729p925p766o563m681l089k252k146k866m281n406n225l981
60666D94494k836k288j898j457j407j842k126j862j485j430j396q65J16J165K032
60651D76915K528K374J605Q45Q10J657K921L903M036L213J975J116R24R77P68
60636E06567K26l83p71p35k82K64O02Q94J465K063J985J149M99Q45J690J750N44
60619E18372j044j866j749j463j708k462l244l734l934l933l804l645l439k952
60605D79395k070j231j010j303j441j264j374k063k680k663k456k664k865k245
$$ plain form
60591 452066 451019 450723 450491 450403 450875 451631 451883 451345 450428 449471 448390 447166 446140 445609 445449 445319 445019 444589
60573 444589 444240 444316 445199 447141 450144 453952 458155 462494 467161 472668 479388 487343 496420 506507 517251
60558 517251 527910 537649 545806 551832 555260 555982 554403 551213 547158 543008 539377 536381 533811 531783
60544 531783 530855 531306 532760 534856 537891 542299 547754 553378 558811 564688 571902 580536 589537 597421 603366
60529 603366 607574 610424 611584 610503 607693 604686 602490 600803 599076 597592 596868 596709 596627 596705 597256 598060
60513 598060 598781 599819 601783 604269 606121 606978 607738 609361 611897 614840 617718 620174 622166 624501 628627
60498 628627 635546 645278 657613 672951 692061 715268 742200 772188 804694 839301 875206 910621
60486 910621 942865 969391 988640 999714 1001604 993481 975809 950645 920656 888060 854370 820510
$$ packed form
60591D52066j047k96k32q8M72P56K52n38r17r57j081j224j026n31j60j30l00m30
60573D44589l49P6Q83J942L003L808M203M339M667N507O720P955R077J0087J0744
60558E17251J0659R739Q157O026L428P22j579l190m055m150l631k996k570k028
60544E31783r28M51J454K096L035M408N455N624N433N877P214Q634R001P884N945
60529F03366M208K850J160j081k810l007k196j687j727j484p24j59q2P8N51Q04
60513E98060P21J038J964K486J852Q57P60J623K536K943K878K456J992K335M126
60498F28627O919R732J2335J5338J9110K3207K6932K9988L2506L4607L5905L5415
60486I10621L2244K6526J9249J1074J890q123j7672k5164k9989l2596l3690l3860
$$ plain form
60474 820510 787057 754803 725115 699180 676741 656160 636076 616675 599126 584220 571807
60463 571807 561103 551121 541102 531050 521779 514121 508084 502954 498128 493653 489940 487094 484574
60450 484574 481558 477690 473384 469340 465942 463266 461370 460200 459373 458529 457798 457460 457162 456031 453697
60435 453697 450716 447832 445311 443220 441850 441404 441559 441668 441291 440329 438935 437573 436917 437264 438079 438401
60419 438401 437763 436618 435841 435877 436361 436619 436526 436695 437681 439299 441107 443248 446120 449255 451363 451849 451648
60402 451648 452017 453004 453698 453648 453338 453399 454077 455531 457927 460936 463632 465368 466553 468111 470287 472417
60386 472417 473937 475187 476944 479420 482128 484658 487139 489773 492324 494392 495989 497485 499052 500473
60372 500473 501507 502188 502768 503579 504935 506919 509200 511240 512744 513831 514814 515916 517119 518167 518822
$$ packed form
60474H20510l3453l2254k9688k5935k2439k0581k0084j9401j7549j4906j2413
60463E71807j0704r982j0019j0052r271p658o037n130m826m475l713k846k520
60450D84574l016l868m306m044l398k676j896j170q27q44p31l38k98j131k334
60435D53697k981k884k521k091j370m46J55J09l77r62j394j362o56L47Q15L22
60419D38401o38j145p77L6M84K58r3J69R86J618J808K141K872L135K108M86k01
60402D51648L69R87O94n0l10O1O78J454K396L009K696J736J185J558K176K130
60386D72417J520J250J757K476K708K530K481K634K551K068J597J496J567J421
60372E00473J034O81N80Q11J356J984K281K040J504J087R83J102J203J048O55
$$ plain form
60357 518822 519255 520026 521520 523643 526291 529742 534091 538572 542097 544500 546743 549894 554482 560824 569222
60342 569222 579494 590856 602651 614695 626527 636874 644490 649226 651693 652066 649869 644920 637905
60329 637905 629882 621626 613658 606407 599950 593741 587049 579796 572778 566957 562611 559288 556452 553925
60315 553925 551752 549948 548582 547825 547657 547750 547979 548873 551145 554791 559167 564038 570079 578147 588522
60300 588522 601211 616554 634839 655337 676194 695473 711985 724966 733375 736118 733227 726526
60288 726526 718792 712182 707431 704242 701874 699327 695596 690301 683861 676749 668718 659130 647867 635538
60274 635538 622935 610682 599232 588685 578658 568828 559584 551645 545043 539119 533613 529009 525556
60261 525556 522563 519232 515669 512582 510315 508704 507607 506993 506652 506396 506514 507459 509014 510252 510541 510276
$$ packed form
60357E18822M33P71J494K123K648L451M349M481L525K403K243L151M588O342Q398
60342E69222J0272J1362J1795J2044J1832J0347P616M736K467L73k197m949p015
60329F37905q023q256p968p251o457o209o692p253p018n821m346l323k836k527
60315E53925k173j804j366p57j68R3K29Q94K272L646M376M871O041Q068J0375
60300E88522J2689J5343J8285K0498K0857J9279J6512J2981Q409K743k891o701
60288G26526p734o610m751l189k368k547l731n295o440p112q031r588j1263j2329
60274F35538j2603j2253j1450j0547j0027r830r244p939o602n924n506m604l453
60261E25556k993l331l563l087k267j611j097o14l41k56J18R45J555J238K89k65
$$ plain form
60245 510276 510363 511233 512623 514127 515613 517121 518609 520027 521514 523326 525472 527539 528952 529402 528987
60230 528987 528084 527183 526741 526991 527823 528920 530056 531210 532510 534162 536362 539121 542151 545029 547513
60215 547513 549717 552035 554953 558759 563343 568364 573669 579369 585438 591413 596732 601277 605497 610080
60201 610080 615520 621715 627903 633264 637767 642060 646436 650385 653487 656109 658659 660643 661301 660920 660678
60186 660678 661185 661891 661966 661057 659040 655785 651515 646975 642884 639450 636488 633695 630758 627560 624384
60171 624384 621572 619036 616431 613793 611543 609952 609043 608907 609491 610107 609852 608693 607595 607441 608345 609981
60155 609981 611903 613448 614106 614245 614802 616054 617378 618423 619686 621496 623268 624310 624757 625193 626019 627762
60139 627762 631344 637213 644620 652454 660496 669226 678730 688479 698029 707294 716201 724548 732042 738143
$$ packed form
60245E10276Q7Q70J390J504J486J508J488J418J487J812K146K067J413M50m15
60230E28987r03r01m42K50Q32J097J136J154J300J652K200K759L030K878K484
60215E47513K204K318K918L806M584N021N305N700O069N975N319M545M220M583
60201F10080N440O195O188N361M503M293M376L949L102K622K550J984O58l81k42
60186F60678N07P06P5r09k017l255m270m540m091l434k962k793k937l198l176
60171F24384k812k536k605k638k250j591r09j36N84O16k55j159j098j54R04J636
60155F09981J922J545O58J39N57J252J324J045J263J810J772J042M47M36Q26J743
60139F27762L582N869P407P834Q042Q730R504R749R550R265Q907Q347P494O101
$$ plain form
60125 738143 742068 743389 742458 739948 736249 731620 726612 721879 717822 714754 713026 712586 712739 712828 712812 712753
60109 712753 712203 710758 708914 707634 707165 706894 706240 705115 703577 701565 699001 695781 691768 687203 682922
60094 682922 679646 677184 674879 672709 671435 671745 673767 677392 682460 688590 695287 702321 709644 716959
60080 716959 723788 729948 735631 740970 745892 750240 753649 755380 754809 752069 747825 742441 735877 728357
60066 728357 720456 712340 703495 693614 683431 674218 666632 660275 654255 647852 640720 632811 624473 616529
60052 616529 609889 604744 600280 595521 590440 585923 582746 581022 580625 581472 583182 585153 587431 590874 595927
60037 595927 601734 607101 611903 616807 621991 626898 631092 634538 637092 638443 638574 637663 635470 631443 625502
60022 625502 618178 609931 600903 591416 582093 573293 564911 556858 549274 542129 535165 528446 522489 517583
$$ packed form
60125G38143L925J321r31k510l699m629n008m733m057l068j728m40J53Q9j6n9
60109G12753n50j445j844j280m69k71o54j125j538k012k564l220m013m565m281
60094F82922l276k462k305k170j274L10K022L625N068O130O697P034P323P315
60080G16959O829O160N683N339M922M348L409J731n71k740m244n384o564p520
60066G28357p901q116q845r881j0183r213p586o357o020o403p132p909q338p944
60052F16529o640n145m464m759n081m517l177j724l97Q47J710J971K278L443N053
60037E95927N807N367M802M904N184M907M194L446K554J351J31r11k193m027n941
60022F25502p324q247r028r487r323q800q382q053p584p145o964o719n957m906
$$ plain form
60008 517583 513373 509469 506167 504194 503871 504760 506043 507068 507608 507838 508196 509265 511566 515115 519169
59993 519169 522760 525705 528748 532497 536601 540368 543808 547495 551662 556004 560244 564363 568290 571788
59979 571788 574539 575971 575310 572432 568490 565004 562312 559563 556204 552753 549994 548117 546868 545955 545066
59964 545066 543975 542885 542252 542078 541900 541648 541987 543459 545746 548073 549949 551199 551661 551352 550684 550162
59948 550162 550014 550369 551543 553728 556510 559051 560791 561740 562071 561696 560407 558233 555414 552031 547998
59933 547998 543600 539662 536652 533777 529689 524258 519005 515450 513689 513023 513243 514505 516429 518282 519846
59918 519846 521293 522367 522580 522204 522238 523246 524923 526871 529111 531726 534676 538154 542505 547603 552832
59903 552832 557800 562538 566982 570900 574452 578102 581810 584974 587381 589554 591917 594272 596403 598583
$$ packed form
60008E17583m210l904l302j973l23Q89J283J025N40K30L58J069K301L549M054
59993E19169L591K945L043L749M104L767L440L687M167M342M240M119L927L498
59979E71788K751J432o61k878l942l486k692k749l359l451k759j877j249r13q89
59964E45066j091j090o33j74j78k52L39J472K287K327J876J250M62l09o68n22
59948E50162j48L55J174K185K782K541J740R49L31l75j289k174k819l383m033
59933E47998m398l938l010k875m088n431n253l555j761o66K20J262J924J853J564
59918E19846J447J074K13l76L4J008J677J948K240K615K950L478M351N098N229
59903E52832M968M738M444L918L552L650L708L164K407K173K363K355K131K180
$$ plain form
59889 598583 601135 604055 607362 611253 615603 619881 623863 627902 632220 636625 641219 646632 652983 659253
59875 659253 664300 667955 670570 672080 672256 671459 670269 668510 665378 660510 654390 647776 641235 635203 629957
59860 629957 625420 621281 617371 613731 610382 607312 604646 602670 601750 602287 604530 608253 612877 618114 624343
59845 624343 632125 641484 651775 661986 671028 677994 682490 684702 685174 684743 684634 686050 689330 693727
59831 693727 698096 701504 703155 702393 699222 694437 688915 683008 676835 670630 664378 657482 649355 640153
59817 640153 630588 621198 612138 603471 595323 587926 581737 577218 574237 572002 569858 567805 565925 563828
59803 563828 561248 558776 557281 556719 556144 554790 552575 549653 546192 542762 540317 539391 539515 539570 538598 536309
59787 536309 533176 530102 527722 525862 523931 521875 520458 520365 521266 522033 521865 520984 520166 519780 519506 518930 518184
$$ packed form
59889E98583K552K920L307L891M350M278L982M039M318M405M594N413O351O270
59875F59253N047L655K615J510J76p97j190j759l132m868o120o614o541o032n246
59860F29957m537m139l910l640l349l070k666j976r20N37K243L723M624N237O229
59845F24343P782R359J0291J0211R042O966M496K212M72m31j09J416L280M397
59831F93727M369L408J651p62l171m785n522n907o173o205o252o896q127r202
59817F40153r565r390r060q667q148p397o189m519k981k235k144k053j880k097
59803E63828k580k472j495n62n75j354k215k922l461l430k445r26J24N5r72k289
59787E36309l133l074k380j860j931k056j417r3R01P67j68q81q18l86k74n76p46
$$ plain form
59770 518184 517824 518257 519510 521466 524058 527152 530401 533266 535252 536301 537076 538536 540977 543787 546426
59755 546426 549224 552686 556485 559937 563232 567209 571936 576610 581015 585922 591572 596914 601156 605136
59741 605136 610075 615655 620465 623990 626945 629746 631841 632834 633360 634342 635930 637570 638676 638939 638326
59726 638326 637212 636337 636260 636839 637416 637519 637194 636647 635777 634365 632690 631582 631520 631925 631811 631070 630616 631187
59708 631187 632538 634007 635359 636683 637871 638718 639396 640389 641888 643503 644667 645253 645763 646831 648551
59693 648551 650494 652539 655268 659066 663117 665951 666918 666471 665112 662916 660241 657961 656584 655776 655090
59678 655090 654508 653932 652931 651498 650330 649788 649192 647738 645494 642858 639698 635810 631697 628013 624563
59663 624563 620706 616448 612337 608478 604547 600670 597480 595250 593631 592322 591439 591152 591511 592701 595029
$$ packed form
59770E18184l60M33J253J956K592L094L249K865J986J049P75J460K441K810K639
59755E46426K798L462L799L452L295L977M727M674M405M907N650N342M242L980
59741F05136M939N580M810L525K955K801K095R93N26R82J588J640J106K63o13
59726F38326j114q75p7N79N77J03l25n47q70j412j675j108o2M05j14p41m54N71
59708F31187J351J469J352J324J188Q47O78R93J499J615J164N86N10J068J720
59693F48551J943K045K729L798M051K834R67m47j359k196k675k280j377q08o86
59678F55090n82n76j001j433j168n42n96j454k244k636l160l888m113l684l450
59663F24563l857m258m111l859l931l877l190k230j619j309q83k87L59J190K328
$$ plain form
59648 595029 598506 602684 606871 610300 612305 612740 612151 611205 610027 608311 605891 602913 599680 596619 594243
59633 594243 592853 592421 592874 594150 595883 597540 599055 600686 602005 601901 600150 598238 597777 598708 599862
59618 599862 600727 601623 602503 602732 602026 600758 599247 597422 595205 592695 590084 587860 586835 587385 588905 590617
59602 590617 592541 595014 597669 599760 601172 602241 602841 602598 601806 601130 600494 599290 597636 596463 596237 596499
59586 596499 596711 596687 596158 594883 593307 592203 591480 590231 588145 585941 584133 582233 579536 575980 571951
59571 571951 567936 564609 562449 561006 559232 556784 554335 552463 551088 550244 550500 552132 554569 557058 559237
59556 559237 560801 561406 561328 561547 562747 564797 567393 570375 573160 574906 575881 577703 581474 586390 590984
59541 590984 595048 599476 604859 611272 619109 629121 641797 657437 676453 698458 720887 739519
$$ packed form
59648E95029L477M178M187L429K005M35n89r46j178j716k420k978l233l061k376
59633E94243j390m32M53J276J733J657J515J631J319j04j751j912m61R31J154
59618E99862Q65Q96Q80K29p06j268j511j825k217k510k611k224j025N50J520J712
59602E90617J924K473K655K091J412J069O00k43p92o76o36j204j654j173k26K62
59586E96499K12k4n29j275j576j104p23j249k086k204j808j900k697l556m029
59571E71951m015l327k160j443j774k448k449j872j375q44K56J632K437K489K179
59556E59237J564O05p8K19J200K050K596K982K785J746R75J822L771M916M594
59541E90984M064M428N383O413P837J0012J2676J5640J9016K2005K2429J8632
$$ plain form
59529 739519 751057 755230 754521 752274 750978 751658 754266 758456 763968 770469 777374 784053 789986 794618
59515 794618 797328 797792 796171 792717 787434 780366 771927 762630 752659 741998 730899 719914 709501
59502 709501 699803 690802 682542 675156 668716 663125 658303 654496 652173 651403 651589 652196 653539 656352 660611
59487 660611 665267 669212 672216 674928 678380 683458 690455 699007 708747 719847 732680 747269 763634
59474 763634 782344 803863 827412 851262 874128 895402 913955 927766 935209 936144 931612 923333
59462 923333 913737 905389 899558 895922 894177 895360 900966 911393 925885 943555 963752 985797 1009055
59449 1009055 1033250 1058362 1084495 1112135 1142112 1174690 1208637 1241223 1268764 1287260 1293499
59438 1293499 1286529 1268199 1242090 1212048 1181410 1152443 1125702 1100240 1074904 1049167 1022692
$$ packed form
59529G39519J1538M173p09k247j296O80K608M190N512O501O905O679N933M632
59515G94618K710M64j621l454n283p068q439r297r971j0661j1099j0985j0413
59502G09501r698r001q260p386o440n591m822l807k323p70J86O07J343K813M259
59487F60611M656L945L004K712L452N078O997Q552R740J1100J2833J4589J6365
59474G63634J8710K1519K3549K3850K2866K1274J8553J3811P443R35m532q279
59462I23333r596q348n831l636j745J183N606J0427J4492J7670K0197K2045K3258
59449A009055K4195K5112K6133K7640K9977L2578L3947L2586K7541J8496O239
59438A293499o970j8330k6109l0042l0638k8967k6741k5462k5336k5737k6475
$$ plain form
59427 1022692 995046 966575 938945 914115 893125 876315 864022 856223 852085 850892 853206 860198
59415 860198 871929 887097 904410 923480 944484 967868 994402 1024230 1054910 1080773 1095281
59404 1095281 1094765 1080367 1056801 1029452 1002293 977808 958004 945015 940606 944905 954934 964202
59392 964202 964895 952297 927759 896947 865178 834894 806832 781582 759179 738676 719423 702068
59380 702068 687400 674944 663857 654489 647827 643705 640784 638135 635785 633753 631651 629399 627461
59367 627461 626189 625583 625778 627073 629398 632289 635385 638437 641030 643057 645380 649269 655125 662505 671330
59352 671330 682161 695143 709635 725225 742339 761373 781946 803534 826257 850418 875607
59341 875607 900825 925266 948496 970043 989247 1005435 1017910 1025889 1028898 1027330 1022326 1014789
$$ packed form
59427A022692k7646k8471k7630k4830k0990j6810j2293p799m138j193K314O992
59415H60198J1731J5168J7313J9070K1004K3384K6534K9828L0680K5863J4508
59404A095281n16j4398k3566k7349k7159k4485j9804j2989m409M299J0029R268
59392I64202O93j2598k4538l0812l1769l0284k8062k5250k2403k0503j9253j7355
59380G02068j4668j2456j1087r368o662m122k921k649k350k032k102k252j938
59367F27461j272o06J95J295K325K891L096L052K593K027K323L889N856P380Q825
59352F71330J0831J2982J4492J5590J7114J9034K0573K1588K2723K4161K5189
59341H75607K5218K4441K3230K1547J9204J6188J2475P979L009j568n004p537
$$ plain form
59329 1014789 1004544 990695 972977 952598 931469 910595 889575 867826 845828 824838 805701
59318 805701 788395 772574 758083 744945 733295 723303 714870 707459 700596 694462 689597 686063 683388
59305 683388 681325 680222 680466 682028 684772 688837 694475 701821 711200 723391 738963 757050 774948
59292 774948 789219 797433 799070 795097 787061 776580 765187 754084 743967 735319 728736 724598 722481
59279 722481 721496 721345 722583 725673 730329 736180 743574 753223 765283 779246 794583 810985 828044
59266 828044 845043 861156 875735 888488 899389 908173 913906 915515 912898 907026 898686 887710 873900
59253 873900 858163 842027 826341 811093 796287 782331 769586 758173 748245 739999 733427 728411
59241 728411 725038 723424 723330 724356 726443 729778 734275 739626 745830 753205 761734 770675 778908 785461 789779
$$ packed form
59329A014789j0245j3849j7718k0379k1129k0874k1020k1749k1998k0990j9137
59318H05701j7306j5821j4491j3138j1650r992q433p411o863o134m865l534k675
59305F83388k063j103K44J562K744M065N638P346R379J2191J5572J8087J7898
59292G74948J4271Q214J637l973q036j0481j1393j1103j0117q648o583m138k117
59279G22481r85j51J238L090M656N851P394R649J2060J3963J5337J6402J7059
59266H28044J6999J6113J4579J2753J0901Q784N733J609k617n872q340j0976j3810
59253H73900j5737j6136j5686j5248j4806j3956j2745j1413r928q246o572n016
59241G28411l373j614r4J026K087L335M497N351O204P375Q529Q941Q233O553M318
$$ plain form
59226 789779 791794 791737 789706 785402 778473 768994 757533 744872 731831 719022 706546 694223 682329
59213 682329 671785 663241 656326 650236 644782 640361 637056 634298 631391 627969 624049 619952 616180 613146
59199 613146 611118 610442 611296 612940 613811 613064 611681 611416 612854 615117 617287 619382 622020 625778 630947
59184 630947 637344 644290 651239 658392 666244 674562 682325 688693 693610 697476 700800 704207 708261 713046
59170 713046 718283 723947 730470 738282 747452 757843 769327 781694 794475 806965 818441 828495
59158 828495 837208 844732 850637 854041 854478 852224 847540 840245 830432 819007 806955 794523 781714
59145 781714 769073 757255 746182 735378 724865 715010 705804 697026 688876 681630 674902 668108 661543
59132 661543 656104 652065 648964 646663 645568 645650 646138 646423 646644 647213 648436 650731 654519 659695 665758 672570
$$ packed form
59226G89779K015n7k031m304o929r479j1461j2661j3041j2809j2476j2323j1894
59213F82329j0544q544o915o090n454m421l305k758k907l422l920m097l772l034
59199F13146k028o76Q54J644Q71p47j383k65J438K263K170K095K638L758N169
59184F30947O397O946O949P153P852Q318P763O368M917L866L324L407M054M785
59170G13046N237N664O523P812R170J0391J1484J2367J2781J2490J1476J0054
59158H28495Q713P524N905L404M37k254m684p295r813j1425j2052j2432j2809
59145G81714j2641j1818j1073j0804j0513r855r206q778q150p246o728o794o565
59132F61543n439m039l101k301j095Q2M88K85K21N69J223K295L788N176O063O812
$$ plain form
59116 672570 680412 689210 698358 707448 716591 725845 734957 743822 752666 761570 770305 778727 786852 794520
59102 794520 801524 808092 814558 820500 824919 827533 829244 831044 833020 834723 835949 836739 836992 836474 835117
59087 835117 833210 831413 830457 830454 830547 829616 827238 823588 818637 811991 803425 793073 781301 769029 757846
59072 757846 748857 741431 733948 725849 718085 711464 705530 699414 692949 686529 680510 675206 670891 667439
59058 667439 664370 661505 659088 657118 655080 652635 650063 647826 646076 644728 643568 642191 640328 638338
59044 638338 636891 636139 635688 635329 635179 635133 634972 635023 635969 637911 640361 643181 646607 650212 652965 654729 656768
59027 656768 660242 665051 670668 677275 685340 694724 704951 715939 727795 740225 752764 765353 778175
59014 778175 790971 802787 812359 818702 821736 822418 821959 820815 818785 816012 813319 811507 810903 811665 813947
$$ packed form
59116F72570P842Q798R148R090R143R254R112Q865Q844Q904Q735Q422Q125P668
59102G94520P004O568O466N942M419K614J711J800J976J703J226P90K53n18j357
59087H35117j907j797r56lR3r31k378l650m951o646q566j0352j1772j2272j1183
59072G57846q989p426p483q099p764o621n934o116o465o420o019n304m315l452
59058F67439l069k865k417j970k038k445k572k237j750j348j160j377j863j990
59044F38338j447p52m51l59j50m6j61N1R46J942K450K820L426L605K753J764K039
59027F56768L474M809N617O607Q065R384J0227J0988J1856J2430J2539J2589J2822
59014G78175J2796J1816R572O343L034O82m59j144k030k773k693j812o04P62K282
$$ plain form
58999 813947 817626 822447 828521 836156 845192 855041 865290 875571 884983 892604 898606 903893 908529 911462
58985 911462 911928 910063 905946 899249 890271 880227 870052 859903 850252 842232 836252 831461 827410 825183
58971 825183 825895 829007 833255 838502 845524 854503 864863 876223 888537 901513 914776 928474 942925
58958 942925 957706 971618 983402 992122 997173 998443 996220 990619 981425 968837 953915 937821 921047
58945 921047 903717 886190 868938 852330 836921 823474 812306 803109 795747 790556 787464 785478
58933 785478 783539 781274 778464 774562 769393 763681 758157 752704 746974 741272 736129 731495 726995 722543
58919 722543 718186 713884 709959 707123 705458 703974 701879 699705 698584 699031 701050 704655 709493 714622
58905 714622 719669 725724 734204 745243 758032 772215 788044 805518 824333 844436 865696 887115
$$ packed form
58999H13947L679M821O074P635R036R849J0249J0281R412P621O002N287M636K933
58985I11462M66j865m117o697q978j0044j0175j0149r651q020n980m791m051k227
58971H25183P12L112M248N247P022Q979J0360J1360J2314J2976J3263J3698J4451
58958I42925J4781J3912J1784Q720N051J270k223n601r194j2588j4922j6094j6774
58945I21047j7330j7527j7252j6608j5409j3447j1168r197p362n191l092j986
58933G85478j939k265k810l902n169n712n524n453n730n702n143m634m500m452
58919G22543m357m302l925k836j665j484k095k174j121M47K019L605M838N129
58905G14622N047O055Q480J1039J2789J4183J5829J7474J8815K0103K1260K1419
$$ plain form
58893 887115 907171 925085 941377 957414 974661 994011 1015376 1038240 1062798 1089899 1119548
58882 1119548 1150209 1179986 1207653 1232084 1251869 1266404 1276440 1282526 1283706 1278724 1267658 1251264
58870 1251264 1229670 1203140 1173528 1143422 1114065 1085362 1057570 1031641 1008069 986736 967837
58859 967837 951747 937899 924868 911721 898450 885168 871793 858523 845766 833568 821788
58848 821788 810678 800608 791461 783011 775528 769131 762950 755915 748101 740326 732696 724642 716213 708218
58834 708218 701104 694595 688348 682118 675459 668197 661044 654883 649709 645197 641894 640675 641248 642455
58820 642455 643928 646162 649039 651730 654242 657716 662732 668378 673474 677773 681524 684672 687051 688827
58806 688827 690405 692200 694462 696909 698755 699645 700204 700927 701044 699554 697024 695039 693963 692581 690074
$$ packed form
58893H87115K0056J7914J6292J6037J7247J9350K1365K2864K4558K7101K9649
58882A119548L0661K9777K7667K4431J9785J4535J0036O086J180m982j1066j6394
58870A251264k1594k6530k9612l0106k9357k8703k7792k5929k3572k1333j8899
58859I67837j6090j3848j3031j3147j3271j3282j3375j3270j2757j2198j1780
58848H21788j1110j0070r147q450p483o397o181p035p814p775p630q054q429p995
58834G08218p114o509o247o230o659p262p153o161n174m512l303j219N73J207
58820F42455J473K234K877K691K512L474N016N646N096M299L751L148K379J776
58806F88827J578J795K262K447J846Q90N59P23J17j490k530j985j076j382k507
$$ plain form
58791 690074 686988 683976 680843 677444 674512 672914 672774 673803 675919 679199 683693 689441 696160 702913
58777 702913 708751 713708 718484 723199 727186 729919 731258 730777 727922 723104 717769 713042 708917 704914
58763 704914 700805 696549 692248 688342 685251 682735 680245 677913 676569 676802 678604 681757 685767 689630
58749 689630 692619 695228 698447 702160 705292 707506 709701 712766 716820 721767 727515 733492 738878 743576
58735 743576 748106 752570 756720 761066 766718 773875 781547 789110 797064 805905 815255 824524 833561 842203
58721 842203 850044 857011 863491 869626 875262 880807 887246 895040 903774 913101 923160 933825 944423
58708 944423 954448 963725 971619 976989 979243 978700 975688 970069 961757 950835 937022 920011 900480
58695 900480 879801 858560 836445 813819 792213 772819 755518 739822 725780 713470 702534
$$ packed form
58791F90074l086l012l133l399k932j598j40J029K116L280M494N748O719O753
58777G02913N838M957M776M715L987K733J339m81k855m818n335m727m125m003
58763G04914m109m256m301l906l091k516k490k332j344K33J802L153M010L863
58749F89630K989K609L219L713L132K214K195L065M054M947N748N977N386M698
58735G43576M530M464M150M346N652P157P672P563P954Q841R350R269R037Q642
58721H42203P841O967O480O135N636N545O439P794Q734R327J0059J0665J0598
58708I44423J0025R277P894N370K254n43l012n619q312j0922j3813j7011j9531
58695I00480k0679k1241k2115k2626k1606j9394j7301j5696j4042j2310j0936
$$ plain form
58684 702534 692730 684093 676146 667848 658856 650065 642448 636092 630713 626322 623040 620927 620278 621310
58670 621310 623416 625627 627955 631369 636322 642464 649989 659943 672567 686399 699628 711435 721494
58657 721494 729189 734068 736397 736711 735421 733120 730474 727493 723686 719127 714490 709885 704756 699190
58643 699190 694228 690506 687627 685230 683605 682879 682683 682988 684187 686053 687834 689660 692562 696596 700351
58628 700351 702836 704478 705680 705862 704827 703728 703744 704908 706967 710180 714435 718926 723743 730628 740998
58613 740998 754173 768534 783358 798488 813213 826678 838630 848763 856134 860223 861799 861824 860287
58600 860287 856952 852384 847171 840990 833482 825334 817539 810251 803255 796877 791485 786845 782908 780577
58586 780577 780703 782850 785979 789870 795178 802547 812253 824028 836664 848458 858690 868065 877365
$$ packed form
58684G02534r804q637p947q298q992q791p617o356n379m391l282k113o49J032
58670F21310K106K211K328L414M953O142P525R954J2624J3832J3229J1807J0059
58657G21494P695M879K329L14j290k301k646k981l807m559m637m605n129n566
58643F99190m962l722k879k397j625p26j96L05J199J866J781J826K902M034L755
58628G00351K485J642J202J82j035j099J6J164K059L213M255M491M817O885J0370
58613G40998J3175J4361J4824J5130J4725J3465J1952J0133P371M089J576K5j537
58600H60287l335m568n213o181p508q148p795p288o996o378n392m640l937k331
58586G80577J26K147L129L891N308P369R706J1775J2636J1794J0232R375R300
$$ plain form
58573 877365 886513 895328 904035 912520 920243 927552 935907 946115 957544 969818 983959 1000953 1020464
58560 1020464 1041947 1065698 1091601 1118055 1143341 1166961 1188495 1206394 1219254 1227347 1231599 1232126
58548 1232126 1229021 1223513 1216842 1208929 1199495 1189573 1180405 1171634 1161999 1151102 1139121 1125575 1109895
58535 1109895 1092557 1074317 1055005 1034441 1013867 995079 978679 964428 952557 943355 936175 930287
58523 930287 926148 924452 924564 925331 926844 929953 934554 939761 945254 950999 956182 959990 963167 967352 973035
58508 973035 979320 985391 990990 995798 999577 1002696 1005481 1007347 1007465 1005842 1002876 998497 992761 986546
58494 986546 980528 974114 966449 957895 949491 941691 934728 929299 925689 922966 920241 917990 917097 917615 919650
58479 919650 924285 932186 942282 953304 965545 979480 993785 1006529 1017396 1026887 1034206 1037924
$$ packed form
58573H77365R148Q815Q707Q485P723P309Q355J0208J1429J2274J4141J6994J9511
58560A020464K1483K3751K5903K6454K5286K3620K1534J7899J2860Q093M252N27
58548A232126l105n508o671p913r434r922r168q771r635j0897j1981j3546j5680
58535A109895j7338j8240j9312k0564k0574j8788j6400j4251j1871r202p180n888
58523I30287m139j696J12P67J513L109M601N207N493N745N183L808L177M185N683
58508I73035O285O071N599M808L779L119K785J866J18j623k966m379n736o215
58494I86546o018o414p665q554q404p800o963n429l610k723k725k251q93N18K035
58479I19650M635P901J0096J1022J2241J3935J4305J2744J0867R491P319L718
$$ plain form
58467 1037924 1038107 1035846 1031306 1024132 1015214 1006185 997573 989162 981552 975607 970897 966563 963228 962325
58453 962325 964109 968001 974069 982149 990247 996063 999623 1002284 1003680 1002037 997209 990975 984345 976835
58439 976835 968573 960981 955047 950750 948353 948445 950522 953167 955829 959025 962905 967167 972229 978914 987131
58424 987131 996314 1006850 1019465 1033612 1048034 1062390 1076593 1089096 1097859 1102725 1105071 1105657 1104681
58411 1104681 1103255 1102499 1101536 1098602 1093838 1088774 1083401 1076214 1067033 1057413 1048204 1038972 1029969 1022436
58397 1022436 1016705 1011899 1007643 1004322 1001798 999656 998395 998474 998622 997244 994962 993528 992813 991425 989764
58382 989764 989579 990738 991333 990983 991145 992077 992428 992124 992757 994693 996597 998359 1001790 1007668 1014617 1021586
58366 1021586 1029086 1037426 1046052 1055193 1065963 1078376 1091359 1104907 1119966 1136074 1151575 1166267
$$ packed form
58467A037924J83k261m540p174q918r029q612q411p610n945m710m334l335r03
58453I62325J784L892O068Q080Q098N816L560K661J396j643m828o234o630p510
58439I76835q262p592n934m297k397R2K077K645K662L196L880M262N062O685Q217
58424I87131R183J0536J2615J4147J4422J4356J4203J2503Q763M866K346N86r76
58411A104681j426p56r63k934m764n064n373p187r181r620r209r232r003p533
58397A022436n731m806m256l321k524k142j261P9J48j378k282j434p15j388j661
58382I89764j85J159N95l50J62R32L51l04O33J936J904J762L431N878O949O969
58366A021586P500Q340Q626R141J0770J2413J2983J3548J5059J6108J5501J4692
$$ plain form
58354 1166267 1181231 1195866 1207799 1216120 1222129 1226662 1229312 1230521 1231706 1233029 1233762 1235032 1239219
58341 1239219 1246313 1253883 1261028 1269313 1279408 1290000 1300713 1313008 1327428 1342821 1358816 1376089
58329 1376089 1393819 1410059 1425123 1441220 1458188 1473101 1484778 1495133 1505217 1513698 1520286 1526961
58317 1526961 1534486 1541289 1547130 1554337 1563934 1574052 1583658 1594428 1607317 1620666 1633378 1646784
58305 1646784 1661788 1677276 1692861 1710033 1729162 1748509 1767491 1787623 1808968 1829155 1847326
58294 1847326 1865535 1884898 1904010 1922566 1942752 1965357 1988284 2010625 2034561 2061557 2090389
58283 2090389 2120527 2153570 2189639 2226329 2262980 2302045 2344492 2387912 2430806 2474438 2518739
58272 2518739 2560960 2600435 2640169 2681630 2722635 2762544 2804710 2851327 2900547 2951081 3004827
$$ packed form
58354A166267J4964J4635J1933Q321O009M533K650J209J185J323P33J270M187
58341A239219P094P570P145Q285J0095J0592J0713J2295J4420J5393J5995J7273
58329A376089J7730J6240J5064J6097J6968J4913J1677J0355J0084Q481O588O675
58317A526961P525O803N841P207R597J0118R606J0770J2889J3349J2712J3406
58305A646784J5004J5488J5585J7172J9129J9347J8982K0132K1345K0187J8171
58294A847326J8209J9363J9112J8556K0186K2605K2927K2341K3936K6996K8832
58283B090389L0138L3043L6069L6690L6651L9065M2447M3420M2894M3632M4301
58272B518739M2221L9475L9734M1461M1005L9909M2166M6617M9220N0534N3746
$$ plain form
58261 3004827 3062493 3121667 3181867 3246473 3316792 3389251 3461112 3533822 3608083 3681307 3753067
58250 3753067 3827441 3906756 3988616 4072191 4161346 4258091 4359163 4462811 4572699 4691262
58240 4691262 4815703 4944617 5081872 5229640 5384442 5544665 5715022 5898877 6093334
58231 6093334 6296814 6513990 6748020 6995626 7255376 7532909 7832330 8150809 8487729
58222 8487729 8850423 9244485 9667640 10120097 10611306 11148980 11731547 12359609 13044586
58213 13044586 13797622 14621138 15521018 16516202 17626858 18865704 20252189 21823116 23618918
58204 23618918 25674846 28039997 30791819 34020046 37814704 42286963 47584956 53873655
58196 53873655 61324190 70152674 80661338 93233475 108324848 126491758 148388955
$$ packed form
58261C004827N7666N9174O0200O4606P0319P2459P1861P2710P4261P3224P1760
58250C753067P4374P9315Q1860Q3575Q9155R6745J01072J03648J09888J18563
58240D691262J24441J28914J37255J47768J54802J60223J70357J83855J94457
58231F093334K03480K17176K34030K47606K59750K77533K99421L18479L36920
58222H487729L62694L94062M23155M52457M91209N37674N82567O28062O84977
58213A3044586P53036Q23516Q99880R95184J110656J238846J386485J570927J795802
58204B3618918K055928K365151K751822L228227L794658M472259N297993O288699
58196E3873655P450535Q828484J0508664J2572137J5091373J8166910K1897197
$$ plain form
58189 148388955 174659410 205721577 241422216 280457935 319760920 354548581 379620074
58182 379620074 391436527 389580621 376557084 356258983 332309196 307161351 282026076
58175 282026076 257278168 233010573 209448528 187024576 166180801 147180740 130100559
58168 130100559 114909768 101509347 89741011 79426147 70405028 62530411 55649667
58161 55649667 49620864 44334869 39703937 35641902 32071665 28937811 26193432 23783529
58153 23783529 21654919 19771773 18107203 16628551 15303902 14114694 13049305 12091091
58145 12091091 11223460 10439423 9735187 9100231 8522910 7999383 7527951 7100746 6709567
58136 6709567 6353476 6031860 5735944 5455963 5191313 4945353 4715479 4496803 4290751
$$ packed form
58189A48388955K6270455L1062167L5700639L9035719L9302985L4787661K5071493
58182C79620074J1816453j855906j3023537k0298101k3949787k5147845k5135275
58175B82026076k4747908k4267595k3562045k2423952k0843775j9000061j7080181
58168A30100559j5190791j3400421j1768336j0314864r021119p874617o880744
58161E5649667o028803n285995m630932m062035l570237l133854k744379k409903
58153B3783529k128610j883146j664570j478652j324649j189208j065389r58214
58145A2091091q67631p84037p04236o34956n77321n23527m71432m27205l91179
58136F709567l56091l21616k95916k79981k64650k45960k29874k18676k06052
$$ plain form
58127 4290751 4101352 3926865 3762806 3609534 3469268 3339007 3213740 3093768 2982192
58118 2982192 2878007 2778007 2682632 2593823 2509770 2427700 2349243 2277429 2210917 2146569 2085019
58107 2085019 2028332 1974693 1920813 1867305 1816550 1767447 1717253 1666513 1617460 1569658 1521866
58096 1521866 1476055 1434889 1397206 1360471 1325696 1295503 1269245 1244419 1221134 1200920 1182894
58085 1182894 1165220 1148637 1134492 1120993 1105426 1088441 1072302 1056605 1039611 1022035 1005554
58074 1005554 989130 970764 951416 933437 916525 898980 881493 865963 851940 837847 824407
58063 824407 813229 803326 792623 781619 772074 763483 754428 745966 739829 734516 727076 717834 709604
58050 709604 703104 696774 690301 684612 679090 672432 665798 661510 659022 655508 650105 644406 639158 633705
$$ packed form
58127D290751j89399j74487j64059j53272j40266j30261j25267j19972j11576
58118B982192j04185j00000r5375q8809q4053q2070p8457p1814o6512o4348o1550
58107B085019n6687n3639n3880n3508n0755m9103n0194n0740m9053m7802m7792
58096A521866m5811m1166l7683l6735l4775l0193k6258k4826k3285k0214j8026
58085A182894j7674j6583j4145j3499j5567j6985j6139j5697j6994j7576j6481
58074A005554j6424j8366j9348j7979j6912j7545j7487j5530j4023j4093j3440
58063H24407j1178r903j0703j1004r545q591r055q462o137n313p440r242q230
58050G09604o500o330o473n689n522o658o634m288k488l514n403n699n248n453
$$ plain form
58036 633705 628435 624638 622016 619063 615539 611896 606944 599130 589637 581172 574018 566292 557725 550008
58022 550008 543498 536673 529111 522184 516499 511114 505594 500581 496257 492334 489364 487933 486826 484208
58008 484208 480399 477311 475511 474006 472505 471571 470914 469885 469256 470223 472024 472874 472879 473672 475587 477589
57992 477589 479550 482108 484660 486056 486930 488779 491123 492244 492416 493523 495604 496707 496298 495921 496172
57977 496172 495857 494679 494120 494931 496053 496681 497223 497760 497715 497485 498260 499830 500701 500788 501750 504174 506615 508079
57959 508079 509287 510837 512101 512601 512607 511808 509340 505661 502442 499983 496717 491972 487223 483736 480847
57944 480847 477571 474280 471748 469984 468864 468687 469329 470110 471115 473468 477777 483492 490217 498281 507572
57929 507572 517038 525805 533700 540466 545795 550246 554751 559014 561779 562719 562505 561030 557436 552117 546691
$$ packed form
58036F33705n270l797k622k953l524l643m952p814r493q465p154p726q567p717
58022E50008o510o825p562o927n685n385n520n013m324l923k970j431j107k618
58008D84208l809l088j800j505j501r34o57j029o29R67J801Q50NP93J915K002
57992D77589J961K558K552J396Q74J849K344J121J72J107K081J103m09l77K51
57977D96172l15j178n59Q11J122O28N42N37m5k30P75J570Q71Q7R62K424K441J464
57959E08079J208J550J264N00Op99k468l679l219k459l266m745m749l487k889
57944D80847l276l291k532j764j120j77O42P81J005K353M309N715O725Q064R291
57929E07572R466Q767P895O766N329M451M505M263K765R40k14j475l594n319n426
$$ plain form
57914 546691 541542 535362 527725 520157 513832 508076 502234 497271 494265 492659 491170 489285 486854 483248
57900 483248 478024 471640 464696 457265 449492 441957 434913 428078 421638 416383 412358 408480 404113 400016
57886 400016 397131 395395 394314 393787 393793 394117 394838 396260 398023 399197 399612 400056 400824 401106 400203 398330 395808
57869 395808 392501 388522 384566 381085 377993 375452 374029 373777 374092 374719 375889 377332 378353 379230 381363
57854 381363 385536 390996 396645 402153 407568 412804 417940 423229 428577 433789 439246 445351 451389 456138
57840 456138 459558 462576 465293 466883 467310 467502 467621 466806 464934 462973 461181 458725 455606 453229 452280
57825 452280 451642 450252 448558 447322 446427 445748 445829 446816 447978 449070 450845 453491 456022 457996 460267 463068
57809 463068 464921 464606 462688 459857 455262 448108 439695 432125 425818 419808 413871 408854 405324 403034
$$ packed form
57914E46691n149o180p637p568o325n756n842m963l006j606j489j885k431l606
57900D83248n224o384o944p431p773p535p044o835o440n255m025l878m367m097
57886D00016k885j736j081n27OL24P21J422J763J174M15M44P68K82r03j873k522
57869C95808l307l979l956l481l092k541j423k52L15O27J170J443J021Q77K133
57854C81363M173N460N649N508N415N236N136N289N348N212N457O105O038M749
57840D56138L420L018K717J590M27J92J19q15j872j961j792k456l119k377r49
57825D52280o38j390j694j236q95o79Q1R87J162J092J775K646K531J974K271K801
57809D63068J853l15j918k831m595p154q413p570o307o010n937n017l530k290
$$ plain form
57795 403034 401383 399537 396718 393270 390759 390093 390247 389720 388435 387225 386286 385318 384523 384245 384139 383812
57779 383812 383870 385273 387941 390906 393590 396128 398745 401509 404429 407263 409594 411495 413564 415914 417835
57764 417835 418807 419035 418545 416774 413609 409743 405326 399423 391723 383666 376801 371057 365773 361394 358706
57749 358706 357148 355423 353353 351756 350789 349734 348264 346828 345828 345317 345349 345821 346094 345483 343992 342066
57733 342066 340006 338118 336869 336284 335760 335135 335238 336619 338433 339523 339985 340703 341857 342888 343542 343967
57717 343967 344127 343988 343966 344353 344653 344226 343248 342343 341713 341349 341544 342337 342939 342542 341300 339792 338082 336153
57699 336153 334654 334283 334883 335937 337396 339136 340298 340266 339723 339599 339454 338147 335768 333646 332583 332196
57683 332196 331880 331490 331182 331476 333304 337125 342298 348155 355306 364865 376806 390287 405454 423781
$$ packed form
57795D03034j651j846k819l448k511o66J54n27j285j210r39r68p95k78j06l27
57779C83812N8J403K668K965K684K538K617K764K920K834K331J901K069K350J921
57764D17835R72K28m90j771l165l866m417n903p700q057o865n744n284m379k688
57749C58706j558j725k070j597r67j055j470j436j000n11L2M72K73o11j491j926
57733C42066k060j888j249n85n24o25J03J381J814J090M62P18J154J031O54M25
57717C43967J60j39k2L87L00m27r78r05o30l64J95P93O02l97j242j508j710j929
57699C36153j499l71O00J054J459J740J162l2n43j24j45j307k379k122j063l87
57683C32196l16l90l08K94J828L821N173N857P151R559J1941J3481J5167J8327
$$ plain form
57669 423781 446732 475166 510010 552297 602034 657321 714078 765825 804456 823304 820575 799721
57657 799721 766647 727015 685351 644856 607158 572776 542060 515288 492065 471508 453199
57646 453199 437322 423844 412193 401828 392654 384865 378761 374541 371807 369540 367027 364516 362502
57633 362502 360877 359394 358350 357983 357681 356768 355678 355384 355933 356481 356497 355985 354864 353217 351980 352206 353604
57616 353604 354729 354636 353569 352177 350980 350513 350991 351814 352201 352217 352438 352830 352975 353207 354375 356455 358429
57599 358429 359611 360204 360530 360656 360837 361344 361758 361362 360362 359824 360237 360935 361068 360392 359038 357322 355867
57582 355867 355184 354939 354254 352729 350622 348290 346154 344899 344822 345251 345502 346072 347758 349913 350928 350370
57566 350370 349349 348736 348339 347960 347934 348245 348357 348253 348558 349381 350150 350947 352693 355507 358083 359392 360028
$$ packed form
57669D23781K2951K8434L4844M2287M9737N5287N6757N1747L8631J8848k729k0854
57657G99721l3074l9632m1664m0495l7698l4382l0716k6772k3223k0557j8309
57646D53199j5877j3478j1651j0365r174p789o104m220k734k267k513k511k014
57633C62502j625j483j044l67l02r13j090k94N49N48J6n12j121j647j237K26J398
57616C53604J125r3j067j392j197m67M78Q23L87J6K21L92J45K32J168K080J974
57599C58429J182N93L26J26J81N07M14l96j000n38M13O98J33o76j354j716j455
57582C55867o83k45o85j525k107k332k136j255p7M29K51N70J686K155J015n58
57566C50370j021o13l97l79k6L11J12j04L05Q23P69P97J746K814K576J309O36
$$ plain form
57549 360028 361124 362783 364266 365083 365268 365115 365145 365894 367432 369532 372334 376146 380633 385044 389357 394134
57533 394134 399054 402750 404549 405378 406429 407833 409162 410336 411377 412031 412255 412553 413290 414274 415358 416817
57517 416817 418780 420936 423173 425798 428754 431301 432907 433906 435036 436915 440060 444495 449121 452432
57503 452432 454284 456104 458944 462290 465177 467464 469398 470839 471709 472495 473605 474760 475599 476355 477480
57488 477480 479124 481266 483678 485539 485975 485349 485120 485985 487069 487443 487408 487671 488279 489084 490315 491867 492933
57471 492933 493259 493992 496340 500036 503942 507549 511006 514320 517425 520595 523956 527048 529579 532101 535211
57456 535211 538668 541930 545053 548320 551634 554980 558841 563365 567803 571588 575268 579494 583833 587605
57442 587605 591212 595446 600088 604438 608760 613895 619675 625055 629680 634071 638290 641687 644150 646530
$$ packed form
57549C60028J096J659J483Q17J85j53L0P49J538K100K802L812M487M411M313M777
57533C94134M920L696J799Q29J051J404J329J174J041O54K24K98P37R84J084J459
57517D16817J963K156K237K625K956K547J606R99J130J879L145M435M626L311
57503D52432J852J820K840L346K887K287J934J441Q70P86J110J155Q39P56J125
57488D77480J644K142K412J861M36o26k29Q65J084L74l5K63O08Q05J231J552J066
57471D92933L26P33K348L696L906L607L457L314L105L170L361L092K531K522L110
57456E35211L457L262L123L267L314L346L861M524M438L785L680M226M339L772
57442E87605L607M234M642M350M322N135N780N380M625M391M219L397K463K380
$$ plain form
57428 646530 649508 652934 656536 660466 664861 669515 674267 679216 684413 689723 695049 700271 705070 709284
57414 709284 713308 717618 722071 726228 730174 734416 739049 743687 748149 752645 757325 762243 767693 773966
57400 773966 780768 787392 793487 799268 805068 811147 817777 825004 832404 839584 846726 854179 861728 868864
57386 868864 875598 882365 889225 895841 902241 909014 916660 925171 934215 943291 951862 959774 967503 975525
57372 975525 983702 991720 999872 1008680 1017979 1027099 1035897 1044893 1054341 1063904 1073303 1082628 1091830 1100627
57358 1100627 1109200 1118411 1128859 1140045 1150814 1160537 1169632 1179024 1189229 1200023 1210947 1221997
57346 1221997 1233519 1245493 1257377 1268831 1280157 1291778 1303679 1315668 1327708 1339616 1350942
57335 1350942 1361643 1372489 1384278 1396936 1409846 1422646 1435284 1447757 1460386 1473885 1488501
$$ packed form
57428F46530K978L426L602L930M395M654M752M949N197N310N326N222M799M214
57414G09284M024M310M453M157L946M242M633M638M462M496M680M918N450O273
57400G73966O802O624O095N781N800O079O630P227P400P180P142P453P549P136
57386H68864O734O767O860O616O400O773P646Q511R044R076Q571P912P729Q022
57372I75525Q177Q018Q152Q808R299R120Q798Q996R448R563R399R325R202Q797
57358A100627Q573R211J0448J1186J0769R723R095R392J0205J0794J0924J1050
57346A221997J1522J1974J1884J1454J1326J1621J1901J1989J2040J1908J1326
57335A350942J0701J0846J1789J2658J2910J2800J2638J2473J2629J3499J4616
$$ plain form
57324 1488501 1503486 1518034 1532342 1547037 1562045 1576785 1591075 1605020 1618416 1631220 1644279
57313 1644279 1658543 1673763 1688992 1704131 1719805 1735854 1751322 1766151 1781602 1798449 1815885
57302 1815885 1832812 1849304 1866038 1883028 1899735 1916072 1932559 1949665 1967485 1985884 2004585
57291 2004585 2023251 2041826 2060705 2080304 2100483 2120611 2140203 2159408 2178825 2198862 2219368
57280 2219368 2239980 2260608 2281260 2301606 2321349 2341097 2362040 2384451 2407285 2429778 2452589
57269 2452589 2476602 2501291 2525291 2548142 2570479 2592835 2615231 2637795 2660816 2684213 2707723
57258 2707723 2731451 2755569 2779783 2803924 2828738 2855109 2882746 2910673 2938763 2967584 2996886
57247 2996886 3025607 3053459 3081242 3109302 3136877 3163341 3189010 3214334 3239338 3264315 3290096
$$ packed form
57324A488501J4985J4548J4308J4695J5008J4740J4290J3945J3396J2804J3059
57313A644279J4264J5220J5229J5139J5674J6049J5468J4829J5451J6847J7436
57302A815885J6927J6492J6734J6990J6707J6337J6487J7106J7820J8399J8701
57291B004585J8666J8575J8879J9599K0179K0128J9592J9205J9417K0037K0506
57280B219368K0612K0628K0652K0346J9743J9748K0943K2411K2834K2493K2811
57269B452589K4013K4689K4000K2851K2337K2356K2396K2564K3021K3397K3510
57258B707723K3728K4118K4214K4141K4814K6371K7637K7927K8090K8821K9302
57247B996886K8721K7852K7783K8060K7575K6464K5669K5324K5004K4977K5781
$$ plain form
57236 3290096 3317123 3345074 3373782 3403603 3434416 3465181 3495112 3524572 3554354 3584732 3615616
57225 3615616 3646873 3678074 3708721 3739201 3770742 3803932 3838029 3872193 3906558 3941466 3976505
57214 3976505 4011033 4044977 4078378 4110785 4141929 4172472 4203249 4234084 4264076 4292766 4320402
57203 4320402 4347319 4373710 4399863 4426124 4452707 4479775 4507426 4535328 4562804 4589631 4616422
57192 4616422 4643930 4672373 4701678 4731801 4762372 4792590 4821995 4850962 4879997 4908937 4937229
57181 4937229 4964498 4990391 5014438 5036681 5058004 5079224 5100213 5120500 5140332 5160416 5180803
57170 5180803 5200689 5219367 5236890 5253848 5270789 5287788 5304305 5319549 5333225 5345768 5357728
57159 5357728 5369169 5379729 5388871 5395885 5400081 5401227 5399503 5394867 5386904 5375470 5361029 5344161 5325248
$$ packed form
57236C290096K7027K7951K8708K9821L0813L0765K9931K9460K9782L0378L0884
57225C615616L1257L1201L0647L0480L1541L3190L4097L4164L4365L4908L5039
57214C976505L4528L3944L3401L2407L1144L0543L0777L0835K9992K8690K7636
57203D320402K6917K6391K6153K6261K6583K7068K7651K7902K7476K6827K6791
57192D616422K7508K8443K9305L0123L0571L0218K9405K8967K9035K8940K8292
57181D937229K7269K5893K4047K2243K1323K1220K0989K0287J9832K0084K0387
57170E180803J9886J8678J7523J6958J6941J6999J6517J5244J3676J2543J1960
57159E357728J1441J0560R142P014M196J146j724m636p963j1434j4441j6868j8913
$$ plain form
57146 5325248 5304758 5283291 5261168 5238581 5216330 5195645 5176991 5159870 5144273 5131508 5123030
57135 5123030 5119151 5119469 5123803 5132012 5143552 5157972 5175265 5195068 5216147 5237370 5258527 5279415
57123 5279415 5298875 5315878 5331204 5347063 5365374 5387295 5414135 5447770 5490300 5543954 5610954
57112 5610954 5692574 5788600 5898543 6023184 6164322 6323740 6503894 6709771 6949342 7232572
57102 7232572 7571214 7979768 8475922 9080292 9816815 10713596 11802672 13119020 14700401
57093 14700401 16587456 18821938 21442695 24480120 27948360 31835814 36098725 40661297
57085 40661297 45416990 50223801 54899062 59230105 63005970 66052947 68252816 69542927
57077 69542927 69914115 69414793 68151262 66271584 63935357 61284539 58427888 55440426
$$ packed form
57146E325248k0490k1467k2123k2587k2251k0685j8654j7121j5597j2765q478
57135E123030l879L18M334Q209J1540J4420J7293J9803K1079K1223K1157K0888
57123E279415J9460J7003J5326J5859J8311K1921K6840L3635M2530N3654O7000
57112E610954Q1620R6026J09943J24641J41138J59418J80154K05877K39571K83230
57102G232572L38642M08554M96154O04370P36523Q96781J089076J316348J581381
57093A4700401J887055K234482K620757L037425L468240L887454M262911M562572
57085D0661297M755693M806811M675261M331043L775865L046977K199869J290111
57077F9542927L71188m99322j263531j879678k336227k650818k856651k987462
$$ plain form
57069 55440426 52371600 49255260 46117603 42982339 39873896 36819104 33847130 30987537
57061 30987537 28267357 25708279 23324587 21122171 19099097 17247692 15557274 14016324
57053 14016324 12613749 11339531 10184913 9142009 8203078 7360157 6605318 5931002 5329927
57044 5329927 4794884 4318878 3895523 3519175 3184702 2887312 2622617 2386762 2176509
57035 2176509 1989230 1822671 1674612 1542943 1426284 1324391 1237740 1166885 1112505 1075891
57025 1075891 1059109 1064686 1094642 1147805 1215704 1280958 1322314 1324420 1284758 1212476 1121587 1024576
57013 1024576 929515 840018 756890 680367 611280 550285 496737 449186 406804 369671 337822
57002 337822 310752 287903 268942 253325 240133 228577 218420 209721 202368 195975 190077 184428
$$ packed form
57069E5440426l068826l116340l137657l135264l108443l054792k971974k859593
57061C0987537k720180k559078k383692k202416k023074j851405j690418j540950
57053A4016324j402575j274218j154618j042904r38931q42921p54839o74316o01075
57044E329927n35043m76006m23355l76348l34473k97390k64695k35855k10253
57035B176509j87279j66559j48059j31669j16659j01893q6651p0855n4380l6614
57025A075891j6782N577K9956N3163O7899O5254M1356K106l9662p2282r0889r7011
57013A024576r5061q9497q3128p6523o9087o0995n3548m7551m2382l7133l1849
57002C37822k7070k2849j8961j5617j3192j1556j0157q699p353o393n898n649
$$ plain form
56990 184428 179216 174922 171892 170229 170192 172313 176806 183040 189866 196091 200228 200279 194613 183289 168134
56975 168134 151403 134571 118193 102388 87217 72920 59975 48929 40178 33955 30433 29687
56963 29687 31722 36609 44559 55860 70932 90315 113997 140445 166591 188913 204448 211143
56951 211143 208352 197516 181683 163695 145098 126933 110595 97057 85864 75872 66831 59577
56939 59577 55006 53622 55878 62164 72458 86664 105244 128978 158006 191213 226021 258120
56927 258120 282066 293552 291725 279117 259487 236028 211042 186111 162166 139791 119516 101533
56915 101533 85345 70241 56030 42945 31164 20882 12451 5795 -33 -5991 -11997 -17286 -21482
56902 -21482 -24577 -26380 -26922 -27045 -27481 -27571 -26026 -22794 -18977 -14867 -9340 -1386 8926 21360 36239
$$ packed form
56990A84428n212m294l030j663l7K121M493O234O826O225M137N1n666j1324j5155
56975A68134j6731j6832j6378j5805j5171j4297j2945j1046q751o223l522p46
56963B9687K035M887P950J1301J5072J9383K3682K6448K6146K2322J5535O695
56951B11143k791j0836j5833j7988j8597j8165j6338j3538j1193r992r041p254
56939E9577m571j384K256O286J0294J4206J8580K3734K9028L3207L4808L2099
56927B58120K3946J1486j827j2608j9630k3459k4986k4931k3945k2375k0275j7983
56915A01533j6188j5104j4211j3085j1781j0282q431E795c3n958o006n289m196
56902b1482l095j803n42j23m36r0J545L232L817M110N527a386H926J2434J4879
$$ plain form
56887 36239 53791 73636 95314 118299 140904 160010 172718 178053 176998 171542 163957 156072 148594
56874 148594 141525 135388 131315 129688 129669 130708 133789 140482 151359 166079 184718 208320 238253
56861 238253 275437 319847 370080 423052 474108 517640 548291 562727 560944 545868 521716 492756
56849 492756 462874 435031 410656 390027 373346 360984 352925 348998 349936 357458 373063 397493
56837 397493 431590 476722 533814 602396 680518 764265 846546 917333 966692 988589 982656 953408
56825 953408 908066 853909 796310 738665 683591 633311 588852 549988 516561 489275 468954
56814 468954 455924 450563 453669 465774 486910 517574 558888 610754 669919 730054 783098 820758
56802 820758 836761 829605 803089 763384 715772 664230 612446 563394 518204 476778 439485 407287
$$ packed form
56887C6239J7552J9845K1678K2985K2605J9106J2708N335j055n456p585p885p478
56874A48594p069o137m073j627j9J039L081O693J0877J4720J8639K3602K9933
56861B38253L7184M4410N0233N2972N1056M3532L0651J4436j783j5076k4152k8960
56849D92756k9882k7843k4375k0629j6681j2362q059l927R38P522J5605K4430
56837C97493L4097M5132N7092O8582P8122Q3747Q2281P0787M9359K1897n933k9248
56825I53408m5342n4157n7599n7645n5074n0280m4459l8864l3427k7286k0321
56814D68954j3030n361L106J2105K1136L0664M1314N1866N9165O0135N3044L7660
56802H20758J6003p156k6516l9705m7612n1542n1784m9052m5190m1426l7293l2198
$$ plain form
56790 407287 380463 358429 340929 328470 321401 319447 322539 331550 347755 371518 401190 432779
56778 432779 460789 480061 487460 482357 466240 442084 413351 382727 351626 320874 291281 263249
56766 263249 236556 211220 188172 168420 151845 137505 124862 114078 105224 97841 91278 85073
56754 85073 79037 73212 67610 61930 55894 49963 45056 41281 37643 33458 29364 26303 24212 22468
56740 22468 21046 20339 20218 20157 20038 20047 20025 19617 18894 18199 17609 17128 17032 17406 17745 17747 18027 19249 20970 22213
56720 22213 22831 23314 23654 23535 23447 24353 26164 27678 28257 28595 29536 31061 32764 34539 36363 38070 39722
56703 39722 41673 43939 45915 47024 47264 46989 46600 46556 47198 48280 49030 48902 48104 47357 47352 48334 49837 50911
56685 50911 51040 50781 51059 51916 52456 52020 50914 49917 49521 49768 50415 51062 51378 51330 51143 51133 51640 52865 54549
$$ packed form
56790D07287k6824k2034j7500j2459p069j954L092R011J6205K3763K9672L1589
56778D32779K8010J9272P399n103j6117k4156k8733l0624l1101l0752k9593k8032
56766B63249k6693k5336k3048j9752j6575j4340j2643j0784q854p383o563o205
56754H5073o036n825n602n680o036n931m907l775l638m185m094l061k091j744
56740B2468j422p07j21o1j19Rk2m08p23o95n90m81r6L74L39KK80J222J721J243
56720B2213O18M83L40j19q8R06J811J514N79L38R41J525J703J775J824J707J652
56703C9722J951K266J976J109K40k75l89m4O42J082P50j28p98p47nR82J503J074
56685E0911J29k59K78Q57N40m36j106r97l96K47O47O47L16m8j87j0N07J225J684
$$ plain form
56666 54549 56098 57225 58137 58897 59169 58985 59147 60265 61890 63271 64501 66103 67878 69113 69731 70367
56650 70367 71379 72573 73837 75316 77000 78817 81020 83789 86584 88626 89948 91263 92946 94843
56636 94843 96840 98797 100150 100562 100819 102077 104241 106137 107263 108236 109360 110032 110010 110107 110983 112068 112329
56619 112329 111478 109918 108164 106801 106401 106857 107210 106695 105691 105230 105826 107059 108070 108243 107614 106718 105897
56602 105897 104895 103398 101661 100081 98465 96457 94467 93208 92405 91061 89159 87977 88271 89122 89216
56587 89216 88500 87924 88124 88992 90097 90972 91307 91338 91787 93142 95196 97496 99881 102406 105072 107801 110382
56570 110382 112473 114060 115814 118379 121339 123654 125156 126857 129652 133496 138093 143536 149976 157391
56556 157391 165910 175519 185144 193043 198740 203712 209531 216075 222237 227604 232451 236607 239367 240472
$$ packed form
56666E4549J549J127R12P60K72j84J62J118J625J381J230J602J775J235O18O36
56650G0367J012J194J264J479J684J817K203K769K795K042J322J315J683J897
56636I4843J997J957J353M12K57J258K164J896J126R73J124O72k2R7Q76J085K61
56619A12329q51j560j754j363m00M56L53n15j004m61N96J233J011J73o29q96q21
56602A05897j002j497j737j580j616k008j990j259q03j344j902j182K94Q51R4
56587H9216p16n76K00Q68J105Q75L35L1M49J355K054K300K385K525K666K729K581
56570A10382K091J587J754K565K960K315J502J701K795L844M597N443O440P415
56556A57391Q519R609R625P899N697M972N819O544O162N367M847M156K760J105
$$ plain form
56542 240472 240466 240124 239969 240143 240301 239830 238499 236629 234377 231335 227311 222976 219101 215476 211252 206190
56526 206190 200919 196048 191620 187481 183650 180186 176976 173830 170621 167301 163934 160745 158010 155793
56512 155793 153826 151736 149516 147748 147049 147258 147487 147194 146733 146506 146133 145123 143894 143263 143179 142899 142277
56495 142277 141865 141732 141250 140303 139655 139757 140067 139959 139488 138867 137982 136944 136375 136592 137088 137302 137327 137438 137536
56476 137536 137544 137818 138645 139772 140831 141749 142475 142854 143064 143562 144284 144623 144520 144796 145908 147180 147809 147916
56458 147916 147963 147903 147632 147660 148509 149910 151306 152638 153946 154722 154555 154019 154004 154429 154430 153740 153054 153009 153441 153801
56438 153801 153854 153822 154157 155201 156933 159028 161150 162999 164155 164393 164187 164375 165091 165583 165279 164535 164083
56421 164083 164247 164930 165802 166314 166173 166015 166879 168730 170251 170522 170099 170035 170622 171595 172753 173765 174087 173743
$$ packed form
56542B40472ol42j55J74J58m71j331j870k252l042m024m335l875l625m224n062
56526B06190n271m871m428m139l831l464l210l146l209l320l367l189k735k217
56512A55793j967k090k220j768o99K09K29k93m61k27l73j010j229o31q4k80o22
56495A42277m12j33m82r47o48J02L10j08m71o21q85j038n69K17M96K14K5J11R8
56476A37536QK74Q27J127J059R18P26L79K10M98P22L39j03K76J112J272O29J07
56458A47916M7o0k71K8Q49J401J396J332J308P76j67n36j5M25Jo90o86m5M32L60
56438A53801N3l2L35J044J732K095K122J849J156K38k06J88P16M92l04p44m52
56421A64083J64O83Q72N12j41j58Q64J851J521K71m23o4N87R73J158J012L22l44
$$ plain form
56403 173743 173500 173697 173663 172957 172328 172636 173547 174268 174934 176258 178238 180212 181921 183646 185543 187574 189826
56386 189826 192196 194012 194740 194871 195468 196970 198828 200118 200195 199244 198503 199325 201587 203707 204712 205441
56370 205441 207035 209205 210999 212485 214448 216862 218850 219933 220321 220196 219645 219166 219391 220363 221633 222864
56354 222864 223843 224339 224538 225131 226311 227215 226987 225869 224562 223299 222406 222893 225264 228311 230374 231375
56338 231375 232417 233820 234884 235361 235817 236574 237479 238712 240648 242878 244414 245005 245350 246001 246930 248157
56322 248157 249818 251571 252905 254112 256124 259244 262770 265915 268446 270435 272080 273721 275388 276520
56308 276520 276691 276318 276029 275851 275853 277002 280152 284587 288830 292672 297108 302410 307773 312878 318282 323858
56292 323858 328302 330854 332366 333988 335695 336894 337671 338609 339806 340856 341727 343119 345924 350407 355902
$$ packed form
56403A73743k43J97l4p06o29L08R11P21O66J324J980J974J709J725J897K031K252
56386A89826K370J816P28J31N97J502J858J290P7r51p41Q22K262K120J005P29
56370B05441J594K170J794J486J963K414J988J083L88j25n51m79K25R72J270J231
56354B22864R79M96J99N93J180R04k28j118j307j263q93M87K371L047K063J001
56338B31375J042J403J064M77M56P57R05J233J936K230J536N91L45O51R29J227
56322B48157J661J753J334J207K012L120L526L145K531J989J645J641J667J132
56308B76520J71l73k89j78KJ149L150M435M243L842M436N302N363N105N404N576
56292C23858M444K552J512J622J707J199P77R38J197J050Q71J392K805M483N495
$$ plain form
56277 355902 361355 366273 370998 376053 381635 387961 395417 403817 412104 419526 426640 434450 442997 451646
56263 451646 460384 469902 480690 492945 507079 523405 541478 560693 581387 604573 630718 659652
56251 659652 691541 727102 766953 811488 861207 916477 977095 1042715 1113357 1188854 1268220
56240 1268220 1350337 1434756 1520900 1606864 1689899 1767674 1838301 1899781 1950535 1989997 2017744
56229 2017744 2032703 2034312 2023710 2002435 1970633 1928067 1876290 1818117 1755354 1688791 1620079
56218 1620079 1551602 1484342 1417641 1351381 1286868 1225349 1167125 1112416 1061619 1014357 969568
56207 969568 926952 887286 851165 818532 789414 763823 740785 718821 697629 678230 661440
56196 661440 647247 635556 626185 618149 610309 602784 596428 591032 585506 579780 574943 571390 568339 565352
$$ packed form
56277C55902N453M918M725N055N582O326P456Q400Q287P422P114P810Q547Q649
56263D51646Q738R518J0788J2255J4134J6326J8073J9215K0694K3186K6145K8934
56251F59652L1889L5561L9851M4535M9719N5270O0618O5620P0642P5497P9366
56240A268220Q2117Q4419Q6144Q5964Q3035P7775P0627O1480N0754L9462K7747
56229B017744J4959J609j0602k1275l1802m2566n1777n8173o2763o6563o8712
56218A620079o8477o7260o6701o6260o4513o1519n8224n4709n0797m7262m4789
56207I69568m2616l9666l6121l2633k9118k5591k3038k1964k1192j9399j6790
56196F61440j4193j1691r371q036p840p525o356n396n526n726m837l553l051k987
$$ plain form
56182 565352 562854 560937 559123 557478 556576 556257 555858 555679 556678 558628 560191 560889 561382 561803 561647 561517 563004
56165 563004 566430 570458 574375 578995 584855 591274 597741 604621 612021 619575 627756 637638 648939 660089
56151 660089 670725 682360 696035 711171 727346 745336 765662 787875 812102 839671 871496
56140 871496 907433 947804 993895 1046443 1105609 1173055 1251881 1343329 1445091 1553440 1665016
56129 1665016 1775694 1880158 1974487 2058044 2131991 2197686 2257383 2314250 2369612 2421062 2464424
56118 2464424 2496658 2516427 2523755 2520607 2510616 2496821 2480002 2459127 2431834 2394214 2342226 2274643
56106 2274643 2193714 2102876 2005532 1906069 1809439 1718577 1633997 1556497 1488054 1429276 1378345
56095 1378345 1333618 1295163 1262772 1234772 1210129 1189563 1173274 1159696 1147863 1138929 1133835 1131377
$$ packed form
56182E65352k498j917j814j645r02l19l99j79R99J950J563O98M93M21j56j30J487
56165E63004L426M028L917M620N860O419O467O880P400P554Q181R882J1301J1150
56151F60089J0636J1635J3675J5136J6175J7990K0326K2213K4227K7569L1825
56140H71496L5937M0371M6091N2548N9166O7446P8826R1448J01762J08349J11576
56129A665016J10678J04464R4329Q3557P3947O5695N9697N6867N5362N1450M3362
56118B464424L2234J9769P328l148r991j3795j6819k0875k7293l7620n1988o7583
56106B274643q0929r0838r7344r9463r6630r0862q4580p7500o8443n8778n0931
56095A378345m4727l8455l2391k8000k4643k0566j6289j3578j1833q934n094k458
$$ plain form
56083 1131377 1130017 1129755 1130881 1132721 1134946 1138394 1143433 1149283 1155927 1164677 1175804 1187687 1199281
56070 1199281 1211268 1223948 1236530 1249485 1264842 1282862 1301101 1318133 1335416 1354125 1373120
56059 1373120 1391702 1411356 1432802 1454205 1474260 1494302 1515329 1535827 1554659 1573341 1593295
56048 1593295 1613535 1633212 1653659 1675883 1698881 1722553 1749220 1780029 1812942 1846496 1882221
56037 1882221 1920927 1960153 1998137 2036827 2077886 2119121 2158141 2196332 2235862 2275928 2315387
56026 2315387 2356070 2400046 2446454 2494214 2544735 2598742 2653823 2708577 2765698 2827397 2891406
56015 2891406 2955283 3021015 3091306 3165015 3240479 3319654 3404633 3493729 3585417 3682309 3786635
56004 3786635 3895800 4007312 4124075 4249623 4382089 4518295 4659923 4810204 4968570
$$ packed form
56083A131377j360k62J126J840K225L448N039N850O644Q750J1127J1883J1594
56070A199281J1987J2680J2582J2955J5357J8020J8239J7032J7283J8709J8995
56059A373120J8582J9654K1446K1403K0055K0042K1027K0498J8832J8682J9954
56048A593295K0240J9677K0447K2224K2998K3672K6667L0809L2913L3554L5725
56037A882221L8706L9226L7984L8690M1059M1235L9020L8191L9530M0066L9459
56026B315387M0683M3976M6408M7760N0521N4007N5081N4754N7121O1699O4009
56015B891406O3877O5732P0291P3709P5464P9175Q4979Q9096R1688R6892J04326
56004C786635J09165J11512J16763J25548J32466J36206J41628J50281J58366
$$ plain form
55995 4968570 5134063 5309807 5498264 5696444 5901798 6118313 6350614 6597082 6855547
55986 6855547 7130580 7427757 7745881 8082734 8443390 8834663 9256652 9708545 10197407
55977 10197407 10732106 11313910 11942670 12626777 13377231 14198216 15094613 16082983 17184357
55968 17184357 18413515 19788107 21341678 23115471 25146716 27481320 30191731 33368947
55960 33368947 37108831 41526025 46772120 53021426 60454033 69284133 79806010 92401833
55952 92401833 107531152 125748025 147704832 174068324 205342005 241560361 281720799
55945 281720799 323050037 360778368 389201814 403849623 403364071 389720967 366814518
55938 366814518 338674863 308443667 278215014 249244204 222186487 197322550 174747301
$$ packed form
55995D968570J65493J75744J88457J98180K05354K16515K32301K46468K58465
55986F855547K75033K97177L18124L36853L60656L91273M21989M51893M88862
55977A0197407N34699N81804O28760O84107P50454Q20985Q96397R88370J101374
55968A7184357J229158J374592J553571J773793K031245K334604K710411L177216
55960C3368947L739884M417194N246095O249306P432607Q830100J0521877J2595823
55952I2401833J5129319J8216873K1956807K6363492L1273681L6218356M0160438
55945B81720799M1329238L7728331K8423446J4647809m85552j3643104k2906449
55938C66814518k8139655l0231196l0228653k8970810k7057717k4863937k2575249
$$ plain form
55931 174747301 154458222 136369971 120340511 106214629 93833387 83018184 73579857
55924 73579857 65346787 58168187 51898448 46401482 41569159 37318597 33574042 30265937
55916 30265937 27342639 24765756 22494427 20486014 18708362 17137779 15746951 14506794
55908 14506794 13397987 12409126 11525102 10727687 10005557 9353436 8762659 8221914 7725682
55899 7725682 7272875 6858456 6474839 6119923 5795316 5497842 5220784 4962218 4724328
55890 4724328 4505641 4301447 4110851 3936022 3775297 3624149 3482268 3352875 3235699
55881 3235699 3127226 3027092 2937402 2855912 2776344 2695552 2614647 2533455 2450031 2365786 2285129
55870 2285129 2209341 2135744 2063144 1993184 1926175 1860441 1796143 1735255 1677585 1621007 1565610
$$ packed form
55931A74747301k0289079j8088251j6029460j4125882j2381242j0815203r438327
55924G3579857q233070p178600o269739n496966m832323m250562l744555l308105
55916C0265937k923298k576883k271329k008413j777652j570583j390828j240157
55908A4506794j108807r88861q84024p97415p22130o52121n90777n40745m96232
55899G725682m52807m14419l83617l54916l24607k97474k77058k58566k37890
55890D724328k18687k04194j90596j74829j60725j51148j41881j29393j17176
55881C235699j08473j00134q9690q1490p9568q0792q0905q1192q3424q4245q0657
55870B285129p5788p3597p2600o9960o7009o5734o4298o0888n7670n6578n5397
$$ plain form
55859 1565610 1513473 1464513 1416687 1370123 1326967 1287461 1250245 1216126 1187295 1162992 1140053
55848 1140053 1117466 1096326 1075690 1052948 1028244 1004340 981991 959539 937026 916463 897892
55837 897892 879316 860792 844494 830333 815610 799539 784173 770261 756109 741346 728078
55826 728078 717393 708143 699862 693347 687517 679315 667882 655637 644315 633113 621714 611681
55814 611681 603491 595235 585742 576364 568362 561056 553848 547662 543153 539635 536844 535702 536503 538408
55800 538408 541443 546755 554149 561564 567809 573665 579525 584185 586869 588292 588853 587682 584276 579213
55786 579213 572620 563959 554054 545308 539090 534552 530457 526195 520585 511998 500666 489033 479054 470869
55772 470869 464617 461514 462349 466825 475058 487727 503699 519157 529987 533828 529769 518233 501901
$$ packed form
55859A565610n2137m8960m7826m6564m3156l9506l7216l4119k8831k4303k2939
55848A140053k2587k1140k0636k2742k4704k3904k2349k2452k2513k0563j8571
55837H97892j8576j8524j6298j4161j4723j6071j5366j3912j4152j4763j3268
55826G28078j0685r250q281o515n830q202j1433j2245j1322j1202j1399j0033
55814F11681q190q256r493r378q002p306p208o186m509l518k791j142Q01J905
55800E38408L035N312P394P415O245N856N860M660K684J423N61j171l406n063
55786E79213o593q661r905q746o218m538m095m262n610q587j1332j1633r979q185
55772D70869o252l103Q35M476Q233J2669J5972J5458J0830L841m059j1536j6332
$$ plain form
55759 501901 484724 468923 454201 440114 427235 415567 403980 392162 381246 371687 362388 352747
55747 352747 343676 335707 327937 319827 312239 305712 299401 292799 286920 282729 279945 278284 278244 279612 280767
55732 280767 280563 279539 278319 276289 272854 268543 263843 258385 252305 246952 243070 239621 235545 231439
55718 231439 228359 226160 224209 222690 222050 222086 222552 223812 226113 229159 233043 238473 245314 252055 257425
55703 257425 261312 263435 262645 258573 252684 246557 240239 233231 225945 219078 212680 206904 202565 199811
55689 199811 197246 193539 189056 184948 181588 178949 177507 177542 178390 179529 181619 185304 189672 193040 194745
55674 194745 195226 194975 194367 193949 193925 193782 193166 192557 192399 192243 191471 190273 189233 188655 188880 190440 193129 195779
55656 195779 197769 200013 203637 208412 213337 217904 221932 224901 226524 227439 228440 229424 229799 229395 228318
$$ packed form
55759E01901j7177j5801j4722j4087j2879j1668j1587j1818j0916r559r299r641
55747C52747r071p969p770q110p588o527o311o602n879m191k784j661m0J368J155
55732B80767k04j024j220k030l435m311m700n458o080n353l882l449m076m106
55718B31439l080k199j951j519o40L6M66J260K301L046L884N430O841O741N370
55703B57425L887K123p90m072n889o127o318p008p286o867o398n776m339k754
55689A99811k565l707m483m108l360k639j442L5Q48J139K090L685M368L368J705
55674A94745M81k51o08m18k4j43o16o09j58j56p72j198j040n78K25J560K689K650
55656A95779J990K244L624M775M925M567M028K969J623R15J001R84L75m04j077
$$ plain form
55641 228318 226529 224216 221951 219834 217138 213365 208898 204036 198390 191953 185776 180617 175830 170614
55627 170614 165546 161765 159290 157295 155486 154132 153181 152375 151877 151836 151678 150708 149105 147551 146251 145027
55611 145027 143929 143016 141938 140425 138771 137207 135364 133016 130746 129116 127796 126289 124915 124193 123787
55596 123787 122985 121762 120558 119442 118300 117380 116824 116185 115145 114177 113668 113016 111539 109654 108148 106851
55580 106851 105142 103317 102262 102101 102361 103209 105255 108192 110800 112477 113802 115487 117645 120234 123353
55565 123353 126838 130172 133008 135362 137273 138726 139870 140842 141403 141096 139707 137280 133940 130099 126539
55550 126539 123911 122336 121671 121635 121401 119825 116738 113428 111222 110094 109330 108885 109180 110020 110749 111190 111592
55533 111592 111868 111709 111274 111005 110905 110712 110528 110588 110632 110202 109370 108520 107680 106741 105972 105566 104989 103625 101844
$$ packed form
55641B28318j789k313k265k117k696l773m467m862n646o437o177n159m787n216
55627A70614n068l781k475j995j809j354r51q06m98m1j58r70j603j554j300j224
55611A45027j098r13j078j513j654j564j843k348k270j630j320j507j374p22m06
55596A23787q02j223j204j116j142r20n56o39j040r68n09o52j477j885j506j297
55580A06851j709j825j055j61K60Q48K046K937K608J677J325J685K158K589L119
55565A23353L485L334K836K354J911J453J144R72N61l07j389k427l340l841l560
55550A26539k628j575o65l6k34j576l087l310k206j128p64m45K95Q40P29M41M02
55533A11592K76j59m35k69j00j93j84O0M4m30q32q50q40r39p69m06n77j364j781
$$ plain form
55514 101844 100602 100153 99954 99677 99505 99493 99406 99124 98594 97597 96211 95180 95032 95100 94275 92593 91128 90492
55496 90492 90344 90320 90474 90698 90600 90128 89568 88825 87470 85612 84005 83160 82994 83376 84227 84971 84773 83692
55478 83692 82911 83391 84804 86128 86784 86866 86711 86659 86954 87498 87799 87384 86282 85058 84355 84291 84205 83287 81658
55459 81658 80524 80969 82855 85258 87578 89684 91262 91810 91323 90479 89996 90096 90577 91079 91288 91151 90925
55442 90925 90880 91018 91107 90780 89677 87951 86620 86689 87784 88420 87988 87523 87959 88621 88375 87494 87216 87912 88792
55423 88792 89171 89019 88469 87732 87370 87803 88620 89193 89747 91049 93197 95556 97741 99821 101740 103362 104910
55406 104910 106505 107445 106883 105149 103453 102394 101641 100962 100481 99959 98901 97569 96869 97018 97196 96705 95641
55389 95641 94292 92749 91348 90616 90507 90435 90215 90221 90433 90244 89535 89094 89552 90517 91151 91088 90523 89958 90015 90977
$$ packed form
55514A01844j242m49j99k77j72j2q7k82n30r97j386j031j48O8q25j682j465o36
55496I0492j48k4J54K24r8m72n60p43j355j858j607q45j66L82Q51P44j98j081
55478H3692p81M80J413J324O56Q2j55n2K95N44L01m15j102j224p03o4q6r18j629
55459H1658j134M45J886K403K320K106J578N48m87q44m83J00M81N02K09j37k26
55442I0925m5J38Q9l27j103j726j331O9J095O36m32m65M36O62k46q81k78O96Q80
55423H8792L79j52n50p37l62M33Q17N73N54J302K148K359K185K080J919J622J548
55406A04910J595R40n62j734j696j059p53o79m81n22j058j332p00J49J78m91j064
55389I5641j349j543j401p32j09p2k20OK12j89p09m41M58R65O34o3n65n65N7R62
$$ plain form
55369 90977 92336 93290 93703 94008 94308 94304 94013 93673 92985 91454 89574 88537 88491 88189 86825 85177 84390 84501
55351 84501 84825 85001 84961 84514 83657 82854 82530 82652 83142 84149 85565 86856 87731 88451 89196 89728 89995 90363
55333 90363 90874 90968 90364 89601 89236 89156 89082 89074 89086 88740 88079 87851 88430 89132 89250 89119 89424 90060 90468 90609 90767
55312 90767 90807 90471 90113 90319 91003 91611 91982 92275 92281 91640 90633 90014 89997 90111 90042 89940 89823 89432 88911 88995 90077
55291 90077 91552 92526 92959 93630 95004 96512 97095 96303 94685 93154 92193 91714 91458 91342 91521 92206 93269
55274 93269 94022 93818 93091 93198 94697 96282 96226 94566 92910 92294 92352 92607 93339 94681 95943 96543 96826 97273
55256 97273 97573 97256 96688 96665 97301 97987 98199 97834 96992 95925 94981 94234 93407 92481 91938 92008 92135 91679 90796
55237 90796 90103 89880 90117 90948 92334 93561 93778 93027 92256 92334 93340 94644 95360 94943 93697 92511 91861
$$ packed form
55369I0977J359R54M13L05L00mk91l40o88j531j880j037m6l02j364j648p87J11
55351H4501L24J76m0m47q57q03l24J22M90J007J416J291Q75P20P45N32K67L68
55333I0363N11R4o04p63l65q0p4qJ2l46o61k28N79P02J18j31L05O36M08J41J58
55312I0767M0l36l58K06O84O08L71K93Oo41j007o19j7J14o9j02j17l91n21Q4J082
55291I0077J475R74M33O71J374J508N83p92j618j531r61m79k56j16J79O85J063
55274I3269P53k04p27J07J499J585n6j660j656o16N8K55P32J342J262O00K83M47
55256I7273L00l17n68k3O36O86K12l65q42j067r44p47q27r26n43P0J27m56q83
55237I0796o93k23K37Q31J386J227K17p51p71P8J006J304P16m17j246j186o50
$$ plain form
55220 91861 91389 90734 90276 90572 91513 92573 93533 94361 94770 94588 94306 94555 95226 95769 96141 96699 97298 97350 96854
55201 96854 96590 97075 97916 98439 98406 97926 97105 96073 95053 94228 93720 93704 94240 94952 95269 94992 94356 93568 92706
55182 92706 92055 92067 92791 93729 94470 95182 96240 97598 98748 99220 99019 98648 98748 99591 100876 102046 102830 103406
55164 103406 104119 105086 105979 106195 105458 104354 103954 104636 105581 105779 105322 105230 106086 107363 108192 108409 108604 109319
55146 109319 110395 111096 110812 109630 108155 106830 105648 104573 103934 104109 104944 105758 105891 105182 104030 103113
55130 103113 102882 103192 103542 103644 103484 102925 101777 100426 99769 100128 100740 100785 100486 100604 101213 101675 101651 101467 101546
55111 101546 102070 103134 104673 106200 107166 107598 107937 108295 108430 108457 108940 110079 111350 112179 112549 112758 113004
55094 113004 113459 114276 115205 115533 114837 113632 112960 113363 114426 115230 115074 113876 112094 110392 109293 109020 109410
$$ packed form
55220I1861m72o55m58K96R41J060R60Q28M09j82k82K49O71N43L72N58N99N2m96
55201I6854k64M85Q41N23l3m80q21j032j020q25n08j6N36P12L17k77o36p88q62
55182I2706o51J2P24R38P41P12J058J358J150M72k01l71J00Q43J285J170P84N76
55164A03406P13R67Q93K16p37j104m00O82R45J98m57r2Q56J277Q29K17J95P15
55146A09319J076P01k84j182j475j325j182j075o39J75Q35Q14J33p09j152r17
55130A03113k31L10L50J02j60n59j148j351o57L59O12M5k99J18O09M62k4j84P9
55111A01546N24J064J539J527R66M32L39L58J35K7M83J139J271Q29L70K09K46
55094A13004M55Q17R29L28o96j205o72M03J063Q04j56j198j782j702j099k73L90
$$ plain form
55077 109410 109900 109869 109306 108987 109652 111064 112274 112776 112960 113351 113863 114046 113718 113057 112308 111681 111356 111348 111446
55058 111446 111527 111830 112634 113701 114336 114122 113440 113083 113418 114089 114504 114403 113838 112811 111255 109375 107720
55041 107720 106702 106218 105888 105527 105298 105518 106491 108351 110810 113084 114341 114304 113420 112436 111879 111812 111970 112119
55023 112119 112316 112737 113257 113413 112900 111968 111163 110792 110787 110953 111176 111390 111528 111515 111371 111357 111879 113026 114250
55004 114250 114854 114811 114725 114876 114841 114329 113942 114554 116111 117529 117785 116860 115651 115192 115864 117123 118115 118625
54986 118625 119240 120411 121681 122229 121958 121658 122115 123328 124525 124816 124010 122970 122896 124013 125303 125822 125842
54969 125842 126245 127221 128235 129028 129845 130665 131005 130720 130375 130490 130827 130755 130080 129205 128655 128657 129143 129972 131104
54950 131104 132496 133869 134783 135117 135271 135683 136299 136711 136639 136021 134881 133427 132103 131220 130693 130432 130679
$$ packed form
55077A09410M90l1n63l19O65J412J210N02J84L91N12J83l28o61p49o27l25qR8
55058A11446Q1L03Q04J067O35k14o82l57L35O71M15j01n65j027j556j880j655
55041A07720j018m84l30l61k29K20R73J860K459K274J257l7q84r84n57o7J58J49
55023A12119J97M21N20J56n13r32q05l71nJ66K23K14J38j3j44j4N22J147J224
55004A14250O04m3q6J51l5n12l87O12J557J418K56r25j209m59O72J259R92N10
54986A18625O15J171J270N48k71l00M57J213J197K91q06j040p4J117J290N19K0
54969A25842M03R76J014P93Q17Q20L40k85l45J15L37p2o75q75n50KM86Q29J132
54950A31104J392J373R14L34J54M12O16M12p2o18j140j454j324q83n27k61K47
$$ plain form
54933 130679 131521 132402 132717 132687 132974 133526 133561 132795 132036 132324 133972 136558 139396 141934 144265 147395 152429
54916 152429 159169 166025 171550 175632 178987 182098 185045 187763 189803 190164 188079 183924 178881 173762
54902 173762 168593 163319 158388 154397 151434 149009 146557 143897 141236 138883 137059 135873 135262 134875 134244
54887 134244 133331 132702 132881 133640 134330 134814 135568 136842 138303 139793 141916 145367 149961 154857 159638 164669
54871 164669 170341 176424 182287 187372 191144 192948 192492 190480 188261 186507 184536 181283 176717 171858
54857 171858 167526 163652 159876 156222 152842 149648 146630 144233 142865 142213 141482 140239 138639 136970 135353
54842 135353 133796 132204 130491 128982 128460 129305 130750 131503 131074 130014 128917 127794 126531 125404 124853
54827 124853 125021 125673 126362 126655 126429 125972 125658 125633 126019 127039 128559 129794 130062 129641 129290 129158 128905 128724
$$ packed form
54933A30679Q42Q81L15l0K87N52L5p66p59K88J648K586K838K538K331L130N034
54916A52429O740O856N525M082L355L111K947K718K040L61k085m155n043n119
54902A73762n169n274m931l991k963k425k452k660k661k353j824j186o11l87o31
54887A34244r13o29J79P59O90M84P54J274J461J490K123L451M594M896M781N031
54871A64669N672O083N863N085L772J804m56k012k219j754j971l253m566m859
54857A71858m332l874l776l654l380l194l018k397j368o52p31j243j600j669j617
54842A35353j557j592j713j509n22Q45J445P53m29j060j097j123j263j127n51
54827A24853J68O52O89K93k26m57l14k5L86J020J520J235K68m21l51j32k53j81
$$ plain form
54809 128724 129294 130623 131827 132315 132452 132739 133128 133497 134043 134738 135029 134636 134104 134018 134184 134128 133949 134040 134334
54790 134334 134446 134363 134441 134925 135853 137149 138356 138625 137648 136404 136352 137866 139976 141592 142447 142833 142959 142868
54772 142868 142705 142867 143899 146163 149469 153171 156851 160781 165498 171092 177202 183530 189953 196213 201904
54757 201904 206816 210901 213811 214849 213653 210785 207387 204251 201318 198130 194619 191258 188362 185471
54743 185471 181744 176922 171646 166781 162784 159766 157756 156584 155787 155018 154437 154413 154911 155452 155669 155630 155583
54726 155583 155609 155627 155677 156098 157384 159818 163280 167431 172023 176948 182052 187066 191626 195279 197610 198592
54710 198592 198723 198470 197616 195486 191774 186914 181693 176788 172603 169108 165846 162472 159247 156700 154883
54695 154883 153465 152381 151722 151101 149966 148678 148368 149383 150633 150933 150240 149121 147795 146409 145550 145582
$$ packed form
54809A28724N70J329J204M88J37K87L89L69N46O95K91l93n32q6J66n6j79R1K94
54790A34334J12q3P8M84R28J296J207K69r77j244n2J514K110J616Q55L86J26r1
54772A42868j63J62J032K264L306L702L680L930M717N594O110O328O423O260N691
54757B01904M912M085K910J038j196k868l398l136k933l188l511l361k896k891
54743A85471l727m822n276m865l997l018k010j172p97p69n81k4M98N41K17l9m7
54726A55583K6J8N0M21J286K434L462M151M592M925N104N014M560L653K331R82
54710A98592J31k53q54k130l712m860n221m905m185l495l262l374l225k547j817
54695A54883j418j084o59o21j135j288l10J015J250L00o93j119j326j386q59L2
$$ plain form
54679 145582 145901 145685 145022 144483 143934 142704 140823 139103 137925 136812 135508 134684 135125 136599 137956 138195
54663 138195 137258 135986 135404 135879 136869 137532 137507 137066 136722 136869 137615 138650 139427 139672 139588 139376 138878 137976 137030
54644 137030 136490 136336 136322 136519 137087 137710 137788 137123 135967 134564 133220 132662 133612 135843 138189 139665 140195
54627 140195 140201 139968 139645 139395 139293 139322 139553 140073 140637 140794 140525 140448 141113 142276 143087 142934 142018 141132 140872 141029
54607 141029 140835 139883 138646 137938 138128 139053 140406 141806 142720 142878 142724 142997 143829 144661 145034 145064 145102 145285
54589 145285 145508 145490 144900 143708 142440 141711 141546 141517 141510 141896 142894 144290 145857 147578 149237 150200 149937 148524
54571 148524 146491 144426 142833 142032 141946 142114 142106 141870 141694 142012 143131 144868 146483 147301 147397 147311 147186 146642
54553 146642 145596 144636 144400 144954 146012 147378 148897 150231 150952 150754 149556 147717 146106 145557 146070 146863
$$ packed form
54679A45582L19k16o63n39n49j230j881j720j178j113j304q24M41J474J357K39
54663A38195r37j272n82M75R90O63k5m41l44J47P46J035P77K45q4k12m98r02r46
54644A37030n40j54j4J97N68O23P8o65j156j403j344n58R50K231K346J476N30
54627A40195Ok33l23k50j02K9K31N20N64J57k69p7O65J163Q11j53r16q86k60J57
54607A41029j94r52j237p08J90R25J353J400R14J58j54K73Q32Q32L73L0L8J83
54589A45285K23j8n90j192j268p29j65k9pL86R98J396J567J721J659R63k63j413
54571A48524k033k065j593q01q6J68qk36j76L18J119J737J615Q18R6q6j25n44
54553A46642j046r60k36N54J058J366J519J334P21j98j198j839j611n49N13P93
$$ plain form
54537 146863 147351 147696 148318 149390 150967 153067 155274 156772 157263 157511 158456 160056 161444 161966 161544 160286
54521 160286 158416 156623 155794 156123 156818 156956 156399 155728 155473 155653 155929 155952 155530 154690 153726 153086 153027 153344 153629
54502 153629 153832 154333 155302 156233 156448 155862 154916 153874 152681 151532 151119 152034 154129 156516 158037 157890 156261
54485 156261 154402 153605 153942 154436 154489 154549 155147 155990 156562 157101 158265 160072 161837 163076 163931 164714 165466 166053
54467 166053 166329 166214 165867 165754 166222 167082 167873 168409 168770 168935 168895 168956 169379 169732 169229 167862 166551 165911 165465
54448 165465 164491 163196 162425 162528 163128 163900 164871 165860 166250 165711 164785 164355 164625 164960 164633 163441 161624 159580
54430 159580 157832 157005 157458 158925 160656 161934 162432 162228 161670 161271 161466 162347 163661 165161 166827 168660
54414 168660 170341 171314 171268 170471 169601 169254 169556 170113 170246 169471 167932 166353 165427 165274 165578 166147 166997 167912
$$ packed form
54537A46863M88L45O22J072J577K100K207J498M91K48R45J600J388N22m22j258
54521A60286j870j793q29L29O95J38n57o71k55J80K76K3m22q40r64o40n9L17K85
54502A53629K03N01R69R31K15n86r46j042j193j149m13R15K095K387J521j47j629
54485A56261j859p97L37M94N3O0N98Q43N72N39J164J807J765J239Q55P83P52N87
54467A66053K76j15l47j13M68Q60P91N36L61J65m0O1M23L53n03j367j311o40m46
54448A65465r74j295p71J03O00P72R71R89L90n39r26m30K70L35l27j192j817k044
54430A59580j748q27M53J467J731J278M98k04n58l99J95Q81J314J500J666J833
54414A68660J681R73m6p97q70l47L02N57J33p75j539j579r26j53L04N69Q50R15
$$ plain form
54396 167912 168347 168090 167736 168082 169228 170662 172147 173952 176169 178321 179824 180504 180503 180095 179754 179898 180328
54379 180328 180350 179741 179040 178504 177471 175470 173422 172775 173630 174672 174910 174579 174246 173995 173884 174331 175506
54362 175506 176941 178249 179778 181949 184324 185857 185856 184354 181875 179317 177734 177590 178246 178631 178376 177906
54346 177906 177573 177226 176724 176400 176729 177679 178561 178516 177287 175600 174613 174759 175299 175261 174597 173967 173553 172735 171154
54327 171154 169522 168943 169687 171117 172621 174118 175611 176741 177161 177144 177471 178708 180795 183306 185893 188388
54311 188388 190692 192713 194332 195412 195978 196452 197423 198974 200388 200723 199628 197474 194921 192650 191247
54296 191247 190871 190965 190654 189572 188077 186676 185495 184311 182797 180704 178164 175923 174929 175442 176773 177967
54280 177967 178536 178453 177864 177122 176802 177216 177957 178218 177607 176517 175687 175585 176199 177238 178317 178980 178765 177556
$$ packed form
54396A67912M35k57l54L46J146J434J485J805K217K152J503O80jm08l41J44M30
54379A80328K2o09p01n36j033k001k048o47Q55J042K38l31l33k51j11M47J175
54362A75506J435J308J529K171K375J533jj502k479k558j583j44O56L85k55m70
54346A77906l33l47n02l24L29R50Q82m5j229j687r87J46N40l8o64o30m14q18j581
54327A71154j632n79P44J430J504J497J493J130M20j7L27J237K087K511K587K495
54311A88388K304K021J619J080N66M74R71J551J414L35j095k154k553k271j403
54296A91247l76R4l11j082j495j401j181j184j514k093k540k241r94N13J331J194
54280A77967N69q3n89p42l20M14P41K61o11j090q30j02O14J039J079O63k15j209
$$ plain form
54262 177556 175922 174788 174534 174612 174288 173552 172970 172865 173142 173792 174953 176371 177355 177523 177217 177017 177193 177835
54244 177835 179016 180551 181929 182828 183431 183941 184095 183488 182182 180654 179247 177877 176248 174229 172155
54229 172155 170728 170368 170635 170700 170394 170323 170793 171283 171334 171355 171977 173078 174070 174806 175484 175912 175655 174892 174446
54210 174446 174825 175731 176590 177083 177013 176196 174750 173199 172076 171662 172137 173620 175822 177962 179306 179719 179558
54193 179558 179136 178521 177762 177117 176924 177288 177981 178671 179195 179479 179347 178637 177516 176412 175604 175131 175086 175596
54175 175596 176406 176968 177258 178017 179680 181412 181804 180449 178303 176575 175754 175760 176477 177815 179520 181183 182455
54158 182455 183230 183644 183826 183587 182553 180748 178854 177653 177359 177666 178207 178628 178514 177729 176746 176236 176367
54141 176367 176886 177760 179196 180946 182155 182168 181218 180101 179390 179126 179132 179391 180136 181528 183247 184511 184701
$$ packed form
54262A77556j634j134k54P8l24p36n82j05K77O50J161J418R84J68l06k00J76O42
54244A77835J181J535J378Q99O03N10J54o07j306j528j407j370j629k019k074
54229A72155j427l60K67O5l06p1M70M90N1K1O22J101R92P36O78M28k57p63m46
54210A74446L79R06Q59M93p0q17j446j551j123m14M75J483K202K140J344M13j61
54193A79558m22o15p59o45j93L64O93O90N24K84j32p10j121j104q08m73m5N10
54175A75596Q10N62K90P59J663J732L92j355k146j728q21OP17J338J705J663J272
54158A82455P75M14J82k39j034j805j894j201k94L07N41M21j14p85r83n10J31
54141A76367N19Q74J436J750J209J3r50j117p11k64OK59P45J392J719J264J90
$$ plain form
54124 184701 183967 183137 183041 183932 185356 186472 186731 186459 186567 187519 188862 189974 190853 191836 192954 194064 195268
54107 195268 196610 197640 197944 197857 197884 197632 196267 194037 192218 191308 190297 188355 186292 185460 185824 186133 185752
54090 185752 185248 185125 184902 183954 182678 182165 182886 184224 185367 186199 187082 188097 189000 189823 190932 192339 193483
54073 193483 194039 194430 195051 195410 194760 193370 192357 192267 192559 192600 192514 192731 193239 193622 193513 192835 191942 191592 192311
54054 192311 193671 194661 194867 194716 194556 194326 194369 195576 198024 200317 201195 201311 202428 205161 208524 211560
54038 211560 214329 217118 219696 221886 224242 227535 231861 236692 241583 246488 251507 256692 262020 267307
54024 267307 272162 276213 279383 281823 283652 284923 285899 287078 288774 290692 292097 292477 291942 290945 289764
54009 289764 288363 286583 284285 281422 278255 275391 273275 271608 269608 266952 264154 261920 260420 259391
$$ packed form
54124A84701p34q30r6Q91J424J116K59k72J08R52J343J112Q79R83J118J110J204
54107A95268J342J030L04q7K7k52j365k230j819r10j011j942k063q32L64L09l81
54090A85752n04j23k23r48j276n13P21J338J143Q32Q83J015R03Q23J109J407J144
54073A93483N56L91O21L59o50j390j013r0K92M1q6K17N08L83j09o78q93l50P19
54054A92311J360R90K06j51j60k30M3J207K448K293Q78J16J117K733L363L036
54038B11560K769K789K578K190K356L293M326M831M891M905N019N185N328N287
54024B67307M855M051L170K440J829J271R76J179J696J918J405L80n35r97j181
54009B89764j401j780k298k863l167k864k116j667k000k656k798k234j500j029
$$ plain form
53995 259391 258650 258248 258287 258898 260285 262600 265854 270109 275656 282862 291953 303058 316317 331814 349438
53980 349438 368782 388808 407454 421937 429913 430463 424088 412218 396934 380527 364489 348880
53968 348880 333149 317535 303189 290978 280760 271972 264326 257608 251378 245465 240495 237326 235928
53955 235928 235301 234534 233522 232533 231571 230525 229623 229284 229598 230280 231068 231889 232742 233859 235852 239116 243015
53938 243015 246323 248779 251533 255571 260311 264534 268198 272372 277515 282846 287529 291555 295096 297859
53924 297859 299599 300710 301737 302730 303573 304529 305978 307947 310408 313713 318170 323400 328705 333902 339279
53909 339279 344830 350109 354834 359108 362943 366007 368058 369310 370214 371055 371834 372335 372270 371482 370069 368210
53893 368210 365937 363218 360140 356856 353431 349951 346569 343186 339248 334247 328403 322496 317008 311750
$$ packed form
53995B59391p41m02L9O11J387K315L254M255N547P206R091J1105J3259J5497J7624
53980C49438J9344K0026J8646J4483P976N50o375j1870j5284j6407j6038j5609
53968C48880j5731j5614j4346j2211j0218q788p646o718o230n913m970l169j398
53955B35928o27p67j012r89r62j046r02l39L14O82P88Q21Q53J117J993L264L899
53938B43015L308K456K754M038M740M223L664M174N143N331M683M026L541K763
53924B97859J740J111J027R93Q43R56J449J969K461L305M457N230N305N197N377
53909C39279N551N279M725M274L835L064K051J252R04Q41P79N01o5p88j413j859
53893C68210k273k719l078l284l425l480l382l383l938n001n844n907n488n258
$$ plain form
53879 311750 306382 301024 296204 292377 289535 287151 284533 281424 278259 275660 273731 272067 270358 268633
53865 268633 266830 264540 261438 257880 254809 253014 252443 252181 251114 248742 245418 241896 238788 236493 235273
53850 235273 235047 235230 235144 234701 234458 234949 236095 237325 238091 238271 238199 238304 238670 239009 239136 239297 239791 240458 240884
53831 240884 240974 240915 240652 239908 238905 238561 239568 241500 243243 244340 245556 248045 252186 257474 263436 270332
53815 270332 278761 288847 300297 313305 328990 348660 372909 401445 433070 465067 492960 512056
53803 512056 519902 517180 506395 490325 471678 453085 436348 421757 408712 396969 386874 378515
53791 378515 371244 364317 357735 352296 348909 347843 348445 349488 349982 349757 349275 349012 349216 350141 352087 355025
53775 355025 358469 362010 365775 370038 374537 378530 381469 383099 382835 379675 373258 364723 355913 347690
$$ packed form
53879C11750n368n358m820l827k842k384k618l109l165k599j929j664j709j725
53865B68633j803k290l102l558l071j795n71k62j067k372l324l522l108k295j220
53850B35273k26J83q6m43k43M91J146J230P66J80p2J05L66L39J27J61M94O67M26
53831B40884R0n9k63p44j003l44J007J932J743J097J216K489M141N288N962O896
53815B70332Q429J0086J1450J3008J5685J9670K4249K8536L1625L1997K7893J9096
53803E12056P846k722j0785j6070j8647j8593j6737j4591j3045j1743j0095q359
53791C78515p271o927o582n439l387j066O02J043M94k25m82k63K04R25J946K938
53775C55025L444L541L765M263M499L993K939J630k64l160o417q535q810q223
$$ plain form
53761 347690 339502 330599 321213 312335 304705 298292 292589 287155 281950 277229 273040 268975 264682 260509
53747 260509 257143 254599 252175 249568 247331 245825 244472 242757 241412 241596 243176 244771 245481 245641 245773
53732 245773 245859 246082 247266 249795 252675 254571 255457 256484 258351 260559 262330 263503 264232 264402 263807 262720
53716 262720 261844 261712 262397 263758 265658 267890 270146 272224 274166 276043 277781 279351 280983 282883 284820
53701 284820 286398 287752 289574 292256 295408 298449 301308 304173 306957 309477 311922 314574 317237 319490
53687 319490 321425 323493 325624 327181 327884 328151 328256 327838 326699 325493 325019 325103 324827 323746 322348 321340
53671 321340 320929 320888 320938 320890 320659 320365 320342 320885 321893 322736 322596 321139 318924 316994 315997 315789 315861 315862 315570 314685
53651 314685 313003 310794 308734 307424 307014 307240 307713 308266 309017 310040 311014 311450 311377 311471 312284 313519 314390
$$ packed form
53761C47690q188q903r386q878p630o413n703n434n205m721m189m065m293m173
53747B60509l366k544k424k607k237j506j353j715j345J84J580J595P10J60J32
53732B45773Q6K23J184K529K880J896Q86J027J867K208J771J173P29J70n95j087
53716B62720q76j32O85J361J900K232K256K078J942J877J738J570J632J900J937
53701B84820J578J354J822K682L152L041K859K865K784K520K445K652K663K253
53687C19490J935K068K131J557P03K67J05m18j139j206m74Q4k76j081j398j008
53671C21340m11m1N0m8k31k94k3N43J008Q43j40j457k215j930r97k08P2Jk92q85
53651C14685j682k209k060j310m10K26M73N53P51J023R74M36p3R4Q13J235Q71
$$ plain form
53634 314390 314632 314873 315990 318273 321221 324003 326059 327378 328321 329258 330393 331813 333512 335389 337361
53619 337361 339529 342061 344974 348242 352057 356598 361515 366071 369973 373696 377721 381836 385517 388650
53605 388650 391505 394253 396961 399840 403042 406314 409276 411968 414683 417316 419369 420621 421344 421780 421853
53590 421853 421582 421342 421414 421536 421207 420347 419393 418779 418481 418106 417405 416602 416135 416008 415604 414279 412046 409463
53572 409463 406992 404693 402378 399805 396897 394097 392346 392202 393038 393624 393540 393462 393922 394448 394326 393727 393523
53555 393523 394180 395276 396033 396062 395641 395513 396255 397684 399041 399907 400698 402059 404153 406834 410123 413996
53539 413996 417963 421520 425033 429626 436055 444011 452639 461414 470471 480433 492017 505545 520745
53526 520745 537149 554502 572444 590007 606071 620434 633886 647023 659495 670684 680649 690140
$$ packed form
53634C14390K42K41J117K283K948K782K056J319R43R37J135J420J699J877J972
53619C37361K168K532K913L268L815M541M917M556L902L723M025M115L681L133
53605C88650K855K748K708K879L202L272K962K692K715K633K053J252P23M36P3
53590D21853k71k40P2J22l29q60r54o14k98l75p01q03m67j27m04j325k233k583
53572D09463k471k299k315k573k908k800j751j44Q36N86q4p8M60N26j22n99k04
53555C93523O57J096P57K9m21j28P42J429J357Q66P91J361K094K681L289L873
53539D13996L967L557L513M593O429P956Q628Q775R057R962J1584J3528J5200
53526E20745J6404J7353J7942J7563J6064J4363J3452J3137J2472J1189R965R491
$$ plain form
53514 690140 700057 711206 724106 738614 754099 770353 787967 807382 828082 849321 871281 894696
53502 894696 919506 944699 969459 993734 1017643 1041146 1064563 1088594 1113345 1137863 1161113
53491 1161113 1183003 1204090 1224805 1245483 1266691 1288805 1311432 1333806 1355602 1376803 1396957
53480 1396957 1415397 1432341 1449104 1466777 1485122 1503109 1520231 1536738 1552664 1567152 1579082
53469 1579082 1588155 1595021 1600294 1603691 1604328 1601694 1596026 1587812 1577376 1565104 1551714 1537886 1523727
53456 1523727 1508821 1492753 1475357 1456609 1436547 1415336 1393246 1370603 1347843 1325492 1303889
53445 1303889 1282948 1262357 1241873 1221398 1200998 1181108 1162492 1145704 1130693 1117214 1105447
53434 1105447 1095813 1088259 1082155 1076935 1072487 1068968 1066590 1065621 1066207 1068117 1071008 1074997 1080568 1087834
$$ packed form
53514F90140R917J1149J2900J4508J5485J6254J7614J9415K0700K1239K1960K3415
53502H94696K4810K5193K4760K4275K3909K3503K3417K4031K4751K4518K3250
53491A161113K1890K1087K0715K0678K1208K2114K2627K2374K1796K1201K0154
53480A396957J8440J6944J6763J7673J8345J7987J7122J6507J5926J4488J1930
53469A579082R073O866N273L397O37k634n668q214j0436j2272j3390j3828j4159
53456A523727j4906j6068j7396j8748k0062k1211k2090k2643k2760k2351k1603
53445A303889k0941k0591k0484k0475k0400j9890j8616j6788j5011j3479j1767
53434A105447r634p554o104n220m448l519k378r69N86J910K891L989N571P266
$$ plain form
53420 1087834 1096299 1105543 1115815 1127740 1141750 1157978 1176395 1196763 1218632 1241633 1265671 1290818
53408 1290818 1317210 1345116 1374791 1406137 1438863 1473082 1509386 1548101 1588890 1631352 1675589
53397 1675589 1721808 1769782 1819275 1870695 1924653 1980929 2038516 2096721 2155701 2215722 2276378
53386 2276378 2336807 2396359 2454806 2512111 2568211 2622818 2675303 2725005 2771826 2816269 2858648
53375 2858648 2898437 2934650 2966659 2994346 3017666 3036559 3051200 3061696 3067347 3066753 3059081 3044808
53363 3044808 3024698 2998458 2965217 2925212 2880107 2831409 2779444 2724351 2667304 2609840 2552436
53352 2552436 2494648 2436501 2378927 2322829 2268538 2216254 2166134 2117553 2069048 2019545 1969329
53341 1969329 1919439 1870546 1822833 1776571 1732263 1690323 1650900 1613886 1578922 1545665 1514296
$$ packed form
53420A087834Q465R244J0272J1925J4010J6228J8417K0368K1869K3001K4038K5147
53408A290818K6392K7906K9675L1346L2726L4219L6304L8715M0789M2462M4237
53397A675589M6219M7974M9493N1420N3958N6276N7587N8205N8980O0021O0656
53386B276378O0429N9552N8447N7305N6100N4607N2485M9702M6821M4443M2379
53375B858648L9789L6213L2009K7687K3320J8893J4641J0496N651n94p672j4273
53363C044808k0110k6240l3241m0005m5105m8698n1965n5093n7047n7464n7404
53352B552436n7788n8147n7574n6098n4291n2284n0120m8581m8505m9503n0216
53341A969329m9890m8893m7713m6262m4308m1940l9423l7014l4964l3257l1369
$$ plain form
53330 1514296 1485420 1459276 1435404 1413361 1393249 1375040 1357821 1340385 1322458 1304879 1288694
53319 1288694 1274456 1262123 1251082 1240371 1229417 1218558 1208491 1199402 1191174 1184230 1179489 1177363
53307 1177363 1177320 1178477 1180213 1182251 1184795 1188632 1194501 1202177 1210805 1220284 1231711 1246113 1263356 1282707
53293 1282707 1303901 1327030 1351798 1377605 1404249 1431919 1460471 1489170 1517269 1544503 1570972
53282 1570972 1596759 1621771 1645737 1668237 1688828 1707148 1722824 1735452 1744876 1751416 1755599 1757608
53270 1757608 1757218 1754300 1749125 1741972 1732535 1719991 1703736 1683956 1661435 1636869 1610574 1582775
53258 1582775 1553916 1524504 1494837 1465024 1435129 1405019 1374288 1342700 1310767 1279512 1249555
53247 1249555 1220684 1192409 1164592 1137303 1110347 1083249 1055638 1027472 999028 970864 943649
$$ packed form
53330A514296k8876k6144k3872k2043k0112j8209j7219j7436j7927j7579j6185
53319A288694j4238j2333j1041j0711j0954j0859j0067r089q228o944m741k126
53307A177363m3J157J736K038K544L837N869P676Q628R479J1427J4402J7243J9351
53293A282707K1194K3129K4768K5807K6644K7670K8552K8699K8099K7234K6469
53282A570972K5787K5012K3966K2500K0591J8320J5676J2628R424O540M183K009
53270A757608l90k918n175p153r437j2544j6255j9780k2521k4566k6295k7799
53258A582775k8859k9412k9667k9813k9895l0110l0731l1588l1933l1255k9957
53247A249555k8871k8275k7817k7289k6956k7098k7611k8166k8444k8164k7215
$$ plain form
53236 943649 917772 893104 869304 846262 824160 803243 783767 766011 750046 735513 721895
53225 721895 709037 697161 686344 676247 666428 656661 646766 636365 625075 612915 600282 587509
53213 587509 574575 561333 547896 534728 522377 511148 501002 491716 483132 475250 468099 461609
53201 461609 455619 449971 444419 438490 431660 423888 415896 408673 402594 397161 391646 385895 380397 375661
53187 375661 371664 367915 363972 359851 355918 352417 349200 346007 342923 340332 338401 336780 334991 332991
53173 332991 331195 330034 329598 329624 329616 329076 327797 326074 324497 323499 323109 323090 323230 323523 324174 325362 326923 328286
53155 328286 328888 328706 328259 328114 328431 328981 329421 329513 329174 328470 327560 326545 325398 324094 322799 321817 321217 320619
53137 320619 319502 317739 315637 313440 311116 308767 306900 305915 305546 305245 304899 304682 304366 303513 302430 302100
$$ packed form
53236I43649k5877k4668k3800k3042k2102k0917j9476j7756j5965j4533j3618
53225G21895j2858j1876j0817j0097r819r767r895j0401j1290j2160j2633j2773
53213E87509j2934j3242j3437j3168j2351j1229j0146r286q584p882p151o490
53201D61609n990n648n552n929o830p772p992p223o079n433n515n751n498m736
53187C75661l997l749l943m121l933l501l217l193l084k591j931j621j789k000
53173C32991j796j161m36K6qn40j279j723j577r98l90j9J40K93O51J188J561J363
53155C28286O02j82m47j45L17N50M40R2l39p04r10j015j147j304j295r82o00n98
53137C20619j117j763k102k197k324k349j867r85l69l01l46k17l16q53j083l30
$$ plain form
53121 302100 302855 303837 304271 304533 305267 306025 305766 304438 303107 302497 302264 301801 300981 299834 298240 296407 295086
53104 295086 294760 294871 294330 292728 290753 289423 289098 289239 289091 288552 288216 288443 288645 287891 286075 284076 282817
53087 282817 282618 283346 284551 285363 284997 283734 282903 283472 284989 286251 286611 286277 285711 285262 285195 285604 286307 287093
53069 287093 287953 288876 289581 289710 289166 288100 286821 285850 285689 286172 286422 285854 284964 284679 285176 285912 286654 287782
53051 287782 289460 291153 292289 293007 293862 295039 296211 297111 297902 298882 300012 300918 301385 301664 302160 302914 303626
53034 303626 304148 304631 305113 305221 304529 303044 301192 299463 298167 297346 296745 296056 295298 294767 294500 294109 293326
53017 293326 292355 291447 290496 289452 288734 288666 288772 288293 287323 286796 287240 288158 288861 289347 290012 290861 291418 291294 290579
52998 290579 289697 289037 288681 288424 288164 288178 288770 289664 290026 289290 287799 286449 285857 286000 286526 287231 288162 289317
$$ packed form
53121C02100P55R82M34K62P34P58k59j328j331o10k33m63q20j147j594j833j321
53104B95086l26J11n41j602j975j330l25J41j48n39l36K27K02p54j816j999j259
53087B82817j99P28J205Q12l66j263q31N69J517J262L60l34n66m49o7M09P03P86
53069B87093Q60R23P05J29n44j066j279r71j61M83K50n68q90k85M97P36P42J128
53051B87782J678J693J136P18Q55J177J172R00P91R80J130R06M67K79M96P54P12
53034C03626N22M83M82J08o92j485j852j729j296q21o01o89p58n31k67l91p83
53017B93326r71r08r51j044p18o8J06m79r70n27M44R18P03M86O65Q49N57j24p15
52998B90579q82o60l56k57k60J4N92Q94L62p36j491j350n92J43N26P05R31J155
$$ plain form
52980 289317 290281 290370 289326 287792 286805 286761 287140 287302 287294 287634 288561 289781 290938 292060 293473 295402 297746
52963 297746 300208 302573 304814 306958 308920 310577 311975 313324 314653 315523 315258 313629 311297 309377 308393
52948 308393 307846 306961 305744 304941 305017 305540 305736 305257 304205 302705 300854 298909 297185 295758 294480 293237
52932 293237 292091 291271 291107 291691 292462 292493 291466 290031 288864 287791 286364 284985 284611 285432 286544 287084
52916 287084 287072 286937 286835 286672 286355 285708 284540 283091 282047 281832 282169 282542 282792 283069 283516 284194 284976 285383
52898 285383 284992 284170 283835 284162 284218 283450 282839 283699 285729 287339 287884 288479 290309 292974 295050 295732 295330
52881 295330 294502 293589 292604 291414 289882 288096 286424 285167 284241 283401 282691 282367 282410 282445 282178 281678 281096 280400
52863 280400 279568 278928 278999 280047 281897 284165 286426 288222 289205 289438 289345 289222 288952 288362 287624 287030 286463 285457
$$ packed form
52980B89317R64Q9j044j534r87m4L79J62qL40R27J220J157J122J413J929K344
52963B97746K462K365K241K144J962J657J398J349J329Q70k65j629k332j920r84
52948C08393n47q85j217q03P6N23J96m79j052j500j851j945j724j427j278j243
52932B93237j146q20j64N84P71L1j027j435j167j073j427j379l74Q21J112N40
52916B87084j2j35j02j63l17o47j168j449j044k15L37L73K50K77M47O78P82M07
52898B85383l91q22l35L27N6p68o11Q60K030J610N45N95J830K665K076O82m02
52881B95330q28r13r85j190j532j786j672j257r26q40p10l24M3L5k67n00n82o96
52863B80400q32o40P1J048J850K268K261J796R83K33r3j23k70n90p38n94n67j006
$$ plain form
52845 285457 283785 281740 279769 278060 276520 274967 273270 271427 269548 267659 265652 263665 262358 262389 263580
52830 263580 265019 266057 266751 267239 267326 266968 266625 266617 266577 266085 265418 265029 264646 263739 262687 262470 263089 263209 261864
52811 261864 259781 258525 258865 260586 263454 267587 272948 278994 284897 289780 292896 293952 293282 291470 288897
52796 288897 285862 282894 280409 278179 275579 272406 269096 266136 263712 261936 260913 260399 259851 259042 258265
52781 258265 257711 257059 256000 254818 254033 253714 253596 253685 254293 255520 257076 258601 259840 260553 260654 260410 260172
52764 260172 259917 259444 259042 259449 260969 262990 264606 265378 265311 264529 263394 262654 262944 264154 265635 266975 268189
52747 268189 269202 269595 269091 267981 266817 265861 265104 264680 264883 265678 266502 266868 267028 267685 268992 270242 270774
52730 270774 270867 271362 272582 274089 275442 276670 277890 278931 279597 279930 280002 279745 279213 278662 278096 277131 275672
$$ packed form
52845B85457j672k045j971j709j540j553j697j843j879j889k007j987j307L1J191
52830B63580J439J038O94M88Q7l58l43qm0m92o67l89l83r07j052k17O19J20j345
52811B61864k083j256L40J721K868M133N361O046N903M883L116J056o70j812k573
52796B88897l035k968k485k230k600l173l310k960k424j776j023n14n48q09p77
52781B58265n54o52j059j182p85l19j18Q9O08J227J556J525J239P13J01k44k38
52764B60172k55m73m02M07J520K021J616P72o7p82j135p40K90J210J481J340J214
52747B68189J013L93n04j110j164r56p57m24K03P95Q24L66J60O57J307J250N32
52730B70774R3M95J220J507J353J228J220J041O66L33P2k57n32n51n66r65j459
$$ plain form
52713 275672 274391 274032 274436 274778 274618 274255 274036 273883 273568 273059 272478 272012 271890 272143 272422 272416 272382 272804 273498
52694 273498 273668 273078 272579 273072 274305 275199 275155 274577 274251 274615 275647 277090 278625 280075 281545 283261 285166
52677 285166 286770 287565 287623 287699 288634 290568 292850 294692 295824 296438 296722 296711 296519 296429 296682 297381 298586 300245
52659 300245 301979 303114 303122 302028 300484 299442 299605 300891 302537 303925 305224 306964 309137 311087 312201
52644 312201 312328 311621 310470 309593 309633 310471 311363 311847 312042 311956 311187 309647 308046 307188 307188 307811 309193 311684
52626 311684 315305 319814 325053 330634 335470 338214 338277 336118 332642 328693 324957 321811 319135 316548 313843
52611 313843 311041 308173 305350 302886 301024 299613 298413 297608 297620 298477 299664 300529 300599 299679 298093 296690
52595 296690 296110 296123 296115 296125 296855 298687 301252 304016 306715 309098 310841 311975 312941 314000 314969 315691 316256
$$ packed form
52713B75672j281l59M04L42j60l63k19j53l15n09n81m66j22K53K79ol4M22O94
52694B73498J70n90m99M93J233Q94m4n78l26L64J032J443J535J450J470J716J905
52677B85166J604P95N8P6R35J934K282J842J132O14K84j1j92r0K53O99J205J659
52659C00245J734J135Qj094j544j042J63J286J646J388J299J740K173J950J114
52644C12201J27p07j151q77M0Q38Q92M84J95q6p69j540j601q58%O23J382K491
52626C11684L621M509N239N581M836K744O3k159l476l949l736l146k676k587k705
52611C13843k802k868k823k464j862j411j200q05J2Q57J187Q65P0r20j586j403
52595B96690n80J3qJ0P30J832K565K764K699K383J743J134R66J059R69P22N65
$$ plain form
52578 316256 316583 316344 315655 315339 316049 317482 318876 319986 321097 322375 323640 324658 325289 325478 325418 325580 326204
52561 326204 326916 327125 326685 325865 324870 323671 322140 320063 317290 314271 312155 311697 312199 312208 311310 310588 311099
52544 311099 312545 313834 314443 314700 315001 315307 315451 315527 315866 316704 317933 319106 319831 320200 320665 321354 321746 321232
52526 321232 319846 318208 316872 316016 315638 315673 315852 315782 315324 314723 314344 314401 314976 315957 316866 317072 316525 316125 317092
52507 317092 319996 324461 329607 334505 338376 340850 342147 342745 342771 341916 339983 337219 333996 330424 326502
52492 326502 322470 318811 315965 314155 313326 313097 312972 312823 313035 313959 315354 316611 317415 317926 318389 318923 319661
52475 319661 320703 321855 322732 323304 324049 325373 327094 328716 329988 330946 331614 332035 332533 333577 335320 337541
52459 337541 340089 343038 346188 348692 349563 348508 346078 343033 339847 336804 334156 331986 330125 328402
$$ packed form
52578C16256L27k39o89l16P10J433J394J110J111J278J265J018O31J89o0J62O24
52561C26204P12K09m40q20r95j199j531k077k773l019k116m58N02Rq98p22N11
52544C11099J446J289O09K57L01L06J44P6L39Q38J229J173P25L69M65O89L92n14
52526C21232j386j638j336q56l78L5J79p0m58o01l79N7N75R81R09K06n47m00R67
52507C17092K904M465N146M898L871K474J297N98K6q55j933k764l223l572l922
52492C26502m032l659k846j810q29k29j25j49K12R24J395J257Q04N11M63N34P38
52475C19661J042J152Q77N72P45J324J721J622J272R58O68M21M98J044J743K221
52459C37541K548K949L150K504Q71j055k430l045l186l043k648k170j861j723
$$ plain form
52445 328402 326872 325640 324639 323755 322993 322232 321031 319077 316835 315329 315152 315905 316696 316937 316585 315925
52429 315925 315284 314778 314257 313728 313755 315023 317366 319696 321083 321491 321218 320253 318694 317335 317072 317889 319033
52412 319033 320132 321533 323611 326396 329951 334604 340590 347885 356569 367029 379643 394362 410415
52399 410415 426055 438825 446787 449632 448226 443221 434796 423734 411813 400734 391230 383425 377246
52386 377246 372083 366933 361670 357576 355729 355325 354481 352507 350437 349433 349577 350426 351857 353940 356517
52371 356517 359374 362570 366297 370610 375456 380689 385939 390681 394563 397510 399461 400308 400208 399717 399402
52356 399402 399426 399576 399520 399046 398255 397604 397545 398028 398559 398822 399056 399764 401214 403285 405629 407902 410022 412263
52338 412263 414919 417902 420967 424357 428777 434489 440792 446761 452344 458378 465647 474283 484049 494788
$$ packed form
52445C28402j530j232j001q84p62p61j201j954k242j506j77P53P91K41l52o60
52429C15925o41n06n21n29K7J268K343K330J387M08k73r65j559j359k63Q17J144
52412C19033J099J401K078K785L555M653N986P295Q684J0460J2614J4719J6053
52399D10415J5640J2770P962K845j406n005q425j1062j1921j1079r504p805o179
52386C77246n163n150n263m094j847m04q44j974k070j004J44Q49J431K083K577
52371C56517K857L196L727M313M846N233N250M742L882K947J951Q47j00m91l15
52356C99402K4J50n6m74p91o51n9M83N31K63K34P08J450K071K344K273K120K241
52338D12263K656K983L065L390M420N712O303N969N583O034P269Q636R766J0739
$$ plain form
52324 494788 506484 519131 532748 547407 563094 579611 596617 613746 630621 646942 662709
52313 662709 678323 694317 710951 728069 745391 762883 780756 799118 817682 835876 853257
52302 853257 869819 885896 901782 917451 932684 947431 961879 976026 989220 1000424 1009015 1015188
52290 1015188 1019361 1021413 1020850 1017699 1012862 1007405 1001684 995449 988631 981719 975306 969531 964176 959194
52276 959194 954915 951658 949366 947802 947001 947346 949167 952462 957078 962975 970122 978260 987007 996299 1006590
52261 1006590 1018458 1031960 1046396 1060739 1074335 1087247 1099925 1112623 1125225 1137594 1149889
52250 1149889 1162446 1175353 1188189 1200103 1210184 1217930 1223445 1227156 1229318 1229890 1228825 1226279 1222521
52237 1222521 1217892 1212869 1207816 1202493 1196199 1188648 1180472 1172432 1164469 1156006 1147064 1138504 1131049 1124549
$$ packed form
52324D94788J1696J2647J3617J4659J5687J6517J7006J7129J6875J6321J5767
52313F62709J5614J5994J6634J7118J7322J7492J7873J8362J8564J8194J7381
52302H53257J6562J6077J5886J5669J5233J4747J4448J4147J3194J1204Q591O173
52290A015188M173K052n63l151m837n457n721o235o818o912o413n775n355m982
52276I59194m279l257k292j564q01L45J821L295M616N897P147Q138Q747R292J0291
52261A006590J1868J3502J4436J4343J3596J2912J2678J2698J2602J2369J2295
52250A149889J2557J2907J2836J1914J0081P746N515L711K162N72j065k546l758
52237A222521m629n023n053n323o294p551q176q040p963q463q942q560p455o500
$$ plain form
52223 1124549 1118362 1112112 1105847 1099827 1094463 1090276 1087576 1086193 1085698 1085866 1086840 1088839 1091835 1095495 1099480
52208 1099480 1103789 1108758 1114686 1121562 1129183 1137235 1145027 1151464 1155871 1158777 1161404 1164298 1166981 1169086
52194 1169086 1171263 1174570 1179345 1185087 1191175 1197246 1203026 1208238 1212705 1216331 1219040 1220935 1222329 1223307
52180 1223307 1223338 1221598 1217617 1211396 1203125 1193223 1182585 1172284 1162799 1153814 1144862 1136014 1127908 1121342
52166 1121342 1116873 1114462 1113365 1112648 1112016 1111974 1113064 1115227 1118139 1121868 1126705 1132294 1137414 1140918 1142762
52151 1142762 1143820 1144764 1145441 1145402 1144700 1143884 1143399 1143411 1144175 1146051 1148916 1151967 1154462 1156348 1157761 1158200 1156863
52134 1156863 1153841 1150349 1147583 1145770 1144640 1144412 1145836 1149490 1155421 1163428 1173323 1184931 1198158 1213173
52120 1213173 1230302 1249674 1271121 1294429 1319488 1346042 1373429 1400725 1427178 1452472 1476675
$$ packed form
52223A124549o187o250o265o020n364m187k700j383m95J68R74J999K996L660L985
52208A099480M309M969N928O876P621Q052P792O437M407K906K627K894K683K105
52194A169086K177L307M775N742O088O071N780N212M467L626K709J895J394R78
52180A223307L1j740l981o221q271r902j0638j0301r485q985q952q848q106o566
52166A121342m469k411j097p17o32m2J090K163K912L729M837N589N120L504J844
52151A142762J058R44O77l9p02q16m85J2P64J876K865L051K495J886J413M39j337
52134A156863l022l492k766j813j130k28J424L654N931Q007R895J1608J3227J5015
52120A213173J7129J9372K1447K3308K5059K6554K7387K7296K6453K5294K4203
$$ plain form
52109 1476675 1500028 1522725 1544751 1565832 1585530 1603483 1619625 1634199 1647618 1660344 1672847
52098 1672847 1685425 1697872 1709415 1719287 1727407 1734301 1740277 1744903 1747352 1746970 1743342 1736127 1725272
52085 1725272 1711303 1695077 1677293 1658602 1640102 1623248 1609045 1597553 1588289 1580787 1574678 1569619
52073 1569619 1565512 1562583 1561049 1560949 1562555 1566620 1573680 1583209 1593937 1605041 1616616 1629009 1642195
$$ packed form
52109A476675K3353K2697K2026K1081J9698J7953J6142J4574J3419J2726J2503
52098A672847J2578J2447J1543R872Q120O894N976M626K449l82l628p215j0855
52085A725272j3969j6226j7784j8691j8500j6854j4203j1492r264p502o109n059
52073A569619m107k929j534j00J606M065P060R529J0728J1104J1575J2393J3186
$$ [...]
##END NTUPLES=NMR SPECTRUM
##END=
