##TITLE=AC1479_ZINDOMA305_8101045_lMus8BbtgM
##JCAMPDX= 6.0         $$ Bruker NMR JCAMP-DX V2.0
##DATA TYPE= NMR SPECTRUM
##DATA CLASS= NTUPLES
##ORIGIN= BRUKER
##OWNER= Administrator
$$ 1.72 TOPSPIN		Version 2.1
$$ 2013-08-15 18:03:10.834 -0700  Administrator@X
$$ Compression mode = diff/dup
##.OBSERVE FREQUENCY= 400.02188249412
##.OBSERVE NUCLEUS= ^1H
##.ACQUISITION MODE= SIMULTANEOUS (DQD)
##.ACQUISITION SCHEME= undefined
##.AVERAGES= 8
##.DIGITISER RES= 22
##SPECTROMETER/DATA SYSTEM= spect
##.PULSE SEQUENCE= zg30
##.SOLVENT NAME= COFFEE_meoh
##.SHIFT REFERENCE= INTERNAL, COFFEE_meoh, 1, 14.98509
##AUDIT TRAIL= $$ (NUMBER, WHEN, WHO, WHERE, PROCESS, VERSION, WHAT)
$$ ##TITLE= Audit trail, TOPSPIN		Version 2.1
$$ ##JCAMPDX= 5.01
$$ ##ORIGIN= Bruker BioSpin GmbH
$$ ##OWNER= Administrator
$$ $$ E:\/data/COFFEE/nmr/AC1479_ZINDOMA305_8101045_lMus8BbtgM/20/pdata/1/auditp.txt
$$ ##AUDIT TRAIL=  $$ (NUMBER, WHEN, WHO, WHERE, PROCESS, VERSION, WHAT)
(   1,<2013-08-15 18:03:04.341 -0700>,<Administrator>,<X>,<go>,<TOPSPIN 2.1>,
      <created by zg
	started at 2013-08-15 18:01:58.867 -0700,
	POWCHK enabled, PULCHK disabled,
       configuration hash MD5:
       C8 4E 4E 5D D3 5C D8 9E 9F 52 82 E0 59 8A DE 15
       data hash MD5: 64K
       4B 25 65 06 55 3E 01 C0 81 67 8F 92 80 6D 95 3E>)
(   2,<2013-08-15 18:03:07.159 -0700>,<Administrator>,<X>,<proc1d>,<TOPSPIN 2.1>,
      <Start of raw data processing
       efp LB = 0 FT_mod = 6 PKNL = 1 PHC0 = 0 PHC1 = 0 SI = 32K 
       data hash MD5: 32K
       21 47 11 57 D2 6A 54 E3 B7 93 F0 5D 6F 0B 90 0F>)
(   3,<2013-08-15 18:03:07.481 -0700>,<Administrator>,<X>,<proc1d>,<TOPSPIN 2.1>,
      <pk PHC0 = 96.8335 PHC1 = 0 
       data hash MD5: 32K
       C1 0E 91 FE 6B 36 CE 98 6C C6 2E DD 7E 9C 31 AD>)
(   4,<2013-08-15 18:03:07.787 -0700>,<Administrator>,<X>,<proc1d>,<TOPSPIN 2.1>,
      <abs ABSG = 1 
       data hash MD5: 32K
       82 E1 66 02 91 0D E9 BA B8 44 69 7D A0 6D 49 AC>)
(   5,<2013-08-15 18:03:07.848 -0700>,<Administrator>,<X>,<proc1d>,<TOPSPIN 2.1>,
      <abs ABSG = 2 
       data hash MD5: 32K
       BD 99 53 2A 4B 0F B4 4C 97 26 66 85 23 AF 44 49>)
(   6,<2013-08-15 18:03:07.955 -0700>,<Administrator>,<X>,<proc1d>,<TOPSPIN 2.1>,
      <abs ABSG = 3 
       data hash MD5: 32K
       4F 5E 6A 58 60 50 A7 8B 4A 11 A1 49 19 35 9D AE>)
(   7,<2013-08-15 18:03:08.001 -0700>,<Administrator>,<X>,<proc1d>,<TOPSPIN 2.1>,
      <abs ABSG = 4 
       data hash MD5: 32K
       47 B6 48 F7 3F E6 7A 94 DD F7 81 B5 EE 4B DE D3>)
(   8,<2013-08-15 18:03:08.047 -0700>,<Administrator>,<X>,<proc1d>,<TOPSPIN 2.1>,
      <abs ABSG = 5 
       data hash MD5: 32K
       15 66 2F 14 C5 3E B5 40 55 E2 6D FC 54 92 5C 89>)
$$ ##END=
$$ 
$$ $$ hash MD5
$$ $$ D6 2E E0 DB 9F 91 7A 08 4F 69 38 2A 96 89 F8 94
##$RELAX= 
##$RELAX= 
##$RELAX= 
##$RELAX= 
##$RELAX= 
##$RELAX= 
##$RELAX= 
$$ Bruker specific parameters
$$ --------------------------
##$DU= <E:\>
##$EXPNO= 20
##$NAME= <AC1479_ZINDOMA305_8101045_lMus8BbtgM>
$$ [...]
##$TP= (0..7)
150 150 150 150 150 150 150 150
##$TP07= 0
##$TPNAME0= <>
##$TPNAME1= <>
##$TPNAME2= <>
##$TPNAME3= <>
##$TPNAME4= <>
##$TPNAME5= <>
##$TPNAME6= <>
##$TPNAME7= <>
##$TPOAL= (0..7)
0.5 0.5 0.5 0.5 0.5 0.5 0.5 0.5
##$TPOFFS= (0..7)
0 0 0 0 0 0 0 0
##$TUNHIN= 0
##$TUNHOUT= 0
##$TUNXOUT= 0
##$USERA1= <user>
##$USERA2= <user>
##$USERA3= <user>
##$USERA4= <user>
##$USERA5= <user>
##$V9= 5
##$VALIST= <valist>
##$VCLIST= <CCCCCCCCCCCCCCC>
##$VD= 0
##$VDLIST= <DDDDDDDDDDDDDDD>
##$VPLIST= <PPPPPPPPPPPPPPP>
##$VTLIST= <TTTTTTTTTTTTTTT>
##$WBST= 1024
##$WBSW= 4
##$XGAIN= (0..3)
0 0 0 0
##$XL= 0
##$YL= 0
##$YMAX_a= 643979
##$YMIN_a= -547874
##$ZGOPTNS= <>
##$ZL1= 120
##$ZL2= 120
##$ZL3= 120
##$ZL4= 120
##$ABSF1= 14.98509
##$ABSF2= -5.573092
##$ABSG= 5
##$ABSL= 3
##$ALPHA= 0
##$AQORDER= 0
##$ASSFAC= 0
##$ASSFACI= 0
##$ASSFACX= 0
##$ASSWID= 0
##$AUNMP= <proc_prof1d_extract_pilot.lims>
##$AXLEFT= 0
##$AXNAME= <>
##$AXNUC= <1H>
##$AXRIGHT= 0
##$AXTYPE= 0
##$AXUNIT= <>
##$AZFE= 0.1
##$AZFW= 0.1
##$BCFW= 0
##$BC_mod= 0
##$BYTORDP= 0
##$COROFFS= 0
##$CY= 15
##$DATMOD= 1
##$DC= 0
##$DFILT= <>
##$DTYPP= 0
##$F1P= 0
##$F2P= 0
##$FCOR= 0.5
##$FTSIZE= 32768
##$FT_mod= 6
##$GAMMA= 0
##$GB= 0
##$INTBC= 1
##$INTSCL= 1
##$ISEN= 128
##$LB= 0
##$LEV0= 0
##$LPBIN= 0
##$MAXI= 10000
##$MC2= 0
##$MEAN= 0
##$ME_mod= 0
##$MI= 0
##$NCOEF= 0
##$NC_proc= -8
##$NLEV= 6
##$NOISF1= 0
##$NOISF2= 0
##$NSP= 0
##$NTH_PI= 0
##$NZP= 0
##$OFFSET= 14.98509
##$PC= 1
##$PHC0= 96.8335
##$PHC1= 0
##$PH_mod= 1
##$PKNL= yes
##$PPARMOD= 0
##$PPDIAG= 0
##$PPIPTYP= 0
##$PPMPNUM= 2147483647
##$PPRESOL= 1
##$PSCAL= 4
##$PSIGN= 0
##$PYNMP= <proc.py>
##$REVERSE= no
##$SF= 400.02
##$SI= 32768
##$SIGF1= 0
##$SIGF2= 0
##$SINO= 400
##$SIOLD= 32768
##$SPECTYP= <>
##$SREGLST= <1H.CDCl3>
##$SSB= 0
##$STSI= 32768
##$STSR= 0
##$SW_p= 8223.68421052631
##$SYMM= 0
##$S_DEV= 0
##$TDeff= 65536
##$TDoff= 0
##$TI= <>
##$TILT= no
##$TM1= 0
##$TM2= 0
##$TOPLEV= 0
##$USERP1= <user>
##$USERP2= <user>
##$USERP3= <user>
##$USERP4= <user>
##$USERP5= <user>
##$WDW= 1
##$XDIM= 32768
##$YMAX_p= 457839999
##$YMIN_p= -778885
##$CURPLOT= <Network HP LaserJet P1505>
##$CURPRIN= <$Network HP LaserJet P1505>
##$DFORMAT= <normdp>
##$LAYOUT= <+/1D_H.xwp>
##$LFORMAT= <normlp>
##$PFORMAT= <normpl>
##$SURQMSG= 1
$$ End of Bruker specific parameters
$$ ---------------------------------
##NTUPLES= NMR SPECTRUM
##VAR_NAME=  FREQUENCY,     SPECTRUM/REAL,   SPECTRUM/IMAG
##SYMBOL=    X,             R,               I
##VAR_TYPE=  INDEPENDENT,   DEPENDENT,       DEPENDENT
##VAR_FORM=  AFFN,          ASDF,            ASDF
##VAR_DIM=   32768,         32768,           32768
##UNITS=     HZ,            ARBITRARY UNITS, ARBITRARY UNITS
##FACTOR=    0.250966925370066, 1,           1
##FIRST=     8223.43324360094, -99219,       -166642
##LAST=      0,             32391,           10428
##MIN=       0,             -778885,         0
##MAX=       8223.43324360094, 457839999,    0
$$ Real data points
##PAGE= N=1
##DATA TABLE= (X++(R..R)), XYDATA
$$ [...]
19541A15802j2984E0019C565a9706m0447a639H92c93814J71751N3493D8827k1243
$$ 115802 102818 50019 3565 -19706 -60153 -1639 892 -393814 -222063 -168570 48827 27584
19529B7584Q017d2265D502J61026b4546F3301a9966j70912d7931j3291k75124
$$ 27584 35601 -42265 4502 165528 -24546 63301 -19966 -190878 -47931 -61222 -336346
19518c36346J50642a600j34990q6872P0762c8268k78614a04915B18265p7110b59662
$$ -336346 -185704 -1600 -136590 -223462 -152700 -38268 -316882 -104915 218265 141155 -259662
19506E9516a98881i0707k34078j01334O6879K940A20749m3355c31344J36794L1161
$$ 59516 -198881 -90707 -324785 -426119 -359240 -356300 120749 77394 -331344 -194550 -163389
19495a63389j24272Q1235h3060C6145b80511J03752A75442b19373A21296b44365
$$ -163389 -287661 -206426 -83060 36145 -280511 -176759 175442 -219373 121296 -244365
19484B2345a47067C6848b60155A6831a22324j495N5189A61393b5038l9499j16138
$$ 22345 -147067 36848 -260155 16831 -122324 -123819 -68630 161393 -25038 -64537 -180675
19473a80675b6117B996K75629D0203Q1593a88092e3172j63233n3427A57595K26993
$$ -180675 -26117 2996 278625 40203 121796 -188092 -53172 -216405 -269832 157595 384588
19462C84588c13230B47796c75630a10100E30587A30331b95432a46861e0962j56152
$$ 384588 -313230 247796 -375630 -110100 530587 130331 -295432 -146861 -50962 -207114
19452b07114A05297C6146J0714a15156r1099j60005c5697j78239C4758a4048D8350
$$ -207114 105297 36146 46860 -115156 -206255 -366260 -35697 -213936 34758 -14048 48350
19440b3783k43463J27496D8250b73281I8737l4879P3129c7251k09079E2794Q5377
$$ -23783 -267246 -139750 48250 -273281 98737 63858 136987 -37251 -246330 52794 138171
19429A38171e2904A47783a48052c2057C7683K06172c11749F3938b42760A02839
$$ 138171 -52904 147783 -148052 -32057 37683 243855 -311749 63938 -242760 102839
19418b70637h0956j69289A54191c29809g1424E6902D498O7551f5061e631j89147
$$ -270637 -80956 -250245 154191 -329809 -71424 56902 4498 72049 -65061 -5631 -194778
19407a94778b9839l83361f2260a1669p2749J6413a1196k89789i1132A20870C8131
$$ -194778 -29839 -413200 -62260 -11669 -84418 -68005 -11196 -300985 -91132 120870 38131
19395B0308L9845a6998j60221r8931D5482M1040j2806c2371m8193j15585e5378
$$ 20308 60153 -16998 -177219 -276150 45482 86522 73716 -32371 -80564 -196149 -55378
19383c78773i255k712H5326e7558k9093c686C63844j68588a72057A50500K56089
$$ -378773 -9255 -11967 85326 -57558 -86651 -3686 363844 195256 -172057 150500 406589
19372D06589a1294B3334a02155I9286B6340J34428b08550C19037d7532A58619
$$ 406589 -11294 23334 -102155 99286 26340 160768 -208550 319037 -47532 158619
19361A81127a45636k1041B98164b72068a15672L6028c6311j45983C0907J43421
$$ 181127 -145636 -166677 298164 -272068 -115672 -79644 -36311 -182294 30907 174328
19351A74328F0304a16031a2850j36672f3336F7879l2949a67301m24395a78861
$$ 174328 60304 -116031 -12850 -149522 -63336 67879 34930 -167301 -591696 -178861
19340E9959i0313A09637b17912i3459E5778b59581J25281k78571b8736B09157
$$ 59959 -90313 109637 -217912 -93459 55778 -259581 -134300 -412871 -28736 209157
19329b41858I6574L66922h3470L5891a3320j51192h987l14403B7523f8588m1118
$$ -241858 96574 463496 -83470 -47579 -13320 -164512 -8987 -323390 27523 -68588 -109706
19318a09706j74811A30811c03539M337A59503J6428n5415J40570b78981j08932
$$ -109706 -284517 130811 -303539 -299202 159503 175931 120516 261086 -278981 -387913
19308c87913a45161B6530d15101J70682c9258B25110B8760j3230b30945C596J30485
$$ -387913 -145161 26530 -415101 -244419 -39258 225110 28760 15530 -230945 3596 134081
19297A34081a27631k56243r007C9880J97638b87810b3967j7229j10330B07207
$$ 134081 -127631 -383874 -392881 39880 237518 -287810 -23967 -41196 -151526 207207
19286b48325K7688b2866l3461q4554A13192a50963J6899K870A81845N5435a81760
$$ -248325 -220637 -22866 -56327 -140881 113192 -150963 -134064 -131194 181845 237280 -181760
19274a1688p5299j45112K8497C00251c1445k73048a40521b4513I186J33198d2924
$$ -11688 -86987 -232099 -203602 300251 -31445 -304493 -140521 -24513 9186 142384 -42924
19262a3204d061k1455B64777d36431J81299A27423a00024M6386A16666a51559
$$ -13204 -4061 -25516 264777 -436431 -255132 127423 -100024 -53638 116666 -151559
19251B306J67556N6730a83411N1110A40990J2101J7543c37907A4297O7653d07135
$$ 2306 169862 226592 -183411 -132301 140990 153091 170634 -337907 14297 81950 -407135
19239c18232Q408H9436j4743a83798j4989p7419D515b59965l1050A48833E2071
$$ -318232 -309824 89436 74693 -183798 -198787 -276206 4515 -259965 -291015 148833 52071
19227a02192l6946O3092B29906a56118n4761j52428C29174a07140p7006B48133
$$ -102192 -139138 -76046 229906 -156118 -210879 -363307 329174 -107140 -184146 248133
19216a32489A98748a70986A31687a4806m04949a93723D4951N3457p561a02514
$$ -132489 198748 -170986 131687 -14806 -419755 -193723 44951 98408 90847 -102514
19205a0311A9233f7016l25327a55866B6354K0546j4566a49968A75085P7558h7604
$$ -10311 19233 -67016 -392343 -155866 26354 46900 32334 -149968 175085 252643 -87604
19193d01548a94375M1569l6609N8316A2095K01016c29991m0876a36292J6713j81077
$$ -401548 -194375 -152806 -189415 -131099 12095 213111 -329991 -370867 -136292 -119579 -300656
19182c00656J32083Q0372M0527A32681c13791l3646k6418a79830a437B14545b07515
$$ -300656 -168573 -88201 -47674 132681 -313791 -347437 -373855 -179830 -1437 214545 -207515
19170a6107D9457b5519j08440k17564a23305p223a2396c926l029A14090M0534
$$ -16107 49457 -25519 -133959 -351523 -123305 -130528 -12396 -3926 -6955 114090 154624
19159A54624b21892K1308K7601A37683d3010B3626L46360C3104j107h853j21483
$$ 154624 -221892 -200584 -172983 137683 -43010 23626 369986 33104 31997 -8853 -130336
19148a30336B10765h3049O492A26992b34530i2039A47985b13315B46696L5239
$$ -130336 210765 -83049 -76557 126992 -234530 -92039 147985 -213315 246696 281935
19138B81935A8550c06631R277R9748b5872k4808b3420r817a1456H147J75671d7924
$$ 281935 18550 -306631 -297354 -197606 -25872 -50680 -23420 -33237 -11456 8147 183818 -47924
19125b68672h9797A52173a83479M9843B3816J38352C2997b33146M9895A23882
$$ -268672 -89797 152173 -183479 -133636 23816 162168 32997 -233146 -183251 123882
19114E0936a30961B80908A25497l8940i1048A32293c3481A88616G8838b26602
$$ 50936 -130961 280908 125497 86557 -91048 132293 -33481 188616 78838 -226602
19103a16207k19739f3134A0661i1239k2497j97043J20902B97415A04052J57747
$$ -116207 -335946 -63134 10661 -91239 -113736 -310779 -189877 297415 104052 261799
19093B61799k2745a05715A0485N03970c01682B26909H3918a96710p5227a30183
$$ 261799 239054 -105715 10485 514455 -301682 226909 83918 -196710 -271937 -130183
19082a14338j49102a09800Q357k19804D3788J13961a57486A83849E7504K31974
$$ -114338 -263440 -109800 -101443 -321247 43788 157749 -157486 183849 57504 289478
19072B89478j35160k2464a93240O2285H8729b12765I5219a09151L070I8035O8751
$$ 289478 154318 131854 -193240 -130955 88729 -212765 95219 -109151 -106081 98035 166786
19061A66786A6017a45291j8998j27692a8495m2598D4132a12736D1446K59643D6408
$$ 166786 16017 -145291 -164289 -291981 -18495 -61093 44132 -112736 41446 301089 46408
19049a8132n3764j61724G7729e8875J8616B43255a0908l5718p6746a8154m1239
$$ -18132 -71896 -233620 77729 -58875 -40259 243255 -10908 -46626 -123372 -18154 -59393
19038e9393E8704a11004k04295J21171Q2343l3234o8025e3420E8614c007C914
$$ -59393 58704 -111004 -315299 -194128 -111785 -145019 -213044 -53420 58614 -3007 3914
19026h9591K3619C03025A2217c245j42678k6937E0160b04629h2727l8492I3005
$$ -89591 -65972 303025 12217 -3245 -145923 -172860 50160 -204629 -82727 -121219 93005
19014A76791a73615b4742j7558I6474a81609l2985B65315D8934b86264A03424
$$ 176791 -173615 -24742 -42300 96474 -181609 -214594 265315 48934 -286264 103424
19003g6318B41348b2011A13282a87397F0468h1109j74707d5957k51697g3171j02264
$$ -76318 241348 -22011 113282 -187397 60468 -81109 -255816 -45957 -297654 -73171 -175435
18992a75435C1673c19191i4550j33685n7850B0969a24328H6989b03783B2509L55422
$$ -175435 31673 -319191 -94550 -228235 -286085 20969 -124328 86989 -203783 22509 377931
18981C77931b89051d7995k97588a55533G1632c08953B03920g7262A19512b79156
$$ 377931 -289051 -47995 -345583 -155533 71632 -308953 203920 -77262 119512 -279156
18970A0229e171A27343b59946e6980A31812b32616j01319J62981j61889a59958
$$ 10229 -5171 127343 -259946 -56980 131812 -232616 -333935 -170954 -332843 -159958
18959b1069B4038J17168h8553a8814B06023a2914F5034K7897a63654r300A17011
$$ -21069 24038 141206 -88553 -18814 206023 -12914 65034 92931 -163654 -172954 117011
18947a58006j83795a41483f0917c65j09649E2854a41404f516A7100g2840c2877
$$ -158006 -341801 -141483 -60917 -365 -110014 52854 -141404 -6516 17100 -72840 -32877
18935h1277j41088B09229a00508B4734J83738a49257A96428i7581D5731c54344
$$ -81277 -222365 209229 -100508 24734 208472 -149257 196428 -97581 45731 -354344
18924B57275q2679a18784M8971A64240C7250K0923a51573A28786c90001i8392
$$ 257275 174596 -118784 -69813 164240 37250 58173 -151573 128786 -390001 -98392
18913F9048a82244h6291a6947k91537A5251L7483a54170b4316k15268B2114J90743
$$ 69048 -182244 -86291 -16947 -308484 15251 52734 -154170 -24316 -239584 22114 212857
18902B12857c7102G406M9071J6769h2254r5171D0423e2540A80563m0327a92256
$$ 212857 -37102 7406 56477 73246 -82254 -177425 40423 -52540 180563 140236 -192256
18890c58768J51819A65927a44944j12636i0483B32748L0237A14150b50076L9006
$$ -358768 -206949 165927 -144944 -257580 -90483 232748 262985 114150 -250076 -211070
18880b11070j07515d2091m518b0191A43352c9377n8332A08380l9833J22541a08116
$$ -211070 -318585 -42091 -46609 -20191 143352 -39377 -97709 108380 68547 191088 -108116
18868b57763J07891f2234j2482E0189a14264E0626b91414c2242A63228p4745d696
$$ -257763 -149872 -62234 -74716 50189 -114264 50626 -291414 -32242 163228 88483 -4696
18856a14979j77928A35259O744b98416A02921d1467j86935A9953K4316a04590
$$ -114979 -292907 135259 142003 -298416 102921 -41467 -228402 19953 44269 -104590
18845b5860j12336A36858Q1092a7338C3320j4138M4936J19263b74706A38222b53832
$$ -25860 -138196 136858 217950 -17338 33320 19182 64118 183381 -274706 138222 -253832
18833b8165G3625b16013a04098k57809j33544e0028E0401a18001B1772c42014
$$ -28165 73625 -216013 -104098 -361907 -495451 -50028 50401 -118001 21772 -342014
18822A52686C8454b32227G9168a25375M400B49483C7898c27967G1231c3325o6264
$$ 152686 38454 -232227 79168 -125375 -120975 249483 37898 -327967 71231 -33325 -99589
18811i9589E436L19919k8129j5420a85235C55005G8705B9061J26404J65697C7367
$$ -99589 5436 325355 297226 281806 -185235 355005 78705 29061 155465 321162 37367
18799b0916k92740A25898f7526c3329k86500l6051B23426b14035H2830K3094I313
$$ -20916 -313656 125898 -67526 -33329 -319829 -355880 223426 -214035 82830 105924 9313
18787g6680j43517f77n342A70260c1962l53126a5205n0635H597c14341N6657i4426
$$ -76680 -220197 -677 -6019 170260 -31962 -385088 -15205 -65840 8597 -314341 -257684 -94426
18774h2858A91815h3761c3591l02165A81924r660b23017i0342B3600c82117A79497
$$ -82858 191815 -83761 -33591 -335756 181924 172264 -223017 -90342 23600 -382117 179497
18762a38549O5640C757i6551c2669C3827a60537A05561C0583a27872A53325g1278
$$ -138549 -72909 3757 -96551 -32669 33827 -160537 105561 30583 -127872 153325 -71278
18750a55301f7298D2333d48809a66535N2357B2447f1446C9450b93250A61043c16768
$$ -155301 -67298 42333 -448809 -166535 -114178 22447 -61446 39450 -293250 161043 -316768
18738B92553b1199k1492A36479g2523k59741h5236F2923K27465a72773E4530q621
$$ 292553 -21199 -42691 136479 -72523 -332264 -85236 62923 290388 -172773 54530 45909
18727D5909e56252a11093F0626b27022B9245e755B60190E8248E686b18333A6113
$$ 45909 -556252 -111093 60626 -227022 29245 -5755 260190 58248 5686 -218333 16113
18715a88033P0444j49220d7615n9109B78594a08758e2240l04097J23066g726C9876
$$ -188033 -117589 -266809 -47615 -106724 278594 -108758 -52240 -356337 -233271 -7726 39876
18703I8219d30845A06358c22433a5359j38985r0312h9169K6736l24340a10301
$$ 98219 -430845 106358 -322433 -15359 -154344 -244656 -89169 -62433 -386773 -110301
18692C3372K9539M2849i6134A83518c59275a67612B31660a2656A66055L0882m3292
$$ 33372 62911 105760 -96134 183518 -359275 -167612 231660 -12656 166055 196937 153645
18681A53645h4484D0335i8150F2404c03427i6664I752a11575j11732g5012E6786
$$ 153645 -84484 40335 -98150 62404 -303427 -96664 9752 -111575 -223307 -75012 56786
18669A90296c5513C7809a37269J1956A31552e1655B7099g3187D2138c57729a05913
$$ 190296 -35513 37809 -137269 -125313 131552 -51655 27099 -73187 42138 -357729 -105913
18657b70346B2038a42993F2157J1567J48669C5192K15999a48431f884j39243B58253
$$ -270346 22038 -142993 62157 73724 222393 35192 251191 -148431 -6884 -146127 258253
18645a3683m4694k5612j27771J2798I2630a5595C87727C2432K33345a05680b511
$$ -13683 -58377 -83989 -211760 -198962 92630 -15595 387727 32432 265777 -105680 -2511
18633a76403A5903K359Q4572f9669J9252F3455Q8309O6193I1374b87253B5997
$$ -176403 15903 18262 102834 -69669 -50417 63455 151764 217957 91374 -287253 25997
18621b71409d2072B19491a4693j14458e350B43152k5165b25743C0947L3868M4058
$$ -271409 -42072 219491 -14693 -129151 -5350 243152 217987 -225743 30947 64815 108873
18610A08873c26483B48578b36498A04510b68353j632B41530j14882C9046b00559
$$ 108873 -326483 248578 -236498 104510 -268353 -269985 241530 126648 39046 -200559
18599b81298a07540B16976d65181A91264b39034B27044A10480e2400A841a40983
$$ -281298 -107540 216976 -465181 191264 -239034 227044 110480 -52400 1841 -140983
18588c06410C15172b05816L7831B86136h0028j07897k76744B97592A37218R6608
$$ -306410 315172 -205816 -167985 286136 -80028 -187925 -464669 297592 137218 233826
18578B33826b60272R5668c1996A42638D4476J56133c30819A3444b10492M2683
$$ 233826 -260272 -164604 -31996 142638 44476 200609 -330819 13444 -210492 -167809
18568a67809q9681A05476J01427o7025o6960b16916L8514J5515A0491a17820j38792
$$ -167809 -257490 105476 206903 139878 72918 -216916 -178402 -162887 10491 -117820 -256612
18557b56612I7945K05544a91916G621c33345F8051b3429q1695k22250B190J33233
$$ -256612 97945 303489 -191916 7621 -333345 68051 -23429 -105124 -327374 2190 135423
18546A35423d02673F2292K5189K2140k0325a6835m335r6530m0854j97410J67500
$$ 135423 -402673 62292 87481 109621 89296 -16835 -21170 -117700 -158554 -355964 -188464
18535a88464A7261a1331B65819b58172C33213b9921p6960G4810c79542a15232
$$ -188464 17261 -11331 265819 -258172 333213 -29921 -106881 74810 -379542 -115232
18524I3326l5875a96791f4631C4521N0339b77570F8814a79746J4562d7157B48267
$$ 93326 57451 -196791 -64631 34521 84860 -277570 68814 -179746 -165184 -47157 248267
18512b74221B80747j12858J01440b87399A20727H92b33138N9075E3882h0574k80525
$$ -274221 280747 167889 269329 -287399 120727 892 -233138 -174063 53882 -80574 -361099
18501c61099N4722d0236G3576d4593A85489D5929J44636k4599d9542L888A69943
$$ -361099 -306377 -40236 73576 -44593 185489 45929 190565 165966 -49542 -45654 169943
18489a0367j37326q2847J07891M3765k07263A23032a657A85637n3303A0748M6469
$$ -10367 -147693 -230540 -122649 -78884 -286147 123032 -1657 185637 132334 10748 57217
18478E7217b16976k0849m5605j9139a6075k9936k865A09245C6961b02477A39393
$$ 57217 -216976 -237825 -283430 -302569 -16075 -46011 -48876 109245 36961 -202477 139393
18466b82002i7472A74045Q2837f2712j2803E7484J60143e30992a05707k6907O0531
$$ -282002 -97472 174045 256882 -62712 -75515 57484 217627 -530992 -105707 -132614 -72083
18455g2083n0244j47274H5406d1460b0429m6048A18108J5562b961a442j27617
$$ -72083 -122327 -269601 85406 -41460 -20429 -66477 118108 133670 -2961 -1442 -129059
18444a29059c5329A22307p838a17468a9101A42035b94387b1618C90223c00497
$$ -129059 -35329 122307 114469 -117468 -19101 142035 -294387 -21618 390223 -300497
18433A07089b27453h7937k15818A28671d6909r2917A12871a3697A48542c6884
$$ 107089 -227453 -87937 -303755 128671 -46909 -139826 112871 -13697 148542 -36884
18422d14034a46479A53393e00699h30A39456j8956a54625j13595Q9591e0624l5607
$$ -414034 -146479 153393 -500699 -830 139456 120500 -154625 -268220 -178629 -50624 -86231
18411h6231j71520B50679A9685l663L21202i1425j08167B83969j11062P1508J15721
$$ -86231 -257751 250679 19685 16022 337224 -91425 -199592 283969 172907 244415 360136
18400C60136a4374j39337l7958B82169a44083d4836B18106a30325l2049b3432
$$ 360136 -14374 -153711 -191669 282169 -144083 -44836 218106 -130325 -162374 -23432
18389a67539J0248g5323j53395P2278B34541B4391L80066g2948k1278L848m3855
$$ -167539 -157291 -75323 -228718 -156440 234541 24391 404457 -72948 -94226 -90378 -134233
18378a34233A57963B9273L6509g4221j6289A15116Q3624d4259q3847A64277c82253
$$ -134233 157963 29273 65782 -74221 -90510 115116 198740 -44259 -128106 164277 -382253
18366b27023B20634a71318A42319C8177a05547A13501a48864K5034E1563h0280
$$ -227023 220634 -171318 142319 38177 -105547 113501 -148864 -123830 51563 -80280
18355a58134A48499a12823k3099j34210e2489n8707o3826H1785n988K65462b13764
$$ -158134 148499 -112823 -135922 -270132 -52489 -111196 -175022 81785 75797 341259 -213764
18343h0090j6926A29775j9243K04662b58499N7840H9968f5624F0800Q6475Q2967
$$ -80090 -97016 129775 110532 315194 -258499 -200659 89968 -65624 60800 147275 230242
18332B30242c82058A89643B0818f2873A08071c48073b7396m0360b0228A03647
$$ 230242 -382058 189643 20818 -62873 108071 -348073 -27396 -67756 -20228 103647
18321g3587n9619E919L5935a42321A37304B3620f955A7590P1239J79970A10060
$$ -73587 -133206 5919 41854 -142321 137304 23620 -6955 17590 88829 268799 110060
18309b81623G1362f8398k1080l6580k5797b5103A71480a87455G1983g2067A19488
$$ -281623 71362 -68398 -89478 -126058 -151855 -25103 171480 -187455 71983 -72067 119488
18297D52936c32798B03148M537B7799b75844O5636D54209j89396b13370B19987
$$ 452936 -332798 203148 207685 27799 -275844 -210208 454209 264813 -213370 219987
18286A08405c8283B02038r2391E2262N3110a2104A39662F3709b56445E0072K7834
$$ 108405 -38283 202038 109647 52262 105372 -12104 139662 63709 -256445 50072 77906
18275G7906a93487F4963c49284a8558A04912L11830a55138m1369a5891C01315
$$ 77906 -193487 64963 -349284 -18558 104912 416742 -155138 -196507 -15891 301315
18264d7823I5749C8923f4314p6159N5283B13472a61730j72842A41931A7538a19784
$$ -47823 95749 38923 -64314 -140473 -85190 213472 -161730 -334572 141931 17538 -119784
18252A13512g358e34j37576r1751A3566g9661E9192J90746c5489k20991i4131
$$ 113512 -7358 -534 -138110 -229861 13566 -79661 59192 249938 -35489 -256480 -94131
18240i5773P42k19967H5506i2524A18617d541k89610k66049J79500A52542D9894
$$ -95773 -95031 -314998 85506 -92524 118617 -4541 -294151 -560200 -380700 152542 49894
18228A01191c55685f6293k17672h3717j21515i0951j77438j9433B51300g1811
$$ 101191 -355685 -66293 -283965 -83717 -205232 -90951 -268389 -287822 251300 -71811
18217f0862l8569G9080J06726b85700A06168R0427a80542J0035A44320e640j98149
$$ -60862 -99431 79080 185806 -285700 106168 196595 -180542 -170507 144320 -5640 -203789
18206b03789C7175L2895K23591I3187b15295B701b58827n6347H0787e9496j62911
$$ -203789 37175 70070 293661 93187 -215295 2701 -258827 -315174 80787 -59496 -222407
18195b22407E6572A2070a30387A10288a25452C48665a5090m0588K3535E4665a52320
$$ -222407 56572 12070 -130387 110288 -125452 348665 -15090 -55678 -32143 54665 -152320
18183f4024G6947k9169c0004k26732g4403D6439a72928F0504a97691J2656G5366
$$ -64024 76947 47778 -30004 -256736 -74403 46439 -172928 60504 -197691 -185035 75366
18171I146O9605a98895A63728A9756a3818A8032b27450K2457o4515J13718n7303
$$ 9146 78751 -198895 163728 19756 -13818 18032 -227450 -204993 -269508 -155790 -213093
18160b13093g6021k83331D0553O9455a3501D7710J61687r5085c7387m8412a8377
$$ -213093 -76021 -359352 40553 110008 -13501 47710 209397 114312 -37387 -85799 -18377
18148e7197A58298b7167C14662a98958G8150f4580j82749h6593A03861c01189
$$ -57197 158298 -27167 314662 -198958 78150 -64580 -247329 -86593 103861 -301189
18137a84754B04242A3233l951a04641A2329L927b14613d8495A50233A6397g2208
$$ -184754 204242 13233 9282 -104641 12329 16256 -214613 -48495 150233 16397 -72208
18125a30255B01552b64633I9407J34814b74740J14913A38830J02053d84849a37886
$$ -130255 201552 -264633 99407 234221 -274740 -159827 138830 240883 -484849 -137886
18114c62880J03946A23029a61881A1625a96671B1100b5169C8018c8837m2182A51306
$$ -362880 -258934 123029 -161881 11625 -196671 21100 -25169 38018 -38837 -81019 151306
18102c39296a1752j4619C26847b41101K7659B6240b1791A13304a46719b1795G033
$$ -339296 -11752 -26371 326847 -241101 -213442 26240 -21791 113304 -146719 -21795 7033
18090b386m09375g1989K3791A90065b00211d9670p012D159f6869k94889C14870
$$ -2386 -411761 -71989 -48198 190065 -200211 -49670 -56682 4159 -66869 -361758 314870
18078a54513b6868A78190a90618P2956l6706G3024C6099J26958l0788a57401B6385
$$ -154513 -26868 178190 -190618 -117662 -154368 73024 36099 163057 132269 -157401 26385
18066A06286a09013q0095G276J1497J70062a26953j30488A49309k8056Q7426F5741
$$ 106286 -109013 -189108 7276 18773 188835 -126953 -257441 149309 121253 208679 65741
18054h5566j26305d683o4364r0911A69908F4653a3246l7348p3059A71289J63036
$$ -85566 -211871 -4683 -69047 -159958 169908 64653 -13246 -50594 -123653 171289 334325
18043C34325A08931a74824q6777i1508l83724a56146J9897A31378a6449j60847
$$ 334325 108931 -174824 -261601 -91508 -475232 -156146 -136249 131378 -16449 -177296
18033a77296j7671j16606C8981M9996J33702G2419H75K15225a16766q3550F0625
$$ -177296 -194967 -311573 38981 88977 222679 72419 875 216100 -116766 -200316 60625
18021b04302J01455b7401j5064g688k06848e7903h299A84378a01082k43496f8402
$$ -204302 -102847 -27401 -42465 -7688 -214536 -57903 -8299 184378 -101082 -344578 -68402
18009a38906N5455A13895j2879c76293G1843J09595m6559b75546C9337c58446
$$ -138906 -83451 113895 101016 -376293 71843 181438 134879 -275546 39337 -358446
17998A11600K24294b50726B685a73463L000A67601a22782j478B66756a49763M3098
$$ 111600 335894 -250726 2685 -173463 -170463 167601 -122782 -124260 266756 -149763 -106665
17987a06665E2886e9310E3461K29970J2978b5312l310j38638m6888h9266B38299
$$ -106665 52886 -59310 53461 283431 296409 -25312 -28622 -167260 -214148 -89266 238299
17975A73447i7091B21021c35685F3376a68159C28059b57311A86619c3804B75457
$$ 173447 -97091 221021 -335685 63376 -168159 328059 -257311 186619 -33804 275457
17964E3319a88425f2722A32467B2821K62727a53648C20842b1093l8764E10950
$$ 53319 -188425 -62722 132467 22821 285548 -153648 320842 -21093 -59857 510950
17953C07133a6979l567A05148b25690A15341K75067j76440D7523p834b73167E1528
$$ 307133 -16979 -20546 105148 -225690 115341 390408 213968 47523 39689 -273167 51528
17941b1140l4373r5653j0523l5073B75732d722A58760a58910c3810a4963l9842
$$ -21140 -55513 -151166 -161689 -196762 275732 -4722 158760 -158910 -33810 -14963 -54805
17930e4805k47847J05235C9946b19977K9329k6515m6365H8730c6123k38633J36019
$$ -54805 -302652 -197417 39946 -219977 -190648 -217163 -263528 88730 -36123 -274756 -138737
17919a38737C9675f2563B85338d9406j68402h5279j37484H6762f7636k32518A75754
$$ -138737 39675 -62563 285338 -49406 -217808 -85279 -222763 86762 -67636 -300154 175754
17907a92967h2312j29072d2630l8007j274a449l2248C54502a44050a5347C07643
$$ -192967 -82312 -211384 -42630 -80637 -81911 -1449 -33697 354502 -144050 -15347 307643
17895A43534F3451b23651A59607B4374N0872J30933e1830n3613j67792A56829
$$ 143534 63451 -223651 159607 24374 75246 206179 -51830 -105443 -273235 156829
17884d52267B1455i1046A86032e6049m32114a34071M6281H7088p504M0618c9674
$$ -452267 21455 -91046 186032 -56049 -488163 -134071 -87790 87088 79584 120202 -39674
17872a62197i600k5683E660M6057O9004c98862J63138k12799d3123A17788m2068
$$ -162197 -9600 -35283 5660 51717 120721 -398862 -235724 -448523 -43123 117788 75720
17861G5720a86148o618A57502P4813L9105a41157f6182C003N0949a35513n5892
$$ 75720 -186148 -192766 157502 232315 271420 -141157 -66182 3003 53952 -135513 -191405
17850a91405b509j02754B53608p0631b2570m4046C0414J29369R1884c60083a10267
$$ -191405 -2509 -105263 253608 182977 -22570 -66616 30414 159783 251667 -360083 -110267
17838A62271f9797b247j6138m9106A30344h4532k8795n5519c5935A41340P8620
$$ 162271 -69797 -2247 -18385 -67491 130344 -84532 -113327 -168846 -35935 141340 219960
17827B19960q3672A0896c1783G5215b06130c6617A12979i7204b3776C28392C2580
$$ 219960 136288 10896 -31783 75215 -206130 -36617 112979 -97204 -23776 328392 32580
17815a95430A62033a87359J6333K8359f242B3519J24223F1425j1777P9398j9457
$$ -195430 162033 -187359 -171026 -142667 -6242 23519 147742 61425 49648 129046 109589
17804A09589a85465A74760a9632H9638K09374E6835J8587e0948F3511J59471a26924
$$ 109589 -185465 174760 -19632 89638 299012 56835 75422 -50948 63511 222982 -126924
17792a45818B86594b03399L3307B92131E0558P9119M9484q8026L9103D6706B3189
$$ -145818 286594 -203399 -170092 292131 50558 129677 179161 91135 130238 46706 23189
17780b51340A76590A583c41266a08431A45982r252m3902K36188F518a39796C6927
$$ -251340 176590 1583 -341266 -108431 145982 136730 92828 329016 6518 -139796 36927
17768A9943a99806m5707a2373C73088A26585J23380J53265H9165a39384B6132
$$ 19943 -199806 -245513 -12373 373088 126585 249965 403230 89165 -139384 26132
17757a39695D38505A53201K46070a41195e9879R006j3725A04796h0590L0515n4763
$$ -139695 438505 153201 399271 -141195 -59879 -50873 -64598 104796 -80590 -50075 -104838
17746a04838J5923n6171b2422A58488b46197c1909k70009I9021K81648D1319b27727
$$ -104838 -88915 -145086 -22422 158488 -246197 -31909 -301918 99021 380669 41319 -227727
17734I7165Q7621e245o4079A97506G7959J01928o8391e2086C04182a3779j6075
$$ 97165 184786 -5245 -69324 197506 77959 179887 111496 -52086 304182 -13779 -29854
17723b9854B32168a19670a5491m8781l719A11235M9772e2510A41653P4301c00812
$$ -29854 232168 -119670 -15491 -64272 -67991 111235 161007 -52510 141653 215954 -300812
17711d8907A10368d16630C25693o5735a93690B68225a59365p8052B2857i9853
$$ -48907 110368 -416630 325693 259958 -193690 268225 -159365 -237417 22857 -99853
17700a60649A42234J45725d476A22225k4757a53295Q431a8804j184C4312a76096
$$ -160649 142234 287959 -4476 122225 97468 -153295 -144864 -18804 -19988 34312 -176096
17688a31570j21864J23007A89807a79559k36438e1998E75a63522j3943D2447b0866
$$ -131570 -253434 -130427 189807 -179559 -415997 -51998 575 -163522 -177465 42447 -20866
17676a73525A5765J3298J67593r3062b27813c089m3154H4168l1447J16843n0356
$$ -173525 15765 29063 196656 103594 -227813 -3089 -46243 84168 52721 169564 119208
17665A19208P0242G192K47909c24015a03369A51442o4159C5621M4301a32411G0185
$$ 119208 189450 7192 255101 -324015 -103369 151442 87283 35621 79922 -132411 70185
17653b63806g9319A4656a58194A84331D5871O8436H563a05877F1311A7831b35207
$$ -263806 -79319 14656 -158194 184331 45871 114307 8563 -105877 61311 17831 -235207
17641B78909o4004D8597P4592a05453L9712j60443f0952A49866a9024j85565A92025
$$ 278909 214905 48597 123189 -105453 -65741 -226184 -60952 149866 -19024 -204589 192025
17629B41858a7108o0426F1601a10004B47559l898a32545j44972C3828L6641j802
$$ 241858 -17108 -77534 61601 -110004 247559 243661 -132545 -277517 33828 70469 68667
17618F8667J42338c0790H0164L9044M1325G8924a45656E074h2612b8236j23312
$$ 68667 211005 -30790 80164 119208 160533 78924 -145656 5074 -82612 -28236 -151548
17607a51548A72020j6539a44936j29466A92856P1462l5791c34744f4618k59869
$$ -151548 172020 155481 -144936 -274402 192856 264318 228527 -334744 -64618 -324487
17597c24487B71281a35683c3339C29230h9755B1016a33522O0188o8348e4843B81665
$$ -324487 271281 -135683 -33339 329230 -89755 21016 -133522 -73334 -141682 -54843 281665
17585a64219j53396a26620N3921b7152B45604j19123e4146j12850B17055c02478
$$ -164219 -317615 -126620 -72699 -27152 245604 126481 -54146 -166996 217055 -302478
17574A50154k7157R3344h9911l4770A11795a6502n8794D6499N9362J75874h098
$$ 150154 122997 216341 -89911 -124681 111795 -16502 -75296 46499 105861 281735 -8098
17562a97878A60338h4830j83177A73340p5088a5154k58736b5806I9673C6958m425
$$ -197878 160338 -84830 -268007 173340 98252 -15154 -273890 -25806 99673 36958 32533
17551C2533a59750j20865g0891A10360a79379k8167J01633A87518C9737c6273
$$ 32533 -159750 -280615 -70891 110360 -179379 -207546 -105913 187518 39737 -36273
17540c4427I6105c37433c1972C20354A32102R8716A11616J13171b05668B67416
$$ -34427 96105 -337433 -31972 320354 132102 230818 111616 224787 -205668 267416
17529B32963A03317L14591A01905m8194H66L74667b4702A83799d954l7759H961
$$ 232963 103317 417908 101905 53711 866 375533 -24702 183799 -4954 -42713 8961
17517h3284k28789A94217E9832e0343B57302j06066L829J27191L8158E2396a00211
$$ -83284 -312073 194217 59832 -50343 257302 151236 155065 282256 320414 52396 -100211
17505A27188J14744o7768a07879q7900M3104C09213j29450E9287J52187a9127
$$ 127188 241932 174164 -107879 -195779 -152675 309213 179763 59287 211474 -19127
17494f5774I0426J355L3967J8092k5162P4253o0460B6055J01959b35958A37033
$$ -65774 90426 91781 125748 143840 118678 192931 132471 26055 128014 -235958 137033
17482a13208P155B79063a05807B5132K61741a40480B33016J17767b4023B79354
$$ -113208 -106053 279063 -105807 25132 286873 -140480 233016 350783 -24023 279354
17471G8520L3175b7353j3981A86390O1982C7657J96323j05769E7093c0775C8594
$$ 78520 111695 -27353 -41334 186390 248372 37657 233980 128211 57093 -30775 38594
17459b11971J8056C46497I6952L7980b0011F0082a3933B53820j04118f6364A18364
$$ -211971 -193915 346497 96952 134932 -20011 60082 -13933 253820 149702 -66364 118364
17447g6364B06100m284P0927J11516j84238E953K46687P9371A21377f1503A76804
$$ -76364 206100 201816 272743 384259 200021 5953 252640 332011 121377 -61503 176804
17435E22939l1913G7131J21059q450p737Q243N2053n8088J9767O0959J97430n3491
$$ 522939 491026 77131 198190 189740 182003 190246 242299 184211 203978 264937 462367 408876
17423D08876a25122H8079J64746k4977K029j06896K47623l4185A10784L5820J87661
$$ 408876 -125122 88079 252825 227848 229877 122981 370604 336419 110784 146604 334265
17412C34265r230j25804N6141B1032M052e2015D21457A99029j530M5344J0933
$$ 334265 325035 199231 255372 21032 25084 -52015 421457 199029 197499 242843 253776
17401B53776q5235a13211A81704P5413I4672J64921A11488k6744K23366E485N3469
$$ 253776 168541 -113211 181704 257117 94672 259593 111488 84744 308110 5485 58954
17390E8954c9666A98653m9082b72843I7398J42133a67687D14456j59042j26091
$$ 58954 -39666 198653 149571 -272843 97398 239531 -167687 414456 255414 129323
17380A29323J04875p8115h6127H0905f4052C1080G712K3044J90002r8477M9138
$$ 129323 234198 156083 -86127 80905 -64052 31080 7712 30756 220758 122281 171419
17369A71419A5552L30386j62004n1931J32476g5888H8075f5977B23684i6858a7134
$$ 171419 15552 345938 183934 132003 264479 -75888 88075 -65977 223684 -96858 -17134
17357B80632b92986I7483b2147D11327j62225K55854B08952g697E3448c5691A73352
$$ 280632 -292986 97483 -22147 411327 249102 504956 208952 -7697 53448 -35691 173352
17345A39067J87521n8953a40613B05606r801j1173J81799p0792N2310A71818J39640
$$ 139067 326588 267635 -140613 205606 195805 184632 366431 295639 347949 171818 311458
17334C11458F1524i7627A75500D7901K3030K3718M6069M10574D6816a62985B8382
$$ 311458 61524 -97627 175500 47901 70931 94649 140718 551292 46816 -162985 28382
17322A99757d6179A82646H0836K85905o0497Q3496j00708C8478J88061r0005n092
$$ 199757 -46179 182646 80836 366741 306244 389740 289032 38478 226539 136534 131442
17311A31442J07471J38424a78853B51736A5905L51803I5388C5210L77801j46372
$$ 131442 238913 377337 -178853 251736 15905 367708 95388 35210 413011 266639
17301B66639j19685J4289R9818L4308A5077M12712k9913e7473B65086r3114M4504
$$ 266639 146954 161243 261061 295369 15077 427789 397876 -57473 265086 171972 216476
17290B16476j07475r987L0620L08237A70335G232K17621a58502k1612D17859O816
$$ 216476 109001 99014 129634 437871 170335 7232 224853 -158502 -180114 417859 424675
17279D24675j85483R6025m7093q4588J6129A0497I05K1466L9133J92960j21828
$$ 424675 239192 335217 288124 203536 219665 10497 905 22371 61504 254464 132636
17268A32636a2013B60039Q5625A31630O9730o9850j7621N702K67484a31001b3117
$$ 132636 -12013 260039 345664 131630 201360 131510 113889 119591 387075 -131001 -23117
17256e2105A54740q1J72239a1792C39874L4797C3223L01688H1817K64349J55457
$$ -52105 154740 154659 326898 -11792 339874 374671 33223 334911 81817 346166 501623
17245E01623q0255q2704j49559b1160B39460J2490K15595A81971P9448A16396
$$ 501623 421368 338664 189105 -21160 239460 251950 467545 181971 261419 116396
17234C54244A08677Q6512k6866a9899O59C9974b8431k15706G5754a33909D59366
$$ 354244 108677 195189 168323 -19899 -19240 39974 -28431 -244137 75754 -133909 459366
17222E61027A11991e5786B15220J62647e3136A12184N5673m6446L6380K40388
$$ 561027 111991 -55786 215220 377867 -53136 112184 167857 121411 157791 398179
17212C98179H7628R9970G2154R9901p2462J3592j7396L19116E7720J55844j2712
$$ 398179 87628 187598 72154 172055 99593 113185 95789 414905 57720 213564 200852
17201B00852Q2069l1379F3638M78620j88513p6740m0601k7481G9615l1108K15937
$$ 200852 282921 251542 63638 542258 353745 277005 236404 208923 79615 48507 264444
17190B64444a9494A81914J37706r7149q2370J57320J00073k0912E8599B8732L40064
$$ 264444 -19494 181914 319620 222471 140101 297421 397494 376582 58599 28732 368796
17179C68796M9029A34487a25951C63350o0364A47577M4929P9837a8183D23212
$$ 368796 417825 134487 -125951 363350 302986 147577 192506 272343 -18183 423212
17168b3212A21476L37299A51005M9540j758J83810q6121q5840M3195R2273A59992
$$ -23212 121476 458775 151005 200545 198787 382597 296476 210636 253831 346104 159992
17156E3314L68225j16628k5395O8776J14660A47121J33441j24589K97528A03933
$$ 53314 421539 304911 279516 348292 462952 147121 280562 155973 453501 103933
17145G43685B62198R8989P1757p6257q5044K03502B06276m3812M97633m9130B02037
$$ 743685 262198 361187 432944 356687 271643 475145 206276 162464 660097 610967 202037
17133D21860n6361J56897j94650L7572a50618A04210K13531M7296j4704Q4784
$$ 421860 365499 522396 327746 365318 -150618 104210 317741 365037 350333 435117
17123D35117k9521A37635L0490l2460L38494l1577o5397j37063R5958I3864L18423
$$ 435117 405596 137635 168125 135665 474159 442582 377185 240122 336080 93864 412287
17112D12287j14315J30943L6289j03283O3309m1540A40675J56265M8595j48662
$$ 412287 297972 428915 465204 361921 425230 383690 140675 296940 345535 196873
17102A96873K79505B27553K80585m9635K7715R3419A13442K71178J57682D3134
$$ 196873 476378 227553 508138 458503 486218 579637 113442 384620 542302 43134
17091E46804R6453J06132l21205A43290J82177o7338G2401M75742j55897l9837
$$ 546804 643257 749389 428184 143290 325467 258129 72401 548143 392246 352409
17081C52409L54099B54194K3792j01916N99809A75622K62447j76302M52718N1611
$$ 352409 706508 254194 277986 176070 775879 175622 438069 261767 714485 766096
17071G66096l70491m16m7341L7136O7148n775J69695j87244J32483j61074R8409
$$ 766096 395605 395189 347848 384984 452132 446357 616052 428808 561291 400217 498626
17060D98626j38322J18537j956j03393N30892l81176j55846L24191A31796M20035
$$ 498626 360304 478841 476885 373492 904384 523208 367362 691553 131796 551831
17050E51831K77471m07780J02570j01240N7757n9856j10754M07621l6C30713j51396
$$ 551831 829302 421522 524092 422852 480609 420753 309999 717620 717584 330713 179317
17039A79317M42417j85250Q7812L18979l90095j61227K64185K9634K10474k96362
$$ 179317 621734 436484 524296 843275 453180 291953 556138 585772 796246 499884
17029D99884J62332k99723L64092q7187j24095M03280C24382J97627N10844C51436
$$ 499884 662216 362493 726585 639398 515303 918583 324382 522009 1032853 351436
17018F09622j9168j26097K57156k17641j66123L33908N1850r1800j66663j5390
$$ 609622 590454 464357 721513 503872 337749 671657 723507 631707 465044 449654
17008D49654J74021l8948K54761n0345j03376n44K59072l24789l8088J06912J75426
$$ 449654 623675 584727 839488 789143 685767 685223 944295 619506 581418 688330 863756
16997H63756k68393K61087L7056q6091O9283l44160k6989O71431n49865M961P3514
$$ 863756 595363 856450 893506 807415 876698 532538 505549 1176980 627115 632076 705590
16986G05590L63538k06546l8212q9379m3774J34839L98763k76970J32831o905
$$ 705590 1069128 862582 824370 734991 691217 826056 1224819 947849 1080680 1073775
16976A073775k04013J14135l16068K45459j66245L16772j35872l4629j6623K22123
$$ 1073775 869762 983897 667829 913288 747043 1063815 927943 893314 876691 1098814
16966A098814J12891k61315j09969Q6782Q9570r5126j00303J518j3849Q3255M44150
$$ 1098814 1211705 950390 840421 927203 1016773 921647 821344 822862 809013 892268 1336418
16955A336418o04353L72049j19888K23607J30071k59240j47864j08453P2155L52865
$$ 1336418 732065 1104114 984226 1207833 1337904 1078664 930800 822347 894502 1247367
16945A247367j27757j29552L73615l54082J89698j81134M08339q0774j50211m82671
$$ 1247367 1119610 990058 1363673 1009591 1199289 1018155 1426494 1345720 1195509 712838
16935G12838P50668J40609o13033L20278o575L00365l95696J37996L69106l27978
$$ 712838 1463506 1604115 991082 1311360 1304785 1605150 1209454 1347450 1716556 1388578
16925A388578l71729K54182p97K52967j411j08543K32859j49669j42978k53246
$$ 1388578 1016849 1271031 1270234 1523201 1521790 1413247 1646106 1496437 1353459 1100213
16915A100213L28718L33423j72081Q21l57606M57146R5123o5607L408k98964j35994
$$ 1100213 1428931 1762354 1590273 1591094 1233488 1690634 1785757 1720150 1723558 1424594 1288600
16904A288600L00198R3574L02914m01084K95741o846k65949J83609j60788K11168
$$ 1288600 1588798 1682372 1985286 1584202 1879943 1873097 1607148 1790757 1629969 1841137
16894A841137K12638j02109j00047j26924N51138n33228L13883j65658J54998
$$ 1841137 2053775 1951666 1851619 1724695 2275833 1742605 2056488 1890830 2045828
16885B045828J56049k41622k6449J3787N72376n26773O25963k58932k50870l2509
$$ 2045828 2201877 1960255 1933806 1947593 2519969 1993196 2619159 2360227 2109357 2076848
16875B076848k02599O56378k21892J48749K68278j45654j45982K58920m3308j20843
$$ 2076848 1874249 2530627 2308735 2457484 2725762 2580108 2434126 2693046 2649738 2528895
16865B528895O6274p3480N4404J46356q7136O40782k66809m1010j14927R0856
$$ 2528895 2595169 2521689 2576093 2722449 2635313 3276095 3009286 2968276 2853349 2944205
16855B944205j78509R7134N1003L01570j20675L27366J36819j80406j13612L16929
$$ 2944205 2765696 2862830 2913833 3215403 3094728 3422094 3558913 3378507 3264895 3581824
16845C581824n0290k3200j21217J52709K6706J29882O2727j21058K35659J8538
$$ 3581824 3531534 3508334 3387117 3539826 3566532 3696414 3759141 3638083 3873742 3892280
16835C892280P9868J73944n6504K45284k66622K27959r7068K45297L71846m37530
$$ 3892280 3972148 4146092 4089588 4334872 4068250 4296209 4199141 4444438 4816284 4378754
16825D378754K21585J89925l8572O28931j92861r4709L46974l95825O30448k7054
$$ 4378754 4600339 4790264 4751692 5380623 5187762 5093053 5440027 5044202 5674650 5647596
16815E647596J29942J09470J63864J49329k1512J34752L19122O7545l2866K37582
$$ 5647596 5777538 5887008 6050872 6200201 6178689 6313441 6632563 6700108 6667242 6904824
16805F904824k9053L25697j62305K72663J00299M11223L7036L23496K98494R161
$$ 6904824 6875771 7201468 7039163 7311826 7412125 7823348 7860384 8183880 8482374 8491535
16795H491535J29651J64148K19589O74937L76339L6457J87807K70552M61821J66987
$$ 8491535 8621186 8785334 9004923 9679860 10056199 10092656 10280463 10551015 11012836 11179823
16785A1179823L52458J99623K17888K52411N94342K08051L70570N07924O14936
$$ 11179823 11532281 11731904 11949792 12202203 12796545 13004596 13375166 13883090 14498026
16776A4498026l66068J129854L75486M68093J78732P44294N77775O92017L33611
$$ 14498026 14131958 15261812 15637298 16105391 16284123 17028417 17606192 18298209 18631820
16767A8631820J037522O74924L67590J080072R55834J49770J702156L70554J143215
$$ 18631820 19669342 20344266 20711856 21791928 22747762 22897532 24599688 24970242 26113457
16758B6113457J533651N88916J395933J084814J798472J491902J295539J802128
$$ 26113457 27647108 28236024 29631957 30716771 32515243 34007145 35302684 37104812
16750C7104812J404585J930028J832168K282857J938107K639148K310963K921002
$$ 37104812 38509397 40439425 42271593 44554450 46492557 49131705 51442668 54363670
16742E4363670L015017L219368L128202L772778L901152L947776M227045M645401
$$ 54363670 57378687 60598055 63726257 67499035 71400187 75347963 79575008 84220409
16734H4220409N173464N604512N287304O308992N972838O469276P329665O935933
$$ 84220409 89393873 94998385 100285689 106594681 112567519 119036795 126366460 133302393
16726A33302393P777878O941934P363114P056002O857146O352415N185662M780654
$$ 133302393 141080271 148022205 155385319 162441321 169298467 175650882 180836544 185617198
16718A85617198L472472K603113J395294n36082j088503k513668l813709m627113
$$ 185617198 189089670 191692783 193088077 192551995 191463492 188949824 185136115 180509002
16710A80509002n394127o794830o546130p342635p045660p566418p625741p073360
$$ 180509002 175114875 168320045 161773915 154431280 147385620 139819202 132193461 125120101
16702A25120101p115663p010175o486380o239446n774651n397685n037217m802253
$$ 125120101 118004438 110994263 104507883 98268437 92493786 87096101 82058884 77256631
16694G7256631m374237m279735l907951l663513l419393l246280k740456k997651
$$ 77256631 72882394 68602659 64694708 61031195 57611802 54365522 51625066 48627415
16686D8627415k476432k266636k348205j866357k038693k129009j344120j803662
$$ 48627415 46150983 43884347 41536142 39669785 37631092 35502083 34157963 32354301
16678C2354301j384914j481138j406701r40952j293921j032044q23519r47370
$$ 32354301 30969387 29488249 28081548 27140596 25846675 24814631 23991112 23043742
16670B3043742j128021o55947j000501q45383n65194o40648m37881m84445r53578
$$ 23043742 21915721 21259774 20259273 19413890 18848696 18208048 17770167 17285722 16332144
16661A6332144n31535p70223o46576O0902o74895n68588j07146n58809n55047
$$ 16332144 15800609 15030386 14383810 14444712 13769817 13201229 13094083 12535274 11980227
16652A1980227j49472n44417k25893j82648m94520k43574K00964o92173k72137
$$ 11980227 11830755 11286338 11060445 10877797 10383277 10139703 10340667 9648494 9376357
16643I376357l95167q9173j58203o32359K36225m00373l75346R3399p08291J29097
$$ 9376357 8981190 8892017 8733814 8101455 8337680 7937307 7561961 7655360 6947069 7076166
16633G076166k094j55499k94707K79940o48166K07028j20336n44008J61566k33023
$$ 7076166 7074072 6918573 6623866 6903806 6255640 6462668 6342332 5798324 5959890 5726867
16623E726867k92943P2646j58720j11003j9325j42223K208m08216K08522m19131
$$ 5726867 5433924 5506570 5347850 5236847 5217522 5075299 5077507 4669291 4877813 4458682
16613D458682J65096L4042l01741J6669j41866L2019j7890l60843M1256K8861
$$ 4458682 4623778 4657820 4356079 4372748 4230882 4262901 4245011 3884168 3925424 3954285
16603C954285k49197j38982j24253o3530M70596l42248j50387k79681n4373J52426
$$ 3954285 3705088 3566106 3441853 3378323 3848919 3506671 3356284 3076603 3022230 3174656
16593C174656n8060k34177M55730j46866l40033J61943k5511J04268k19523k48507
$$ 3174656 3116596 2882419 3338149 3191283 2851250 3013193 2987682 3091950 2872427 2623920
16583B623920j91057m6239M99001m34596J825l48706O86097k77582k82010J22112
$$ 2623920 2432863 2386624 2885625 2451029 2452854 2104148 2790245 2512663 2230653 2352765
16573B352765m97036L91842O7940j63700j43013k2379l6356r5378j05646K97643
$$ 2352765 1855729 2247571 2315511 2151811 2008798 1986419 1950063 1854685 1749039 2046682
16563B046682N9291M3773j91733j93368J62268K3869k18263k3254K78648l92367
$$ 2046682 2105973 2149746 1958013 1764645 1926913 1950782 1732519 1709265 1987913 1595546
16553A595546o3723L90766l84827L24925l25520J57887m30509J76860M23626k79109
$$ 1595546 1531823 1922589 1537762 1862687 1537167 1695054 1264545 1441405 1865031 1585922
16543A585922j54548M3020Q8039J27172P5135o70332K23403P6794J29962o8210
$$ 1585922 1431374 1474394 1562433 1689605 1764740 1094408 1317811 1394605 1524567 1456357
16533A456357O016l20459M42581k87887J22575l56570J55044k96763K41013q9008
$$ 1456357 1462373 1141914 1584495 1296608 1419183 1062613 1217657 920894 1161907 1072899
16523A072899N35291m88899J43333k38449J3979k52696K52785j47779J21305R8448
$$ 1072899 1608190 1119291 1262624 1024175 1038154 785458 1038243 890464 1011769 1110217
16513A110217j36592K22819j56006k30994K15144l42517M61393m55049L80364
$$ 1110217 973625 1196444 1040438 809444 1024588 682071 1143464 688415 1068779
16504A068779l44237Q3092L10514j46866k41497k43196O10189l76585O0270n1046
$$ 1068779 724542 807634 1118148 971282 729785 486589 1096778 720193 780463 729417
16494G29417L60382k37118k83733M22797j01938k09319j36132N17167D77732K66337
$$ 729417 1089799 852681 568948 991745 889807 680488 544356 1061523 477732 744069
16484G44069J77144j33209L09248D04153J52180J24863J88730q7399j47948M3402
$$ 744069 921213 788004 1097252 404153 556333 681196 869926 782527 634579 677981
16474F77981J59913q4271l4921k32893K634K32256K97011k56953p2212j12503
$$ 677981 837894 753623 718702 485809 488443 720699 1017710 760757 688545 576042
16464E76042J91006o918l29470J32989o7411J93692J0332o9772k74604M48509
$$ 576042 767048 760130 430660 563649 496238 689930 700262 630490 355886 804395
16454H04395k95891J82228N0649J01687k10527m0112J27466B57262L74268j66408
$$ 804395 508504 690732 741381 843068 632541 592429 719895 257262 631530 465122
16444D65122J73683C11812K02928J73838K5116k29414m2513j07824l454L64446
$$ 465122 638805 311812 514740 688578 713694 484280 441767 333943 330489 694935
16434F94935B91878J67493N7269j80069K68360K74693l14832J12668k74050K17188
$$ 694935 291878 459371 516640 336571 604931 879624 564792 677460 403410 620598
16424F20598j78413p7525N3658B03117R0038j16498L28584A85352K28687o2654
$$ 620598 442185 364660 418318 203117 293155 176657 505241 185352 414039 351385
16414C51385N9143L9205q6807K7769o7551K4655K43545B94829L282L78877k75757
$$ 351385 410528 449733 362926 390695 323144 347799 591344 294829 298111 676988 401231
16403D01231j65137O2054J42603L7558j74387N8737J07194A48635K11178j68220
$$ 401231 236094 298148 440751 478309 303922 362659 469853 148635 359813 191593
16393A91593K24434j84507J26792j69123J12987K03290k37462J0455P5935j76727
$$ 191593 416027 231520 358312 189189 302176 505466 268004 278459 354394 177667
16383A77667J34163m0569A22966J46773C1223K5198K53637j14498q4674a9347
$$ 177667 311830 271261 122966 269739 31223 56421 310058 195560 110886 -19347
16372E04451r9229J66273j38386q9903A56179K37524K03224I8002M621K36753
$$ 504451 405222 571495 433109 343206 156179 393703 596927 98002 102623 339376
16362C39376J76739A76973K65778k21251M621L0200j22111C3874R2779h1477B03391
$$ 339376 516115 176973 442751 221500 226121 256321 134210 33874 126653 -81477 203391
16350D42905H746M91856E1956K41223J88508H4655K89841I1103O27780j67779
$$ 442905 8746 500602 51956 293179 481687 84655 374496 91103 718883 551104
16340E51104B4017R5222K55985A85750M9916c44912D19855k03165H8235K14405
$$ 551104 24017 119239 375224 185750 235666 -344912 419855 216690 88235 302640
16330C02640J86019B33022K26039j76555F343L0410J02998B1424K31833a20B80227
$$ 302640 488659 233022 459061 282506 6343 36753 139751 21424 253257 -120 280227
16318C08064f9638A81427H8716N4189D9932J60770c7259B24161m5364K41569j68187
$$ 308064 -69638 181427 88716 142905 49932 210702 -37259 224161 178797 420366 252179
16307B52179p6465C0245J7912e8955K9237A74825o2736f9586E62296j23274j52650
$$ 252179 175714 30245 48157 -58955 -29718 174825 112089 -69586 562296 439022 286372
16296B86372i0956A66563m0095n3588J01635J32167A51088K4731G8703J21862
$$ 286372 -90956 166563 126468 72880 174515 306682 151088 175819 78703 200565
16286B00565o7962a2275C3502K71151I3285k6902K87495b5784f002B10180G8714
$$ 200565 132603 -12275 33502 304653 93285 66383 353878 -25784 -6002 210180 78714
16274A2829b10471A12852K00331p7354d6620A06724a71893A94711J23092q3783
$$ 12829 -210471 112852 313183 235829 -46620 106724 -171893 194711 317803 234020
16264B34020b65244B7076h0497A72222b3800j1619A53843d8327C5193a88189B1388
$$ 234020 -265244 27076 -80497 172222 -23800 -35419 153843 -48327 35193 -188189 21388
16252B58418J28717C8540J9920J05800j9429J60096j41406k8938a73127A22190
$$ 258418 387135 38540 58460 164260 144831 304927 163521 134583 -173127 122190
16241C30201l5143j06914H5890J28250p6420d6060r19q0044C2826b99714D61247
$$ 330201 295058 188144 85890 214140 137720 -46060 -46979 -127023 32826 -299714 461247
16229G9470b71108D41731D3862J32950m1223f948j03710A85248G7242Q6610a06111
$$ 79470 -271108 441731 43862 176812 135589 -6948 -110658 185248 77242 163852 -106111
16217a71329O9506A85624A7993Q490M5415K40872l2248A07586N4687B1543J46102
$$ -171329 -101823 185624 17993 26483 71898 312770 280522 107586 162273 21543 167645
16206A67645E7297h5310A8762L00287A48612a21832A09611J24261a88239A09628
$$ 167645 57297 -85310 18762 319049 148612 -121832 109611 233872 -188239 109628
16195B79698A05799c7540j39354D08888b9107A87345K1441A3408K0023J33183
$$ 279698 105799 -37540 -176894 408888 -29107 187345 208786 13408 33431 166614
16185A66614B3209P9207e8847B55566C3368d7077B54472j21414m929J80043E3710
$$ 166614 23209 102416 -58847 255566 33368 -47077 254472 133058 128129 308172 53710
16173E4792k3231a42411B90719A31426i9375B55168a94406A71793N7478d04n7051
$$ 54792 31561 -142411 290719 131426 -99375 255168 -194406 171793 229271 -404 -57455
16162e7455A49218D5895J2288b0129j30435A68934a00064g185C91820A71583a59155
$$ -57455 149218 45895 58183 -20129 -150564 168934 -100064 -7185 391820 171583 -159155
16150A0754Q7788d9523A83014B6419J81218a26903I7774A5793L22027m3747c70059
$$ 10754 98542 -49523 183014 26419 207637 -126903 97774 15793 337820 294073 -370059
16138F0079I117a47347I4141k5274J17373a4579A86230c8052l5862A65422g6711
$$ 60079 9117 -147347 94141 68867 186240 -14579 186230 -38052 -73914 165422 -76711
16126i2863A24697L213A1096R0659f3522k42906C60033E531a6619k53509B72137
$$ -92863 124697 127910 11096 101755 -63522 -306428 360033 5531 -16619 -270128 272137
16114a24822j13869p6427A28416P4784f7973B46646i170A32914J61380i1236L1870
$$ -124822 -238691 -315118 128416 203200 -67973 246646 -9170 132914 294294 -91236 -59366
16103e9366K0287B03104G2694K68869D972L6458f0298F4202a58528B77523b98651
$$ -59366 -39079 203104 72694 341563 4972 41430 -60298 64202 -158528 277523 -298651
16091h5854B55409i2616c0046B71347j21743N5165a10953d4469r0007c9807j21422
$$ -85854 255409 -92616 -30046 271347 149604 204769 -110953 -44469 -134476 -39807 -161229
16080a61229A94338C2439a13348k1357A14260f0554B45280q6491b65009m3304
$$ -161229 194338 32439 -113348 -134705 114260 -60554 245280 158789 -265009 -308313
16070c08313B32532a5241B39207a19721B21588K1489b7755j29926C02486i6614
$$ -308313 232532 -15241 239207 -119721 221588 243077 -27755 -157681 302486 -96614
16059A7495h0893l6723j74940G2783g2572A16448c0837n1111q6932B15201A1043
$$ 17495 -80893 -117616 -292556 72783 -72572 116448 -30837 -81948 -168880 215201 11043
16047C50976C5593K03929g7663I026b86373A17639O3221d9804B1257a4874j56726
$$ 350976 35593 239522 -77663 9026 -286373 117639 180860 -49804 21257 -14874 -171600
16036a71600K0553l808o5575f428j1582j94816A07573L52059a55925B29540D8918
$$ -171600 -151047 -154855 -220430 -6428 -18010 -212826 107573 459632 -155925 229540 48918
16024b5653A73677D0314g2456a671o9182k26650A81760F5756J14630A0503a67778
$$ -25653 173677 40314 -72456 -1671 -70853 -297503 181760 65756 180386 10503 -167778
16012a34380I9063c01919D28675b01361j97663A42135j8760d3027C64259i2766
$$ -134380 99063 -301919 428675 -201361 -399024 142135 123375 -43027 364259 -92766
16001a94963i6755B0180J43103a24420B5883Q9214a39n3673k52215J02850M8361
$$ -194963 -96755 20180 163283 -124420 25883 115097 -139 -53812 -306027 -203177 -154816
15990a54816A51520A1437e3386B36830b10868D1555J815K65191E4185L68792B6370
$$ -154816 151520 11437 -53386 236830 -210868 41555 43370 308561 54185 422977 26370
15978B31481a7852I1048a8922j31704e9058C323a18877r497A31404N6588a5269
$$ 231481 -17852 91048 -18922 -150626 -59058 3323 -118877 -128374 131404 187992 -15269
15966D0130J35216c75548a21643B15835A203h5302k50573c8320I3973a77385d3582
$$ 40130 175346 -375548 -121643 215835 1203 -85302 -335875 -38320 93973 -177385 -43582
15954d2362C0286a97434H6450a99950F4947q251R8131b40157J09403m03179C778
$$ -42362 30286 -197434 86450 -199950 64947 56696 154827 -240157 -130754 -533933 3778
15942b32433j68246A89503a88237H9818b85975d918j78102d5683q7232A00632
$$ -232433 -400679 189503 -188237 89818 -285975 -4918 -183020 -45683 -132915 100632
15931A26802a44346o8820a2255A28282A533b37312A98462o8206c38694h8059j71959
$$ 126802 -144346 -213166 -12255 128282 1533 -237312 198462 130256 -338694 -88059 -260018
15920b60018J20416d2474A5591c3983B81224A6563K29890e305A4289e6944j35491
$$ -260018 -139602 -42474 15591 -33983 281224 16563 246453 -5305 14289 -56944 -192435
15909a92435R0681J6197o5559k9311D0704b58960B82556a82002B68253H9504C6694
$$ -192435 -101754 -85557 -151116 -180427 40704 -258960 282556 -182002 268253 89504 36694
15897A14764N64b02086a4993C0637h6822B8175j0318K1912b11927E50910e1311
$$ 114764 115328 -202086 -14993 30637 -86822 28175 17857 39769 -211927 550910 -51311
15885a92987B08343m2300E7768g8529l84682A56369a4042A14934a31358A57686
$$ -192987 208343 166043 57768 -78529 -463211 156369 -14042 114934 -131358 157686
15874e05574E9392c05487A29828N9470m0496A8321c5615m0831j25809d5917r7334
$$ -505574 59392 -305487 129828 189298 148802 18321 -35615 -76446 -202255 -45917 -143251
15863a43251k71940a12824B82398f9289j37853D8006q783J68674D8656K74691
$$ -143251 -415191 -112824 282398 -69289 -207142 48006 39223 207897 48656 323347
15853C23347a10839A88105k9160F9503b5745A49356b78283A00811a29689k92883
$$ 323347 -110839 188105 158945 69503 -25745 149356 -278283 100811 -129689 -422572
15843d22572d499A28717a71936C70242a48946O4848j77381E1439L5824K6708b24629
$$ -422572 -4499 128717 -171936 370242 -148946 -84098 -261479 51439 87263 113971 -224629
15831H8015C7521i4161C54547j25324A14179f72541G9125e8850I4075f5561j96980
$$ 88015 37521 -94161 354547 229223 114179 -672541 79125 -58850 94075 -65561 -262541
15820b62541a1845A99102a08858F7105f7682L06B2800f3080l8942j76900b2822
$$ -262541 -11845 199102 -108858 67105 -67682 -67376 22800 -63080 -102022 -278922 -22822
15808c20615B2832d1840b0119j71769A22131c6363j76053H604b52242B47902A0819
$$ -320615 22832 -41840 -20119 -191888 122131 -36363 -212416 8604 -252242 247902 10819
15796b50403E6471a23349L9360H6678J36469J60656A2953a02849b2450C27345
$$ -250403 56471 -123349 -83989 86678 223147 383803 12953 -102849 -22450 327345
15785a16100A75195P7114c73634a28331E6988Ra20006A56022A9773R4014k9355
$$ -116100 175195 252309 -373634 -128331 56988 56997 -120006 156022 19773 113787 84432
15774H4432a12027m9212f9395C03176H1382C4904a35868d7072A98868p4173m2667
$$ 84432 -112027 -161239 -69395 303176 81382 34904 -135868 -47072 198868 124695 82028
15763H2028A8690a87558i006B41274k1898a47685A73632E7316Q4341h1300A94860
$$ 82028 18690 -187558 -9006 241274 219376 -147685 173632 57316 141657 -81300 194860
15751B48895j19297a7369D6222r263d10177B29769a37040M6312m1334A05827h8063
$$ 248895 129598 -17369 46222 36959 -410177 229769 -137040 -90728 -132062 105827 -88063
15739a36746B2112K4298a01419A93096A2914D274c2089E4603K4798M5566d25908
$$ -136746 22112 46410 -101419 193096 12914 4274 -32089 54603 79401 124967 -425908
15727a00748I9549b19249M0071G963b22294C1000f569j32007j04879L283C1567
$$ -100748 99549 -219249 -179178 7963 -222294 31000 -6569 -138576 -243455 -240172 31567
15715B41320a21403a2598M528A20250b67523L4232g3901J913F9850a07329M112
$$ 241320 -121403 -12598 -8070 120250 -267523 -233291 -73901 -71988 69850 -107329 -103217
15704a03217B07669b27381A0608a72837D3047i0831R197j21063g0685o5257A25431
$$ -103217 207669 -227381 10608 -172837 43047 -90831 -81634 -202697 -70685 -135942 125431
15692a14j02841C24282f7790k08279H8576a15447b6788A29373c88953J94392M4862
$$ -114 -102955 324282 -67790 -276069 88576 -115447 -26788 129373 -388953 -194561 -149699
15681a49699B10239E4938l440a26138e311n91028J77361e3805k13624B09790b39527
$$ -149699 210239 54938 51498 -126138 -5311 -596339 -418978 -53805 -267429 209790 -239527
15669i6618l0033K0639B4236a12586c5907B11959c866k47910J04561c1284n046
$$ -96618 -126651 -106012 24236 -112586 -35907 211959 -3866 -251776 -147215 -31284 -36330
15658c6330k15639h3764b7437l55933A76210H2460k6597b69481c5467F1832A6835
$$ -36330 -251969 -83764 -27437 -383370 176210 82460 55863 -269481 -35467 61832 16835
15646a33534C60836C3419a54423k7415M6025J835j37538b7887o7718A4461O0808
$$ -133534 360836 33419 -154423 -181838 -135813 -133978 -271516 -27887 -95605 14461 75269
15635G5269b1702k60825H7552a8564l706E4293a9120j19310A00343c71083A26158
$$ 75269 -21702 -282527 87552 -18564 -22270 54293 -19120 -138430 100343 -371083 126158
15623c6807A2040M1295e6231C09847d59984H3549a93416f9506k5551A74037J3460
$$ -36807 12040 53335 -56231 309847 -459984 83549 -193416 -69506 -95057 174037 187497
15612A87497a57203N3504B8873j3524a17186M5420b5719j57396N6704B4563J59452
$$ 187497 -157203 -103699 28873 15349 -117186 -71766 -25719 -183115 -126411 24563 184015
15601A84015b26101c1163k987o8971E9520F847b3005l93887a5921q7879D2133
$$ 184015 -226101 -31163 -34150 -103121 59520 6847 -23005 -416892 -15921 -103800 42133
15589A40599B4533A0830K50371m4402c4367B3522L68422G2472h3933i747C19896
$$ 140599 24533 10830 261201 216799 -34367 23522 391944 72472 -83933 -9747 319896
15577C0414J15374J7506b4293j8655A29379b28200A47674J8096a71837A33795
$$ 30414 145788 163294 -24293 -42948 129379 -228200 147674 165770 -171837 133795
15566C0145J89417m69E293r32h2460M719D09070A18869g2906E7107b25998A47173
$$ 30145 219562 219093 5293 4361 -82460 -77741 409070 118869 -72906 57107 -225998 147173
15553A01820a59790g0647p090G1348A8626c54357d8469k5551A61252L9254a45160
$$ 101820 -159790 -70647 -77737 71348 18626 -354357 -48469 -74020 161252 200506 -145160
15541A31009a12607k90370a35221J5861a2375E2514J140a23342m0782L2436A34259
$$ 131009 -112607 -402977 -135221 -119360 -12375 52514 53654 -123342 -164124 -131688 134259
15529a62920j7112A12921a11602A81207a0086l2864A83347a49366F1121J16867
$$ -162920 -180032 112921 -111602 181207 -10086 -42950 183347 -149366 61121 177988
15519A77988P0616a50677D8963a9486A59660B6376K14746D8882b5415j80589N4422
$$ 177988 248604 -150677 48963 -19486 159660 26376 241122 48882 -25415 -206004 -151582
15508a51582B50448r9998D0769a2590j5593n3065A8794d2676A16947a3264A42643
$$ -151582 250448 150450 40769 -12590 -28183 -81248 18794 -42676 116947 -13264 142643
15496a54453E5339i9497p8342o7069r7218A17711M7997a76407G6049d849j10771
$$ -154453 55339 -99497 -177839 -244908 -342126 117711 165708 -176407 76049 -4849 -115620
15485a15620A62075C1521a1496k49374f9818A16989C1402J36471M0762b51821
$$ -115620 162075 31521 -11496 -260870 -69818 116989 31402 167873 208635 -251821
15474a54563E5891a05291k10326J50636J4833I3472n949b9810k83866b0244A90508
$$ -154563 55891 -105291 -315617 -164981 -150148 93472 87523 -29810 -313676 -20244 190508
15462A03743O3618b77630D4368L3177e7669A43738f7427A20672a17564B76937
$$ 103743 167361 -277630 44368 77545 -57669 143738 -67427 120672 -117564 276937
15451I1929K00982b74687H6093R3289a64579d7997q1080j56109O3621B98288h1217
$$ 91929 292911 -274687 86093 179382 -164579 -47997 -129077 -285186 -221565 298288 -81217
15439a50298f0122m8210C1180r670c74060C6153a54611N8889A73714b14086n2170
$$ -150298 -60122 -108332 31180 21510 -374060 36153 -154611 -95722 173714 -214086 -266256
15428b66256d0045j45014F906d9922D7311c6820j34072e2761C0124K3071a51051
$$ -266256 -40045 -185059 6906 -49922 47311 -36820 -170892 -52761 30124 53195 -151051
15416A30818e2721r3182H9334f437A10519D2054a19760B67607B2832R5579a23585
$$ 130818 -52721 -145903 89334 -6437 110519 42054 -119760 267607 22832 118411 -123585
15404b22464O9815A5854J61641H3513k5668e6443A69474L9425a89143d296B60263
$$ -222464 -152649 15854 177495 83513 57845 -56443 169474 208899 -189143 -4296 260263
15392A44705m1892a52354b1114p1663d3543J188N157G2824Q3842b18694A93445
$$ 144705 102813 -152354 -21114 -92777 -43543 -42355 -37198 72824 156666 -218694 193445
15380a84666d717A71032p2214a8824F2308C0180a53585E7401h8519a6781j20604
$$ -184666 -4717 171032 98818 -18824 62308 30180 -153585 57401 -88519 -16781 -137385
15369a37385m539C1256g0186p0886J0271o7034A28192P5516D8175B0639a60441
$$ -137385 -141924 31256 -70186 -141072 -130801 -197835 128192 203708 48175 20639 -160441
15357b27266b2835B74579f3675b3706j51649D8177b46205J1410b3979B1398Q2980
$$ -227266 -22835 274579 -63675 -23706 -175355 48177 -246205 -234795 -23979 21398 104378
15346A04378l7622J83171a91182j36371a701l32529m8877g8675A97840B5048K0237
$$ 104378 66756 249927 -191182 -327553 -1701 -334230 -383107 -78675 197840 25048 45285
15335D5285Q139O8708B9948q532N9147h7202m5216B48577j3261m1510d7949A14095
$$ 45285 53424 122132 29948 21416 80563 -87202 -132418 248577 235316 193806 -47949 114095
15322B71648a99468B5255c0678B34692r8530a1309k65932j83324C71834A39504
$$ 271648 -199468 25255 -30678 234692 136162 -11309 -277241 -460565 371834 139504
15311B37521A5413J50096G9106J81442A4625b76900f5269Q395A14697F859J55005
$$ 237521 15413 165509 79106 260548 14625 -276900 -65269 -56874 114697 6859 161864
15300A61864J72904A32859J08138g8048j70785G2314R9314a31052D9249K66019
$$ 161864 334768 132859 240997 -78048 -248833 72314 171628 -131052 49249 315268
15290C15268B4361a99450B23766K2592d18j20350A72537a85614I6040B1627R1596
$$ 315268 24361 -199450 223766 246358 -418 -120768 172537 -185614 96040 21627 113223
15279A13223a39068A64092g4290a2748A7806b7574A09395K04250a90417e9056
$$ 113223 -139068 164092 -74290 -12748 17806 -27574 109395 313645 -190417 -59056
15268d8651l8944C3535a17406L4670j26248C25135F809a00059B69120G3863N1936
$$ -48651 -87595 33535 -117406 -82736 -208984 325135 6809 -100059 269120 73863 125799
15257A25799k6139g2047A95285b63363C62248d5306a0553B99691J16744L94750
$$ 125799 99660 -72047 195285 -263363 362248 -45306 -10553 299691 416435 811185
15247H11185J002291n82190k17850M71210F03197j30151j66017a82019B18762
$$ 811185 1813476 1231286 1013436 1484646 603197 473046 307029 -182019 218762
15237B82263J7096A08912a19950Q906A50868K00644j71314F7754A8604f1401j39
$$ 282263 299359 108912 -119950 -111044 150868 351512 180198 67754 18604 -61401 -61540
15226f1540j7605C52095a14826j93884H9241N1287n8755J53337J14520a43442
$$ -61540 -79145 352095 -114826 -308710 89241 140528 81773 235110 349630 -143442
15215h8797k1339B77417A06898a868j349D10285A3742a72568r8697D3376J7484
$$ -88797 -110136 277417 106898 -1868 -3217 410285 13742 -172568 -271265 43376 60860
15204F0860Q7447A1013J04832c990A66549o4697J83813j38409n5275A9447L2049
$$ 60860 148307 11013 115845 -3990 166549 101852 285665 147256 91981 19447 51496
15193E1496K2663c5195k48056I4455A0476J53525M7611k9319i1601B00590J16805
$$ 51496 74159 -35195 -283251 94455 10476 164001 211612 182293 -91601 200590 317395
15182C17395b37352A22324P5186l1054b07662M6009E1123k0329Q5881E5476J55861
$$ 317395 -237352 122324 197510 166456 -207662 -161653 51123 30794 116675 55476 211337
15171B11337A02744J00941n1457G5048K14636j26144J79020b4033D40140D0762
$$ 211337 102744 203685 152228 75048 289684 163540 342560 -24033 440140 40762
15160b80061A07614n0287K71925j33394J8863H0917K27735a53181G3035l105f3994
$$ -280061 107614 57327 329252 195858 214721 80917 308652 -153181 73035 69930 -63994
15148G1510J79582C2374J04280m688L9802o3550J53182e693A29816A9601J17827
$$ 71510 251092 32374 136654 131966 171768 108218 261400 -5693 129816 19601 137428
15137A37428J47970B0476K30907A10279h8915A87524e6226C65979j21340G5969
$$ 137428 285398 20476 251383 110279 -88915 187524 -56226 365979 244639 75969
15126B05436G2841k9330c71300H6887b734B28075j01708J04779h2524C07362d8641
$$ 205436 72841 43511 -371300 86887 -2734 228075 126367 231146 -82524 307362 -48641
15114B23455B4011L81767a4661B49551I2302L70578a87090C7147J39736E5849
$$ 223455 24011 405778 -14661 249551 92302 462880 -187090 37147 176883 55849
15103A83681L7674N9513b45307B48911a065l5370j20328j28163A39492f6660o5415
$$ 183681 221355 280868 -245307 248911 -1065 -36435 -156763 -284926 139492 -66660 -132075
15092a32075G2166a90177A41295K15481G6747J25990C0779N2117c21335C40888
$$ -132075 72166 -190177 141295 356776 76747 202737 30779 82896 -321335 340888
15081C43608a55260P6671k5877d5412j3661B25098A00127J50272D3483L08384
$$ 343608 -155260 -78589 -104466 -45412 -59073 225098 100127 250399 43483 351867
15071C51867A27058a6676A2705J38342L8784l5614P5975a38530F9443a72795A37186
$$ 351867 127058 -16676 12705 151047 189831 154217 230192 -138530 69443 -172795 137186
15059A15616K46777A27668P7039J0498q5908L8251E4579a0785A31172K41973q9119
$$ 115616 362393 127668 204707 215205 129297 167548 54579 -10785 131172 373145 284026
15048B84026A09952R7476G9817a32196C29580i7688j7303B98572J43856B0568
$$ 284026 109952 207428 79817 -132196 329580 -97688 -114991 298572 442428 20568
15037C08368j18725Q5954j24874K06207j10136j01954M00908n6358k5262j39186
$$ 308368 189643 275597 150723 356930 246794 144840 545748 489390 464128 324942
15027C24942A41256L2488n0483K2850K9523N8573C8363J83391p5939e8789o0178
$$ 324942 141256 173744 123261 146111 175634 234207 38363 221754 145815 -58789 -118967
15016a18967C78556e8334B30438J4521n8068D2205K64759E8998M39191B01497
$$ -118967 378556 -58334 230438 244959 186891 42205 306964 58998 498189 201497
15005d7840G6821a4940I0830K07906k9749g2124I6114K16414F17J6996L12786
$$ -47840 76821 -14940 90830 298736 268987 -72124 96114 312528 617 17613 330399
14994C30399c933A85728L9886a49313C32097N2521j73433p916a86788B48475r7061
$$ 330399 -3933 185728 225614 -149313 332097 384618 211185 203269 -186788 248475 151414
14983A51414a13925A38674n6826G812i9574C96643A27927K71655j87981J45359
$$ 151414 -113925 138674 81848 7812 -99574 396643 127927 399582 211601 356960
14973C56960A34231J64913j43493g7108C55128K985j55406K45241H7574J13421
$$ 356960 134231 299144 155651 -77108 355128 358113 202707 447948 87574 200995
14963B00995r2825b9461B84270A01608L05750j34122j25976K54634K66872B34815
$$ 200995 108170 -29461 284270 101608 407358 273236 147260 401894 668766 234815
14952B08111M5810A7456N83545j27159j05389j77594K60110p4899j84099M0488
$$ 208111 253921 17456 601001 473842 368453 190859 450969 376070 191971 232459
14942B32459H7849M25972A45946L49519A81511a36263C52247j69575L10385j89847
$$ 232459 87849 513821 145946 495465 181511 -136263 352247 182672 493057 303210
14932C03210B3678K69958G5703K04708J57567I4186L44083j15991J83879k40440
$$ 303210 23678 293636 75703 280411 437978 94186 438269 322278 506157 265717
14922B65717R7148a05779E91484B92945j34479a27785C68558j60892o9937L9517
$$ 265717 362865 -105779 591484 292945 158466 -127785 368558 207666 137729 177246
14912A77246p7799D0357J66957p3857R500m8022K89218m6855a1009C39701L7915
$$ 177246 99447 40357 207314 133457 142957 94935 384153 337298 -11009 339701 377616
14901C77616j30477J14039Q1136A68085P9135k8862j06922N00392B12241l2454
$$ 377616 247139 361178 442314 168085 247220 218358 111436 611828 212241 179787
14891A79787L9325L56336k56923M42788k19883P8487C08330D0545K47572E499
$$ 179787 219112 575448 318525 761313 541430 619917 308330 40545 288117 5499
14880D21168N1339N6915K2295j14530k09973O3464K56150A88840J55453J06869
$$ 421168 472507 529422 551717 437187 227214 290678 546828 188840 344293 451162
14870D51162J08812k39670j52154L27966r5326L08875B82763J63640k08660J29466
$$ 451162 559974 320304 168150 496116 400790 709665 282763 446403 237743 367209
14860C67209r1235K01901J8377J9835k50451J44156R9116k37641L07955A99465
$$ 367209 275974 477875 496252 516087 265636 409792 508908 271267 579222 199465
14849C07047J54233K04207B95947n0686K69006j08661G1039L92737j22673j62633
$$ 307047 461280 665487 295947 245261 514267 405606 71039 463776 341103 178470
14839A78470K76043r4128H9870O90235l34688k1251k3366N6628M17449D17721
$$ 178470 454513 360385 89870 780105 445417 424166 400800 457428 874877 417721
14828D23841n9157J43473n7673J03135r9108l09d9448F55423j60395q6182J86471
$$ 423841 364684 508157 450484 553619 454511 454202 -49448 655423 495028 408846 595317
14817E95317P6515l8487k57372J73659M0943j34644N6646J77414k43216J96728
$$ 595317 671832 633345 375973 549632 590575 455931 512577 689991 446775 643503
14807F43503A93154M54711k73712J70130q1138c2421D86167k10246L19867J09057
$$ 643503 193154 647865 374153 544283 463145 -32421 486167 275921 595788 704845
14797G04845j69479L5617k01652J50319J25026B93022L17447J7161O0696l33077
$$ 704845 535366 570983 369331 519650 644676 293022 610469 627630 688326 355249
14787C55249K77692K4162j68033j37120M58540l64083M5524K22150k38178q5619
$$ 355249 632941 657103 489070 351950 810490 446407 491931 714081 475903 390284
14777C90284J80953M8598K8873B84184L01201k37762K04230N7334j03859M7570
$$ 390284 571237 619835 648708 284184 585385 347623 551853 609187 505328 552898
14767E52898R8045j50477N1963K21330l31658J18347R2482J4559J4253j84948
$$ 552898 650943 500466 552429 773759 442101 560448 652930 667489 681742 496794
14757D96794K41284k00660K45286k64711j82679K41336n0241M1599k14287R8223
$$ 496794 738078 537418 782704 517993 335314 576650 526409 568008 353721 451944
14747D51944J17619B40447K11570M46302m34316k9856L37779K183j55575J84780
$$ 451944 569563 240447 452017 898319 464003 434147 771926 774109 618534 803314
14737H03314L9288j84680k17302M28108J6838C76546N3857J19783p5483J26813
$$ 803314 842602 657922 440620 868728 885566 376546 430403 550186 474703 601516
14727F01516j32865J34625K39606k13617j151K22202l97941N37606j91472J39242
$$ 601516 468651 603276 842882 629265 628114 850316 452375 989981 798509 937751
14717I37751k3829R4724k30543J42325p5722j74207j3180r1616J75582o9066M13007
$$ 937751 913922 1008646 778103 920428 844706 670499 657319 565703 741285 672219 1085226
14706A085226n10697k03268L94143C36811N53913n3547J27276l49424M53833l15859
$$ 1085226 574529 371261 765404 336811 890724 837177 964453 615029 1068862 753003
14696G53003J27169N68080F71040K18518L29988k41285j50109q6858O6780J69526
$$ 753003 880172 1448252 671040 889558 1219546 978261 828152 741294 808074 977600
14686I77600J22482n15022L99285O352l8831r621J09367j00678r6845j76838K77367
$$ 977600 1100082 585060 984345 990697 951866 942245 1051612 950934 854089 677251 954618
14675I54618j55542J27319K78148j03548l2064r0734Q0234J18126l60469K45346
$$ 954618 799076 926395 1204543 1100995 1068931 978197 1058431 1176557 816088 1061434
14665A061434O6850J15649k30049j72596L31149j02020l72775M44239l11864P6803
$$ 1061434 1128284 1243933 1013884 841288 1172437 1070417 697642 1141881 830017 906820
14655I06820j2395L65533j67357K7483J08511E86908O95775k17764J16404M8855
$$ 906820 894425 1259958 1092601 1120084 1228595 586908 1282683 1064919 1181323 1230178
14645A230178j01504J16983m0264N3579j39891K31319J9349q9419P995k58100
$$ 1230178 1128674 1245657 1205393 1258972 1119081 1350400 1369749 1280330 1288325 1030225
14635A030225N0611L2072L05972l5790r3145j04328P4485L8832J90421k83878
$$ 1030225 1080836 1112908 1418880 1383090 1289945 1185617 1260102 1298934 1489355 1205477
14625A205477J16905J64188j50327m79191M78872J50685m09177K90478L0322j50995
$$ 1205477 1322382 1486570 1336243 857052 1335924 1486609 1077432 1367910 1398232 1247237
14615A247237L79002k59968o00n0314K00465N1081m52268M20633k48972J75171
$$ 1247237 1626239 1366271 1365671 1315357 1515822 1566903 1114635 1535268 1286296 1461467
14605A461467J66155K16434k71384m6025K8972O155L6137P1632j97368J96262
$$ 1461467 1627622 1844056 1572672 1526647 1555619 1561774 1597911 1669543 1472175 1668437
14595A668437J67942j40338J39714J36458K6719j16679M479L33515m83911L58310
$$ 1668437 1836379 1696041 1835755 1972213 1998932 1882253 1886732 2220247 1736336 2094646
14585B094646m012k67291J45314j4495j33677j9372Q0032J39468n9313K91368
$$ 2094646 2090634 1823343 1968657 1954162 1820485 1801113 1881145 2020613 1961300 2252668
14575B252668K55972l42222P0147p5872K62916L6888L0450l65785K67702j81529
$$ 2252668 2508640 2166418 2236565 2160693 2423609 2460497 2490947 2125162 2392864 2211335
14565B211335M8064K1890P5952L47587m2400J64745l72323p5948L23127L56700
$$ 2211335 2259399 2281289 2357241 2704828 2662428 2827173 2454850 2378902 2702029 3058729
14555C058729J51661J92447J49317M16284K65538R81207K320881L487035Q377997
$$ 3058729 3210390 3402837 3552154 3968438 4233976 5215183 7536064 11023099 19401096
14546A9401096J7772320P250206B1554952q942628n985684k191798j182623o47525
$$ 19401096 37173416 44423622 21554952 12612324 6626640 4434842 3252219 2604694
14538B604694n95995N4304J31842l68743J49783j66260K71550M64525k69675O6032
$$ 2604694 2008699 2063003 2194845 1826102 1975885 1809625 2081175 2545700 2276025 2342057
14528B342057J99196j55705J47910n26392M68885n50374L93915o3303N69823l56173
$$ 2342057 2541253 2385548 2533458 2007066 2475951 1925577 2319492 2256189 2826012 2469839
14518B469839L14967k20747k94454L95810r6210J2019K01475O6460q4365J99975
$$ 2469839 2784806 2564059 2269605 2665415 2569205 2581224 2782699 2849159 2764794 2964769
14508B964769l49251K41452K89036j19583j9071J67871j92973R5646j85333k17754
$$ 2964769 2615518 2856970 3146006 3026423 3007352 3175223 2982250 3077896 2892563 2674809
14498B674809N63704l22626L10928p1612p2122J78956J07801J72006l56161K08801
$$ 2674809 3238513 2915887 3226815 3155203 3083081 3262037 3369838 3541844 3185683 3394484
14488C394484J22335K0611K02691l7770J99307K5059k94652O3735O8497J4157
$$ 3394484 3516819 3537430 3740121 3702351 3901658 3926717 3632065 3695800 3764297 3778454
14478C778454j45103J58018j03078K33224o4981K67363j82189K78948J39323M38392
$$ 3778454 3633351 3791369 3688291 3921515 3856534 4123897 3941708 4220656 4359979 4798371
14468D798371l56815j8195J69436O7023n9695l37163L97170k4307M04555p7209
$$ 4798371 4441556 4423361 4592797 4659820 4600125 4262962 4660132 4635825 5040380 4963171
14458D963171M1357J02105l8573K8787J8186M97686k82103K35186k20785q86k15927
$$ 4963171 5004528 5106633 5068060 5096847 5115033 5612719 5330616 5565802 5345017 5344131 5128204
14447E128204N25637K46921l33957N8831J38234L47189j54778R7597K75418j93840
$$ 5128204 5653841 5900762 5566805 5625636 5763870 6111059 5956281 6053878 6329296 6135456
14437F135456R3421j5339L51190O0341l605l503r6324M40232l50490O76058l84419
$$ 6135456 6228877 6213538 6564728 6625069 6621464 6617961 6521637 6961869 6611379 7287437 6903018
14426F903018M09221M6461k19241O01685O2196l80354K04941P9650N49428P8557
$$ 6903018 7312239 7358700 7139459 7741144 7803340 7422986 7627927 7707577 8257005 8335562
14416H335562K00255j60468P4394j1740M49814J97421l82474O42620j73097K02017
$$ 8335562 8535817 8375349 8449743 8438003 8887817 9085238 8702764 9345384 9172287 9374304
14406I374304j96240P94550k07312L0549L72768K80524K18723j48270M82106J3212
$$ 9374304 9178064 9972614 9765302 9795851 10168619 10449143 10667866 10519596 11001702 11014914
14396A1014914L9860L26117J18993j16659L48642K47549J2775O2005O95065J12409
$$ 11014914 11054774 11380891 11499884 11383225 11731867 11979416 11992191 12054196 12749261 12861670
14386A2861670J86606L50044K22477L00906M18741L49143j16602N03606Q4863
$$ 12861670 13048276 13398320 13620797 13921703 14340444 14689587 14572985 15076591 15161454
14377A5161454L86950K17851J15091N55310K33938M18202k12234Q78335J46178
$$ 15161454 15548404 15766255 15881346 16436656 16670594 17088796 16876562 17754897 17901075
14368A7901075N25978J28478Q13648P9783M77878M61924P17372j9989O79341O83986
$$ 17901075 18427053 18555531 19369179 19448962 19926840 20388764 21106136 21086147 21765488 22449474
14358B2449474J16585M83057N13713O64973P38175M28295O17840O57132P69059
$$ 22449474 22566059 23049116 23562829 24227802 24965977 25394272 26012112 26669244 27438303
14349B7438303M12976R35948P53754Q47036N92346R72202O51610Q31059J114357
$$ 27438303 27851279 28787227 29540981 30388017 30980363 31952565 32604175 33435234 34549591
14340C4549591J196678L34690J514935O96902J363498J053015J135858J027327
$$ 34549591 35746269 36080959 37595894 38292796 39656294 40709309 41845167 42872494
14332D2872494J593472J451428R73434J674371J698934J463890J855688J596919
$$ 42872494 44465966 45917394 46890828 48565199 50264133 51728023 53583711 55180630
14324E5180630J870283K110183J974082K107444K037773K450602K522560K326777
$$ 55180630 57050913 59161096 61135178 63242622 65280395 67730997 70253557 72580334
14316G2580334K881008K978475K904092K812842L795250L498399L793652L561915
$$ 72580334 75461342 78439817 81343909 84156751 87952001 91450400 95244052 98805967
14308I8805967M678931M070753M813097M881634M888155N731884N530456O478452
$$ 98805967 103484898 107555651 112368748 117250382 122138537 127870421 133400877 139879329
14300A39879329O792282P253399P042823P693693Q276463Q577927R667460R573757
$$ 139879329 146671611 153925010 160967833 168661526 176937989 185515916 195183376 204757133
14292B04757133J0509621J0894791J1205473J2365507J2356805J3269751J3518879
$$ 204757133 215266754 226161545 237367018 249732525 262089330 275359081 288877960
14285B88877960J4120003J4676609J4801320J5084268J5002868J4831081J5059286
$$ 288877960 302997963 317674572 332475892 347560160 362563028 377394109 392453395
14278C92453395J4319106J3479647J2479250J0893503Q189103M287410J614772
$$ 392453395 406772501 420252148 432731398 443624901 451814004 456101414 457716186
14271D57716186l90197N14010k80144n470849o461611o724038o998990q752257
$$ 457716186 457325989 457839999 457559855 452089006 445627395 438903357 431904367 423152110
14263D23152110j0103144j2149016j3448522j4203642j4660667j4920860j5217882
$$ 423152110 413048966 400899950 387451428 373247786 358587119 343666259 328448377
14256C28448377j5499794j5436556j3948108j3970740j3443332j2938813j2149509
$$ 328448377 312948583 297512027 283563919 269593179 256149847 243211034 231061525
14249B31061525j1623232j1007215j0330364r950270r203919q189771q036363
$$ 231061525 219438293 208431078 198100714 188150444 178946525 170756754 162720391
14242A62720391q002228p302522o796570o507039n708143n456700n572957n181892
$$ 162720391 154718163 147415641 140619071 134112032 128403889 122947189 117374232 112192340
14234A12192340m718762m615308m052512l690494l697981l776950l721547l117454
$$ 112192340 107473578 102858270 98805758 95115264 91417283 87640333 83918786 80801332
14226H0801332k975827k742023l054471k534991k290435k113284k366991k340629
$$ 80801332 77825505 75083482 72029011 69494020 67203585 65090301 62723310 60382681
14218F0382681j731331k423000j794685j590596j527716j097514j928167j283728
$$ 60382681 58651350 56228350 54433665 52843069 51315353 50217839 48289672 47005944
14210D7005944j489360j706182r31070r22191p34129j650082j055575j074806
$$ 47005944 45516584 43810402 42879332 41957141 41223012 39572930 38517355 37442549
14202C7442549j313911o19747p16543q95691j396972n51928o34281r44312p19219
$$ 37442549 36128638 35508891 34792348 33896657 32499685 31947757 31313476 30369164 29649945
14193B9649945m33929p80693j063698m58060p03604l03222r21274m26963l97160
$$ 29649945 29216016 28435323 27371625 26913565 26209961 25906739 24985465 24558502 24161342
14184B4161342r52949l60477p4016r25257k77763p24559l78613n12741n27862
$$ 24161342 23208393 22847916 22773900 21848643 21570880 20846321 20467708 19954967 19427105
14175A9427105j81838j4322m72861l76083p86408P9719n79953m87961K01717j015959
$$ 19427105 19245267 19230945 18758084 18382001 17595593 17675312 17095359 16607398 16809115 15793156
14165A5793156K42628m56739k86870m21606j12736q6050k24933n23520l27087
$$ 15793156 16035784 15579045 15292175 14870569 14757833 14671783 14446850 13923330 13596243
14156A3596243K9075k40895l34152k26916j43672l9938l66872m43067j4860l66462
$$ 13596243 13625318 13384423 13050271 12823355 12679683 12639745 12272873 11829806 11814946 11448484
14146A1448484J0765k82754j06989L44344n17329l47550m6174m20474K32414q8131
$$ 11448484 11459249 11176495 11069506 11413850 10896521 10548971 10502797 10082323 10314737 10226606
14136A0226606m88824o1368j12236p3639M3056m67825J46311k16491k00838j60000
$$ 10226606 9737782 9676414 9564178 9490539 9533595 9065770 9212081 8995590 8794752 8634752
14126H634752j90571J61101m71306p030l8333j12791J11300j67314k16975N4308
$$ 8634752 8444181 8605282 8133976 8126946 8088613 7975822 8087122 7919808 7702833 7757141
14116G757141m25495p6278Q6306k7557k6422m81628O4220N4924m96669R4914L23151
$$ 7757141 7331646 7255368 7341674 7314117 7287695 6806067 6870287 6925211 6428542 6523456 6846607
14105F846607l05788J17184l15842K08106l74882j72531K87908l55082k79552
$$ 6846607 6540819 6658003 6342161 6550267 6175385 6002854 6290762 5935680 5656128
14096E656128J3704J71853q3868q2429j52425J62424R0882n00197j51082L44925
$$ 5656128 5669832 5841685 5757817 5675388 5522963 5685387 5776269 5276072 5124990 5469915
14086E469915j99657m8684J53970j71308l82456M13446l64748r6043M1264J00180
$$ 5469915 5270258 5221574 5375544 5204236 4821780 5235226 4870478 4774435 4815699 4915879
14076D915879m13586P542J19983k30089K7464q8304O1635m66544N11268p1140
$$ 4915879 4502293 4509835 4629818 4399729 4427193 4338889 4400524 3933980 4445248 4374108
14066D374108k94554K8610j04006J07532L27133l50498k43443j13746K11819M28570
$$ 4374108 4079554 4108164 4004158 4111690 4438823 4088325 3844882 3731136 3942955 4371525
14056D371525l88261p5299j23035o3359q4368J9515o3589K51105k98455J25562
$$ 4371525 3983264 3907965 3784930 3721571 3637203 3656718 3593129 3844234 3545779 3671341
14046C671341l96885K01843K05906k49232M1762J90168m39720k1400J56434K5216
$$ 3671341 3274456 3476299 3682205 3432973 3474735 3664903 3225183 3203783 3360217 3385433
14036C385433m25883K00376l1998K62893k7729n27233N71240L8621o2684o59180
$$ 3385433 2959550 3159926 3127928 3390821 3363092 2835859 3407099 3445720 3383036 2723856
14026B723856J83977N0632Q1445m9221k16190o8429l53657P08699n74394Q2334
$$ 2723856 2907833 2958465 3039910 2990689 2774499 2706070 2352413 3061112 2486718 2569052
14016B569052o515J94532j34919j26863n0753K06494k25291m9539R2807J07277
$$ 2569052 2562537 2757069 2622150 2495287 2444534 2651028 2425737 2376198 2469005 2576282
14006B576282p4695k07924l183m33105K53361j77231R4758j54422O55288m11252
$$ 2576282 2501587 2293663 2290480 1857375 2110736 1933505 2028263 1873841 2529129 2117877
13996B117877j3286k04892p8693J04598K95221j63897K13545J014372K586801
$$ 2117877 2104591 1899699 1821006 1925604 2220825 2056928 2270473 3284845 5871646
13987E871646O571285J7062811J6993173k0385393j1566295m959037k188693j592509
$$ 5871646 12442931 29505742 46498915 26113522 14547227 9588190 7399497 5806988
13979E806988j003455o52169o39239J00268o99818J97164k11124j79432r6939
$$ 5806988 4803533 4151364 3512125 3612393 2912575 3109739 2898615 2719183 2622244
13970B622244k60591M64990l07433k88126P4915N8869l4320J1877p3577J94552
$$ 2622244 2361653 2826643 2519210 2231084 2305999 2364868 2330548 2342425 2268848 2463400
13960B463400m87019K45125j15067K56149l72220J66755j17689j33780K56475
$$ 2463400 1976381 2221506 2106439 2362588 1990368 2157123 2039434 1905654 2162129
13951B162129j25117j50160J99424q6977r7447l7372j42500q1993K77387j46158
$$ 2162129 2037012 1886852 2086276 1999299 1901852 1864480 1721980 1639987 1917374 1771216
13941A771216K42650n41550K86999J94195m92911K92078k1195R6794n4718k18175
$$ 1771216 2013866 1472316 1759315 1953510 1460599 1752677 1731482 1828276 1773558 1555383
13931A555383Q0660j62217J75180J39006k31341N1728k68492L24590J5931r2769
$$ 1555383 1636043 1473826 1649006 1788012 1556671 1608399 1339907 1664497 1680428 1587659
13921A587659O0089m58186M16401k10589L00074l6356j66353j97147q2928M92932
$$ 1587659 1647748 1189562 1605963 1395374 1695448 1659092 1492739 1295592 1212664 1705596
13911A705596j53523j08778K62975k48454L3169N1701m25251M55729l24m7825
$$ 1705596 1552073 1443295 1706270 1457816 1490985 1542686 1117435 1573164 1572840 1525015
13901A525015J12301l38260K57732n3792L534l86161M26573j20078j63601J3272
$$ 1525015 1637316 1299056 1556788 1502996 1506530 1120369 1546942 1426864 1263263 1276535
13891A276535J23701K85N6868l91486M62023l43211L22130j64542p8037j9468
$$ 1276535 1400236 1400521 1457389 1065903 1527926 1184715 1506845 1342303 1264266 1244798
13881A244798J09496j40344L05183l72666K32213j21563J05889k54423j30583
$$ 1244798 1354294 1213950 1519133 1146467 1378680 1257117 1363006 1108583 978000
13872I78000J40072L12017n12829M64974l48024K67944k15366K37642j18906M62408
$$ 978000 1118072 1430089 917260 1382234 1034210 1302154 1086788 1324430 1205524 1667932
13862A667932o01099j36899R0383k8518P8583K08375j21131l31004J97283L4383
$$ 1667932 1066833 929934 1020317 991799 1070382 1278757 1157626 826622 1023905 1058288
13852A058288j50524l3888j86663L06774J89359r6293j36380j15346L85620L95
$$ 1058288 907764 873876 687213 993987 1183346 1087053 950673 835327 1220947 1221342
13842A221342l19509J10089M9718r8065J04317k6531j6598j81947m4021K42937
$$ 1221342 901833 1011922 1061640 963575 1067892 1041361 1024763 842816 798795 1041732
13832A041732l13415J97707N868j09159k00702n8114j2052J57842N37368k50211
$$ 1041732 728317 926024 931892 822733 622031 563917 551865 709707 1247075 996864
13822I96864o0991j12238K20375l23342q6008L42255j38274J68522Q9245M035
$$ 996864 935873 823635 1044010 720668 634660 976915 838641 1007163 1096408 1100443
13812A100443j27385r6005K72753m98410L94034k44995O1122j25168K74413k10292
$$ 1100443 973058 877053 1149806 651396 1045430 800435 861557 736389 1010802 800510
13802H00510L60227E29524K05914R5234L45893m16590K18483C88683M94512J21816
$$ 800510 1160737 529524 735438 830672 1176565 759975 978458 388683 883195 1005011
13792A005011P1050k83964k33235J61271R9283j2061K66533L2649l12640P0144
$$ 1005011 1076061 792097 558862 720133 819416 807355 1073888 1106537 793897 864041
13782H64041l66188N20179j5351k47831L95424n28850M91997m37259K95121l67251
$$ 864041 497853 1018032 1002681 754850 1150274 621424 1113421 676162 971283 604032
13772F04032K66624l08865P5142j38180J69942r1861K20075k30415q613J2284
$$ 604032 870656 561791 636933 498753 668695 576834 796909 566494 557881 570165
13762E70165R4316o7001J75870J52749j51294j56655M57275l25964j33474J04861
$$ 570165 664481 597480 773350 926099 774805 618150 1075425 749461 615987 720848
13752G20848r2983r4967J77320P1459k08502M19745D19807J59530J18968K66571
$$ 720848 627865 532898 710218 781677 573175 992920 419807 579337 698305 964876
13742I64876m78604B00679M92576o4781B47547N02294K5864j25275A51068M60542
$$ 964876 486272 200679 693255 628474 247547 749841 775705 650430 151068 611610
13732F11610K11912C15959L69717r6039J74619l29880K70045p3596q1437J66955
$$ 611610 823522 315959 685676 589637 764256 434376 704421 630825 549388 716343
13722G16343C09616L08959R1805A69151M78275N994k67822N8886K00980J93173
$$ 716343 309616 618575 710380 169151 647426 653420 385598 444484 645464 838637
13712H38637k71651K01768k95611j2610K08981q885l19373K65730k34611K00815
$$ 838637 566986 768754 473143 460533 669514 660629 341256 606986 372375 573190
13702E73190K39032B52662L46184N9215l24078l4406M40135j52175j89444P4514
$$ 573190 812222 252662 598846 658061 333983 299577 739712 587537 398093 472607
13692D72607j41578N77723l94238B19601L89810l6841j48190K08502L4372k28070
$$ 472607 331029 908752 514514 219601 609411 572570 424380 632882 667254 439184
13682D39184M8352K79221j50142B78332L12359k03905J78450k74221J67788L75042
$$ 439184 487536 766757 616615 278332 590691 386786 565236 291015 458803 833845
13672H33845k58086j96662R1173Q5568k39744k1208K25722p6480r9717L03578
$$ 833845 575759 379097 470270 555838 316094 294886 520608 444128 344411 647989
13662F47989J81403A41470O65965l87086L72198l48873L96903C44780K01437J99728
$$ 647989 829392 141470 807435 420349 792547 443674 840577 344780 546217 745945
13652G45945B14688K87966j20843A84097K53691Q4819J06520k57399M7749K3757
$$ 745945 214688 502654 381811 184097 437788 522607 629127 371728 419477 443234
13642D43234M283n9310M06156C41574K62322r7185K95027B49535Q3962L07481
$$ 443234 447517 388207 794363 341574 603896 506711 801738 249535 333497 640978
13632F40978j76949A10631J62740L06435j57076A14710K12181m4026j16632M17004
$$ 640978 464029 110631 273371 579806 422730 114710 326891 282865 166233 583237
13622E83237J29101k43738j66344F1582K48752A33710Q1888K12904P240r093O7251
$$ 583237 712338 468600 302256 61582 310334 133710 215598 428502 435742 426649 493900
13611D93900d8632D49582j78868O51K44971R0210k11129j48362M98294A60703
$$ 493900 -48632 449582 270714 271365 516336 606546 395417 247055 745349 160703
13600B80523J30783o8465I5379K29311K62677A85984K28836N595A32268K70305
$$ 280523 411306 342841 95379 324690 587367 185984 414820 420415 132268 402573
13590D02573l2518L37434j62792B9738K03746j01483J31647K75204j52650j26289
$$ 402573 370055 707489 544697 29738 233484 132001 263648 538852 386202 259913
13580B59913G8581O5053p20K47836r9112R4815J21309O4881g7009E33521B19826
$$ 259913 78581 143634 142914 390750 291638 386453 507762 572643 -77009 533521 219826
13568B15300J91820o298k1958F9565J31556a8665C91755F2581L05502P321j8952
$$ 215300 407120 400822 378864 69565 201121 -18665 391755 62581 368083 375404 356452
13557C56452J14426B30192A1812L40903K55609k43209j15327K62575j02602k806
$$ 356452 470878 230192 11812 352715 608324 365115 249788 512363 409761 406955
13547D06955j49902J68501A27597L19874a32212D99435k36765r7474K21115l8476
$$ 406955 257053 425554 127597 447471 -132212 499435 262670 165196 386311 347835
13537C47835o4566K07749j80282h625B72976A13700N12744A17819D7284L87055
$$ 347835 283269 491018 310736 -8625 272976 113700 626444 117819 47284 434339
13527D34339j56009m3806q3614l9871M72491A50333J29730j28710J86320j05993
$$ 434339 278330 234524 150910 111039 583530 150333 280063 151353 337673 231680
13517B31680K33877r5864j08725K93620C5956M36987J7728q4208K12678F935R4779
$$ 231680 465557 369693 260968 554588 35956 472943 490671 406463 619141 6935 101714
13506A01714J39735A04663K02663a4957E56208A59403N592K3907m2509K78918
$$ 101714 241449 104663 307326 -14957 556208 159403 164995 188902 146393 425311
13496D25311J29971J10877B39178J26014B2787K63427l5074K1640O6355j29980
$$ 425311 555282 666159 239178 365192 22787 286214 251140 272780 339135 209155
13486B09155L2824A17913C2939M7195J28837q9978J16111O100K32808A98581Q7293
$$ 209155 241979 117913 32939 80134 208971 118993 235104 241204 474012 198581 285874
13475B85874H4277K61018k2764O8117p0635E9314O6859C5459K65590p3990K3058
$$ 285874 84277 345295 322531 390648 320013 59314 126173 35459 301049 227059 250117
13464B50117J14483o6242d2249B16085C8298R9102K42192A40095J81889m8778
$$ 250117 364600 298358 -42249 216085 38298 137400 379592 140095 321984 273206
13454B73206A6323M75648j00882j33676c4071C09715J14239j83649P356N65K24962
$$ 273206 16323 491971 391089 257413 -34071 309715 423954 240305 247661 248226 473188
13443D73188k19448J05853l7751j15104m033E5793K34779b20665B72885j9614
$$ 473188 253740 359593 321842 206738 202705 55793 290572 -220665 272885 253271
13433B53271H3752J05858P8579J04984j30167A14081J59260R1128j80351i9289
$$ 253271 83752 189610 268189 373173 243006 114081 273341 364469 184118 -99289
13422F30094g2919D46348E9142L02639A08277e8716D04864q2791j06963M9634
$$ 630094 -72919 446348 59142 361781 108277 -58716 404864 322073 215110 264744
13412B64744B4786J52707L28747B1638J65003m1653M6056H4578K82045C5275J00424
$$ 264744 24786 177493 506240 21638 186641 144988 191044 84578 366623 35275 135699
13401A35699J73366A32654K9650k0418J24320Q4886A1556N62985B70692O6334
$$ 135699 309065 132654 162304 141886 266206 351092 11556 574541 270692 337026
13391C37026a18307B08585n8068L5828J09566j3900J42980A75501J36871D5073
$$ 337026 -118307 208585 150517 186345 295911 282011 424991 175501 312372 45073
13380A95896m6515J1358J71509E7479a6048E0731K10851G611J17010J99796J53513
$$ 195896 149381 160739 332248 57479 -16048 50731 261582 7611 124621 324417 477930
13369D77930j82440b5247C10374E6091M7857L49632b7102A42421N2553q7155K15098
$$ 477930 295490 -25247 310374 56091 103948 453580 -27102 142421 194974 107819 322917
13358C22917R7383I9119R3443j226m1589M51868F1212K72536L2529j57496J14239
$$ 322917 420300 99119 192562 191336 149747 601615 61212 333748 366277 208781 323020
13347C23020Q744j19045K84924j19538l0144o9358P0935E2461M42531j67086q2637
$$ 323020 331764 212719 497643 378105 347961 278603 349538 52461 494992 327906 245269
13336B45269k8817A08093L62748a47030G56918k79112m8139j75132A24734m0344
$$ 245269 216452 108093 470841 -147030 756918 477806 429667 254535 124734 84390
13326H4390J80319J83665j93965J45435j75975J18517A09766O7192J25918K33265
$$ 84390 264709 448374 254409 399844 223869 342386 109766 176958 302876 536141
13316E36141j02666A39137K38543m732A83845q1043g6558B50666e7204A29377
$$ 536141 433475 139137 377680 372948 183845 102802 -76558 250666 -57204 129377
13305D5773K34229E7698J74908J09795a0638B79866A17352J88020L0383A27890
$$ 45773 280002 57698 232606 342401 -10638 279866 117352 305372 335755 127890
13294B31439b02835A27112J33895C07K07617J86885j81167G348J87818M5330R0528
$$ 231439 -202835 127112 261007 307 207924 394809 213642 7348 195166 240496 331024
13283C31024A32379K32671i2285C8230K52564B6871b6793A60979K00164F3875
$$ 331024 132379 365050 -92285 38230 290794 26871 -26793 160979 361143 63875
13272b34782A6001J43779M23263a97317E9181a01143B8586P8290O3456C0000K29296
$$ -234782 16001 159780 583043 -197317 59181 -101143 28586 106876 170332 30000 259296
13261B59296o3344i6807B06110c0066M096o7634E73945F3326F238K70794j07914
$$ 259296 195952 -96807 206110 -30066 -25970 -93604 573945 63326 6238 277032 169118
13250A69118J47738j21994a83732H8018A2301R3899J4784f6163G016g6096I0520
$$ 169118 316856 194862 -183732 88018 12301 106200 120984 -66163 7016 -76096 90520
13238A60026a68392E6928R1169j7272J13152i951j11350A47050K44432B4839a14588
$$ 160026 -168392 56928 148097 130825 243977 -9951 -121301 147050 391482 24839 -114588
13226B12337h203A23520l0704J7454J34122J27444r4751a59796B26141K6670h9175
$$ 212337 -8203 123520 92816 110270 244392 371836 277085 -159796 226141 252811 -89175
13214A71501J09249J49458B10637a05439a8924A12187J36447J37483A11184L8352
$$ 171501 280750 430208 210637 -105439 -18924 112187 248634 386117 111184 149536
13204A49536m4454R5602N5425m6041H0656L00039a6239p5063C51561b15133H6628
$$ 149536 105082 200684 256109 210068 80656 380695 -16239 -91302 351561 -215133 86628
13192a04141j7611C85190A10763D9362K56307j18247K12209j82143j07B7293a63004
$$ -104141 -121752 385190 110763 49362 305669 187422 399631 217488 217381 27293 -163004
13180H3168K64293e9674r3392C21458b89149A59261a02217j41732a5669A58959
$$ 83168 347461 -59674 -153066 321458 -289149 159261 -102217 -243949 -15669 158959
13169b86921g076A53812J81058A02767j2102L853R0977a11353J3019C46483A53649
$$ -286921 -7076 153812 334870 102767 90665 94518 185495 -111353 -98334 346483 153649
13157G2899J32816e5041F5846J82999b9957A36825J35794n2502F2686k8656H271
$$ 72899 205715 -55041 65846 248845 -29957 136825 272619 220117 62686 34030 8271
13145H479K74457H6577N701g1110A01381a7253k00184A53296R6579c14631E0010
$$ 8479 282936 86577 92278 -71110 101381 -17253 -217437 153296 249875 -314631 50010
13133F0836J73307J46998A55160g0459a8254k05176d0020m4050A55653d9222I9000
$$ 60836 234143 381141 155160 -70459 -18254 -223430 -40020 -84070 155653 -49222 99000
13121B42538H4127L63800j24068l1756J67044a95181B14056D6135K00254d701
$$ 242538 84127 447927 323859 292103 459147 -195181 214056 46135 246389 -4701
13110b9897A36945F3949a1371L617A38129J10092j9751k2077e894A24740R1937
$$ -29897 136945 63949 -11371 -7754 138129 248221 228470 206393 -5894 124740 216677
13099B16677E619b56495F9672J43133J5683b50732B57864i3792p6975G0347R491
$$ 216677 5619 -256495 69672 212805 228488 -250732 257864 -93792 -170767 70347 79838
13088G9838J73717H828K00491n1736J36546h4635D8999a05663M4986C45644E8727
$$ 79838 253555 8828 209319 157583 294129 -84635 48999 -105663 -60677 345644 58727
13076E8390K2023d078B06029k0718c2792r7223J8148k3782B48933i7035B64287
$$ 58390 80413 -4078 206029 185311 -32792 -130015 -111867 -135649 248933 -97035 264287
13064B21718b2556A92873J30109a30089a2406D09881c22371J36276a0666A15327
$$ 221718 -22556 192873 322982 -130089 -12406 409881 -322371 -186095 -10666 115327
13053I9750R9964J30018A60318G3793J86434l4386d2179r1493L9759A60057B768
$$ 99750 199714 329732 160318 73793 260227 225841 -42179 -133672 -93913 160057 2768
13041b55933Q0859A9926J00357D1738k0267f6246A81339b0081r5632I6912K46340
$$ -255933 -175074 19926 120283 41738 21471 -66246 181339 -20081 -115713 96912 343252
13030C43252A4730a44381O9621A76178J55258K651E2170R1863b29864A86901K41683
$$ 343252 14730 -144381 -74760 176178 331436 334087 52170 144033 -229864 186901 428584
13019D28584j57277a23195j73700D16759B0533c58817D1689J06697N3040r7031
$$ 428584 271307 -123195 -296895 416759 20533 -358817 41689 148386 201426 104395
13009A04395K9896i1140A59134b48312G6634c0915A94128m6300K51566A77739
$$ 104395 134291 -91140 159134 -248312 76634 -30915 194128 147828 399394 177739
12998a65583a9434B00119q2603Q2414l2843c3347A61645o4762B5170J4092a40555
$$ -165583 -19434 200119 117516 199930 167087 -33347 161645 96883 25170 39262 -140555
12986A29956c70937B1784J77033m8480b39096A02530a26829C66722E0303c8141
$$ 129956 -370937 21784 198817 150337 -239096 102530 -126829 366722 50303 -38141
12975f5423B89616i8017C6099a31202A2196J51730D0269a85988G463a59119E4848
$$ -65423 289616 -98017 36099 -131202 12196 163926 40269 -185988 7463 -159119 54848
12963a4068q5855A87050j5224H2649K05148g7734C0233j1994a68826B4469M88509
$$ -14068 -99923 187050 171826 82649 287797 -77734 30233 18239 -168826 24469 512978
12952E12978C6632r553a02581a9799c064E1531b07982D7808M2196N9562K1766
$$ 512978 36632 27079 -102581 -19799 -3064 51531 -207982 47808 90004 149566 171332
12941A71332K5561J6770G7843j1665Q2061a8945j38141A27514A7302a71958L1925
$$ 171332 196893 213663 77843 66178 148239 -18945 -157086 127514 17302 -171958 -140033
12930a40033c1679A70227a31581G7772J79883A19162a89032E0782A3771J27913
$$ -140033 -31679 170227 -131581 77772 257655 119162 -189032 50782 13771 141684
12920A41684j0415N35594C22603A35461C7902J0240K10769r9542p1761a34294
$$ 141684 131269 666863 322603 135461 37902 48142 258911 159369 87608 -134294
12909B64285A18238B4850L75357A32334b18554D14421j99474q3788a4422B18091
$$ 264285 118238 24850 400207 132334 -218554 414421 214947 131159 -14422 218091
12898B49913b05896G8264h922H1273J07264k844Q1441G8960a09574A04732b7442
$$ 249913 -205896 78264 -8922 81273 188537 185693 267134 78960 -109574 104732 -27442
12886D35960q9623j47847E2144k1209J63978a59206j7477f7769j89994c2352G0961
$$ 435960 346337 198490 52144 30935 194913 -159206 -176683 -67769 -257763 -32352 70961
12874b07679A58133G2273K0260a42117M8172B47610I9563j2882h4202j7784A38928
$$ -207679 158133 72273 92533 -142117 -93945 247610 99563 86681 -84202 -101986 138928
12862A85694b25769c6222D1036d6069B19542a10028q933G1576j5577c57051A12270
$$ 185694 -225769 -36222 41036 -46069 219542 -110028 -118961 71576 55999 -357051 112270
12850a98452g1167p9089d9806A16324c7348l1425B43732r2780i6244A13262m8961
$$ -198452 -71167 -150256 -49806 116324 -37348 -68773 243732 150952 -96244 113262 64301
12839F4301A4033a61523c540B66272p7028H9258J1563O843L8206O0408i1844N288
$$ 64301 14033 -161523 -3540 266272 189244 89258 100821 107664 145870 206278 -91844 -86556
12827h6556k1121o3671C630h5747A86265J65547b12286A15500n6684N3905K23895
$$ -86556 -107677 -171348 3630 -85747 186265 351812 -212286 115500 58816 112721 336616
12816C36616b21937G452b09017D7648j9843a66220J5238A40656A7507f4919j64474
$$ 336616 -221937 7452 -209017 47648 27805 -166220 -150982 140656 17507 -64919 -229393
12805b29393G1892g0151B41077C6181N4477K27495Q2363E3547a0121r5770F6565
$$ -229393 71892 -70151 241077 36181 90658 318153 400516 53547 -10121 -105891 66565
12793a36341E4842N2193A5508M8567M1977i0055A7917a99684D0018J63025g4042
$$ -136341 54842 107035 15508 64075 106052 -90055 17917 -199684 40018 203043 -74042
12781B92540b96173Q4296j11889A14026C7163a7094l247B85204f8497G973P6680
$$ 292540 -296173 -211877 -323766 114026 37163 -17094 -20341 285204 -68497 7973 84653
12770H4653g6688l6128R980B74097A32122n2790L08211A05041a367j76012A11001
$$ 84653 -76688 -112816 -102836 274097 132122 79332 387543 105041 -1367 -177379 111001
12758A13599J49086g8273A69178l0901L5756c0906I8754g260j93024g3046G5764
$$ 113599 262685 -78273 169178 138277 174033 -30906 98754 -7260 -200284 -73046 75764
12746A66620o9824b91186B35618c95147C9150d1441B8063N696J00422L3272p0345
$$ 166620 96796 -291186 235618 -395147 39150 -41441 28063 33759 134181 167453 97108
12735I7108j3354M73B8317C499M1190j0095K6450B4498c5440j47622O0486B21448
$$ 97108 83754 84227 28317 3499 44689 34594 61044 24498 -35440 -183062 -122576 221448
12722f0608j0630F1250d27798A16947h691J314C1415K461R8548J39746i0899L0757
$$ -60608 -71238 61250 -427798 116947 -8691 -7377 31415 33876 132424 272170 -90899 -60142
12710f0142G6970J32037O2707F1941i2643r4092c7627A25733K28173C8743c2628
$$ -60142 76970 209007 271714 61941 -92643 -186735 -37627 125733 353906 38743 -32628
12698B57025j1257J55104J18971G5132N0314m5197J7993e026E5857N9988D286
$$ 257025 245768 400872 519843 75132 125446 80249 98242 -5026 55857 115845 4286
12686f8715a3095k41031B21895G5628b20993C8355J64844a54798C95431b37744
$$ -68715 -13095 -254126 221895 75628 -220993 38355 203199 -154798 395431 -237744
12675A68050c8491A01544O2129C3070J73252R3621A44420j6628m9849o829a18342
$$ 168050 -38491 101544 163673 33070 206322 299943 144420 127792 77943 71114 -118342
12663A08549M04688A985J17567C9956N2059K59921A20643O3075J21616H0440P2283
$$ 108549 513237 1985 119552 39956 92015 351936 120643 183718 305334 80440 152723
12652A52723b56521A99597d9022l2663L088l2107B27486m7392a29603A48601N7228
$$ 152723 -256521 199597 -49022 -81685 -78597 -110704 227486 180094 -129603 148601 205829
12641B05829a81601e9649K028q8924B06415H7315b60267J20020A30529a14600
$$ 205829 -181601 -59649 -57621 -146545 206415 87315 -260267 -140247 130529 -114600
12630D14411j10402J22272d750l2886l5859b3038A48L56193F9636a67239A89839
$$ 414411 304009 426281 -4750 -37636 -73495 -23038 148 356341 69636 -167239 189839
12618a71026f9818k7162C7024J23097a12917j06658h1381l5096A77098b9449K757
$$ -171026 -69818 -96980 37024 160121 -112917 -219575 -81381 -116477 177098 -29449 -26692
12607b6692j10510e9787F5003f6820J7377A44302h7823K3033A54530b59858M1895
$$ -26692 -137202 -59787 65003 -66820 -49443 144302 -87823 -64790 154530 -259858 -217963
12596b17963E7084J1829J99221I2804C0159A4946K9935B0895J40532N976k1586
$$ -217963 57084 68913 268134 92804 30159 14946 44881 20895 161427 167403 145817
12585A45817D9899J23147n2061R7356a05073A24272P305b02935I8416B9478J8738
$$ 145817 49899 173046 120985 218341 -105073 124272 131577 -202935 98416 29478 48216
12574D8216J18551j1796C9137a33361d7460j0681k48182A96194b92911a6815q8542
$$ 48216 166767 154971 39137 -133361 -47460 -58141 -306323 196194 -292911 -16815 -105357
12563a05357A53942J58572a48777D1851c14811A21400a15110A00967a83890c8492
$$ -105357 153942 312514 -148777 41851 -314811 121400 -115110 100967 -183890 -38492
12552E55489f8544A05333O0345d2478G4502J88806a85803B91009n0796j01270
$$ 555489 -68544 105333 165678 -42478 74502 263308 -185803 291009 240213 138943
12542A38943J43883c16156J37876A26550C3856J1476b7999p1027o4594B36818
$$ 138943 282826 -316156 -178280 126550 33856 45332 -27999 -99026 -163620 236818
12531A00448J95066j20056a3649E7410C574N30043h89k0318q5549L4229A38051
$$ 100448 295514 175458 -13649 57410 3574 533617 -889 -21207 -106756 -72527 138051
12519d5063A52683k8527Q4087b37320A54677o4423M22181A53282f8001a1459A93213
$$ -45063 152683 124156 208243 -237320 154677 90254 512435 153282 -68001 -11459 193213
12507A34049e20591i0186n8266k73879A31556g3676b1404A53838a56650I6012
$$ 134049 -520591 -90186 -148452 -422331 131556 -73676 -21404 153838 -156650 96012
12496H2985b9698o3692j68167M8070B35142F7748O7856d3031j0168C96593i8374
$$ 82985 -29698 -93390 -261557 -213487 235142 67748 135604 -43031 -53199 396593 -98374
12484d1638H7371F61c62404j56431G9304K33748G3510J12643E2822j759b54811
$$ -41638 87371 661 -362404 -518835 79304 313052 73510 186153 52822 51063 -254811
12472a10020p4091C84284F0657K13413j17760D0607b32843B1550a18832G9842
$$ -110020 -184111 384284 60657 274070 156310 40607 -232843 21550 -118832 79842
12461a30568C07581F1615P0633a12777p1509A14475a07263b234k92612l8228G2237
$$ -130568 307581 61615 132248 -112777 -184286 114475 -107263 -2234 -294846 -333074 72237
12449a66205r3380H8807l3513Q151N9193F160L17885D1976a08058p1760N4376
$$ -166205 -259585 88807 55294 63445 122638 6160 324045 41976 -108058 -179818 -125442
12438a25442b2270A53774b47780A76951d31149a20415A86105p7448i2271A43036
$$ -125442 -22270 153774 -247780 176951 -431149 -120415 186105 108657 -92271 143036
12427B15742q4426j522d8156o3408B75457k5942c2238A4918c86244B00293c3834
$$ 215742 131316 129794 -48156 -111564 275457 249515 -32238 14918 -386244 200293 -33834
12415a44158C7035J84358a19609F2241O5922b0424G2424c716l76840a8458D945
$$ -144158 37035 221393 -119609 62241 128163 -20424 72424 -3716 -380556 -18458 4945
12403a45902l2516A5839O9970b87562h0097l41045D32707G63b45309b4623p5866
$$ -145902 -178418 15839 85809 -287562 -80097 -421142 432707 763 -245309 -24623 -100489
12392a00489j64500J7140A03001J55135C5788R2806A7255a04991a8705A4241i7236
$$ -100489 -264989 -247849 103001 258136 35788 128594 17255 -104991 -18705 14241 -97236
12380b23342A50803N482L0083a66010j67458I6035a54825L0650A14246c00462
$$ -223342 150803 156285 186368 -166010 -333468 96035 -154825 -124175 114246 -300462
12369d6722A18772a6137A71092h6625b5234Q6l20466B5927b04471N1184j73179
$$ -46722 118772 -16137 171092 -86625 -25234 -25148 -345614 25927 -204471 -153287 -326466
12358c26466a61944B82114A13250D2087N4049j6790A0714a06313F8176K87559
$$ -326466 -161944 282114 113250 42087 96136 79346 10714 -106313 68176 355735
12348C55735E3368a6109H1495k3629c7427L533O925j46542H4973j3389A5275J25401
$$ 355735 53368 -16109 81495 57866 -37427 -33894 -26969 -173511 84973 71584 15275 140676
12336A40676a61848m5092d2503B13829p3278e8356D13727A05790K40068f6233
$$ 140676 -161848 -206940 -42503 213829 140551 -58356 413727 105790 345858 -66233
12325B34564E9065J91940f2200E20599A12140D9956A1095J52562M7265q2238J20124
$$ 234564 59065 251005 -62200 520599 112140 49956 11095 163657 210922 128684 248808
12314B48808i2558p6998C1936J77253A2066f5356r6743n2b1974B3629c34592A42618
$$ 248808 -92558 -169556 31936 209189 12066 -65356 -162099 -162151 -21974 23629 -334592 142618
12301h9631m3723A39104D5943P6613n5195k2771d24478C7225a56934A48055Q8800
$$ -89631 -133354 139104 45943 122556 67361 44590 -424478 37225 -156934 148055 236855
12290B36855A07346C1742L9261j9791f7344r2028k23948J63570C1254P3798J56292
$$ 236855 107346 31742 71003 51212 -67344 -159372 -383320 -219750 31254 105052 261344
12279B61344K43033F4269L26664B2831K79736A44757J39074E6670h7477j52233
$$ 261344 504377 64269 390933 22831 302567 144757 283831 56670 -87477 -239710
12269b39710e211F8157b6540H3040a29128B97234j46231a15215B39676l0502c8090
$$ -239710 -5211 68157 -26540 83040 -129128 297234 151003 -115215 239676 209174 -38090
12257C11552j43572b86728i5246C23120j08657F1491J2877a87359e6021A79904
$$ 311552 167980 -286728 -95246 323120 214463 61491 74368 -187359 -56021 179904
12246D20564e3363A19548d6808B1776L58191a49151A5793L34258j07217A14635
$$ 420564 -53363 119548 -46808 21776 379967 -149151 15793 350051 242834 114635
12235A67964b4380D1703f9845A55084J47508j30586i0760n5955A51243J42271
$$ 167964 -24380 41703 -69845 155084 302592 172006 -90760 -146715 151243 293514
12225B93514r2979l3974d013B06800m4567E2278J11217F6451J24613O4549b01470
$$ 293514 200535 166561 -4013 206800 162233 52278 163495 66451 191064 255613 -201470
12213A06908J89822a30169A51037C0224N61889f091k3101B55891f758B76775J5934
$$ 106908 296730 -130169 151037 30224 592113 -6091 -29192 255891 -6758 276775 292709
12202B92709A00872C3300K73053q0948J43751D0070J50205A169K68627k6592M5708
$$ 292709 100872 33300 306353 225405 369156 40070 190275 1169 269796 243204 288912
12191B88912K1095p5421L9014a20822A50347c6608j1522A29867J65605f9644B74826
$$ 288912 310007 234586 273600 -120822 150347 -36608 -48130 129867 295472 -69644 274826
12179A28623l122E6556Q0648a12119C9671P5838M4674a80378M0622a0696j36014
$$ 128623 125501 56556 137204 -112119 39671 115509 160183 -180378 -139756 -10696 -146710
12168a46710E1612R1383a89701B52301A20485J22032f9875A51961a75887h7627
$$ -146710 51612 142995 -189701 252301 120485 242517 -69875 151961 -175887 -87627
12157b13160I8599l2005O4142a42432a9978H5617l1551b03011J1823C0078b37247
$$ -213160 98599 66594 130736 -142432 -19978 85617 54066 -203011 -191188 30078 -237247
12145a99740E619K69195d86382C40118d5954j68748c9082C44462A00498a71589
$$ -199740 5619 274814 -486382 340118 -45954 -214702 -39082 344462 100498 -171589
12134B24956I7273R171O6418e6738H1824e3567a760C5112a7438m6171B14327b38697
$$ 224956 97273 106444 172862 -56738 81824 -53567 -1760 35112 -17438 -63609 214327 -238697
12121A45700A7535J9483h935j62220b1343A2143k496K65589A04591g399I8578
$$ 145700 17535 37018 -8935 -171155 -21343 12143 9647 275236 104591 -7399 98578
12109B08932e6943o1984L5333B6804K1753K8051a04933B30714b86020A18599J9497
$$ 208932 -56943 -118927 -83594 26804 48557 76608 -104933 230714 -286020 118599 138096
12098A38096A8471a60347M696F7028a17545C765R1611O2399N3378p7491a79534
$$ 138096 18471 -160347 -155651 67028 -117545 3765 95376 157775 211153 133662 -179534
12086a3205A42755f4378j29121A23737c5733E9511b23300A102b49564B03282b52300
$$ -13205 142755 -64378 -193499 123737 -35733 59511 -223300 1102 -249564 203282 -252300
12074A33275f3563j09610I7839J32748J01672J45812N02408J543870I60425k94678
$$ 133275 -63563 -173173 97839 230587 332259 478071 980479 2524349 960425 665747
12064F65747D484M22522D3229N9155a03808I4195c13437B1354K53281l9757O3737
$$ 665747 4484 427006 43229 102384 -103808 94195 -313437 21354 274635 234878 298615
12053B98615e2156r895B30610D5716J19241l3071M9982a93048B42546n3804B2857
$$ 298615 -52156 -62051 230610 45716 164957 131886 181868 -193048 242546 188742 22857
12041c02419C78260b35840B28697F0023a00727j015B35819a97781B62048c3175
$$ -302419 378260 -235840 228697 60023 -100727 -101742 235819 -197781 262048 -33175
12030A88183b28659i1654k9161B09238a8719H8152R3312l0427l8224J08233G6828
$$ 188183 -228659 -91654 -120815 209238 -18719 88152 181464 151037 112813 221046 76828
12018A27542B4302a71761A51900k1831B2243J41146p8454e06k24409K2106R0201
$$ 127542 24302 -171761 151900 130069 22243 163389 84935 -506 -224915 -202809 -112608
12007a12608q0619R5589I2428J24967H7406d9355A0814J68396h9325j56800k5161
$$ -112608 -193227 -97638 92428 217395 87406 -49355 10814 179210 -89325 -246125 -271286
11996b71286J20461b0696C86407c5177A63391a26656K7346L6613B8286K14029
$$ -271286 -150825 -20696 386407 -35177 163391 -126656 -99310 -62697 28286 242315
11986B42315A18291c53659G992f8434C47230H8241b63242c1817B8723d4600l2435
$$ 242315 118291 -353659 7992 -68434 347230 88241 -263242 -31817 28723 -44600 -77035
11975g7035A60476p1534L9895a65080A52059k7876h4977j73510G535O6713d1750
$$ -77035 160476 88942 128837 -165080 152059 124183 -84977 -258487 7535 74248 -41750
11963a19100A36212F7987B744a15281a2797k06150G5687a18470m51188F1813a84386
$$ -119100 136212 67987 2744 -115281 -12797 -218947 75687 -118470 -569658 61813 -184386
11951A75519G1549J26747A3049J15614o1444i4843k79744i8857D8469L7969h3376
$$ 175519 71549 198296 13049 128663 67219 -94843 -374587 -98857 48469 86438 -83376
11939c52828e9981A11240m2268b86642h1393J1707j69562d6560m571A89269J4628
$$ -352828 -59981 111240 68972 -286642 -81393 -69686 -239248 -46560 -51131 189269 203897
11928B03897a54700N633A9972i2295D2824K27409j7584a1043C34308F3457J2541
$$ 203897 -154700 -149067 19972 -92295 42824 270233 252649 -11043 334308 63457 75998
11917G5998J4094i5127I1564N5507B8182d546j19629M9204L2078E1342I039K51730
$$ 75998 90092 -95127 91564 147071 28182 -4546 -124175 -74971 -42893 51342 9039 260769
11905B60769A07253J07348r8298a84643A3932K32391c17994A80021a02429c999
$$ 260769 107253 214601 116303 -184643 13932 246323 -317994 180021 -102429 -3999
11894e3206j08012H5542P4043A0119P4848a90184C6469E608J98162d393E0511
$$ -53206 -161218 85542 159585 10119 84967 -190184 36469 5608 203770 -4393 50511
11882g0133J4078B13458a84104k9322E9083L3036a385D3378e95854A22140a47395
$$ -70133 -56055 213458 -184104 -213426 59083 92119 -1385 43378 -595854 122140 -147395
11870F6606d67995B07780q1426m2228c7323j00261A33916b9290k91101F0777j1077
$$ 66606 -467995 207780 126354 84126 -37323 -137584 133916 -29290 -320391 60777 49700
11859D9700R6874K2680a00873M3102E87N3989d13129A22244R9499g4093E1555
$$ 49700 146574 169254 -100873 -57771 587 54576 -413129 122244 221743 -74093 51555
11847A01488b4206R896C177K74991c15752a23584H9671d6933B65847l7064A5130
$$ 101488 -24206 -14310 3177 278168 -315752 -123584 89671 -46933 265847 228783 15130
11835E2633L3074a25344B52422q2200P1966c304E8399J25318J07665a10131C9648
$$ 52633 85707 -125344 252422 170222 242188 -3304 58399 183717 291382 -110131 39648
11823A45167a08363r5116H3254P5812g2396j44780Q8815A29430F2803a29972a6903
$$ 145167 -108363 -203479 83254 159066 -72396 -217176 -128361 129430 62803 -129972 -16903
11811g313A18006H611J6601K751a78028j03785I9619g6795n9984c5513j92839
$$ -7313 118006 8611 25212 27963 -178028 -281813 99619 -76795 -136779 -35513 -228352
11800b28352Q8839B25143b80934G9279i7972k1436q5242B42980o8853l2719L8382
$$ -228352 -139513 225143 -280934 79279 -97972 -119408 -204650 242980 174127 141408 179790
11789A79790b08510D5587J11712a53735d5336C22230p3985B91J12611I188e9504
$$ 179790 -208510 45587 157299 -153735 -45336 322230 248245 291 112902 9188 -59504
11777c1529B90884g7252l2823G7710B6623D227a50709E8705R72d64856J50092
$$ -31529 290884 -77252 -110075 77710 26623 4227 -150709 58705 59677 -464856 -314764
11766c14764L6773B29557I2643a52296d3659B13546a8915j29872m0045A3481i8736
$$ -314764 -277991 229557 92643 -152296 -43659 213546 -18915 -148787 -188832 13481 -98736
11754b98652B79271F7297B467e0675C17436a24975j77825a18990A18821a18398
$$ -298652 279271 67297 2467 -50675 317436 -124975 -302800 -118990 118821 -118398
11743a51337B8568a15704k05551B21940a50082B04947e3285p4730d4746A11800
$$ -151337 28568 -115704 -321255 221940 -150082 204947 -53285 -128015 -44746 111800
11732A64887D3583c4539J153C7544R0594a49930j5577j4791B45263q6538c4951
$$ 164887 43583 -34539 -33386 37544 128138 -149930 -165507 -180298 245263 158725 -34951
11720B52104b12959A53920A7769d77025A76463G927a99437A24409K28139b5441
$$ 252104 -212959 153920 17769 -477025 176463 7927 -199437 124409 352548 -25441
11709A1417K39823E0620a74164j2768F1946a16562K9966j29529C68296E2995a302
$$ 11417 251240 50620 -174164 -186932 61946 -116562 -86596 -216125 368296 52995 -1302
11697B92524k6281b98400i8282j40785e0343C6402b01191k36360A79528L29538
$$ 292524 266243 -298400 -98282 -239067 -50343 36402 -201191 -437551 179528 509066
11687E09066a63423A11339g1086L4464a0339k08366c5034I6543a21236D08922
$$ 509066 -163423 111339 -71086 -36622 -10339 -218705 -35034 96543 -121236 408922
11676d49608a30927A0954c9003A39864e1096A5668L2656a53480q971A61458g8690
$$ -449608 -130927 10954 -39003 139864 -51096 15668 48324 -153480 -162451 161458 -78690
11664a97287B81979a65445a5291B03400O8536b48985C55260c5741B48672d595
$$ -197287 281979 -165445 -15291 203400 271936 -248985 355260 -35741 248672 -4595
11653G6351l835d2458G5266a70453C1973i791E7039Q6546h4820j26331d9824F0158
$$ 76351 72516 -42458 75266 -170453 31973 -9791 57039 143585 -84820 -211151 -49824 60158
11640a15487C07461p3134i7145E0353b69746c507k8125j0540B07539a66639k02215
$$ -115487 307461 234327 -97145 50353 -269746 -3507 -31632 -42172 207539 -166639 -368854
11629c68854A76193e5540j52794j83743A35902r40b15316M2837F4515a27210C9735
$$ -368854 176193 -55540 -208334 -392077 135902 134962 -215316 -172479 64515 -127210 39735
11617b04797E1728b81672N843C0522b39415B4865a66862d7910A41971P9647d3182
$$ -204797 51728 -281672 -275829 30522 -239415 24865 -166862 -47910 141971 221618 -43182
11605a79805L3617B4431K32644a7479I9994L68102F6789A1286b50008A34715n4614
$$ -179805 -146188 24431 257075 -17479 99994 468096 66789 11286 -250008 134715 80101
11594H0101J09253d3238B58933d06622F1554o755B5650J3434K36606e2273C01604
$$ 80101 189354 -43238 258933 -406622 61554 54799 25650 39084 275690 -52273 301604
11582A24506M1959d5986A49381h6451A69467J52201R8477D5312R6678G734i5847
$$ 124506 166465 -45986 149381 -86451 169467 321668 420145 45312 141990 7734 -95847
11570h8611A9289K23033j7317r7179a54475A34700a22883C72537E4286K19298
$$ -88611 19289 242322 225005 127826 -154475 134700 -122883 372537 54286 273584
11560B73584j28167b64421R4429F3392J78740E7958a15936A4078J25309b895B32976
$$ 273584 145417 -264421 -169992 63392 242132 57958 -115936 14078 139387 -2895 232976
11548A62235A5052a02670A45008a0705j03828A19385h3878c0820E479K62398j4367
$$ 162235 15052 -102670 145008 -10705 -114533 119385 -83878 -30820 5479 267877 253510
11537B53510j20532b48866I4964J75324a97877A91581b13353A03820N3832a64577
$$ 253510 132978 -248866 94964 270288 -197877 191581 -213353 103820 157652 -164577
11526A5950J30934J98006P2211a0583A76945q0708N2770g7535J067A94118a9064
$$ 15950 146884 344890 417101 -10583 176945 96237 149007 -77535 -76468 194118 -19064
11514F4571c66810a2292B93165r0021N4223O9536a57392B47785f999k2958C74122
$$ 64571 -366810 -12292 293165 203144 257367 326903 -157392 247785 -6999 -29957 374122
11502D46782C188K00473J57889j54261j7184K5772h5096B67750r580a75890D8794
$$ 446782 3188 203661 361550 207289 190105 215877 -85096 267750 258170 -175890 48794
11490E7536j3411J22565J85828j22380n2862B189R4188K00618Q0420c809H3276
$$ 57536 44125 166690 352518 230138 177276 2189 96377 296995 377415 -3809 83276
11478D7691J55590e0832k30604C47997N9868j44909P8162n7579j09445h8723F9821
$$ 47691 203281 -50832 -281436 347997 407865 262956 341118 283539 174094 -88723 69821
11466a3247D88085B04500a78934A94838I25N49709a5030A43414c7857I2552b850
$$ -13247 488085 204500 -178934 194838 925 550634 -15030 143414 -37857 92552 -2850
11454B626R0640J5097h6727j44465B35070m1397c71944C4323b0844D0723K37072
$$ 2626 93266 108363 -86727 -231192 235070 193673 -371944 34323 -20844 40723 277795
11443B77795e8009o6618B03635m1790l7082e9427F9080b44070d981B52213A11465
$$ 277795 -58009 -124627 203635 161845 124763 -59427 69080 -244070 -4981 252213 111465
11431A45922a69806A72266m2905e3993a0236k4903j82742A45496a8719n7546A02746
$$ 145922 -169806 172266 129361 -53993 -10236 -35139 -217881 145496 -18719 -76265 102746
11419d1439A46307b40829g7492n9720B6842G307a21120q5341e4860H2474e2228
$$ -41439 146307 -240829 -77492 -137212 26842 7307 -121120 -206461 -54860 82474 -52228
11407A22987a7445p9198J306C762J1024L08882j27628a96057b4139B18513a86976
$$ 122987 -17445 -96643 -95337 3762 14786 323668 196040 -196057 -24139 218513 -186976
11395b38268A97299f5887E7288R6489c11826a5714j99646R1943A8432f5053B6163
$$ -238268 197299 -65887 57288 153777 -311826 -15714 -215360 -123417 18432 -65053 26163
11383A48233k7119b31369E3939a45616N4480A5285J97743b09694A38591O0822
$$ 148233 121114 -231369 53939 -145616 -91136 15285 213028 -209694 138591 199413
11373A99413b11148B80840a18578p7045a5968r4629C25866A8732J82681p8349
$$ 199413 -211148 280840 -118578 -195623 -15968 -110597 325866 18732 201413 123064
11363A23064j8803F683b37626J167E2742a5467A95274j2692p1200a884o2134B54835
$$ 123064 104261 6683 -237626 -236459 52742 -15467 195274 182582 111382 -1884 -64018 254835
11350g914l18925B7637b61953C9363M7872a45531J3489f4260A10385O4601a01227
$$ -7914 -326839 27637 -261953 39363 87235 -145531 -132042 -64260 110385 174986 -101227
11338C7967b48084D3218b43043I8528c00517a14777j58274B0894b37163B02305
$$ 37967 -248084 43218 -243043 98528 -300517 -114777 -273051 20894 -237163 202305
11327A15256A2140d00513c6645d138A16704b23960B10144G5226c3991j60100E2028
$$ 115256 12140 -400513 -36645 -4138 116704 -223960 210144 75226 -33991 -194091 52028
11315A04918f915l0691J5733C15241j34938j4284p0831a03949k3271B68474P1568
$$ 104918 -6915 -37606 -21873 315241 180303 166019 95188 -103949 -127220 268474 340042
11304C40042h0736A7948c6733l13309H2292a16032N3395H6215a30488d8865k08009
$$ 340042 -80736 17948 -36733 -350042 82292 -116032 -62637 86215 -130488 -48865 -256874
11293b56874K045A80730b1155k4704A4113J69309C4537a69986m4278d3277l25370
$$ -256874 -254829 180730 -21155 -45859 14113 183422 34537 -169986 -214264 -43277 -368647
11282c68647a32029L7671A9085R8955g4338j57054h021k5266j03404A86533N9638
$$ -368647 -132029 -94358 19085 118040 -74338 -231392 -8021 -33287 -136691 186533 246171
11271B46171a61198j01402L2990F8351B370J21850a20970n7028l45627K56382
$$ 246171 -161198 -262600 -229610 68351 2370 124220 -120970 -177998 -523625 -267243
11261b67243A07688b17788q2233B90939a9899C36923F9563L7128a51879r684r611
$$ -267243 107688 -217788 -300021 290939 -19899 336923 69563 106691 -151879 -161563 -171174
11250a71174A19917a19187e1490H8225l1905b74292J29904e9548r5664O5054M758
$$ -171174 119917 -119187 -51490 88225 56320 -274292 -144388 -59548 -155212 -90158 -85400
11239h5400D7680c20380I6541a95521D8937K33351c05843K4110I390K47814i5164
$$ -85400 47680 -320380 96541 -195521 48937 282288 -305843 -281733 9390 257204 -95164
11227a03409n5339D2648d49845J79227A86712c38098e3922k35755a19908B691
$$ -103409 -158748 42648 -449845 -270618 186712 -338098 -53922 -289677 -119908 2691
11216b15292A07837a09993I512c27358a2631r1652G0341Q0699M8647B5560f7585
$$ -215292 107837 -109993 9512 -327358 -12631 -104283 70341 151040 199687 25560 -67585
11204A49332b06072Q4147l0657C31071f7686j6239B1632b96725E7374N3224l1989
$$ 149332 -206072 -121925 -152582 331071 -67686 -83925 21632 -296725 57374 110598 78609
11193G8609I030a24291c5454l48492d5484A35489J07388j14689g9077A88410c69300
$$ 78609 9030 -124291 -35454 -383946 -45484 135489 242877 128188 -79077 188410 -369300
11181c04545a13168L4090P329B15772k1945d23421F5438c1253h261j55984A55336
$$ -304545 -113168 -79078 -71749 215772 193827 -423421 65438 -31253 -8261 -164245 155336
11169a34996f4139l80340a01733G6646d4672o0025j58944j0770g0921B01727a47300
$$ -134996 -64139 -444479 -101733 76646 -44672 -104697 -263641 -274411 -70921 201727 -147300
11157i4633A41965h4891j33424A99378G5417j5568A1690c60550a79137d6963B57948
$$ -94633 141965 -84891 -218315 199378 75417 59849 11690 -360550 -179137 -46963 257948
11145b27567a13279e1169l35423P6547J49818l74597F197J24290J87206c77790
$$ -227567 -113279 -51169 -386592 -310045 -160227 -534824 6197 130487 317693 -377790
11134h8971C35915B9757O1758A0497b7038i753A32286j5763c6845j85904a03709
$$ -88971 335915 29757 91515 10497 -27038 -9753 132286 116523 -36845 -222749 -103709
11122B85396F0997a23721D71412c2918H9911a88836B25931J03176A63295e0543
$$ 285396 60997 -123721 471412 -32918 89911 -188836 225931 329107 163295 -50543
11111B81157f0719K5367l10789J50497B28443Q0244g3684B15519M6815j11637
$$ 281157 -60719 -35352 -346141 -195644 228443 308687 -73684 215519 262334 150697
11101A50697J75273A59815B9246J15799K0262K62401a870G7227Q358K54535c6021
$$ 150697 325970 159815 29246 145045 165307 427708 -1870 77227 85585 340120 -36021
11089B25138e5809A95758J16839O5035j20892c271H5633N3276J76465I5986P0499
$$ 225138 -55809 195758 312597 377632 256740 -3271 85633 138909 315374 95986 166485
11078A66485J95682p3899o1097J58276A76652A8413O1193J74266J7249M51728
$$ 166485 362167 288268 227171 385447 176652 18413 79606 253872 271121 722849
11068G22849B52395p9984J31939p010j1969j142K9968L47738A85893J50485j61130
$$ 722849 252395 172411 304350 297340 285371 284229 314197 661935 185893 336378 175248
11057A75248L31127K08791k10486O1797L87643l37571M69741j85430k85763K10738
$$ 175248 506375 715166 504680 566477 954120 616549 1086290 900860 615097 825835
11047H25835k13386J1311L54491m2793K938l39276L65115J57994l15917k16952
$$ 825835 612449 623760 978251 935458 938396 599120 964235 1122229 806312 589360
11037E89360L04015C25548o7804K78344j67885j16083K76365J54480j92084K05738
$$ 589360 893375 325548 257744 536088 368203 252120 528485 682965 490881 696619
11027F96619l07527m6905M77383J03062n9904m7901j08407o3766L1666J30549
$$ 696619 389092 342187 819570 922632 862728 814827 706420 642654 674320 804869
11017H04869K3213l62078N3892K55835j30506P3982p169j69953P8378m7586j21045
$$ 804869 828082 466004 519896 775731 645225 719207 712038 542085 620463 572877 451832
11006D51832j07270j8265P2831M7097J928K48979J11106j61660p1751Q8033M6447
$$ 451832 344562 326297 399128 446225 448153 697132 808238 646578 574827 662860 709307
10995G09307M8255j29945j92841J61876J89753J8604J00914j59199j15447L66232
$$ 709307 757562 627617 434776 596652 786405 805009 905923 746724 631277 997509
10985I97509q5476n8496r2798J38556J41352K21252k52555K80106J76051J34764
$$ 997509 912033 853537 760739 899295 1040647 1261899 1009344 1289450 1465501 1600265
10975A600265L49889J70537M83716j9706N17303k35591k1297k27134m5316l47123
$$ 1600265 1950154 2120691 2604407 2584701 3102004 2866413 2845116 2617982 2572666 2225543
10965B225543l83212j25158k73579K01529m3970Q2381m71558K22601j74384J71716
$$ 2225543 1842331 1717173 1443594 1645123 1601153 1683534 1211976 1434577 1260193 1431909
10955A431909K11295l99630P3482N0747m26201l34892K30577B49295J04857J76868
$$ 1431909 1643204 1243574 1317056 1367803 941602 606710 837287 249295 354152 531020
10945E31020k8415j33914n7232k1603j01739l2560C6687R418J49433J16184j23244
$$ 531020 502605 368691 311459 289856 188117 155557 36687 46105 195538 311722 188478
10934A88478I0126i9683B82856f5932e573C34435a12256p8015A1756J79766d7696
$$ 188478 90126 -99683 282856 -65932 -5573 334435 -112256 -190271 11756 191522 -47696
10922c7919O860C1915a11230e3558n0798F3535K61946A31142c92938b0037C52064
$$ -37919 -31059 31915 -111230 -53558 -104356 63535 325481 131142 -392938 -20037 352064
10910a30910N3421a5177I2894g0573P975A42550a43650A0717d7231m7888l2043
$$ -130910 -77489 -15177 92894 -70573 -62598 142550 -143650 10717 -47231 -95119 -127162
10899a27162H2495b76553A70429D0681J9015k7639a97785L7651a4963C70528G1650
$$ -127162 82495 -276553 170429 40681 59696 32057 -197785 -160134 -14963 370528 71650
10887C3288M40232a86357e7449A26633a36649G9344a41111B3336a22974J9123
$$ 33288 473520 -186357 -57449 126633 -136649 79344 -141111 23336 -122974 -103851
10877a03851j0284j41329Q5836M2649c2871n0784h100j16673j11520e5178o262
$$ -103851 -114135 -255464 -169628 -126979 -32871 -83655 -8100 -124773 -236293 -55178 -61440
10866f1440G1027d9188k21268k52464a26748B28546G286a79305A28646k1910k7933
$$ -61440 71027 -49188 -270456 -522920 -126748 228546 7286 -179305 128646 106736 78803
10855G8803A2132J23354B3621M4744N05d7881n3356D2356i1514n3687B8283K4213
$$ 78803 12132 135486 23621 68365 68870 -47881 -101237 42356 -91514 -145201 28283 52496
10843E2496d740B4962c7836A31987d25871B8469L2775l527d28760B49764A9918
$$ 52496 -4740 24962 -37836 131987 -425871 28469 61244 57717 -428760 249764 19918
10831C4520J1159A3962b22233h6174B49835i6975I6336h4532B00353C3351b15475
$$ 34520 45679 13962 -222233 -86174 249835 -96975 96336 -84532 200353 33351 -215475
10819e6209A48248a67662d3749k94162C77850r9051C2055A2360b23288g3439l1972
$$ -56209 148248 -167662 -43749 -337911 377850 278799 32055 12360 -223288 -73439 -105411
10808a05411B22707b79742a04992L1680H0900K31118a52477N8403k72515F2603
$$ -105411 222707 -279742 -104992 -73312 80900 312018 -152477 -94074 -366589 62603
10797i2697A01152D103b20127h5547A6075f3772A35755a21920D7275f5045B4035
$$ -92697 101152 4103 -220127 -85547 16075 -63772 135755 -121920 47275 -65045 24035
10785A2633a77213A09776b90594J26030N0612j80825J36106e510A98003c28261
$$ 12633 -177213 109776 -290594 -164564 -113952 -294777 -158671 -5510 198003 -328261
10774d35653h3418K1504j77529B03288e7620H4907Q4762e3495l4084D6735I409
$$ -435653 -83418 -61914 -239443 203288 -57620 84907 169669 -53495 -87579 46735 9409
10762a69219j09279A45053D5264J36954a87316O4916J1401A97744r0440A3606
$$ -169219 -278498 145053 45264 182218 -187316 -122400 -110999 197744 107304 13606
10751b36956f1432a2390j91488p8853d1105A47503d2250j27866M1662B66339I9482
$$ -236956 -61432 -12390 -203878 -282731 -41105 147503 -42250 -170116 -128454 266339 99482
10739b4325r4943r259A59488e5309l7220A24471a5912k09016D9830a68538B1338
$$ -24325 -119268 -128527 159488 -55309 -92529 124471 -15912 -224928 49830 -168538 21338
10727A14860D3627M739l449b61219m0401i6377b4840B10274H299b06003j34229
$$ 114860 43627 48366 44917 -261219 -301620 -96377 -24840 210274 8299 -206003 -340232
10716c40232G7426d8876g014k12034B2941J9010e0435B47074a56724d9208o3176
$$ -340232 77426 -48876 -7014 -219048 22941 41951 -50435 247074 -156724 -49208 -112384
10705a12384o7237g6944A83429n8807h2223G7370B8497b61996L609i0271b2048
$$ -112384 -179621 -76944 183429 124622 -82223 77370 28497 -261996 -258387 -90271 -22048
10693A44554c3979B87458a20634I062Q724L7190g142l07000B74228I048d3691
$$ 144554 -33979 287458 -120634 9062 17786 54976 -7142 -314142 274228 9048 -43691
10681a84128A582i7474a8457A45554J86444i5557A06139c95137f9573k0504F3996
$$ -184128 1582 -97474 -18457 145554 331998 -95557 106139 -395137 -69573 -90077 63996
10669a31724c1565j70208r5975d2009H1103J71948c23964k3460m6315g6143L0596
$$ -131724 -31565 -201773 -297748 -42009 81103 253051 -323964 -347424 -393739 -76143 -45547
10658d5547G2751L2391a08977A55170e7161a7695j51948d4970F407a04678a3235
$$ -45547 72751 105142 -108977 155170 -57161 -17695 -169643 -44970 6407 -104678 -13235
10646A7803K18635e4744A65225a68177k80666A77661n8980a32913A2975c69914
$$ 17803 236438 -54744 165225 -168177 -448843 177661 118681 -132913 12975 -369914
10635a0035j02131l4644A41892a02181A96185d38622f9483K1886k50359K6272
$$ -10035 -112166 -146810 141892 -102181 196185 -438622 -69483 -47597 -297956 -271684
10625b71684B50414A1925J8159b6259A00481I064N9724j66a76183d5821k32890
$$ -271684 250414 11925 30084 -26259 100481 9064 68788 68622 -176183 -45821 -278711
10614b78711D0220O5626d6874j13683k0255A2456a73939n4499A76523d13929A4960
$$ -278711 40220 105846 -46874 -160557 -180812 12456 -173939 -228438 176523 -413929 14960
10602a20832I2409f0544F255b64955C70317a77619f1453B15445n0622i8283B74240
$$ -120832 92409 -60544 6255 -264955 370317 -177619 -61453 215445 164823 -98283 274240
10590i0713k45241A21657a65272P3770D0068f9854E469f9210p491C8354a34627
$$ -90713 -335954 121657 -165272 -91502 40068 -69854 5469 -69210 -76701 38354 -134627
10578a06606B1811B119d3994q070q9120J6566e5103C3789M2546J62945a04399
$$ -106606 21811 2119 -43994 -52064 -141184 -124618 -55103 33789 76335 239280 -104399
10566A73687a52581k15541A53949b38611B478a31885B07189c85466J75637f1800
$$ 173687 -152581 -368122 153949 -238611 2478 -131885 207189 -385466 -209829 -61800
10555c26276h6558D3018a16261A75921a16577b2104o3109G1343c76358i0836k6028
$$ -326276 -86558 43018 -116261 175921 -116577 -22104 -85213 71343 -376358 -90836 -116864
10544a16864A47195a02079k8804B53067i2810j2653D1890a20719H4348C2527c1359
$$ -116864 147195 -102079 -130883 253067 -92810 -105463 41890 -120719 84348 32527 -31359
10532A94933c42181K4973c5394j74955K0333A93123a48785B37806C3958j6819
$$ 194933 -342181 -317208 -35394 -210349 -190016 193123 -148785 237806 33958 17139
10522A7139c60941B87509j38542e9086A07505d43875O7557B00730A9771M741K8127
$$ 17139 -360941 287509 148967 -59086 107505 -443875 -376318 200730 19771 24512 52639
10511E2639I441b10518A4968b6534p3682b2684n835q0834q1205d3072C3968L09762
$$ 52639 9441 -210518 14968 -26534 -100216 -22684 -28519 -109353 -190558 -43072 33968 343730
10499C43730g6777n2542J5436a0497j61062j81698a46286B04897A00624J5665
$$ 343730 -76777 -129319 -113883 -10497 -171559 -353257 -146286 204897 100624 116289
10489A16289J19830q4010A089J53935f7972a9040B42774o8136G3892h9997D63617
$$ 116289 236119 152109 1089 155024 -67972 -19040 242774 174638 73892 -89997 463617
10477C55957c6544A51077A9129K26677b38568A71527A3298i8456B49252e32240
$$ 355957 -36544 151077 19129 245806 -238568 171527 13298 -98456 249252 -532240
10466b21193C55549h6964r710B04428r1827J55550A2826J3787K57862b32173Q9034
$$ -221193 355549 -86964 -96674 204428 112601 268151 12826 26613 284475 -232173 -143139
10455a43139K0834G8985L6513L6234E8497a21334j08176f7512j37688I4132l2502
$$ -143139 -122305 78985 115498 151732 58497 -121334 -229510 -67512 -205200 94132 61630
10444F1630a4620j05655C01962F2949A9404c6566A56404J67938b31568N4840n8911
$$ 61630 -14620 -120275 301962 62949 19404 -36566 156404 324342 -231568 -176728 -235639
10433b35639A7672K13790r9139b55398A7899K27317d06066J45682n2498B76149
$$ -235639 17672 231462 132323 -255398 17899 245216 -406066 -260384 -312882 276149
10422B61716i7576a7168A00906a25393A06895N4144o0867k2730c72442B65191
$$ 261716 -97576 -17168 100906 -125393 106895 161039 100172 77442 -372442 265191
10411c98743J80946j7715c8222j05614J582J9617a9176j40063A41151A9687J86711
$$ -398743 -217797 -235512 -38222 -143836 -142254 -122637 -19176 -159239 141151 19687 206398
10400B06398a15443I8477a330o4833B09302h269D43345a88727B49148K33734G1503
$$ 206398 -115443 98477 -1330 -66163 209302 -8269 443345 -188727 249148 482882 71503
10388B2423J58241K35215g7576j7513O66A5980b5294F9847j1451R2835e2464p6859
$$ 22423 180664 415879 -77576 -95089 -94423 15980 -25294 69847 58396 151231 -52464 -129323
10376a29323b4706C46670A7468L87765j77979B7837L46226A85963P1554K29261
$$ -129323 -24706 346670 17468 405233 227254 27837 374063 185963 257517 486778
10366D86778K8443n8219j64472M37172A44190J76746m2076j1981j6964J1000J60888
$$ 486778 515221 457002 292530 729702 144190 320936 278860 266879 249915 260915 421803
10355D21803r1746j54307a16741B72126Q3568K89641k00110j2982R3982A74100
$$ 421803 330057 175750 -116741 272126 355694 645335 445225 432243 526225 174100
10344B5349M34392j42283P4757K51237f7901E01373j61303N7847A88822l5402
$$ 25349 459741 317458 392215 643452 -67901 501373 340070 397917 188822 153420
10334A53420j8834c79464B27131a08299j63060A86399K64365A56642l6277a57737
$$ 153420 134586 -379464 227131 -108299 -271359 186399 450764 156642 120365 -157737
10323C19335e2935B00854J37862A04448K18335m2893i8939d570l8819C62146P7165
$$ 319335 -52935 200854 338716 104448 322783 279890 -98939 -4570 -43389 362146 439311
10312D39311a37957Q556B0692J28630m66e1871F1612b55789o599g0840j88562
$$ 439311 -137957 -129401 20692 149322 148856 -51871 61612 -255789 -262388 -70840 -259402
10301b59402d6475B0583b69631N2489a07254e0044B9187a15178A8401f1991L374
$$ -259402 -46475 20583 -269631 -217142 -107254 -50044 29187 -115178 18401 -61991 -58617
10290e8617A68527a94858b551G248a31236A72880J14971A00539k4932k3311a2032
$$ -58617 168527 -194858 -2551 7248 -131236 172880 287851 100539 75607 52296 -12032
10278d0528B25543j5442B4657f5624A80902a88653D20400H2089n454c8075H4321
$$ -40528 225543 210101 24657 -65624 180902 -188653 420400 82089 76635 -38075 84321
10266E5788J06385b21534Q2187c0915k99950C32135A65829E877M9913c11055A99275
$$ 55788 162173 -221534 -139347 -30915 -330865 332135 165829 5877 55790 -311055 199275
10254B35245B5694a34411C48686b57173a07949c2275B1321J37248L9028p6091
$$ 235245 25694 -134411 348686 -257173 -107949 -32275 21321 158569 197597 121506
10244A21506a8986A14266b35482I3531b72167a1331L362n5319K1599k8181H079
$$ 121506 -18986 114266 -235482 93531 -272167 -11331 -7969 -63288 -41689 -69870 8079
10232G834a51706b1712e173H2024l145c10350g9039B6919f6447l7788j56629G6038
$$ 7834 -151706 -21712 -5173 82024 78879 -310350 -79039 26919 -66447 -104235 -260864 76038
10219a81602o6868j13365E7098A4083K54509F9984k644e5595C87545E752a83736
$$ -181602 -248470 -361835 57098 14083 268592 69984 67340 -55595 387545 5752 -183736
10207i089E1762g4471Q323l16412D2943M8164b28350F8087f7980n0328M888n8253
$$ -9089 51762 -74471 -66148 -382560 42943 91107 -228350 68087 -67980 -118308 -113420 -171673
10195a71673B49002l9821k5880e4263D00504G927h939j27036D8120a53911H161
$$ -171673 249002 209181 183301 -54263 400504 7927 -8939 -135975 48120 -153911 8161
10183i1281F4713c7735B00853J7220n8000c2676j44259o4212J08543I698e31295
$$ -91281 64713 -37735 200853 218073 160073 -32676 -176935 -241147 -132604 9698 -531295
10171C4495c0692p0413k4981m127A65265a81739n8697d9022B49433h9131C80062
$$ 34495 -30692 -101105 -126086 -130213 165265 -181739 -240436 -49022 249433 -89131 380062
10159b7078j11604C8836d4182k36744C620a02342n6469m9A56700a1007D4695b00313
$$ -27078 -138682 38836 -44182 -280926 3620 -102342 -158811 -158860 156700 -11007 44695 -200313
10146A26927c22526N6114j22141a13183g800j91175R2086J5647k3798B5316J05391
$$ 126927 -322526 -266412 -388553 -113183 -7800 -198975 -106889 -91242 -115040 25316 130707
10135A30707c24476A2830a33784a2651B056e9412K1227I6884O5074d368e14B47945
$$ 130707 -324476 12830 -133784 -12651 2056 -59412 -38185 96884 161958 -4368 -514 247945
10122b28360g8762G6469b19945f4365B46079b03461K8820d3205m08262H0142b30090
$$ -228360 -78762 76469 -219945 -64365 246079 -203461 -174641 -43205 -451467 80142 -230090
10110a3876k00970C486i4067p5193F2827K78381A7704b16322M3383l3165K6749
$$ -13876 -214846 3486 -94067 -169260 62827 341208 17704 -216322 -172939 -206104 -179355
10099a79355K1284A82897b77313m5019D691R848d05610b5926A77848a31950j49703
$$ -179355 -158071 182897 -277313 -322332 4691 14539 -405610 -25926 177848 -131950 -281653
10088b81653C29195A6855a0838m30993C8160a91894C25966a68067M2171m0632
$$ -281653 329195 16855 -10838 -441831 38160 -191894 325966 -168067 -125896 -166528
10078a66528j58766A72722e1317F6473a82681e7534A8934e2107A04089g8415l7913
$$ -166528 -325294 172722 -51317 66473 -182681 -57534 18934 -52107 104089 -78415 -116328
10067a16328L4015r5568Q799e4355j763G5473N0052i4566b9150A74581a48644
$$ -116328 -82313 -177881 -169082 -54355 -56118 75473 125525 -94566 -29150 174581 -148644
10055b21936B05086g9810q7251L8132O4458j03167B1585b95821e8382j6449A943
$$ -221936 205086 -79810 -167061 -128929 -64471 -167638 21585 -295821 -58382 -74831 1943
10043b16062b8317H5372k225a82680L3659b1738j13157l5790n7350m4507e594
$$ -216062 -28317 85372 83147 -182680 -149021 -21738 -134895 -170685 -228035 -272542 -5594
10031b64576m216J23614C0899a16760k50129A13212i2475q4194j23051A7355b0168
$$ -264576 -268792 -145178 30899 -116760 -366889 113212 -92475 -176669 -299720 17355 -20168
10019a07842P547b8518C8484J19149c16771A37517b43946J14321j03234P7991
$$ -107842 -100295 -28518 38484 157633 -316771 137517 -243946 -129625 -232859 -154868
10009a54868K2998D53093h5393p4688B17407Q1300a85713P9529d4931A57479b53465
$$ -154868 -131870 453093 -85393 -160081 217407 298707 -185713 -106184 -44931 157479 -253465
9997c28073i1808I9555e8794j23179r0518a20256C54788b43304J14247j8002C6285
$$ -328073 -91808 99555 -58794 -181973 -272491 -120256 354788 -243304 -129057 -147059 36285
9985a23134j77436I0556i8348A72899b5296r5470r1230A22648C7676b52834g8466
$$ -123134 -300570 90556 -98348 172899 -25296 -120766 -211996 122648 37676 -252834 -78466
9973D8208B2619l71j166a47410k9809A34031P2933a05052A98314c8638H3200c0534
$$ 48208 22619 22248 21082 -147410 -177219 134031 206964 -105052 198314 -38638 83200 -30534
9960d2255j0885A60076N3894H66a89608M8999G0435J9424H856L2314c64114h5168
$$ -42255 -53140 160076 213970 866 -189608 -140609 70435 89859 8856 41170 -364114 -85168
9947D77946F458K06637c66674J16379K4469A32550b62017M6222m954a4727B97059
$$ 477946 6458 213095 -366674 -250295 -225826 132550 -262017 -215795 -220749 -14727 297059
9935a84328E91227A83451A874J66740C7440b15655p1955J03911c8843k72719a11541
$$ -184328 591227 183451 1874 168614 37440 -215655 -287610 -183699 -38843 -311562 -111541
9923a2128A6306g4165a7598A73721a99109A14433E0003J76633a2110A60244a38752
$$ -12128 16306 -74165 -17598 173721 -199109 114433 50003 226636 -12110 160244 -138752
9911a64446n9095A4915M710J80730D0841b46778A81804a3324k83068g3710k7595
$$ -164446 -223541 14915 19625 200355 40841 -246778 181804 -13324 -296392 -73710 -101305
9900a01305l12687b2487o7477A88093K04431B2966f011B74227G5701O1445a91046
$$ -101305 -413992 -22487 -89964 188093 392524 22966 -6011 274227 75701 137146 -191046
9888C35418b87151j4121a01963j36047a06511B5660a5830B27860g5356D4720f6156
$$ 335418 -287151 -301272 -101963 -238010 -106511 25660 -15830 227860 -75356 44720 -66156
9876F2778b46834B1761f2682A21692D3112J99085K11020i2738j69721h8094n18408
$$ 62778 -246834 21761 -62682 121692 43112 242197 453217 -92738 -262459 -88094 -606502
9865f06502J34255a77755C7665K98480A54878a38887N6381C59340d34121c0899
$$ -606502 -472247 -177755 37665 336145 154878 -138887 -82506 359340 -434121 -30899
9854i8060m7362d5428l99008f4742k04619J04826j80718a67816f4871j99309J18528
$$ -98060 -145422 -45428 -444436 -64742 -269361 -164535 -345253 -167816 -64871 -264180 -145652
9843a45652B13551n511b1407B0051a35460l3893A48660K14180d2012C3984h9476
$$ -145652 213551 208040 -21407 20051 -135460 -169353 148660 362840 -42012 33984 -89476
9831A93503n2256a801r8690m9884I4584R7438M2198b69466o5977h9644a6112l5026
$$ 193503 141247 -1801 -100491 -150375 94584 192022 234220 -269466 -335443 -89644 -16112 -51138
9819e1138k85444Q5923B35041r5835a5367r270n6923A93424b04674j99495A73187
$$ -51138 -336582 -250659 235041 139206 -15367 -24637 -81560 193424 -204674 -404169 173187
9807d19732b00948j7728c2382j86925H8019d63784a71142j38641a10921A85614
$$ -419732 -200948 -218676 -32382 -219307 88019 -463784 -171142 -309783 -110921 185614
9796g9766A44933i4942j67466b9522j86898g9813j55968M5811d7497A37674a16095
$$ -79766 144933 -94942 -262408 -29522 -216420 -79813 -235781 -189970 -47497 137674 -116095
9784E280a06656A86088D5542i4433K9314F694J61415i1818j74688B9286a62295
$$ 5280 -106656 186088 45542 -94433 -65119 6694 168109 -91818 -266506 29286 -162295
9772e6020H5788Q0075f5741I7555D1182i7352B08871a17781b9486k00856Q7163
$$ -56020 85788 165863 -65741 97555 41182 -97352 208871 -117781 -29486 -230342 -143179
9761a43179M2862c1367l4421g283k38900A30215E5659M5883k942B0039e1130k16227
$$ -143179 -100317 -31367 -65788 -7283 -246183 130215 55659 101542 98600 20039 -51130 -267357
9749b67357C1788c3617C02035c7266B63263A1368J31499c21291J04048P8678A04402
$$ -267357 31788 -33617 302035 -37266 263263 11368 142867 -321291 -217243 -138565 104402
9737a33254J3278C8250J49829L6480A4025a00712A57727G5905J7950i192k8261
$$ -133254 -119976 38250 188079 224559 14025 -100712 157727 75905 93855 -9192 -37453
9726c7453j21871j16802m1793P1588J15133k10008H6603a87998q6258e6359A12624
$$ -37453 -159324 -276126 -317919 -246331 -131198 -341206 86603 -187998 -274256 -56359 112624
9714b7850j45058a4339j13148A51016a39257L9447A4679b74683A19024L2435b08912
$$ -27850 -172908 -14339 -127487 151016 -139257 -99810 14679 -274683 119024 151459 -208912
9702a98141l9630a18382k4335D1771J23728b34952J10942a7277A0131c27972A03354
$$ -198141 -237771 -118382 -142717 41771 165499 -234952 -124010 -17277 10131 -327972 103354
9690A07119a50580B95984a53626A02320j9542O8711b61488K6949B68689a54139
$$ 107119 -150580 295984 -153626 102320 82778 151489 -261488 -234539 268689 -154139
9679e2184n659A3786K36073A21282n5252a7154k47067A40639g2715A1867a12441
$$ -52184 -57843 13786 249859 121282 66030 -17154 -264221 140639 -72715 11867 -112441
9667c22759J60871P2798M3059G5148a08433j0404b0424j72965l4416B5576a18601
$$ -322759 -161888 -89090 -46031 75148 -108433 -118837 -20424 -193389 -227805 25576 -118601
9655i2226q884q223N0123J8655E570J23546F3492b26356k16571K11659a00330
$$ -92226 -101110 -109333 -59210 -40555 5570 129116 63492 -226356 -442927 -231268 -100330
9643c79763J8648A7728c5263A27389B5375a69542A75176i1103B37757d04175B3504
$$ -379763 -361115 17728 -35263 127389 25375 -169542 175176 -91103 237757 -404175 23504
9631b677B8157b26904i7957j531j48428D4877M4170g1250J3021j48869j49272
$$ -2677 28157 -226904 -97957 -99488 -247916 44877 89047 -71250 -58229 -207098 -356370
9620c56370J53702A8855a32811e9787k39155a06929e2106a2606q3457I1472c30168
$$ -356370 -202668 18855 -132811 -59787 -298942 -106929 -52106 -12606 -96063 91472 -330168
9608A04510g5724j39655R3982n3807J6912l0384O8190M6401j58019O2203n9544
$$ 104510 -75724 -215379 -121397 -175204 -158292 -188676 -120486 -74085 -232104 -169901 -229445
9597b29445c7962a1413B70937r1628i4848l04238J29574A29299e4318C29956f483
$$ -229445 -37962 -11413 270937 179309 -94848 -399086 -269512 129299 -54318 329956 -6483
9585A70602P841b41501A41341D0328b03814A27476f1523j59653k36491B62507
$$ 170602 178443 -241501 141341 40328 -203814 127476 -61523 -221176 -457667 262507
9574d3784j55707n819O8854j55821H886c15732B29343G5436c92884a75278C0728
$$ -43784 -199491 -205310 -136456 -292277 8886 -315732 229343 75436 -392884 -175278 30728
9562A68953a10964n3575A06648L9933e4633F4955J22001j1049L9174E0361M1539
$$ 168953 -110964 -164539 106648 146581 -54633 64955 186956 175907 215081 50361 91900
9551I1900a17636B85770a90674A692L45642d38129h4704j6860j12580B22198h9364
$$ 91900 -117636 285770 -190674 1692 347334 -438129 -84704 -101564 -214144 222198 -89364
9539E8286b40768g9072m11457a04716A39550g7659l0517l9469B03226b18809O0470
$$ 58286 -240768 -79072 -490529 -104716 139550 -77659 -108176 -147645 203226 -218809 -158339
9528a58339A07302C745Q5831a72428C2251b55232d2608o9000k04037a05732A6543
$$ -158339 107302 3745 89576 -172428 32251 -255232 -42608 -111608 -315645 -105732 16543
9516g3060A55368b45506N48e3423B44559i1979F9590a50093a7460k46165J22357
$$ -73060 155368 -245506 -244958 -53423 244559 -91979 69590 -150093 -17460 -263625 -141268
9505a41268a1432A03241P4203a76070k0263A48324d19082K07519g128B10715b20104
$$ -141268 -11432 103241 177444 -176070 -196333 148324 -419082 -211563 -7128 210715 -220104
9493a41648O2475m85341A20154d38754a74221f1258B48975a29563E3355a11693
$$ -141648 -79173 -564514 120154 -438754 -174221 -61258 248975 -129563 53355 -111693
9482A71365L3282c6371E8981a74090B65372A4365b0502j71116H1653g9902k37033
$$ 171365 204647 -36371 58981 -174090 265372 14365 -20502 -191618 81653 -79902 -316935
9471c16935g2119E029K6946Q7950N5490a15202m2296j89338I0618l5018J16491
$$ -316935 -72119 5029 31975 119925 175415 -115202 -157498 -346836 90618 55600 172091
9460A72091L8150i9954b9914a366A60375b04770f610n4207a8130l5037J3170E2795
$$ 172091 210241 -99954 -29914 -1366 160375 -204770 -6610 -60817 -18130 -53167 -39997 52795
9447B7034K55357h1179A58005B6822j2879a35923C32430b49794j28909i7450C23603
$$ 27034 282391 -81179 158005 26822 13943 -135923 332430 -249794 -378703 -97450 323603
9435b64735J6467c7437H0790c19930i5559j19375R6792H1495b25015Q3189C37659
$$ -264735 -248268 -37437 80790 -319930 -95559 -214934 -118142 81495 -225015 -141826 337659
9423A00299J14749G7876a93754n3684j7784C9189a23961A15426c11930A39781
$$ 100299 215048 77876 -193754 -247438 -265222 39189 -123961 115426 -311930 139781
9412h9476L2111j75646b9479j94146N1525D3292A78e0414a0113B89666a17392
$$ -89476 -57365 -233011 -29479 -223625 -172100 43292 178 -50414 -10113 289666 -117392
9400a14875d8771j54929p9949h0407l4072j29090r6980G3832c51496A12648L8560
$$ -114875 -48771 -203700 -283649 -80407 -114479 -243569 -340549 73832 -351496 112648 151208
9389A51208a76360l18352A3096J01897L7005a08314o3228J1596h929K030l00138
$$ 151208 -176360 -494712 13096 114993 151998 -108314 -171542 -159946 -8929 -6899 -307037
9378c07037a29539n046l02397J51460c7432r1470M9914K3098B35873b76913a25550
$$ -307037 -129539 -134585 -436982 -285522 -37432 -128902 -78988 -55890 235873 -276913 -125550
9366h9033b6875j22594E6586C491J85329a70158C7758a04616j90930i5350l15679
$$ -89033 -26875 -149469 56586 3491 188820 -170158 37758 -104616 -295546 -95350 -411029
9355d11029K4603C29996i1592j14751A05487G262J06141i0903C27808H1849P3990
$$ -411029 -386426 329996 -91592 -206343 105487 7262 113403 -90903 327808 81849 155839
9344A55839A9368J43990b38291j40961e8119B04679G2031Q7805a65375d5083B39840
$$ 155839 19368 163358 -238291 -379252 -58119 204679 72031 159836 -165375 -45083 239840
9332b63056Q0228A01053a58689D09674b01446M5781d1506j97333C0359b24978
$$ -263056 -182828 101053 -158689 409674 -201446 -155665 -41506 -238839 30359 -224978
9321e7127r4925l6812l81267K38681j61418K37123A75677G2107a26078C6924f0707
$$ -57127 -152052 -188864 -570131 -331450 -492868 -255745 175677 72107 -126078 36924 -60707
9309a55629L6180j23653Q800i1974K8956A5420a82914f4464A49590D1560e8209
$$ -155629 -119449 -243102 -234302 -91974 -63018 15420 -182914 -64464 149590 41560 -58209
9297b14392h2645A42808c69331e5821o8926I2531f5682I0945k9453J38696b09813
$$ -214392 -82645 142808 -369331 -55821 -124747 92531 -65682 90945 61492 200188 -209813
9285A26480K5373b79714e1994o2226B41430H4590f724m15350a23867r6323M3695
$$ 126480 151853 -279714 -51994 -114220 241430 84590 -6724 -422074 -123867 -220190 -176495
9274a76495l7996A61464a37914f5169j50932B07688I786h1478j4675F2048b38943
$$ -176495 -214491 161464 -137914 -65169 -216101 207688 9786 -81478 -96153 62048 -238943
9262H8803m3764R6681a58812C71198a9025l39960B32774c38864a63629d1969b494
$$ 88803 45039 141720 -158812 371198 -19025 -358985 232774 -338864 -163629 -41969 -2494
9250c42287d4911j11661O7105F41b57246A0610M1085J27408J02007g0528J260
$$ -342287 -44911 -156572 -89467 641 -257246 10610 51695 179103 281110 -70528 -69268
9239f9268j68259j06110D1055c24583i0773A87460a2510l32022h0054c2309j26891
$$ -69268 -237527 -343637 41055 -324583 -90773 187460 -12510 -344532 -80054 -32309 -159200
9228a59200j71345a08792q9765i0695k61982R3957h2953A14252i3967j21040E1093
$$ -159200 -330545 -108792 -198557 -90695 -352677 -258720 -82953 114252 -93967 -215007 51093
9216B67830b41486c4570A35413j1131a68106O5679A47360g1691k48631a43689
$$ 267830 -241486 -34570 135413 124282 -168106 -102427 147360 -71691 -320322 -143689
9205A56854E5753a63208M3490N286j2996A09142f0487p2234g523F7978a08325
$$ 156854 55753 -163208 -119718 -114432 -127428 109142 -60487 -132721 -7523 67978 -108325
9193E25155b54233a16131J8054l7588j0849A0343b18891g072A41926i4680A80495
$$ 525155 -254233 -116131 -98077 -135665 -146514 10343 -218891 -7072 141926 -94680 180495
9181D1889c2771H4750a18585l6751k47706D3206a79097h1551A48394b33069R8348
$$ 41889 -32771 84750 -118585 -155336 -403042 43206 -179097 -81551 148394 -233069 -134721
9170a34721B76391G6666A7318J1882a05151j01572H3199C5934b34066b0553A55582
$$ -134721 276391 76666 17318 29200 -105151 -206723 83199 35934 -234066 -20553 155582
9158F1429J5921j1752H765K3087J43092C1152M2409j4133b53194A71670e6541
$$ 61429 77350 65598 8765 31852 174944 31152 73561 59428 -253194 171670 -56541
9146b1208N685B3212R7875d13692i8945k05406a23827j86606f5392j47374D3131
$$ -21208 -15523 23212 121087 -413692 -98945 -304351 -123827 -310433 -65392 -212766 43131
9134A17203b3602k80389A83421E6657a16510F1600e0442l3857j08464b3690C40790
$$ 117203 -23602 -303991 183421 56657 -116510 61600 -50442 -84299 -192763 -23690 340790
9122a92505Q7486C1396O3863f6349D9695P5959J05733C6740e2750A2290a28330
$$ -192505 -105019 31396 95259 -66349 49695 125654 231387 36740 -52750 12290 -128330
9110B44826j03500J23428c01071d6043j1778m4349E9385f0064K2106B8927a50788
$$ 244826 141326 264754 -301071 -46043 -57821 -102170 59385 -60064 -37958 28927 -150788
9098c29730O7540C8581b83507L8507j61420E6014J17358A9470b9157B46408i3640
$$ -329730 -262190 38581 -283507 -245000 -406420 56014 173372 19470 -29157 246408 -93640
9086e1595j89139h7893k00408i7040j53825C5255L3881b80704P6323d2606k79880
$$ -51595 -240734 -87893 -288301 -97040 -250865 35255 69136 -280704 -204381 -42606 -322486
9075c22486B10551b03984k8719N3453B17214b45576E97J4508R8469f7080A27987
$$ -322486 210551 -203984 -232703 -179250 217214 -245576 597 15105 113574 -67080 127987
9063H8057a30599k10841a04799q0453H1262a82753n4938A68874a60028j24938
$$ 88057 -130599 -341440 -104799 -185252 81262 -182753 -237691 168874 -160028 -284966
9053b84966J28540A77957c7073j8235B49793c00141H4200b94076a8316m05328
$$ -284966 -156426 177957 -37073 -55308 249793 -300141 84200 -294076 -18316 -423644
9043d23644J44691B8695a89664k4074a1091j22381A8452Q228h9084n3885o2507
$$ -423644 -278953 28695 -189664 -213738 -11091 -133472 18452 26680 -89084 -142969 -205476
9032b05476B6135K093f2427L810q0659K9021A98655a04074B58614d1786k47254
$$ -205476 26135 28228 -62427 -58617 -139276 -110255 198655 -104074 258614 -41786 -289040
9021b89040A01906D3437j7670J71476q8596a22138b4397o0148B51336a37040j11156
$$ -289040 101906 43437 25767 197243 108647 -122138 -24397 -84545 251336 -137040 -248196
9010b48196A13941d71306d0562k17161R9534B44256b5693j51086m2603C46251
$$ -248196 113941 -471306 -40562 -257723 -158189 244256 -25693 -176779 -219382 346251
8999A71113h6954A19009a43604c077o5311J4480o4608B13525b65605h0371o1563
$$ 171113 -86954 119009 -143604 -3077 -68388 -53908 -118516 213525 -265605 -80371 -141934
8988a41934N8583B16113a75407O8850K7331a2530j10073m2478c3197j9762j79390
$$ -141934 -83351 216113 -175407 -106557 -79226 -12530 -122603 -165081 -33197 -52959 -232349
8977b32349a4848j47464H3077c10460F2812c6282a6778g575j47000A4742K00081
$$ -232349 -14848 -162312 83077 -310460 62812 -36282 -16778 -7575 -154575 14742 214823
8966B14823i5309j6699a1372l00503h0629j58197A58103l8675a68383A28121Q9483
$$ 214823 -95309 -112008 -11372 -311875 -80629 -238826 158103 119428 -168383 128121 217604
8955B17604a53721d8343a537j19611h295k29346J15750o5999M556k0619j34449
$$ 217604 -153721 -48343 -1537 -121148 -8295 -237641 -121891 -187890 -183334 -203953 -338402
8944c38402A75983a32084k00758E1765J51210j4241a89089A88232b77095F57880
$$ -338402 175983 -132084 -332842 51765 202975 188734 -189089 188232 -277095 657880
8933E19781a43093E0447d36393A86858I0263i7516A68885M15665J30340M01668
$$ 519781 -143093 50447 -436393 186858 90263 -97516 168885 584550 714890 1116558
8923A116558K864466P491219O169596E925736B590546A277148m78088l47054N1785
$$ 1116558 3981024 11472243 17641839 5925736 2590546 1277148 799060 452006 503791
8914E03791j79491c01164C7120a51054B05663J5473K21496q6634A60023a89872
$$ 503791 324300 -301164 37120 -151054 205663 221136 442632 355998 160023 -189872
8903a2905m1076I7629N1217E7736b79879J01097l0083K1371b1495j17486C6498
$$ -12905 -53981 97629 148846 57736 -279879 -178782 -208865 -187494 -21495 -138981 36498
8891a16436M7989A7549a54637m3584b9851j63630Q0089I8030j6947M7423a14568
$$ -116436 -68447 17549 -154637 -198221 -29851 -193481 -113392 98030 81083 128506 -114568
8879b03911d5638E0123c24494A72178J04154b58750C33247a05459p7957B7601
$$ -203911 -45638 50123 -324494 172178 276332 -258750 333247 -105459 -183416 27601
$$ [...]
##END NTUPLES=NMR SPECTRUM
##END=
