##TITLE=AC1480_CUNDIAS13306_8101136_fXrxJl3XZk
##JCAMPDX= 6.0         $$ Bruker NMR JCAMP-DX V2.0
##DATA TYPE= NMR SPECTRUM
##DATA CLASS= NTUPLES
##ORIGIN= BRUKER
##OWNER= Administrator
$$ 1.72 TOPSPIN		Version 2.1
$$ 2013-07-31 18:46:39.895 -0700  Administrator@X
$$ Compression mode = diff/dup
##.OBSERVE FREQUENCY= 400.02188249412
##.OBSERVE NUCLEUS= ^1H
##.ACQUISITION MODE= SIMULTANEOUS (DQD)
##.ACQUISITION SCHEME= undefined
##.AVERAGES= 64
##.DIGITISER RES= 22
##SPECTROMETER/DATA SYSTEM= spect
##.PULSE SEQUENCE= noesygpps1d.comp
##.SOLVENT NAME= COFFEE_meoh
##.SHIFT REFERENCE= INTERNAL, COFFEE_meoh, 1, 14.96105
##AUDIT TRAIL= $$ (NUMBER, WHEN, WHO, WHERE, PROCESS, VERSION, WHAT)
$$ ##TITLE= Audit trail, TOPSPIN		Version 2.1
$$ ##JCAMPDX= 5.01
$$ ##ORIGIN= Bruker BioSpin GmbH
$$ ##OWNER= Administrator
$$ $$ E:\/data/COFFEE/nmr/AC1480_CUNDIAS13306_8101136_fXrxJl3XZk/12/pdata/1/auditp.txt
$$ ##AUDIT TRAIL=  $$ (NUMBER, WHEN, WHO, WHERE, PROCESS, VERSION, WHAT)
(   1,<2013-07-31 18:46:35.004 -0700>,<Administrator>,<X>,<go>,<TOPSPIN 2.1>,
      <created by zg
	started at 2013-07-31 18:35:05.567 -0700,
	POWCHK enabled, PULCHK disabled,
       configuration hash MD5:
       C8 4E 4E 5D D3 5C D8 9E 9F 52 82 E0 59 8A DE 15
       data hash MD5: 64K
       95 25 4F 1A DD 4F 68 A7 84 3C 87 C3 A7 1E 7C 31>)
(   2,<2013-07-31 18:46:37.973 -0700>,<Administrator>,<X>,<proc1d>,<TOPSPIN 2.1>,
      <Start of raw data processing
       efp LB = 0.3 FT_mod = 6 PKNL = 1 PHC0 = 0 PHC1 = 0 SI = 128K 
       data hash MD5: 128K
       96 24 2D DA A8 28 49 BD 16 14 32 A6 A0 D4 CA 52>)
(   3,<2013-07-31 18:46:38.911 -0700>,<Administrator>,<X>,<proc1d>,<TOPSPIN 2.1>,
      <pk PHC0 = -77.90955 PHC1 = 0 
       data hash MD5: 128K
       14 A3 F0 DB 25 50 26 8C DE 7F 80 73 02 14 B7 AE>)
(   4,<2013-07-31 18:46:39.348 -0700>,<Administrator>,<X>,<proc1d>,<TOPSPIN 2.1>,
      <abs ABSG = 1 
       data hash MD5: 128K
       07 8F D9 95 FE E8 6F EA 64 54 0B DE A0 27 0E 6B>)
(   5,<2013-07-31 18:46:39.457 -0700>,<Administrator>,<X>,<proc1d>,<TOPSPIN 2.1>,
      <abs ABSG = 2 
       data hash MD5: 128K
       5B 1A 3F DA BD D8 5B 9E C4 D2 59 72 60 7E 3A 66>)
(   6,<2013-07-31 18:46:39.551 -0700>,<Administrator>,<X>,<proc1d>,<TOPSPIN 2.1>,
      <abs ABSG = 3 
       data hash MD5: 128K
       7F 25 B4 F7 8E D1 94 A6 15 32 F7 C8 A8 21 5B 81>)
(   7,<2013-07-31 18:46:39.629 -0700>,<Administrator>,<X>,<proc1d>,<TOPSPIN 2.1>,
      <abs ABSG = 4 
       data hash MD5: 128K
       DB 41 DC F2 10 40 15 B2 F5 B5 77 7B 3D B1 FC 5D>)
(   8,<2013-07-31 18:46:39.723 -0700>,<Administrator>,<X>,<proc1d>,<TOPSPIN 2.1>,
      <abs ABSG = 5 
       data hash MD5: 128K
       34 FC 0E AD E3 3C 5D 97 D3 63 1B 59 A7 97 25 24>)
$$ ##END=
$$ 
$$ $$ hash MD5
$$ $$ 23 55 68 FB D2 AF 44 25 DF 2D EB D1 D0 A7 7C E8
##$RELAX= 
##$RELAX= 
##$RELAX= 
##$RELAX= 
##$RELAX= 
##$RELAX= 
##$RELAX= 
##$RELAX= 
$$ Bruker specific parameters
$$ --------------------------
##$DU= <E:\>
##$EXPNO= 12
$$ [...]
##$TP07= 0
##$TPNAME0= <>
##$TPNAME1= <>
##$TPNAME2= <>
##$TPNAME3= <>
##$TPNAME4= <>
##$TPNAME5= <>
##$TPNAME6= <>
##$TPNAME7= <>
##$TPOAL= (0..7)
0.5 0.5 0.5 0.5 0.5 0.5 0.5 0.5
##$TPOFFS= (0..7)
0 0 0 0 0 0 0 0
##$TUNHIN= 0
##$TUNHOUT= 0
##$TUNXOUT= 0
##$USERA1= <user>
##$USERA2= <user>
##$USERA3= <user>
##$USERA4= <user>
##$USERA5= <user>
##$V9= 5
##$VALIST= <valist>
##$VCLIST= <CCCCCCCCCCCCCCC>
##$VD= 0
##$VDLIST= <DDDDDDDDDDDDDDD>
##$VPLIST= <PPPPPPPPPPPPPPP>
##$VTLIST= <TTTTTTTTTTTTTTT>
##$WBST= 2048
##$WBSW= 25
##$XGAIN= (0..3)
0 0 0 0
##$XL= 0
##$YL= 0
##$YMAX_a= 6374793
##$YMIN_a= -14251462
##$ZGOPTNS= <>
##$ZL1= 120
##$ZL2= 120
##$ZL3= 120
##$ZL4= 120
##$ABSF1= 14.96105
##$ABSF2= -5.597132
##$ABSG= 5
##$ABSL= 3
##$ALPHA= 0
##$AQORDER= 0
##$ASSFAC= 0
##$ASSFACI= 0
##$ASSFACX= 0
##$ASSWID= 0
##$AUNMP= <proc_prof1d_extract.lims>
##$AXLEFT= 0
##$AXNAME= <>
##$AXNUC= <1H>
##$AXRIGHT= 0
##$AXTYPE= 0
##$AXUNIT= <>
##$AZFE= 0.1
##$AZFW= 0.1
##$BCFW= 0
##$BC_mod= 0
##$BYTORDP= 0
##$COROFFS= 0
##$CY= 15
##$DATMOD= 1
##$DC= 0
##$DFILT= <>
##$DTYPP= 0
##$F1P= 0
##$F2P= 0
##$FCOR= 0.5
##$FTSIZE= 131072
##$FT_mod= 6
##$GAMMA= 0
##$GB= 0
##$INTBC= 1
##$INTSCL= 1
##$ISEN= 128
##$LB= 0.3
##$LEV0= 0
##$LPBIN= 0
##$MAXI= 10000
##$MC2= 0
##$MEAN= 0
##$ME_mod= 0
##$MI= 0
##$NCOEF= 0
##$NC_proc= -2
##$NLEV= 6
##$NOISF1= 0
##$NOISF2= 0
##$NSP= 0
##$NTH_PI= 0
##$NZP= 0
##$OFFSET= 14.96105
##$PC= 1
##$PHC0= -77.90955
##$PHC1= 0
##$PH_mod= 1
##$PKNL= yes
##$PPARMOD= 0
##$PPDIAG= 0
##$PPIPTYP= 0
##$PPMPNUM= 2147483647
##$PPRESOL= 1
##$PSCAL= 4
##$PSIGN= 0
##$PYNMP= <proc.py>
##$REVERSE= no
##$SF= 400.020009615657
##$SI= 131072
##$SIGF1= 0
##$SIGF2= 0
##$SINO= 400
##$SIOLD= 131072
##$SPECTYP= <>
##$SREGLST= <1H.CDCl3>
##$SSB= 0
##$STSI= 131072
##$STSR= 0
##$SW_p= 8223.68421052631
##$SYMM= 0
##$S_DEV= 0
##$TDeff= 65536
##$TDoff= 0
##$TI= <>
##$TILT= no
##$TM1= 0
##$TM2= 0
##$TOPLEV= 0
##$USERP1= <user>
##$USERP2= <user>
##$USERP3= <user>
##$USERP4= <user>
##$USERP5= <user>
##$WDW= 1
##$XDIM= 131072
##$YMAX_p= 447645195
##$YMIN_p= -11184
##$CURPLOT= <Network HP LaserJet P1505>
##$CURPRIN= <$Network HP LaserJet P1505>
##$DFORMAT= <normdp>
##$LAYOUT= <+/1D_H.xwp>
##$LFORMAT= <normlp>
##$PFORMAT= <normpl>
##$SURQMSG= 1
$$ End of Bruker specific parameters
$$ ---------------------------------
##NTUPLES= NMR SPECTRUM
##VAR_NAME=  FREQUENCY,     SPECTRUM/REAL,   SPECTRUM/IMAG
##SYMBOL=    X,             R,               I
##VAR_TYPE=  INDEPENDENT,   DEPENDENT,       DEPENDENT
##VAR_FORM=  AFFN,          ASDF,            ASDF
##VAR_DIM=   131072,        131072,          131072
##UNITS=     HZ,            ARBITRARY UNITS, ARBITRARY UNITS
##FACTOR=    0.0627417313425164, 1,          1
##FIRST=     8223.62146879497, 4457,         -71031
##LAST=      0,             7133,            -70227
##MIN=       0,             -11184,          0
##MAX=       8223.62146879497, 447645195,    0
$$ Real data points
##PAGE= N=1
##DATA TABLE= (X++(R..R)), XYDATA
$$ [...]
61614D54093o613o001n539n411n174m480l674l336l517l806l972m219m666m906
61600C88779m321k904j467q02q61j059j209j621k262k560k311k183k746l424l176
61585C55873k013j081j139j631j561q34k06j51l17j96J03R7k57m71l29k35m79
61568C45173o06q5P46J102R89J150J746K007J546J135J586K545L086L003K753
61553C67876K545K242J924J789J636J127M82K30L67L74R7q6J8J54J46J53K09J01
61535C81384q9J14Q87J695J932J641J311J157Q79J24j044k098k533k354j997j749
61519C79260j528j300j311j573j541q23J04M66K57J15K77L90L38M92J045J705
61503C76373K226K653K922K832K532K470K670K732K699L180M275N113M947M095
$$ plain form
61614 454093 447480 441479 435940 430529 425355 420875 417201 413865 410348 406542 402570 398351 393685 388779
61600 388779 384458 381554 380087 379285 378424 377365 376156 374535 372273 369713 367402 365219 362473 359049 355873
61585 355873 353860 352779 351640 350009 348448 347614 347408 347257 346940 346744 346847 346944 346687 346216 345887 345652 345173
61568 345173 344567 344482 345228 346330 347319 348469 350215 352222 353768 354903 356489 359034 362120 365123 367876
61553 367876 370421 372663 374587 376376 378012 379139 379621 379851 380218 380592 380689 380603 380621 380775 380921 381074 381283 381384
61535 381384 381295 381409 382296 383991 385923 387564 388875 390032 390911 391035 389991 387893 385360 383006 381009 379260
61519 379260 377732 376432 375121 373548 372007 371184 371288 371754 372011 372126 372403 372793 373131 373623 374668 376373
61503 376373 378599 381252 384174 387006 389538 392008 394678 397410 400109 403289 407564 412677 417624 421719
61489D21719L306K730K153J690J584J630J412R62O34N56O58J031J695K349K851
61474D46960L672N168O620O795N517L914K954K399J497P6j477k876m076m945n275
61459D66923n083m673m377m409m787n224n220m499l351k321j592q65J14J122J717
61444D23475J771J596J589J910K417K748K516J698Q18M44M39R3q28j584j408n35
61428D37159K49O92J033J063K68r47j159L14K279L047K503J998K403L167L365
61413D57434K945K512K297J877Q67m42j280j188n46j63l77p67p69l74k8n0l41
61396D61607n81n73m50n76j081j476j091j1Q99J121J120J475J913J892J755K415
61380D68358L930N251N577N228M923M901N097N595O308O658O115M911L705K756
$$ plain form
61489 421719 425025 427755 429908 431598 433182 434812 436224 437186 437820 438376 439034 440065 441760 444109 446960
61474 446960 450632 455800 462420 469215 474732 478646 481600 483999 485496 485572 484095 481219 477143 472198 466923
61459 466923 461840 457167 452790 448381 443594 438370 433150 428651 425300 422979 421387 420522 420636 421758 423475
61444 423475 425246 426842 428431 430341 432758 435506 438022 439720 440538 440982 441421 441514 440686 439102 437694 437159
61428 437159 437408 438100 439133 440196 440464 439517 438358 438672 440951 443998 446501 448499 450902 454069 457434
61413 457434 460379 462891 465188 467065 467932 467490 466210 465022 464476 464313 463936 463169 462400 462026 461998 461948 461607
61396 461607 461026 460453 460003 459427 458346 456870 455779 455768 456667 457788 458908 460383 462296 464188 465943 468358
61380 468358 472288 477539 483116 488344 493267 498168 503265 508860 515168 521826 527941 532852 536557 539313
61366E39313J805O35o68j953l063l728l835l761m035m597m860m543m029l634l017
61351D96030j737q7J129J584J687J815J808J418R00P71J090J417J449J359J393
61336E12026J449J309J129J326J973K520K362J538O82L12L93O64J079J676K188
61321E32626K217J824J612K015K810L533M108M807N804P129Q861J0928J2774J3719
61307F14767J3808J3896J4740J6236J7744J8770J9199J9041J8277J6767J4258
61296G97503J0681O550K765k11k741n363q044j0344j2031j3145j3674j3645j3448
61283G24853j3582j4002j4070j3323j1966j0535r323q287p220n863m071k120o98
61270F09793l17o93r73o46k3K49k2m87q05r05o68J92J599K880L493L698M000M089
$$ plain form
61366 539313 541118 541753 541085 539132 536069 532341 528506 524745 520710 516113 511253 506710 502681 499047 496030
61351 496030 494293 494206 495335 496919 498606 500421 502229 503647 504547 505318 506408 507825 509274 510633 512026
61336 512026 513475 514784 515913 517239 519212 521732 524094 525632 526314 526626 527019 527683 528762 530438 532626
61321 532626 534843 536667 538279 540294 543104 546637 550745 555552 561356 568485 577346 588274 601048 614767
61307 614767 628575 642471 657211 673447 691191 709961 729160 748201 766478 783245 797503
61296 797503 808184 814734 817499 817288 814547 809184 801140 790796 778765 765620 751946 738301 724853
61283 724853 711271 697269 683199 669876 657910 647375 638052 629765 622545 616682 612611 610491 609793
61270 609793 609476 608783 607810 607164 607141 607390 607368 606881 606076 605171 604503 604695 606294 609174 612667 616365 620365 624454
61252F24454L219J612N58Q03J630K104K334K728K807J871N10J07Q27J285N20p47
61236F46622j306j073q02q43q76n73J10J129K408L771N154O732Q548J0269J1596
61221F90866J2654J3635J4274J4090J3066J1719J0603R963R779R861R949R888
61209H30347R634R019P836O276M946M145L562K966K731L166L769L891L839M476
61195I00603N837P049P760Q682J0347J2043J2529J1330Q865N757K531l24k546
61182I90463m189n327n933o333p255q910j0491j1216j1517j2366j3685j4352j3916
61169H64973j3252j3193j3361j3022j2366j2167j2499j2670j2343j1975j2012
61158G26113j2196j1994j1261j0251r166q007o693n226l757k577j840j334p16
$$ plain form
61252 624454 627673 629285 629843 630646 632276 634380 636714 639442 642249 644120 644630 644737 645564 646849 647369 646622
61236 646622 645316 644243 643441 642598 641722 641149 641259 642388 644796 648567 653721 660453 669001 679270 690866
61221 690866 703520 717155 731429 745519 758585 770304 780907 790870 800649 810510 820459 830347
61209 830347 839981 849000 856836 863112 868058 872203 875765 878731 881462 884628 888397 892288 896127 900603
61195 900603 906440 913489 921249 929931 940278 952321 964850 976180 985045 990802 993333 993009 990463
61182 990463 986274 980947 975014 968681 961426 952516 942025 930809 919292 906926 893241 878889 864973
61169 864973 851721 838528 825167 812145 799779 787612 775113 762443 750100 738125 726113
61158 726113 713917 701923 690662 680411 671245 663238 656545 651319 647562 644985 643145 641811 641095
61145F41095kM23L31p3n77j272k183k870k839k183j432q24j30P95J741K590L565
61128F36155M763N771O207O448P397R414J1864J3879J5305J6724J8627K0869K2894
61115G96317K4306K5085K5373K5320K5155K5192K5593K6114K6330K6015K5247
61104A076047K4098K2474K0352J7997J5763J3722J1608R068N874K001k313o513
61092A210178r975j2387j3944j5158j6356j7345j7509j6447j4541j2723j1524
61081A052269j0506q807o148l034m6K742N519Q250J0735J2946J5113J7407J9695
61068A116135K1613K2826K3293K3420K3841K4823K5860K6012K4873K2990K1235
61057A376921J9750J7843J4974J1535Q428N962L601Q39k052m376n867o945q123
$$ plain form
61145 641095 641093 641516 641847 641774 641197 639925 637742 634872 632033 629850 628418 627594 627464 628259 630000 632590 636155
61128 636155 640918 646689 652896 659344 666741 676155 688019 701898 717203 733927 752554 773423 796317
61115 796317 820623 845708 871081 896401 921556 946748 972341 998455 1024785 1050800 1076047
61104 1076047 1100145 1122619 1142971 1160968 1176731 1190453 1202061 1211129 1217003 1219004 1216691 1210178
61092 1210178 1200203 1187816 1173872 1158714 1142358 1125013 1107504 1091057 1076516 1063793 1052269
61081 1052269 1041763 1032956 1026808 1023774 1023728 1026470 1031989 1040239 1050974 1063920 1079033 1096440 1116135
61068 1116135 1137748 1160574 1183867 1207287 1231128 1255951 1281811 1307823 1332696 1355686 1376921
61057 1376921 1396671 1414514 1429488 1441023 1449451 1455413 1459014 1459853 1457801 1453425 1447558 1440613 1432490
61044A432490r437j0448j0668r991q754p322n692l657j401N04J835L051M579O135
61030A381224P296Q399J0217J2844J5618J8163K0771K3654K6551K9265L1888L4180
61018A620070L5585L6396L8157M2280M8747N6815O6379P7776R0643J04044J17612
61007B334504J32037J48701J69745J98182K36885K87324L49866M25001N13665
60998D795910O17252P39023Q85221J063234J278739J534340J823712K113184K322413
60989A7173028K336852K068232J527280Q43756K07388k25015l86289k96791l8336
60980B3210105K61346M44867L72783n683o13178j278778j826497k152816k246731
60971A6165418k159474j961818j716126j465767j234487j031004q56045p07921
$$ plain form
61044 1432490 1423053 1412605 1401937 1391946 1383192 1375870 1370178 1366521 1365120 1365624 1367459 1370510 1375089 1381224
61030 1381224 1388520 1396919 1407136 1419980 1435598 1453761 1474532 1498186 1524737 1554002 1585890 1620070
61018 1620070 1655655 1692051 1730208 1772488 1821235 1878050 1944429 2022205 2112848 2216892 2334504
61007 2334504 2466541 2615242 2784987 2983169 3220054 3507378 3857244 4282245 4795910
60998 4795910 5413162 6152185 7037406 8100640 9379379 10913719 12737431 14850615 17173028
60989 17173028 19509880 21578112 23105392 23949148 24156536 23931521 23545232 23248441 23210105
60980 23210105 23471451 23916318 24289101 24283418 23670240 22391462 20564965 18412149 16165418
60971 16165418 14005944 12044126 10328000 8862233 7627746 6596742 5740697 5032776
60963E032776n84380m82358l98344l29484k74088k30977j98365j73343j52737
60954B208700j34697j19208j06565r5745q5071p4247o4565n6811n0087m3410l7581
60943A340713l4389l4268l5701l6881l7155l6686l5577l3852l1861l0105k8660
60932I65578k7135k5182k2897k0690j8877j7500j6374j5212j3779j2076j0353
60921G65503q852p610o672o319o714p353p366o579n742n379m905l545j809j092
60907F85566j842k896l026k402k057k461l267m137n065n898o187n822n431n770
60893F29305o796p687p798p358p067p176p277o955o220n258m215l530l917n441
60879E42610o944p155o202n279m864m209k844j607j473k091k268j610p89l40J3
$$ plain form
60963 5032776 4448396 3966038 3567694 3238210 2964122 2733145 2534780 2361437 2208700
60954 2208700 2074003 1954795 1848230 1752485 1667414 1593167 1528602 1471791 1421704 1378294 1340713
60943 1340713 1306324 1272056 1236355 1199474 1162319 1125633 1090056 1056204 1024343 994238 965578
60932 965578 938443 913261 890364 869674 850797 833297 816923 801711 787932 775856 765503
60921 765503 756651 749041 742369 736050 729336 721983 714617 708038 702296 696917 692012 688467 686658 685566
60907 685566 683724 680828 677802 675400 673343 670882 667615 663478 658413 652515 646328 640506 635075 629305
60893 629305 622509 614822 607024 599666 592599 585423 578146 571191 564971 559713 555498 551968 548051 542610
60879 542610 535666 528511 522309 517030 512166 507957 505113 503506 502033 499942 497674 496064 495275 494935 494948
60864D94948P40J812K856L630M095M285M337M498M943N614O248O513O165N222
60850E55906L989K807J817J065P56J143K173L324L890L391J793m25k476l764m394
60835E70995n084o380p969q940q877q361q181q228p686o345n084m729m909m643
60821D75579l746l004l023l591m210m714n138n458n632n643n398m879m367m108
60807D12668l851l170k193j468j163j015j000j263j367o20O91J401J169J032J744
60792D01595K644K910K840K939K733J770R45J418K713L346L014K682K644K127
60778D36320R86J86J67N5q21j788k006j799j963k486k781k654k321j831j159n64
60762D15541k76j31N4P9k48o43p66p68r81j286j243o39M24J618K287J730J15j298
$$ plain form
60864 494948 495688 497500 500356 503986 508081 512366 516703 521201 526144 531758 538006 544519 550684 555906
60850 555906 559895 562702 564519 565584 566340 567483 569656 572980 576870 580261 582054 581629 579153 575389 570995
60835 570995 565911 559531 551562 542622 533745 525384 517203 508975 501289 494944 489860 485131 480222 475579
60821 475579 471833 468829 465806 462215 458005 453291 448153 442695 437063 431420 426022 421143 416776 412668
60807 412668 408817 405647 403454 401986 400823 399808 398808 397545 396178 395558 396249 397650 398819 399851 401595
60792 401595 404239 407149 409989 412928 415661 417431 418376 419794 422507 425853 428867 431549 434193 436320
60778 436320 437306 437492 437659 437714 436893 435105 433099 431300 429337 426851 424070 421416 419095 417264 416105 415541
60762 415541 415265 415134 415188 415267 415019 414376 413610 412842 411861 410575 409332 408693 409117 410735 413022 414752 414867 413569
60744D13569j419n59J79L50L24K27l49j506k688l435l881m241m256l588k402j235
60728C85090m68j90l19n81n00J96J223K010K304K332K375K495K652K883L149L257
60712D07908L092K787K438J850R22J15Q8P85J380J323R68Q93J028R11M33j89r59
60695D25773j965k878l180k904k565k370k049j529j189j214j298j195j083j127
60681C99227j131q84m77j7N55J168J570J816K279K940L209K809K272K050J722
60666D19108P35n50j350j677k191k968l326l019k709k897l068k428j029L45J205
60651C94181J716K133K329K095J682J753K629L702L821K459L68j099j356j017
60637D15396j014j528k019k074j926k014k320k342j751p85kK53Om25n75r2Q03
$$ plain form
60744 413569 412150 411591 411770 412120 412444 412671 412322 410816 408128 404693 400812 396571 392315 388727 386325 385090
60728 385090 384622 384432 384113 383532 383032 383228 384451 386461 388765 391097 393472 395967 398619 401502 404651 407908
60712 407908 411000 413787 416225 418075 418997 419112 419200 419985 421365 422688 423656 424549 425577 426488 426921 426732 425773
60695 425773 423808 420930 417750 414846 412281 409911 407862 406333 405144 403930 402632 401437 400354 399227
60681 399227 398096 397212 396735 396718 397273 398441 400011 401827 404106 407046 410255 413064 415336 417386 419108
60666 419108 419843 419293 417943 416266 414075 411107 407781 404762 402053 399156 396088 393660 392631 392976 394181
60651 394181 395897 398030 400359 402454 404136 405889 408518 412220 416041 418500 418868 417769 416413 415396
60637 415396 414382 412854 410835 408761 406835 404821 402501 400159 398408 397623 397621 397874 397880 397455 396880 396788 397591
60620C97591J304Q54j15o43l40L22P96R49P58J11p41j116o54J55O53Q73J264J842
60602D03863K058J530M83m97r58q47m83k12n3K39P39J303J903K600L086K817J902
60585D19473J297J635K302K304J605J010R41J090J171J279J474J573J512J479
60571D40145J644K110L061M579O330P896R283J0668J1804J2309J2399J2624J2828
60558E47680J2132J0140P431M640J763j170l498m632m914n103n281m867l569j789
60544E48963p3J397K768M235N862P505Q988J0431J2214J4480J6900J9195K1544
60531F74409K4189K6801K8656K9308K8734K6817K3171J7555J0346K508m770j0546
60519H77178j4529j7098j8751j9582j9367j8133j6343j4548j3033j1735j0318
$$ plain form
60620 397591 398895 399749 399634 398991 398651 398973 399769 400718 401476 401587 400846 399730 399076 399231 399884 400757 402021 403863
60602 403863 405921 407451 407934 407437 406479 405632 405149 404937 404884 405123 405862 407165 409068 411668 414754 417571 419473
60585 419473 420770 422405 424707 427011 428616 429626 430567 431657 432828 434107 435581 437154 438666 440145
60571 440145 441789 443899 446960 451539 457869 465765 475048 485716 497520 509829 522228 534852 547680
60558 547680 559812 569952 577383 582023 583786 582616 579118 574486 569572 564469 559188 554321 550752 548963
60544 548963 548890 550287 553055 557290 563152 570657 579645 590076 602290 616770 633670 652865 674409
60531 674409 698598 725399 754055 783363 812097 838914 862085 879640 889986 892494 887724 877178
60519 877178 862649 845551 826800 807218 787851 769718 753375 738827 725794 714059 703741
60508G03741q313n574k612k77J103K151L898O907J0903J5147J9111K2892K6975
60495G96052L1540L6084L9976M3262M6487M9615N1620N1403M8812M4425L8739
60484A278015L2207K5847K1000J8111J6230J3950J0426N268j926j1298k2148l3210
60472A352472m3456n2289n9083o3208o4580o3722o1091n6769n1014m4704l8882
60461G53674l4011k9915k6284k2982k0092j7859j6426j5493j4400j2787j0936
60450E32489r284p864o545n502m956m599l844k748k141k561l493l919l447k531
60436D69055j768j311j019q03p11p62r22j172j446j530j160l83L15M11j16p28
60420D55950q50m19J44M11L44J78N6p0j11L26J379K395K443J587R53J237J754
$$ plain form
60508 703741 695428 689854 687242 686965 688068 690219 694117 701024 711927 727074 746185 769077 796052
60495 796052 827592 863676 903652 946914 993401 1043016 1094636 1146039 1194851 1239276 1278015
60484 1278015 1310222 1336069 1357069 1375180 1391410 1405360 1415786 1421054 1419128 1407830 1385682 1352472
60472 1352472 1309016 1256727 1197644 1134436 1069856 1006134 945043 888274 837260 792556 753674
60461 753674 719663 689748 663464 640482 620390 602531 586105 570612 556212 543425 532489
60450 532489 523205 515341 508796 503294 498338 493739 489895 487147 485006 482445 478952 475033 471586 469055
60436 469055 467287 465976 464957 464154 463443 462681 461759 460587 459141 457611 456451 456068 456383 456794 456678 455950
60420 455950 455100 454681 454825 455236 455580 455758 455814 455744 455633 455959 457338 459733 462176 463763 464716 465953 467707
60403D67707J644J375J971L131L409K459J730K359L537L839L267K889L055L192
60389E05564L063L125L543L842L719L452L358L420L593L902M082L683K750J856
60375E52952J403J274J322J586J942K097K144K485K977K783J537J03m09RM54M21
60359E75080K84N18J073J694K437L527M867N976O487O576O808P498Q334Q687Q183
60344F48029P010N648M423L161J341j197l710n111n225n050n461o121o227n831
60330F25679n649n796n666n110m790n148n754o122o398o702o412m906k701j120
60316E53405p80r61n70N98J857K677L494N247Q067J0846J2402J2865J3344J4380
60302F36871J5424J5965J6340J6943J7270J6409J4215J1305P998L837j696q293
$$ plain form
60403 467707 469351 470726 472697 475828 479237 481696 483426 485785 489322 493161 496428 499317 502372 505564
60389 505564 508627 511752 515295 519137 522856 526308 529666 533086 536679 540581 544663 548346 551096 552952
60375 552952 554355 555629 556951 558537 560479 562576 564720 567205 570182 572965 574502 574605 574196 574205 574659 575080
60359 575080 575364 575882 576955 578649 581086 584613 589480 595456 601943 608519 615327 622825 631159 639846 648029
60344 648029 655039 660687 665110 668271 669612 668415 664705 659594 654369 649319 643858 637737 631510 625679
60330 625679 620030 614234 608568 603458 598668 593520 587766 581644 575246 568544 562132 557226 554525 553405
60316 553405 552625 551664 551094 551692 553549 556226 559720 564967 573034 583880 596282 609147 622491 636871
60302 636871 652295 668260 684600 701543 718813 735222 749437 760742 768740 772577 770881 762588
60290G62588j4740j9619k2180k2675k1875k0267j7898j4887j1706q847o541m946
60278E76407m166l973l842l567l454l645l786l648l616m000m325l960l176k831
60264E24418l046l009k220j265j061j662k253k068j104J3O76P82O18M27K38J00
60248E09584J87M41M74J05j89K23J289K283K591K190J385M96k34p07j021j207
60232E17890r77j02J004J573J486J596K665M306N369N327M791M646M976N204N079
60217E64833N109N863P114Q002P999P393O892P013P852R120J0235J0665J0358
60204F68448R686Q933Q123P387P086P321P692P813P746P569O953N602L917K631
60190G66907J896J241L89m51j193k227l905n903p381p714p000o010n581n894o300
$$ plain form
60290 762588 747848 728229 706049 683374 661499 641232 623334 608447 596741 587894 581353 576407
60278 576407 572241 568268 564426 560859 557405 553760 549974 546326 542710 538710 534385 530425 527249 524418
60264 524418 521372 518363 516143 514878 513817 512155 509902 507834 506730 506743 507419 508201 508819 509246 509484 509584
60248 509584 509771 510212 510686 510791 510602 510825 512114 514397 516988 519178 520563 521059 520825 520118 519097 517890
60232 517890 516913 516811 517815 519388 520874 522470 525135 529441 534810 540137 544928 549574 554550 559754 564833
60217 564833 569942 575805 582919 590921 598920 606313 613205 620218 628070 637190 647425 658090 668448
60204 668448 678134 687067 695190 702577 709663 716984 724676 732489 740235 747804 754757 760359 764276 766907
60190 766907 768803 770044 770433 769982 768789 766562 762657 756754 749373 741659 734659 728649 723068 717174 710874
60175G10874o003m943l857l478l828m279m148l301k250j678j770k130k391k647
60161F64171l067l402l295k896k649k529k037j042j53M6k17k51J74O00N50J33
60145F44136j41LL87P68J211J856K477K623K274K020K381L280M287N113N609N684
60129F83968N536N645O062O066N084L650K788K629K375J692J256J702K740L739
60115G34932M565N387O172O811P365P746P472O342N022M379M365M098L039J502
60101H09197jj311k450l292l683l561k846j561k32L17j05p03o88l54o46j863l368
60084G82850m570n520o319o649o318n848n944o546p011p046o987p136p402p648
60070F91906p947q319q611q711q607q134p193o230n919o168o078n241m416m335
$$ plain form
60175 710874 704871 699928 696071 692593 688765 684486 680338 677037 674787 673109 671339 669209 666818 664171
60161 664171 661104 657702 654407 651511 648862 646333 644296 643254 643101 643147 642930 642679 642853 643453 644003 644136
60145 644136 643995 643998 644385 645153 646364 648220 650697 653320 655594 657614 659995 663275 667562 672675 678284 683968
60129 683968 689504 695149 701211 707277 712361 716011 718799 721428 723803 725495 726751 728453 731193 734932
60115 734932 739497 744884 751056 757867 765232 772978 780450 786792 791814 796193 800558 804656 807695 809197
60101 809197 809196 807885 805435 802143 798460 794899 792053 790492 790260 790577 790472 789769 789081 788727 788081 786218 782850
60084 782850 778280 772760 766441 759792 753474 747626 741682 735136 728125 721079 714092 706956 699554 691906
60070 691906 683959 675640 667029 658318 649711 641577 634384 628154 622235 616067 609989 604748 600332 595997
60056E95997m478l876k666j928k006k038j300j92N43Q64J228J782K337K873L551
60041E90691M330N008N551O097O531O426N574M402L584L329L219K843K276J760
60027F51621J117j1j369k155k143k329l824o378q535r276r005q738q852q923q560
60012E72640p935p388o839n887m507l319k829k643j914o11L16K27l42n34l77m80
59996E27578r07j102p97l36o4P4K41N77J328K617M102N235N857O067N713M656
59980E60839L462K975L078K684J228n69j756k216k272k010j640j830k879l957
59966E55137l959k964k017j660j431q28q4L39M87P99J544K585L519L933L650K891
59950E61941K042J271N08k17n96l25N25J532K205K255J684P70k6l18j00K10J60
$$ plain form
60056 595997 591519 587643 584977 583049 581043 579005 577705 577513 578056 578920 580148 581930 584267 587140 590691
60041 590691 595021 600029 605580 611677 618208 624634 630208 634610 638194 641523 644742 647585 649861 651621
60027 651621 652738 652727 651358 649203 647060 644731 640907 634529 625994 616718 607713 598975 590123 581200 572640
60012 572640 564705 557317 550478 544591 540084 536765 533936 531293 529379 528768 529084 529311 528969 528435 528058 527578
59996 527578 526671 525569 524772 524436 524372 524446 524687 525264 526592 529209 533311 538546 544403 550470 556183 560839
59980 560839 564301 567276 570354 573038 574266 573697 571941 569725 567453 565443 563803 561973 559094 555137
59966 555137 551178 548214 546197 544537 543106 542278 542194 542533 543020 543819 545363 547948 551467 555400 559050 561941
59950 561941 563983 565254 565762 565545 564949 564624 565149 566681 568886 571141 572825 573595 573569 573251 573151 573361 573521
59933E73521k43n26l36K27R67K093L952O328Q397R462R492Q876P878O471M549
59918F41108K251Q6j247j435q28j3P76J587K256K431K083J526R57L90m7k54n96
59901F51031j533k722l258k983k770l044k957j725r0O16M68R25K788N171O795
59886F46712P501Q016Q733R287R213Q604P962P590P325O956O737P064P680P745
59872G57125O881N657M655L611K029J89j239k168k919l297k863k059k029k999
59858G60574l846l705l117k928k920k371j441r59j062j024m59J47L27L80R03K103
59842G40602L807N737P397P973O892M448J726k09r85q69j95J055K938M820N418
59827G90555M034J542m42j347j972k871l350k598j163l95o68j032o36L00J096
$$ plain form
59933 573521 573278 572752 572416 572643 573610 575703 579655 585983 594380 603842 613334 622210 630088 636559 641108
59918 641108 643359 643445 642198 640763 639935 639922 640698 642285 644541 646972 649055 650581 651538 651928 651881 651627 651031
59901 651031 649498 646776 643518 640535 637765 634721 631764 630039 629949 630565 631033 631958 634746 639917 646712
59886 646712 654213 662229 670962 680249 689462 698066 706028 713618 720943 727899 734636 741700 749380 757125
59872 757125 764006 769663 774318 777929 779958 780147 778908 776740 773821 770524 767661 765602 763573 760574
59858 760574 756728 753023 749906 746978 744058 741687 740246 739287 738225 737201 736742 736889 737216 737596 738499 740602
59842 740602 744409 750146 757543 765516 772408 776856 778582 778373 777388 776519 776324 777379 780317 785137 790555
59827 790555 794589 796131 795689 794342 792370 789499 786149 783551 782388 781993 781325 780293 779657 779957 781053
59812G81053J576K056K749L450L618K736Q24j386l204m727o365p770q030p107
59798G59473o203o310p061p559p665p775p828p386o454n549n004m761m662m521
59784F70735m119l561l332l560l607k946k009j433r07L14K020L164L353L271L581
59769F60964M305N313O551P668Q270Q611R217R787R429Q107O859O344O184O050
59755G63659O190O559O569O254O552P694Q496Q067P145O748O552N752M653M029
59741H54919L591K494R21k08p67j315j784j600j058j129j871k302j964j411r94
59726H45522m52R1M9l08K26J918L365L379K599K267K396K170J474Q67M80M5k04
59709H65884L48J659K979L847M452N013N462N900O692P819Q725R065R248R802
$$ plain form
59812 781053 782629 784685 787434 790884 794502 797238 798062 796676 793472 788745 782380 774610 766580 759473
59798 759473 753270 746960 739899 732340 724675 716900 709072 701686 695232 689683 684679 679918 675256 670735
59784 670735 666616 663055 659723 656163 652556 649610 647601 646168 645261 645575 647595 650759 654112 657383 660964
59769 660964 665269 670582 677133 684801 693071 701682 710899 720686 730115 738222 745081 751425 757609 763659
59755 763659 769849 776408 782977 789231 795783 803477 811973 820040 827185 833933 840485 846237 850890 854919
59741 854919 858510 861004 861925 861717 860950 859635 857851 856251 855193 854064 852193 849891 847927 846516 845522
59726 845522 845070 845161 845210 844902 845128 847046 850411 853790 856389 858656 861052 863222 864696 865563 866043 866088 865884
59709 865884 866232 867891 870870 874717 879169 884182 889644 895544 902236 910055 918780 927845 937093 946895
59695I46895J0555J0872J0616J0423J0928J1855J2097J0660P485L407n92l971
59683A041230o601q350q942q364p319p013q176j0288j2036j2567j2063j1102r922
59670I18487q647p762p738q251q336p417n772l905j937J99K322M101N356O114
59656H76814O612P383Q995J1403J3848J5631J6763J7560J7791J6726J3886R405
59644A032817L681k837r451j5228j9529k2344k3957k4537k4196k3170k1558j9203
59632H30488j6183j3251j1191r829q326o567n504n753o536o741o463o676p644
59619G19824q594q922q802q458p725o670n890n725n789n684n511n241m323k536
59605F29954p45M8j2M2N98J199J384J158O96K34J65O48J206J319J261J667K401
$$ plain form
59695 946895 957450 968322 978938 989361 1000289 1012144 1024241 1034901 1042386 1045793 1045201 1041230
59683 1041230 1034629 1026279 1017337 1008973 1001654 994641 986465 976177 964141 951574 939511 928409 918487
59670 918487 909840 902078 894340 886089 877753 870336 864564 860659 858722 858921 861243 865344 870700 876814
59656 876814 883426 890809 899804 911207 925055 940686 957449 975009 992800 1009526 1023412 1032817
59644 1032817 1036498 1033661 1024210 1008982 989453 967109 943152 918615 894419 871249 849691 830488
59632 830488 814305 801054 789863 780034 771708 765141 759637 753884 747348 740607 734144 727468 719824
59619 719824 711230 702308 693506 685048 677323 670653 664763 659038 653249 647565 642054 636813 632490 629954
59605 629954 629209 629257 629245 629287 629885 631084 632468 633626 634322 634556 634721 635369 636575 637894 639155 640822 643223
59588F43223K625K066J418J300J485J418R22O2j107k320l102l355l574m153m818
59573F32090n110n049m968m875m460l663k865k437k295k007j344n87k40l92o02
59558E91196m59q6J05j7k34l28k13J30O06J002J287J734K515L393M119M818N569
59541F15137N994N779N466N987P618R952J2867J6646K0941K4241K4652K1051J3703
59528G90034M372m135r406j0914r929q009n978m136k730j861j428j393j756k337
59514G30394l064m287o165p819q031o880n832n921o710p274p333o894n793m240
59500F44151l129l010l316l204k673k177j680p94M85J815K952L656L623L092K983
59485F42774L808M876N333N435N935O691O966O860P261Q313R107R065Q719Q690
$$ plain form
59588 643223 645848 647914 649332 650632 652117 653535 654457 654519 653412 651092 647990 644635 641061 636908 632090
59573 632090 626980 621931 616963 612088 607628 603965 601100 598663 596368 594361 593017 592430 592190 591798 591196
59558 591196 590737 590651 590756 590739 590505 590177 589964 590094 590700 591702 592989 594723 597238 600631 604750 609568 615137
59541 615137 621131 626910 632376 638363 645981 655933 668800 685446 706387 730628 755280 776331 790034
59528 790034 794406 790271 780865 769951 760022 752013 746035 741899 739169 737308 735880 734487 732731 730394
59514 730394 727330 723043 716878 709059 701028 694148 688316 682395 675685 668411 661078 654184 648391 644151
59500 644151 641022 638012 634696 631492 628819 626642 624962 624168 624653 626468 629420 633076 636699 639791 642774
59485 642774 646582 651458 656791 662226 668161 674852 681818 688678 695939 704252 713359 722424 731143 739833
59471G39833Q743Q367P572O546N053K795J50k098l630m713n466n491m440k673
59457G50548j026R2J095K570M459O157P355Q314R254R909R976R670R377R040Q194
59442H44984O533M073J022k175m813o423p264p907q351q054o860n447m593m393
59428G90332m387m233l978l760l494k827j266J497N173Q778J1245J2362J3021
59415H18463J4282J6276J8238J9650K0936K2936K6010K9709L2687L2557K6797
59404A078541J5047N49j1708j8509j9791j6979j1299l760M517J2601J9371K2385
59392A070965J8623P665o619j8854k6275k9331k9211k6570k2468j8537j5523j2781
59380H91084r836p452o428o191n452l899k381j624j431j185o87k40j02r3J84P49
$$ plain form
59471 739833 748576 756943 764515 771061 776114 778909 779059 776961 773331 768618 763152 757661 753221 750548
59457 750548 749522 749614 750709 753279 757738 763895 771250 779564 788818 798727 808703 818373 827750 836790 844984
59442 844984 851517 855590 856612 854437 849624 843201 835937 828030 819679 811625 804765 799318 794725 790332
59428 790332 785945 781712 777734 773974 770480 767653 766387 767884 773057 781835 793080 805442 818463
59415 818463 832745 849021 867259 886909 907845 930781 956791 986500 1019187 1051744 1078541
59404 1078541 1093588 1094137 1082429 1063920 1044129 1027150 1015851 1012091 1016608 1029209 1048580 1070965
59392 1070965 1089588 1097253 1090634 1071780 1045505 1016174 986963 960393 937925 919388 903865 891084
59380 891084 881248 873796 867368 861177 855725 851826 849445 847821 846390 845205 844518 844278 844176 844083 844267 845016
59364H45016J143J069Q76J095J680K182K513L020L840M718N676P169R296J1347
59350I00640J2580J3262J4376J6426J8839K0623K1295K1109K0512J9674J8570
59339A097906J7323J6145J4814J2640R268N334J868r18l775p226j0718j3255j4612
59326A124794j5543j6871j8681k0404k1430k1527k0895j9998j9272j8825j8350
59315I12998j7508j6362j5319j4575j3883j3040j2296j1933j1692j1079j0139
59304G65172r273q379o876m815l115k279j426O23L779O975R721J2522J5553J7621
59290G95803J6932J2672N667k241r237j4118j6331j5880j3409j0139p244n083
59278G37392l205j101J325L976O796R615J2102J4100J5744J7126J8188J8925J9229
$$ plain form
59364 845016 846159 847228 848104 849199 850879 853061 855574 858594 862434 867152 872828 879997 889293 900640
59350 900640 913220 926482 940858 957284 976123 996746 1018041 1039150 1059662 1079336 1097906
59339 1097906 1115229 1131374 1146188 1158828 1168096 1173430 1175298 1174380 1170605 1163379 1152661 1139406 1124794
59326 1124794 1109251 1092380 1073699 1053295 1031865 1010338 989443 969445 950173 931348 912998
59315 912998 895490 879128 863809 849234 835351 822311 810015 798082 786390 775311 765172
59304 765172 755899 747520 740644 735829 732714 730435 729009 729632 733411 740386 750107 762629 778182 795803
59290 795803 812735 825407 831074 828833 819596 805478 789147 773267 759858 749719 742475 737392
59278 737392 734187 733086 734411 738387 745183 754798 766900 781000 796744 813870 832058 850983 870212
59265H70212J8520J6237J2945J0121Q526P396N691L382R22j701m496o728p623
59252I33404p464p086o625n700m534l800l410k490o75J366K807L461L615L715
59238I06584M151M824M983M104K664J445L32j338l497n376o690p816q867r590
59224H85913j0194j1231j2488j3070j2785j2400j2314j1978j0956r562q032o114
59212G54789l997k613k356k346j687p16l07n02n73NJ235K790M061M514M334M235
59196G60866M431M472M425N165O889Q323Q320P430O937O950O605N667M773M264
59182H45517L762K968K032J137K73n42j401k656m384n935o635o685o696o607n914
59167H08234m829m296m673n198m970l933k715j969k013k658l215l118k650k615
$$ plain form
59265 870212 888732 904969 917914 928035 936561 943957 949648 953030 953952 952251 947755 941027 933404
59252 933404 925940 918854 912229 906529 901995 898195 894785 892295 891620 892986 895793 899254 902869 906584
59238 906584 910735 915559 920542 924646 927310 928755 929087 927749 924252 918876 912186 904370 895503 885913
59224 885913 875719 864488 852000 838930 826145 813745 801431 789453 778497 768935 760903 754789
59212 754789 750792 748179 745823 743477 741790 741074 740767 740265 739692 739697 740932 743722 747783 752297 756631 760866
59196 760866 765297 769769 774194 779359 786248 794571 802891 810321 817258 824208 830813 836480 841253 845517
59182 845517 849279 852247 854279 855416 855689 855147 853746 851090 846706 840771 834136 827451 820755 814148 808234
59167 808234 803405 799109 794436 789238 784268 780335 777620 775651 773638 770980 767765 764647 761997 759382
59153G59382l286m039m222l873l453l230l161l091k936k794l011l836n018n990
59139G07442o503o825p201p472p361o938o541o297n914m999l533j998r07k67L39
59124F35025J174K101K953L872N102O631Q255R810J1173J2178J2777J3083J3173
59111G37307J2953J2353J1427J0137Q338O169M151K694J666P28k23j063j647j849
59097H03141j738j870k935m737o002n705m282l051k686k780k684k219j607j220
59083G59625j347j947k611l063l472m080m736n133n267n248m994m444l833l369
59069G06081k942k497k320k401k102j098k48o40k026l100l163k668k184j842j868
59054F74982k611l749m328m009l546l650m036m023l430k483j395n15l12p22j018
$$ plain form
59153 759382 756096 752057 747835 743962 740509 737279 734118 731027 728091 725297 722286 718450 713432 707442
59139 707442 700939 694114 686913 679441 672080 665142 658601 652304 646390 641391 637858 635860 634953 634686 635025
59124 635025 636199 638300 641253 645125 650227 656858 665113 674923 686096 698274 711051 724134 737307
59111 737307 750260 762613 774040 784177 792515 798684 802835 805529 807195 807923 807700 806637 804990 803141
59097 803141 801403 799533 796598 791861 785859 780154 775872 772821 770135 767355 764671 762452 760845 759625
59083 759625 758278 756331 753720 750657 747185 743105 738369 733236 727969 722721 717727 713283 709450 706081
59069 706081 703139 700642 698322 695921 693819 692721 692473 691833 689807 686707 683544 680876 678692 676850 674982
59054 674982 672371 668622 664294 660285 656739 653089 649053 645030 641600 639117 637722 637207 636895 636173 635155
59039F35155p49l35k16l9O54J376J234L24k86O8R84J854K679L724M860N706O208
59022F63201O747P722R241J1051J2651J3514J3359J2291J0618Q575O215L579Q79
59009G79643j556l464m750n389n396m948m374l820l031j737j36J289K450L678
58995G48459N013N842N619M636L677L084K610K147K017K343K615K240J387Q21
58981G92510J003J738K753M174O095Q018R249R816J0611J2400J4947J7322J8892
58968I09528J9785K0451K1007K1118K0503J9342J8070J6744J4867J2015Q459M872
58956A106761J568j600m654p357r722j2146j4789j7205j8929k0015k0671k0741
58944I60500j9997j8702j7409j6304j5129j3625j1783r762p869o359n021l208
$$ plain form
59039 635155 634406 634071 633855 633816 634470 635846 637080 637404 637118 637186 638170 640024 642703 646427 651287 656993 663201
59022 663201 669948 677670 686911 697962 710613 724127 737486 749777 760395 768970 775185 778764 779643
59009 779643 778087 774623 769873 764484 759088 754140 749766 745946 742915 741178 741042 742331 744781 748459
58995 748459 753472 759314 764933 769569 773246 776330 778940 781087 783104 785447 788062 790302 791689 792510
58981 792510 793513 795251 798004 802178 808273 816291 825540 835356 845967 858367 873314 890636 909528
58968 909528 929313 949764 970771 991889 1012392 1031734 1049804 1066548 1081415 1093430 1101889 1106761
58956 1106761 1108329 1106729 1102075 1094718 1084996 1072850 1058061 1040856 1021927 1001912 981241 960500
58944 960500 940503 921801 904392 888088 872959 859334 847551 837789 829920 823561 818540 815332
58932H15332p49J521K651K701K337J628J79j571k298j465k18Mq38j680j824j436
58916H14274r26n63n95j000j066N8K193L988M352L704L407M236N801P430R036
58901H54329J0913J2986J4754J5920J6724J7524J8279J8684J8628J8269J7701
58890A034711J6903J6085J5795J6403J7623J8789J9563K0078K0349J9809J7830
58879A233938J4588J1073Q146N841L705J427j055l791o667r160j0730j1430j1814
58866A224071j2163j2234j1822j1139j0504j0024r763r855j0252j0734j1334j2407
58854A091840j3984j5448j6120j5974j5431j4784j4131j3593j3240j2894j2388
58843I33853j1838j1514j1542j1931j2579j3162j3295j3013j2677j2262j1296
$$ plain form
58932 815332 814583 816104 818755 821456 823793 825421 825600 824029 821731 820266 820048 820052 819214 817534 815710 814274
58916 814274 813348 812785 812190 811190 810124 810182 812375 816363 820715 824419 827826 832062 837863 845293 854329
58901 854329 865242 878228 892982 908902 925626 943150 961429 980113 998741 1017010 1034711
58890 1034711 1051614 1067699 1083494 1099897 1117520 1136309 1155872 1175950 1196299 1216108 1233938
58879 1233938 1248526 1259599 1267745 1273586 1277291 1278718 1277663 1273872 1267205 1258045 1247315 1235885 1224071
58866 1224071 1211908 1199674 1187852 1176713 1166209 1156185 1146422 1136567 1126315 1115581 1104247 1091840
58854 1091840 1077856 1062408 1046288 1030314 1014883 1000099 985968 972375 959135 946241 933853
58843 933853 922015 910501 898959 887028 874449 861287 847992 834979 822302 810040 798744
58832G98744r763q413p650o797n180l424k612k582k065m73J473L008M253N529
58818G64048O629P220P436P595P683P455O846O046N374N069M915M208K535N29
58804H43588q11j492k517m349o192p196p633q284r141r490q997q130p490p201
58790G54665o979o494n616m457l179j759m0J924L867N638P314Q872J0071J0859
58776G74686J1628J2700J3735J3907J2644R972O220J636l561q819j3096j5436
58764H16216j5822j5244j4679j4156j3169j1719j0389r460q558p362o106n059
58752F84493m010k643j174k05m8m06o39k72O59J688K490L317M599O153P239P495
58736G08736P324P240P309P521Q132R197J0082J0063R187Q107P206O315N196L854
$$ plain form
58832 798744 788981 780568 772918 766121 760941 757517 754905 752323 750258 749785 751258 754266 758519 764048
58818 764048 770677 777897 785333 792928 800611 808066 814912 820958 826332 831401 836316 840524 843059 843588
58804 843588 842777 841285 838768 834419 828227 821031 813398 805114 795973 786483 777486 769356 761866 754665
58790 754665 747686 741192 735576 731119 727940 726181 726141 728065 731932 737570 744884 753756 763827 774686
58776 774686 786314 799014 812749 826656 839300 849272 855492 857128 853567 844748 831652 816216
58764 816216 800394 785150 770471 756315 743146 731427 721038 711578 703020 695658 689552 684493
58752 684493 680483 677840 676666 676461 676413 676007 675368 675096 675755 677443 679933 683250 687849 694002 701241 708736
58736 708736 716060 723300 730609 738130 746262 755459 765541 775604 784791 792898 800104 806419 811615 815469
58722H15469K347P57o08j276j058j78J088K629M328N885P041P752Q038P789O868
58707H66871N309L223O18k446n589q293j0470j2535j4831j7090j8755j9714k0351
58694G45947k0891k0990k0178j8493j6541j4912j3625j2092r782o929m466l018
58682E84030k275j644j248j639k660l379l283k781k272j451J2J775L293M454N317
58667E76249N811O237P389R533J1886J3685J5084J6078J5475J2125O813J618k465
58654F95518n935r015j0945j1301j0782j0165r473q657q152q139q022p234o018
58641E81680n024m551m497m533m104k903j462o58m74m0R27J634J575J367J626
58626E60563J862J288O8j033j731k143k090j327k15O21J177J889K748L272L415
$$ plain form
58722 815469 817816 818573 817965 816689 815631 815453 816541 819170 823498 829383 836424 844176 852214 860003 866871
58707 866871 872180 875403 876021 873575 867986 859693 849223 836688 821857 804767 786012 766298 745947
58694 745947 725056 704066 683888 665395 648854 633942 620317 608225 598443 591514 587048 584030
58682 584030 581755 580111 578863 577224 574564 571185 567902 565121 562849 561398 561410 563185 566478 570932 576249
58667 576249 582060 588297 595686 605219 617105 630790 645874 661952 677427 689552 696365 697983 695518
58654 695518 689583 680568 669623 658322 647540 637375 627902 619245 611093 602954 594932 587698 581680
58641 581680 576656 572105 567608 563075 558971 556068 554606 553948 553474 553434 554361 555995 557570 558937 560563
58626 560563 562425 563713 563781 562748 561017 558874 556784 555457 555242 555863 557040 558929 561677 564949 568364
58611E68364L837M985O335O862O120M650L351K619K315K375K988L931M310L585
58597F26627K472K042K121J568J27j027r21n0N43P39J273K684M849P275R408J0960
58581F70690J2036J2764J2873J2162J1260J1003J1053J0151Q080O267N943O693
58569G90975P475Q147R161J0622J2534J5312J9003K2586K5048K6783K8913L1459
58557A008018L3125L2783L0386K6459K1543J6154J0733N543R10k682n131p072
58545A170769r113j0998j2096j2491j2978j4108j5872j8260k1387k4915k7827
58534I90724k9155k8806k7573k6279k4960k2976k0059j6910j4363j2292j0042
58523G57309p773o412o191o211n798n245m912m506l841l332l079k427j126o3l
$$ plain form
58611 568364 572201 577186 583521 590383 596503 601153 604504 607123 609438 611813 614801 618732 623042 626627
58597 626627 629099 631141 633262 634830 634957 633930 633009 632959 633502 634241 635514 638198 643047 650322 659730 670690
58581 670690 682726 695490 708363 720525 731785 742788 753841 763992 772072 778339 784282 790975
58569 790975 798450 806597 815758 826380 838914 854226 873229 895815 920863 947646 976559 1008018
58557 1008018 1041143 1073926 1104312 1130771 1152314 1168468 1179201 1184744 1185654 1182972 1177841 1170769
58545 1170769 1161656 1150658 1138562 1126071 1113093 1098985 1083113 1064853 1043466 1018551 990724
58534 990724 961569 932763 905190 878911 853951 830975 810916 794006 779643 767351 757309
58523 757309 749536 743124 736933 730722 724924 719679 714767 710261 706420 703088 700009 697582 696456 696393 696390
58508F96390l98l58J4J98M03J035J639J566J180J304J784J793J275R53J059J148
58492G10985J109J401K198L109L901M771N919P275Q618R646J0261J1114J3229
58479G93536J6564J9632K1266K1974K2647K2818K1431J8621J5320J1489O331J68
58467I91797n390r348j2157j4386j5702j5553j3981j1418q317n172k305M12L177
58454H81657N738P816R706J1761J3471J3910J2825J0511O973K191l038p581j1167
58441I54773j4220j6624j7652j7031j5158j2472r455o947n429m158k155K02J711
58428H35385K223K740L736M725N537O648Q035Q949R088Q880Q398P090M803K025
58414I18262r73m189o980q354q417q340q679q825q361p707p112o209n014m158
$$ plain form
58508 696390 695992 695634 695648 695846 696249 697284 698923 700489 701669 702973 704757 706550 707825 708778 709837 710985
58492 710985 712094 713495 715693 718802 722703 727474 733393 740668 749286 758932 769193 780307 793536
58479 793536 810100 829732 850998 872972 895619 918437 939868 958489 973809 985298 991629 991797
58467 991797 986407 977059 964902 950516 934814 919261 905280 893862 885545 880373 878068 878480 881657
58454 881657 887395 895211 904917 916678 930149 944059 956884 967395 974368 976559 973521 965940 954773
58441 954773 940553 923929 906277 889246 874088 861616 852161 845214 839785 835627 833472 833674 835385
58428 835385 837608 840348 844084 848809 854346 860994 869029 877978 887066 895946 904344 911434 916237 918262
58414 918262 917289 913100 906120 897766 889349 881009 872330 863505 855144 847437 840325 834116 829102 824944
58400H24944l720k878j272L49J271J589J511R89N05J012K501L673L699L288L303
58385H40764L332K595J493J252K273L627M098L381K405K484L879N418O012O112
58371H89125O866Q239R209R490R744J0083R945R564J0024J1426J2536J2768J3073
58358A022092J4127J5076J4944J4054J3084J1738R433O567M115K533J721J512
58346A130996J613J652J766K583M216N950P168P916Q344Q508Q921J0273J2207
58333A212113J3391J3307J3015J3706J5374J7217J8502J8602J7196J4831J2430
58322A379684J0086P307M547L144L425M162M364M392M807N465O287P687R555J0967
58308A465879J1495J1772J2317J2895J3408J4161J4896J4893J4405J4603J5655
$$ plain form
58400 824944 821224 818346 817074 817423 818694 820283 821794 822783 823288 824300 826801 830474 834173 837461 840764
58385 840764 844096 846691 848184 849436 851709 855336 859434 862815 865220 867704 871583 877001 883013 889125
58371 889125 895991 904230 913439 922929 932673 942756 952701 962265 972289 983715 996251 1009019 1022092
58358 1022092 1036219 1051295 1066239 1080293 1093377 1105115 1114548 1121115 1125230 1127763 1129484 1130996
58346 1130996 1132609 1134261 1136027 1138610 1142826 1148776 1155944 1163860 1172204 1180712 1189633 1199906 1212113
58333 1212113 1225504 1238811 1251826 1265532 1280906 1298123 1316625 1335227 1352423 1367254 1379684
58322 1379684 1389770 1397077 1401624 1404768 1408193 1412355 1416719 1421111 1425918 1431383 1437670 1445357 1454912 1465879
58308 1465879 1477374 1489146 1501463 1514358 1527766 1541927 1556823 1571716 1586121 1600724 1616379
58297A616379J6395J6358J6567J7674J8863J9365J9558J9882K0082K0225K1031
58286A822379K2532K3810K4553K5376K6250K6362K6001K6574K8226K9550L0308
58275B111921L2100L5436L8513M0036M0928M1996M2383M1812M2082M4600M8409
58264B560216N2246N6443O1247O5442O8401P1373P4914P7245P7060P5816P5203
58253C315606P4506P2567P0388O9553P0018P1465P4856Q0470Q6469R1587R7150
58242D174635J04380J11960J18589J25562J34265J43409J51440J59565J69612
58233E393417J81046J92726K05434K19960K34901K49130K64174K81621L00650
58224G523059L20717L43766L71044M00835M32229M67678N08738N53254O00341
$$ plain form
58297 1616379 1632774 1649132 1665699 1683373 1702236 1721601 1741159 1761041 1781123 1801348 1822379
58286 1822379 1844911 1868721 1893274 1918650 1944900 1971262 1997263 2023837 2052063 2081613 2111921
58275 2111921 2144021 2179457 2217970 2258006 2298934 2340930 2383313 2425125 2467207 2511807 2560216
58264 2560216 2612462 2668905 2730152 2795594 2863995 2935368 3010282 3087527 3164587 3240403 3315606
58253 3315606 3390112 3462679 3533067 3602620 3672638 3744103 3818959 3899429 3985898 4077485 4174635
58242 4174635 4279015 4390975 4509564 4635126 4769391 4912800 5064240 5223805 5393417
58233 5393417 5574463 5767189 5972623 6192583 6427484 6676614 6940788 7222409 7523059
58224 7523059 7843776 8187542 8558586 8959421 9391650 9859328 10368066 10921320 11521661
58215A1521661O53900P17212P88562Q66878R56966J064088J188186J329260J493516
58206B0580229J688456J917605K187085K511840K908708L390768L976972M699246
58198D3860909N589759O669452P959706R494721J1310809J3441174J5943413J8916839
58190A33186782K2464881K6643645L1420524L6514335M1025243M3160977M0646864
58183C75063251L1958583J7597098K92446j6175855k8689343l5855499l7979055
58176C06211626l6374844l2665337k8330353k4437026k1480862j9399917j7801529
58169A25721758j6281953j4639411j2885979j1133422r488206q015554o743956
58162D6533277n672676m780289m039793l428946k927864k514999k171083j883119
$$ plain form
58215 11521661 12175561 12892773 13681335 14548213 15505179 16569267 17757453 19086713 20580229
58206 20580229 22268685 24186290 26373375 28885215 31793923 35184691 39161663 43860909
58198 43860909 49450668 56120120 64079826 73574547 84885356 98326530 114269943 133186782
58190 133186782 155651663 182295308 213715832 250230167 291255410 334416387 375063251
58183 375063251 407021834 424618932 424911378 408735523 380046180 344190681 306211626
58176 306211626 269836782 237171445 208841092 184404066 162923204 143523287 125721758
58169 125721758 109439805 94800394 81914415 70780993 61292787 53277233 46533277
58162 46533277 40860601 36080312 32040519 28611573 25683709 23168710 20997627 19114508
58154A9114508j641123j435099j258469j110009r88217q87014q00130p25994o64549
58145I603904o12457n65169n21111m80285m41299m03048l67066l34887l05062
58136E573520k75723k48200k25209k07333j93892j85122j80510j76892j71195
58127C709444j63681j55899j47367j37080j26537j17949j10782j03153r5553r0016
58117B461427q6367q2391p7359p2528o8402o4088n9446n5506n2566m9777m6768
58106A746229m4076m1970m0289l9253l9081l9198l9049l9270m0636m2261m2276
58095A298870l9890l5627l0132k4182j9338j6952j6698j7158j7537j7749j7445
58084A046162j6359j5181j4814j5118j5453j5922j6858j7690j7668j7270j7556
$$ plain form
58154 19114508 17473385 16038286 14779817 13669808 12681591 11794577 10994447 10268453 9603904
58145 9603904 8991447 8426278 7905167 7424882 6983583 6580535 6213469 5878582 5573520
58136 5573520 5297797 5049597 4824388 4617055 4423163 4238041 4057531 3880639 3709444
58127 3709444 3545763 3389864 3242497 3105417 2978880 2860931 2750149 2646996 2551443 2461427
58117 2461427 2375060 2292669 2215310 2142782 2074380 2010292 1950846 1895340 1842774 1792997 1746229
58106 1746229 1702153 1660183 1619894 1580641 1541560 1502362 1463313 1424043 1383407 1341146 1298870
58095 1298870 1258980 1223353 1193221 1169039 1149701 1132749 1116051 1098893 1081356 1063607 1046162
58084 1046162 1029803 1014622 999808 984690 969237 953315 936457 918767 901099 883829 866273
58073H66273j8475j9057j8895j8250j7137j5564j4299j4015j3967j2841j0771
58062F93002r124q484q096p433o987p275q013q658r141r773j0818j2070j2700
58049E74430j1894r928q014o788n750m618m109m541m866m270l704m376n545n487
58035D90540m133l027k931l097k997l233m428o284q108r393r843r557r171r100
58021D05238q830p743o257n243m688l984l237l092l428l419k832k193j663r25
58007C47704j88j56q02j225q97j82M97J067J302R43M66Q40K168L466M023M188
57991C63214M489M744M465L516K096N45o15r89q47r28j644k807l990m710m515
57976C62024l531k660k556k605j801l33P04J018J418K352L298L821M098M076L103
$$ plain form
58073 866273 847798 828741 809846 791596 774459 758895 744596 730581 716614 703773 693002
58062 693002 683878 675394 667298 659865 652878 645603 637590 628932 619791 610018 599200 587130 574430
58049 574430 562536 552608 544594 537806 532056 527438 523329 518788 513922 509652 505948 501572 496027 490540
58035 490540 486407 483380 480449 477352 474355 471122 466694 460410 452302 442909 433066 423509 414338 405238
58021 405238 396408 388665 382408 377165 372477 368493 365256 362164 358736 355317 352485 350292 348629 347704
58007 347704 347516 347360 346558 345333 344436 344254 344751 345818 347120 348063 348529 349369 351537 355003 359026 363214
57991 363214 367703 372447 376912 380428 382524 383069 382454 381465 380618 379690 378046 375239 371249 366539 362024
57976 362024 358493 355833 353277 350672 348871 348538 349242 350260 351678 354030 357328 361149 365247 369323 372426
57961C72426J048j122k404k833l004l175l367l816m688n663o270o398o206n746
57947C18782m996m067l188k563k269k087j542m18Q87J824K379K938L695M620N787
57932C19782P178Q346Q790Q432P257M989J814j060k635l495m839o407o841o063
57918C35248n643o401p177o805n947n863o356o146m753k854j032P70K527L700
57904B83268L751K756J355K05n75j436k719m018m635m514m170l730k747j190K29
57889B61830R95J395J811K081K022J942K135K352K331K362K799L390L629L454
57875B94528L154K932K929L256L619L325K202J120J014J690K116J681O46l95j034
57860C22783j174j038r62r47o67j22K27K35M84J375K315K401J559M54l66o85l81
$$ plain form
57961 372426 373474 372352 369948 367115 364111 360936 357569 353753 349065 343402 337132 330734 324528 318782
57947 318782 313786 309719 306531 303968 301699 299612 298070 297652 298539 300363 302742 305680 309375 313995 319782
57932 319782 326960 335306 344096 352528 359785 364774 366588 365528 362893 359398 354559 348152 341311 335248
57918 335248 329605 323204 316027 309222 303275 297412 291056 284910 280157 277303 276271 277041 279568 283268
57904 283268 287019 289775 291130 291335 290760 289324 286605 282587 277952 273438 269268 265538 262791 261601 261830
57889 261830 262825 264220 266031 268112 270134 272076 274211 276563 278894 281256 284055 287445 291074 294528
57875 294528 297682 300614 303543 306799 310418 313743 315945 317065 318079 319769 321885 323566 324212 323817 322783
57860 322783 321609 320571 319609 318662 317995 317873 318100 318335 318819 320194 322509 324910 326469 326923 326557 325872 325491
57843C25491K87N06k04j111j099k50K40k38r40r07j40P08J211J415J554J893K552
57826C30968L304L743L688L238K494J657J204J423J719J106m37j748j949j533
57812C48877j517k027k404k366k401l027m278n844p270p960p628o828o572p115
57798B81640p528o807n109l459k505j978j401p89m32l50j94L34J091J562J296
57783B55371N07N7O24J804K436J942J005P14J283K040K363K274K136K172K309
57768B79037K172J371J7j135j421j067r18j385k097k488k335j636n75L22M58r4
57752B68226m86k7J094K227L080L809M537N185N618N737N488M965M367L725K829
57737C20374J600K63r04j826k433k534k126j605j353j291j080o48k47r7k60p10
$$ plain form
57843 325491 325778 326284 326080 324969 323870 323620 323860 323622 322682 321775 321635 322343 323554 324969 326523 328416 330968
57826 330968 334272 338015 341703 344941 347435 349092 350296 351719 353438 354544 354107 352359 350410 348877
57812 348877 347360 345333 342929 340563 338162 335135 330857 325013 317743 309783 302155 295327 288755 281640
57798 281640 274112 267305 262196 258737 256232 254254 252853 252064 251632 251282 251088 251422 252513 254075 255371
57783 255371 255878 255935 256559 258363 260799 262741 263746 264460 265743 267783 270146 272420 274556 276728 279037
57768 279037 281209 282580 282597 281462 280041 278974 278056 276671 274574 272086 269751 268115 267540 267862 268320 268226
57752 268226 267740 267713 268807 271034 274114 277923 282460 287645 293263 299000 304488 309453 313820 317545 320374
57737 320374 321974 322237 321333 319507 317074 314540 312414 310809 309456 308165 307085 306437 306190 306093 305833 305123
57721C05123j292j660j577j246j089j186j111m87M53R89O17l62j108j120p20n10
57705B93714n85n55k37J57M60P87J157J369J407J557J920K199K198K120K144K035
57689C11847J538P13l06j491k508k735k121j520j532j465k35K068M361O145P936
57674C20695J0208J2843J5903J9989K5474L1988L9172M7312N6741O6792P5522
57663G22639P9844P5826O0223L3243j8l1831n6126p0859p6984p6345p0805o2338
57651E26469n2826m3544l5136k7994k2365j8106j4736j1889r575p834o328m605
57639B71531k727j357j033j499j903j679j051o59q46j390j828j921j820j840k147
57624B47831k585k815k646k256k007k098k388k602k605k419k111j798j631j644
$$ plain form
57721 305123 303831 302171 300594 299348 298259 297073 295962 295475 295928 296917 297534 297172 296064 294944 294224 293714
57705 293714 293129 292574 292337 292494 292954 293741 294898 296267 297674 299231 301151 303350 305548 307668 309812 311847
57689 311847 313385 314098 313792 312301 309793 307058 304937 303417 301885 300420 300185 302253 306614 312759 320695
57674 320695 330903 343746 359649 379638 405112 437100 476272 523584 580325 647117 722639
57663 722639 802483 878309 938532 971775 971757 939926 883800 812941 735957 659612 588807 526469
57651 526469 473643 430099 394963 366969 344604 326498 311762 299873 290298 282464 276136 271531
57639 271531 268804 267447 266414 264915 263012 261333 260282 259623 258777 257387 255559 253638 251818 249978 247831
57624 247831 245246 242431 239785 237529 235522 233424 231036 228434 225829 223410 221299 219501 217870 216226
57610B16226j632j470j436j866k427k268j174j3L68K56M18P38M59l81p68k74J66
57593B04922m09j606k341k345k233k368k449k142j494p20l1L03J47k74o29q89
57577A85442j124j169r25p90j190j808j924j496j207j346j417j116r11j254j796
57562A65969j971j844j815j796j397o79j32N1J07J02j72o49p95k87N30J126J410
57545A57758J567J537J106M14l0O1M43P79J140J809K732L401L340K479J079n18
57529A79097j932k745k696j932r31j26L50N93O46M41kl53k14M17J053J298J334
57512A74298J556J907J965J672J436J430J268P09K19L28P84Q61M23K8L1N9l74
57495A88600j150j695j667j252q74p19o04l13Jn5n23r52j046j129j566k035j924
$$ plain form
57610 216226 214594 213124 211688 209822 207395 205127 203953 203940 204308 204564 204982 205720 206179 205798 205030 204756 204922
57593 204922 204513 202907 200566 198221 195988 193620 191171 189029 187535 186815 186784 187087 187234 186960 186331 185442
57577 185442 184318 183149 182224 181434 180244 178436 176512 175016 173809 172463 171046 169930 169019 167765 165969
57562 165969 163998 162154 160339 158543 157146 156467 156335 156386 156493 156595 156423 155774 154979 154692 155222 156348 157758
57545 157758 159325 160862 161968 162382 162352 162413 162856 163635 164775 166584 169316 172717 176057 178536 179615 179097
57529 179097 177165 174420 171724 169792 168861 168735 169085 169678 170324 170765 170763 170410 170196 170613 171666 172964 174298
57512 174298 175854 177761 179726 181398 182834 184264 185532 186241 186460 186788 187572 188433 188856 188884 188915 188974 188600
57495 188600 187450 185755 184088 182836 181962 181243 180639 180326 180327 180272 179749 178797 177751 176622 175056 173021 171097
57478A71097j281p26n10l30k41q93k416l696l472j922m94k30q00j235j105p43
57462A51003o03p36q65p53m01N2M75P56Q14O88N50M91L37m1l68k19M01R81J151
57443A53713R97P05K29l55n67J3J098J912K036J773J654J849K119K133J768J222
57427A72299Q88R80J289J355R21J94m11o43n73l76j35J67M43M60N1o68j359j662
57409A73220j288j29J537K976L431K800J725R72P60O54O2j119k205k308j361l27
57393A79400l6o1O32K031K881K360J205O72R69J374J490J578J843K161K560L214
57377B04273L833L677K551J273P05P21O03J80l5J83K93k30j093j526j302r63j014
57360B12129j262j142m76L81R33R21M32p4nP76J617J710J055M22K73K43j52o54
$$ plain form
57478 171097 169816 169090 168580 168250 168009 167116 164700 161004 157532 155610 155116 154886 154086 152851 151746 151003
57462 151003 150400 149664 148799 148046 147645 147697 148172 148928 149742 150430 150980 151471 151808 151767 151399 151180 151581 152562 153713
57443 153713 154710 155415 155644 155289 154722 154735 155833 157745 159781 161554 163208 165057 167176 169309 171077 172299
57427 172299 173187 174167 175456 176811 177732 177926 177515 176872 176299 175923 175788 175955 176398 176858 176909 176241 174882 173220
57409 173220 171932 171803 173340 176316 179747 182547 184272 185244 186004 186658 186720 185601 183396 181088 179727 179400
57393 179400 179364 179303 179935 181966 184847 187207 188412 189084 190053 191427 192917 194495 196338 198499 201059 204273
57377 204273 208106 211783 214334 215607 216312 217033 217636 217816 217781 217964 218257 218027 216934 215408 214106 213143 212129
57360 212129 210867 209725 209249 209630 210563 211484 211916 211842 211837 212613 214230 215940 216995 217417 217690 217933 217781 217127
57342B17127o46l6O07Q26P55Q14J093J212P47k13r71q94j40N29P43R28J561K324
57324B26366K446J670N33k72n06l63j03K35Q63J834K619K449J285J57R0R67J837
57307B42107K101J913J616J406J463J806J958J399M58J52Q95J952K456K460K537
57292B66679K777K788K441K038J827J750J773K009K442K777K777K535K352K358
57278B99323K384K205J799J392J222J324J505J478J031K69k80l5R62J983K490
57263C19052K829L586M550M875M292L479L107L129L317L807M649N316N326M906
57249C76220M535M133L480L036L493M541N081M878M997O172P572P942P395P101
57235D50576P473P668O948N743N003N094N712O445P014P267P457Q234R948J2006
$$ plain form
57342 217127 216481 216445 217052 217878 218633 219447 220540 221752 222499 222286 221315 220421 220281 220810 221553 222481 224042 226366
57324 226366 228812 230482 231015 230743 230237 229874 229771 230006 230869 232703 235322 237771 239056 239213 239303 240270 242107
57307 242107 244208 246121 247737 249143 250606 252412 254370 255769 256227 256379 257274 259226 261682 264142 266679
57292 266679 269456 272244 274685 276723 278550 280300 282073 284082 286524 289301 292078 294613 296965 299323
57278 299323 301707 303912 305711 307103 308325 309649 311154 312632 313663 313932 313652 313617 314579 316562 319052
57263 319052 321881 325467 330017 334892 339184 342663 345770 348899 352216 356023 360672 365988 371314 376220
57249 376220 380755 384888 388368 391404 394897 399438 404519 409397 414394 420566 428138 436080 443475 450576
57235 450576 458049 465717 472665 478408 483411 488505 494217 500662 507676 514943 522400 530634 540582 552588
57221E52588J3405J3846J3903J4136J4466J4557J4364J4055J3728J3477J3429
57210G05954J3485J3257J2597J1943J1908J2647J3914J5445J6970J8080J8585
57199H64785J8878J9455K0158K0443K0409K0902K2362K4081K4957K4690K3898
57188A105018K3250K2878K2482K1787K0851K0024J9611J9621K0004K0923K2388
57177A338837K3759K4121K3392K2478K2126K2093K1827K1418K1361K1685K1961
57166A585058K2093K2481K3454K4905K6509K7939K8987K9789L0893L2689L4811
57155A889608L6544L7697L8620L9432L9872L9984M0299M0991M1496M1433M1473
57144B327449M2628M4890M7167M8622M9491N0474N1782N3142N4353N5363N5944
$$ plain form
57221 552588 565993 579839 593742 607878 622344 636901 651265 665320 679048 692525 705954
57210 705954 719439 732696 745293 757236 769144 781791 795705 811150 828120 846200 864785
57199 864785 883663 903118 923276 943719 964128 985030 1007392 1031473 1056430 1081120 1105018
57188 1105018 1128268 1151146 1173628 1195415 1216266 1236290 1255901 1275522 1295526 1316449 1338837
57177 1338837 1362596 1386717 1410109 1432587 1454713 1476806 1498633 1520051 1541412 1563097 1585058
57166 1585058 1607151 1629632 1653086 1677991 1704500 1732439 1761426 1791215 1822108 1854797 1889608
57155 1889608 1926152 1963849 2002469 2041901 2081773 2121757 2162056 2203047 2244543 2285976 2327449
57144 2327449 2370077 2414967 2462134 2510756 2560247 2610721 2662503 2715645 2769998 2825361 2881305
57133B881305N5862N5453N5488N6108N6414N5670N4665N5114N7680O1403O5298
57122C510460O9718P5612Q3074R1365R9914J08479J16656J24057J31014J38428
57112D548777J47039J57582J71533J90872K16786K49232K87748L32185L82914
57103F684668M41540N11699N98248P05476Q36933R96994J190980J422881J694000
57094A5083419K004310K353608K740332L160524L609083M080375M565532N049868
57086D2647051N514165N936793O292802O553675O691407O678748O476214O018520
57078I2809375N229305M069883K585081R02558q15252k425736l832129m981601
57070I3541484n854797o456600o806559o930012o854617o611716o236704n766284
$$ plain form
57133 2881305 2937167 2992620 3048108 3104216 3160630 3216300 3270965 3326079 3383759 3445162 3510460
57122 3510460 3580178 3655790 3738864 3830229 3930143 4038622 4155278 4279335 4410349 4548777
57112 4548777 4695816 4853398 5024931 5215803 5432589 5681821 5969569 6301754 6684668
57103 6684668 7126208 7637907 8236155 8941631 9778564 10775558 11966538 13389419 15083419
57094 15083419 17087729 19441337 22181669 25342193 28951276 33031651 37597183 42647051
57086 42647051 48161216 54098009 60390811 66944486 73635893 80314641 86790855 92809375
57078 92809375 98038680 102108563 104693644 105596202 104780950 102355214 98523085 93541484
57070 93541484 87686687 81230087 74423528 67493516 60638899 54027183 47790479 42024195
57062D2024195n235870m678601m123620l593157l101398k656656k263814j924509
57054A4446570j636535j394885j193611j026661q87839p71403o73026n89739n18972
57045E753899m58255m05806l60690l22053k88601k59147k33248k10819j91337
57036C023943j73900j57935j43323j29787j16706j03745r1259p9714o9010n8559
57026A900005m7681l5574k1358m636J4190L4288N4007O8974P1373N3862J6049
57015B103499l3140q0392j15517j34916j40035j34526j22632j08231r3936q0916
57005A059258o9536n9866n1774m5087l9755l5554l1790k7872k4013k0842j8388
56994F34781j6155j4051j2478j1286r491o477k858L02K808N400Q750J2679J6055
$$ plain form
57062 42024195 36788325 32109724 27986104 24392947 21291549 18634893 16371079 14446570
57054 14446570 12810035 11415150 10221539 9194878 8307039 7535636 6862610 6272871 5753899
57045 5753899 5295644 4889838 4529148 4207095 3918494 3659347 3426099 3215280 3023943
57036 3023943 2850043 2692108 2548785 2418998 2302292 2198547 2107288 2027574 1958564 1900005
57026 1900005 1852324 1816750 1795392 1790756 1804946 1839234 1893241 1962215 2033588 2087450 2103499
57015 2103499 2070359 1989967 1874450 1739534 1599499 1464973 1342341 1234110 1140174 1059258
57005 1059258 989722 929856 878082 832995 793240 757686 725896 698024 674011 653169 634781
56994 634781 618626 604575 592097 580811 571320 564843 561985 562287 565095 570495 579245 591924 607979
56981F07979J7187J4626Q088j246j1391k0429k6975l0368l0766k8849k5373k1101
56969D51382j6913j3372j0156o582k820J55K078M136P557J2138J6738K0791K4443
56956D89575K7389K8279K5388J7660N615q259k0365k8194l1785l2672l1761k8910
56944D11960k4337j9278j4932j1416q158m663o08M238R644J4823J9272K3494K8429
56931D28468L4221L9666M2570M0438L1432J5738l582k1684l4660m1473m3410m2094
56919D45630l8452l3359k8240k4328k1527j8727j5282j1720q835o715n036l849
56907B29560l477l725l775l039j782p28j40M53J644L326M712N213N148N348O223
56892B44961P614R410J1795J4757J7946K1185K4577K7698K9186K7594K2357J3813
$$ plain form
56981 607979 625166 639792 647880 646634 635243 614814 587839 557471 526705 497856 472483 451382
56969 451382 434469 421097 410941 404359 401539 401694 403772 407908 415465 427603 444341 465132 489575
56956 489575 516964 545243 570631 588291 593906 585647 565282 537088 505303 472631 440870 411960
56944 411960 387623 368345 353413 341997 333839 329176 328568 332806 342450 357273 376545 400039 428468
56931 428468 462689 502355 544925 585363 616795 632533 628951 607267 572607 531134 487724 445630
56919 445630 407178 373819 345579 321251 299724 280997 265715 253995 245160 238445 233409 229560
56907 229560 226083 222358 218583 215544 213762 213034 212894 213347 214991 218317 223029 228242 233390 238738 244961
56892 244961 252575 261985 273780 288537 306483 327668 352245 379943 409129 436723 459080 472893
56880D72893K936q349j7323k2021k2754k1460j9585j7098j3466q764l640J336
56868C22705O023J0646J5485K0618K6001L1894L8827M6898N5285O2623O7109O6053
56856G70167N6471L7626J2877j1980l2295m6155n3310n4159n0030m3003l4719
56845E51490k5845j6824q165K54R240J9113K9220L9114M9414O1012P3961Q7489
56833H69473J00156J09069J09572R6981O9497K9965j4490n4883q4046r9530j03353
56822A028411r9084q9581p7063o3643n0651l8152k6003j4802n039M033J3674K4193
56810F06293L5041M5975N7058O7606P5667P8314P2090N4284K5479q950m1129o5059
56798A002669p8799q3294q0624p3453o4505n5326m5928l6049k6320j7792j0824
$$ plain form
56880 472893 475829 467480 450157 428136 405382 383922 364337 347239 333773 325009 321369 322705
56868 322705 328728 339374 354859 375477 401478 433372 472199 519097 574382 637005 704114 770167
56856 770167 826638 864264 877141 865161 832866 786711 733401 679242 629212 586209 551490
56845 551490 525645 508821 500656 500910 510150 529263 558483 597597 647011 708023 781984 869473
56833 869473 969629 1078698 1188270 1285251 1354748 1384713 1370223 1315340 1231294 1131764 1028411
56822 1028411 929327 839746 762683 699040 648389 610237 584234 569432 564393 568426 582100 606293
56810 606293 641334 687309 744367 811973 887640 965954 1038044 1092328 1117807 1108857 1067728 1002669
56798 1002669 923870 840576 759952 686499 621994 566668 520740 484691 458371 440579 429755
56787D29755m933O28O513J3161K0563K8166L5132M0392M2358L9103K9404J3942
56775F94184m604k2602l6928m5968m9716m9183m5696m0673l5468l0937k7075k3407
56763B81927j9742j6408j3814j2090j1060j0382r651q653p463o229m949l660k648
56750A55178k185k206k423k629k625k157j248m03n6l9j0j15o53j280j257n69r2
56733A35231m14r88q31K74J550K052J597Q18L92K58j21p70r53k65N79O69K21K32
56715A39531J008J856K173K097J962J870J922K195K325J826R71O28J023J451J517
56700A64355J759K494K869J980L50o10l73L35Q03J104J432J494R75J78j69K82
56684A79258J183J859J962J750J780K233K645K393J406J89p77j471k077k469k273
$$ plain form
56787 429755 424822 425450 431963 445124 465687 493853 528985 569377 611735 650838 680242 694184
56775 694184 689580 666978 630050 584082 534366 485183 439487 398814 363346 332409 305334 281927
56763 281927 262185 245777 231963 219873 208813 198431 188780 180127 172664 166435 161486 157826 155178
56750 155178 152993 150787 148364 145735 143110 140953 139705 139302 139246 139207 139197 139082 138429 137149 135892 135323 135231
56733 135231 134817 133829 132998 133272 134822 136874 138471 139289 139681 139939 139818 139048 138095 137830 138409 139078 139299 139531
56715 139531 140539 142395 144568 146665 148627 150497 152419 154614 156939 158765 159736 160364 161387 162838 164355
56700 164355 166114 168608 171477 173457 173807 173197 172824 173159 173962 175066 176498 177992 178967 179145 178976 179258
56684 179258 180441 182300 184262 186012 187792 190025 192670 195063 196469 196658 195881 194410 192333 189864 187591
56669A87591j489p67p43j177j139k04R19J297R78Q25J251J632J197Q7p82p86k87
56652A88403k02r04j715j599l91R77J517J067L8j228k319k533j495O3R43Q38N14
56635A81974N43O07K65k78n76o23p00q53q65o38l14j10k12n83r26j001j011j316
56617A73383j798j913j473r13o43n97n92p06r35r30m92jK5k87k88L85J350J892
56599A65467J699J214J215J864K305J617J35o92o5J153J577J031M79M80N52J34
56583A80165m44m93nL93M92Q00J570K060J420Q9m83L21J484J747J250J116J900
56566A93382L139M218N005N626O254P170Q610J0515J2691J4978J6910J7564J6386
56553C22448J3856J0722O961K435j786l984l853k889k463k541k566k516k504k308
$$ plain form
56669 187591 186102 185335 184592 183415 182276 182072 182991 184288 185266 186091 187342 188974 190171 190258 189476 188690 188403
56652 188403 188201 187297 185582 183983 183592 184569 186086 187153 187191 185963 183644 181111 179616 179679 180622 181460 181974
56635 181974 182517 183124 183389 183111 182535 181912 181212 180359 179494 178856 178542 178432 178220 177637 176711 175710 174699 173383
56617 173383 171585 169672 168199 167286 166643 166046 165454 164748 163813 162883 162391 162390 162415 162128 161840 162225 163575 165467
56599 165467 167166 168380 169595 171459 173764 175381 175516 174824 174759 175912 177489 178520 178999 179479 180031 180165
56583 180165 179721 179228 179223 179616 180108 180908 182478 184538 185958 186047 185564 185885 187369 189116 190366 191482 193382
56566 193382 196521 200739 205744 211370 217624 224794 233404 243919 256610 271588 288498 306062 322448
56553 322448 336304 347026 353987 356422 354636 350652 346799 343910 341447 338906 336340 333824 331320 329012
56539C29012j986k217l305m462m783m350l848l557l484l844m706n489n557n060
56525B72364m602m351m048l668l385l066k442j734j558k179l179l911m063l822
56511B26356l639l738l793l330k435j700j410j291j152j211j500j575j123m26
56497A98033J32N23O96L39n75j474j818j647j166l67N85J168J123Q08N74L10k7
56480A97217j28J6j35p55j160p77K8O47J000J039L91p55j216k97J042J445R15
56463A98517L31j11o95j084p33p0L9k50r7M85P22O04Q95J650K026J756J540J756
56445B07281J960J901J923J982J431K09p82r38o54l27K73J103J327N13m73o13
56429B16116j52j6l28m17J7O07J021J294J401J139O24L50N59Q36O76K63L05J044
$$ plain form
56539 329012 327026 324809 321504 317042 312259 307909 304061 300504 297020 293176 288470 282981 277424 272364
56525 272364 267762 263411 259363 255695 252310 249244 246802 245068 243510 241331 238152 234241 230178 226356
56511 226356 222717 218979 215186 211856 209421 207721 206311 205020 203868 202657 201157 199582 198459 198033
56497 198033 198165 198688 199384 199723 199148 197674 195856 194209 193043 192676 193261 194429 195552 196360 196934 197244 197217
56480 197217 197089 197105 196970 196215 195055 194278 194306 194953 195953 196992 197383 196628 195412 195115 196157 197602 198517
56463 198517 198848 198737 198042 196958 196225 196155 196194 195944 195847 196332 197054 197658 198553 200203 202229 203985 205525 207281
56445 207281 209241 211142 213065 215047 216478 216687 215905 214967 214313 213986 214259 215362 216689 217202 216729 216116
56429 216116 215964 215948 215620 215203 215220 215827 216848 218142 219543 220682 221306 221656 222215 223051 223727 223990 224295 225339
56411B25339J839J988J597J206Q14K7r17j181o57l49q91j530j321n46k7L13J102
56394B26806K105K333J483L12l95l65M24J670K454J988O90k94n13l72j09L50O77
56377B39244L40l21l49M27J195J467J507J368P05j57j62R67K228K807L013L201
56361B57480K919J890R20Q51J265J139L62j78J84J235K244K577K182J687J748
56346B78505K096J780N39o75q93k47N05J060J637K353L013L385L361L044K761
56331C02224K769K904K870K733K780K964L062L212L622L946L731L349L471L722
56317C47359L058J605Q16J382K229K183J502J030Q91Q77J238K130L037L549M104
56302C76990N144O234O865P504Q814J0351J1038J0567R425P784N492L034J561
$$ plain form
56411 225339 227178 229166 230763 231969 232783 232810 231893 230712 230055 229706 228815 227285 225964 225418 225391 225704 226806
56394 226806 228911 231244 232727 233039 232644 232279 232703 234373 236827 238815 239505 239211 238698 238326 238217 238567 239244
56377 239244 239584 239263 238914 239341 240536 242003 243510 244878 245583 245426 245264 246231 248459 251266 254279 257480
56361 257480 260399 262289 263209 264060 265325 266464 266826 266648 266832 268067 270311 272888 275070 276757 278505
56346 278505 280601 282381 282920 282245 281352 281105 281610 282670 284307 286660 289673 293058 296419 299463 302224
56331 302224 304993 307897 310767 313500 316280 319244 322306 325518 329140 333086 336817 340166 343637 347359
56317 347359 350417 352022 352838 354220 356449 358632 360134 361164 362055 362932 364170 366300 369337 372886 376990
56302 376990 382134 388368 395233 402737 411551 421902 432940 443507 452932 460716 466208 469242 470803
56289D70803J730L042M518N577O274P030Q166R480J0417J0761J0895J1179J1517
56276E71389J1825J2430J3518J4602J5107J5286J6087J8097K0940K3625K5367
56265G58273K6260K7269K9387L2686L6472M0269M4274M8840N4104O0205O7319
56254A225358P5391Q4342R4657J07003J21171J36100J51179J66776J83134J99462
56244B544573K14553K27575K37957K45081K48630K48542K44221K34228K17327
56235D662687J93399J63170J27573Q7736M5052R88m2713q3731j19951j50693j76426
56224D707091j97050k11570k19758k22972k22754k19564k13535k05428j96057
56215B798403j85494j73712j61370j49247j37557j26299j15746j06039r6968q8582
$$ plain form
56289 470803 472533 475575 480093 485670 491944 498974 507140 516620 527037 537798 548693 559872 571389
56276 571389 583214 595644 609162 623764 638871 654157 670244 688341 709281 732906 758273
56265 758273 784533 811802 841189 873875 910347 950616 994890 1043730 1097834 1158039 1225358
56254 1225358 1300749 1385091 1479748 1586751 1707922 1844022 1995201 2161977 2345111 2544573
56244 2544573 2759126 2986701 3224658 3469739 3718369 3966911 4211132 4445360 4662687
56235 4662687 4856086 5019256 5146829 5234565 5279617 5280605 5237892 5154161 5034210 4883517 4707091
56224 4707091 4510041 4298471 4078713 3855741 3632987 3413423 3199888 2994460 2798403
56215 2798403 2612909 2439197 2277827 2128580 1991023 1864724 1748978 1642939 1545971 1457389
56205A457389q1312p5059o9018o2808n6874n1403m5999m0865l7019l4526l1828
56194H70678k7845k3577k0573j8836j7423j6046j4873j3584j1950j0607j0070
56183F85294r665q591p278o495n886m741l453k846k641k021j240j216j871k288
56169F25062k214k050j606k91J579K876L179L108L227L530L996M699N499O318
56155F56912P535R308J0912J1594J1725J2249J3396J4854J6729J9305K2225K4926
56143H31670K7647L1092L5398M0366M6211N3116O0332O6672P1599P4903P5732
56132A414738P3006O6727N8126M8883M0699L5015L2180L1148L0437K8845K5011
56121A884815J7758P867j734q828j3927j8461k2500k5984l0772l9039n0062o0589
$$ plain form
56205 1457389 1376077 1301018 1232000 1169192 1112318 1060915 1014916 974051 937032 902506 870678
56194 870678 842833 819256 798683 779847 762424 746378 731505 717921 705971 695364 685294
56183 685294 675629 667038 659760 653265 647379 642638 639185 636339 633698 631677 630437 629221 627350 625062
56169 625062 622848 620798 619192 618901 620480 623356 626535 629643 632870 636400 640396 645095 650594 656912
56155 656912 664447 673755 684667 696261 707986 720235 733631 748485 765214 784519 806744 831670
56143 831670 859317 890409 925807 966173 1012384 1065500 1125832 1192504 1264103 1339006 1414738
56132 1414738 1487744 1554471 1612597 1661480 1702179 1737194 1769374 1800522 1830959 1859804 1884815
56121 1884815 1902573 1910440 1908706 1899878 1885951 1867490 1844990 1819006 1788234 1749195 1699133 1638544
56109A638544o8140p2284p3206p1051o6626o1004n4321m6308l7830l0486k4749
56098A032539j9863j5346j1430q223n648l844k629j142R17K487K837L051M327
56085I78033N913O465O499P369Q755R310R196R661J0633J1000J0904J1448J2412
56072A097598J2515J1841J1756J2552J3249J3650J4497J5696J6495J7199J8623
56061A255671K0073K0165J9411J9613K0835K1354K0619J9697J8808J7020J4650
56050A467916J3337J3313J3027J2018J1749J3033J4805J6028J6915J7772J8562
56039A628475J9829K2229K5120K7462K9875L3611L7803M0231M0650M0780M1194
56028A987259M1076M0896M2292M4979M6789M7174M7820M9488N1107N2414N4553
$$ plain form
56109 1638544 1570404 1498120 1424914 1353863 1287237 1226233 1171912 1125604 1087774 1057288 1032539
56098 1032539 1012676 997330 985900 977677 972029 968185 965556 964414 965331 967818 970655 973706 978033
56085 978033 983946 990411 996910 1004279 1013034 1022344 1031540 1041201 1051834 1062834 1073738 1085186 1097598
56072 1097598 1110113 1121954 1133710 1146262 1159511 1173161 1187658 1203354 1219849 1237048 1255671
56061 1255671 1275744 1295909 1315320 1334933 1355768 1377122 1397741 1417438 1436246 1453266 1467916
56050 1467916 1481253 1494566 1507593 1519611 1531360 1544393 1559198 1575226 1592141 1609913 1628475
56039 1628475 1648304 1670533 1695653 1723115 1752990 1786601 1824404 1864635 1905285 1946065 1987259
56028 1987259 2028335 2069231 2111523 2156502 2203291 2250465 2298285 2347773 2398880 2451294 2505847
56017B505847N7620O0383O2821O6137P0000P2723P4437P7062Q0966Q4711Q8285
56006C300992R3199R9156J04050J07636J11911J17620J23736J30399J38689J47550
55996D474938J54878J61593J70611J81901J92910K03644K16520K31324K45503
55987F233822K59561K76769K97338L18487L40437L66316L95990M26424M58543
55978I373687M96916N42154N90912O43936P06295P78953Q58595R46846J050772
55969A5989066J173138J311884J470799J660458J887258K153167K468641K854127
55961C0968538L327480L904073M611557N488753O566652P866631R419066J1264866
55953H3417616J3441576J5999075J9033148K2667533K6986402L1979910L7432879
$$ plain form
56017 2505847 2563467 2623850 2686671 2752808 2822808 2895531 2969968 3047030 3127996 3212707 3300992
56006 3300992 3394191 3493347 3597397 3705033 3816944 3934564 4058300 4188699 4327388 4474938
55996 4474938 4629816 4791409 4962020 5143921 5336831 5540475 5756995 5988319 6233822
55987 6233822 6493383 6770152 7067490 7385977 7726414 8092730 8488720 8915144 9373687
55978 9373687 9870603 10412757 11003669 11647605 12353900 13132853 13991448 14938294 15989066
55969 15989066 17162204 18474088 19944887 21605345 23492603 25645770 28114411 30968538
55961 30968538 34296018 38200091 42811648 48300401 54867053 62733684 72152750 83417616
55953 83417616 96859192 112858267 131891415 154558948 181545350 213525260 250958139
55946B50958139M2594495M5787515M4576007L6905882K2637952M185205j4449813
55939D33195382k9561574l9174674m3255121m3004741l9993581l5597574l0786484
55932A71821633k6134404k1926781j8271523j5173649j2585126j0443704q690237
55925E8596209p264244o102548n151571m373622l737564l212521k774586k410361
55917B3569192k108308j853331j633499j444449j282945j142329j017884r10101
55909A2176346q18777p39380o68492o07271n56200n11590m70463m34002m03128
55900F967043l75229l48135l23039l00755k79240k57382k37316k20501k05258
55891D420188j90391j77504j67430j58042j47840j38236j30184j21996j12585
$$ plain form
55946 250958139 293552634 339340149 383916156 420822038 443459990 447645195 433195382
55939 433195382 403633808 364459134 321204013 278199272 238205691 202608117 171821633
55932 171821633 145687229 123760448 105488925 90315276 77730150 67286446 58596209
55925 58596209 51331965 45229417 40077846 35704224 31966660 28754139 25979553 23569192
55917 23569192 21460884 19607553 17974054 16529605 15246660 14104331 13086447 12176346
55909 12176346 11357569 10618189 9949697 9342426 8786226 8274636 7804173 7370171 6967043
55900 6967043 6591814 6243679 5920640 5619885 5340645 5083263 4845947 4625446 4420188
55891 4420188 4229797 4052293 3884863 3726821 3578981 3440745 3310561 3188565 3075980
55882C075980j03500r5735q7805p8981p1126o5399o0464n6014n4576n7484o2057
55871B282839o5183o6830o7826o7212o4359o1014n8594n5794n1272m6408m2909
55860A635438l9939l6265l3314l3366l5986l8630l9648l8768l5956l1878k8414
55849A243274k6964k6960k7264k7838k8843k9439k8909k7762k6618k5177k3378
55838I44122k2055k1480k0624j8990j7601j7093j6416j4616j2431j0889r792q809
55826G53326q569r330r965r584q930r055r885j1007j2486j3818j3638j1709r781
55813F15569r249r338q797p874p231o289m217j494Q44K582L891M646N133O234
55799E84410P894Q740Q205P524P443O546L401r75m432o368p590q573r311j0050
$$ plain form
55882 3075980 2972480 2876745 2788940 2709959 2638833 2573434 2512970 2456956 2402380 2344896 2282839
55871 2282839 2217656 2150826 2083000 2015788 1951429 1890415 1831821 1776027 1724755 1678347 1635438
55860 1635438 1595499 1559234 1525920 1492554 1456568 1417938 1378290 1339522 1303566 1271688 1243274
55849 1243274 1216310 1189350 1162086 1134248 1105405 1075966 1047057 1019295 992677 967500 944122
55838 944122 922067 900587 879963 860973 843372 826279 809863 795247 782816 771927 762135 753326
55826 753326 744757 735427 725462 715878 706948 697893 688008 677001 664515 650697 637059 625350 615569
55813 615569 606320 596982 588185 580311 573080 566791 562574 561080 561924 564506 568397 573043 578176 584410
55799 584410 592304 601044 609249 616773 624216 630762 634163 633188 628756 622388 614798 606225 596914 586864
55785E86864j0745j0636r390p767o117l648l67J668P55j812l146j916J316N875
55771E40934J1450J7660K4576L2764M1167M5815M2547L0692J2974p138k6258m0521
55759G26662m7011m6217m1476l5806l0359k5579k2005j9569j7423j5053j2875
55748D13289j1568j1323j1610j1346r717p264n530n045m564k966q39Q30K319M081
55734C38747N068L798O29k635n019o791q063q549q522q593q605q021p175o842
55720B69427o703n697l824k238j433n90R87K929M668O344Q476J1230J4104J5862
55706C13542J5089J1493O461J698k309n896r007j1298j2883j3915j3901j2552
55694B66522j0793r724r019p645n716m152k900j180N82R13k58r77L10K901N041
$$ plain form
55785 586864 576119 565483 556093 548326 542209 538561 538194 539862 540617 538805 535659 533743 535059 540934
55771 540934 552384 570044 594620 627384 668551 714366 756913 787605 800579 793441 767183 726662
55759 726662 679651 633434 591958 556152 525793 500214 478209 458640 441217 426164 413289
55748 413289 401721 390398 378788 367442 357725 350461 344931 339886 335322 332356 331517 332347 334666 338747
55734 338747 343815 347613 348242 345607 340588 333797 325734 317185 308663 300070 291465 283444 276269 269427
55720 269427 262724 257027 253203 250965 249532 248942 249929 252858 257526 263870 272346 283576 297680 313542
55706 313542 328631 340124 346585 348283 345974 340078 331071 319773 306890 292975 279074 266522
55694 266522 255729 246005 236986 229341 223625 219473 216573 215393 215975 216888 216630 215653 215963 218864 223905
55679B23905N870N670N110M802M892M637L127O69j335k102k200k345k401k061
55665B46238j657j624j745j494p99j11Q9k29m96M1J349K383K389J991K168K558
55649B51051K013O56q3K77M52n42j809j948j117o75j273k294k974l345l991n291
55633B29107o909p972p867o900n866n018l948k532j398j151j584j919j610p16
55619A73717J87M08k40j115j378r42n24p92j775k976l688l349k103q97n52q74
55603A53107j172j345j652j804j230k32K05j53n32n26o99j428k135k195j848j632
55587A34729j580j506j481j526j298n91K84R86J531J925J904J427R10O25M05K82
55571A37026P60J966L125L501L348L331L494L421L049K655K267J684R37K20m52
$$ plain form
55679 223905 229775 235445 240555 245357 250249 254886 258013 258682 257347 255245 253045 250700 248299 246238
55665 246238 244581 242957 241212 239718 238919 238808 238897 238668 238172 238213 239562 241945 244334 246325 248493 251051
55649 251051 253064 253720 253637 253914 254366 253824 252015 250067 248950 248275 247002 244708 241734 238389 234398 229107
55633 229107 222198 214226 206359 199459 193593 188575 184627 182095 180697 179546 177962 176043 174433 173717
55619 173717 173904 174312 174072 172957 171579 170637 170113 169321 167546 164570 160882 157533 155430 154533 153981 153107
55603 153107 151935 150590 148938 147134 145904 145672 145877 145724 145192 144666 143967 142539 140404 138209 136361 134729
55587 134729 133149 131643 130162 128636 127338 126747 127031 128017 129548 131473 133377 134804 135714 136339 136744 137026
55571 137026 137786 139752 142877 146378 149726 153057 156551 159972 163021 165676 167943 169627 170564 170784 170332
55556A70332j134j735k255k858l440l520l042k744l150l626l273k241j393q45
55542A35076N6J300J885J233J13l50J7N95R84J250J473J521J283P98J82l96p46
55525A46274q93j136j707k435k946l090k965k624k050j481j419k080k984l342
55511A15122k907k224j959k155k307k085j699j494j412j068k92O01J169J317J297
55496I9904J304J276J104Q53O15K97j97o11n49m4L28J14m34o63k92L48P52P24
55478A04829N02M98R19J474J627J212O75N00N48K59n72j485j938j917j870k119
55462A03142k452k354j623p06k60m38p46o40j26L72M88K18r9qO02J217J101J90
55444I7878p52r80n58n4J94K38J96J63K25L16K46Q5K15P02J008P42L27M04Q72
$$ plain form
55556 170332 169198 167463 165208 162350 158910 155390 152348 149604 146454 142828 139555 137314 135921 135076
55542 135076 135132 136432 138317 139550 139663 139313 139330 139925 140909 142159 143632 145153 146436 147234 147416 147020 146274
55525 146274 145381 144245 142538 140103 137157 134067 131102 128478 126428 124947 123528 121448 118464 115122
55511 115122 112215 109991 108032 105877 103570 101485 99786 98292 96880 95812 95520 96121 97290 98607 99904
55496 99904 101208 102484 103588 104441 105056 105353 105156 104545 103996 103952 104280 104394 103960 103297 103005 103353 104105 104829
55478 104829 105331 105829 106748 108222 109849 111061 111736 112236 112784 113043 112471 110986 109048 107131 105261 103142
55462 103142 100690 98336 96713 96007 95747 95309 94563 93923 93797 94169 94657 94875 94776 94768 95370 96587 97688 97878
55444 97878 97126 96146 95588 95534 95728 95966 96162 96325 96550 96866 97112 97197 97412 98114 99122 99864 100191 100595 101467
55425A01467J142J112J127J130O70j52n71k53J42r6q00j309j386j250j012n85
55409I9376q8Q1k42o64o16m6M27K21m33p16k46M58P11M55J3m81r64j062n47J05
55389I5742K47R9M19J192J455P07k95n79j59K71L74L11J95k2k39l37n41j191k088
55370I5561k434j698l41N04J16j123k142k189j336j45Q61J346J199P04M77Q11
55354I0171J250J135M27l91j022j537j855j614o64N85J464J480O54l33n03L69
55338H9616J266J035p3p14l15K00j36r17r99o0J168J898J948J481O99o8m29l18
55320I5282k25o59j416j583o35O67J004K40k84L84J337J097j44p77j39O08L39
55303I5096n53j098j197j251j111m64J57j39j200j880j520o33P9O01J111J341
$$ plain form
55425 101467 102609 103721 104848 105978 106648 106496 105925 105672 105814 105718 104918 103609 102223 100973 99961 99376
55409 99376 99288 99369 99127 98463 97847 97801 98228 98449 98016 97300 97054 97512 98223 98678 98691 98210 97246 96184 95637 95742
55389 95742 95989 96088 96507 97699 99154 99861 99566 98987 98828 99099 99473 99784 99979 99957 99718 99381 98840 97649 95561
55370 95561 93127 91429 91088 91592 91708 90585 88443 86254 84918 84773 85634 86980 88179 88883 89360 90171
55354 90171 91421 92556 92983 92592 91570 90033 88178 86564 85900 86485 87949 89429 90083 89750 89247 89616
55338 89616 90882 91917 91844 91130 90815 91015 90879 89962 88963 88903 90071 91969 93917 95398 96097 96029 95600 95282
55320 95282 95057 94398 92982 91399 90764 91431 92435 92675 92391 92775 94112 95209 95065 94288 94149 94757 95096
55303 95096 94543 93445 92248 90997 89886 89422 89579 89440 88240 86360 84840 84207 84286 84887 85998 87339
55287H7339R62L43K33P59J243J106N65J51p6m02p70p55k76J81K17L1n1n0n5J39
55267I0834O34J039R94P50P56Q86O98J71m28j102j855k083j207J96Q46M30r2K3
55249I1490M67P62R54J011N11n25j193q40lL51J6n97j151j426j129l10M28O74
55231H9490P02Q09O76Pp39r28o90n35m60j27L34M81L06J88K48L24M18N94O69N16
55211I2283M61P89J079P05j47o45l87K19O25N95J56m06n60j66J60j78p54o74P5
55192I3230N83M19J72L98P71O71N1o57j086j106p57k81M3K14M45P20P15K60m39
55173I4366j045j265q10L90J814K596K336J469P08L51J88j56p95j414j579j328
55157I5826j175j233q50M24J761J857O65m54m64K64P61O34Q8n58r37p45j98J1
$$ plain form
55287 87339 88301 88644 88877 89636 90879 91985 92550 92701 92625 92223 91453 90698 90422 90603 90820 90851 90800 90750 90695 90834
55267 90834 91468 92507 93501 94251 95007 95893 96591 96762 96334 95232 93377 91294 90087 90283 91129 91559 91467 91490
55249 91490 91957 92719 93673 94684 95195 94670 93477 92637 92634 92985 93001 92404 91253 89827 88698 88388 88816 89490
55231 89490 90192 91001 91677 91684 90945 90017 89327 88792 88332 88205 88539 89020 89326 89514 89762 90086 90504 91098 91767 92283
55211 92283 92744 93533 94612 95317 95170 94525 94138 94357 94982 95577 95733 95327 94767 94601 94761 94583 93829 93155 93230
55192 93230 93813 94232 94404 94802 95573 96244 96295 95638 94552 93446 92689 92408 92451 92665 93110 93830 94545 94805 94366
55173 94366 93321 92056 91246 91636 93450 96046 98382 99851 100559 100910 101098 100942 100147 98733 97154 95826
55157 95826 94651 93418 92568 92992 94753 96610 97275 96821 96357 96621 97382 98016 98104 97546 96609 95864 95666 95677
55139I5677l65o79l18L90P21O03M93M81J78m71r75r98p53n53l74j50p6k98m54
55120I2079mJ024J892J926J213M32R7K14N29Q60J120J240J182R16L73m27j128
55103A03538j187m43N95J213J182Q12N08M66O01O36L15k38n57l80K7K76L56M76
55085A08196P05J069J751K708L302K919J868J131J127J285R84L60o0j48j87l67
55069A26643n75o80p22q15r34q65n04j60k69o88o74Q2P88M93n86j429j738k111
55051A15256k676k559j250L87J127Q29J51n73j338j708j074K43J102R25L26J18
55035A09286K71K98J46J58L87M44M0o64j225j276p49k5K44k30r18r52j63O71P85
55016A06528L45J54O00J295J602J239L75n14q96o20j75j83o31r07o69j96K42P36
$$ plain form
55139 95677 95312 94633 94315 94705 95426 96029 96522 97003 97181 96710 95735 94737 93984 93431 93057 92907 92831 92533 92079
55120 92079 92075 93099 94991 96917 98130 98562 98659 98873 99402 100262 101382 102622 103804 104720 105093 104666 103538
55103 103538 102351 101908 102503 103716 104898 105710 106218 106684 107285 107921 108236 107998 107441 107061 107088 107364 107720 108196
55085 108196 108901 109970 111721 114429 117731 120650 122518 123649 124776 126061 127045 127405 127345 127197 127010 126643
55069 126643 126068 125388 124666 123851 122917 122052 121548 121388 121119 120431 119757 119839 120627 121120 120534 119105 117367 115256
55051 115256 112580 110021 108771 109158 110285 111114 111265 110692 109354 107646 106572 106815 107917 108842 109168 109286
55035 109286 109557 109855 110001 110159 110546 110990 111030 110366 109141 107865 107116 107091 107335 107105 106187 105235 105072 105743 106528
55016 106528 106873 107027 107627 108922 110524 111763 112138 111624 110728 110108 109933 109750 109119 108212 107543 107347 107589 108325
54998A08325J228J235O20Q9K83P88P91M65O76J430J607N13j104k054k030j520
54982A11342r50m74j83k3K36N32M14k45p63m82K74O64N66N95R90J221Q84L21M8
54963A14967L9o7l37m93l10K16Q97J375J320Q70O43R86J418J192L00n08o90m84
54945A21334m07o25j040j583k070k052j244m3Q11J044R97R72Q62N93M23N40O49
54928A19161M63L78J092K523L585L473K767K772L834M977N314N279N884P182Q225
54913A76909Q440Q156P550N981L020n01l248m903o128p281q030q105p565o324
54899A57971m337k424j922l052m408m554l551k348j449p37r9N23J305K098K162
54884A35178J123j76m55N00J807K802L571M244M605M716N196O439P885Q504P918
$$ plain form
54998 108325 109553 110788 111408 111497 111780 112568 113359 113824 114500 115930 117537 118050 116946 114892 112862 111342
54982 111342 110392 109918 109735 109712 109948 110480 110894 110649 109886 109404 109678 110342 110908 111503 112493 113714 114598 114919 114967
54963 114967 115006 114939 114602 114109 113799 114015 114912 116287 117607 118477 119120 120106 121524 122716 123016 122508 121818 121334
54945 121334 120927 120302 119262 117679 115609 113557 112313 112270 113081 114125 115122 116094 116956 117549 117972 118512 119161
54928 119161 119624 120002 121094 123617 127202 130675 133442 136214 140048 145025 150339 155618 161502 168684 176909
54913 176909 185349 193505 201055 207036 210056 209555 206307 201404 195276 187995 179965 171860 164295 157971
54899 157971 153634 151210 149288 146236 141828 137274 133723 131375 129926 129189 129090 129613 130918 133016 135178
54884 135178 136301 136125 135670 136170 137977 140779 144350 148594 153199 157915 163111 169550 177435 185939 193857
54869A93857O707N566M381K422m99l439n288o101o813p750q204p700o749n907
54855A54483m966l696k692k578k955k988k571k113j611r01m06o75j356j632j420
54840A21923j246j158q23m42n07p11k53P75J413J298R35M85m29j529j823j187
54824A16721p36j108j535j267p46n69l75K81Q35M74n04j075p74O0Q89J261J004
54807A12836O55J089K169K533J396j41m61M73J396J606J535J632J649J149J26
54792A29642r75j524j163k80K81K70K44N16N63Mn54m11J13L50M52R95J823K239
54774A32585K118J880J648J336J324K025K951L204K885L113M521O600Q544R973
54760A84707J0654J0351R190P638N957M099K053j92k850n852q354r457r326q857
$$ plain form
54869 193857 200564 206130 210511 212933 212434 208995 203707 197606 190793 183043 174839 167139 160390 154483
54855 154483 149517 145821 143129 140551 137596 134608 132037 129924 128313 127412 127006 126331 124975 123343 121923
54840 121923 120677 119519 118696 118254 117747 117036 116783 117558 118971 120269 121204 121689 121260 119731 117908 116721
54824 116721 115985 114877 113342 112075 111329 110760 110385 110666 111501 111975 111471 110396 109622 109682 110571 111832 112836
54807 112836 113491 114580 116749 119282 120678 120537 120076 120549 121945 123551 125086 126718 128367 129516 129642
54792 129642 128667 127143 125980 125700 125981 126251 126495 127011 127574 127578 127024 126613 126726 127076 127528 128523 130346 132585
54774 132585 134703 136583 138231 139567 140891 142916 145867 149071 151956 155069 159590 166190 174734 184707
54760 184707 195361 205712 214902 222540 228497 232596 234649 234457 231607 225755 217401 207944 198618 189761
54746A89761q405p666o686n948n419m548l389k769k979l219k742j754p73J39J029
54731A34632J595J621J387J248J243J408J878K440K598K473K945M451O212P219
54717A73350P402P302P109O612N688M230K006q43l432m962n688o512p695q507
54703A76060q156o633m683l222k725k896k988k544j743r78m84m32r50j700j935
54688A33991j375o24l08k28M1K25k67j199j633j232p26q35j321j425q50Q8R00
54671A23222J271J066M27j74k25L08Q09N61m25j323j407r45q14j260j618j357
54655A18116q64p55q99p04j22K98K99K52N18R57J265J386J422J434J436J361R36
54638A26336nj031j334o98R5J37n06r78o72J72Q86J081Q34M46R5k63o98j024q22
$$ plain form
54746 189761 181356 173690 167004 161056 155637 151089 147700 144931 141952 138733 135991 134237 133464 133603 134632
54731 134632 136227 137848 139235 140483 141726 143134 145012 147452 150050 152523 155468 159919 166131 173350
54717 173350 180752 188054 195163 201775 207463 211693 213699 212856 209424 204462 198774 192262 184567 176060
54703 176060 167904 161271 156588 153366 150641 147745 144757 142213 140470 139492 139008 138576 137626 135926 133991
54688 133991 132616 131992 131684 131456 131497 131722 131455 130256 128623 127391 126665 125830 124509 123084 122234 122322 123222
54671 123222 124493 125559 125986 125812 125587 125895 126704 127265 126840 125517 124110 123165 122351 121091 119473 118116
54655 118116 117252 116497 115598 114894 114772 115070 115369 115621 116139 117096 118361 119747 121169 122603 124039 125400 126336
54638 126336 126331 125300 123966 123268 123363 123500 122994 122016 121344 121516 122402 123483 124317 124763 124858 124595 123897 122873 122051
54619A22051R0J311K090J938R50l30j206j144j45J014J262K23j346k217j863q29
54603A21849j9J74K9j5J64L74M69N56P45Q57N96J00n3M56J138J233O43mj70P3
54583A29195L42L61P5l44n38l77l15q35j452j012O65K132J949M57q11j015n97
54566A27880j73J45K88P3k77j85L80O97L51q1P6O13Q04M82J00j8Lrm3m5rJ05L02
54543A31459M52M80O15J112J812K196J977J420R46O12J18o43j244j148m73n1m71
54526A39169j280j561j132p08p87r90p58j78K68M16M18K50j72n67m55J88P93Q18
54508A33732K36n77j139j121n56J35N88R04J332J633J276L16l97k27M31P31M97
54491A37794K93M40N62K71k05l97l31l85n81m81N4N05L98L4M8M74P42N88M30O58
$$ plain form
54619 122051 122141 123452 125542 127480 128430 128100 126894 125750 125605 126619 127881 128104 126758 124541 122678 121849
54603 121849 121830 122004 122033 122018 122182 122556 123025 123581 124326 125183 125779 125879 125826 126282 127420 128653 129296 129292 129122 129195
54583 129195 129537 129898 129973 129629 129091 128714 128399 127564 126112 125100 125765 127897 129846 130303 129492 128477 127880
54566 127880 127707 127852 128140 128213 127936 127751 128131 128828 129179 129098 129174 129787 130591 131073 131173 131155 131158 131149 131106 131061 131052 131157 131459
54543 131459 131911 132391 133006 134118 135930 138126 140103 141523 142469 143081 143199 142556 141312 140164 139691 139640 139169
54526 139169 137889 136328 135196 134488 133701 132711 131953 131775 132043 132459 132877 133127 132955 132388 131933 132121 132914 133732
54508 133732 133968 133391 132252 131131 130575 130710 131298 132202 133534 135167 136443 136759 136362 136135 136566 137297 137794
54491 137794 138087 138527 139089 139360 139155 138758 138427 138042 137461 136980 137034 137539 137937 137971 138019 138493 139235 139823 140253 140911
54471A40911J044J182J190J514K175K647K499J834J054M40P7o3q4o0O7M13Q41
54454A57681R28M02n40j430k035k425k640k534k075j545j287j283j189p10J37
54439A39455J026J430R66j02p80l04Q33J276M38q09j418j502j787k163j725k58
54423A34576J239J768J427R47O94O06P02J055J423J437J122R13J076J354J245
54408A51584N11n27j161r16j00M37K43j95j32M69R71R50P16Q53J497K181K245
54391A59626J389n9j318j723j241m31R0J34o0j85k40m37p87q75k30J024K117K378
54373A59172J915J486J689K413L002K971K468K043K001K134K172K204K412K572
54359A90654K267J505O84l4q52j744k263k190j929j907j980j835j588j564j683
$$ plain form
54471 140911 141955 143137 144327 145841 148016 150663 153162 154996 156050 156490 156567 156504 156420 156360 156427 156840 157681
54454 157681 158609 159011 158471 157041 155006 152581 149941 147407 145332 143787 142500 141217 140028 139318 139455
54439 139455 140481 141911 142877 142775 141995 141691 142524 143800 144238 143429 142011 140509 138722 136559 134834 134576
54423 134576 135815 137583 139010 139957 140651 141257 141959 143014 144437 145874 146996 147909 148985 150339 151584
54408 151584 152095 151568 150407 149491 149391 149828 150071 149876 149744 150213 151184 152134 152850 153703 155200 157381 159626
54391 159626 161015 160956 159638 157915 156674 156243 156333 156467 156407 156222 155982 155545 154758 153883 153653 154677 156794 159172
54373 159172 161087 162573 164262 166675 169677 172648 175116 177159 179160 181294 183466 185670 188082 190654
54359 190654 192921 194426 195110 195076 194224 192480 190217 188027 186098 184191 182211 180376 178788 177224 175541
54344A75541j591j279j145j423j912k228k138j655j034n61k34J75N88M83l68j349
54328A59870j657j245o62j62M29J057J366J341J339J355Q42m03j683k143j711
54313A57933r86m47j87j27j81k08j47q3j03j91l75p59j223j329q00O1O46O43K14
54294A52351k70m87l64k07m42r68j074l48O15Q90M95L42Q96J530J506J068J037
54277A56570J585J970J548N76j47j82J67L41J51j13j18J30L71M69N45P72J169
54260A65804J630J980K024J734J436J550J963J960J069k29r68p98k56Or4k49k87
54243A78275l29n89j113j613j593q69L9L69nm81o09n91p76j019r55n06K03J053
54225A68891J713J562L49j247k226k274j730q70J37Q09O63M0j56K96O52L50k74
$$ plain form
54344 175541 173950 172671 171526 170103 168191 165963 163825 162170 161136 160575 160341 160516 161104 161587 161219 159870
54328 159870 158213 156968 156306 156144 156573 157630 158996 160337 161676 163031 163873 163470 161787 159644 157933
54313 157933 156947 156500 156313 156186 156005 155797 155650 155567 155464 155273 154898 154139 152916 151587 150787 150848 151494 152137 152351
54294 152351 152081 151594 151230 151023 150581 149613 148539 148191 148806 149696 150191 150533 151429 152959 154465 155533 156570
54277 156570 158155 160125 161673 162249 162102 161920 162087 162428 162579 162466 162348 162478 162849 163318 163863 164635 165804
54260 165804 167434 169414 171438 173172 174608 176158 178121 180081 181150 180921 179953 179155 178899 178905 178811 178562 178275
54243 178275 177946 177357 176244 174631 173038 172169 172208 172577 172572 172091 171482 170891 170115 169096 168141 167635 167838 168891
54225 168891 170604 172166 172515 171268 169042 166768 165038 164168 164305 165114 165777 165817 165661 165957 166609 166959 166685
54208A66685p62j255j950k355j842o50K89L77j85q02r21k73Q88J844K071J768
54192A62927J433J153P16J88r7o0Q0K54N45P61N23q6m71l09L1O5j51j99Q0M65
54172A67848O87O47M22K96N58J120J389Q66j99j023j174r82r55j096j044p27m67
54155A66166m60n52o01p30r36p89J7J013J326P57n2n29p70j011j086p97m63n78
54137A59925j026j208q17j85K09K50Q6j20k37r7L82R87J198O32l81q03P8J653
54119A60526K472J922R37O69R94R25K51q0P33K277L445L571K858J984J614K080
54103A87178L122M054M247L576K344R72k25j070j518j595j387j085r44j038j143
54088A95488j018p67p22r59j187j154r46p91p29o58o12p39j020j120p43p0L68
$$ plain form
54208 166685 165923 164668 162718 160363 158521 157871 158160 158537 158352 157550 156629 156356 157244 159088 161159 162927
54192 162927 164360 165513 166229 166417 166320 166260 166340 166594 167139 167900 168423 168337 167866 167557 167588 167653 167502 167303 167383 167848
54172 167848 168535 169182 169604 169900 170458 171578 172967 173833 173634 172611 171437 170455 169500 168404 167360 166633 166166
54155 166166 165706 165154 164553 163823 162887 162098 162115 163128 164454 165211 165159 164630 163860 162849 161763 160966 160503 159925
54137 159925 158899 157691 156874 156689 156898 157148 157234 157114 156877 156780 157162 158149 159347 159979 159598 158795 158873 160526
54119 160526 162998 164920 165857 166526 167520 168445 168696 168616 169349 171626 175071 178642 181500 183484 185098 187178
54103 187178 190300 194354 198601 202177 204521 205493 205268 204198 202680 201085 199698 198613 197669 196631 195488
54088 195488 194470 193703 192981 192022 190835 189681 188735 187944 187215 186557 185945 185206 184186 183066 182323 182253 182621
54071A82621L57L91J105K386L379L398K607J638Q96L83n4n78j293k006k240j706
54055A91284p07J56N70O18M89L17K44L49N83Q93J324J894K486L016L473L713L516
54038B14218L128L315M489N959O617O215N521N273N450N613N533N347N290N407
54024B87375N404M855L726K497J634J163R11Q44P90K86p85j732j932j878k598
54009C00560m119n366n662n480n489n549n117m132l067k409k350k759l214l342
53995B42505l139k785k246j506j033j297j850j654o04J93q4r32j507j799k151
53980B20111k242j517k78N29N14J30j74l41k76K93J341K467L400M193M802N020
53964B37972M979N263O030O394N170K265j095l505m550m688m413l885l262k809
$$ plain form
54071 182621 182978 183369 184474 186860 190239 193637 196244 197882 198778 199161 199107 198529 197236 195230 192990 191284
54055 191284 190577 190733 191303 191921 192410 192727 192971 193320 193903 194796 196120 198014 200500 203516 206989 210702 214218
54038 214218 217346 220661 225150 231109 237726 243941 249462 254735 260185 265798 271331 276678 281968 287375
54024 287375 292779 297634 301360 303857 305491 306654 307565 308409 309199 309485 308700 306968 305036 303158 300560
54009 300560 296441 291075 285413 279933 274444 268895 263778 259646 256579 254170 251820 249061 245847 242505
53995 242505 239366 236581 234335 232829 231796 230499 228649 226995 226391 226584 226500 225568 224061 222262 220111
53980 220111 217869 216352 216074 216603 217117 217247 217073 216732 216456 216749 218090 220557 223957 228150 232952 237972
53964 237972 242951 248214 254244 260638 265808 268073 266978 263473 258923 254235 249822 245937 242675 239866
53950B39866k516k014j152l28J16N05J351K513L364L674L734L667L340K975L119
53935B62214L727M020L598L023K897K919K505J801J450J598J832J914K022K305
53921B97825K719L239L881M510M950N254N573N914O206O438O549O444O382O875
53907C72759P845Q318P523N905M408L105J406n97j988k348k293k410k517k386
53893C96730k420l000l754m171m500n301o383p006p017p007p220p141o512o043
53879C19255o433p150o942n473l711k644k257k096k140k626l348l804l880l866
53865B62885l813l459k806k267k127k264k488k782k994k798k148j460j144j236
53851B29099j598k067k260j709n37L70K83n12j043p20J96R18P69k25j212j315
$$ plain form
53950 239866 237350 235336 234184 233856 233972 234477 235828 238341 241705 245379 249113 252780 256120 259095 262214
53935 262214 265941 269961 273559 276582 279479 282398 284903 286704 288154 289752 291584 293498 295520 297825
53921 297825 300544 303783 307664 312174 317124 322378 327951 333865 340071 346509 353058 359502 365884 372759
53907 372759 380604 388922 396445 402350 406758 409863 411269 410672 408684 406336 404043 401633 399116 396730
53893 396730 394310 391310 387556 383385 378885 373584 367201 360195 353178 346171 338951 331810 325298 319255
53879 319255 312822 305672 298730 293257 289546 286902 284645 282549 280409 277783 274435 270631 266751 262885
53865 262885 259072 255613 252807 250540 248413 246149 243661 240879 237885 235087 232939 231479 230335 229099
53851 229099 227501 225434 223174 221465 220928 221298 221581 221069 220026 219306 219502 220420 221189 220964 219752 218437
53835B18437o51j61k98n32l74j12m3L10J304K168J814L99q38j165q57k68N77J402
53817B21112J610J132O18N31O85Q31J052J365J580J751K159K612K572K199K448
53802B44257L655M852N109M863N032N505N486N008M890N268N235M319L329L212
53788C10020L663L559K496J263Q08J215J780J831J187N3j307k628l627m172m517
53773C11624n045n718o011n639n026m758m752m529m173m340n066n304m152k215
53759B44896r87j058j602j707j492j548j901k081j943j781j748j620j241p63l55
53744B23069m7R5j08o02r47o67K63J354J954J764J086N30L44K59J43M29J373K190
53726B32482J782L36o47k33Q06J207Q41N11O00P92R06J211J805K282K236J797
$$ plain form
53835 218437 217786 217625 217327 216795 216421 216309 216266 216576 217880 220048 221862 222261 221423 220258 219401 219133 219710 221112
53817 221112 222722 223854 224472 225003 225688 226519 227571 228936 230516 232267 234426 237038 239610 241809 244257
53802 244257 247912 252764 257873 262736 267768 273273 278759 283767 288657 293925 299160 303479 306808 310020
53788 310020 313683 317242 319738 321001 321809 323024 324804 326635 327822 327875 326568 323940 320313 316141 311624
53773 311624 306579 300861 294850 289211 284185 279427 274675 270146 265973 261633 256567 251263 247111 244896
53759 244896 243909 242851 241249 239542 238050 236502 234601 232520 230577 228796 227048 225428 224187 223424 223069
53744 223069 223022 223117 223009 222407 221460 220793 221056 222410 224364 226128 227214 227744 228088 228347 228490 228919 230292 232482
53726 232482 234264 234600 233953 233720 234526 235733 236574 237085 237685 238477 239383 240594 242399 244681 246917 248714
53710B48714J509J783K491L020K888K321J980K063K106J876J910K755M070N005
53696B84491N149M624L667K651K243K748L480L491K760K022J555R80K60o0J51
53681C20212K18l18r12q05q3M69L42k93r23j093o75qK95o8p28r94m70N87J400
53662C16153J260J79j034j567j341p78j52M33O82L42k52m51j49J58J88J49K20
53645C14040L29N17Q99J172R15M91Q34K012K879K651K047K171K912L320L073K695
53629C42957K517K292J890J623J763K212K778L313L556L231K459J801J692K040
53615C76124K441K637K706K894L318L757L853L523L078K930L252L914M450M231
53601D23108L094J906J882L044L914L255J672P61R68J145L05j022j593j062k30
$$ plain form
53710 248714 250223 252006 254497 257517 260405 262726 264706 266769 268875 270751 272661 275416 279486 284491
53696 284491 289640 294264 297931 300582 302825 305573 309053 312544 315304 317326 318881 319861 320121 320061 320212
53681 320212 320430 320112 319200 318395 318312 318781 319123 318830 317907 316814 316139 316131 316426 316358 315630 314636 314166 314753 316153
53662 316153 317413 317592 316558 314991 313650 312872 312720 313153 313835 314177 313925 313474 313325 313483 313671 313820 314040
53645 314040 314369 314886 315785 316957 317872 318363 319197 321209 324088 326739 328786 330957 333869 337189 340262 342957
53629 342957 345474 347766 349656 351279 353042 355254 358032 361345 364901 368132 370591 372392 374084 376124
53615 376124 378565 381202 383908 386802 390120 393877 397730 401253 404331 407261 410513 414427 418877 423108
53601 423108 426202 428108 429990 433034 436948 440203 441875 442636 443604 444749 445054 444032 442439 441377 441147
53586D41147J19l3l21p14j438k412l163l364l197k947k556j910j331j356j987
53571D14537k645k873k676k147j297m58l14j070j978k135j525q66o33o65o51n13
53555C92091l15q2K01O08J214J922K369K288J866J566J588J711J657J480J509
53540D11673J969K626K903K467J735J514K173L336M427N233N853O464P229Q240
53526D67842R291J0012J0272J0294J0263J0207J0337J1055J2376J3714J4562J5088
53514F05313J5781J6825J8085J9388K0447K0972K1218K1982K3602K5261K5912
53503H34786K5564K5062K4836K4554K3982K3342K2777K2070K1165K0434K0133
53492A088705J9956J9391J8307J7019J5998J5608J5870J6383J6733J6972J7434
$$ plain form
53586 441147 441266 441233 440912 440198 438760 436348 433185 429821 426624 423677 421121 419211 417880 416524 414537
53571 414537 411892 409019 406343 404196 402899 402441 402127 401057 399079 396944 395419 394553 393920 393255 392604 392091
53555 392091 391776 391694 391895 392503 393717 395639 398008 400296 402162 403728 405316 407027 408684 410164 411673
53540 411673 413642 416268 419171 421638 423373 424887 427060 430396 434823 440056 445909 452373 459602 467842
53526 467842 477133 487145 497417 507711 517974 528181 538518 549573 561949 575663 590225 605313
53514 605313 621094 637919 656004 675392 695839 716811 738029 760011 783613 808874 834786
53503 834786 860350 885412 910248 934802 958784 982126 1004903 1026973 1048138 1068572 1088705
53492 1088705 1108661 1128052 1146359 1163378 1179376 1194984 1210854 1227237 1243970 1260942 1278376
53481A278376J8050J8309J8056J7894J8353J8951J8561J6732J4191J1920J0050
53470A459443P998N481K918P58j254l724o737r630j1670j2626j2767j2508j2191
53457A393491j1958j1782j1732j2138j3277j4941j6602j7918j8808j9187j9063
53446A226085j8771j8585j8204j7243j6097j5535j5367j4512j2562j0322q364
53435A060523o117l132l51Q87N76j24l12J83J294K708L698L882L931M711O050
53420A078407P156Q000R257J1067J2893J4511J6160J7747J8902J9878K1404K3489
53408A258871K5371K6792K8331L0200L1765L2653L3427L4670L6211L7768L9556
53397A615615M1740M3949M5929M8013N0392N2479N3601N3863N3830N3801N3900
$$ plain form
53481 1278376 1296426 1314735 1332791 1350685 1369038 1387989 1406550 1423282 1437473 1449393 1459443
53470 1459443 1467441 1472922 1475840 1476598 1475344 1471620 1464883 1455253 1443583 1430957 1418190 1405682 1393491
53457 1393491 1381533 1369751 1358019 1345881 1332604 1317663 1301061 1283143 1264335 1245148 1226085
53446 1226085 1207314 1188729 1170525 1153282 1137185 1121650 1106283 1091771 1079209 1068887 1060523
53435 1060523 1054406 1051274 1050923 1051810 1052386 1052262 1051950 1052133 1053427 1056135 1059833 1063715 1067646 1072357 1078407
53420 1078407 1085563 1093563 1102820 1113887 1126780 1141291 1157451 1175198 1194100 1213978 1235382 1258871
53408 1258871 1284242 1311034 1339365 1369565 1401330 1433983 1467410 1502080 1538291 1576059 1615615
53397 1615615 1657355 1701304 1747233 1795246 1845638 1898117 1951718 2005581 2059411 2113212 2167112
53386B167112N4327N4906N4775N3219N0560M7800M5585M3898M2382M0491L7634
53375B692689L3701K9213K4670K0006J5077J0224N904J982k142o939j2639j9266
53363B792480k6326l2757l7802m1599m4528m6338m6624m5879m5270m5368m5746
53352B334243m5814m5400m4407m2586l9963l7129l4785l3282l2702l3115l4430
53341A910630l6070l7052l6609l4802l2460l0390k8597k6606k4405k2624k1552
53330A579463k0485j8555j5863j3387j1960j1827j2888j4793j6800j8173j8857
53319A405875j9357j9848j9861j8984j7495j6023j4802j3522j1896j0098q599
53308A235390p540o503n028l311k014j332o80M64J888L230M795P168J0139J2819
$$ plain form
53386 2167112 2221439 2276345 2331120 2384339 2434899 2482699 2528284 2572182 2614564 2655055 2692689
53375 2692689 2726390 2755603 2780273 2800279 2815356 2825580 2831484 2833466 2831324 2824385 2811746 2792480
53363 2792480 2766154 2733397 2695595 2653996 2609468 2563130 2516506 2470627 2425357 2379989 2334243
53352 2334243 2288429 2243029 2198622 2156036 2116073 2078944 2044159 2010877 1978175 1945060 1910630
53341 1910630 1874560 1837508 1800899 1766097 1733637 1703247 1674650 1648044 1623639 1601015 1579463
53330 1579463 1558978 1540423 1524560 1511173 1499213 1487386 1474498 1459705 1442905 1424732 1405875
53319 1405875 1386518 1366670 1346809 1327825 1310330 1294307 1279505 1265983 1254087 1243989 1235390
53308 1235390 1227850 1221347 1216319 1213008 1210994 1209662 1208982 1209446 1211334 1214564 1219359 1226527 1236666 1249485
53294A249485J4818J6594J8462J9934K0528K0741K1515K2974K4204K4430K3856
53283A477541K3123K2314K0933J8835J6630J4941J3531J1537Q425M440J98l674
53271A628774o545q074q764r776j1845j4643j7452j9949k1947k2939k2686k2047
53259A442107k2363k3876k5417k5808k5102k4226k3900k4180k4634k4686k3995
53248A173920k2877k2092k2018k2231k2111k1626k1180k0948k0746k0514k0371
53237I37206k0158j9374j7921j6566j6106j6124j5209j2670r647p963q120q944
53225G68404r196q883q771r182r845j0646j1837j3456j4986j5863j6091j6197
53213F23451j6623j7228j7437j6862j5706j4485j3357j2048j0448q985q182q032
$$ plain form
53294 1249485 1264303 1280897 1299359 1319293 1339821 1360562 1382077 1405051 1429255 1453685 1477541
53283 1477541 1500664 1522978 1543911 1562746 1579376 1594317 1607848 1619385 1627810 1632250 1632448 1628774
53271 1628774 1622229 1614155 1605391 1595615 1583770 1569127 1551675 1531726 1509779 1486840 1464154 1442107
53259 1442107 1419744 1395868 1370451 1344643 1319541 1295315 1271415 1247235 1222601 1197915 1173920
53248 1173920 1151043 1128951 1106933 1084702 1062591 1040965 1019785 998837 978091 957577 937206
53237 937206 917048 897674 879753 863187 847081 830957 815748 803078 793431 785468 777348 768404
53225 768404 759208 750325 741554 732372 722527 711881 700044 686588 671602 655739 639648 623451
53213 623451 606828 589600 572163 555301 539595 525110 511753 499705 489257 480272 472090 464058
53201D64058q117q204q430q988r810j0532j0691j0122r254q737q682q543p958
53188C45990p228o687o057m994l850l229l029k721k394k658l426l724l017j992
53174B90984j583j788j983j828j407q98o37j102k250l058k509r10L55M44j25m00
53158B71305k02p5m32j065j432j169l97L52N35J23l84n18l91n14j104j711j678
53141B61243q99J5L49M6l14k08K36L77j98j186j756j321p5J194J807J709J301
53124B62320R24O10K89J05M19J377K520L050K749K440L045M157M246K617N64j60
53108B91272M37P69m9j172j514j294j376j771j736j095o22r28j629j839j154J8
53092B76317Q78Q26r8j217j829j853j792k058k498k648k215j373o74o43j176j432
$$ plain form
53201 464058 455941 447737 439307 430319 420509 409977 399286 389164 379910 371173 362491 353948 345990
53188 345990 338762 332075 326018 321024 317174 313945 310916 308195 305801 303143 299717 295993 292976 290984
53174 290984 289401 287613 285630 283802 282395 281497 280860 279758 277508 274450 271941 271031 271386 271830 271705 271305
53158 271305 271103 271028 270596 269531 268099 266930 266533 266885 267420 267543 267159 266641 266250 265736 264632 262921 261243
53141 261243 260344 260359 260708 260754 260440 260232 260468 260845 260647 259461 257705 256384 256309 257503 259310 261019 262320
53124 262320 263244 263854 264143 264248 264667 266044 268564 271614 274363 276803 279848 284005 288251 290868 291432 291272
53108 291272 291709 292478 292429 291257 289743 288449 287073 285302 283566 282471 281849 280921 279292 277453 276299 276317
53092 276317 277195 278021 277923 276706 274877 273024 271232 269174 266676 264028 261813 260440 259766 259123 257947 256515
53076B56515o96O33J355R10lm38l62l17m97p12j011j548j906j404k58M53K44q2
53058B50876K27O14J83o45n65N85J403Q44l99j004p64m00j68M38J611K702K995
53041B58533K500J709R19Q6q24j645k083j929j202k03O58J100J010M33l31p19
53025B58012l70L51N90L7o11n14J70M49j76j027j112l15O17J056J049R32Q42P71
53007B60751P67Q40Q97R25J056J215R61O8r33j201o06J26L58K17J94L84M51K23
52989B66693J0K61R74J614J681J354J288J704K058J887J652K058K822K871J813
52974B90740M40m51r48j349j394q09p1J99J93N30J149J439J324J387J775J861
52958B96015J248M54Q0j00o73j545j999j694j096p52o36m22j79l36r66j518j441
$$ plain form
53076 256515 255819 256452 257807 258717 258714 258276 257914 257597 257100 256388 255377 253829 251923 250519 250261 250714 250958 250876
53058 250876 251103 251717 251900 251255 250690 251275 252678 253522 253123 252119 251355 250955 250787 251225 252836 255538 258533
53041 258533 261033 262742 263661 263747 262923 261278 259195 257266 256064 255861 256519 257619 258629 259062 258731 258012
53025 258012 257642 257993 258583 258620 258009 257495 257665 258114 257938 256911 255799 255484 256101 257157 258206 259138 259980 260751
53007 260751 261518 262358 263255 264180 265236 266451 267412 267480 266547 265346 264740 264866 265224 265441 265635 266019 266470 266693
52989 266693 266703 266964 267938 269552 271233 272587 273875 275579 277637 279524 281176 283234 286056 288927 290740
52974 290740 291180 290729 289781 288432 287038 286229 286158 286357 286550 287080 288229 289668 290992 292379 294154 296015
52958 296015 297263 297717 297797 297697 297024 295479 293480 291786 290690 289938 289302 288880 288701 288365 287399 285881 284440
52941B84440q34k49mrj49l55m50k95j92n76j221j306n40L36N09M9m72q06r42p06
52921B76228p1M59M21Q7m3j19n83j116q66L08J494J803J188J85n55n17K31P90
52903B79324L12q46j543j430j272j550j696j125j81M89Q28J031R44M48j2L3L66
52886B74120M66L37L30M45M07K81L96P03P88N37K73K00J36l3LO28J786K972L678
52867B88453L764L360K550J352R5n47k92J32k92j520k394k132j310r96j439k060
52851B86724k343k285k137k167k505k941l036k689k299k124j890j388j004j210
52837B56706j814k291k534k678k457j500j39P69Q87O60M63K16m5J19Q43J420J046
52820B49671j67j324j749j532j117p15k45K82O56P87R76J552K240K264J309J05
$$ plain form
52941 284440 283606 283357 283353 283344 283195 282840 282390 282095 281903 281327 280106 278800 278260 278596 279105 279154 278682 277876 276934 276228
52921 276228 276157 276616 277037 277124 277081 276962 276379 275263 274397 274705 276199 278002 279190 279375 278820 278303 278534 279324
52903 279324 279636 278790 277247 275817 274545 272995 271299 270174 269993 270482 271310 272341 273285 273733 273721 273754 274120
52886 274120 274586 274923 275253 275698 276105 276386 276782 277485 278273 278810 279083 279283 279419 279386 279389 280017 281803 284775 288453
52867 288453 292217 295577 298127 299479 299574 299027 298735 298867 298575 297055 294661 292529 291219 290223 288784 286724
52851 286724 284381 282096 279959 277792 275287 272346 269310 266621 264322 262198 260308 258920 257916 256706
52837 256706 254892 252601 250067 247389 244932 243432 243293 244062 244949 245609 246072 246288 246243 246362 247205 248625 249671
52820 249671 249504 248180 246431 244899 243782 243067 242822 243104 243760 244547 245523 247075 249315 251579 252888 252993
52804B52993k98L02J113J292O46m52j516k180k324k113j778j398r92p44q46j135
52788B40570j156o88K9O11Q98R25P75N76N31P65J160J411J320J001P33O08L85
52771B50454j62q12j074p68k24J36J54j50o90j218j429j317j096p20J24J305K108
52754B44621K073J560J108P33L45L10Q89J514J423P78M05N32O62O55J006J886
52738B60500K684K890K723K598K449K055J508J017N94L16M90J165J815J872J404
52723B86080Q97N63K01l93j098j596j665j450j386j657j856j547j036j064j621
52708B71372j769r23K99J000J179J322J309N97o01j228p37J15K68l16p93o27j43
52691B70324J83M03Q36J323J255M60l27k21P12J483J285K54q83j565j694j528
$$ plain form
52804 252993 252695 252997 254110 255402 256048 255596 254080 251900 249576 247463 245685 244287 243295 242551 241705 240570
52788 240570 239414 238726 238755 239366 240264 241189 241964 242540 243071 243836 244996 246407 247727 248728 249461 250069 250454
52771 250454 250292 249480 248406 247638 247414 247550 247704 247554 246864 245646 244217 242900 241804 241084 241208 242513 244621
52754 244621 246694 248254 249362 250095 250440 250750 251639 253153 254576 255354 255759 256291 256953 257608 258614 260500
52738 260500 263184 266074 268797 271395 273844 275899 277407 278424 279018 279334 279824 280989 282804 284676 286080
52723 286080 286977 287540 287741 287348 286250 284654 282989 281539 280153 278496 276640 275093 274057 272993 271372
52708 271372 269603 268680 268979 269979 271158 272480 273789 274386 273785 272557 271820 271935 272203 271887 271094 270467 270324
52691 270324 270507 270910 271746 273069 274324 274784 274457 274236 274948 276431 277716 277970 277087 275522 273828 272300
52675B72300j434j568j625j181l47K23J75j32k72l75o65p48k8J263K152K104J578
52658B71420J221J086R54R52J329J914K248K241K248K471K710K709K433J890R75
52643B98801k78j525k407k840k796k116q72K84O10J19n11q62j117j385j315p24
52627B81066j40j43m77l83K73Q23P37K57n8J9L58P30R44Q61N41J95r4l96o81p66
52607B83666n91l05L0N31J138J469J348J230J695K517K723J712N9j121j436j379
52591B93286j331j007j76N66M71j96l93J92O99M32j03m1N97J126J284J340J349
52574B98095J059M90M9K2L30O78N97k52j389j590l83J003J055K2o07l91l68j116
52556B97304j897k101k243k770l033k338j135k27L57Q66R53K66o31r84r17r13
$$ plain form
52675 272300 270866 269298 267673 266492 266145 266368 266543 266411 266139 265764 265099 264351 264323 265586 267738 269842 271420
52658 271420 272641 273727 274681 275633 276962 278876 281124 283365 285613 288084 290794 293503 295936 297826 298801
52643 298801 298523 296998 294591 291751 288955 286839 285967 286251 286861 286980 286469 285607 284490 283105 281790 281066
52627 281066 280926 280783 280306 279923 280196 281019 281756 282013 281955 281974 282332 283062 284006 284867 285408 285603 285509 285113 284432 283666
52607 283666 283075 282770 282800 283331 284469 285938 287286 288516 290211 292728 295451 297163 297222 296101 294665 293286
52591 293286 291955 290948 290772 291338 291809 291613 291220 291412 292111 292543 292440 292399 292996 294122 295406 296746 298095
52574 298095 299154 299644 299693 299715 300045 300723 301320 301068 299679 298089 297706 298709 299764 299786 299179 298788 298420 297304
52556 297304 295407 293306 291063 288293 285260 282922 281787 281560 281917 282783 283736 284002 283371 282387 281470 280557
52540B80557p53p2N24J76p18r16k62J96M1J55J148K275K611K305K023J820J361
52523B92471Q27P70J270J790J820J319N89K0j41j1M0j38k18K60J337K551L333
52506C07889L431L080K746K605K319J463P2j475k935m221n039m974l984k568j341
52491B97068o90p78j468k167k186j442n70k75o75j279j324k79J573L103L298K326
52475B94235J301R60J043J047R45R20Q65N97K43R7K95P88J486K217K790L206L575
52458C16610L784L603L124K593J696k11k852m708m608l259k407k738l355l268
52444C04004k630k212k252k263j820j143q09r86j135o79J71N99K61k54l11n1Q9
52427B88579J82N93J151J286Q74L46m1l64m98q0P48J273J180R84J122J214P80
$$ plain form
52540 280557 279804 279732 280256 280432 279714 278798 278536 278732 278773 278928 280076 282351 284962 287267 289290 291110 292471
52523 292471 293298 294068 295338 297128 298948 300267 300856 300876 300735 300724 300764 300626 300408 300668 302005 304556 307889
52506 307889 311320 314400 317146 319751 322070 323533 323605 322130 319195 314974 309935 304961 300977 298409 297068
52491 297068 296378 295600 294132 291965 289779 288337 287767 287492 286817 285538 284214 283935 285508 288611 291909 294235
52475 294235 295536 296496 297539 298586 299531 300451 301316 301913 302156 302253 302548 303336 304822 307039 309829 313035 316610
52458 316610 320394 323997 327121 329714 331410 331199 328347 323639 319031 315772 313365 310627 307272 304004
52444 304004 301374 299162 296910 294647 292827 291684 290875 289889 288754 288075 288246 288845 289106 288852 288541 288490 288579
52427 288579 288761 289354 290505 291791 292665 293011 292970 292606 292108 292028 292776 294049 295229 296213 297335 298549 299329
52410B99329K28L94J388K550L461M281N149N908O621P682R074R948R390P336M419
52395C77158J215j949m602o139o312n492m338l322k618k172j840j597j489j376
52381C35127q50K56J405J813J361P49O91J280K181L011L382L060K371K133K831
52366C60801M028M948N297N163M390K680L10j787k777k589j736p66O8Q54J747
52351C80631K601K942K536J809J394J420J583J726J940K140K123K086K584L749
52337D11264M996N731O014O332P006Q008R085R937J0477J1036J2057J3490J4814
52324E30247J5721J6404J7167J8122J9429K1222K3051K3916K3339K2047K1220
52313G51885K1311K1963K2718K3368K3845K4247K4776K5305K5252K4354K3258
$$ plain form
52410 299329 299557 299951 301339 303889 307350 311631 316780 322688 329309 336991 346065 356013 365403 372739 377158
52395 377158 378373 376424 371822 365683 359371 353879 349541 346219 343601 341429 339589 337992 336503 335127
52381 335127 334277 334533 335938 337751 339112 339861 340552 341832 344013 347024 350406 353466 355837 357970 360801
52366 360801 364829 369777 375074 380237 384627 387307 387617 385830 383053 380464 378728 377962 378030 378884 380631
52351 380631 383232 386174 388710 390519 391913 393333 394916 396642 398582 400722 402845 404931 407515 411264
52337 411264 416260 421991 428005 434337 441343 449351 458436 468373 478850 489886 501943 515433 530247
52324 530247 545968 562372 579539 597661 617090 638312 661363 685279 708618 730665 751885
52313 751885 773196 795159 817877 841245 865090 889337 914113 939418 964670 989024 1012282
52302A012282K2779K2782K2365K1151J9707J8662J7924J6980J5524J3485J0799
52291A214440P453L690j4l191n639p537r222j0726j1666j1767j1314j0851j0516
52278A133140r972q854p084m899k772j109K70J995M227O245P482Q541J0409J2881
52264A150500J4694J5188J4945J4680J4488J4481J5200J6739J8225J8826J8783
52253A326749J8791J8856J8467J7494J6236J4800J3122J1349R499P007L373q00
52241A474943m225o456q236j0240j2202j3616j4582j5504j6416j7109j7633j8131
52229A320593j8420j8218j7694j7356j7241j6626j4783j1942r289p887p690p712
52217A155735p170o206n357m674l756k502j271k24R16K238L264L626L738M287
$$ plain form
52302 1012282 1035061 1057843 1080208 1101359 1121066 1139728 1157652 1174632 1190156 1203641 1214440
52291 1214440 1221893 1225583 1225569 1222378 1216739 1209202 1199980 1189254 1177588 1165821 1154507 1143656 1133140
52278 1133140 1123168 1114314 1107230 1102331 1099559 1098450 1098720 1100715 1104942 1111187 1118669 1127210 1137619 1150500
52264 1150500 1165194 1180382 1195327 1210007 1224495 1238976 1254176 1270915 1289140 1307966 1326749
52253 1326749 1345540 1364396 1382863 1400357 1416593 1431393 1444515 1455864 1465363 1472370 1475743 1474943
52241 1474943 1470718 1464262 1456026 1445786 1433584 1419968 1405386 1389882 1373466 1356357 1338724 1320593
52229 1320593 1302173 1283955 1266261 1248905 1231664 1215038 1200255 1188313 1179024 1171137 1163447 1155735
52217 1155735 1148565 1142359 1137002 1132328 1128572 1126070 1124799 1124575 1125491 1127729 1130993 1134619 1138357 1142644
52203A142644N252N911N769N021M123L341K904L079L863M818N442N611N480N205
52189A208463M969N029N431N751N451M506L385K348J112o15k585m336n931p870
52175A225108j0164j1875j2019j0775r346q638q419p976p131o203n231l839j958
52162A121534j73R52J637K511L731M794N243N158M813M251L335K052N87p60j547
52147A158118j330j24J359K259K396K279K342K446K345K241K579L312L771L408
52133A187401K477J880K315L684N309O735Q206J0288J3117J6284J9468K2825K6403
52120A326392K9506L1241L1661L1844L2599L3607L4051L3675L2739L1355K9512
52109A678182K7515K5729K3926K1558J8820J6614J5261J3959J2054J0155R195
$$ plain form
52203 1142644 1147896 1153807 1159576 1164597 1168720 1172061 1174965 1178044 1181907 1186725 1192167 1197778 1203258 1208463
52189 1208463 1213432 1218461 1223892 1229643 1235094 1239600 1242985 1245333 1246445 1245830 1243245 1238909 1232978 1225108
52175 1225108 1214944 1203069 1191050 1180275 1170929 1162291 1153872 1145896 1138765 1132562 1127331 1123492 1121534
52162 1121534 1121361 1122313 1123950 1126461 1130192 1134986 1140229 1145387 1150200 1154451 1157786 1159838 1160425 1159665 1158118
52147 1158118 1156788 1156664 1158023 1160282 1162678 1164957 1167299 1169745 1172090 1174331 1176910 1180222 1183993 1187401
52133 1187401 1189878 1191758 1194073 1197757 1203066 1209801 1218007 1228295 1241412 1257696 1277164 1299989 1326392
52120 1326392 1355898 1387139 1418800 1450644 1483243 1516850 1550901 1584576 1617315 1648670 1678182
52109 1678182 1705697 1731426 1755352 1776910 1795730 1812344 1827605 1841564 1853618 1863773 1872968
52098A872968Q826P736N502L078J257n16l167o599r924j2782j5612j8644k1397
52085A810726k3352k4667k5774k6605k6581k5284k2856j9752j6380j3047r973
52074A576455p180m485j774P73K894M665O537Q873J1548J4093J6086J7357J7949
52061A663791J8113J8277J8789J9589K0192K0080J9112J7606J6066J4794J3663
52050A860072J2320J0494Q128N186J633k301o133r600j2912j6267j9319k1653
52038A809648k3576k5802k8233k9685k9221k7382k5581k4526k3680k2244k0161
52027A529557j8078j6587j5762j5307j4941j4590j4260j3913j3544j3271j3080
52016A366224j2602j1501j0180r671j0448j1679j2057j1287j0307j0167j1055
$$ plain form
52098 1872968 1881794 1889530 1895032 1898110 1899367 1898851 1895684 1889085 1879161 1866379 1850767 1832123 1810726
52085 1810726 1787374 1762707 1736933 1710328 1683747 1658463 1635607 1615855 1599475 1586428 1576455
52074 1576455 1569275 1564790 1563016 1563789 1566683 1571348 1577885 1586758 1598306 1612399 1628485 1645842 1663791
52061 1663791 1681904 1700181 1718970 1738559 1758751 1778831 1797943 1815549 1831615 1846409 1860072
52050 1860072 1872392 1882886 1891014 1896200 1897833 1895532 1889399 1879799 1866887 1850620 1831301 1809648
52038 1809648 1786072 1760270 1732037 1702352 1673131 1645749 1620168 1595642 1571962 1549718 1529557
52027 1529557 1511479 1494892 1479130 1463823 1448882 1434292 1420032 1406119 1392575 1379304 1366224
52016 1366224 1353622 1342121 1331941 1322270 1311822 1300143 1288086 1276799 1266492 1256325 1245270
52005A245270j2571j4502j6932j9717k2224k3780k4342k4486k4747k5059k5063
51994A011847k4703k4223k3564k2226j9962j7348j5353j4519j4648j5130j5376
51983H04795j5178j4896j5075j5713j6099j5707j4912j4545j4872j5420j5603
51972F36775j5093j3789j1883r856q034o224m166k107m02J234L379N855P697Q302
51958E91688Q007P364O485N298L856K110r7k424m032m535m430m176l344j343J457
51943F01884M039O097Q391J1693J5783J9716K2905K5731K9020L2879L6209L7573
51931H51920L6249L2080K4609J3453k01j3438k3627l0154l3861l5602l5986l5703
51919G49739l5042l3472l0636k7388k4869k2896k0340j7032j4116j2361j1262
$$ plain form
52005 1245270 1232699 1218197 1201265 1181548 1159324 1135544 1111202 1086716 1061969 1036910 1011847
51994 1011847 987144 962921 939357 917131 897169 879821 864468 849949 835301 820171 804795
51983 804795 789617 774721 759646 743933 727834 712127 697215 682670 667798 652378 636775
51972 636775 621682 607893 596010 586154 578120 571896 567730 565623 565221 566455 569834 575689 583386 591688
51958 591688 599695 607059 613544 618842 622698 624808 624711 622287 618255 613720 609290 605114 601770 600427 601884
51943 601884 605923 612020 620411 632104 647887 667603 690508 716239 745259 778138 814347 851920
51931 851920 888169 920249 944858 958311 958110 944672 921045 890891 857030 821428 785442 749739
51919 749739 714697 681225 650589 623201 598332 575436 555096 538064 523948 511587 500325
51908E00325r989q367o495m345k190o49K15J184K788M527N615N902N604M721L278
51893E02124J658L9k041m917p883r744j0086r493q649p718o585n190l640k155
51879D25720r13K24J566L110M552N872P392Q980R874R695Q987Q215O894M555J898
51864E06621l0j312k750m213m735m220l795m072m210l247j413M41J942L041L471
51849D81519L113K452K007J537M00j533l749n628o713o809o316o119o592p011
51835D40558o460n084l825l089k360j160K89J474K175K437K334J934J296M03p04
51820D30218j760k471k857l136l269k974k200j271n22l0K75M85P66J187J555J652
51804D15648J629J787J936J451K57p48o07N15J488J482P99L49N24P96M06p00j870
$$ plain form
51908 500325 490336 481969 475474 471129 468939 468290 468505 469689 472477 477004 482619 488521 494125 498846 502124
51893 502124 503782 503821 501780 496863 488980 479236 469150 459657 451008 443290 436705 431515 427875 425720
51879 425720 424807 425031 426597 429707 434259 440131 447523 456503 466377 476072 485059 493274 500168 504723 506621
51864 506621 506591 505279 502529 498316 493581 489361 485566 481494 477284 474037 472624 473065 475007 478048 481519
51849 481519 484632 487084 489091 490628 491028 489495 485746 480118 473405 466596 460280 454161 447569 440558
51835 440558 434098 429014 425189 422100 419740 418580 418869 420343 422518 424955 427289 429223 430519 430922 430218
51820 430218 428458 425987 423130 419994 416725 413751 411551 410280 409758 409728 410003 410488 411254 412441 413996 415648
51804 415648 417277 419064 421000 422451 422708 421960 421353 421868 423356 424838 425637 425986 426510 427306 427712 427012 425142
51787D25142k637l247l966m309l549j907m74J79O35J477K220K037J051J81j22
51772D12711j78k01J13R31J889K738L785N302O920Q100Q879R615J0083R492P477
51757D87656M617J706j053l814o314p858q173p875p830q228q512q137p119n779
51743D13287m355l009k059j684j534r39L51J903L257M578O350Q599J0669J1769
51729D47183J1532J0119P991N622L319J347K75Q10L003N758P559P616N952K685
51715E20771j847o250q445p687n534m056l612l306l096l949n917p477p479o577
51701D45539n919n225l376n09J661J798L58j137j738j691j742k144k316j554q8
51686D21917R08O26m53j322j797k414l297l908l907l440k506q56J258K994M009
$$ plain form
51787 425142 422505 419258 415292 410983 407434 405527 405053 405232 405867 407344 409564 411601 412652 412833 412711
51772 412711 412533 412332 412445 413376 415265 418003 421788 427090 434010 442110 450989 460604 470687 480179 487656
51757 487656 492273 493979 492926 489112 482798 474940 466767 458892 451062 442834 434322 426185 419066 413287
51743 413287 408932 405923 403864 402180 400646 399707 400058 401961 405218 409796 416146 424745 435414 447183
51729 447183 458715 468834 476825 482447 485766 487113 487388 488198 491201 496959 504518 512134 518086 520771
51715 520771 518924 512674 504229 496542 491008 486952 483340 480034 476938 472989 467072 459595 452116 445539
51701 445539 439620 434395 431019 430510 432171 433969 434327 433190 431452 429761 428019 425875 423559 422005 421917
51686 421917 422825 423451 422998 421676 419879 417465 414168 410260 406353 402913 400407 399551 400809 403803 407812
51671D07812M945O288P402P301O088M999N254P264J0600J4134J6482J6876J5598
51658E31043J3164R391L879k793r041j3483j5711j5936j4501j1812q268m110K29
51645D62051L672N071M378K652O82j669m405o507o918n961m935m425l900k970
51631D36816k180k212k965l884m735n469n779n347m397l417k427j150M6J46j174
51616C91872k857l652l595l594l802l305j574N16J603J311L78m01q60j128j178
51601C69734q36j65M36N69L35L72J283L050N143P117Q824J0167J0947J0984J0021
51586D37981P614L700o89l933n363n691n686n126l618j726l43O33K101M344O686
51571D30884Q550J0059J1486J2735J3605J4128J4490J5036J6151J7722J8813J8662
$$ plain form
51671 407812 412757 419045 426447 433748 439836 444835 450089 457353 467953 482087 498569 515445 531043
51658 531043 544207 553598 557477 554684 545643 532160 516449 500513 486012 474200 465932 461822 462051
51645 462051 465723 470794 475172 477824 478506 476837 472432 465925 459007 453046 448111 443686 439786 436816
51631 436816 434636 432424 429459 425575 420840 415371 409592 404245 399848 396431 394004 392854 392900 393046 391872
51616 391872 389015 385363 381768 378174 374372 371067 369493 370009 371612 372923 373301 372900 372040 370912 369734
51601 369734 368898 368733 369169 369738 370073 370445 371728 374778 379921 387038 395862 406029 416976 427960 437981
51586 437981 445595 449295 448606 444673 439310 433619 427933 422807 419189 417463 417120 417753 419854 424198 430884
51571 430884 439434 449493 460979 473714 487319 501447 515937 530973 547124 564846 583659 602321
51559F02321J7841J7743J8905K0726K2836K5547K8605L0523K9922K6754K1582
51548H63305J4504N718l491j1458j7641k2584k6567k9192l0209k9808k8018k4681
51536F59878k0296j6144j3140j0996r039p419o979p967r529j0666j1305j2003
51524E24395j2720j2554j0982q813p318o725o342n957o094o748o950o183n245
51511D21764m967m819l824k276j378j479j772j733j764k211k651k523j823q54
51497C87690R2O95P78P59J246K070K382J917J456J650K100K143J896J833J741
51482D10448R42n65j871k176j578q06m55o05r55j223j442j856k553l345m010m461
51466C83489m653m604m515m608m707m346l463k604k226k116j770j088l79J13L95
$$ plain form
51559 602321 620162 637905 656810 677536 700372 725919 754524 785047 814969 841723 863305
51548 863305 877809 883527 880036 868578 850937 828353 801786 772594 742385 712577 684559 659878
51536 659878 639582 623438 610298 599302 590263 582844 575865 567898 558369 547703 536398 524395
51524 524395 511675 499121 488139 479326 472008 465283 458941 452984 446890 440142 433192 427009 421764
51511 421764 416797 411978 408154 405878 404500 403021 401249 399516 397752 395541 392890 390367 388544 387690
51497 387690 387782 388477 389255 390014 391260 393330 395712 397629 399085 400735 402835 404978 406874 408707 410448
51482 410448 411390 410825 408954 406778 405200 404394 403939 403334 402379 401156 399714 397858 395305 391960 387950 383489
51466 383489 378836 374232 369717 365109 360402 356056 352593 349989 347763 345647 343877 342789 342410 342523 342918
51451C42918N85Q18J176J504J555J478J916L259N034O467P505Q787J0684J2712
51437D06398J4114J4593J4211J2859J0276O721L218Q10m55j374k494l649m737
51424D70491o259q401j0137j0184q737p286o653o258n498m704m179l360j882n92
51410C86361l55n17J90J589K257J739J179J462J929J616Q43O92J450K340K666
51395D05441K612K815L531M351M704M569M580N298O625Q170R921J2027J4158J5761
51381E04563J7041J9008K2323K6641L1192L5455L9049M1707M3770M6024M8372
51370H75145M9053M5826L7801K5873J1800k549j5476k5892l3626l9058m2537m4420
51358H41940m5308m5592m4931m2802l9491l5948l2627k9187k5420k1733j8482
$$ plain form
51451 342918 343503 344321 345497 347001 348556 350034 351950 355209 360243 366710 374215 383002 393686 406398
51437 406398 420512 435105 449316 462175 472451 479172 482390 483200 482745 481371 478877 475228 470491
51424 470491 464232 455831 445694 435510 426773 419487 412834 406576 401078 396374 392195 388835 386953 386361
51410 386361 386006 385489 385679 387268 389525 391264 392443 393905 395834 397450 398293 398985 400435 402775 405441
51395 405441 408053 410868 414399 418750 423454 428023 432603 437901 444526 452696 462617 474644 488802 504563
51381 504563 521604 540612 562935 589576 620768 656223 695272 736979 780749 826773 875145
51370 875145 924198 970024 1007825 1033698 1045498 1042949 1027473 1001581 967955 928897 886360 841940
51358 841940 796632 751040 706109 663307 623816 587868 555241 526054 500634 478901 460419
51347D60419j5431j2290r357p130n609m474l675l379l447l385k850j898q55j69
51333C86470k36q88j281p94p3m47k156l791m006l170k700l119l678l682l253k634
51317C50562j735p66m46q86r61K72K014K582J696P65Q67J491J680J460J375J416
51301C61386J136N36l2m92r55j142o57J94N32Op99j154r66n85l05k63m30m45K48
51282C55813J747L390M316M292L816L592M025N124O513P524P466O038L636J204
51268D18496m35j170j498j730j611q68J91J010J544K100K482J889n4k553m286
51253D13507m616l996l343l164l212k904k198j854k508l617l902k953j762j413
51239C72065j797k071j777j027M7J273K128K126J507R21N14j45j204k194k649
$$ plain form
51347 460419 444988 432698 423341 416211 410602 406128 402453 399074 395627 392242 389392 387494 386639 386470
51333 386470 386234 385346 384065 383271 383198 382751 380595 376804 372798 369628 366928 363809 360131 356449 353196 350562
51317 350562 348827 348061 347615 346729 345768 346040 348054 350636 352332 353097 353964 355455 357135 358595 359970 361386
51301 361386 362522 363058 363026 362534 361579 360437 359780 359974 360506 360512 359713 358559 357593 357008 356703 356440 356010 355565 355813
51282 355813 357560 360950 365266 369558 373374 376966 380991 386115 392628 400152 407618 413656 417292 418496
51268 418496 418061 416891 415393 413663 412052 411184 411375 412385 413929 416029 418511 420400 420346 417793 413507
51253 413507 408891 404895 401552 398388 395176 392272 390074 388220 385712 382095 378193 375240 373478 372065
51239 372065 370268 368197 366420 365393 365440 366713 368841 370967 372474 373395 373909 373764 372560 370366 367717
51224C67717k565k133j527j028q58p51j70Q60J631J701J489J599J937J960J476
51209C71338Q48N76R47J860K766L054K738K487K746L204L405L502L906M506M815
51194D12698M604L889K526M46j736l047l185k784k535k542k589k559k376j943
51180C98867j341q22m63j36J31K10L24R06J809K229J711P54J1n71j363k127k247
51163C97882j664j027q17q59p28j89P92K092L217L468K601J240L61L16M77p2j477
51146D05613k804k959j844m39K56P2n50j185j527j282l98O77J399J670J685J402
51130C99786O57k80p66n66j24R0J54M66J179K083K738K733K042J248J077J564
51114D14081K053K114K065K280K472K121J355Q55R23J199J315J347J481J592J447
$$ plain form
51224 367717 365152 363019 361492 360464 359606 358855 358685 359545 361176 362877 364366 365965 367902 369862 371338
51209 371338 372186 372762 373709 375569 378335 381389 384127 386614 389360 392564 395969 399471 403377 407883 412698
51194 412698 417302 421191 423717 424163 422427 419380 416195 413411 410876 408334 405745 403186 400810 398867
51180 398867 397526 396704 396241 396105 396236 396446 396770 397676 399485 401714 403425 404179 404190 403619 402256 400129 397882
51163 397882 396218 395191 394374 393515 392787 392598 393390 395482 398699 402167 404768 406008 406369 406685 407162 407090 405613
51146 405613 402809 399850 398006 397567 397823 397895 397345 396160 394633 393351 392953 393630 395029 396699 398384 399786
51130 399786 400443 400163 399397 398831 398707 398797 398951 399417 400596 402679 405417 408150 410192 411440 412517 414081
51114 414081 416134 418248 420313 422593 425065 427186 428541 429396 430319 431518 432833 434180 435661 437253 438700
51099D38700J085P56P04J099K021L167L820L418K196R35R2n11j036j154n76K89
51083D55005P24O45O35R67J188Q67K73p3j39k37m13m66m02l10M7R53K116K939
51065D64319L471M459O141P713Q451Q910J0352J3201J6700J9947K2636K4524K4762
51052F35586K2327J7172J0699N045J904J792M042P095R080Q693O119K918O63m69
51038G32666j577l645o544r366j1186j1373r734o932m618m515p071j1006j4359
51025F30740j6002j6161j5584j4344j1888q198m433j771k6J965M604P039Q585
51012E64526R716J1147J2669J3637J4024J4137J3628J1877R232O965N680M647
51000F91885L041J097m19j400k335l377m108m207l861l345k566j239O45K682M391
$$ plain form
51099 438700 439785 440541 441245 442344 444365 447532 451352 454770 456966 457901 457993 457482 456446 455292 454716 455005
51083 455005 455729 456374 457009 457976 459164 460031 460304 460231 460092 459855 459442 458976 458574 458264 458311 459264 461380 464319
51065 464319 467790 472249 478390 486103 494554 503464 513816 527017 543717 563664 586300 610824 635586
51052 635586 657913 675085 685784 690829 692733 694525 698567 705662 714742 723435 729554 732472 733135 732666
51038 732666 731089 727444 720900 711534 700348 688975 679241 672309 667691 663176 656105 645099 630740
51025 630740 614738 598577 582993 568649 556761 548563 544130 542359 542333 544298 548902 555941 564526
51012 564526 574242 585389 598058 611695 625719 639856 653484 665361 674593 681558 687238 691885
51000 691885 694926 696023 695604 694204 691869 688492 684384 680177 676316 672971 670405 669166 669811 672493 676884
50985F76884N567O373P191Q414J0250J2568J5056J7604K0499K3985K7639L0497
50973H62527L1861L1860L1143L0404L0334L1584L4443L8632M3696M9389N5462
50962A271335O1472O7187P2883P8682Q3835Q7322Q9095R0043R0588Q9945Q7049
50951B169436Q1758P4754O6605N7420M7321L6878K6921J7953R857K330m371r328
50939B577534j1915j2620j2592j2587j2783j3436j4958j7247j9486k1073k2325
50928B406512k4029k6575k9818l3497l7461m1665m6182n1143n6470o1737o6331
50917A931604o9710p1562p1865p0816o8515o4954o0535n6185n2419m8510m3477
50906A253056l7801l3153l0281k8112k5492k2789k0973j9911j8592j6678j4792
$$ plain form
50985 676884 682451 688824 696015 704429 714679 727247 742303 759907 780406 804391 832030 862527
50973 862527 894388 926248 957391 987795 1018129 1049713 1084156 1122788 1166484 1215873 1271335
50962 1271335 1332807 1399994 1472877 1551559 1635394 1722716 1811811 1901854 1992442 2082387 2169436
50951 2169436 2251194 2325948 2392553 2449973 2497294 2534172 2561093 2579046 2588903 2591233 2586862 2577534
50939 2577534 2565619 2552999 2540407 2527820 2515037 2501601 2486643 2469396 2449910 2428837 2406512
50928 2406512 2382483 2355908 2326090 2292593 2255132 2213467 2167285 2116142 2059672 1997935 1931604
50917 1931604 1861894 1790332 1718467 1647651 1579136 1514182 1453647 1397462 1345043 1296533 1253056
50906 1253056 1215255 1182102 1151821 1123709 1098217 1075428 1054455 1034544 1015952 999274 984482
50895I84482j3380j2131j0647q976p401o157n434n167m837l916k573j430o51K60
50881I02042J629L114M171M694N015N517O426P769R408J1174J2920J4421J5433
50868A003733J6070J6923J8449K0462K2521K4572K6836K9266L1649L4151L7196
50857A281828M0859M4904M9376N4612O0694O7444P5096Q4302R5229J07193J19438
50846B080975J31789J44236J56376J67661J77898J87134J95259K01936K06633
50837C649897K08517K06575K00098J88863J72696J51368J25281R6002O5708L6147
50827E101152Q424j6517l7698n4456o6652p4337p7400p5624o9208n9249m7570
50816D530865l5941k5531j7325j2855j3834k0854l2752m7596o4035q1526r9618
$$ plain form
50895 984482 971102 958971 948324 939348 931947 925790 920356 915189 910352 906436 903863 902433 901782 902042
50881 902042 903671 906785 910956 915650 920665 926182 932608 940377 949785 960959 973879 988300 1003733
50868 1003733 1019803 1036726 1055175 1075637 1098158 1122730 1149566 1178832 1210481 1244632 1281828
50857 1281828 1322687 1367591 1416967 1471579 1532273 1599717 1674813 1759115 1854344 1961537 2080975
50846 2080975 2212764 2357000 2513376 2681037 2858935 3046069 3241328 3443264 3649897
50837 3649897 3858414 4064989 4265087 4453950 4626646 4778014 4903295 4999297 5065005 5101152
50827 5101152 5109576 5093059 5055361 5000905 4934253 4859916 4782516 4706892 4637684 4578435 4530865
50816 4530865 4494924 4469393 4452068 4439213 4425379 4404525 4371773 4324177 4260142 4178616 4078998
50805D078998j17451j33954j48228j59778j68424j73933j75786j73552j67532
50796B660360j58717j48076j36215j23734j11398r9618q8275p7346o7299n8452
50786A591230n0385m2541l5133k8856k3910j9851j6302j3192j0468q136o664o636
50774A329156p777q879q991q377q050q598r662j0435j0450j0043j0050j0970j2376
50761A204498j3305j3211j2330j1213j0213r438q801p988o649m770k681n87J624
50748A104936M062O652R424J2630J6329K0131K3683K7210L1217L5786M0464M4902
50736A377426M9247N3884N8997O4465P0028P5478Q0825Q6338R2198R7979J02583
50725B209448J04986J05136J03968J02454J00744R8323R4755Q9983Q3857P5697
$$ plain form
50805 4078998 3961547 3827593 3679365 3519587 3351163 3177230 3001444 2827892 2660360
50796 2660360 2501643 2353567 2217352 2093618 1982220 1882602 1794327 1716981 1649682 1591230
50786 1591230 1540845 1498304 1463171 1434315 1410405 1390554 1374252 1361060 1350592 1342456 1335792 1329156
50774 1329156 1321379 1312500 1303509 1295132 1287082 1278484 1268822 1258387 1247937 1237894 1227844 1216874 1204498
50761 1204498 1191193 1177982 1165652 1154439 1144226 1134788 1125987 1117999 1111350 1106580 1103899 1103312 1104936
50748 1104936 1108998 1115650 1125074 1137704 1154033 1174164 1197847 1225057 1256274 1292060 1332524 1377426
50736 1377426 1426673 1480557 1539554 1604019 1674047 1749525 1830350 1916688 2008886 2106865 2209448
50725 2209448 2314434 2419570 2523538 2625992 2726736 2825059 2919814 3009797 3093654 3169351
50715C169351O4547M9822L1731J1303r870l0062m7818o1959p1319p4972p3028
50704B957726o6978n8785m9648l9804k9384j9072r952l135M90N15k807q934j7620
50691B652612k8897m2408n7062p1381q3956r3601r9539j01762j00903r7612r2239
50680A783252q5217p7274o9053o0769n2514m4577l7202l0319k3830j7860j2416
50669A272221p129j787L090O717Q934J0215J0975J1363J1646J2118J2566J2412
50657A363341J1586J0844J1045J2391J4535J6969J9177K0798K1969K3193K4728
50646A550576K6426K8260L0566L3412L6203L8432M0477M3106M6377M9505N1815
50635A975155N3353N4496N5398N5909N5723N4527N2247M9271M6207M3448M1130
$$ plain form
50715 3169351 3233898 3283720 3315451 3326754 3316884 3286822 3239004 3177045 3105726 3030754 2957726
50704 2957726 2890748 2831963 2782315 2742511 2713127 2694055 2684103 2680968 2681458 2681973 2679166 2670232 2652612
50691 2652612 2623715 2581307 2524245 2452864 2368908 2275307 2175768 2074006 1973103 1875491 1783252
50680 1783252 1698035 1620761 1551708 1490939 1438425 1393848 1356646 1326327 1302497 1284637 1272221
50669 1272221 1265092 1263305 1266395 1273112 1282046 1292261 1303236 1314599 1326245 1338363 1350929 1363341
50657 1363341 1374927 1385771 1396816 1409207 1423742 1440711 1459888 1480686 1502655 1525848 1550576
50646 1550576 1577002 1605262 1635828 1669240 1705443 1743875 1784352 1827458 1873835 1923340 1975155
50635 1975155 2028508 2083004 2138402 2194311 2250034 2304561 2356808 2406079 2452286 2495734 2536864
50624B536864L9529L9033L9450L9283L5921K6942J1993o123k2513l3064l6716
50613B670599l5077l0324k3941j7037j0724n630j581J711L926M350K456j918q534
50600B548276j6608k5205l4104m3827n4252o3765p0594p4675p7345p9302p9872
50589A928727p8534p6080p3648p1159o7563o2384n6408n0770m5835m1195l6463
50578A268688l1811k7715k4320k1194j7782j3960j0035o316k936k6K306M273O419
50565A125591R070J1944J4417J6126J7228J8203J9496K1117K2615K3500K3828
50554A323135K4118K4596K4828K4275K3074K1948K1421K1376K1347K1036K0489
50543A571643K0011K0025K0891K2632K4878K7241K9867L3421L8329M4098M9720
$$ plain form
50624 2536864 2576393 2615426 2654876 2694159 2730080 2757022 2769015 2762892 2740379 2707315 2670599
50613 2670599 2635522 2605198 2581257 2564220 2553496 2547866 2546285 2547996 2551922 2556272 2558728 2556810 2548276
50600 2548276 2531668 2506463 2472359 2428532 2374280 2310515 2239921 2165246 2087901 2008599 1928727
50589 1928727 1850193 1774113 1700465 1629306 1561743 1499359 1442951 1392181 1346346 1305151 1268688
50578 1268688 1236877 1209162 1184842 1163648 1145866 1131906 1121871 1115555 1112619 1112593 1114899 1119172 1125591
50565 1125591 1134661 1146605 1161022 1177148 1194376 1212579 1232075 1253192 1275807 1299307 1323135
50554 1323135 1347253 1371849 1396677 1420952 1444026 1465974 1487395 1508771 1530118 1551154 1571643
50543 1571643 1591654 1611679 1632570 1655202 1680080 1707321 1737188 1770609 1808938 1853036 1902756
50532A902756N4761N9723O5200P1095P6937Q2580Q8141R3601R9013J04862J11477
50521B810146J18122J23377J26475J27607J26831J23515J17231J08404R7503Q4197
50511C963408O8046M9635L0378J1244p681k6505m4904o2143p7353q9675r8459
50500C715991j03310j03968j00297r2598q1507o7504n0936l2839j5069R31J5080
50489C083974K7671L7914M4255M5848M2708L4535K0505P04k3060m8184p2521r4399
50477C099950j12150j24400j30799j32164j29930j25468j19684j13010j05807
50468B006538r8552r1488q4310p6673o8867o1505n4721m8225m2060l6532l1414
50457A312191k6034k0369j5245j1110p318l079J530N963J0020J3778J7156K0131
$$ plain form
50532 1902756 1957517 2017240 2082440 2153535 2230472 2313052 2401193 2494794 2593807 2698669 2810146
50521 2810146 2928268 3051645 3178120 3305727 3432558 3556073 3673304 3781708 3879211 3963408
50511 3963408 4031454 4081089 4111467 4122711 4115030 4088525 4043621 3981478 3904125 3814450 3715991
50500 3715991 3612681 3508713 3408416 3315818 3234311 3166807 3115871 3083032 3067963 3068894 3083974
50489 3083974 3111645 3149559 3193814 3239662 3282370 3316905 3337410 3338114 3315054 3266870 3194349 3099950
50477 3099950 2987800 2863400 2732601 2600437 2470507 2345039 2225355 2112345 2006538
50468 2006538 1907986 1816498 1732188 1655515 1586648 1525143 1470422 1422197 1380137 1343605 1312191
50457 1312191 1286157 1265788 1250543 1239433 1232115 1229036 1230566 1236529 1246549 1260327 1277483 1297614
50445A297614K2940K5642K7950K9955L2495L6083L9908M2563M3354M2108L8173
50434A678785L0797K0654J0071J304m962r346j2589j4929j6129j5811j3991j1398
50422A642456r014p123n169k633K96L138N898R119J3262J8291K3773K9329L4843
50409A756466M0249M5270M9583N3220N6499N9354O1160O1433O0337N8170N4721
50398B356462M9773M3893L7958L1939K4880J6103N782n799j8686l2504m5916n7413
50386B406472o6400p2995p7128p8375p6572p2122o5654n7727m8842l9429k9722
50375A721506j9797r838k61Q333J5293K0024K2151K1468J7867J1460K907o737
50363A804376j6641k6452l5742m3486m8587n0821n0873m9456m6682m2447l7089
$$ plain form
50445 1297614 1320554 1346196 1374146 1404101 1436596 1472679 1512587 1555150 1598504 1640612 1678785
50434 1678785 1709582 1730236 1740307 1741611 1736649 1727303 1714714 1699785 1683656 1667845 1653854 1642456
50422 1642456 1633442 1626319 1621150 1618517 1618813 1621951 1627849 1636968 1650230 1668521 1692294 1721623 1756466
50409 1756466 1796715 1841985 1891568 1944788 2001287 2060641 2121801 2183234 2243571 2301741 2356462
50398 2356462 2406235 2450128 2488086 2520025 2544905 2561008 2566790 2560991 2542305 2509801 2463885 2406472
50386 2406472 2340072 2267077 2189949 2111574 2035002 1962880 1897226 1839499 1790657 1751228 1721506
50375 1721506 1701709 1691871 1691610 1699943 1715236 1735260 1757411 1778879 1796746 1808206 1811113 1804376
50363 1804376 1787735 1761283 1725541 1682055 1633468 1582647 1531774 1482318 1435636 1393189 1356100
50352A356100l1517k6877k4182k3967k5954k9090l2129l4292l5385l5343l3941
50341A023423l0945k6499k1241j6015j1426p597m289j262J478L790N681P344Q947
50328I31389J0463J1741J2602J2882J2538J1868J1381J1304J1373J1347J1483
50317A060371J2123J2881J2875J1846J0551R676Q828P040M088P83j947l752m614
50304A140749m435l160j108J112L006M498N949P873J0479J3376J5918J7911J9999
50291A232167K3231K8155L4039L8702L9245L3528K1489N357j1329k5174l4015
50280A385395l7428l6524l3089k8590k3814j9190j5075j1558q341n223k616j250
50268A162697j172j371p85N36J625K006K302L261M609N535N992O695P925R098
$$ plain form
50352 1356100 1324583 1297706 1273524 1249557 1223603 1194513 1162384 1128092 1092707 1057364 1023423
50341 1023423 992478 965979 944738 928723 917297 909700 905411 904149 905627 909417 915098 922442 931389
50328 931389 941852 953593 966195 979077 991615 1003483 1014864 1026168 1037541 1048888 1060371
50317 1060371 1072494 1085375 1098250 1110096 1120647 1130323 1139151 1146191 1150279 1151062 1149115 1145363 1140749
50304 1140749 1136314 1133154 1132046 1133158 1136164 1140662 1146611 1154484 1164963 1178339 1194257 1212168 1232167
50291 1232167 1255398 1283553 1317592 1356294 1395539 1429067 1450556 1455913 1444584 1419410 1385395
50280 1385395 1347967 1311443 1278354 1249764 1225950 1206760 1191685 1180127 1171786 1166563 1163947 1162697
50268 1162697 1161525 1160154 1159369 1159905 1161530 1163536 1165838 1169099 1173708 1179243 1185235 1191930 1199855 1208953
50254A208953R806J0475J1492J2341J2332J1747J1458J1655J1664J0994R800Q243
50242A340960O048K906j025n181q809j1205j2093j1782j0611q384m949j065J930
50229A276740L258K760j09o056j4342k2377k7771l0219l0789l0183k8586k6615
50217A065711k5137k4167k2889k0899j8713j6934j5620j4563j3612j2488j0878
50206H69811q968p412o456n567m291l055k700l381m355m758m319l386k574k365
50192H06224k774l324l455l067k584k575l361m773o164o707o080m922m352m825
50178G47261n694o055n827n516n246m670l911l784m539m993l775j176R96J454
50164F94525N47o27j394j495p48O16J826K371K658L350M388N278O096P471R618
$$ plain form
50254 1208953 1218759 1229234 1240726 1253067 1265399 1277146 1288604 1300259 1311923 1322917 1332717 1340960
50242 1340960 1347008 1349914 1348889 1343708 1334899 1323694 1311601 1299819 1289208 1280824 1275875 1274810 1276740
50229 1276740 1279998 1282758 1282649 1276593 1262251 1239874 1212103 1181884 1151095 1120912 1092326 1065711
50217 1065711 1040574 1016407 993518 972619 953906 936972 921352 906789 893177 880689 869811
50206 869811 860843 853431 846975 841408 837117 834062 831362 827981 823626 818868 814549 811163 808589 806224
50192 806224 803450 800126 796671 793604 791020 788445 785084 780311 774147 767440 761360 756438 752086 747261
50178 747261 741567 735512 729685 724169 718923 714253 710342 706558 702019 697026 693251 692075 693071 694525
50164 694525 695072 694445 693051 691556 690808 691424 693250 695621 698279 701629 706017 711295 717391 724862 734480
50149G34480J1960J3866J5300J6637J8162J9826K1278K2142K2561K3245K4626
50138I44083K6058K6344K5187K3621K2940K3581K5227K7457K9919L2049L2948
50127A239414L1613K7346K0277J1531K591n700j3340k0284k5852k9253l0483l0284
50115A177576k9355k7904k5893k3293k0096j6395j2693r862q531q550r211r964
50103I75829j0673j1167j0966r809q233p178o915o751o000m824l942l758m128
50090H81485m664m859m132k271J65K274L709M749N609O115O207O260O660P360
50076I14667Q081Q717R295R737R820R348Q251O740N309M376L766K861J340m19
50062A001889j855k808l443l888m215m614n229n912o403o661o804o808o467n678
$$ plain form
50149 734480 746440 760306 775606 792243 810405 830231 851509 873651 896212 919457 944083
50138 944083 970141 996485 1021672 1045293 1068233 1091814 1117041 1144498 1174417 1206466 1239414
50127 1239414 1271027 1298373 1318650 1330181 1332772 1327072 1313732 1293448 1267596 1238343 1207860 1177576
50115 1177576 1148221 1120317 1094424 1071131 1051035 1034640 1021947 1012085 1003554 995004 985793 975829
50103 975829 965156 953989 943023 933214 924981 917803 910888 904137 898137 893313 889371 885613 881485
50090 881485 876821 871962 867830 865559 865724 867998 871707 876456 882065 888180 894387 900647 907307 914667
50076 914667 922748 931465 940760 950497 960317 969665 977916 984656 989965 994341 998107 1000968 1002308 1001889
50062 1001889 1000034 997226 993783 989895 985680 981066 975837 969925 963522 956861 950057 943249 936782 931104
50048I31104m550l248j862m44R23K161L278M444N951P915J0010J1657J2669J3412
50034I93420J4228J4860J4798J4094J3443J3459J4119J5026J5891J6539J6744
50023A156621J6424J5944J5790J5839J5341J3882J2036J0658R743Q581O994N645
50011A303498M844L800J648j248l875o205r360j4144k0124k6273l1760l5806l7563
49998A127432l6701l3768k9612k4820j9934j5602j2027q809n890m184m408n655
49986I26022o074n049l934m409o747r902j2722j4673j5790j6355j6554j6280j5386
49973G82147j4101j2933j2087j1309j0379r378q353p126n677m385l601l284l341
49960F76193l911m873n399m647k886j273m06K74J466L005M348N538O998Q539R304
$$ plain form
50048 931104 926554 923306 921444 921000 921923 924084 927362 931806 937757 945672 955682 967339 980008 993420
50034 993420 1007648 1022508 1037306 1051400 1064843 1078302 1092421 1107447 1123338 1139877 1156621
50023 1156621 1173045 1188989 1204779 1220618 1235959 1249841 1261877 1272535 1282278 1290859 1297853 1303498
50011 1303498 1308342 1312142 1313790 1312542 1308667 1302462 1293102 1278958 1258834 1232561 1200801 1164995 1127432
49998 1127432 1090731 1056963 1027351 1002531 982597 966995 954968 946159 940269 936085 931677 926022
49986 926022 919948 914899 910965 906556 899809 889907 877185 862512 846722 830367 813813 797533 782147
49973 782147 768046 755113 743026 731717 721338 711960 703607 696481 690804 686419 682818 679534 676193
49960 676193 672282 667409 662010 657363 654477 653204 652798 653072 654538 657543 661891 667429 674427 682966 692270
49945F92270Q861P794O987O665O414N728M370K552J038O23J131J267m5k455m895
49930G38305p035r293j1528j2850j2966j2705j2689j2248j0405p442m703l118
49918F21323k540k329j983j238j22J028J906K506K801K484J554Q22J150K307L307
49903F32976L853M654O146P709Q553Q783R174J0167J1490J2405J2119J0283P454
$$ plain form
49945 692270 701131 708925 715912 722577 728991 734719 739089 741641 742679 743302 744433 745700 745655 743200 738305
49930 738305 731270 721977 710449 697599 684633 671928 659239 646991 636586 629144 624441 621323
49918 621323 618783 616454 614471 613233 613111 614139 616045 618551 621352 623836 625390 626212 627362 629669 632976
49903 632976 636829 641483 647629 655338 663891 672674 681848 692015 703505 715910 728029 738312 745766
$$ [...]
##END NTUPLES=NMR SPECTRUM
##END=
