##TITLE=AC1501_CRIANN13308_8125382_Exf7PWUoEY
##JCAMPDX= 6.0         $$ Bruker NMR JCAMP-DX V2.0
##DATA TYPE= NMR SPECTRUM
##DATA CLASS= NTUPLES
##ORIGIN= BRUKER
##OWNER= Administrator
$$ 1.72 TOPSPIN		Version 2.1
$$ 2013-08-15 19:57:20.809 -0700  Administrator@X
$$ Compression mode = diff/dup
##.OBSERVE FREQUENCY= 400.02188249412
##.OBSERVE NUCLEUS= ^1H
##.ACQUISITION MODE= SIMULTANEOUS (DQD)
##.ACQUISITION SCHEME= undefined
##.AVERAGES= 64
##.DIGITISER RES= 22
##SPECTROMETER/DATA SYSTEM= spect
##.PULSE SEQUENCE= noesygpps1d.comp
##.SOLVENT NAME= COFFEE_meoh
##.SHIFT REFERENCE= INTERNAL, COFFEE_meoh, 1, 14.96095
##AUDIT TRAIL= $$ (NUMBER, WHEN, WHO, WHERE, PROCESS, VERSION, WHAT)
$$ ##TITLE= Audit trail, TOPSPIN		Version 2.1
$$ ##JCAMPDX= 5.01
$$ ##ORIGIN= Bruker BioSpin GmbH
$$ ##OWNER= Administrator
$$ $$ E:\/data/COFFEE/nmr/AC1501_CRIANN13308_8125382_Exf7PWUoEY/12/pdata/1/auditp.txt
$$ ##AUDIT TRAIL=  $$ (NUMBER, WHEN, WHO, WHERE, PROCESS, VERSION, WHAT)
(   1,<2013-08-15 19:57:15.981 -0700>,<Administrator>,<X>,<go>,<TOPSPIN 2.1>,
      <created by zg
	started at 2013-08-15 19:45:45.809 -0700,
	POWCHK enabled, PULCHK disabled,
       configuration hash MD5:
       C8 4E 4E 5D D3 5C D8 9E 9F 52 82 E0 59 8A DE 15
       data hash MD5: 64K
       F0 78 7A 8D B8 C7 AA 4B ED 01 BD E1 23 93 F0 01>)
(   2,<2013-08-15 19:57:18.888 -0700>,<Administrator>,<X>,<proc1d>,<TOPSPIN 2.1>,
      <Start of raw data processing
       efp LB = 0.3 FT_mod = 6 PKNL = 1 PHC0 = 0 PHC1 = 0 SI = 128K 
       data hash MD5: 128K
       5A D1 1B FD FB E9 7E 63 37 A6 D0 63 D6 50 AA D9>)
(   3,<2013-08-15 19:57:19.841 -0700>,<Administrator>,<X>,<proc1d>,<TOPSPIN 2.1>,
      <pk PHC0 = -78.94775 PHC1 = 0 
       data hash MD5: 128K
       5F 76 C5 E3 34 39 11 86 89 AF AC 2B 39 4E 03 CC>)
(   4,<2013-08-15 19:57:20.200 -0700>,<Administrator>,<X>,<proc1d>,<TOPSPIN 2.1>,
      <abs ABSG = 1 
       data hash MD5: 128K
       3E 62 2D D7 38 DD 6F 04 0B FD 3E 19 CB 76 35 D9>)
(   5,<2013-08-15 19:57:20.294 -0700>,<Administrator>,<X>,<proc1d>,<TOPSPIN 2.1>,
      <abs ABSG = 2 
       data hash MD5: 128K
       2D BD FD 2A 92 A6 37 99 27 DE FF 57 C0 7D B1 1A>)
(   6,<2013-08-15 19:57:20.372 -0700>,<Administrator>,<X>,<proc1d>,<TOPSPIN 2.1>,
      <abs ABSG = 3 
       data hash MD5: 128K
       AE 45 A5 25 96 78 9E 1D 7B C9 89 79 B2 BC 44 14>)
(   7,<2013-08-15 19:57:20.481 -0700>,<Administrator>,<X>,<proc1d>,<TOPSPIN 2.1>,
      <abs ABSG = 4 
       data hash MD5: 128K
       64 AA 6D 33 1B 99 B6 7D 32 92 B8 02 48 EE FE 9C>)
(   8,<2013-08-15 19:57:20.606 -0700>,<Administrator>,<X>,<proc1d>,<TOPSPIN 2.1>,
      <abs ABSG = 5 
       data hash MD5: 128K
       C4 2F 11 44 A8 6D 9C B3 F5 8B DB A3 6D 3D 8A 4A>)
$$ ##END=
$$ 
$$ $$ hash MD5
$$ $$ B3 61 50 3A 19 2B D2 1B FE 72 2E AF E4 21 6C 71
##$RELAX= 
##$RELAX= 
##$RELAX= 
##$RELAX= 
##$RELAX= 
##$RELAX= 
##$RELAX= 
##$RELAX= 
$$ Bruker specific parameters
$$ --------------------------
##$DU= <E:\>
##$EXPNO= 12
$$ [...]
##$TP07= 0
##$TPNAME0= <>
##$TPNAME1= <>
##$TPNAME2= <>
##$TPNAME3= <>
##$TPNAME4= <>
##$TPNAME5= <>
##$TPNAME6= <>
##$TPNAME7= <>
##$TPOAL= (0..7)
0.5 0.5 0.5 0.5 0.5 0.5 0.5 0.5
##$TPOFFS= (0..7)
0 0 0 0 0 0 0 0
##$TUNHIN= 0
##$TUNHOUT= 0
##$TUNXOUT= 0
##$USERA1= <user>
##$USERA2= <user>
##$USERA3= <user>
##$USERA4= <user>
##$USERA5= <user>
##$V9= 5
##$VALIST= <valist>
##$VCLIST= <CCCCCCCCCCCCCCC>
##$VD= 0
##$VDLIST= <DDDDDDDDDDDDDDD>
##$VPLIST= <PPPPPPPPPPPPPPP>
##$VTLIST= <TTTTTTTTTTTTTTT>
##$WBST= 1024
##$WBSW= 4
##$XGAIN= (0..3)
0 0 0 0
##$XL= 0
##$YL= 0
##$YMAX_a= 6657261
##$YMIN_a= -13754753
##$ZGOPTNS= <>
##$ZL1= 120
##$ZL2= 120
##$ZL3= 120
##$ZL4= 120
##$ABSF1= 14.96095
##$ABSF2= -5.597232
##$ABSG= 5
##$ABSL= 3
##$ALPHA= 0
##$AQORDER= 0
##$ASSFAC= 0
##$ASSFACI= 0
##$ASSFACX= 0
##$ASSWID= 0
##$AUNMP= <proc_prof1d_extract.lims>
##$AXLEFT= 0
##$AXNAME= <>
##$AXNUC= <1H>
##$AXRIGHT= 0
##$AXTYPE= 0
##$AXUNIT= <>
##$AZFE= 0.1
##$AZFW= 0.1
##$BCFW= 0
##$BC_mod= 0
##$BYTORDP= 0
##$COROFFS= 0
##$CY= 15
##$DATMOD= 1
##$DC= 0
##$DFILT= <>
##$DTYPP= 0
##$F1P= 0
##$F2P= 0
##$FCOR= 0.5
##$FTSIZE= 131072
##$FT_mod= 6
##$GAMMA= 0
##$GB= 0
##$INTBC= 1
##$INTSCL= 1
##$ISEN= 128
##$LB= 0.3
##$LEV0= 0
##$LPBIN= 0
##$MAXI= 10000
##$MC2= 0
##$MEAN= 0
##$ME_mod= 0
##$MI= 0
##$NCOEF= 0
##$NC_proc= -2
##$NLEV= 6
##$NOISF1= 0
##$NOISF2= 0
##$NSP= 0
##$NTH_PI= 0
##$NZP= 0
##$OFFSET= 14.96095
##$PC= 1
##$PHC0= -78.94775
##$PHC1= 0
##$PH_mod= 1
##$PKNL= yes
##$PPARMOD= 0
##$PPDIAG= 0
##$PPIPTYP= 0
##$PPMPNUM= 2147483647
##$PPRESOL= 1
##$PSCAL= 4
##$PSIGN= 0
##$PYNMP= <proc.py>
##$REVERSE= no
##$SF= 400.020009657321
##$SI= 131072
##$SIGF1= 0
##$SIGF2= 0
##$SINO= 400
##$SIOLD= 131072
##$SPECTYP= <>
##$SREGLST= <1H.CDCl3>
##$SSB= 0
##$STSI= 131072
##$STSR= 0
##$SW_p= 8223.68421052631
##$SYMM= 0
##$S_DEV= 0
##$TDeff= 65536
##$TDoff= 0
##$TI= <>
##$TILT= no
##$TM1= 0
##$TM2= 0
##$TOPLEV= 0
##$USERP1= <user>
##$USERP2= <user>
##$USERP3= <user>
##$USERP4= <user>
##$USERP5= <user>
##$WDW= 1
##$XDIM= 131072
##$YMAX_p= 383385789
##$YMIN_p= -17786
##$CURPLOT= <Network HP LaserJet P1505>
##$CURPRIN= <$Network HP LaserJet P1505>
##$DFORMAT= <normdp>
##$LAYOUT= <+/1D_H.xwp>
##$LFORMAT= <normlp>
##$PFORMAT= <normpl>
##$SURQMSG= 1
$$ End of Bruker specific parameters
$$ ---------------------------------
##NTUPLES= NMR SPECTRUM
##VAR_NAME=  FREQUENCY,     SPECTRUM/REAL,   SPECTRUM/IMAG
##SYMBOL=    X,             R,               I
##VAR_TYPE=  INDEPENDENT,   DEPENDENT,       DEPENDENT
##VAR_FORM=  AFFN,          ASDF,            ASDF
##VAR_DIM=   131072,        131072,          131072
##UNITS=     HZ,            ARBITRARY UNITS, ARBITRARY UNITS
##FACTOR=    0.0627417313425164, 1,          1
##FIRST=     8223.62146879497, 2673,         -66652
##LAST=      0,             4530,            -66529
##MIN=       0,             -17786,          0
##MAX=       8223.62146879497, 383385789,    0
$$ Real data points
##PAGE= N=1
##DATA TABLE= (X++(R..R)), XYDATA
$$ [...]
63888G96566k2594k1078k0370j9504j7939j6183j4924j4092j3118j1702r969q063
$$ 796566 773972 752894 732524 713020 695081 678898 663974 649882 636764 625062 615093 607030
63876F07030n986l819j790M3J989M422P157R374J0396J0481J0588J1371J2631
$$ 607030 601044 597225 595435 595478 597467 601889 609046 618420 628816 639297 649885 661256 673887
63863F73887J3807J4607J4940J4600J3411J1636R883Q577P628O600N080L002P08
$$ 673887 687694 702301 717241 731841 745252 756888 766771 775348 782976 789576 794656 797658 798366
63850G98366j404l337n447p847j0134j1881j3202j4505j5870j7013j7794j8420
$$ 798366 796962 793625 788178 780331 770197 758316 745114 730609 714739 697726 679932 661512
63838F61512j9114j9764k0077j9881j9330j8787j8502j8336j7878j6934j5744
$$ 661512 642398 622634 602557 582676 563346 544559 526057 507721 489843 472909 457165
63827D57165j4608j3555j2555j1838j1630j1671j1342j0349r007p825p030o537
$$ 457165 442557 429002 416447 404609 392979 381308 369966 359617 350610 342785 335755 329218
63815C29218o151n689n061m368l866l703l710l504k859k022j531j577j634j016
$$ 329218 323067 317378 312317 307949 304083 300380 296670 293166 290307 288285 286754 285177 283543 282527
63801B82527J49Q91M97o93j812k439k699k728k580k427k366k151j651j397j983
$$ 282527 282676 283567 284064 283371 281559 279120 276421 273693 271113 268686 266320 264169 262518 261121 259138
63786B59138k917k920j653l79m04j423k110j862j182o09r3M03N02k4p34r85p00
$$ 259138 256221 253301 251648 251269 250865 249442 247332 245470 244288 243679 243586 243989 244491 244467 243733 242748 242048
63769B42048k88n6L2O6O7O5J31K06J17j89n34o80n63l52l14n51p96n93J58R64
$$ 242048 241760 241704 241736 241802 241869 241934 242065 242271 242388 242199 241665 240985 240422 240070 239756 239205 238409 237816 237974 238938
63749B38938J240J000P65Q69J124J267J303J285J152R97J186J854K622L086L324
$$ 238938 240178 241178 241943 242812 243936 245203 246506 247791 248943 249940 251126 252980 255602 258688 262012
63734B62012L514L395K682J805J480J704J844J761K007K713L188L065L080L966
$$ 262012 265526 268921 271603 273408 274888 276592 278436 280197 282204 284917 288105 291170 294250 298216
63720B98216N228N780N451M973M701M225L295K287J543R22K79j73l34o40j519
$$ 298216 303444 309224 314675 319648 324349 328574 331869 334156 335699 336621 336900 336727 336393 335753 334234
63705C34234k707l468l384k614j544m95K65N40L80J17R2L16M71L47K32O77J772
$$ 334234 331527 328059 324675 322061 320517 320022 320287 320827 321207 321324 321416 321732 322203 322550 322782 323459 325231
63688C25231K893L344L114K706K326J710P20k43o49l62L11R34J233J258J343J684
$$ 325231 328124 331468 334582 337288 339614 341324 342044 341801 341152 340790 341101 342035 343268 344526 345869 347553
63672C47553J995J851J389J197J498J831J831J736J778J564P09k79n20j33l17
$$ 347553 349548 351399 352788 353985 355483 357314 359145 360881 362659 364223 364932 364653 364133 364000 363683
63657C63683j817l926n338n565n076m423l805l361l349l723l963l528k458j291
$$ 363683 361866 357940 352602 347037 341961 337538 333733 330372 327023 323300 319337 315809 313351 312060
63643C12060m42J65P47J165J089O66O48J530K814L557L582L607M130M782N095
$$ 312060 311618 311783 312530 313695 314784 315450 316098 317628 320442 323999 327581 331188 335318 340100 345195
63628C45195N319N968O943P754Q374R210J0284J1147J1672J2214J2915J3462J3850
$$ 345195 350514 356482 363425 371179 379553 388763 399047 410194 421866 434080 446995 460457 474307
63615D74307J4625J6036J7616J9043K0752K3030K5225K6647K7762K9449L1379
$$ 474307 488932 504968 522584 541627 562379 585409 610634 637281 665043 694492 725871
63604G25871L2275L1749L0725K9817K8372K5555K1501J6793J1611O105J023k899
$$ 725871 758146 789895 820620 850437 878809 904364 925865 942658 954269 960374 961397 958498
63592I58498n809q330j0493j1757j2018j2029j2770j4756j7808k1094k3544k4622
$$ 958498 952689 944359 933866 922109 910091 898062 885292 870536 852728 831634 808090 783468
63580G83468k4733k4581k4356k3810k2851k1570j9861j7592j5085j2924j1191
$$ 783468 758735 734154 709798 685988 663137 641567 621706 604114 589029 576105 564914
63569E64914r349o914l890o53K235M107M710M680N036O062P139P854Q643J0081
$$ 564914 555565 548651 544761 544108 546343 550450 555160 559840 564876 570938 578077 585931 594574 604655
63555F04655J1957J3528J4446J5064J6012J7770K0506K3909K7263L0018L2319
$$ 604655 616612 630140 644586 659650 675662 693432 713938 737847 765110 795128 827447
63544H27447L4736L7366L9392L9663L7660L3768K8598K2265J4659O363j095o351
$$ 827447 862183 899549 938941 978604 1016264 1050032 1078630 1100895 1115554 1121917 1120822 1114471
63532A114471r359j1109j2283j2772j2569j2428j3225j5014j7261j9789k2914
$$ 1114471 1105112 1094003 1081720 1068948 1056379 1043951 1030726 1015712 998451 978662 955748
63521I55748k6574l0010l2531l4214l5473l6201l5878l4429l2356l0006k7191
$$ 955748 929174 899164 866633 832419 796946 760745 724867 690438 658082 628076 600885
63510F00885k3947k1046j9198j7977j6305j4021j2173j1519j1425j0692r050p200
$$ 600885 576938 555892 536694 518717 502412 488391 476218 464699 453274 442582 433532 426332
63498D26332n761m799m231m084m193m163l776l137k422j689j003n04k61k11k48
$$ 426332 420571 415772 411541 407457 403264 399101 395325 392188 389766 388077 387074 386570 386309 386098 385850
63483C85850j86K36J079K056K867L522M087M294L833K962K363K299K304J740M14
$$ 385850 385664 385900 386979 389035 391902 395424 399511 403805 407638 410600 412963 415262 417566 419306 419720
63468D19720j322k798l375k970k342k455l460m570m935m417l468k590j933j244
$$ 419720 418398 415600 412225 409255 406913 404458 400998 396428 391493 387076 383608 381018 379085 377841
63454C77841j60J225K241K391K050K002K476L109L702M442N370O290P187Q201
$$ 377841 377681 378906 381147 383538 385588 387590 390066 393175 396877 401319 406689 412979 420166 428367
63440D28367R184R945J0884J2614J4875J6730J8018J9673K2195K4847K6829K8282
$$ 428367 437551 447496 458380 470994 485869 502599 520617 540290 562485 587332 614161 642443
63428F42443K9321K9054K6728K3228K0246J8302J6670J5104J4487J5626J8341
$$ 642443 671764 700818 727546 750774 771020 789322 805992 821096 835583 851209 869550
63417H69550K1929K5766K9255L1903L3715L4972L5472L4563L2038K8419K4082
$$ 869550 891479 917245 946500 978403 1012118 1047090 1082562 1117125 1149163 1177582 1201664
63406A201664J8761J2259N209j311o578j0387j2770j3980j4608j5330j6537j8307
$$ 1201664 1220425 1232684 1237893 1236582 1230004 1219617 1206847 1192867 1178259 1162929 1146392 1128085
63394A128085k0594k3351k6508k9934l3350l6294l8291l9068l8513l6669l3944
$$ 1128085 1107491 1084140 1057632 1027698 994348 958054 919763 880695 842182 805513 771569
63383G71569l1057k8377k5535k2162j8748j6095j3983j1289p655m174j869k80
$$ 771569 740512 712135 686600 664438 645690 629595 615612 604323 596668 592494 590625 590345
63371E90345J755M365O626Q054R262J1020J3311J5594J7505J9043K0409K2004
$$ 590345 592100 596465 603091 611145 620407 631427 644738 660332 677837 696880 717289 739293
63359G39293K4247K7102K9827L1649L2638L3651L5293L7135L8143L7665L5688
$$ 739293 763540 790642 820469 852118 884756 918407 953700 990835 1028978 1066643 1102331
63348A102331L2302K7457K1488J5360R888M938m6m897q771j1407j3576j5952j8175
$$ 1102331 1134633 1162090 1183578 1198938 1208826 1213764 1213718 1208821 1200050 1188643 1175067 1159115 1140940
63335A140940j9596k0443k1620k3611k6213k9149l2171l4644l5785l5545l4642
$$ 1140940 1121344 1100901 1079281 1055670 1029457 1000308 968137 933493 897708 862163 827521
63324H27521l3527l1871k9306k6068k2475j8452j4163j0620q868q756r261r919
$$ 827521 793994 762123 732817 706749 684274 665822 651659 641039 632171 623415 614154 604235
63312F04235j1123j3009j4856j5993j6570j6967j6959j6091j4481j2697j1015
$$ 604235 593112 580103 565247 549254 532684 515717 498758 482667 468186 455489 444474
63301D44474r373p884o809o056n246m341l685l379l111k807k878l526m258m451
$$ 444474 435101 427217 420408 414352 409106 404765 401080 397701 394590 391783 388905 385379 381121 376670
63287C76670m062l409k663k018j972k742l556l317k103j245j581k322k157j012
$$ 376670 372608 369199 366536 364518 362546 359804 356248 352931 350828 349583 348002 345680 343523 342511
63273C42511L2L13K43L81O36P09P06Q02P94M90K57N50J154J522J749K435L550
$$ 342511 342543 342856 343099 343480 344116 344825 345531 346333 347127 347617 347874 348424 349578 351100 352849 355284 358834
63256C58834M231M043L653L784M145M045L602L515L969M482M772N054N508O080
$$ 358834 363065 367108 370761 374545 378690 382735 386337 389852 393821 398303 403075 408129 413637 419717
63242D19717O821P831Q866R653J0558J2208J4389J6119J7019J7780J8917J9920
$$ 419717 426538 434369 443235 452888 463446 475654 490043 506162 523181 540961 559878 579798
63230E79798K0166J9939J9849J9856J9695J9717K0450K1584K2273K2284K2071
$$ 579798 599964 619903 639752 659608 679303 699020 719470 741054 763327 785611 807682
63219H07682K1815K1296K0646K0354K0361J9955J8811J7391J5947J3933J0920
$$ 807682 829497 850793 871439 891793 912154 932109 950920 968311 984258 998191 1009111
63208A009111P476M368J325k542p264j1733j5125j7796k0372k2525k3305k2572
$$ 1009111 1016587 1020955 1022280 1019738 1012474 1000741 985616 967820 947448 924923 901618 879046
63196H79046k1286k0209j8961j6760j3688j0524p521m153j67L786O963R368J1426
$$ 879046 857760 837551 818590 801830 788142 777618 770097 765944 765777 769563 776526 785894 797320
63183G97320J3313J5097J7043J9196K0952K1755K1994K2530K3464K4136K4162
$$ 797320 810633 825730 842773 861969 882921 904676 926670 949200 972664 996800 1020962
63172A020962K3773K3098K1971K0564J9354J8101J5760J1946P796M640K274p35
$$ 1020962 1044735 1067833 1089804 1110368 1129722 1147823 1163583 1175529 1183325 1187965 1190239 1189504
63160A189504n299j1074j7211k3017k7884l1316l3382l4726l5840l6573l6512
$$ 1189504 1184205 1173131 1155920 1132903 1105019 1073703 1040321 1005595 969755 933182 896670
63149H96670l5550l3924l1883k9492k6725k3645k0621j8242j6846j6049j4996
$$ 896670 861120 827196 795313 765821 739096 715451 694830 676588 659742 643693 628697
63138F28697j3224j1068r183p807o678n482m194l053k347k103j862r68O60K176
$$ 628697 615473 604405 595222 587415 580737 575255 571061 568008 565661 563558 561696 560728 561388 563564
63124E63564K648K240K086K867L969M430M264M303M927N585N610M956L938K765
$$ 563564 566212 568452 570538 573405 577374 581804 586068 590371 595298 600883 606493 611449 615387 618152
63110F18152J613P58K91ok29j07N27J274J584J431J192J028P53K52l89j024j451
$$ 618152 619765 620523 620814 620808 620579 620472 620999 622273 623857 625288 626480 627508 628261 628513 628124 627100 625649
63093F25649j337n24N68J241J168N43k99j009j148m80N71J208J156R43J137J669
$$ 625649 624312 623788 624356 625597 626765 627308 627009 626000 624852 624372 624943 626151 627307 628250 629387 631056
63077F31056K065K107K089K515L684N365O944P996Q633R120R399R428R719J0939
$$ 631056 633121 635228 637317 639832 643516 648881 655825 663821 672454 681574 690973 700401 710120 721059
63063G21059J2916J4787J6160J7596J9626K1971K4056K5831K7614K9573L1802
$$ 721059 733975 748762 764922 782518 802144 824115 848171 874002 901616 931189 962991
63052I62991L4583L8010M1601M4733M7271M9406N1092N2104N2560N2859N3152
$$ 962991 997574 1035584 1077185 1121918 1169189 1218595 1269687 1321791 1374351 1427210 1480362
63041A480362N3219N2864N2091N0934M9459M7968M6879M6264M5688M4585M2699
$$ 1480362 1533581 1586445 1638536 1689470 1738929 1786897 1833776 1880040 1925728 1970313 2013012
63030B013012M0080L6767L2553K7115K0379J2609M057n308j5384k5412l4368m1892
$$ 2013012 2053092 2089859 2122412 2149527 2169906 2182515 2186572 2181264 2165880 2140468 2106100 2064208
63018B064208m8262n3382n6520n7369n6637n5029n2294m7964m2514l6875l1109
$$ 2064208 2015946 1962564 1906044 1848675 1792038 1737009 1684715 1636751 1594237 1557362 1526253
63007A526253k4581j7285j0047l264L507J0421J6675K1544K5438K9316L3459L7403
$$ 1526253 1501672 1484387 1474340 1471076 1474583 1485004 1501679 1523223 1548661 1577977 1611436 1648839
62995A648839M0743M3350M4959M5105M3722M1490L9453L8271L7744L6965L5071
$$ 1648839 1689582 1732932 1777891 1822996 1866718 1908208 1947661 1985932 2023676 2060641 2095712
62984B095712L1888K7810K3074J7400J0438K288o599j5829k5162l4345m3023n0822
$$ 2095712 2127600 2155410 2178484 2195884 2206322 2208610 2202011 2186182 2161020 2126675 2083652 2032830
62972B032830n7519o3127o7722p1068p2591p2113p0407o8479o6369o3240n8849
$$ 2032830 1975311 1912184 1844462 1773394 1700803 1628690 1558283 1489804 1423435 1360195 1301346
62961A301346n4189n0276m6971m3524l9835l6435l3584l1145k9137k7704k6565
$$ 1301346 1247157 1196881 1149910 1106386 1066551 1030116 996532 965387 936250 908546 881981
62950H81981k5258k3943k3215k3022k2461k0914j8816j7012j5867j5276j4964
$$ 881981 856723 832780 809565 786543 764082 743168 724352 707340 691473 676197 661233
62939F61233j4426j3182j1500j0331j0040r750q606p151o568o857o770n559l865
$$ 661233 646807 633625 622125 611794 601754 592004 583398 576247 569679 562822 556052 550493 546628
62926E46628k654k152k150k565l171l369k928k503k759l250k975j868j021j261
$$ 546628 543974 541822 539672 537107 533936 530567 527639 525136 522377 519127 516152 514284 513263 512002
62912E12002k123k606k438k176k299k619k638k135j375q74j000j706k480k700
$$ 512002 509879 507273 504835 502659 500360 497741 495103 492968 491593 490719 489719 488013 485533 482833
62898D82833k184j416j062j241j392j010l02P9j64p29j195j400j311r02l50K0
$$ 482833 480649 479233 478171 476930 475538 474528 474226 474305 474141 473412 472217 470817 469506 468604 468254 468274
62882D68274J75M36R03J138P80J39j83m0L20P57J158J093K74p10q61j49K93l31
$$ 468274 468449 468885 469788 470926 471706 471845 471662 471622 471942 472699 473857 474950 475224 474514 473653 473504 473797 473466
62864D73466j375j650r57j27J79Q9jj0k5O0M99J330K199K565K205J505J145J370
$$ 473466 472091 470441 469484 469357 469536 469625 469624 469614 469589 469649 470148 471478 473677 476242 478447 479952 481097 482467
62846D82467J744J730J305Q33M54po24j107j089m74M85J318J559J027L7p98j042
$$ 482467 484211 485941 487246 488079 488533 488526 487902 486795 485706 485232 485717 487035 488594 489621 489658 488860 487818
62829D87818p72l47nL63J040K118L261L851L501K426J261N10K31K77O18J243J874
$$ 487818 487046 486699 486694 487057 488097 490215 493476 497327 500828 503254 504515 505025 505256 505533 506151 507394 509268
62812E09268K110J987K102K854L790M061L564L115L370M025M456M658N079N777
$$ 509268 511378 513365 515467 518321 522111 526172 529736 532851 536221 540246 544702 549360 554439 560216
62798E60216O442P129Q284R907J1312J2047J2534J3505J5127J7101J9211K1412
$$ 560216 566658 573787 582071 591978 603290 615337 627871 641376 656503 673604 692815 714227
62786G14227K3642K5955K8746L2453L7084M2237M7478N2440N6834O0662O4280
$$ 714227 737869 763824 792570 825023 862107 904344 951822 1004262 1061096 1121758 1186038
62775A186038O7875P0996P3008P3852P3929P3256P1231O7297O1440N3857M4589
$$ 1186038 1253913 1324909 1397917 1471769 1545698 1618954 1690185 1757482 1818922 1872779 1917368
62764A917368L3754K1910R817k162j4143k6204l7816m7955n5897o1826o6509p0230
$$ 1917368 1951122 1973032 1982849 1980687 1966544 1940340 1902524 1854569 1798672 1736846 1670337 1600107
62752A600107p2437p2654p1411o9747o7955o5426o1809n7651n3661m9908m6167
$$ 1600107 1527670 1455016 1383605 1313858 1245903 1180477 1118668 1061017 1007356 957448 911281
62741I11281m2478l8897l5043l0660k6421k3446k1827k0340j7892j4753j2027
$$ 911281 868803 829906 794863 764203 737782 714336 692509 672169 654277 639524 627497
62730F27497j0220q850p315n688m528m134m101l640k251j55K007L775N039N856
$$ 627497 617277 608427 601112 595424 590896 586762 582661 579021 576770 576615 578622 582397 587436 593292
62716E93292O451P424R303J1716J3534J4282J4962J6883K0110K3676K7034L0346
$$ 593292 599743 607167 616470 628186 641720 656002 670964 687847 707957 731633 758667 789013
62704G89013L3576L6403L9231M3115M8183N3088N6796O0081O4350O9586P4519
$$ 789013 822589 858992 898223 941338 989521 1042609 1099405 1159486 1223836 1293422 1367941
62693A367941P8379Q1307Q3201Q3379Q1600P8428P4150O8125N9611M8660L5850
$$ 1367941 1446320 1527627 1610828 1694207 1775807 1854235 1928385 1996510 2056121 2104781 2140631
62682B140631K1702O751q248k2704l6367m8941n9842o8722p5774q1196q4702q5999
$$ 2140631 2162333 2169084 2160836 2138132 2101765 2052824 1992982 1924260 1848486 1767290 1682588 1596589
62670A596589q5401q3588q0942p7501p3302o8436o3015n7425n2360m8145m4248
$$ 1596589 1511188 1427600 1346658 1269157 1195855 1127419 1064404 1006979 954619 906474 862226
62659H62226l9968l5506l1828k9360k7346k4730k1391j8154j5777j4278j3299
$$ 862226 822258 786752 754924 725564 698218 673488 652097 633943 618166 603888 590589
62648E90589j2684j2351j1855j0673r011p750p278o946o054m878m058l466k568
$$ 590589 577905 565554 553699 543026 534015 526265 518987 512041 505987 501109 497051 493585 491017
62635D91017j583j226j398j249o19k97n45n84p8N7q83k106k460k058j738j574
$$ 491017 489434 488208 486810 485561 484942 484645 484100 483516 483438 483495 482612 480506 478046 475988 474250 472676
62619D72676j017r5O35J163J976L108M039M522M762M952N304O270P892R186R113
$$ 472676 471659 471564 472199 473362 475338 478446 482485 487007 491769 496721 502025 508295 516187 525373 534486
62604E34486Q112P664Q432R711J0857J2203J4318J7120K0063K2634K4495K5780
$$ 534486 542598 550262 558694 568405 579262 591465 605783 622903 642966 665600 690095 715875
62592G15875K7301K9771L2746L4986L5938L6085L5788L4734L2693K9881K6234
$$ 715875 743176 772947 805693 840679 876617 912702 948490 983224 1015917 1045798 1072032
62581A072032K1197J4728P731R55n769j2674j9164k4396k8227l0962l2705l3559
$$ 1072032 1093229 1107957 1115688 1116643 1110874 1098200 1079036 1054640 1026413 995451 962746 929187
62569I29187l3930l4074l3721l2702l1431l0221k8641k6242k3495k1226j9521
$$ 929187 895257 861183 827462 794760 763329 733108 704467 678225 654730 633504 613983
62558F13983j7890j6274j4965j3694j1760r138o752n366m807m445l996l558l275
$$ 613983 596093 579819 564854 551160 539400 530262 523510 518144 513337 508892 504896 501338 498063
62545D98063l192l218l124k702j986j137k25O45J163J180J143J668K631L162K766
$$ 498063 494871 491653 488529 485827 483841 482704 482479 483124 484287 485467 486610 488278 490909 494071 496837
62530D96837K044J993K928M347N691O912Q293J0004J1920J3824J5712J7889K0632
$$ 496837 498881 500874 503802 508149 513840 520752 529045 539049 550969 564793 580505 598394 619026
62517F19026K3743K6602K8822L0767L3267L6684M0515M3977M6792M9112N0804
$$ 619026 642769 669371 698193 728960 762227 798911 839426 883403 930195 979307 1030111
62506A030111N1277N0178M7872M4974M1640L7630L2755K6882J9778J1629L580
$$ 1030111 1081388 1131566 1179438 1224412 1266052 1303682 1336437 1363319 1383097 1394726 1398306
62495A398306k967p711j1530j4978j7333j7477j5257j1423o666j239M633J0543
$$ 1398306 1395339 1387628 1376098 1361120 1343787 1326310 1311053 1299630 1292964 1291725 1296358 1306901
62483A306901J6147K1273K5875L0071L4114L7951M0857M1791M0215L6352L0724
$$ 1306901 1323048 1344321 1370196 1400267 1434381 1472332 1513189 1554980 1595195 1631547 1662271
62472A662271K3681J5410O102l927j4223k4264l3653m2251n0081n7144o3272o8016
$$ 1662271 1685952 1701362 1707464 1703537 1689314 1665050 1631397 1589146 1539065 1481921 1418649 1350633
62460A350633p0689p0812o8674o5280o1471n7311n2544m7373m2382l7761l3083
$$ 1350633 1279944 1209132 1140458 1075178 1013707 956396 903852 856479 814097 776336 743253
62449G43253k8084k3306j9624j7261j5500j3423j0746p918n573l968k845j636
$$ 743253 715169 691863 672239 654978 639478 626055 615309 607391 601818 597850 595005 593369
62437E93369L2J875L027K919J967J149Q68O39j7r78j989l204m786o404p630q455
$$ 593369 593401 595276 598303 601222 603189 604338 605206 605845 605828 604850 602861 599657 594871 588467 580837 572382
62421E72382q957q880q217p751q136q726q315o904n683n260n038m572m314m539
$$ 572382 563425 554545 546328 538577 530441 521715 513400 506496 500813 495553 490515 485943 481629 477090
62407D77090m597l984l208k863k621k036j649k137k861k435o72J073J651J371
$$ 477090 472493 468509 465301 462438 459817 457781 456132 453995 451134 448699 448027 449100 450751 452122
62393D52122J227J554J920J980J971K320K967L318L070K826L447M763N615N337
$$ 452122 453349 454903 456823 458803 460774 463094 466061 469379 472449 475275 478722 483485 489100 494437
62379D94437M620M521N236O306P480Q666R515R783R904J0544J1717J2945J4036
$$ 494437 499057 503578 508814 515120 522600 531266 540781 550564 560468 571012 582729 595674 609710
62366F09710J5204J6572J8069J9743K1688K3930K6665L0253L4504L8521M1905
$$ 609710 624914 641486 659555 679298 700986 724916 751581 781834 816338 854859 896764
62355H96764M5546N0260N5149N8431N9696O0085O0188N9001N5349M9299M1655
$$ 896764 942310 992570 1047719 1106150 1165846 1225931 1286119 1345120 1400469 1449768 1491423
62344A491423L2997K3743J4490N722k453r858j6165k1487k6558l1858l7096m1757
$$ 1491423 1524420 1548163 1562653 1568375 1565922 1556064 1539899 1518412 1491854 1459996 1422900 1381143
62332A381143m5612m8201m8696m6865m3749m0702l8133l5725l3413l1376k9397
$$ 1381143 1335531 1287330 1238634 1191769 1148020 1107318 1069185 1033460 1000047 968671 939274
62321I39274k7156k4994k3650k3180k2860k2252k1637k1255k0801k0031j9239
$$ 939274 912118 887124 863474 840294 817434 795182 773545 752290 731489 711458 692219
62310F92219j8689j7985j6600j4751j3158j2065j1027r647q062o605n423m582
$$ 692219 673530 655545 638945 624194 611036 598971 587944 578297 570235 563630 558207 553625
62298E53625m155l935l459k558j634j080p70m15p5J53O24J695K961L562L265K625
$$ 553625 549470 545535 542076 539518 537884 536804 536034 535619 535544 535697 536321 538016 540977 544539 547804 550429
62282E50429K129J896K122L046M272M949M983N282O380P542P846P548P710Q904
$$ 550429 552558 554454 556576 559622 563894 568843 573826 579108 585488 593030 600876 608424 616134 625038
62268F25038J0814J2816J4461J5740J7272J9807K3218K6605K9683L3289L7896
$$ 625038 635852 648668 663129 678869 696141 715948 739166 765771 795454 828743 866639
62257H66639M2613M6538N0210N4563N9162O2823O5420O7549O8608O6957O2139
$$ 866639 909252 955790 1006000 1060563 1119725 1182548 1247968 1315517 1384125 1451082 1513221
62246A513221N5557M8481M0666L1402K0837R708j373j1867k1365l0051l8403m6121
$$ 1513221 1568778 1617259 1657925 1689327 1710164 1719872 1718499 1706632 1685267 1655216 1616813 1570692
62234A570692n2213n6515o0109o3682o6325o6606o4267o0252n5672n1199m6940
$$ 1570692 1518479 1461964 1401855 1338173 1271848 1205242 1140975 1080723 1025051 973852 926912
62223I26912m2470l7464l2533k8760k6195k3697k0717j8145j6763j5840j4217
$$ 926912 884442 846978 814445 785685 759490 735793 715076 696931 680168 664328 650111
62212F50111j1997j0085q680p357o228n823n889n452m182k811j955j282j48J388
$$ 650111 638114 628029 619349 611992 605764 599941 594052 588600 584418 581607 579652 578370 578222 579610
62198E79610K617L033K967L240M238N415O009O122O505P361Q112Q524R181J0332
$$ 579610 582227 585260 588227 591467 595705 601120 607129 613251 619756 627117 635229 643753 652934 663266
62184F63266J1185J1098J0716J0995J1749J2135J2088J2142J2159J1434J0101
$$ 663266 674451 685549 696265 707260 719009 731144 743232 755374 767533 778967 789068
62173G89068R279R578J0442J1205J2035J3470J5757J8956K3124K7957L2706L6742
$$ 789068 798347 807925 818367 829572 841607 855077 870834 889790 912914 940871 973577 1010319
62161A010319L9916M2225M3550M3836M3142M1306L7996L3180K7221K0413J2870
$$ 1010319 1050235 1092460 1136010 1179846 1222988 1264294 1302290 1335470 1362691 1383104 1395974
62150A395974N031k293q617j4236j9666k4930k9660l3570l6597l8717l9861l9949
$$ 1395974 1401005 1398712 1390095 1375859 1356193 1331263 1301603 1268033 1231436 1192719 1152858 1112909
62138A112909l8868l6610l3483k9984k6420k2828j9363j6408j4132j2151r902
$$ 1112909 1074041 1037431 1003948 973964 947544 924716 905353 888945 874813 862662 852760
62127H52760p323n006l644l338l387k841j360M97J977K966L964N282O585P299
$$ 852760 845437 840431 836787 833449 830062 827221 825861 826358 828335 831301 835265 840547 847132 854431
62113H54431P195O538N817N357M990M024J886j117l846n333n646n524n382n076
$$ 854431 861626 868164 873981 879338 884328 888352 890238 889121 885275 879942 874296 868772 863390 858314
62099H58314m693m975o424q253q960q095o697n674m488k316K26J679J913K348
$$ 858314 853621 848646 842222 833969 825009 816914 810217 804543 800055 797739 797965 799644 801557 803905
62085H03905L758N199N678N767O597Q168R770J1369J3375J5453J6822J7681J9068
$$ 803905 807663 812862 818540 824307 830904 839072 848842 860211 873586 889039 905861 923542 942610
62072I42610K1141K2734K2971K2479K2488K3383K4554K5280K5349K5179K5537
$$ 942610 963751 986485 1009456 1031935 1054423 1077806 1102360 1127640 1152989 1178168 1203705
62061A203705K6873K8741L0168L0573K9998K8501K5871K2091J7604J2864P996
$$ 1203705 1230578 1259319 1289487 1320060 1350058 1378559 1404430 1426521 1444125 1456989 1464985
62050A464985L008k077p352j2891j8370k3266k7552l1727l5987l9831m2685m4501
$$ 1464985 1467993 1465916 1458564 1445673 1427303 1404037 1376485 1344758 1308771 1268940 1226255 1181754
62038A181754m5442m5416m4258m2159l9634l7137l4778l2334k9494k6336k3378
$$ 1181754 1136312 1090896 1046638 1004479 964845 927708 892930 860596 831102 804766 781388
62027G81388k0977j8819j6509j4357j3039j2504j2045j1376j0895j0700j0298
$$ 781388 760411 741592 725083 710726 697687 685183 673138 661762 650867 640167 629869
62016F29869r546r081r274r558r321q768q309p658o319m503k883j785j176j029
$$ 629869 620323 611242 601968 592410 583089 574321 566012 558354 552035 547532 544649 542864 541688 540659
62002E40659j047m26J262L267M411M444L976L399K687K045J816J729J095j71j454
$$ 540659 539612 539186 540448 543715 548126 552570 556546 559945 562632 564677 566493 568222 569317 569146 567692
61987E67692k439l419m499n313n761o267o970p362p129o707o593o581o200n412
$$ 567692 565253 561834 557335 552022 546261 539994 533024 525662 518533 511826 505233 498652 492452 487040
61973D87040m549l881l678m138m855m900l925k748k290k403k377k183k326k752
$$ 487040 482491 478610 474932 470794 465939 461039 457114 454366 452076 449673 447296 445113 442787 440035
61959D40035k844k427j939j500o81N65J548J799J760K094K824L596M339N114N793
$$ 440035 437191 434764 432825 431325 430644 431209 432757 434556 436316 438410 441234 444830 449169 454283 460076
61944D60076O279O832P648Q499R242J0284J1923J3555J4334J4486J5073J6377
$$ 460076 466355 473187 480835 489334 498576 508860 520783 534338 548672 563158 578231 594608
61932E94608J7339J6981J5692J4513J3746J2883J1647J0309R008P432N415L386
$$ 594608 611947 628928 644620 659133 672879 685762 697409 707718 716726 724158 729573 732959
61920G32959J808M63j298l532n394n984n338m248l212j985k13J851L617M962O341
$$ 732959 734767 735230 733932 730400 725006 719022 713684 709436 706224 704239 704026 705877 709494 714456 720797
61905G20797Q116J0038J1499J2108J1962J1465J0852R802P696M446Q99j889l704
$$ 720797 728913 738951 750450 762558 774520 785985 796837 806639 814335 818781 819680 817791 814087
61892H14087n166o732q176r113r624j0060j0475j0566j0080r169q374q237q814
$$ 814087 808921 802189 794013 784900 775276 765216 754741 744175 734095 724926 716552 708315 699501
61879F99501r638j0238j0642j1099j1581j1848j1835j1614j1064j0073q929p978
$$ 699501 689863 679625 668983 657884 646303 634455 622620 611006 599942 589869 580940 572962
61867E72962p014n648m120l035k238q92J150K968L974M793O216Q057R736J1269
$$ 572962 565948 560300 556180 553145 550907 550015 551165 554133 558107 562900 569116 577173 586909 598178
61853E98178J2955J4711J6466J8604K1170K3247K4036K4111K4542K5153K4796
$$ 598178 611133 625844 642310 660914 682084 705331 729367 753478 778020 803173 827969
61842H27969K3133K0944J8707J6061J2894R837P225M508J240k089m689o395p423
$$ 827969 851102 872046 890753 906814 919708 929545 936770 941278 942518 940429 935740 929345 921922
61829I21922p723p091n559l368p51J926M128N569O494P304Q009Q127P033M488
$$ 921922 914199 907108 901549 898181 897430 899356 903484 909053 915547 922851 930860 938987 946020 950508
61815I50508R97k539n728r026j2767j6322j8780k0229k1455k2588k2908k2095
$$ 950508 951505 948966 943238 934212 921445 905123 886343 866114 844659 822071 799163 777068
61803G77068k0683j9131j7379j5643j4689j4728j4826j4035j2500j0960r671q460
$$ 777068 756385 737254 719875 704232 689543 674815 659989 645954 633454 622494 612823 604363
61791F04363p306o255n203m261l936m325m629m172l484l546m208m253l090j574
$$ 604363 597057 590802 585599 581338 577402 573077 568448 564276 560792 557246 553038 548785 545695 544121
61777E44121q66j047j244q34j11J75k49q78j059o93j50L54Q97J404J642J722K117
$$ 544121 543255 542208 540964 540130 540019 540194 539945 539067 538008 537315 537165 537519 538416 539820 541462 543184 545301
61760E45301K972L821M270M427M430M090L407K921K967L051K549J606P59j0j080
$$ 545301 548273 552094 556364 560791 565221 569311 572718 575639 578606 581657 584206 585812 586571 586561 585481
61745E85481k282k967l027l115l721m588n172n253m910m278l504k752k093j589
$$ 585481 583199 580232 577205 574090 570369 565781 560609 555356 550446 546168 542664 539912 537819 536230
61731E36230j346j307j066k99O70J196J183J241J748K255K128J472J044J340K075
$$ 536230 534884 533577 532511 532212 532882 534078 535261 536502 538250 540505 542633 544105 545149 546489 548564
61716E48564K710L149L633M060L865K743J255K58p9l43j000j928k828l574m021
$$ 548564 551274 554423 558056 562116 565981 568724 569979 570237 570158 569815 568815 566887 564059 560485 556464
61701E56464m004l721l653l864l847l401l106l451m025m137l862l797m071m241
$$ 556464 552460 548739 545086 541222 537375 533974 530868 527417 523392 519255 515393 511596 507525 503284
61687E03284m081l803l532l146k667k352k337k580l120l989m808m983m374l447
$$ 503284 499203 495400 491868 488722 486055 483703 481366 478786 475666 471677 466869 461886 457512 454065
61673D54065k699k241j999j918j884j681j188m92J60M34J08o30j223j316j079
$$ 454065 451366 449125 447126 445208 443324 441643 440455 439963 440123 440557 440665 440035 438812 437496 436417
61658D36417p56k31N94J354J655J658J736J823J758J965K874L821L544J991P10
$$ 436417 435661 435430 436024 437378 439033 440691 442427 444250 446008 447973 450847 454668 458212 460203 460913
61643D60913R48K166K933K678J939J366J191J388J663J488O25m18r18q49q26j202
$$ 460913 461861 464027 466960 469638 471577 472943 474134 475522 477185 478673 479298 478880 477962 477113 476287 475085
61627D75085j702j983k041j935j571j023p64j247k296l210l456l086k533k148
$$ 475085 473383 471400 469359 467424 465853 464830 464066 462819 460523 457313 453857 450771 448238 446090
61613D46090j997j944j861j858k287l371m767n737n894n572n333n327n386n458
$$ 446090 444093 442149 440288 438430 436143 432772 428005 422268 416374 410802 405469 400142 394756 389298
61599C89298n519n225m275l123k649k979l255k875k318k279k578k564k206k056
$$ 389298 383779 378554 374279 371156 368507 365528 362273 359398 357080 354801 352223 349659 347453 345397
61585C45397k311k582k565k321j910j305p42o34r47j172j026q18r07j155j160
$$ 345397 343086 340504 337939 335618 333708 332403 331661 331027 330080 328908 327882 327064 326157 325002 323842
61570C23842p85k67J08K13J28J0j7J16M77J052J580J720J521J395J436J209N04
$$ 323842 323057 322790 322898 323111 323239 323249 323232 323348 323825 324877 326457 328177 329698 331093 332529 333738 334242
61553C34242p5J50R59J584J790J921J956J443M33k70j53L26N03M56P28J451K247
$$ 334242 334167 334317 335276 336860 338650 340571 342527 343970 344403 344133 343980 344306 344809 345265 345993 347444 349691
61536C49691K785L055L140L003K578J891J085L62j00k68k20j31k23o15j131j482
$$ 349691 352476 355531 358671 361674 364252 366143 367228 367590 367490 367222 367002 366871 366648 366033 364902 363420
61520C63420j647j859k107k094j858j903k333k405j567m17R2O4L48J082J506J216
$$ 363420 361773 359914 357807 355713 353855 351952 349619 347214 345647 345230 345322 345386 345734 346816 348322 349538
61504C49538O29J06m24q37p32k34Rk4M51J658K606K432J569R55P47N61L26J02
$$ 349538 350167 350273 349849 349012 348280 348046 348055 348031 348482 350140 352746 355178 356747 357702 358449 359010 359336 359438
61486C59438m07j316j839j060P21K126K214J283K53j81J43R61J796K355K646K669
$$ 359438 359031 357715 355876 354816 355537 357663 359877 361160 361413 361232 361375 362336 364132 366487 369133 371802
61470C71802K252J403N23n9l83n04k99O8K1n55q69l18M57L51o89j710k026j668
$$ 371802 374054 375457 375980 375921 375538 375034 374735 374803 374824 374269 373400 373082 373539 373890 373201 371491 369465 367797
61452C67797p67N53J736K098J750J460J540J587J463J642K289K720K346J585J330
$$ 367797 367030 367583 369319 371417 373167 374627 376167 377754 379217 380859 383148 385868 388214 389799 391129
61437C91129J834K595L080L176L107L143L305L217K480J308M73M34P94Q49L92
$$ 391129 392963 395558 398638 401814 404921 408064 411369 414586 417066 418374 418847 419281 420075 420924 421316
61422D21316k13n48m76j26K09K36q8m71n88l58K6K63J86l6k0L10M42j52j286k293
$$ 421316 421103 420555 420079 419953 420162 420398 420310 419839 419251 418893 418919 419182 419368 419332 419312 419622 420064 419912 418626 416333
61402D16333k842l070k946k303j534j494k285k831k242j059m41n72o62k99R7J78
$$ 416333 413491 410421 407475 405172 403638 402144 399859 397028 394786 393727 393286 392714 392052 391753 391850 392028
61386C92028J47J83J09j9L39J449K681L205K984K671K694K931L193L503L802L743
$$ 392028 392175 392358 392467 392448 392787 394236 396917 400122 403106 405777 408471 411402 414595 418098 421900 425643
61370D25643L075K058J284J102J302J392J167R40J121J613J815J394Q60J095K326
$$ 425643 428718 430776 432060 433162 434464 435856 437023 437963 439084 440697 442512 443906 444766 445861 448187
61355D48187L830M737M947N065N562O239O548O372O248O770P771Q346P762O259
$$ 448187 452017 456754 461701 466766 472328 478567 485115 491487 497735 504505 512276 520622 528384 534643
61341E34643M746L818L325K901K577K658L151L625L655L222K582J831Q19n24j832
$$ 534643 539389 543207 546532 549433 552010 554668 557819 561444 565099 568321 570903 572734 573553 573029 571197
61326E71197k576k656k581k849l376l647l319k439j239oR34J446J756K098K340
$$ 571197 568621 565965 563384 560535 557159 553512 550193 547754 546515 546509 547443 548889 550645 552743 555083
61311E55083K371K689L932N827P356Q207R241J1013J2628J2803J1555R966Q602
$$ 555083 557454 560143 564075 569902 577258 585465 594706 605719 618347 631150 642705 652671 661273
61298F61273P113N188L027P43j768m233o016p003p823q853r613r524q755p857
$$ 661273 668386 673574 676601 677344 675576 671343 665327 658324 650501 641648 632035 622511 613756 605899
61284F05899p039o292n870o011o308n888m345k218m26O36J392K509M040N236N398
$$ 605899 598860 592568 586698 580687 574379 568491 564146 561928 561502 562138 563530 566039 570079 575315 580713
61269E80713M761M337M746N609O127O008N639N536N855O308O562O713P183P943
$$ 580713 585474 589811 594557 600166 606293 612301 617940 623476 629331 635639 642201 648914 656097 664040
61255F64040Q160P137N422M304M138L955K914J426L56k31r08j909k915l613l928
$$ 664040 672200 679337 684759 689063 693201 697156 700070 701496 701852 701621 700713 698804 695889 692276 688348
61240F88348l834l489l353l682l973l446k092p93l29o26j078j220r56l89K82Q20
$$ 688348 684514 681025 677672 673990 670017 666571 664479 663686 663357 662731 661653 660433 659477 659088 659370 660190
61224F60190J096J263J657K445L339L814L723L540L812M466M958M988M687M150
$$ 660190 661286 662549 664206 666651 669990 673804 677527 681067 684879 689345 694303 699291 703978 708128
61210G08128L326K417J887J839J838J587J348J367J406J270J420K514M534O844
$$ 708128 711454 713871 715758 717597 719435 721022 722370 723737 725143 726413 727833 730347 734881 741725
61196G41725Q896J0490J1600J2383J3247J4392J5381J5566J4859J3629J1976R671
$$ 741725 750621 761111 772711 785094 798341 812733 828114 843680 858539 872168 884144 893815
61184H93815O904M504L114K484J887J054L13r5m84j308k503l597m419n321o524
$$ 893815 900719 905223 908337 910821 912708 913762 914075 913980 913496 912188 909685 906088 901669 896348 889824
61169H89824p660q339q802r441r954r747r058q882r602j0488j0850j0939j1246
$$ 889824 882164 873825 865023 855582 845628 835881 826823 817941 808339 797851 787001 776062 764816
61156G64816j1620j1577j0980r935q456o735n213m001k703j277m59p90j883l181
$$ 764816 753196 741619 730639 720704 712248 705513 700300 696299 693596 692319 691860 691070 689187 686006
61142F86006m742o492p522p212o470o605p344p283o055m735l993l165j589L58
$$ 686006 681264 674772 667250 660038 653568 646963 639619 632336 626281 621546 617553 614388 612799 613157
61128F13157K014L390M787O178P458Q786J0307J1978J3856J5999J7975J9146J9666
$$ 613157 615171 618561 623348 629526 636984 645770 656077 668055 681911 697910 715885 735031 754697
61115G54697K0456K1928K3449K4446K5199K6038K6520K6137K5244K4496K3777
$$ 754697 775153 797081 820530 844976 870175 896213 922733 948870 974114 998610 1022387
61104A022387K2443K0428J8286J6250J3897J0789O984K869j101m559p507j0405
$$ 1022387 1044830 1065258 1083544 1099794 1113691 1124480 1131464 1134333 1133232 1128673 1121166 1110761
61092A110761j3578j6551j8458j9227j9834k1072k2502k3094k2662k2046k1861
$$ 1110761 1097183 1080632 1062174 1042947 1023113 1002041 979539 956445 933783 911737 889876
61081H89876k1690k0880j9595j8490j7658j6533j4880j3173j1881j0912r953q787
$$ 889876 868186 847306 827711 809221 791563 775030 760150 746977 735096 724184 714231 705444
61069G05444p103m734k275q17n25k90O90J748K000J960K827M670O450P634Q564
$$ 705444 698341 693607 691332 690515 689990 689700 690390 692138 694138 696098 698925 703595 710045 717679 726243
61054G26243R380R780R974J0765J2451J4528J6646J8912K1099K2576K3360K4359
$$ 726243 735623 745403 755377 766142 778593 793121 809767 828679 849778 872354 895714 920073
61042I20073K6096K7996K9372L0360L1468L2810L4184L5417L6322L6836L7442
$$ 920073 946169 974165 1003537 1033897 1065365 1098175 1132359 1167776 1204098 1240934 1278376
61031A278376L8747M0613M2290M3582M5068M7038M9046N0733N2309N4017N5928
$$ 1278376 1317123 1357736 1400026 1443608 1488676 1535714 1584760 1635493 1687802 1741819 1797747
61020A797747N8430O1940O6111P0438P5852Q4292R6338J10711J26645J45127J67015
$$ 1797747 1856177 1918117 1984228 2054666 2130518 2214810 2311148 2421859 2548504 2693631 2860646
61009B860646J91614K18478K49186K86127L30868L85266M52791N36982O39277
$$ 2860646 3052260 3270738 3519924 3806051 4136919 4522185 4974976 5511958 6151235
61000F151235P59386Q96022J045802J203903J368029J537285J700211J825103
$$ 6151235 6910621 7806643 8852445 10056348 11424377 12961662 14661873 16486976
60992A6486976J871609J817187J667801J439804J141171P84293M15790J14651
$$ 16486976 18358585 20175772 21843573 23283377 24424548 25208841 25624631 25739282
60984B5739282n7462j06668j02027j20871k04374l61960n97722r11165j271225
$$ 25739282 25681820 25575152 25473125 25352254 25147880 24785920 24188198 23277033 22005808
60975B2005808j607280j841527j933665j894528j763872j582848j383218j187970
$$ 22005808 20398528 18557001 16623336 14728808 12964936 11382088 9998870 8810900
60967H810900j011179q57434p25556o13712n20502m43459l79451l26477k83602
$$ 8810900 7799721 6942287 6216731 5603019 5082517 4639058 4259607 3933130 3649528
60958C649528k49436k21888j99154j79952j63141j47962j34302j22077j10724
$$ 3649528 3400092 3178204 2979050 2799098 2635957 2487995 2353693 2231616 2120892
60949B120892r9886r0100q2024p5548p0262o6185o3294o0852n8147n5442n3324
$$ 2120892 2021006 1930906 1848882 1773334 1703072 1636887 1573593 1512741 1454594 1399152 1345828
60938A345828n1564m9489m7124m4975m2914m0284l7019l3814l1154k8902k6854
$$ 1345828 1294264 1244775 1197651 1152676 1109762 1069478 1032459 998645 967491 938589 911735
60927I11735k4970k3111k1203j9544j8341j7115j5386j3681j2889j2676j1679
$$ 911735 886765 863654 842451 822907 804566 787451 772065 758384 745495 732819 721140
60916G21140r477p283o267o113n825n032l883k412q01K55K74k43m24j52P1L5j06
$$ 721140 711663 704380 698113 692000 686175 681143 677260 674848 674047 674302 674576 674333 673909 673757 673828 673863 673757
60899F73757m07j046j705j832j531j510j973k300k049j651j722k236k803l341
$$ 673757 673350 672304 670599 668767 667236 665726 663753 661453 659404 657753 656031 653795 650992 647651
60885F47651l950m511m904n393o235p063p276o976o896p284p552p216o665o566
$$ 647651 643701 639190 634286 628893 622658 615595 608319 601343 594447 587163 579611 572395 565730 559164
60871E59164o927p224p162o813o181n132l833k765k194j911j576j050k89P28J787
$$ 559164 552237 545013 537851 531038 524857 519725 515892 513127 510933 509022 507446 506396 506107 506835 508622
60856E08622K470K592K486K583K847K895K536J964J437J016P25O67Q98J258J432
$$ 508622 511092 513684 516170 518753 521600 524495 527031 528995 530432 531448 532173 532840 533738 534996 536428
60841E36428J127K16j097k266k736k446j905j692j950k478l005l210k727j505
$$ 536428 537555 537771 536674 534408 531672 529226 527321 525629 523679 521201 518196 514986 512259 510754
60827E10754j72M49K59k5K20Q07J166J076O88J18o22j418k135k759l255l415l182
$$ 510754 510582 511031 511290 511265 511485 512292 513458 514534 515222 515340 514718 513300 511165 508406 505151 501736 498554
60810D98554k920k990l266l486l805m458n069n020m533m526n245n792n405m492
$$ 498554 495634 492644 489378 485892 482087 477629 472560 467540 463007 458481 453236 447444 442039 437547
60796D37547l912l860m007m172m217l786k878k305k731l541l492k387j216o81
$$ 437547 433635 429775 425768 421596 417379 413593 410715 408410 405679 402138 398646 396259 395043 394362
60782C94362m75k16j56n01p10j90P26J144P75K67L40J043J903K518K894L274L830
$$ 394362 393887 393671 393515 393014 392304 392114 392840 393984 394759 395026 395366 396409 398312 400830 403724 406998 410828
60765D10828M496N055N322N195M708M077L602L336L012K446J849J453J065L09
$$ 410828 415324 420379 425701 430896 435604 439681 443283 446619 449631 452077 453926 455379 456444 456753
60751D56753p44j627k071k192k061j626j181j355k325l449m049m201m384m594
$$ 456753 456009 454382 452311 450119 448058 446432 445251 443896 441571 438122 434073 429872 425488 420894
60737D20894m392l750l304l595m430n199n560n559n217m375l002j493m27j01m19
$$ 420894 416502 412752 409448 405853 401423 396224 390664 385105 379888 375513 372511 371018 370591 370490 370071
60722C70071j065j670j859j498r10n79m90j41O34J191Q98O6m50m63n80j050j226
$$ 370071 369006 367336 365477 363979 363069 362490 362000 361859 362493 363684 364582 364648 364198 363735 363155 362105 360879
60705C60879n52N31J194J362J596K015K077J559J130J549K672L682M051L837L199
$$ 360879 360327 360858 362052 363414 365010 367025 369102 370661 371791 373340 376012 379694 383745 387582 390781
60690C90781K301J709K178L605M740M579L685L435M094M485L679K178J091Q47
$$ 390781 393082 394791 396969 400574 405314 409893 413578 417013 421107 425592 429271 431449 432540 433387
60676D33387J198J858K468K423J476K63m30o82j056j559j761j831k461l684m630
$$ 433387 434585 436443 438911 441334 442810 443073 442643 441961 440905 439346 437585 435754 433293 429609 424979
60661D24979m765m585m666m759m301l353k412j669j033o19o26p50l11R19K249
$$ 424979 420214 415629 410963 406204 401903 398550 396138 394469 393436 392817 392191 391441 391130 392049 394298
60646C94298K674J886O12j02M5L99K60l02q34j358k229l226l539k899k022j586
$$ 394298 396972 398858 399470 399368 399413 399812 400072 399770 398936 397578 395349 392123 388584 385685 383663 382077
60630C82077j354q52l46m22q84q65q0P17O96o9p96q60k42N90J071R01K39n08j073
$$ 382077 380723 379871 379525 379103 378219 377354 377274 377991 378687 378618 377822 376962 376720 377310 378381 379282 379521 379013 377940
60611C77940j427j546j233m30M85R18P44M79N92Q13N75J08L67J613K633K185P85
$$ 377940 376513 374967 373734 373304 373789 374707 375451 375930 376522 377335 377910 378018 378385 379998 382631 384816 385601
60594C85601R4O25J149O66j28n6P06J007N64L48J116K337K871K188P68l54l55
$$ 385601 385695 386320 387469 388135 388007 387951 388657 389664 390228 390576 391692 394029 396900 399088 399856 399502 399147
60577C99147O51J629J685J193J345K610M130M922N142N675O844Q090Q917R462
$$ 399147 399798 401427 403112 404305 405650 408260 412390 417312 422454 428129 434973 443063 451980 461442
60563D61442J0025J0394J0120R211Q207P451O580M974K589J54j536k308k641l104
$$ 461442 471467 481861 491981 501192 509399 516850 523430 528404 530993 531147 529611 527303 524662 521558
60549E21558l850m520m521l478j570N71K319L496M398N482P013Q903J0834J2493
$$ 521558 517708 513188 508667 505189 503619 504190 506509 510005 514403 519885 526898 535801 546635 559128
60535E59128J3824J4961J5947J6555J6435J5466J3888J1991R771P006L743M70
$$ 559128 572952 587913 603860 620415 636850 652316 666204 678195 687966 694972 698715 699185
60523F99185k407n019p646r934j1078j0839r883q846p660o180m917m479m570m272
$$ 699185 696778 691759 684113 674179 663101 652262 642379 633533 625873 619693 614776 610297 605727 601455
60509F01455l158j515L98K513M517N984P126Q636J0650J2694J4838J7983K2485
$$ 601455 598297 596782 597180 599693 604210 610194 617320 625956 636606 649300 664138 682121 704606
60496G04606K7238L0851L3221L5264L7453L9363M0364M0141L8605L5801L1917
$$ 704606 731844 762695 795916 831180 868633 907996 948360 988501 1027106 1062907 1094824
60485A094824K7052K1128J4243O779j121r699j8701k6895l3141l7650m1364m4301
$$ 1094824 1121876 1143004 1157247 1164026 1162905 1153206 1134505 1107610 1074469 1036819 995455 951154
60473I51154m5473m4464m2194l9761l7259l4167l0479k6903k4090k1984j9939
$$ 951154 905681 861217 819023 779262 742003 707836 677357 650454 626364 604380 584441
60462E84441j7429j4700j2655j1837j1671j1079r740q317p432o909o197n098l903
$$ 584441 567012 552312 539657 527820 516149 505070 495330 487013 479581 472672 466475 461377 457474
60449D57474l080k936l339l636l251k409j919k087k296j927j199p30o63o82o31
$$ 457474 454394 451458 448119 444483 441232 438823 436904 434817 432521 430594 429395 428665 428002 427320 426689
60434D26689n74l91J25P31P80K5r86j491j312q47n03m50p64j440k168k373j754
$$ 426689 426115 425724 425849 426580 427360 427385 426399 424908 423596 422749 422246 421796 421032 419592 417424 415051 413297
60417D13297o46L65J062J627K093K166J716J104P68P20P29P97J143J778K448K958
$$ 413297 412651 413016 414078 415705 417798 419964 421680 422784 423552 424272 425001 425798 426941 428719 431167 434125
60401D34125L230L123K591K017J972K475K931K956K884L126L446L309K753K367
$$ 434125 437355 440478 443069 445086 447058 449533 452464 455420 458304 461430 464876 468185 470938 473305
60387D73305K496K932L410L952M483M560L795K475J428J313K097L131L621L205
$$ 473305 475801 478733 482143 486095 490578 495138 498933 501408 502836 504149 506246 509377 512998 516203
60373E16203K289J725J959K535K671K242J922K336L316M042L776K408O39l47J72
$$ 516203 518492 520217 522176 524711 527382 529624 531546 533882 537198 541240 545016 547424 548063 547716 547888
60358E47888J638K640K458J908K210L405M440M722M837N534O635P378P437P175
$$ 547888 549526 552166 554624 556532 558742 562147 566587 571309 576146 581680 588315 595693 603130 610305
60344F10305O974O734O000M365J832j012l227m242m359m392m789n314n585n636
$$ 610305 617279 624013 630013 634378 636210 635198 631971 627729 623370 618978 614189 608875 603290 597654
60330E97654n715n795n612n176m879m933n016m755m274l886l500k877k357k570
$$ 597654 591939 586144 580532 575356 570477 565544 560528 555773 551499 547613 544113 541236 538879 536309
60316E36309l275l255j833J93J717K807M246O034P466Q445R732J1667J3604J4954
$$ 536309 533034 529779 527946 528139 529856 532663 536909 542943 550409 558854 568586 580253 593857 608811
60302F08811J5936J6897J7472J7001J5341J2878R970O735L086j197o060j0721
$$ 608811 624747 641644 659116 676117 691458 704336 714306 721041 724127 722930 716870 706149
60290G06149j4100j5882j6691j7014j6526j4818j2280r742p694o222n351m963
$$ 706149 692049 676167 659476 642462 625936 611118 598838 589096 581402 575180 569829 564866
60278E64866m699m334m048m036m144m139m033l864l627l533l868m318m100l141
$$ 564866 560167 555833 551785 547749 543605 539466 535433 531569 527942 524409 520541 516223 512123 508982
60264E08982k352k249k105j274n35j033k396l158k820k298k239k164j550q10n82
$$ 508982 506630 504381 502276 501002 500467 499434 497038 493880 491060 488762 486523 484359 482809 481999 481417
60249D81417p54p73m40L2N22J108J752K154J931J053Q2k96k4K51J75K37R36J894
$$ 481417 480663 479890 479450 479482 480004 481112 482864 485018 486949 488002 488084 487788 487764 488015 488190 488427 489363 491257
60231D91257K412K548K803L023K609J780J606K518L673M161M102M136M470M930
$$ 491257 493669 496217 499020 502043 504652 506432 508038 510556 514229 518390 522492 526628 531098 536028
60217E36028N412N753N646N184N114N963P162P667P319O974P253P799Q005P946
$$ 536028 541440 547193 552839 558023 563137 569100 576262 583929 591248 598222 605475 613274 621279 629225
60203F29225Q041Q130P593O484N790O098O570O029M669L755L688L457K369J154
$$ 629225 637266 645396 652989 659473 665263 671361 677931 683960 688629 692384 696072 699529 701898 703052
60189G03052P07O77J73q17j696k400l257m098m490m649n091n630n754n749o313
$$ 703052 703759 704436 704609 703792 702096 699696 696439 692341 687851 683202 678111 672481 666727 660978 654665
60174F54665p083o835n285l593k739k487k340k445k910l131k579j674j199j336
$$ 654665 647582 640747 635462 631869 629130 626643 624303 621858 618948 615817 613238 611564 610365 609029
60160F09029j672j800j484p24J5J48j33Q7J153K202K312J700J180R77P72N71P38
$$ 609029 607357 605557 604073 603349 603364 603512 603379 603466 604619 606821 609133 610833 612013 612990 613762 614333 615071
60143F15071J241J546J350J006J125J939L193M469N533O302O597O196N299M562
$$ 615071 616312 617858 619208 620214 621339 623278 626471 630940 636473 642775 649372 655568 660867 665429
60129F65429M309M073L379K674K736L379L618L124K657K887L572M097M141L678
$$ 665429 669738 673811 677190 679864 682600 685979 689597 692721 695378 698265 701837 705934 710075 713753
60115G13753K923K454K703L198L088K400J922J736J015m89j916k699l346m215
$$ 713753 716676 719130 721833 725031 728119 730519 732441 734177 735192 734703 732787 730088 726742 722527
60101G22527m707m409m023m205m405l839k836k221k047j941k014k425k652k205
$$ 722527 717820 713411 709388 705183 700778 696939 694103 691882 689835 687894 685880 683455 680803 678598
60087F78598j551j322j229q42o98j368j982j253L19Q65k68j851k795l369m018
$$ 678598 677047 675725 674496 673654 672956 671588 669606 668353 668672 669537 669269 667418 664623 661254 657236
60072F57236m433m447m663n483o324o471o068n647n376n247n397n670n461m589
$$ 657236 652803 648356 643693 638210 631886 625415 619347 613700 608324 603077 597680 592010 586549 581960
60058E81960l808l796m102l770k738j878j763k038k076j688j022r6J194K700L973
$$ 581960 578152 574356 570254 566484 563746 561868 560105 558067 555991 554303 553281 553185 554379 557079 561052
60043E61052M659M885N131N655O155O120N422M471L815L642L644L296K329R63
$$ 561052 565711 570596 575727 581382 587537 593657 599079 603550 607365 611007 614651 617947 620276 621239
60029F21239l38j263j676j521j025r46j958l723n120n614n827o464p326p921q386
$$ 621239 620901 619638 617962 616441 615416 614470 612512 608789 603669 598055 592228 585764 578438 570517 562131
60014E62131r031r418q759p168n786n480o013o519o406n670m715l957l426k756
$$ 562131 553100 543682 534923 527755 521969 516489 510476 503957 497551 491881 487166 483209 479783 477027
60000D77027j717n13N48J355J753J480P02K08N45J264J583J417J318J704K683
$$ 477027 475310 474797 475345 476700 478453 479933 480635 480843 481388 482652 484235 485652 486970 488674 491357
59985D91357M211N757O258N234L673K930K937K467J057m07j085j251j634k438
$$ 491357 495568 501325 507583 512817 516490 519420 522357 524824 525881 525474 524389 523138 521504 519066
59971E19066l375m050m099l412k448j857j768j825j914k145k194j424J21J531
$$ 519066 515691 511641 507542 504130 501682 499825 498057 496232 494318 492173 489979 488555 488676 490207
59957D90207K079J917J616J545J798K182K122J214l3o38m03nJ89M95R19Q25P2
$$ 490207 492286 494203 495819 497364 499162 501344 503466 504680 504647 504009 503606 503601 503790 504285 505204 506029 506101
59940E06101m06Q5Q67P80k60j315j622j084M1J301K130K331K362K722L338L942
$$ 506101 505695 505780 506647 507427 507167 505852 504230 503146 503187 504488 506618 508949 511311 514033 517371 521313
59924E21313M679N772O902P578P871Q209Q556Q459P817O974O012M614K811J313
$$ 521313 525992 531764 538666 546244 554115 562324 570880 579339 587156 594130 600142 604756 607567 608880
59910F08880P00O43M03j84o01n20k64k71m32l19Q8L81M61P48J423J895J517N50
$$ 608880 609580 610223 610626 610442 609841 609321 609057 608786 608354 608035 608123 608504 608965 609713 611136 613031 614548 615098
59892F15098j10j7N33J202J945K646L031L151L448M063M613M837N013N332N399
$$ 615098 614988 614971 615504 616706 618651 621297 624328 627479 630927 634990 639603 644440 649453 654785 660184
59877F60184M839M101L980M435M478L338J394l47j379k050k814l537l797l641
$$ 660184 665023 669124 673104 677539 682017 685355 686749 686402 685023 682973 680159 676622 672825 669184
59863F69184l658m147m650m537l765k714j593m06O70J398J912K578L395M010M317
$$ 669184 665526 661379 656729 652192 648427 645713 644120 643714 644384 645782 647694 650272 653667 657677 661994
59848F61994M578M949N289N595O124O901P457P241O148M510K787J318K06o03j037
$$ 661994 666572 671521 676810 682405 688529 695430 702887 710128 716276 720786 723573 724891 725097 724494 723457
59833G23457r12l64l1m24j355k392l572n154o856q014q374q145p411o237n229
$$ 723457 722545 722181 722150 721726 720371 717979 714407 709253 702397 694383 686009 677864 670453 664216 658987
59818F58987n113n654n773m913l645k714k295k394l134m197m632l848k337j049
$$ 658987 653874 648220 642447 637534 633889 631175 628880 626486 623352 619155 614523 610675 608338 607289
59804F07289m27l36n46q16q80o69l46k7K24J76l47r87j228j273j822k816l253
$$ 607289 606862 606526 605980 605164 604284 603615 603269 603242 603466 603642 603295 602308 601080 599807 597985 595169 591916
59787E91916k590j585j302j897k808l520l678l129k304k031k456k716k159j351
$$ 591916 589326 587741 586439 584542 581734 578214 574536 571407 569103 567072 564616 561900 559741 558390
59773E58390j250j861k308j899o38R64K218K700K718K994L697M355M797N432O267
$$ 558390 557140 555279 552971 551072 550434 551398 553616 556316 559034 562028 565725 570080 574877 580309 586576
59758E86576O611O260O043O552P193P346P491Q191Q819Q521P825P871Q426Q137
$$ 586576 593187 599447 605490 612042 619235 626581 634072 642263 651082 659603 667428 675299 683725 691862
59744F91862O643N061M252L842L297K766K396J723M63p42j043n19j14n37j526
$$ 691862 698505 703566 707818 711660 714957 717723 720119 721842 722305 721563 720520 720001 719887 719350 717824
59729G17824k220k089j491j179j351j500j341j285j668k054j887j387j133j118
$$ 717824 715604 713515 712024 710845 709494 707994 706653 705368 703700 701646 699759 698372 697239 696121
59715F96121r11n40m01n04m96l80m50n83k74N20J255J530J451J260J221J736K971
$$ 696121 695210 694670 694269 693765 693269 692889 692439 691856 691582 692102 693357 694887 696338 697598 698819 700555 703526
59698G03526M301M855M633M487M913N540N893O016O007N592M545L111J795Q81
$$ 703526 707827 712682 717315 721802 726715 732255 738148 744164 750171 755763 760308 763419 765214 766095
59684G66095L22k08j173k692m218n029n079m931m943n041n273n986p171q220q544
$$ 766095 766417 766209 765036 762344 758126 753097 748018 743087 738144 733103 727830 721844 714673 706453 697909
59669F97909q139p292o148m830l684l100l085l205k922k053r19mO24J277K025
$$ 697909 689770 682478 676330 671500 667816 664716 661631 658426 655504 653451 652532 652528 653152 654429 656454
59654F56454K501K572K745L471M421M910M737M094L054J721N30l06j332l064m959
$$ 656454 658955 661527 664272 667743 672164 677074 681811 685905 688959 690680 691210 690904 689572 686508 681549
59639F81549o045o352o720p328p462o853o175n832n329m289l268k875k837k582
$$ 681549 675504 669152 662432 655104 647642 640789 634614 628782 623453 619164 615896 613021 610184 607602
59625F07602k321k756l955n182n768n764n593n378m826l769k704k412k965l495
$$ 607602 605281 602525 598570 593388 587620 581856 576263 570885 566059 562290 559586 557174 554209 550714
59611E50714l256k491j816j226l70N86J145J295J328J124N16J37P91J971K263
$$ 550714 547458 544967 543151 541925 541555 542141 543286 544581 545909 547033 547549 547686 548477 550448 552711
59596E52711J356M93N36Q23M81k34o08o11n17k08L79P26M44m7k64n29j298k228
$$ 552711 554067 554560 555096 555919 556400 556166 555558 554947 554430 554222 554601 555327 555771 555724 555460 554931 553633 551405
59578E51405k673k713k852l077l024k784k747k817k562j996j488j045m37O6j35
$$ 551405 548732 546019 543167 540090 537066 534282 531535 528718 526156 524160 522672 521627 521190 521256 521121
59563E21121r24j343p68K70O88M9j022j386m77J038J788J162Nm29J17Q88J316
$$ 521121 520197 518854 518086 518356 519044 519093 518071 516685 516208 517246 519034 520196 520201 519772 519889 520777 522093
59546E22093J556J990K781L979N611P458R081J0215J0972J1609J2304J3099J3854
$$ 522093 523649 525639 528420 532399 538010 545468 554549 564764 575736 587345 599649 612748 626602
59533F26602J4246J4007J3028J1087P837L436j015m120n313n034l953k475r74
$$ 626602 640848 654855 667883 678970 686807 690243 689228 685108 679795 674761 670808 668333 667359
59520F67359J04O08Q07R43Q74L10q03k252l725m973n921o751p643q490q949q885
$$ 667359 667463 668071 668878 669821 670695 671005 670202 667950 664225 659252 653331 646580 638937 630447 621498 612613
59504F12613q512q122p821p583p298o724n679m362l262k611k134j489o93P8Q40
$$ 612613 604101 595979 588158 580575 573277 566553 560874 556512 553250 550639 548505 547016 546323 546401 547241
59489E47241J596K021J791J206J007J482K214K838L521M396N030N016M777N059
$$ 547241 548837 550858 552649 553855 554862 556344 558558 561396 564917 569313 574343 579359 584136 589195
59475E89195N780O129N768N244M980M633L800K735J892J242N22k27q37j283j324
$$ 589195 594975 601104 606872 612116 617096 621729 625529 628264 630156 631398 631920 631693 630856 629573 628249
59460F28249m10J486L358M249M468N013O135P322Q451R917J1565J2494J2157J0935
$$ 628249 627839 629325 632683 636932 641400 646413 652548 659870 668321 678238 689803 702297 714454 725389
59446G25389R408P797O240M913L523J439j387m160o243p809r196j0224j0522j0074
$$ 725389 734797 742594 748834 753747 757270 758709 757322 753162 746919 739110 729914 719690 709168 699094
59432F99094r053p573n902m515l621k962k223j314j09J503L269M809O317Q343
$$ 699094 690041 682468 676566 672051 668430 665468 663245 661931 661822 663325 666594 671403 677720 686063
59418F86063J0732J2627J3832J5206J7267J9322K0645K1612K2735K3281K1996
$$ 686063 696795 709422 723254 738460 755727 775049 795694 817306 840041 863322 885318
59407H85318J8789J4607R887M231k269q387j2670j4352j3344j0041n551j483R61
$$ 885318 904107 918714 928601 932832 930563 922176 909506 895154 881810 871769 866218 864735 865696
59394H65696J624R20j074m767j0260j6497k1423k3348k2209j9344j6081j2901
$$ 865696 867320 868240 867166 862399 852139 835642 814219 790871 768662 749318 733237 720336
59382G20336r940p512n744m196k423o06Q41J918K900L802M470M900N059M685L855
$$ 720336 710396 702884 697140 692944 690521 689915 690756 692674 695574 699376 703846 708746 713805 718490 722345
59367G22345L339L722M379M134K929K002K275L244L841L761L476L362L408L708
$$ 722345 725684 729406 733785 737919 740848 742850 745125 748369 752210 755971 759447 762809 766217 769925
59353G69925M623O278Q231R919J1284J2645J4080J5271J6065J6702J7293J7454
$$ 769925 774548 780826 789057 798976 810260 822905 836985 852256 868321 885023 902316 919770
59341I19770J6832J5666J4338J2704J0438P784N297K979M61k127m284o115q220
$$ 919770 936602 952268 966606 979310 989748 997532 1002829 1005808 1006269 1004142 999858 993743 985523
59328I85523j0492j2029j2516j2747j3372j4042j4282j4266j4204j3769j2759
$$ 985523 975031 963002 950486 937739 924367 910325 896043 881777 867573 853804 841045
59317H41045j1613j0655r593q304p399p304p562p676p839q181q137p372o448n721
$$ 841045 829432 818777 809184 800880 793481 786177 778615 770939 763100 754919 746782 739410 732962 727241
59303G27241m522k446n23J85L39J360L320N233O797Q294R183Q484O332L671N30
$$ 727241 722719 720273 719750 719935 720274 721634 724954 730187 736984 745278 754461 762945 769277 772948 773478
59288G73478l689q327j1615j2955j3411j3550j2491r779o668m604l512k396o97
$$ 773478 769789 761462 749847 736892 723481 709931 697440 687661 680993 676389 672877 670481 669784
59275F69784J610M411P154Q944R654J0266J1582J3246J4452J4895J4529J3175
$$ 669784 671394 675805 682959 691903 701557 711823 723405 736651 751103 765998 780527 793702
59263G93702J1056Q944P187N147K251j054l918o136p919r197r778r803r540r084
$$ 793702 804758 813702 820889 826036 828287 827233 823315 817179 809260 800063 790285 780482 770942 761858
59249G61858q610q370q146p310n877m712m196l487j771M61K153L144L916M537
$$ 761858 753248 744878 736732 729422 723545 718833 714637 711150 709379 709840 711993 715137 719053 723590
59235G23590M799N066N927P139P782P453O525N364M053K841J996J128n61l065
$$ 723590 728389 733455 739382 746521 754303 761756 768281 773645 777698 780539 782535 783663 783102 780037
59221G80037n310o409o600o634o738o690o532o616o978p118o628n766n197n166
$$ 780037 774727 768318 761718 755084 748346 741656 735124 728508 721530 714412 707784 702018 696821 691655
59207F91655n247m932m318l929m000m193m037l410k539j818j579j822k053j639
$$ 691655 686408 681476 677158 673229 669229 665036 660999 657589 655050 653232 651653 649831 647778 646139
59193F46139m36J051K200K754K883K977L329L874M247M353M586N169N509M927
$$ 646139 645703 646754 648954 651708 654591 657568 660897 664771 669018 673371 677957 683126 688635 693562
59179F93562L805L319L924M868N350N454N648O001O320O521O532O230N855O011
$$ 693562 697367 700686 704610 709478 714828 720282 725930 731931 738251 744772 751304 757534 763389 769400
59165G69400O918P977Q397P886O605M926L410K447J607k1k581n152p048q638j0424
$$ 769400 776318 784295 792692 800578 807183 812109 815519 817966 819573 819552 816971 811819 804771 796133 785709
59150G85709j1990j2622j2411j2047j1895j1953j2203j2370j1815j0391q980q409
$$ 785709 773719 761097 748686 736639 724744 712791 700588 688218 676403 666012 657032 648623
59138F48623q260p642o684o188o098n526m275l174k664k227j492r13p12j11J577
$$ 648623 640363 632721 626037 619849 613751 608225 603950 600776 598112 595885 594393 593480 592768 592657 594234
59123E94234L698M968N098N009N583O845Q384R908J1161J1808J1691J1152J0771
$$ 594234 597932 602900 607998 613007 618590 625435 633819 643727 654888 666696 678387 689539 700310
59110G00310J0812J1028J1045J0741J0206R421Q301P001N903N151M450L426K067
$$ 700310 711122 722150 733195 743936 754142 763563 771864 778865 784768 789919 794369 797795 799862
59097G99862O17p30j850k590k867k786k511k183j992k062k124j717r61p38j642
$$ 799862 800479 799749 797899 795309 792442 789656 787145 784962 782970 780908 778784 777067 776106 775368 773726
59082G73726l074l950m115m401n388o724p760q302q543q667q783q872q662p857
$$ 773726 770652 766702 762587 758186 752798 746074 738314 730012 721469 712802 704019 695147 686485 678628
59068F78628o680n849n794o157o245n834n219m685m215l718l279l060l044k992
$$ 678628 671948 666099 660305 654148 647903 642069 636850 632165 627950 624232 620953 617893 614849 611857
59054F11857k676k114j526j110r80j185j560j582p85M57R49n1j791k713k151r29
$$ 611857 609181 607067 605541 604431 603451 602266 600706 599124 598339 598796 599745 599694 597903 595190 593039 592110
59038E92110j96k01l83k60J42N75R13J215J601K189L055M215N609P045Q274R261
$$ 592110 591914 591713 591330 591070 591212 591787 592700 593915 595516 597705 600760 604975 610584 617629 625903 635164
59022F35164J0316J1770J3377J4332J4019J2704J1284J0330R539Q189O041L620
$$ 635164 645480 657250 670627 684959 698978 711682 722966 733296 742835 751024 757065 760685
59010G60685J581M8j237k231k460j779r11p94j404j564j98K382M695N567N230
$$ 760685 762266 762314 761077 758846 756386 754607 753696 752902 751498 749934 749736 752118 756813 762380 767610
58995G67610M831N029N339M913L673K370J566R68m1j482k722l307l483l748m121
$$ 767610 772441 777470 782809 787722 791395 793765 795331 796299 796258 794776 792054 788747 785264 781516 777395
58980G77395m131l515k615j868j161O1K048M393O469P954Q872R380R777J0428
$$ 777395 773264 769749 767134 765266 764105 764166 766214 770607 777076 785030 793902 803282 813059 823487
58966H23487J1434J2388J2756J2411J1598J0479Q974P055M952K944J131o27k594
$$ 823487 834921 847309 860065 872476 884074 894553 903527 910582 915534 918478 919609 918982 916388
58953I16388m963p605j0098j2062j3459j4499j5339j6030j6475j6389j5484j3991
$$ 916388 911425 903820 893722 881660 868201 853702 838363 822333 805858 789469 773985 759994
58941G59994j2624j1798j1019r557p437n381l928l057k561k321k155j874j521
$$ 759994 747370 735572 724553 714996 707559 702178 698250 695193 692632 690311 688156 686282 684761
58928F84761j220q68l41J02R2k76n76o92q13q57n28O6M50M84M37L54M4k03L19
$$ 684761 683541 682673 682332 682434 682526 682250 681674 680982 680169 679312 678784 678850 679300 679784 680221 680575 680619 680416 680735
58909F80735J705L099L796M062M570N545O860Q411R982J1231J2180J3298J4701
$$ 680735 682440 685539 689335 693397 697967 703512 710372 718783 728765 739996 752176 765474 780175
58896G80175J5769J5966J5646J5518J5709J5884J5960J6127J6370J6512J6696
$$ 780175 795944 811910 827556 843074 858783 874667 890627 906754 923124 939636 956332
58885I56332J7259J8085J8454J7681J5796J3448J1184Q929O264L166J06k697n632
$$ 956332 973591 991676 1010130 1027811 1043607 1057055 1068239 1077168 1083432 1086598 1086704 1084007 1078375
58872A078375q854j1575j2960j3369j3908j4834j5362j5047j4329j3591j2661
$$ 1078375 1069521 1057946 1044986 1031617 1017709 1002875 987513 972466 958137 944546 931885
58861I31885j1588j0887j0625j0215r597r632j0708j1867j2080j1583j1187j0980
$$ 931885 920297 909410 898785 888570 878973 869341 858633 846766 834686 823103 811916 800936
58849H00936j0534r819r104q428p932q089q936r554r162q173p471p162o931o909
$$ 800936 790402 780583 771479 763051 755119 747030 738094 728540 719378 711205 703734 696572 689641 682732
58835F82732p273p471o933o177o037o134n290l386j586o49j19N42J065J050P71
$$ 682732 675459 667988 661055 654878 648841 642707 637417 634031 632445 631796 631677 632219 633284 634334 635105
58820F35105Q19J439K463L534M202M184L726L402L485L709L666L190K396J614
$$ 635105 635924 637363 639826 643360 647562 651746 655472 658874 662359 666068 669734 672924 675320 676934
58806F76934J133Q76M75j42o03p63j072j966l222m249m667m283l155k019j964
$$ 676934 678067 678943 679418 679276 678673 677910 676838 674872 671650 667401 662734 658451 655296 653277 651313
58791F51313l077m079l937l159k708k386j370K64J758L016M500O012O767O689
$$ 651313 648236 644157 640220 637061 634353 631967 630597 630861 632619 635635 640135 646147 652914 659603
58777F59603O523O587O429N788M974M121K946J337n39k714n183p227p927p434
$$ 659603 666126 672713 679142 684930 689904 694025 696971 698308 697769 695055 689872 682645 674718 667284
58763F67284o867o790o673o082n503n492n733n412m185k436r15j22J28N42J426
$$ 667284 660417 653627 646954 640872 635369 629877 624144 618732 614547 612111 611196 611074 611202 611744 613170
58748F13170K187K166J698J689K464L664M921N933O195N545M795M855N478N759
$$ 613170 615357 617523 619221 620910 623374 627038 631959 637892 644087 649632 654427 659282 664760 670519
58734F70519N674N994O743P010O396N548M983M460L798L315L108K776K200J785
$$ 670519 676193 682187 688930 695940 702336 707884 712867 717327 721125 724440 727548 730324 732524 734309
58720G34309J665J477J204J364K143L141M151N281O078N698M293L181L034K898
$$ 734309 735974 737451 738655 740019 742162 745303 749454 754735 760813 766511 770804 773985 777019 779917
58706G79917J678l27k125l520m956o487p781q902j0266j1933j3469j4526j5162
$$ 779917 781595 781268 779143 775623 770667 764180 756399 747497 737231 725298 711829 697303 682141
58693F82141j5632j5978j5759j4373j1889r425q087p604o755n191l974l998m623
$$ 682141 666509 650531 634772 620399 608510 599085 590998 583394 576639 571448 567474 563476 558853
58680E58853m506l318k041j787k657l737l963l027j451K12J888L551M796N381
$$ 558853 554347 551029 548988 547201 544544 540807 536844 533817 532366 532578 534466 538017 542813 548194
58666E48194N727O354P181Q002R058J0333J0785R458O976M753K949N67k549n243
$$ 548194 553921 560275 567456 575458 584516 594849 605634 615092 622068 626821 629770 630337 627788 622545
58652F22545o704p266p277o585n502n012n404n838n708n404n229m711l612k590
$$ 622545 615841 608575 601298 594713 589211 584199 578795 572957 567249 561845 556616 551905 548293 545703
58638E45703k085j500k21J321K293K533K379K052J695J499J345R58N67P03J108
$$ 545703 543618 542118 541897 543218 545511 548044 550423 552475 554170 555669 557014 557972 558539 559242 560350
58623E60350P90n00j728j902j105J82J729L143L784L740L980M967N936O099N709
$$ 560350 561140 560640 558912 557010 555905 556087 557816 560959 564743 568483 572463 577430 583366 589465 595174
58608E95174N316M816L905K804J916J289Q76P05N80K31k8L36R56Q51K6m66k44
$$ 595174 600490 605306 609211 612015 613931 615220 616096 616801 617381 617612 617584 617920 618876 619727 619753 619287 619043
58591F19043q5k88J9J254K591L552M988P401R609J0338J0062J0048J0454J0611
$$ 619043 618958 618670 618689 619943 622534 626086 631074 638475 648084 658422 668484 678532 688986 699597
58577F99597J0367J0000R389Q405P575P398P552P600P857Q743R933J1057J2546
$$ 699597 709964 719964 729353 737758 745333 752731 760283 767883 775740 784483 794416 805473 818019
58564H18019J4923J7822K0522K2803K4619K5586K5653K5397K4931K3291J9853
$$ 818019 832942 850764 871286 894089 918708 944294 969947 995344 1020275 1043566 1063419
58553A063419J5538J1640Q225M669J053k060m623o829q390r010r132r371r753
$$ 1063419 1078957 1090597 1098822 1103491 1104544 1102484 1097861 1091032 1082642 1073632 1064500 1055129 1045376
58540A045376j0301j1632j4084j6831j8853k0216k1470k2403k2401k1551k0385
$$ 1045376 1035075 1023443 1009359 992528 973675 953459 931989 909586 887185 865634 845249
58529H45249j8931j6873j4368j1974j0016q544p555o779n770m531l539k872k122
$$ 845249 826318 809445 795077 783103 773087 764543 756988 750209 744439 739908 736369 733497 731375
58516G31375j347j151j541j771j709k064k870l171k723k569l132l288k232p89
$$ 731375 730028 728877 727336 725565 723856 721792 718922 715751 713028 710459 707327 704039 701807 701018
58502G01018R8O62J133Q51k81j037p93n80j035j044J37J227J172J240K826M815
$$ 701018 701116 701778 702911 703762 703481 702444 701651 701071 700036 698992 699129 700356 701528 702768 705594 710409
58486G10409N409N253O256Q382J0004J0759J1678J3049J4206J5080J5981J6388
$$ 710409 715818 721071 727327 735709 745713 756472 768150 781199 795405 810485 826466 842854
58474H42854J5713J4670J4098J3157J0477O428K389j386n234q275r342r125r200
$$ 842854 858567 873237 887335 900492 910969 917397 919786 918400 913166 904891 895549 886424 877224
58461H77224r407q314n786l032n29K064M314N508O294P858R764J0635J0426R923
$$ 877224 867817 859503 853717 850685 850156 852220 856534 862042 868336 876194 885958 896593 907019 916942
58447I16942Q607N388J098k199m205o377q984j0650j0845j0489r890q275n726
$$ 916942 925549 930937 932035 929836 925631 919254 910270 899620 888775 878286 868396 860121 854395
58434H54395l540k322j430m39N52J948M223O512P512P631Q339R645J0192R624
$$ 854395 850855 848533 847103 846664 847216 849164 853387 859899 867411 875042 883381 893026 903218 912842
58420I12842Q860Q091O629M555K583L87k786o154q133q843r699j0820j1093j0574
$$ 912842 921702 929793 936422 940977 943560 943947 941161 935007 926874 918031 908332 897512 886419 875845
58406H75845j0367j0377r586q269p444o418l738l34J267R41J074K447L197K418
$$ 875845 865478 855101 845515 837246 829802 823384 819646 819312 820579 821520 822594 825041 828238 830656
58392H30656J698K162K857L027L379M095M036K854J652Q34m12j831j801m8J704
$$ 830656 832354 834516 837373 840400 843779 847874 851910 854764 856416 857250 856838 855007 853206 853158 854862
58377H54862K529L363M655N458N616O417Q123R259R125Q775Q825Q658Q479R608
$$ 854862 857391 860754 865409 870867 876483 882900 891023 900282 909407 918182 927007 935665 944144 953752
58363I53752J1915J3490J3598J3601J4176J4247J3425J2984J3380J3334J2172
$$ 953752 965667 979157 992755 1006356 1020532 1034779 1048204 1061188 1074568 1087902 1100074
58352A100074J0703R090O485L466K089K734L565L847M797O429O790N517M942O335
$$ 1100074 1110777 1119867 1126352 1129818 1131907 1134641 1138206 1142053 1146850 1153279 1160069 1165586 1170528 1176863
58338A176863Q079Q948J0139J2429J4328J4780J4993J5939J6578J6085J5357J4879
$$ 1176863 1184942 1193890 1204029 1216458 1230786 1245566 1260559 1276498 1293076 1309161 1324518 1339397
58326A339397J3741J1939J0977J0921R712O742M158L338L081K560K880M188M593
$$ 1339397 1353138 1365077 1376054 1386975 1396687 1403429 1407587 1410925 1414006 1416566 1419446 1423634 1428227
58313A428227L669L783O090Q410R020R326J0823J2540J3497J4660J6415J7194
$$ 1428227 1431896 1435679 1441769 1450179 1459199 1468525 1479348 1491888 1505385 1520045 1536460 1553654
58301A553654J6580J6672J8433J9783J9367J8913J9782K0522K0053J9995K1520
$$ 1553654 1570234 1586906 1605339 1625122 1644489 1663402 1683184 1703706 1723759 1743754 1765274
58290A765274K3074K3503K4202K5942K6899K6192K5991K7771K9702L0139L0309
$$ 1765274 1788348 1811851 1836053 1861995 1888894 1915086 1941077 1968848 1998550 2028689 2058998
58279B058998L1328L1957L1583L1918L3492L4098L2961L2552L4132L5540L5742
$$ 2058998 2090326 2122283 2153866 2185784 2219276 2253374 2286335 2318887 2353019 2388559 2424301
58268B424301L7153M0960M4604M6669M9586N4653N9108O1307O3907O8599P2540
$$ 2424301 2461454 2502414 2547018 2593687 2643273 2697926 2757034 2818341 2882248 2950847 3023387
58257C023387P3574P4155P6465P8501P8701P9457Q2256Q4385Q4355Q5459Q9974
$$ 3023387 3096961 3171116 3247581 3326082 3404783 3484240 3566496 3650881 3735236 3820695 3910669
58246C910669R5131R8837J03742J11528J18964J24124J30510J40415J50326J57800
$$ 3910669 4005800 4104637 4208379 4319907 4438871 4562995 4693505 4833920 4984246 5142046
58236E142046J66400J78837J91744K02534K14500K29754K44452K56768K72009
$$ 5142046 5308446 5487283 5679027 5881561 6096061 6325815 6570267 6827035 7099044
58227G099044K93599L16892L38289L62191L92174M24159M55653M92478N38492
$$ 7099044 7392643 7709535 8047824 8410015 8802189 9226348 9682001 10174479 10712971
58218A0712971N88386O39079O98015P71080Q53225R40995J043120J168177J313874
$$ 10712971 11301357 11940436 12638451 13409531 14262756 15203751 16246871 17415048 18728922
58209A8728922J480226J680820J928861K225140K572232K985066L472987M028581
$$ 18728922 20209148 21889968 23818829 26043969 28616201 31601267 35074254 39102835
58201C9102835M651883N369467O213654P205088Q378327R801086J1536149J3594108
$$ 39102835 43754718 49124185 55337839 62542927 70921254 80722340 92258489 105852597
58193A05852597J5937943J8505767K1208151K3936847K6580458K8931551L0501205
$$ 105852597 121790540 140296307 161504458 185441305 212021763 240953314 271454519
58186B71454519L0535519K8409572K4037022J7787928J0049564J111665q412039
$$ 271454519 301990038 330399610 354436632 372224560 382274124 383385789 374973750
58179C74973750j7291693k4124660k8139649k9499889k8908866k7107783k4716569
$$ 374973750 357682057 333557397 305417748 275917859 247008993 219901210 195184641
58172A95184641k2250254k0033070j8105791j6328720j4589123j2882245j1249440
$$ 195184641 172934387 152901317 134795526 118466806 103877683 90995438 79745998
58165G9745998r725711q345789p140302o110535n233922m493431l878910l367952
$$ 79745998 70020287 61674498 54534196 48423661 43189739 38696308 34817398 31449446
58157C1449446k932148k558877k246503j983948j754727j555161j389528j251953
$$ 31449446 28517298 25958421 23711918 21727970 19973243 18418082 17028554 15776601
58149A5776601j130194j022307r33068q58268p87974p21362o63893o13533n63283
$$ 15776601 14646407 13624100 12691032 11832764 11044790 10323428 9659535 9046002 8482719
58140H482719n13831m70812m32798l94222l57032l27622l05003k83044k61812
$$ 8482719 7968888 7498076 7065278 6671056 6314024 5986402 5681399 5398355 5136543
58131E136543k45875k33928k20461k05680j93954j84498j72790j59404j48592
$$ 5136543 4890668 4656740 4436279 4230599 4036645 3852147 3679357 3519953 3371361
58122C371361j40000j30127j19958j13044j07987j00804r2634q7346q3674p7577
$$ 3371361 3231361 3101234 2981276 2868232 2760245 2659441 2566807 2479461 2395787 2318210
58112B318210p0335o6407o5043o1817n6977n4544n4398n2828m9872m8880m9546
$$ 2318210 2247875 2181468 2116425 2054608 1997631 1943087 1888689 1835861 1785989 1737109 1687563
58101A687563m8423m5727m4898m5890m5332m2843m1000l9559l5836l0389k6523
$$ 1687563 1639140 1593413 1548515 1502625 1457293 1414450 1373450 1333891 1298055 1267666 1241143
58090A241143k4500k1855j8859j7997j8562j7460j4985j4314j5621j6125j5563
$$ 1241143 1216643 1194788 1175929 1157932 1139370 1121910 1106925 1092611 1076990 1060865 1045302
58079A045302j6170j7558j7068j5213j5267j7357j8178j6855j6004j6568j6532
$$ 1045302 1029132 1011574 994506 979293 964026 946669 928491 911636 895632 879064 862532
58068H62532j5324j4820j5306j4798j2982j1768j1463j0386q580q052q955r358
$$ 862532 847208 832388 817082 802284 789302 777534 766071 755685 747105 739053 730098 720740
58056G20740q955r282j0214j0029q988r042r979r686q235p741q207p480n529m703
$$ 720740 711785 702503 692289 682260 673272 664230 654251 644565 636330 628589 620382 612902 607373 602670
58042F02670n419n579m696m672n864o238n191m605n284n793n578n983p381q377
$$ 602670 597251 591672 586976 582304 576440 570202 565011 560406 555122 549329 543751 537768 530387 522010
58028E22010q554r010r754r501q448q180q602q006o450n852o435o342n125m391
$$ 522010 513456 504446 494692 485191 476743 468563 459961 451955 445505 439653 433218 426876 421751 417360
58014D17360m551m180l018k431k442j617k55k78j452j348L62J151P1p53j68R2
$$ 417360 412809 408629 405611 403180 400738 399121 398866 398588 397136 395788 396150 397301 397372 396619 396451 396543
57998C96543j019j788r55mm01j230j217p21k43O62J729J560J89l62P05J541O92
$$ 396543 395524 393736 392781 392777 392376 391146 389929 389208 388965 389627 391356 392916 393105 392743 393448 394989 395681
57981C95681p94j582k072k793l029k462k167k607k623j648r56j420j962j476n59
$$ 395681 394887 393305 391233 388440 385411 382949 380782 378175 375552 373904 372948 371528 369566 368090 367531
57966C67531j15Q5L44K78KL39J061Q00n15j226q08r41k549m010l656k135r14k55
$$ 367531 367416 367501 367845 368123 368125 368464 369525 370325 369810 368584 367776 366835 364286 360276 356620 354485 353571 353316
57948C53316k6p23k170k808j663K84J808L038M326N094N054N127O007P100P823
$$ 353316 353290 352567 350397 347589 345926 346210 348018 351056 355382 360476 365530 370657 376664 383764 391587
57933C91587Q507R230R206Q273P400O837N461K857L31j172k503m464o260p004
$$ 391587 400094 409324 418530 426803 434203 441040 446501 449358 449689 448517 446014 441550 435290 428286
57919D28286p241p671p853p420p151p475p325n782l724k503k095j656r16M0J329
$$ 428286 421045 413374 405521 398101 390950 383475 376150 370368 366644 364141 362046 360390 359474 359514 360843
57904C60843K687L339L163K915K712J770J89o17j51L05J5J26J390K396J677J70
$$ 360843 363530 366869 370032 372947 375659 377429 377618 377001 376850 377155 377170 377296 378686 381082 382759 382929
57888C82929k24N96J252J065M37k55q45j069j082j577k642l413l521l760m517
$$ 382929 382705 383301 384553 385618 386055 385800 384955 383886 382804 381227 378585 375172 371651 367891 363374
57873C63374m894m357l893m326m760l930k120m62O79J494J839J722J831K595L544
$$ 363374 358480 354123 350230 345904 341144 337214 335094 334632 335311 336805 338644 340366 342197 344792 348336
57858C48336M290N151O064O210N538N352O269P091O754O026N929N910N072L884
$$ 348336 352626 357777 363841 370051 375589 380941 387210 394301 401055 407081 413010 418920 423992 427876
57844D27876L099K120J51k022l094l311l876n041o229p291q164q041o468m599
$$ 427876 430975 433095 433246 431224 428130 424819 420943 415902 409673 402382 394218 386177 379709 375110
57830C75110l848l914l637l117l273l857l723k853k324k345j876m87Q21J031L73
$$ 375110 371262 367348 363711 360594 357321 353464 349741 346888 344564 342219 340343 339856 340677 341708 342081
57815C42081j88n1O46J184Q21m41j828k746l435m323n387o484p614q348p886o275
$$ 342081 341893 341842 342488 343672 344493 344052 342224 339478 336043 331720 326333 319849 312235 303887 296001 289726
57799B89726m758m204m072l592l058k989k923k071n58R14K078K934L320L391L796
$$ 289726 284968 280764 276692 273100 270042 267053 264130 262059 261501 262415 264493 267427 270747 274138 277934
57784B77934M681N266N190N265O051O761O618O297O799P797Q301Q238Q042P483
$$ 277934 282615 287881 293071 298336 304387 311148 317766 324063 330862 338659 346960 355198 363240 370723
57770C70723O182M637L523K540J175j48r08j795l714o016p134o691n753n244n274
$$ 370723 376905 381542 385065 387605 388780 388632 387724 385929 382215 376199 369065 362374 356621 351377 346103
57755C46103n659o063n887n016m213l927l400j969m93j33m39j10Q81J437J250
$$ 346103 340444 334381 328494 323478 319265 315338 311938 309969 309476 309343 308904 308794 309675 311112 312362
57740C12362J002Q80L94l42n30JN95R86J612K648L647M183M036L009J425N57J451
$$ 312362 313364 314244 314638 314296 313766 313767 314362 315348 316960 319608 323255 327438 331474 334483 335908 336465 337916
57723C37916L420M679M407L278K147J257P06O54R01R23N18j51r42j674k023k034
$$ 337916 341336 346015 350422 353700 355847 357104 357810 358464 359365 360288 360806 360655 359713 358039 356016 353982
57707C53982k365l401m544n044m986m756m135k859j473o39p9Q17J749J924J333
$$ 353982 351617 348216 343672 338628 333642 328886 324751 321892 320419 319780 319701 320518 322267 324191 325524
57692C25524N63k99j502k704l234l135l099l497m130m637m551l394j386N14J965
$$ 325524 326087 325788 324286 321582 318348 315213 312114 308617 304487 299850 295299 291905 290519 291033 292998
57677B92998L842O838J0357J3748J7567K2430K7596L2098L6394M1314M6088M9064
$$ 292998 296840 303678 314035 327783 345350 367780 395376 427474 463868 505182 551270 600334
57665F00334M9735M8376M4196L5689K2766P027r870k6511m0719n0078n3821n3045
$$ 600334 650069 698445 742641 778330 801096 808123 798253 771742 731023 680945 627124 574079
57653E74079m9234m3654l7756l2546k7709k2681j8257j5510j3632j0845p382n379
$$ 574079 524845 481191 443435 410889 383180 360499 342242 326732 313100 302255 294873 289494
57641B89494n563o081n301l815k880k469j941j421j371j594j556j185q22p88j198
$$ 289494 283931 277850 272549 268734 265854 263385 261444 260023 258652 257058 255502 254317 253495 252707 251509
57626B51509j775j909j452j175j661k194j785q84p76j579k243k340k354k304j691
$$ 251509 249734 247825 246373 245198 243537 241343 239558 238674 237898 236319 234076 231736 229382 227078 225387
57611B25387q89r47j749j993j299p89j067j222m82M99Q19N51J09n75j497k101
$$ 225387 224498 223551 221802 219809 218510 217721 216654 215432 214950 215449 216268 216819 216928 216353 214856 212755
57595B12755k036j723j699k041k670l390l585k760j507r07r83q45l73l96j030
$$ 212755 210719 208996 207297 205256 202586 199196 195611 192851 191344 190437 189454 188609 188236 187840 186810
57580A86810j323r01n77q35j051q17p07j123j577j771k188k943l225k625j961
$$ 186810 185487 184586 184009 183174 182123 181306 180599 179476 177899 176128 173940 170997 167772 165147 163186
57565A63186j988k250j978j280o68k14J44J87q4k05J2J82K01N32J302J919K024
$$ 163186 161198 158948 156970 155690 155022 154808 154952 155139 155055 154850 154862 155044 155245 155777 157079 158998 161022
57548A61022J990K124K176K008J831J512O02o22j209r94q72j209j150j39J036
$$ 161022 163012 165136 167312 169320 171151 172663 173265 172643 171434 170440 169568 168359 167209 167070 168106
57533A68106J396J035N45J15k27k80j55l30p64q57n66n25p67m85M12R09N85M16
$$ 168106 169502 170537 171082 171197 170970 170690 170535 170205 169441 168584 168018 167493 166726 166241 166653 167562 168147 168563
57515A68563J062J706J521J100J336J884J895J445J162J105R75Q07O74L45j19
$$ 168563 169625 171331 172852 173952 175288 177172 179067 180512 181674 182779 183754 184561 185235 185580 185461
57500A85461j61K52K50o16j645k246k897l905m354l410j862j148j452j838j756
$$ 185461 185300 185552 185802 185186 183541 181295 178398 174493 170139 166729 164867 163719 162267 160429 158673
57485A58673j404j013o87n65m77J03J145J774J471Q23L82k63j444k370k146j181
$$ 158673 157269 156256 155569 155004 154527 154630 155775 157549 159020 159843 160225 159962 158518 156148 154002 152821
57469A52821n01l20k90n17j201j724j290j25Q38J206J237J057O40K74K56M03M55
$$ 152821 152320 152000 151710 151193 149992 148268 146978 146853 147691 148897 150134 151191 151831 152105 152361 152764 153219
57452A53219O16J052J332R57O4q73j510j475m68Q52J077r7j094m70J151K082J799
$$ 153219 153835 154887 156219 157176 157240 156367 154857 153382 152914 153766 154843 154746 153652 153182 154333 156415 158214
57435A58214J065N10K81N03J052J219O17L8L88J272J584J100M56n6n64q35m53
$$ 158214 159279 159789 160070 160573 161625 162844 163461 163499 163887 165159 166743 167843 168299 168243 167679 166844 166391
57418A66391K94O97O20M72M09L24M02Q72J377J338P82K36L2J96O08Q40L88m03
$$ 166391 166685 167382 168002 168474 168883 169207 169609 170481 171858 173196 173978 174214 174246 174442 175050 175890 176278 175875
57400A75875m77L39P24k36j487j457l19M72L87K42P15J623K486K871K404J346
$$ 175875 175398 175737 176461 176225 174738 173281 172962 173434 173821 174063 174778 176401 178887 181758 184162 185508
57384A85508Q15J522K728L291L258L313L275K454J154M27M78N31K47L8N5p1l38
$$ 185508 186323 187845 190573 193864 197122 200435 203710 206164 207318 207745 208223 208754 209001 209039 209094 209023 208685
57367B08685k84J14L48K41Q3l2k35l21O8P75J346J716K009J969J383P78Q06J258
$$ 208685 208401 208515 208863 209104 209187 209155 208920 208599 208667 209442 210788 212504 214513 216482 217865 218643 219449 220707
57349B20707J519J609J893K158K043K001K625L444L525K996K674K472J623L97
$$ 220707 222226 223835 225728 227886 229929 231930 234555 237999 241524 244520 247194 249666 251289 251686
57335B51686M7R11J855K014J792J831K085K340K636K790K374J540J073J306J711
$$ 251686 251733 252644 254499 256513 258305 260136 262221 264561 267197 269987 272361 273901 274974 276280 277991
57320B77991J838J938K387L104L782M119L764K642J423J047J709K855L977M859
$$ 277991 279829 281767 284154 287258 291040 295159 298923 301565 302988 304035 305744 308599 312576 317435
57306C17435N216M914M469M533N000N285N304N374N413N188N097N683O555O886
$$ 317435 322651 327565 332034 336567 341567 346852 352156 357530 362943 368131 373228 378911 385466 392352
57292C92352O846P332Q290Q644Q055P420P382P498P428P753Q936J0277J0712J0101
$$ 392352 399198 406530 414820 423464 431519 438939 446321 453819 461247 469000 477936 488213 498925 509026
57278E09026R231Q879R237R862J0019R417Q731Q965J0319J2063J3407J4070J4174
$$ 509026 518257 527136 536373 546235 556254 565671 574402 583367 593686 605749 619156 633226 647400
57265F47400J4243J5015J6661J8389J9418J9970K0585K0982K0630J9950J9761
$$ 647400 661643 676658 693319 711708 731126 751096 771681 792663 813293 833243 853004
57254H53004J9820J9232J8128J7568J7730J7613J6768J5938J5657J5430J4820
$$ 853004 872824 892056 910184 927752 945482 963095 979863 995801 1011458 1026888 1041708
57243A041708J4218J3967J3663J2902J1964J1322J1093J1279J1885J2632J3218
$$ 1041708 1055926 1069893 1083556 1096458 1108422 1119744 1130837 1142116 1154001 1166633 1179851
57232A179851J3960J5446J7474J9160K0161K0923K1704K2297K2777K3474K4089
$$ 1179851 1193811 1209257 1226731 1245891 1266052 1286975 1308679 1330976 1353753 1377227 1401316
57221A401316K3942K3264K3150K3930K4692K4731K4421K4262K4110K3880K3997
$$ 1401316 1425258 1448522 1471672 1495602 1520294 1545025 1569446 1593708 1617818 1641698 1665695
57210A665695K4632K5314K5790K6499K7762K9251L0596L1783L2680L2972L2893
$$ 1665695 1690327 1715641 1741431 1767930 1795692 1824943 1855539 1887322 1920002 1952974 1985867
57199A985867L3189L4045L4824L5234L5789L6880L8137L9102L9752M0037L9755
$$ 1985867 2019056 2053101 2087925 2123159 2158948 2195828 2233965 2273067 2312819 2352856 2392611
57188B392611L9143L8817L8760L8244L6929L5242L3565L1989L1076L1621L3179
$$ 2392611 2431754 2470571 2509331 2547575 2584504 2619746 2653311 2685300 2716376 2747997 2781176
57177B781176L4041L3309L2059L1710L2210L2573L2534L2797L3986L6016L8213
$$ 2781176 2815217 2848526 2880585 2912295 2944505 2977078 3009612 3042409 3076395 3112411 3150624
57166C150624L9807M0536M0888M1397M1892M1995M2041M2652M3590M4074M4057
$$ 3150624 3190431 3230967 3271855 3313252 3355144 3397139 3439180 3481832 3525422 3569496 3613553
57155C613553M4089M4027M3206M1936M1358M1689M2014M2051M2594M3732M4240
$$ 3613553 3657642 3701669 3744875 3786811 3828169 3869858 3911872 3953923 3996517 4040249 4084489
57144D084489M3403M2103M1260M0460L8941L6813L4468L1797K8747K5862K3542
$$ 4084489 4127892 4169995 4211255 4251715 4290656 4327469 4361937 4393734 4422481 4448343 4471885
57133D471885K1612K0130J9654K0283K1432K2943K5370K8663L1801L4283L6813
$$ 4471885 4493497 4513627 4533281 4553564 4574996 4597939 4623309 4651972 4683773 4718056 4754869
57122D754869L9957M3309M6620N0366N4616N8718O2898O8901P8050Q9767J02850
$$ 4754869 4794826 4838135 4884755 4935121 4989737 5048455 5111353 5180254 5258304 5348071 5450921
57111E450921J17069J32743J49977J69424J92890K22390K59373L05233L61400
$$ 5450921 5567990 5700733 5850710 6020134 6213024 6435414 6694787 7000020 7361420
57102G361420M28569N07308O00051P10892Q42656R95520J168872J362509J575247
$$ 7361420 7789989 8297297 8897348 9608240 10450896 11446416 12615288 13977797 15553044
57093A5553044J804265K046746K300439K562545K831070L107910L396562L693919
$$ 15553044 17357309 19404055 21704494 24267039 27098109 30206019 33602581 37296500
57085C7296500L984798M239377M402147M377198M043897L324161K260696J028938
$$ 37296500 41281298 45520675 49922822 54300020 58343917 61668078 63928774 64957712
57077F4957712j45624j103424j809054k320143k713137l031234l279490l447283
$$ 64957712 64812088 63708664 61899610 59579467 56866330 53835096 50555606 47108323
57069D7108323l528432l526926l453672l322314l146606k938859k709821k469797
$$ 47108323 43579891 40052965 36599293 33276979 30130373 27191514 24481693 22011896
57061B2011896k228878j995281j774077j568221j380043j211013j061065r29403
$$ 22011896 19783018 17787737 16013660 14445439 13065396 11854383 10793318 9863915
57053I863915q15425p17929o34311n61963n00015m48406m05681l69052l36461
$$ 9863915 9048490 8330561 7696250 7134287 6634272 6185866 5780185 5411133 5074672
57044E074672l07423k82051k60375k42339k27389k14237k01824j90141j79252
$$ 5074672 4767249 4485198 4224823 3982484 3755095 3540858 3339034 3148893 2969641
57035B969641j68314j56625j45012j34713j25386j15553j04563r2813q0544o7799
$$ 2969641 2801327 2644702 2499690 2364977 2239591 2124038 2019475 1926662 1846118 1778319
57025A778319n5160m3095l1107j9029q784l182l232q034j6821k9209m3696n7832
$$ 1778319 1723159 1680064 1648957 1629928 1621144 1617962 1614730 1606696 1589875 1560666 1516970 1459138
57013A459138p0051p9684q5428q5850q1654p5523o9230o2596n5542m9186m4240
$$ 1459138 1389087 1309403 1223975 1138125 1056471 980948 911718 849122 793580 744394 700154
57002G00154l9984l5685l1682k8381k5472k2784k0650j8840j6440j3310j0413
$$ 700154 660170 624485 592803 564422 538950 516166 495516 476676 460236 446926 436513
56991D36513q123n588k438L15J982L465N711Q025R058Q704P860O820M997J884
$$ 436513 428390 422802 420364 420679 422661 426126 431837 439862 448920 457624 465484 472304 477301 479185
56977D79185k340o946j0878j3280j4175j4309j4117j3348j1884j0141q376o293
$$ 479185 476845 469899 459021 445741 431566 417257 403140 389792 377908 367767 359391 353098
56965C53098l760j210J016L133N385P637R758J1726J3177J3469J2515J0820Q477
$$ 353098 349338 348128 349144 352277 357662 365299 375057 386783 399960 413429 425944 436764 445241
56952D45241M875k41o050j1384j5485j7868j8127j6399j3575j0627q036n846l766
$$ 445241 450116 449875 443825 432441 416956 399088 380961 364562 350987 340360 332324 326478 322712
56939C22712j206K092N533Q359J0866J3988J7674K0637K1930K1752K0424J7493
$$ 322712 321506 323598 329131 337490 348356 362344 380018 400655 422585 444337 464761 482254
56927D82254J2440N566k238j0046j6928k2064k5196k6572k6351k4579k1771j8814
$$ 482254 494694 500260 498022 487976 471048 448984 423788 397216 370865 346286 324515 305701
56915C05701j6181j3847j1944j0713r845q706p285o131n335m460l497k936k720
$$ 305701 289520 275673 263729 253016 243171 234465 227180 221049 215714 211254 207757 204821 202101
56902B02101k136r58K05R46J548K234K822L356M169N174N987O910Q763J1486J3958
$$ 202101 199965 199007 199212 200158 201706 203940 206762 210118 214287 219461 225448 232358 241121 252607 266565
56887B66565J5478J6477J7312J7408J5991J2964Q664L623j215m888p314r021r867
$$ 266565 282043 298520 315832 333240 349231 362195 370859 374482 373267 368379 361065 352044 342177
56874C42177r061o603l654j065J420M292P577J1346J5809K0584K4919K8897L3309
$$ 342177 333116 326513 322859 321794 323214 327506 335083 346429 362238 382822 407741 436638 469947
56861D69947L7962M1331M2280M0933L7481L1446K2731J2191N96j1579k2745l0148
$$ 469947 507909 549240 591520 632453 669934 701380 724111 736302 736898 725319 702574 672426
56849F72426l2328l0618k7186k2692j6815r909k873M046J1174J8632K6373L4395
$$ 672426 640098 609480 582294 559602 542787 532878 530005 534051 545225 563857 590230 624625
56837F24625M2371M9681N6168O1925O5843O5638O0020M9764L5950J8553k033k3270
$$ 624625 666996 716677 772845 834770 900613 966251 1026271 1076035 1111985 1130538 1128505 1105235
56825A105235m1728n5352o3536o5981o2980n6148m7530l8198k8629j9668j1929
$$ 1105235 1063507 1008155 944619 878638 815658 759510 711980 673782 645153 625485 613556
56814F13556m795K755J0696J8357K5681L2905L9300M3383M4206M1542L5114K4717
$$ 613556 608761 611516 622212 640569 666250 699155 738455 781838 826044 867586 902700 927417
56802I27417J0963m765k0912l5613m6655n2623n3975n2256m8522m3202l6907l0384
$$ 927417 938380 933615 912703 877090 830435 777812 723837 671581 623059 579857 542950 512566
56790E12566k3890j7395j1171n478j23N037R593J3290J6598J9698K1487K0617
$$ 512566 488676 471281 460110 454632 454509 459546 469139 482429 499027 518725 540212 560829
56778E60829J7150J2115N839k091j1360k0486k7928l2859l5022l4682l2752l0208
$$ 560829 577979 590094 595933 593842 582482 561996 534068 501209 466187 431505 398753 368545
56766C68545k7368k4190k0983j8260j6051j4103j2389j0956r525p964o771o384
$$ 368545 341177 316987 296004 277744 261693 247590 235201 224245 214720 206756 199985 193601
56754A93601o367n983n257m733m475m155l779l537l151k185r01m3J30l1k88o41
$$ 193601 187234 181251 175994 171261 166786 162631 158852 155315 152164 149979 149078 149035 149165 149134 148846 148205
56738A48205r03q20n02k51o6J42J08l92r53r18k55M84Q47P41L02n4J88R90J530
$$ 148205 147302 146482 145980 145729 145663 145805 145913 145521 144568 143650 143395 143879 144726 145467 145769 145715 145903 146893 148423
56719A48423J154J86n41o02n4Q39J539J476Q03M12P19J166J305J520K105K488
$$ 148423 149577 149763 149222 148620 148566 149405 150944 152420 153223 153635 154354 155520 156825 158345 160450 162938
56703A62938K256J990K209K263J402J66m36m78o74r35o54oK92K26K96L78n2p00
$$ 162938 165194 167184 169393 171656 173058 173224 172788 172310 171636 170701 170047 170041 170333 170559 170855 171233 171181 170481
56685A70481o62J93J056J323J063M55k58m92J09R57J247J136J310J713J751J385
$$ 170481 169819 170012 171068 172391 173454 173909 173651 173159 173268 174225 175472 176608 177918 179631 181382 182767
56669A82767J021N51k90q60k43J163J921J464N90M6k12k17L12J151J552J356J194
$$ 182767 183788 184339 184049 183189 182946 184109 186030 187494 188084 188130 187918 187701 188013 189164 190716 192072 193266
56652A93266J415J602J469J260J059N61j68n49m28l64p08j128j286j296j198o94
$$ 193266 194681 196283 197752 199012 200071 200632 200464 199915 199487 199123 198415 197287 196001 194705 193507 192813
56636A92813K33J013J143O93k8q17j409j494j132p87q18j202j714k055j869j168
$$ 192813 193046 194059 195202 195895 195867 195050 193641 192147 191015 190228 189410 188208 186494 184439 182570 181402
56620A81402n72p08j379j800j605j112p41o47p99j005r31m67O4L99O52Q37N60
$$ 181402 180830 180122 178743 176943 175338 174226 173485 172838 172039 171034 170103 169636 169700 170099 170751 171588 172148
56603A72148k18o98k41N71O65jn32m31j8L28N67O55N15L19L07M25N51P62R58O92
$$ 172148 171930 171232 170991 171562 172227 172226 171694 171263 171245 171573 172140 172795 173310 173629 173936 174361 174912 175674 176632 177324
56583A77324r1o70n17o6J42M57J383K383K492J704Q39M20N16J239K384L139L106
$$ 177324 177233 176563 176046 175980 176122 176579 177962 180345 182837 184541 185380 185800 186316 187555 189939 193078 196184
56566A96184L153M214N742O532O587O900P775Q663R415J0267J0807J0211Q561
$$ 196184 199337 203551 209293 215825 222412 229312 237087 245750 255165 265432 276239 286450 295011
56553B95011O716M912K665Rk303l797m540m466l608k758k811l508l852l642l406
$$ 295011 301727 306639 309304 309313 307010 303213 298673 294207 290599 287841 285030 281522 277670 274028 270622
56538B70622l188k560j770j566j956k307k532k953l223k738j970k011k739k913
$$ 270622 267434 264874 263104 261538 259582 257275 254743 251790 248567 245829 243859 241848 239109 236196
56524B36196k119j295j122j246j212j033o39O9N72K19o60j237j596k351l113k871
$$ 236196 234077 232782 231660 230414 229202 228169 227530 227599 228171 228390 227730 226493 224897 222546 219433 216562
56508B16562j826j293j702k112j888j332o27L90J245J149M07J26L86K45m39p87
$$ 216562 214736 213443 211741 209629 207741 206409 205782 206172 207417 208566 208973 209099 209485 209730 209291 208504
56492B08504n88n20n67J2R45J088N30N99J345J196k33j133l37Q70R66N10P81J541
$$ 208504 207916 207396 206829 206841 207786 208874 209404 210003 211348 212544 212311 211178 210841 211711 212677 213187 213968 215509
56474B15509J688J074L99J7j41r0rk01m51j60N46Q50O00M71N76K78l99o34l92
$$ 215509 217197 218271 218670 218687 218546 218456 218447 218246 217795 217635 218181 219031 219631 220102 220678 220956 220557 219923 219531
56455B19531n41j032p02N91J434J146Q26J240J557J124P87J190J478R05K67M06
$$ 219531 218990 217958 217256 217847 219281 220427 221253 222493 224050 225174 225961 227151 228629 229534 229801 230207
56439B30207O76K30m05l41J70M44M93M09k24j283j607o93L28M09P4J14J22m43
$$ 230207 230883 231113 230708 230367 230537 230981 231474 231883 231659 230376 228769 228076 228404 228813 228887 229001 229123 228680
56421B28680r93q83o46q73j000m41J58R4oO77J567J614R90O32Q09J190J611J840
$$ 228680 227687 226804 226158 225285 224285 223844 224002 224096 224090 224767 226334 227948 228938 229570 230379 231569 233180 235020
56403B35020J415O21N55J438K010J506Q93J103J449J133P96J140J301L05j002
$$ 235020 236435 237056 237611 239049 241059 242565 243458 244561 246010 247143 247939 249079 250380 250685 249683
56388B49683j224n97k18OQ73K044K438J984J474J150P89O49J030J365J015M35
$$ 249683 248459 247862 247644 247650 248523 250567 253005 254989 256463 257613 258402 259051 260081 261446 262461 262896
56372B62896L84O13M38mk50m42p41n37N14J565J806J757K097K224J368K47J14
$$ 262896 263280 263893 264331 264327 264077 263635 262894 262357 262871 264436 266242 267999 270096 272320 273688 273935 274049
56355B74049Q35J402J631J940K158J884J467J322J009K12k41L68J255J450J485
$$ 274049 274884 276286 277917 279857 282015 283899 285366 286688 287697 287909 287668 288036 289291 290741 292226
56340B92226K282L246L191K411K072K238K224K236K853L406K745J318O94J165
$$ 292226 294508 297754 300945 303356 305428 307666 309890 312126 314979 318385 321130 322448 323142 324307
56326C24307J570J308J030J271J789K272K571K319J419O35P38J348J529J127O16
$$ 324307 325877 327185 328215 329486 331275 333547 336118 338437 339856 340491 341229 342577 344106 345233 345849
56311C45849K50J85P54J649J760Q10J52Q84K229L070L729M859N772N660N336N928
$$ 345849 346099 346284 347038 348687 350447 351257 351409 352293 354522 357592 361321 366180 371952 377612 382948 388876
56295C88876O777O525N355M370L566K389J472J786K764L233L521M650O079O387
$$ 388876 395653 402178 407533 411903 415469 417858 419330 421116 423880 427113 430634 435284 441363 447750
56281D47750N696N365N716O076O543P667Q817Q938Q571R104J0383J1142J1415
$$ 447750 453446 458811 464527 470603 477146 484813 493630 502568 511139 520243 530626 541768 553183
56268E53183J2373J4045J5345J6245J7760J9922K1807K3458K5806K8750L1328
$$ 553183 565556 579601 594946 611191 628951 648873 670680 694138 719944 748694 780022
56257G80022L3684L6854M0771M4571M8753N4782O2454O9812P5946Q1844Q8272
$$ 780022 813706 850560 891331 935902 984655 1039437 1101891 1171703 1247649 1329493 1417765
56246A417765R4703J00627J06075J10549J13143J13945J13677J11903J07225R9288
$$ 1417765 1512468 1613095 1719170 1829719 1942862 2056807 2170484 2282387 2389612 2488900
56236B488900Q9016P6914O2825M7233L1018J4110l897k1898l8012n1949o4644
$$ 2488900 2577916 2654830 2717655 2764888 2795906 2810016 2806119 2784221 2746209 2694260 2629616
56225B629616p5813q4036q9288r3127r6132r7271r6146r3841r1169q7941q4326
$$ 2629616 2553803 2469767 2380479 2287352 2191220 2093949 1997803 1903962 1812793 1724852 1640526
56214A640526q1057p7948p3895o8792o3865n9829n6187n2539m9076m5696m2015
$$ 1640526 1559469 1481521 1407626 1338834 1274969 1215140 1158953 1106414 1057338 1011642 969627
56203I69627l8242l4841l1552k8148k5457k4141k3153k1200j8881j7366j5940
$$ 969627 931385 896544 864992 836844 811387 787246 764093 742893 724012 706646 690706
56192F90706j3265j0207q725q543p740o257n784o333n961m100k345j603j144p44
$$ 690706 677441 667234 658509 649966 642226 635969 630185 623852 617891 613791 611446 609843 608699 607955
56178F07955j120j875j643n45q5l61N4J267J817J532J880L114L802L630L977N238
$$ 607955 606835 604960 603317 602772 602687 602326 602380 603647 605464 606996 608876 611990 615792 619422 623399 628637
56162F28637O224O678P737R398J0242J0184J0808J2485J3841J4551J5960J8396
$$ 628637 634861 641539 649276 658674 668916 679100 689908 702393 716234 730785 746745 765141
56150G65141K0648K2676K6030L0984L5954M0355M5369N1463N7902O5100P4350
$$ 765141 785789 808465 834495 865479 901433 941788 987157 1038620 1096522 1161622 1235972
56139A235972Q4766R3478R9483J04206J07850J08450J05300R9959R3109Q3756
$$ 1235972 1320738 1414216 1513699 1617905 1725755 1834205 1939505 2039464 2132573 2216329
56129B216329P2483O2135N4130M7122M0168L3985K8194K0786J1414K010o785j6394
$$ 2216329 2288812 2350947 2405077 2452199 2492367 2526352 2554546 2575332 2586746 2588756 2581971 2565577
56117B565577k6783l5984m4074n3736o5536p6618q5438r3729j01979j07064j06560
$$ 2565577 2538794 2502810 2458736 2405000 2339464 2262846 2177408 2083679 1981700 1874636 1768076
56106A768076j01846r4996q6062p5477o5423n6737m7834l8553l1505k7660k4382
$$ 1768076 1666230 1571234 1485172 1409695 1344272 1287535 1239701 1201148 1169643 1141983 1117601
56095A117601j9901j6009j4026j2003q402m901k955j193J243K371J147M7J151
$$ 1117601 1097700 1081691 1067665 1055662 1047260 1042359 1039404 1038211 1039454 1041825 1042972 1043019 1044170
56082A044170K937L609M223N912P330P571Q282J0297J1568J1003J0755J2194J3308
$$ 1044170 1047107 1050716 1054939 1060851 1068181 1075752 1084034 1094331 1105899 1116902 1127657 1139851 1153159
56069A153159J2788J2761J4569J5837J4920J4260J5957J7821J7462J6523J7200
$$ 1153159 1165947 1178708 1193277 1209114 1224034 1238294 1254251 1272072 1289534 1306057 1323257
56058A323257J8117J7455J6730J7695J8793J8299J7831J9137K0656K0722K0827
$$ 1323257 1341374 1358829 1375559 1393254 1412047 1430346 1448177 1467314 1487970 1508692 1529519
56047A529519K2305K3257K2206K1301K2433K3784K3718K4104K6294K7940K7468
$$ 1529519 1551824 1575081 1597287 1618588 1641021 1664805 1688523 1712627 1738921 1766861 1794329
56036A794329K7508K9933L1882L0945K9790L1225L3139L2960L2769L5065L7830
$$ 1794329 1821837 1851770 1883652 1914597 1944387 1975612 2008751 2041711 2074480 2109545 2147375
56025B147375L8712L9836M3447M7109M8414M9940N4294N8723O0129O0965O4486
$$ 2147375 2186087 2225923 2269370 2316479 2364893 2414833 2469127 2527850 2587979 2648944 2713430
56014B713430O8669P0607P2340P6455Q0540Q2083Q4165Q9951R6332R9536J02221
$$ 2713430 2782099 2852706 2925046 3001501 3082041 3164124 3248289 3338240 3434572 3534108 3636329
56003C636329J08323J15750J21022J26188J34136J42113J47246J53246J64154
$$ 3636329 3744652 3860402 3981424 4107612 4241748 4383861 4531107 4684353 4848507
55994D848507J76638J86169J95393K08526K23156K35764K49502K68085K88056
$$ 4848507 5025145 5211314 5406707 5615233 5838389 6074153 6323655 6591740 6879796
55985F879796L05853L25984L53183L83342M11809M43323M83557N28652N74063
$$ 6879796 7185649 7511633 7864816 8248158 8659967 9103290 9586847 10115499 10689562
55976A0689562O25555O89877P63214Q41351R32216J045113J177194J325284J501268
$$ 10689562 11315117 12004994 12768208 13609559 14541775 15586888 16764082 18089366 19590634
55967A9590634J720467J985292K296387K667475L110553L619475M189594M841712
$$ 19590634 21311101 23296393 25592780 28260255 31370808 34990283 39179877 44021589
55959D4021589N606240O501172P553588Q826542J0389423J2265479J4426801J6818249
$$ 44021589 49627829 56129001 63682589 72509131 82898554 95164033 109590834 126409083
55951A26409083J9359961K1956087K4518431K6890232K8643647K9026133K7309751
$$ 126409083 145769044 167725131 192243562 219133794 247777441 276803574 304113325
55944C04113325K3273895J7255908R727250J028520q334070j7307300k4519831
$$ 304113325 327387220 344643128 354370378 355398898 347064828 329757528 305237697
55937C05237697k9013066l0700038l0156907k8132823k5279302k2120351j9036248
$$ 305237697 276224631 245524593 215367686 187234863 161955561 139835210 120798962
55930A20798962j6226296j3750885j1622241r834672q346563p097775o050275
$$ 120798962 104572666 90821781 79199540 69364868 61018305 53920530 47870255
55923D7870255n184687m469464l865765l354703k931487k579266k273439k005271
$$ 47870255 42685568 38216104 34350339 30995636 28064149 25484883 23211444 21206173
55915B1206173j778091j585374j413296j259733j130840j022731r24293q34336
$$ 21206173 19428082 17842708 16429412 15169679 14038839 13016108 12091815 11257479
55907A1257479p59214o96780o38304n83200n37214m98661m60273m22294l90821
$$ 11257479 10498265 9801485 9163181 8579981 8042767 7544106 7083833 6661539 6270718
55898F270718l65159l38894l11613k88112k67907k46352k24484k07379j94213
$$ 6270718 5905559 5566665 5255052 4966940 4699033 4452681 4228197 4020818 3826605
55889C826605j79614j63527j50500j40622j29948j18519j09649j02636r4016q4675
$$ 3826605 3646991 3483464 3332964 3192342 3062394 2943875 2834226 2731590 2637574 2552899
55879B552899p8144p3554o7636o1871o0245o1608o1632o0636o2084o4894o4690
$$ 2552899 2474755 2401201 2333565 2271694 2211449 2149841 2088209 2027573 1965489 1900595 1835905
55868A835905o1621n9809n9861n8621n5552n2986n0773m6920m2709m1165m1269
$$ 1835905 1774284 1714475 1654614 1595993 1540441 1487455 1436682 1389762 1347053 1305888 1264619
55857A264619l9485l6081l4163l3422l0788k6558k4023k3514k2365k0364j9887
$$ 1264619 1225134 1189053 1154890 1121468 1090680 1064122 1040099 1016585 994220 973856 953969
55846I53969k0931k1158k0479k0776k1540k0620j8630j7995j8188j6703j3958
$$ 953969 933038 911880 891401 870625 849085 828465 809835 791840 773652 756949 742991
55835G42991j2572j2475j1518j0156j0615j2068j1550r268q180q695q525p503
$$ 742991 730419 717944 706426 696270 685655 673587 662037 652769 644589 635894 627369 619866
55823F19866p736r135r472q789r248j0617j0482q940q574r598r482p715o541o581
$$ 619866 612130 602995 593523 584734 575486 564869 554387 545447 536873 527275 517793 510078 503537 496956
55809D96956n883l853k190j381r1J587J978J321J733L345M087L645L910N103N134
$$ 496956 491073 487220 485030 483649 483558 485145 487123 488444 490177 493522 497609 501254 505164 510267 515401
55794E15401L331J380J7j849m239n687o185p266q775q793p185n995n908n552m658
$$ 515401 518732 520112 520129 518280 514041 508354 502169 494903 486128 477335 470150 464155 458247 452695 448037
55779D48037m630n530n717m930m553m453k861J16K225K959M329P045R100R145
$$ 448037 443407 437877 432160 427230 422677 418224 415363 415479 417704 420663 424992 432037 441137 450282
55765D50282Q119O605L566j197o044r886j3096j5392j5547j3950j2675j2295j1287
$$ 450282 458401 465006 468572 467375 461331 451445 438349 422957 407410 393460 380785 368490 357203
55752C57203r236p757p459o861n369m485m977n493n209n265o301o943o055m405
$$ 357203 347967 340210 332751 325890 320521 316036 311059 305566 300357 295092 288791 281848 275793 271388
55738B71388l031j877r75r80j621j603p67m39j099j762k127l100m651n433n163
$$ 271388 268357 266480 265505 264525 262904 261301 260534 260095 258996 257234 255107 252007 247356 241923 236760
55723B36760n026n215m506k896k087k575k773j929j257j223l67J911L933M461
$$ 236760 231734 226519 222013 219117 217030 214455 211682 209753 208496 207273 206906 208817 212750 217211
55709B17211M530N187N641N105M354M017L170J163r70k220l160m554n932o662
$$ 217211 221741 226928 232569 237674 242028 246045 249215 250378 249408 247188 244028 239474 233542 226880
55695B26880o946o953o406n650n444n245l697j248K7j87J64J878L085K620J976
$$ 226880 219934 212981 206575 200925 195481 190236 186539 185291 185318 185131 185295 187173 190258 192878 194854
55680A94854K375K603J696J214K595M442M750M017L746L603K400O09m76j017j925
$$ 194854 197229 199832 201528 202742 205337 209779 214529 218546 222292 225895 228295 228904 228428 227411 225486
55665B25486k801k592j551p52l65L7K28n9j08O84J497J340P56Q29J270J073L43
$$ 225486 222685 220093 218542 217790 217425 217462 217690 217631 217523 218207 219704 221044 221800 222629 223899 224972 225315
55648B25315k9L2j26o20j119j714k665l668m365m965n552n508m506l381l057l336
$$ 225315 225286 225318 225192 224572 223453 221739 219074 215406 211041 206076 200524 195016 190510 187129 184072 180736
55632A80736l545l645l832l854l523l152k816k063r86m43n46k09Q81J295L3j663
$$ 180736 177191 173546 169714 165860 162337 159185 156369 154306 153320 152877 152331 152122 153003 154298 154331 152668
55616A52668k058j384j057j368j568j572j981k774l200k870k028j053m26o19j408
$$ 152668 150610 149226 148169 146801 145233 143661 141680 138906 135706 132836 130808 129755 129329 128710 127302
55601A27302j817j418r16r46j147j087j103j421j528j165r12r71n52O02J384J074
$$ 127302 125485 124067 123151 122205 121058 119971 118868 117447 115919 114754 113842 112871 112319 112921 114305 115379
55585A15379O55J165J961K025J816K327L237L620L702M347N396O045O355O969
$$ 115379 116034 117199 119160 121185 123001 125328 128565 132185 135887 140234 145630 151675 158030 164999
55571A64999P850Q586R406J0562J1249J0528Q908P588O524M659J851q06k546l689
$$ 164999 172849 181435 190841 201403 212652 223180 232088 239676 246200 250859 252710 251904 249358 245669
55557B45669m813o178p810r390j0172r724q518p243o060n096m904n518n894n172
$$ 245669 240856 234678 226868 217478 207306 197582 189064 181821 175761 170665 165761 160243 154349 149177
55543A49177l819k581j265L73J414R41k50o12l1L80K58K25M23K77l00p61r46j180
$$ 149177 145358 142777 141512 141885 143299 144240 143990 143378 143347 143727 143985 144210 144633 144910 144610 143849 142903 141723
55525A41723j400j281j185j829l062l934m060l954l992l892l365k588j980j879
$$ 141723 140323 139042 137857 136028 132966 129032 124972 121018 117026 113134 109769 107181 105201 103322
55511A03322k282k539j795k09Q98O61k38p58r12j127j126n71q1l43q69q23m76
$$ 103322 101040 98501 96706 96497 97395 98056 97818 97060 96148 95021 93895 93324 93243 92900 92031 91208 90732
55494I0732n57p56l25L88M38m2k02j23n44j154q62K72R10M89j81n01q30j256j025
$$ 90732 90175 89419 89094 89482 89920 89878 89676 89553 89009 87855 86993 87265 88175 88664 88483 87982 87152 85896 84871
55475H4871J50J354J645J170N83R4l98q21j023r90q31p90j100j578j585r02j82
$$ 84871 85021 86375 88020 89190 89773 89867 89469 88648 87625 86635 85804 85014 83914 82336 80751 79849 79667
55458G9667L9K07Q37J345Q46k93q51m26L28Q68J074P11k58j044q34q8P6m42q43
$$ 79667 79706 79913 80750 82095 82941 82648 81797 81371 81699 82567 83641 84352 84094 83050 82216 82128 82204 81762 80919
55439H0919r24j045q69L41K091K873K272J464J278J147M82k20l31r4m8k16l72
$$ 80919 79995 78950 78081 78422 80513 83386 85658 87122 88400 89547 90029 89809 89478 89384 89336 89120 88748
55422H8748m29k55K61P77Q37O41O87P93M26k4L74J439J907J365P91P71N81l44
$$ 88748 88319 88064 88325 89102 89939 90580 91267 92060 92486 92462 92836 94275 96182 97547 98338 99109 99690 99346
55404I9346j307j492j164r25p13l23q3k66m86m09l13m23l25J54L07n08j736k240
$$ 99346 98039 96547 95383 94458 93745 93422 93339 93073 92587 92178 91865 91442 91117 91271 91578 91070 89334 87094
55386H7094j612l16J006J816J690P59j40k74J49L71Qo76j179j181p39k63k8J96
$$ 87094 85482 85166 86172 87988 89678 90437 90297 90023 90172 90543 90551 89875 88696 87515 86776 86513 86485 86681
55368H6681O54R47N29k91o54m89n40r35q40J8O15J37p09p51n9L72J46k38l03o5
$$ 86681 87335 88282 88811 88520 87866 87377 86837 85902 85062 85080 85695 85832 85123 84372 84313 84685 84831 84593 84290 84225
55348H4225L39P72R25N77Q5J23Q08J441J242K52o69p64k70j18p47j515j589r54
$$ 84225 84564 85336 86261 86838 86923 87046 87854 89295 90537 90789 90120 89356 89086 88968 88221 86706 85117 84163
55330H4163j50N98J297J619J257O44M45N38L62R8L61Q39N40m15p21k7L11o30j763
$$ 84163 84013 84611 85908 87527 88784 89428 89873 90411 90773 90871 91232 92071 92611 92196 91475 91448 91759 91129 89366
55311H9366j643n72J81M10Q39J372J007m76j924k229j515o30o9K08L32L38L49
$$ 89366 87723 87151 87332 87742 88581 89953 90960 90484 88560 86331 84816 84186 84117 84325 84657 84995 85344
55294H5344O26J274J955K099J535P33K04k5m3L78J236J713J012l10r41o49m81
$$ 85344 85970 87244 89199 91298 92833 93566 93770 93745 93702 94080 95316 97029 98041 97731 96790 96141 95660
55277I5660r24j098l16O82Q54L00k04m51o57o86l50p7m19j110j344q71j14N96
$$ 95660 94736 93638 93322 94004 94858 95158 94954 94503 93846 93160 92810 92733 92314 91204 89860 88989 88875 89471
55259H9471J280J853J984J514O61k00p69r94j095j264j242o62K05N31M4o03p95
$$ 89471 90751 92604 94588 96102 96763 96563 95794 94800 93705 92441 91199 90537 90742 91273 91317 90714 89919
55242H9919o50m17J15R89J511J050%p59r77r97r29n57R8P25J103J091N17m46j054
$$ 89919 89269 88852 88967 89956 91467 92517 92517 91758 90781 89784 88855 88298 88396 89121 90224 91315 91832 91386 90332
55223I0332p28J65P09M84j81p42q33l62L63P76P46P75J202J586J388Q85P15Q35
$$ 90332 89604 89769 90478 90962 90781 90039 89206 88844 89207 89983 90729 91504 92706 94292 95680 96565 97280 98115
55205I8115O29p5p27p64j52O96J132O30o04j554j536j113j291j919j798m91Q37
$$ 98115 98744 98669 97942 97178 97026 97722 98854 99484 98880 97326 95790 94677 93386 91467 89669 89178 90015
55188I0015Q19l87j330j058j17L31O6k6O63J500J460O24O7L06P24O55K28k09o14
$$ 90015 90834 90447 89117 88059 87942 88273 88339 88313 88976 90476 91936 92560 92627 92933 93657 94312 94540 94331 93717
55169I3717p77j39J159J901J290K83L46J358J878J258L07j47k64m64o13m12k5
$$ 93717 92940 92801 93960 95861 97151 97434 97780 99138 101016 102274 102581 102434 102170 101706 101093 100681 100656
55152A00656J47o2n34j014j177r14n56m83n24j41P59J615J837J363N69n3j78Q2
$$ 100656 100803 100741 100207 99193 98016 97102 96546 96063 95539 95398 96157 97772 99609 100972 101541 101488 101310 101392
55134A01392K68J42PJ10Q9m21r38o69K23P23L77k34n42p28r79q89k13L91J18p40
$$ 101392 101660 101802 101809 101919 102008 101587 100649 99980 100203 100926 101303 101069 100527 99799 98820 97931 97718 98109 98227 97487
55114I7487j049l06P45J117P56M13N52P86M98j83m28K42J320J965K055K139K494
$$ 97487 96438 96132 96877 97994 98750 99163 99715 100501 100999 100816 100388 100630 101950 103915 105970 108109 110603
55097A10603K692K263J317L27m46j007j329j292r28m67p0K73N09L56k96r20p06
$$ 110603 113295 115558 116875 117202 116756 115749 114420 113128 112200 111733 111663 111936 112445 112801 112505 111585 110879
55080A10879L37J143Q47j7k91J22J38p32j559j396o58l55n03k39P08J526J394
$$ 110879 111216 112359 113206 113189 112898 113020 113158 112426 110867 109471 108813 108458 107955 107716 108424 109950 111344
55063A11344M16n79q36k55N05O16Rn31m70k89o52j281j406j056r68j322j416q18
$$ 111344 111760 111181 110345 110090 110595 111211 111220 110689 110219 109930 109278 107997 106591 105535 104567 103245 101829 101011
55045A01011n8J86j7r2L07J026J606J584R45L16L44Q68J115P75L22J77J30j52
$$ 101011 100953 101139 101122 101030 101337 102363 103969 105553 106498 106814 107158 108026 109141 109916 110238 110415 110545 110393
55027A10393n26o72o22n91o03n41l86k15j40l58r25j429j224k74O96J088J078
$$ 110393 109867 109195 108573 107982 107379 106838 106452 106237 106097 105739 104814 103385 102161 101887 102583 103671 104749
55010A04749J095J057P01L24N39J297J704J067k52j212j178m02L74N93K54j96
$$ 104749 105844 106901 107602 107926 108465 109762 111466 112533 112281 111069 109891 109489 109863 110456 110710 110514
54994A10514k47K06P36Q10M07M6Q6K41N0l51m09KM17N79P72J097J070M25j87j8
$$ 110514 110267 110473 111209 112019 112426 112472 112558 112799 112849 112498 112089 112091 112508 113087 113859 114956 116026 116451 116264 116246
54974A16246O16P51K14j54K46J060J647J789J476O47m14r98p23n3L16L02K18P0
$$ 116246 116862 117613 117827 117673 117919 118979 120626 122415 123891 124538 124124 123126 122403 122350 122666 122968 123186 123256
54956A23256m03j066j320q08R7O47M73j45n87m90n2K07K1l64m85j55M05P96P66
$$ 123256 122853 121787 120467 119659 119756 120403 120876 120731 120144 119654 119602 119809 119830 119466 118981 118826 119231 120027 120793
54937A20793M18J20J08J56j39p03q84k07R47J701J734J644K104K954L420L206
$$ 120793 121211 121331 121439 121595 121456 120753 119869 119662 120609 122310 124044 125688 127792 130746 134166 137372
54921A37372K929L312M268N142N642O084O620O723N763L854J814L14o43j521k671
$$ 137372 140301 143613 147881 153023 158665 164749 171369 178092 183855 187709 189523 189837 189194 187673 185002
54906A85002l996n040n430n245m887m592m243l728l204k881k728k542k217j782
$$ 185002 181006 175966 170536 165291 160404 155812 151569 147841 144637 141756 139028 136486 134269 132487
54892A32487j297q72n72k43L55J134J640J636J472J613K027K326K367K428K867
$$ 132487 131190 130318 129746 129503 129858 130992 132632 134268 135740 137353 139380 141706 144073 146501 149368
54877A49368L744M733N322N289M981M919N019M668L619K384J439O01m76j635k557
$$ 149368 153112 157845 163167 168456 173437 178356 183375 188043 191662 194046 195485 196086 195610 193975 191418
54862A91418l355m283n166n613n591n277m627l619k703k393k506k415j943j523
$$ 191418 188063 183780 178614 173001 167410 162133 157506 153887 151184 148791 146285 143870 141927 140404
54848A40404j465j630j772j811j755j707j825j977j713r98n94j085j871j897j127
$$ 140404 138939 137309 135537 133726 131971 130264 128439 126462 124749 123751 123157 122072 120201 118304 117177
54833A17177m59k42N7O52Q93L54l46l94J20N03M42K14J14R9k6k97n06m15j05O1
$$ 117177 116718 116476 116533 117185 118078 118432 118086 117692 117812 118315 118757 118971 119085 119184 119158 118861 118355 117940 117835 117896
54813A17896JJ71Q63J586J668J239R98J085R64L60l08n71l63K22J007J452R92
$$ 117896 117897 118068 118931 120517 122185 123424 124422 125507 126471 126831 126523 125952 125589 125811 126818 128270 129262
54796A29262j65j147j417j102l67P91J893K095J257K68n5K31P85J496J986J502
$$ 129262 129097 127950 126533 125431 125064 125855 127748 129843 131100 131368 131313 131544 132329 133825 135811 137313
54780A37313j5j326j218j3R47R94O50O70J266K247L337M228M681M704M538M540
$$ 137313 137298 135972 134754 134741 135688 136682 137332 138002 139268 141515 144852 149080 153761 158465 163003 167543
54764A67543N031N981O798O823O171N610N449N055L759J742l75k267l823m798
$$ 167543 172574 178555 185353 192176 198347 203957 209406 214461 218220 219962 219587 217320 213497 208699
54750B08699n146n353n932o633o769o082n019m161l744l581l236k441j515j108
$$ 208699 203553 198200 192268 185635 178866 172784 167765 163604 159860 156279 153043 150602 149087 147979
54736A47979j347j620j383q42m06k2N21R80R23M34Q8L12J104K194L204L812M095
$$ 147979 146632 145012 143629 142787 142381 142359 142880 143860 144783 145217 145305 145617 146721 148915 152119 155931 160026
54719A60026M454M971N150M698M100L926L818K879R49j153k663l594m270m646
$$ 160026 164480 169451 174601 179299 183399 187325 191143 194022 194971 193818 191155 187561 183291 178645
54705A78645m433l724l163l394m343n172n122m331l527k974k187q58M48R20M69
$$ 178645 174212 170488 167325 163931 159588 154416 149294 144963 141436 138462 136275 135417 135865 136785 137254
54690A37254l07q71j087j019q13o91q00j046j228j154o85R2O68N00k35p40o31
$$ 137254 136947 136076 134989 133970 133157 132466 131666 130620 129392 128238 127553 127645 128313 128813 128578 127838 127207
54673A27207l74m13m76j81J87J13l33o31o01m90m94n91o73n24J8O05N06m33j344
$$ 127207 126833 126420 125944 125763 125950 126063 125730 125099 124498 124008 123514 122923 122250 121726 121744 122349 122855 122422 121078
54654A21078j416r04n22k65L76J352K002J983J548R96N02K98M52M84j10j011j397
$$ 121078 119662 118758 118236 117971 118347 119699 121701 123684 125232 126228 126730 127028 127480 127964 127854 126843 125446
54637A25446j010l70J03N03R67J417J842K257K314J576L09o27p99n95m81l83p0
$$ 125446 124436 124066 124169 124672 125639 127056 128898 131155 133469 135045 135354 134727 133928 133333 132852 132469 132399
54620A32399K76K75j74p89j164j057o36m10o59r91p76Q1J110J884K224J971J123
$$ 132399 132675 132950 132776 131987 130823 129766 129130 128720 128061 127070 126294 126375 127485 129369 131593 133564 134687
54603A34687J75k55j87j35k30j03K25Q6q22j732j697q66l25p35j545j666p43M22
$$ 134687 134862 134607 134420 134285 134055 133952 134177 134263 133441 131709 130012 129146 128821 128086 126541 124875 124132 124554
54585A24554P65J73l70K9J103J794J473M75m49q06n55n1J78r7m94m67%L99L94
$$ 124554 125319 125492 125122 125151 126254 128048 129521 129996 129547 128741 128186 128135 128313 128216 127722 127255 127255 127654 128048
54566A28048J38o5j19p9j5J4j2pR6K92O43J298K113K505K044R44k41j184j709
$$ 128048 128186 128121 128002 127923 127908 127922 127910 127903 127999 128291 128934 130232 132345 134850 136894 137838 137597 136413 134704
54547A34704j549o83L10Q07Q26P63O86M88M61R69J734K120K022J757J240K30p13
$$ 134704 133155 132472 132782 133589 134415 135178 135864 136352 136813 137782 139516 141636 143658 145415 146655 146885 146172
54530A46172n56O49J534J189K78j65k17o05j328j618j098k63K33K60J18P4J00
$$ 146172 145616 146265 147799 148988 149266 149101 148884 148279 146951 145333 144235 143972 144205 144465 144583 144657 144757
54513A44757k6m09q28r56p42m60l70n22p79q53m81J89N28J52m95o59k77J26L38
$$ 144757 144731 144322 143494 142538 141796 141336 140966 140444 139665 138812 138331 138520 139048 139200 138705 138046 137769 137895 138233
54494A38233O54J141J353R46P4r12j687j802r85L12J123J023N24K93M12N44M13
$$ 138233 138887 140028 141381 142327 142401 141489 139802 138000 137015 137327 138450 139473 139997 140290 140702 141246 141659
54477A41659j5m47l42M88J422J695J451J426J710J635R61L10J04M1j33q9L45P39
$$ 141659 141644 141197 140855 141343 142765 144460 145911 147337 149047 150682 151643 151953 152057 152098 151965 151876 152221 152960
54459A52960Q05Q62J117J203R18O84P01M54l26r81r06n26m22k67L92R39M70o59
$$ 152960 153765 154627 155744 156947 157865 158549 159250 159704 159378 158397 157491 156965 156543 156276 156668 157607 158077 157418
54441A57418j261j079q83r08n59K02L98l92j148q35N7L00k22m55J46Q16O49r3
$$ 157418 156157 155078 154195 153287 152728 152930 153328 152936 151788 150953 151010 151310 151088 150633 150779 151595 152244 152151
54423A52151l49L48J420K060K048J573Q57K35J95P98J321J044K68j28j2q1n38
$$ 152151 151802 152150 153570 155630 157678 159251 160108 160343 160538 161336 162657 163701 163969 163841 163829 163748 163210
54406A63210o05K26J183J091j06j336j627q99K17R79J041P00N03N95O74O18O26
$$ 163210 162605 162831 164014 165105 164999 163663 162036 161137 161354 162333 163374 164074 164577 165172 165846 166464 167090
54389A67090O51L11l77p63m99r4m3MN25J117J003L04k2M74J171J215M81m57r80
$$ 167090 167741 168052 167675 166912 166413 166319 166276 166280 166805 167922 168925 169229 169207 169681 170852 172067 172548 172091 171111
54370A71111r40o83n93o46m98N0R55K128L287L747L085J990J663K198K443J745
$$ 171111 170171 169488 168895 168249 167751 167801 168756 170884 174171 177918 181003 182993 184656 186854 189297 191042
54354A91042Q17M07K14j95m66l43m95j340j962j495q56j540l142l730k574r87
$$ 191042 191859 192266 192480 192285 191819 191476 190981 189641 187679 186184 185328 183788 180646 176916 174342 173355
54338A73355l34n39r73j496k077k355k117j592r30l7Q72J277J113Q94Q85P83L63
$$ 173355 173021 172482 171509 170013 167936 165581 163464 161872 160942 160905 161777 163054 164167 165061 165946 166729 167092
54321A67092j95p20j131j047j07J179J680R97j26q46j007p88l65j57n60j184j163
$$ 167092 166897 166177 165046 163999 163892 165071 166751 167748 167622 166776 165769 164981 164616 164459 163899 162715 161552
54304A61552m51k7m51j119j332j259j312j319r88m81JO23J360J648J168M64J51
$$ 161552 161101 161074 160623 159504 158172 156913 155601 154282 153294 152813 152814 153437 154797 156445 157613 158077 158228
54287A58228P4j43l25j67P2J00L35J257K263K166P70p53j256p23O1N23O89Q23
$$ 158228 158302 158159 157834 157667 157739 157839 158174 159431 161694 163860 164630 163877 162621 161898 161959 162482 163171 163994
54269A63994R99J010O91J67l05o47q36o52KO53P60O09J015K006K655K424J848
$$ 163994 164993 166003 166694 166861 166556 165909 165073 164421 164423 165076 165836 166445 167460 169466 172121 174545 176393
54252A76393J462J062N08L24O59N84n22j608j233K45J069M81n68j117j324j547
$$ 176393 177855 178917 179425 179749 180408 180992 180470 178862 177629 177874 178943 179424 178856 177739 176415 174868
54236A74868j511r49l49l53q94j330j209n94Q7L46L0m87p20o50n35l16K57J017
$$ 174868 173357 172408 172059 171706 170812 169482 168273 167679 167766 168112 168142 167655 166935 166285 165750 165434 165691 166708
54218A66708J509J694J889J942J262j43j383j742j408q31r0O58Q40J83o79r89
$$ 166708 168217 169911 171800 173742 175004 174861 173478 171736 170328 169497 169407 170065 170905 171088 170409 169420
54202A69420p98o15m88j58K41L07J4m16r73j570j539l45J315K026J397M31M6J16
$$ 169420 168622 168007 167519 167361 167602 167909 167923 167507 166534 164964 163425 163080 164395 166421 167818 168249 168295 168411
54184A68411K46N35R74R49J06q53j005m45R2L45N53O81N03K66L47M30k5o19l26
$$ 168411 168657 169192 170166 171115 171221 170368 169363 168918 169010 169355 169908 170589 171092 171358 171705 172135 172110 171491 171165
54165A71165Q55J734J598J050P26K92n74j217r92m12m19r72j361j429j494j412
$$ 171165 172020 173754 175352 176402 177128 177420 176846 175629 174637 174225 173806 172834 171473 170044 168550 167138
54149A67138q04l8O5m89q75p05l98k60j13O0N0R8P04J546J619P65O2J45K86k52
$$ 167138 166334 166296 166361 165872 164997 164292 163894 163634 163521 163581 163631 163729 164433 165979 167598 168363 168425 168570 168856 168604
54129A68604q58n42M17Q78N17P1J04L55M33L78M44P39J222J702J859J502Q03O7
$$ 168604 167746 167204 167621 168499 169016 169087 169191 169546 169979 170357 170801 171540 172762 174464 176323 177825 178628 178695
54111A78695n15p81n61m3J54k80q18o90J58J096J641J805J753J520J178R33J058
$$ 178695 178180 177399 176838 176795 176949 176669 175851 175161 175319 176415 178056 179861 181614 183134 184312 185245 186303
54094A86303J692K610L167K873K117J813K140K238J596J050J684L170M064L517
$$ 186303 187995 190605 193772 196645 198762 200575 202715 204953 206549 207599 209283 212453 216517 220034
54080B20034J911o5k078l715m310l630k398j687j927k568k623j642l11J56n34
$$ 220034 221945 221880 219802 216087 211777 208147 205749 204062 202135 199567 196944 195302 194991 195147 194613
54065A94613j270r19J85Q14N66K42N05J036J177P51Po78q33j16J175K279K773
$$ 194613 193343 192424 192609 193423 193989 194231 194736 195772 196949 197700 197707 197029 196196 196080 197255 199534 202307
54048B02307K889K943L052L400M221N179N466M818M035L993M591N015M796M193
$$ 202307 205196 208139 211191 214591 218812 223991 229457 234275 238310 242303 246894 251909 256705 260898
54034B60898L787L957M630N309N513N265M907M441L589K549K062K378K705K187
$$ 260898 264685 268642 273272 278581 284094 289359 294266 298707 302296 304845 306907 309285 311990 314177
54020C14177R89k8l98k99n2R0j66r33j897k623l040l371l747m196m775n372n600
$$ 314177 315166 315138 314740 314441 314389 314479 314313 313380 311483 308860 305820 302449 298702 294506 289731 284359 278759
54003B78759n297m913m889m931m397l342k568k613l142l457l207k522j792j365
$$ 278759 273462 268549 263660 258729 254332 250990 248422 245809 242667 239210 236003 233481 231689 230324
53989B30324j238j052o40m02p70j431j639j262r24j033j323j427j353j142o23
$$ 230324 229086 228034 227394 226992 226222 224791 223152 221890 220966 219933 218610 217183 215830 214688 214065
53974B14065O3K71l33j092j054j25R23J383J149N50J12K88R53J328Q89K15K95
$$ 214065 214128 214399 214066 212974 211920 211795 212718 214101 215250 215800 215912 216200 217153 218481 219370 219585 219880
53957B19880J144J795J733J560J981K831L613M278M931N242N007M880N742P394
$$ 219880 221024 222819 224552 226112 228093 230924 234537 238815 243746 248988 253995 258875 264617 272011
53943B72011Q767R443J0077J1069J1686J1082R538P879O143L636K57l018n121
$$ 272011 280778 290221 300298 311367 323053 334135 343673 351552 357695 361331 361588 358570 353449
53930C53449n789n404m439l367k639k331k017j244k2J344K648L765M472M650M571
$$ 353449 347660 342256 337817 334450 331811 329480 327463 326219 326197 327541 330189 333954 338426 343076 347647
53915C47647M693N141N730O401P277Q188Q504P751O243M819M009L617L130K273
$$ 347647 352340 357481 363211 369612 376889 385077 393581 401332 407575 412394 416403 420020 423150 425423
53901D25423J151K9q81j558k143k757l308l600l685l957m710n696o367o555o700
$$ 425423 426574 426603 425722 424164 422021 419264 415956 412356 408671 404714 400004 394308 387941 381386 374686
53886C74686p267q071q412p859o800o107o203o547o191m913l629l430m307n157
$$ 374686 367419 359348 350936 343077 336277 330170 323967 317420 311229 306316 302687 299257 294950 289793
53872B89793n093m419m026m167m216l620k679k177k452l030l212k849k419k321
$$ 289793 284700 280281 276255 272088 267872 264252 261573 259396 256944 253914 250702 247853 245434 243113
53858B43113k280j732o88N8j70j167k187k820l162l264k927k190j552j416j508
$$ 243113 240833 239101 238413 238471 238301 237134 234947 232127 228965 225701 222774 220584 219032 217616 216108
53843B16108j172k38P02R42M51j64m02l28k38o5M20R79R75K48m98o04k98j60j08
$$ 216108 214936 214698 215400 216342 216793 216629 216227 215899 215661 215596 216016 216995 217970 218218 217720 217116 216818 216658 216550
53824B16550L50J050J206O51K02M55R49J052R85J250J603J438J002J210K228L058
$$ 216550 216900 217950 219156 219807 220009 220464 221413 222465 223450 224700 226303 227741 228743 229953 232181 235239
53808B35239K858K030J629K121L141M110M685M837M841N047N413N445M892M280
$$ 235239 238097 240127 241756 243877 247018 251128 255813 260650 265491 270538 275951 281396 286288 290568
53794B90568M406N326O140N923M609L008K055K007K277K046J161K38j54j86m20
$$ 290568 294974 300300 306440 312363 316972 319980 322035 324042 326319 328365 329526 329764 329610 329424 329004
53779C29004j003j678k327l030l564l523l088l127m094n229n404m526l604l448
$$ 329004 328001 326323 323996 320966 317402 313879 310791 307664 303570 298341 292937 288411 284807 281359
53765B81359l812l943l573l113l121l769m711n248m790l366j720p43p21j203j550
$$ 281359 277547 273604 270031 266918 263797 260028 255317 250069 245279 241913 240193 239450 238729 237526 235976
53750B35976j526j303j090r38q86j027j282j323r19k63K96P16J142J401J056J28
$$ 235976 234450 233147 232057 231119 230233 229206 227924 226601 225682 225419 225715 226431 227573 228974 230030 230158
53734B30158o67o77l2O52R62Q25L13k99n00l8O58R96J012J246J881K476K635K474
$$ 230158 229491 228814 228782 229434 230396 231221 231534 231235 230735 230697 231355 232351 233363 234609 236490 238966 241601 244075
53716B44075K315K280K321K387K404K287K049J804J664J769K262K956L265K807
$$ 244075 246390 248670 250991 253378 255782 258069 260118 261922 263586 265355 267617 270573 273838 276645
53702B76645J989J490J398J341J333J781K597L078K884K502K468K759L128L497
$$ 276645 278634 280124 281522 282863 284196 285977 288574 291652 294536 297038 299506 302265 305393 308890
53688C08890L647L183K185J261O63m5j011j578j326q93r96j234q64j80j31p86
$$ 308890 312537 315720 317905 319166 319829 319784 318773 317195 315869 314976 313980 312746 311882 311702 311571 310785
53672C10785j275j156q83p98o07r4L96N28L85J25l00p93j022r13q35j016j198
$$ 310785 309510 308354 307471 306673 306066 305972 306368 306896 307281 307406 307106 306313 305291 304378 303543 302527 301329
53655C01329j019m83J39N66N67Q9n84j011r79n09M06J651K681K861K196J386J104
$$ 301329 300310 299827 299966 300532 301099 301188 300604 299593 298614 298105 298511 300162 302843 305704 307900 309286 310390
53638C10390J537K441L265L363K621J774J519J506R11q2l28N87J707K181K453
$$ 310390 311927 314368 317633 320996 323617 325391 326910 328416 329327 329245 328917 329504 331211 333392 335845
53623C35845L360M678N386N000M004L140K804L005L518M115M777N576O259O336
$$ 335845 339205 343883 349269 354269 358273 361413 364217 367222 370740 374855 379632 385208 391467 397803
53609C97803N760N107M803M626M258L880L758L617K995J990J219J044J238J368
$$ 397803 403563 408670 413473 418099 422357 426237 429995 433612 436607 438597 439816 440860 442098 443466
53595D43466J216R00O98P18O92L05l15p44r53j322j899k156j809j308j162j230
$$ 443466 444682 445582 446280 446998 447690 447995 447680 446936 445983 444661 442762 440606 438797 437489 436327 435097
53579D35097j189j190j580k248k768k923k650j860p73q4k23p45r54q97j116j706
$$ 435097 433908 432718 431138 428890 426122 423199 420549 418689 417916 417832 417609 416864 415910 415013 413897 412191
53563D12191k196k252j867j042Q9R19Q32Q2m28k52K17N07O44P83Q96R72J192J649
$$ 412191 409995 407743 405876 404834 404923 405842 406674 406756 406328 406076 406293 406800 407444 408227 409123 410095 411287 412936
53545D12936K141K456K604K721K959L379L829M044M112M591N702O772P037O735
$$ 412936 415077 417533 420137 422858 425817 429196 433025 437069 441181 445772 451474 458246 465283 472018
53531D72018O744P272P807Q326R516J1484J3187J3771J3741J4125J5028J5777
$$ 472018 478762 486034 493841 502167 511683 523167 536354 550125 563866 577991 593019 608796
53519F08796J6093J6341J6796J7371J8012J8786J9617K0469K1671K3509K5471
$$ 608796 624889 641230 658026 675397 693409 712195 731812 752281 773952 797461 822932
53508H22932K6623K6861K7089K7847K8456K8100K7178K6820K7227K7423K6719
$$ 822932 849555 876416 903505 931352 959808 987908 1015086 1041906 1069133 1096556 1123275
53497A123275K5646K4992K4599K3694K2089K0428J9406J9216J9703K0512K1088
$$ 1123275 1148921 1173913 1198512 1222206 1244295 1264723 1284129 1303345 1323048 1343560 1364648
53486A364648K0981K0326J9649J9184J8745J8289J8051J8003J7637J6569J5001
$$ 1364648 1385629 1405955 1425604 1444788 1463533 1481822 1499873 1517876 1535513 1552082 1567083
53475A567083J3345J1737J0077Q180N743K588p80l476n318p086r352j1650j3280
$$ 1567083 1580428 1592165 1602242 1610422 1616165 1618753 1617973 1614497 1609179 1602093 1592741 1581091 1567811
53462A567811j4336j5306j6184j6729j7262j8279j9520k0222k0222k0120k0353
$$ 1567811 1553475 1538169 1521985 1505256 1487994 1469715 1450195 1429973 1409751 1389631 1369278
53451A369278k0815k1386k2084k2686k2783k2348k1647k0676j9261j7675j6385
$$ 1369278 1348463 1327077 1304993 1282307 1259524 1237176 1215529 1194853 1175592 1157917 1141532
53440A141532j5221j3623j1713j0277r412q157n894l337j556p04k05M13J402K998
$$ 1141532 1126311 1112688 1100975 1090698 1081286 1073129 1067235 1063898 1062342 1061638 1061433 1061846 1063248 1066246
53426A066246N045O878Q088R128J0585J2299J3811J5253J7088J9210K1031K2448
$$ 1066246 1071291 1078169 1086257 1095385 1105970 1118269 1132080 1147333 1164421 1183631 1204662 1227110
53414A227110K3952K5761K7500K8892L0317L2297L4807L7315L9368M0967M2433
$$ 1227110 1251062 1276823 1304323 1333215 1363532 1395829 1430636 1467951 1507319 1548286 1590719
53403A590719M4034M5765M7465M9155N0998N2840N4111N4537N4711N5567N7280
$$ 1590719 1634753 1680518 1727983 1777138 1828136 1880976 1935087 1989624 2044335 2099902 2157182
53392B157182N9030O0058O0508O1026O1728O1915O0844N8564N5876N3554N1708
$$ 2157182 2216212 2276270 2336778 2397804 2459532 2521447 2582291 2640855 2696731 2750285 2801993
53381B801993M9787M7150M3579L9419L5201L1076K6703K1764J6472J1261O100
$$ 2801993 2851780 2898930 2942509 2981928 3017129 3048205 3074908 3096672 3113144 3124405 3130505
53370C130505O44m978j0160j4982k0583k7708l5340m1622m5966m9331n2578n5558
$$ 3130505 3131149 3126171 3116011 3101029 3080446 3052738 3017398 2975776 2929810 2880479 2827901 2772343
53358B772343n7837n9358o0029n9570n8268n7152n6723n6197n4573n2054m9722
$$ 2772343 2714506 2655148 2595119 2535549 2477281 2420129 2363406 2307209 2252636 2200582 2150860
53347B150860m8199m7297m6696m6242m5692m4805m3693m2642m1559m0003l7764
$$ 2150860 2102661 2055364 2008668 1962426 1916734 1871929 1828236 1785594 1744035 1704032 1666268
53336A666268l5107l2474l0173k8318k6694k4864k2660k0503j8958j8052j7358
$$ 1666268 1631161 1598687 1568514 1540196 1513502 1488638 1465978 1445475 1426517 1408465 1391107
53325A391107j6621j5948j5411j4870j4175j3335j2450j1652j1040j0452r413
$$ 1391107 1374486 1358538 1343127 1328257 1314082 1300747 1288297 1276645 1265605 1255153 1245740
53314A245740p579n283l308k140j538r16J25J618L417N389P420R301J0812J2030
$$ 1245740 1238161 1232878 1229570 1227430 1225892 1224976 1225101 1226719 1230136 1235525 1242945 1252246 1263058 1275088
53300A275088J3408J5277J7380J9229K0840K2646K4642K6168K6790K6960K7436
$$ 1275088 1288496 1303773 1321153 1340382 1361222 1383868 1408510 1434678 1461468 1488428 1515864
53289A515864K8396K9342K9624K8810K6915K4516K2339K0488J8433J5899J3282
$$ 1515864 1544260 1573602 1603226 1632036 1658951 1683467 1705806 1726294 1744727 1760626 1773908
53278A773908J0924Q559N806K691o82m269p586r812j1069j2761j5786j9157k1445
$$ 1773908 1784832 1793391 1799197 1801888 1801206 1796937 1789351 1779539 1768470 1755709 1739923 1720766 1699321
53265A699321k2902k4849k7435k9486l0488l1158l1898l2116l1566l1044l1126
$$ 1699321 1676419 1651570 1624135 1594649 1564161 1533003 1501105 1468989 1437423 1406379 1375253
53254A375253l1278l0960l0673l1022l1513l1139k9780k8312k7606k7901k8784
$$ 1375253 1343975 1313015 1282342 1251320 1219807 1188668 1158888 1130576 1102970 1075069 1046285
53243A046285k9381k8936k7670k6598k6194k5774k4642k3144k1905k0705j8919
$$ 1046285 1016904 987968 960298 933700 907506 881732 857090 833946 812041 791336 772417
53232G72417j6709j4895j3837j3229j2790j2401j1748j0585r400r103r959j1341
$$ 772417 755708 740813 726976 713747 700957 688556 676808 666223 656823 647720 637761 626420
53220F26420j2533j3206j3278j2954j2898j3571j4315j3899j2196j0568j0192
$$ 626420 613887 600681 587403 574449 561551 547980 533665 519766 507570 497002 486810
53209D86810j0689j0870j0238r148q037p141o688o680o657o307o125o779p875
$$ 486810 476121 465251 455013 445865 437828 430687 423999 417319 410662 404355 398230 391451 383576
53196C83576q199p381o503o514o791o073m497l612m271n354n220l786k438k123
$$ 383576 375377 367996 361493 354979 348188 342115 337618 334006 329735 324381 319161 315375 312937 310814
53182C10814k392k374j972j647j619j792k195k885l556l760l495l112k630j739
$$ 310814 308422 306048 304076 302429 300810 299018 296823 293938 290382 286622 283127 280015 277385 275646
53168B75646n93K0k56o63k96N80Q43P6r07j238j054j026j285j420j222q84n39
$$ 275646 275053 275073 274817 274154 273858 274438 275281 275357 274450 273212 272158 271132 269847 268427 267205 266321 265782
53151B65782r4L54M08o7o49q49p51q07j111j188o20L47R55O82j97q48o55J87R42
$$ 265782 265688 266042 266450 266383 265734 264885 264134 263327 262216 261028 260408 260755 261710 262392 262195 261347 260692 260879 261821
53132B61821J113Q85P32P96Q21O91P11J188J886K128J571O55J44L13P94J128J171
$$ 261821 262934 263819 264551 265347 266168 266859 267570 268758 270644 272772 274343 274998 275142 275455 276249 277377 278548
53115B78548R95P30N91P79J051P97j63j102j239p68n47q50j115r39p15r47j532
$$ 278548 279543 280273 280864 281643 282694 283491 283328 282226 280987 280219 279672 278822 277707 276768 276053 275106 273574
53098B73574k024k223k146j769j193p60o23n19k33No6k06k6L52M46R9m01p31p48
$$ 273574 271550 269327 267181 265412 264219 263459 262836 262317 262084 262089 262023 261817 261791 262143 262589 262688 262287 261556 260808
53079B60808m16R2L74K69J72M33P07L84m00q70o82l12k42l30k65k34p15j763k730
$$ 260808 260392 260484 260858 261127 261299 261732 262439 262823 262423 261553 260871 260559 260317 259987 259722 259488 258773 257010 254280
53060B54280k757j580M8R14N14m48r56q34n97m65j08O12J276J434J082N22P4k
$$ 254280 251523 249943 249991 250905 251419 250971 250015 249181 248584 248119 248011 248623 249899 251333 252415 252937 253011 253009
53042B53009K79M49M9o67r03l35N10R31P60K41l56p81q60o48l13J41O99R95O89
$$ 253009 253288 253737 253786 253119 252216 251881 252391 253322 254082 254323 253967 253186 252326 251678 251365 251506 252205 253200 253889
53023B53889J52R2M98O05J35k84j61J67L09M97R07J064O37K42N68J186J100K80
$$ 253889 254041 254133 254631 255236 255371 255087 254926 255093 255402 255899 256806 257870 258507 258749 259317 260503 261603 261883
53005B61883k60N7O88Q32M00j43l78k27P5K05J08R7L72O80P22O47O94O68K98o1
$$ 261883 261623 261680 262368 263200 263600 263457 263079 262852 262927 263132 263240 263337 263709 264389 265111 265758 266452 267120 267418 267357
52985B67357K51J180J893J863J440J225J321J488J578J617J635J684J811J884
$$ 267357 267608 268788 270681 272544 273984 275209 276530 278018 279596 281213 282848 284532 286343 288227
52971B88227J668J132M76j45p15j131j220j001o40j20O64J421J542Q98J68N2L54
$$ 288227 289895 291027 291503 291358 290643 289512 288292 287291 286651 286531 287195 288616 290158 291056 291224 291276 291630
52954B91630L16l63j204j637j601j378j107p76m87m83q30j301j566j438r13k02
$$ 291630 291946 291583 290379 288742 287141 285763 284656 283880 283393 282910 282080 280779 279213 277775 276862 276660
52938B76660K50O1n70q75l81L99N62p2q57j261j401j524j577j487j415j417j277
$$ 276660 276910 276971 276401 275526 275145 275544 276106 276034 275177 273916 272515 270991 269414 267927 266512 265095 263818
52921B63818r85q90j121j206p71j86k6j85q4M14Q07O78K04q2J83Q11J132O70j70
$$ 263818 262833 261943 260822 259616 258845 258659 258633 258448 258364 258778 259585 260263 260467 260385 260568 261379 262511 263181 263011
52902B63011m76q2J50l47r24p41m9L74N12Q88J358J309Q66P66R87O61m44j370
$$ 263011 262535 262453 262603 262256 261332 260591 260542 260916 261428 262316 263674 264983 265849 266615 267602 268263 267819 266449
52884B66449j357q29n27m93m44l75k33L83J499K338K288J820J761K023J848J046
$$ 266449 265092 264263 263736 263243 262799 262424 262191 262574 264073 266411 268699 270519 272280 274303 276151 277197
52868B77197K81J28M91R84J377J587J574J439J384J485J644J699J469P63m31j776
$$ 277197 277478 277606 278097 279081 280458 282045 283619 285058 286442 287927 289571 291270 292739 293502 293071 291295
52852B91295k763l122l104l291m001m823m933m065k931k331k187j923j529j497
$$ 291295 288532 285410 282306 279015 275014 270191 265258 261193 258262 255931 253744 251821 250292 248795
52838B48795j785j725j141p30r91j488j589j301q60j81O96J201R23L03K1N6j7
$$ 248795 247010 245285 244144 243414 242423 240935 239346 238045 237185 237004 237700 238901 239824 240127 240148 240204 240187
52821B40187j30J01N89P73M16k11p47r09m55M64J159J119P39P99J374J867J937
$$ 240187 240057 240158 240747 241520 241936 241725 240978 240069 239614 240078 241237 242356 243095 243894 245268 247135 249072
52804B49072J715J232L62o30j139r82o06n10q25j429j982j939j131k13Jl84o39
$$ 249072 250787 252019 252381 251751 250612 249630 249024 248514 247689 246260 244278 242339 241208 240995 240996 240612 239973
52787B39973o14q44j410j637j173n38j62L54J447K683L250K913K084J202N73M14
$$ 239973 239359 238515 237105 235468 234295 233757 233595 233949 235396 238079 241329 244242 246326 247528 248101 248515
52771B48515O29P81O24L44Q2m07j163j640j412q65o38o34l52J50K09l98j089j158
$$ 248515 249144 249925 250549 250893 250975 250568 249405 247765 246353 245488 244850 244216 243864 244014 244223 243825 242736 241578
52753B41578m48P06J760K201J910J360J110J118J001Q82J356K441L159K641J263
$$ 241578 241130 241836 243596 245797 247707 249067 250177 251295 252296 253178 254534 256975 260134 262775 264038
52738B64038K08P7M45O98Q17J090J457J552J290J029J032J063P59J63l65o57p68
$$ 264038 264246 264323 264768 265466 266283 267373 268830 270382 271672 272701 273733 274796 275555 275718 275353 274696 273928
52721B73928o66k72R8j15r52j736j957j828j737j572j101n73k56K40J352K431
$$ 273928 273262 272990 273088 272973 272021 270285 268328 266500 264763 263191 262090 261517 261261 261501 262853 265284
52705B65284K183M64j266j644q58L4N78J012J339J191N31k13p37j080j239j042
$$ 265284 267467 267931 266665 265021 264163 264197 264775 265787 267126 268317 268848 268635 267898 266818 265579 264537
52689B64537n29n5J18L1j97m47m15J39Q31Q41J4p19m96K28K44p39j686j611p95
$$ 264537 264008 263953 264071 264102 263905 263458 263043 263182 264013 264854 264868 264149 263653 263881 264125 263386 261700 260089 259294
52670B59294k23l10n74m20J60O80O10j41r91r88K90K081L008K441J111K58L87
$$ 259294 259071 258761 258187 257767 257927 258607 259217 259076 258085 257097 257387 259468 262476 264917 266028 266286 266673
52653B66673J058J628J839J747J451J057Q10R16J233J312Q86J96l48p20j220j770
$$ 266673 267731 269359 271198 272945 274396 275453 276263 277179 278412 279724 280610 280806 280458 279738 278518 276748
52637B76748j743q58J29J83o27j160p47kK40J23L19Q29J035P54M47L28N3n01q41
$$ 276748 275005 274147 274276 274459 273832 272672 271925 271923 272163 272286 272605 273434 274469 275223 275670 275998 276051 275550 274709
52618B74709o49l86n73r20p21J11R46J245R86M49L2K15J143K146K186J015n06
$$ 274709 274060 273674 273101 272181 271460 271571 272517 273762 274748 275197 275229 275444 276587 278733 280919 281934 281428
52601B81428j392j520j380j283j159r38o72l95j30k7j56k47N0O20R29P23L99M96
$$ 281428 280036 278516 277136 275853 274694 273756 273084 272689 272559 272532 272376 272129 272179 272799 273728 274451 274850 275346
52583B75346J015J474J463J015M57J47K66O73R91R85Q24P58O39J37n98q96m33
$$ 275346 276361 277835 279298 280313 280770 280917 281183 281856 282847 283832 284656 285414 286053 286190 285592 284696 284263
52566B84263K39L46j57p47j191j700k274k423j812p95r0j41q61j664j704n76R84
$$ 284263 284502 284848 284691 283944 282753 281053 278779 276356 274544 273749 273659 273518 272657 270993 269289 268713 269697
52549B69697J544N61q94j345n85M10Q59P99N46K73J37J96J79k29p57q60o08o18
$$ 269697 271241 271802 270908 269563 268978 269388 270247 271046 271592 271865 272002 272198 272377 272148 271391 270531 269923 269305
52531B69305r57q85jJ093J698J912K114K143J739J236J146J296J205R95J168J644
$$ 269305 268348 267463 267462 268555 270253 272165 274279 276422 278161 279397 280543 281839 283044 284039 285207 286851
52515B86851J777J440J281J731K351K479K089J747J965K674L235K969J899Q00
$$ 286851 288628 290068 291349 293080 295431 297910 299999 301746 303711 306385 309620 312589 314488 315288
52501C15288J84m11j630l106l842l679l454l602l505k552j127p6K23j32r11j629
$$ 315288 315472 315061 313431 310325 306483 302804 299350 295748 292243 289691 288564 288488 288711 288579 287668 286039
52485B86039j620p68J91N66M89M29M29L76M88R17J214Q87K22r5O9L47P07J421
$$ 286039 284419 283651 283842 284408 284897 285326 285755 286131 286619 287536 288750 289637 289859 289764 289833 290180 290887 292308
52467B92308K289K638K179J342O99N37R42J758K429K444J947J433Q88o8j235j822
$$ 292308 294597 297235 299414 300756 301455 301992 302934 304692 307121 309565 311512 312945 313833 313765 312530 310708
52451C10708j616j443k064l188l954l926l242k230j268p10n81n93o49r26j317
$$ 310708 309092 307649 305585 302397 298443 294517 291275 289045 287777 287067 286486 285893 285244 284318 283001
52436B83001j340r33p01r75j176p79k84m14p90l46R59J931J773J089R17J408J950
$$ 283001 281661 280728 280027 279052 277876 277097 276813 276399 275609 275263 276222 278153 279926 281015 281932 283340 285290
52419B85290K079J798J249O32K68M24R92J567J831J788J713J977K778L975N272
$$ 285290 287369 289167 290416 291048 291316 291740 292732 294299 296130 297918 299631 301608 304386 308361 313633
52404C13633O479P494Q040P775O775N535M372L094J516r5j420k666m161n543n955
$$ 313633 320112 327606 335646 343421 350196 355731 360103 363197 364713 364618 363198 360532 356371 350828 344873
52389C44873n195m078l396k967k170j074m30n60q44n35L52J183J591J802K220
$$ 344873 339678 335600 332204 329237 327067 325993 325563 325003 324159 323624 323976 325159 326750 328552 330772
52374C30772K898L494L672L499L430L808M365M391L573K436J791J818J910J459
$$ 330772 333670 337164 340836 344335 347765 351573 355938 360329 363902 366338 368129 369947 371857 373316
52360C73316N08l38n08P3R29J409J151L20o10j154r98j79P99J323J333J358J724
$$ 373316 373824 373486 372978 373051 373980 375389 376540 376860 376250 375096 374098 373919 374718 376041 377374 378732 380456
52343C80456K034J954J956K644L579L743L122K875L665M815N587O323P626R146
$$ 380456 382490 384444 386400 389044 392623 396366 399488 402363 406028 410843 416430 422753 430379 439525
52329D39525J0142J0649J1216J1865J2275J2720J3745J5044J5750J5879J6405
$$ 439525 449667 460316 471532 483397 495672 508392 522137 537181 552931 568810 585215
52318E85215J7610J8444J8075J7121J6716J7036J7486J7782J8000J7937J7251
$$ 585215 602825 621269 639344 656465 673181 690217 707703 725485 743485 761422 778673
52307G78673J6230J5690J6008J6696J6995J6610J5784J4950J4329J3746J2820
$$ 778673 794903 810593 826601 843297 860292 876902 892686 907636 921965 935711 948531
52296I48531J1421R831Q382P089N691L921J643r14l042m119m409m842n719o258
$$ 948531 959952 969783 978165 985254 990945 994866 996509 995595 992553 988434 984025 979183 973464 967206
52282I67206n859n157n109n528n359m164k414m71J696L774N030N362N617O457
$$ 967206 961347 956190 951081 945553 940194 936030 933616 933145 934841 938615 943645 949007 954624 961081
52268I61081P557Q387R119J0203J1515J2551J3131J3370J3234J2734J2317J2437
$$ 961081 968638 977025 986144 996347 1007862 1020413 1033544 1046914 1060148 1072882 1085199 1097636
52256A097636J2834J2783J2155J1622J1732J2179J2299J1910J1296J0531R249
$$ 1097636 1110470 1123253 1135408 1147030 1158762 1170941 1183240 1195150 1206446 1216977 1226226
52245A226226P160M552K099J90j351k920m653o341p637q237q090p692p862q837
$$ 1226226 1233386 1237938 1240037 1240227 1238876 1235956 1231303 1224962 1217325 1209088 1200998 1193306 1185444 1176607
52231A176607r724r408p978o712o538p018p133o500n509m604l925l408k859k093
$$ 1176607 1166883 1157475 1149497 1142785 1136247 1129229 1122096 1115596 1110087 1105483 1101558 1098150 1095291 1093198
52217A093198j231o40k99L65J626K876L398L414L705M493N285N766O093O285O058
$$ 1093198 1091967 1091327 1091028 1091393 1093019 1095895 1099293 1102707 1106412 1110905 1116190 1121956 1128049 1134334 1140392
52202A140392N470N045N010M927M479M087M303M954N422N571N875O593P295P332
$$ 1140392 1145862 1150907 1155917 1160844 1165323 1169410 1173713 1178667 1184089 1189660 1195535 1202128 1209423 1216755
52188A216755O568N459M509L791L042K076R57k97j820l585n210o387p332q411
$$ 1216755 1223323 1228782 1233291 1237082 1240124 1242200 1243157 1242860 1241040 1237455 1232245 1225858 1218526 1210115
52174A210115r454r956r887r752r690r148p775o088m791l779k414o35Q08J305
$$ 1210115 1200661 1190705 1180818 1171066 1161376 1152228 1144453 1138365 1133574 1129795 1127381 1126746 1127554 1128859
52160A128859J102R18J147J643K111K401K480K275J670O62n72j736k462k350j271
$$ 1128859 1129961 1130879 1132026 1133669 1135780 1138181 1140661 1142936 1144606 1145268 1144696 1142960 1140498 1138148 1136877
52145A136877K26J137R75L66K55O61P59K43j36L10J143J450J168J126J916L327
$$ 1136877 1137103 1138240 1139215 1139581 1139836 1140497 1141256 1141499 1141363 1141673 1142816 1144266 1145434 1146560 1148476 1151803
52129A151803M937O653Q504J0387J2299J4538J7280K0061K2070K3032K3521K4242
$$ 1151803 1156740 1163393 1171897 1182284 1194583 1209121 1226401 1246462 1268532 1291564 1315085 1339327
52117A339327K5171K5705K5543K5007K4402K3497K2007K0274J8919J7952J6748
$$ 1339327 1364498 1390203 1415746 1440753 1465155 1488652 1510659 1530933 1549852 1567804 1584552
52106A584552J4978J2966J1133R587Q455P945P807P315O189N007M251L407J729
$$ 1584552 1599530 1612496 1623629 1633216 1641671 1649616 1657423 1664738 1670927 1675934 1680185 1683592 1685321
52093A685321n97k683m174n522p186r218j1573j4081j6112j6993j6890j6623j6393
$$ 1685321 1684724 1682041 1677867 1672345 1665159 1655941 1644368 1630287 1614175 1597182 1580292 1563669 1547276
52080A547276j5459j3371j0834q794p200n328k998p84R22K396M005N627O914P877
$$ 1547276 1531817 1518446 1507612 1498818 1491618 1486290 1483292 1482508 1483430 1485826 1489831 1495458 1502372 1510249
52066A510249Q869J0095J1367J2380J3072J3532J3620J2984J1609J0178R484R491
$$ 1510249 1519118 1529213 1540580 1552960 1566032 1579564 1593184 1606168 1617777 1627955 1637439 1646930
$$ [...]
##END NTUPLES=NMR SPECTRUM
##END=
