##TITLE=AC1502_INDRS13309_8125441_JUPnpALMwU
##JCAMPDX= 6.0         $$ Bruker NMR JCAMP-DX V2.0
##DATA TYPE= NMR SPECTRUM
##DATA CLASS= NTUPLES
##ORIGIN= BRUKER
##OWNER= Administrator
$$ 1.72 TOPSPIN		Version 2.1
$$ 2013-08-15 20:18:35.811 -0700  Administrator@X
$$ Compression mode = diff/dup
##.OBSERVE FREQUENCY= 400.02188249412
##.OBSERVE NUCLEUS= ^1H
##.ACQUISITION MODE= SIMULTANEOUS (DQD)
##.ACQUISITION SCHEME= undefined
##.AVERAGES= 8
##.DIGITISER RES= 22
##SPECTROMETER/DATA SYSTEM= spect
##.PULSE SEQUENCE= zg30
##.SOLVENT NAME= COFFEE_meoh
##.SHIFT REFERENCE= INTERNAL, COFFEE_meoh, 1, 14.98509
##AUDIT TRAIL= $$ (NUMBER, WHEN, WHO, WHERE, PROCESS, VERSION, WHAT)
$$ ##TITLE= Audit trail, TOPSPIN		Version 2.1
$$ ##JCAMPDX= 5.01
$$ ##ORIGIN= Bruker BioSpin GmbH
$$ ##OWNER= Administrator
$$ $$ E:\/data/COFFEE/nmr/AC1502_INDRS13309_8125441_JUPnpALMwU/10/pdata/1/auditp.txt
$$ ##AUDIT TRAIL=  $$ (NUMBER, WHEN, WHO, WHERE, PROCESS, VERSION, WHAT)
(   1,<2013-08-15 20:18:28.827 -0700>,<Administrator>,<X>,<go>,<TOPSPIN 2.1>,
      <created by zg
	started at 2013-08-15 20:17:23.030 -0700,
	POWCHK enabled, PULCHK disabled,
       configuration hash MD5:
       C8 4E 4E 5D D3 5C D8 9E 9F 52 82 E0 59 8A DE 15
       data hash MD5: 64K
       05 43 35 0A F7 A0 0C 70 4E 38 6E EB F2 93 48 85>)
(   2,<2013-08-15 20:18:31.717 -0700>,<Administrator>,<X>,<proc1d>,<TOPSPIN 2.1>,
      <Start of raw data processing
       efp LB = 0 FT_mod = 6 PKNL = 1 PHC0 = 0 PHC1 = 0 SI = 32K 
       data hash MD5: 32K
       96 4B D0 C3 27 2E 60 98 EB 3F 37 31 A0 B5 A8 6B>)
(   3,<2013-08-15 20:18:32.014 -0700>,<Administrator>,<X>,<proc1d>,<TOPSPIN 2.1>,
      <pk PHC0 = 98.37158 PHC1 = 0 
       data hash MD5: 32K
       DB 46 BA 25 F8 6D AE B9 AC 7D 80 E3 CE 52 25 C6>)
(   4,<2013-08-15 20:18:32.186 -0700>,<Administrator>,<X>,<proc1d>,<TOPSPIN 2.1>,
      <abs ABSG = 1 
       data hash MD5: 32K
       B9 A8 95 FA CC F7 E3 F2 B7 82 3F CD A5 C3 60 37>)
(   5,<2013-08-15 20:18:32.233 -0700>,<Administrator>,<X>,<proc1d>,<TOPSPIN 2.1>,
      <abs ABSG = 2 
       data hash MD5: 32K
       6D BE 8C BF 27 D7 B3 F5 4C 74 F0 F1 0C A4 75 A7>)
(   6,<2013-08-15 20:18:32.374 -0700>,<Administrator>,<X>,<proc1d>,<TOPSPIN 2.1>,
      <abs ABSG = 3 
       data hash MD5: 32K
       A0 9B 3A 4A B1 E8 E5 65 68 DC 7B AA B2 86 03 10>)
(   7,<2013-08-15 20:18:32.452 -0700>,<Administrator>,<X>,<proc1d>,<TOPSPIN 2.1>,
      <abs ABSG = 4 
       data hash MD5: 32K
       3C D5 ED 63 33 89 8F BC F7 F2 D1 6C 9D 98 D1 91>)
(   8,<2013-08-15 20:18:32.608 -0700>,<Administrator>,<X>,<proc1d>,<TOPSPIN 2.1>,
      <abs ABSG = 5 
       data hash MD5: 32K
       A4 BA 3D 91 71 D3 8D 20 8B 7F 44 1F 8B EE 85 A4>)
$$ ##END=
$$ 
$$ $$ hash MD5
$$ $$ A2 93 15 78 78 B8 24 83 8B F8 D1 03 C4 29 07 17
##$RELAX= 
##$RELAX= 
##$RELAX= 
##$RELAX= 
##$RELAX= 
##$RELAX= 
##$RELAX= 
$$ Bruker specific parameters
$$ --------------------------
##$DU= <E:\>
##$EXPNO= 10
##$NAME= <AC1502_INDRS13309_8125441_JUPnpALMwU>
$$ [...]
##$TP= (0..7)
150 150 150 150 150 150 150 150
##$TP07= 0
##$TPNAME0= <>
##$TPNAME1= <>
##$TPNAME2= <>
##$TPNAME3= <>
##$TPNAME4= <>
##$TPNAME5= <>
##$TPNAME6= <>
##$TPNAME7= <>
##$TPOAL= (0..7)
0.5 0.5 0.5 0.5 0.5 0.5 0.5 0.5
##$TPOFFS= (0..7)
0 0 0 0 0 0 0 0
##$TUNHIN= 0
##$TUNHOUT= 0
##$TUNXOUT= 0
##$USERA1= <user>
##$USERA2= <user>
##$USERA3= <user>
##$USERA4= <user>
##$USERA5= <user>
##$V9= 5
##$VALIST= <valist>
##$VCLIST= <CCCCCCCCCCCCCCC>
##$VD= 0
##$VDLIST= <DDDDDDDDDDDDDDD>
##$VPLIST= <PPPPPPPPPPPPPPP>
##$VTLIST= <TTTTTTTTTTTTTTT>
##$WBST= 1024
##$WBSW= 4
##$XGAIN= (0..3)
0 0 0 0
##$XL= 0
##$YL= 0
##$YMAX_a= 601575
##$YMIN_a= -513906
##$ZGOPTNS= <>
##$ZL1= 120
##$ZL2= 120
##$ZL3= 120
##$ZL4= 120
##$ABSF1= 14.98509
##$ABSF2= -5.573092
##$ABSG= 5
##$ABSL= 3
##$ALPHA= 0
##$AQORDER= 0
##$ASSFAC= 0
##$ASSFACI= 0
##$ASSFACX= 0
##$ASSWID= 0
##$AUNMP= <proc_prof1d_extract_pilot.lims>
##$AXLEFT= 0
##$AXNAME= <>
##$AXNUC= <1H>
##$AXRIGHT= 0
##$AXTYPE= 0
##$AXUNIT= <>
##$AZFE= 0.1
##$AZFW= 0.1
##$BCFW= 0
##$BC_mod= 0
##$BYTORDP= 0
##$COROFFS= 0
##$CY= 15
##$DATMOD= 1
##$DC= 0
##$DFILT= <>
##$DTYPP= 0
##$F1P= 0
##$F2P= 0
##$FCOR= 0.5
##$FTSIZE= 32768
##$FT_mod= 6
##$GAMMA= 0
##$GB= 0
##$INTBC= 1
##$INTSCL= 1
##$ISEN= 128
##$LB= 0
##$LEV0= 0
##$LPBIN= 0
##$MAXI= 10000
##$MC2= 0
##$MEAN= 0
##$ME_mod= 0
##$MI= 0
##$NCOEF= 0
##$NC_proc= -8
##$NLEV= 6
##$NOISF1= 0
##$NOISF2= 0
##$NSP= 0
##$NTH_PI= 0
##$NZP= 0
##$OFFSET= 14.98509
##$PC= 1
##$PHC0= 98.37158
##$PHC1= 0
##$PH_mod= 1
##$PKNL= yes
##$PPARMOD= 0
##$PPDIAG= 0
##$PPIPTYP= 0
##$PPMPNUM= 2147483647
##$PPRESOL= 1
##$PSCAL= 4
##$PSIGN= 0
##$PYNMP= <proc.py>
##$REVERSE= no
##$SF= 400.02
##$SI= 32768
##$SIGF1= 0
##$SIGF2= 0
##$SINO= 400
##$SIOLD= 32768
##$SPECTYP= <>
##$SREGLST= <1H.CDCl3>
##$SSB= 0
##$STSI= 32768
##$STSR= 0
##$SW_p= 8223.68421052631
##$SYMM= 0
##$S_DEV= 0
##$TDeff= 65536
##$TDoff= 0
##$TI= <>
##$TILT= no
##$TM1= 0
##$TM2= 0
##$TOPLEV= 0
##$USERP1= <user>
##$USERP2= <user>
##$USERP3= <user>
##$USERP4= <user>
##$USERP5= <user>
##$WDW= 1
##$XDIM= 32768
##$YMAX_p= 450603780
##$YMIN_p= -809105
##$CURPLOT= <Network HP LaserJet P1505>
##$CURPRIN= <$Network HP LaserJet P1505>
##$DFORMAT= <normdp>
##$LAYOUT= <+/1D_H.xwp>
##$LFORMAT= <normlp>
##$PFORMAT= <normpl>
##$SURQMSG= 1
$$ End of Bruker specific parameters
$$ ---------------------------------
##NTUPLES= NMR SPECTRUM
##VAR_NAME=  FREQUENCY,     SPECTRUM/REAL,   SPECTRUM/IMAG
##SYMBOL=    X,             R,               I
##VAR_TYPE=  INDEPENDENT,   DEPENDENT,       DEPENDENT
##VAR_FORM=  AFFN,          ASDF,            ASDF
##VAR_DIM=   32768,         32768,           32768
##UNITS=     HZ,            ARBITRARY UNITS, ARBITRARY UNITS
##FACTOR=    0.250966925370066, 1,           1
##FIRST=     8223.43324360094, 42848,        -3336
##LAST=      0,             -32238,          -209450
##MIN=       0,             -809105,         0
##MAX=       8223.43324360094, 450603780,    0
$$ Real data points
##PAGE= N=1
##DATA TABLE= (X++(R..R)), XYDATA
$$ [...]
$$ plain form
19592 -87649 -6930 27841 -22759 -396586 -297845 -150267 32085 3129 -325944 -230957 72360
19580 297333 71029 -27286 -118680 -45116 -73877 -310635 111023 -255329 -507948 -62629 -297177
19569 -297177 -285131 61821 50318 -260752 -343524 -151648 -31642 14268 -43056 -5679 -271120
19558 -271120 275504 -115973 42585 -278379 206918 275642 27600 -99009 -109601 -281123
19548 -281123 -145847 344385 -211426 327601 48579 -336709 181220 278893 65862 -118952
19537 152267 313707 39424 36393 71281 -77776 176288 116321 -309316 -303592 -311706 -81022
19525 41670 148205 -71747 -256365 525811 79875 122798 -361529 -59033 238629 -338750
19514 152404 80413 -40687 -25418 713 -58808 205718 -208507 -9008 -30466 -142680 -87424
$$ packed form
19592h7649f930B7841b2759l73827R8741J47578C2085C129c25944R4987G2360
19580B97333G1029b7286r1394d5116k8761k36758A11023b55329k52619f2629k34548
19569b97177J2046F1821j1503b60752q2772a51648c1642A4268d3056e679k65441
19558b71120B75504a15973D2585b78379B06918O8724B7600i9009j0592j71522
19548b81123J35276C44385b11426C27601D8579c36709A81220R7673F5862a18952
19537A52267J61440C9424l031L4888g7776A76288n9967c09316N724q114h1022
19525D1670J06535g1747j84618E25811G9875M2923c61529e9033B38629c38750
19514A52404p1991d0687J5269G13e8808B05718b08507i008k1458j12214N5256
$$ plain form
19503 -87424 238087 -196433 155177 -254547 -134586 -366725 223946 -35164 333035 -18870
19492 -36515 112819 -209461 58720 556843 41062 -276964 48960 -55051 197208 -185290
19481 88262 -33069 61874 -44558 -45970 -81557 -147535 116459 117824 72164 -76386 -132371 -247118
19469 -247118 77831 116171 -240932 15676 -209735 -444850 -103862 -291908 14832 -156409
19458 -71758 -183891 -102329 -68748 -193024 -18626 -323237 -14346 -68385 81769 84657 133384
19447 133384 7339 27912 -145901 331041 118040 -45288 -90024 -166893 -50087 -118871 -55202
19435 -59053 -221036 281510 -99847 -29985 -149921 -10707 -9281 -100154 -135326 -83695 180553
19423 -496544 -300215 -97219 -73555 -253176 37071 -40803 -53167 -67866 -216742 -255769 96335
$$ packed form
19503h7424B38087a96433A55177b54547J19961k32139B23946c5164C33035a8870
19492c6515A12819b09461E8720M98123D1062b76964D8960e5051A97208a85290
19481H8262c3069F1874d4558j412l5587o5978A16459J365m5660g6386n5985j14747
19469b47118G7831L8340b40932A5676b09735k35115a03862j88046A4832a56409
19458g1758j12133Q1562L3581j24276a8626l04611a4346n4039H1769K888M8727
19447A33384G339K0573a45901C31041A18040d5288m4736p6869e0087o8784e5202
19435e9053j61983B81510i9847b9985j19936a0707J426r0873l5172N1631A80553
19423d96544J96329i7219K3664j79621C7071d0803j2364j4699j48876l9027I6335
$$ plain form
19411 -213076 -79820 -124123 -303714 -316815 -98880 -305791 -92917 -107074 -349720 -363995 5939
19399 35984 -353992 209390 -281120 26047 -172808 114697 43833 -160464 -369310 -149332
19388 -190601 55281 -141201 -237413 -208294 -95390 93068 29051 -47721 283664 135237 78568
19377 78568 123748 57307 -65577 352284 24422 -149421 45815 74814 -284257 -76873 -37316
19365 -158417 -94513 132676 90231 -408055 54522 -117090 -27226 -133291 -72577 -207685
19355 -207685 -404367 -149264 -55590 -91558 -47297 82477 34561 -175607 -389319 125174
19344 -165607 12527 384112 11126 -256816 249303 -159674 -75754 -116218 -7445 176920 -8814
19332 -83466 -92338 -67795 -166162 -46827 219944 73842 85147 -29660 -151494 54790 245397
$$ packed form
19411b13076g9820m4303j79591j3101i8880k06911i2917j4157k42646j4275E939
19399C5984c53992B09390b81120B6047a72808A14697D3833a60464k08846a49332
19388a90601E5281a41201r6212K9119i5390I3068B9051d7721B83664A35237n6669
19377G8568M5180E7307f5577C52284B4422a49421D5815K8999b84257g6873c7316
19365a58417O3904A32676m2445d08055E4522a17090b7226j06065O0714j35108
19355b07685j96682a49264e5590l5968M4261H2477C4561a75607k13712A25174
19344a65607A2527L71585A1126b56816B49303a59674g5754m0464g445A76920h814
19332h3466q872K4543r8367d6827B19944G3842J1305b9660j21834E4790J90607
$$ plain form
19321 245397 -182945 -280618 -253212 -225901 151435 -38485 98005 -117698 44056 -216184 -182275
19310 -182275 -121022 -239111 -195802 29142 213827 -289870 -40050 16839 -67825 19927 -129104
19298 33187 120363 -102146 -343370 -350642 -189073 -41241 -48155 -361048 -75284 -34667 245383
19286 108358 186251 -97842 197863 -172174 72351 121128 130535 -148305 -178835 86856 181992
19275 181992 -43009 -62459 272053 97001 -189805 -123967 184200 -13718 -135651 314595
19264 -85350 -25536 93562 31178 -124688 -41322 -76509 65813 310247 -164345 -167569 135242
19252 -109381 140555 -160644 -22388 200887 357175 135479 -82143 101361 -256928 -21006
19241 254362 -97941 20568 -279517 -70722 86181 -26939 -245460 -107749 -152714 -132484 -186065
$$ packed form
19321B45397a82945r7673K7406K7311A51435c8485I8005a17698D4056b16184L3909
19310a82275O1253j18089M3309B9142J84685b89870d0050A6839f7825A9927a29104
19298C3187Q7176a02146k41224p272J61569d1241o914l12893g5284c4667B45383
19286A08358P7893i7842A97863a72174G2351M8777R407a48305l0530H6856R5136
19275A81992d3009j9450B72053I7001a89805O5838A84200a3718j21933C14595
19264h5350b5536I3562C1178a24688d1322l5187F5813K44434a64345l224A35242
19252a09381A40555a60644b2388B00887J56288A35479h2143A01361b56928b1006
19241B54362i7941B0568b79517g0722H6181b6939k18521a07749m4965K0230n3581
$$ plain form
19230 -186065 32433 40715 379692 6123 -342342 -15034 -368416 -50602 52637 -121598 -231615
19219 -231615 189927 -104943 97068 -2705 -29484 -49831 -39637 -46573 -6652 299649 14330
19207 -83431 76113 -158828 -197390 247327 -92557 -39047 -93972 -121774 -159598 -95737 61825
19195 177150 85895 -92836 -34620 191568 -76367 68522 37300 -181666 30352 -55173 21050
19183 -284990 31376 -220379 -67863 -71193 -38914 -96678 83815 83275 -107644 9611 -60285 47324
19170 40663 -198731 -73802 -136641 -82815 -37520 69901 48937 -128104 -121974 203020 -223243
19158 -266033 165536 -92843 -16663 -170794 87868 70809 -379293 -195917 -377754 125950
19147 59943 -146820 -271087 61458 423333 -112604 -74460 371529 102112 105621 229429
$$ packed form
19230a86065C2433Q282L38977F123c42342a5034l53382e0602E2637a21598j10017
19219b31615A89927a04943I7068b705k6779k0347J0194o936f652B99649A4330
19207h3431G6113a58828l8562B47327i2557c9047n4925k7802l7824O3861F1825
19195A77150H5895i2836c4620A91568g6367F8522l1222a81666C0352e5173B1050
19183b84990C1376b20379f7863l330L2279n7764H3815n40a07644I611f0285D7324
19170D0663a98731g3802o2839N3826c7520F9901k0964a28104O130B03020b23243
19158b66033A65536i2843a6663j54131H7868j7059c79293J83376j81837A25950
19147E9943a46820j24267F1458L61875a12604L8144C71529A02112L509J23808
$$ plain form
19137 229429 -316702 101128 175081 -115209 -100037 16825 -198168 -394811 -54259 -124008
19127 -124008 -279615 -456398 96267 -28485 -357570 -42259 10305 86938 -37664 -98178 -211699
19116 -211699 170221 810 -151213 357688 -30797 5981 83283 -20197 67738 -184208 -81332
19104 207429 -247858 231138 -65020 -246008 191421 -197004 -209196 383783 186086 -367980
19093 251626 -360194 18249 -194684 -491349 49861 -163681 279462 -55083 115074 -178903
19082 -29726 193798 -238664 -412217 -233569 41211 -364271 219049 493 27268 -70218 74814
19070 -40676 184786 358300 -145555 24502 101201 -183411 -168193 -20878 170926 -131478
19059 -104875 190534 -262290 -130180 -196478 117394 -334355 21298 -12245 -80638 147914
$$ packed form
19137B29429c16702A01128P3953a15209J5172A6825a98168j96643e4259o9749
19127a24008j55607j76783I6267b8485l29085d2259A0305P6633c7664o0514j13521
19116b11699A70221H10a51213C57688c0797E981P7302b0197F7738a84208h1332
19104B07429b47858B31138f5020j80988A91421a97004j2192C83783A86086c67980
19093B51626c60194A8249a94684k96665D9861a63681B79462e5083A15074a78903
19082b9726A93798b38664j73553J78648D1211c64271B19049D93K6775g0218G4814
19070d0676A84786J73514a45555B4502P6699a83411J5218b0878A70926a31478
19059a04875A90534b62290a30180o6298A17394c34355B1298a2245o8393A47914
$$ plain form
19048 -407728 -166189 -195779 103153 306963 6581 203492 208111 109219 -14521 -369107 10745
19036 -28683 152199 59664 -322829 -245562 -153966 -234165 -95749 -101470 -450049 84920 7801
19024 -201754 -66536 102375 124784 -166696 51362 -56932 6056 -374122 70785 -6883 145039
19012 144935 -51118 -218366 -301921 99249 -193665 26997 148835 56378 -63714 91747 -94571
19000 106745 44780 -47274 22876 85340 -428857 -4359 -207263 -717 -119803 13473 52542
18989 52542 -168686 -302495 10985 -125915 109758 -201593 83480 12988 433387 11526
18978 332409 -80793 -33959 98018 -105500 40379 10976 27102 -150445 -127838 8017 -275295
18966 65869 103678 -66054 200191 157562 -33794 135986 -182105 -220354 43676 -170379 8229
$$ packed form
19048d07728a66189k9590A03153K03810F581J96911M619r8892a4521l54586A0745
19036b8683A52199E9664c22829P7267R1596q0199i5749n721l48579H4920G801
19024b01754f6536A02375K2409a66696E1362e6932F056c74122G0785f883A45039
19012A44935e1118j67248q3555I9249a93665B6997J21838E6378f3714I1747i4571
19000A06745D4780d7274B2876O2464d28857d359k02904g17j19086A3473L9069
18989E2542a68686j33809A0985a25915A09758b01593H3480A2988M20399A1526
18978C32409h0793c3959I8018a05500D0379A0976J6126a50445K2607H017b75295
18966F5869L7809f6054B00191m2629c3794A35986a82105l8249D3676a70379H229
$$ plain form
18954 -199080 -15526 -7323 241378 -185776 -145330 -189526 -247078 -322277 136229 144070 -161175
18942 361869 -188271 -80647 -36638 -83031 -113125 -77995 15385 47223 155172 113145 106444
18931 106444 104513 -160231 -198069 -333415 -8362 139807 -160129 -66420 165019 -126107 -147111
18920 -147111 -59179 56307 -139341 -325001 -201690 -230471 244444 -235209 239336 -114244
18909 16898 -285684 -137853 31840 136301 -6318 256685 93446 -42988 -131237 -33970 37893
18897 -57545 -80648 161809 -470668 -57451 -81640 213651 -96456 68034 144670 -509 5179 93879
18885 93879 412909 360977 -156605 -191385 -6857 104428 -129259 269627 220408 99626 97782
18874 97782 -173533 -195480 -171423 -22086 -300213 -349989 35552 171848 108661 -240123 56129
$$ packed form
18954a99080a5526g323B41378a85776M0446m4196n7552p5199A36229P841a61175
18942C61869a88271h0647c6638m6393l0094L5130A5385L1838J07949m2027o701
18931A06444j931a60231l7838j35346h362A39807a60129f6420A65019a26107k1004
18920a47111e9179E6307a39341j85660J23311k8781B44444b35209B39336a14244
18909A6898b85684a37853C1840J04461f318B56685I3446d2988q8249c3970C7893
18897e7545k3103A61809d70668e7451k4189B13651i6456F8034P6636e09E179Q8700
18885I3879L19030n1932a56605l4780f857A04428a29259B69627m9219I9626j844
18874I7782a73533k1947K4057b2086k78127m9776C5552J36296o3187b40123E6129
$$ plain form
18862 -181360 -33914 -298938 -45892 302088 -89834 -16290 -126359 -226035 415886 -98215 108857
18850 185701 -178924 -158857 -260116 144139 -241169 -44181 -23673 -21614 -372806 -353643 12136
18838 -117376 -7916 -270284 317336 -31415 255749 -43242 -25610 125804 142186 -253067 -212376
18827 -212376 -343704 195114 -155113 204491 -67582 131984 163254 178 151153 184477 87187
18815 -210756 89489 265628 -266830 39219 121203 -51935 253495 153947 -121705 -21060 -140862
18804 -140862 9180 -195512 -256402 242663 -79768 -20731 -29713 -216046 102944 -145479 48115
18792 -184701 -142580 -149415 -105195 -41234 -274778 -141945 -226825 -75293 -68766 -89440 184168
18780 -269148 -262848 118045 30259 -175759 -119345 -43417 -180095 79905 -163855 -181900 -207473
$$ packed form
18862a81360c3914k65024d5892C02088h9834a6290j10069r9676D15886i8215A08857
18850A85701a78924K0067j01259A44139b41169d4181K0508K059l51192J9163A2136
18838a17376g916k62368C17336c1415B55749d3242J7632A25804J6382b53067M0691
18827b12376j31328A95114a55113B04491f7582A31984L1270A78J50975L3324H7187
18815b10756H9489J76139b66830C9219Q1984e1935B53495r9548a21705b1060j19802
18804a40862I180a95512o0890B42663g9768b0731q982j86333A02944a45479D8115
18792a84701M2121o835M4220d1234k33544J32833q4880g5293O527k0674A84168
18780b69148O300A18045C0259a75759N6414d3417j36678G9905a63855j8045k5573
$$ plain form
18769 -207473 -129401 -94861 -70566 -60130 12584 26665 36510 -99564 68663 79190 -302589
18757 -313399 -27316 -19424 -372864 65219 63407 -114461 36026 -24538 -446515 -84115 121303
18745 -242160 -23850 -261994 2064 -400303 -104921 -42904 217808 -174355 -151422 -265213
18735 -265213 55975 -145341 134648 89676 -103732 11376 -420796 -1880 -62710 4818 -82181
18723 278577 56542 609605 21877 -263393 -219471 182171 242329 -46 -90543 -123733 48104
18711 -66864 -86882 -349945 -139658 232777 279011 -22609 -174009 13858 -324005 -68562 51741
18699 -442675 135124 -61731 58864 153304 35259 -19709 -53121 69033 205844 87059 19320
18687 -155409 -17334 28755 -31673 -84188 118487 255687 -175849 96428 -100663 209235
$$ packed form
18769b07473P8072L4540K4295J0436A2584J4081R845i9564F8663J0527c02589
18757c13399b7316P892l53440F5219j812a14461C6026b4538m21977h4115A21303
18745b42160b3850k38144B064d00303a04921d2904B17808a74355K2933j13791
18735b65213E5975a45341A34648m4972a03732A1376d20796a880o0830D818h2181
18723B78577E6542N53063B1877b63393M3922A82171O0158d6r0497l3190D8104
18711f6864k0018k63063a39658B32777M6234b2609j51400A3858c24005f8562E1741
18699d42675A35124f1731E8864R4440C5259a9709l3412F9033J36811H7059A9320
18687a55409a7334B8755c1673n2515A18487J37200a75849I6428a00663B09235
$$ plain form
18676 -52230 -315849 28164 156489 -69748 67635 348774 -257457 -31510 -158372 -2241 116457
18664 -318176 -207549 143428 224565 91953 8818 -169783 -167719 229218 -26440 34083 -126402
18652 -176395 -395493 74088 -392678 9720 47767 -45027 -28001 -192743 -377226 -227025 -44972
18640 254872 12163 -49222 -284984 -320462 -241854 -20041 -31383 -102834 1276 -173275 -19009
18628 -230230 -169940 -177724 -105286 -108129 224398 -235131 -12330 6108 -68964 -485645 8724 -81630
18615 10931 78461 -10128 -105579 296792 -570648 -359037 -7128 -27936 311402 -155896 86632
18603 190913 -50488 221114 -252328 199562 -229288 -77018 -319574 -306307 -169640 172140
18592 -421772 79443 -291781 -121485 -134958 -229671 5448 -80890 -145057 -40107 125611 -2051
$$ packed form
18676e2230k63619B8164J28325f9748F7635K81139b57457c1510j26862b241A16457
18664c18176J10627A43428Q1137I1953H818a69783K064B29218b6440C4083a26402
18652a76395k19098G4088c92678I720L8047d5027J7026j64742j84483J50201d4972
18640B54872A2163d9222k35762l5478P8608b0041j1342p1451A276a73275a9009
18628b30230O0290p784P2438k843B24398b35131a2330F108f8964m16681H724h1630
18615A0931O7530a0128r5451B96792e70648K11611g128k0808C11402a55896H6632
18603A90913e0488B21114b52328A99562b29288g7018k42556J3267J36667A72140
18592d21772G9443b91781a21485j3473r4713E448h0890o4167d0107A25611b051
$$ plain form
18580 10357 76481 -66782 321916 -165416 19988 -42618 -251135 -31780 114118 -169242 67217
18568 -175690 53372 -82315 -288519 6505 69180 131667 -48272 -118490 -74414 306508 -12030
18556 174368 81683 197226 44973 -107841 -135733 -25267 -93720 55881 370300 -160841 296347
18544 -171480 -368058 237020 58476 -62660 170994 147599 -53282 -31715 -56744 78946 -31760
18532 -337736 -75838 178041 79562 -155740 123348 -210170 24524 -138197 18104 169039
18522 169039 16450 -216220 -20874 836 -189213 201972 4603 284227 -149146 -179106 -149039
18511 -149039 -136282 -79769 -65818 -138432 148636 -302002 123249 -304488 -85158 -147674 -350720
18500 -350720 30535 -188251 -189993 -85767 113477 -234207 -47288 -24925 -67195 77553 -18213
$$ packed form
18580A0357O6124f6782C21916a65416A9988d2618k08517c1780A14118a69242F7217
18568a75690E3372h2315k06204F505O2675O2487d8272p0218M4076C06508a2030
18556A74368H1683J15543D4973a07841k7892b5267o8453E5881L14419a60841B96347
18544a71480j96578B37020E8476f2660A70994k3395e3282K1567k5029G8946c1760
18532c37736g5838A78041G9562a55740A23348b10170B4524a38197A8104J50935
18522A69039A6450b16220b0874H36a89213B01972D603K79624a49146k9960L0067
18511a49039J2757N6513J3951p2614A48636c02002A23249c04488h5158o2516k03046
18500c50720C0535a88251j742h5767A13477b34207d7288K2363m2270G7553a8213
$$ plain form
18488 -24378 -352665 16067 175424 -283570 -183254 -202583 -185752 -16454 5275 59564 3546
18476 -126182 325735 -167703 158451 -141447 -125681 26593 -131178 -147236 7809 -177566
18465 208575 111597 -11978 135083 -453316 5119 99401 -28470 -8024 -232891 -112809 -172346
18454 -172346 -11269 -55750 -109731 -293567 81554 -78150 247421 44140 131610 -115724 -15548
18442 -34108 334478 23553 -3909 41897 -381872 -28110 53004 64013 -21969 -188020 -8221
18430 200276 -471979 228698 -170651 -65341 -208345 -36218 -174305 -42619 -178104 42134
18419 74513 36076 50785 -297453 1486 70762 32030 42389 211706 -188856 31658 -190912
18407 -36331 -61041 -210762 -5338 -10112 203712 -70247 177670 165856 -263136 -72993 -20649
$$ packed form
18488b4378l28287A6067J59357b83570J00316j9329J6831a6454E275N4289C546
18476a26182C25735a67703A58451a41447J5766B6593a31178j6058G809a77566
18465B08575r6978a1978A35083d53316E119R4282b8470h024k24867a12809n9537
18454a72346a1269m4481n3981j83836H1554g8150B47421D4140Q7470a15724a5548
18442c4108C34478B3553c909D1897c81872b8110E3004J1009b1969j66051h221
18430B00276d71979B28698a70651f5341j43004c6218j38087d2619j35485D2134
18419G4513C6076J4709b97453A486O9276C2030J0359J69317a88856C1658a90912
18407c6331k4710j49721e338m774B03712g0247A77670j1814b63136g2993b0649
$$ plain form
18395 -121405 141416 -231858 299295 11732 -142825 -32349 -209494 164364 -391845 -240764
18385 -240764 -10206 86550 168642 44138 217577 -118162 -44086 -57351 129634 20599 84761
18374 84761 -100931 156877 -186232 198783 -240574 139556 327969 -191412 -37350 49792
18363 113843 -86991 -253506 -212249 60527 -51086 125714 -147335 69015 -382656 134615
18352 212527 222507 316486 103982 -57317 -327685 -178290 87866 -335285 -50128 -107585 -234527
18341 -234527 -48563 1051 -94649 -105950 -290901 129963 -42656 65802 -162896 -271936 -58171
18329 161008 -232072 280657 40069 -142167 111476 204751 162697 -300760 27715 -6724 108928
18317 -14546 22678 200519 -318878 -100300 121047 -25901 -197372 -56470 34627 -92140 -155323
$$ packed form
18395a21405A41416b31858B99295A1732a42825c2349j77145A64364c91845J51081
18385b40764a0206H6550Q2092D4138J73439a18162d4086j3265A29634B0599O4162
18374H4761a00931A56877a86232A98783b40574A39556J88413a91412c7350D9792
18363A13843h6991j66515M1257F0527e1086A25714a47335F9015c82656A34615
18352B12527R980R3979A03982e7317k70368J49395H7866c35285e0128n7457j26942
18341b34527d8563A051i4649j1301j84951A29963d2656F5802a62896j09040e8171
18329A61008b32072B80657D0069a42167A11476R3275m2054c00760B7715f724A08928
18317a4546B2678J77841c18878a00300A21047b5901j71471e6470C4627i2140o3183
$$ plain form
18306 -155323 -259035 679 -143644 31153 -161181 -44743 23067 189226 15963 48622 -106947
18294 -323208 43336 -9835 -153645 -183400 -75198 24117 -320892 -241722 -50440 -62158 -308210
18283 -308210 150923 80250 -138388 -124809 137934 253268 -152118 37498 -87605 190562
18272 -85573 -180550 -218012 -99454 146978 57177 -257197 49399 39889 -110573 -8682 130643
18260 -220148 24506 52294 -535252 -146259 -389928 -187696 -129662 33169 -31771 83819 -159273
18248 120537 4724 -43035 49448 -353288 -51623 -286193 266496 -176573 -34263 -167793 412858
18236 -161766 -213793 -80528 -312012 -172541 -14808 -126465 113091 104937 -111762 117881
18225 -353213 220173 80755 -97077 128679 -28768 318321 -196373 188648 -67692 116234
$$ packed form
18306a55323j03712F79a43644C1153a61181d4743B3067J66159A5963L2659a06947
18294c23208D3336i835j43810k9755g5198B4117c20892P9170e0440j1718k46052
18283c08210A50923p0673a38388J3579A37934J15334a52118C7498h7605A90562
18272h5573r4977l7462i9454A46978E7177b57197D9399r510a10573h682A30643
18260b20148B4506K7788e35252a46259k43669a87696N8034C3169c1771H3819a59273
18248A20537D724d3035D9448c53288e1623k34570B66496a76573c4263j33530D12858
18236a61766n2027h0528k31484J39471a4808j11657A13091q154a11762A17881
18225c53213B20173H0755i7077A28679b8768C18321a96373A88648f7692A16234
$$ plain form
18214 36702 -273339 1302 -5317 -42319 -121549 -7152 -399108 79361 145873 155277 245807 201405
18202 201405 -135954 -146216 154086 172638 -32952 -116393 -60571 8451 146992 -219655 50534
18190 -126504 -239647 87571 163684 -56547 107458 -85229 -224049 -44679 130803 22735 38697
18179 38697 73225 77936 -100672 53169 239204 256155 -334291 128709 106818 132813 80148
18168 80148 -252195 -201372 -244003 -120269 -102679 239894 -152543 -59067 -148963 91203 -37600
18156 192890 219278 11585 -184949 12451 44235 -401255 38562 -459819 20533 26876 -153495
18144 219835 26121 127380 -219511 -48975 -151156 33364 -19632 -110361 -213817 22294 -131547
18132 31759 -96215 127354 -56655 10516 218490 -198190 -64042 16254 276834 149949 -201932
$$ packed form
18214C6702b73339A302e317l7002p9230g152l91956G9361O6512R404R0530m4402
18202B01405a35954j0262A54086J8552c2952q3441N5822H451J38541b19655E0534
18190a26504j13143H7571P6113e6547A07458h5229j38820d4679A30803B2735J5962
18179C8697L4528M711a00672E3169J86035J6951c34291A28709k1891K5995n2665
18168H0148b52195N0823m2631a20269J7590B39894a52543e9067q9896I1203c7600
18156A92890K6388A1585a84949A2451L1784d01255C8562d59819B0533O343a53495
18144B19835B6121J01259b19511d8975j02181C3364a9632r0729j03456B2294a31547
18132C1759i6215A27354e6655A0516K07974a98190f4042A6254K60580j26885b01932
$$ plain form
18120 4588 -199931 32332 -106615 -39948 380684 -262534 134600 163914 173365 135622 66005
18108 -144099 88945 -229616 -69148 -127528 -144960 134912 -609 150627 197245 -41792 -137651
18097 -137651 92403 63797 -208065 -63286 169290 118450 -153959 -123087 -53662 -51045 97870
18085 -78398 58182 -103697 215738 79524 -78186 11421 -89354 -288069 -57416 -226656 205541
18073 156373 -334641 158923 65188 237036 -65535 289077 93381 -32311 -172779 57283
18062 71439 -31318 -116672 -131910 -228720 -133760 64797 180845 1608 -320979 -270759 90951
18050 73436 -44325 105433 -117678 261576 -166128 59963 277519 4431 43418 27805 63830
18039 63830 89922 -167513 -254670 -147562 -153486 422123 85528 12617 26125 -217528 57760
$$ packed form
18120D588a99931C2332a06615c9948C80684b62534A34600K9314R451l7743F6005
18108a44099H8945b29616f9148n8380j7432A34912f09A50627M6618d1792r5859
18097a37651I2403k8606b08065f3286A69290n0840a53959L0872e3662K617I7870
18085g8398E8182a03697B15738G9524g8186A1421h9354j98715e7416j69240B05541
18073A56373c34641A58923F5188J71848f5535B89077I3381c2311j40468E7283
18062G1439c1318q5354j5238r6810R4960F4797J16048A608c20979N0220I0951
18050G3436d4325A05433a17678B61576a66128E9963K17556D431L8987j5613L6025
18039F3830K6092a67513q7157J07108n924D22123H5528A2617J3508b17528E7760
$$ plain form
18027 200025 -40152 357971 23152 322037 10728 -198282 196450 -299752 39626 -269770
18016 -8390 -106150 -134817 -102433 127270 -292975 -283683 168114 -78507 251322 62456 -188541
18004 -182968 -71263 -265209 166563 -42143 -179287 -79148 70431 28623 222900 -225532
17993 41433 -66125 -131858 -136654 142180 -83567 278473 136206 -89626 -149363 -86576 222066
17981 -186207 -267645 -520229 -7353 46244 84715 -111537 349118 -189118 158024 -158099
17970 -398722 -518674 4113 152089 -61741 -215311 -183977 7437 -128264 75534 -95038 130695
17958 -43183 46338 31014 120851 46538 -40263 88203 99085 -360372 96836 -91339 -15020
17946 90987 -290527 -63854 23898 -158681 11927 -216211 5113 170942 -203566 -491445 -28821
$$ packed form
18027B00025d0152C57971B3152K98885A0728a98282A96450b99752C9626b69770
18016h390r7760k8667L2384A27270b92975R292A68114g8507B51322F2456a88541
18004a82968g1263j93946A66563d2143j37144g9148G0431B8623J94277b25532
17993D1433f6125o5733m796A42180h3567B78473A36206h9626n9737O2787B22066
17981a86207q1438k52584g353D6244L8471a11537C49118a89118A58024a58099
17970c98722j19952D113J47976f1741j53570L1334G437a28264G5534i5038A30695
17958d3183D6338j5324Q9837D6538d0263H8203J0882c60372I6836i1339a5020
17946I0987b90527f3854B3898a58681A1927b16211E113J65829b03566k87879b8821
$$ plain form
17934 44002 -78427 -179324 -49804 67517 280145 161733 722 -10648 235650 136210 -19688
17922 -171603 271506 -57353 -60916 -30836 -180697 -25269 230849 11403 -25081 208364 123977
17911 123977 -190782 -470450 -164318 -94660 -1665 31708 -76754 136861 1000 19390 67454
17900 67454 -225149 55460 -69207 -10011 -209236 -161504 -185954 -118110 -60569 38854 -91055
17888 187920 25798 -176452 172851 223541 -157310 39175 -224312 215354 -122380 11970
17877 -22990 110128 289961 186235 -157115 -167905 -14450 -271664 -238663 -114499 19652
17866 446079 19509 26257 234596 6325 49547 11113 72934 -97577 137576 -276695 128351
17854 34521 153747 91697 -178826 310681 -145994 -64044 -248762 -114924 -92486 -145587
$$ packed form
17934D4002g8427j00897d9804F7517K12628j18412G22a0648B35650r9440a9688
17922a71603B71506e7353l563L0080j49861b5269B30849A1403b5081B08364q4387
17911A23977a90782k79668a64318O9658a665C1708g6754A36861A000J8390M8064
17900F7454b25149E5460f9207a0011j99225M7732k4450O7844N7541C8854i1055
17888A87920B5798a76452A72851N0690a57310C9175b24312B15354a22380A1970
17877b2990A10128J79833j03726a57115j0790a4450k57214L3001a14499A9652
17866D46079A9509O748K08339F325M3222A1113O1821i7577A37576b76695A28351
17854C4521J19226o2050a78826C10681a45994f4044j84718a14924K2438n3101
$$ plain form
17844 -145587 24029 -186101 -13868 164799 -248701 -93528 -1480 64979 -114515 215518 -184303
17832 -39702 123120 185974 -28562 -130577 -23434 -176126 -114350 72825 -72288 221733 150975
17821 150975 99315 319118 -150059 -187607 -13932 1615 123128 234455 1788 60319 4818
17809 113412 102075 182292 203872 -221105 -11641 59731 417430 -237131 -228575 -195535 -28045
17797 110195 189355 -86710 -173112 126282 -47516 -7330 -78173 204471 88639 -389420 -285888
17786 -285888 103257 133754 257530 -19105 -184696 -284698 -60520 211800 -66757 266096
17775 16856 -11022 26261 41488 -174222 116284 59263 18079 171615 134751 48594 -521628
17763 101586 -54484 -108502 -99026 -39219 -129936 -57831 50375 -293070 42558 -211346 159190
$$ packed form
17844a45587B4029a86101a3868A64799b48701i3528a480F4979a14515B15518a84303
17832c9702A23120O2854b8562j02015b3434j52692O1776G2825g2288B21733p0758
17821A50975n1660K19803a50059l7548a3932A615J21513J11327A788N8531D818
17809A13412j1337Q0217K1580b21105a1641E9731L57699b37131Q556L3040b8045
17797A10195P9160h6710q6402A26282d7516g330p0843B04471H8639c89420J03532
17786b85888A03257L0497J23776a9105j65591j00002f0520B11800f6757B66096
17775A6856a1022B6261J5227a74222A16284n7021A8079J53536l6864D8594e21628
17763A01586e4484n4018R476c9219r0717e7831E0375b93070D2558b11346A59190
$$ plain form
17751 -34134 -55697 147321 101393 -291581 -90417 77817 63441 -82866 -76018 -156838 -211389
17740 -211389 -108188 -29442 -113238 -145162 -212681 338589 -99525 148712 366744 191327
17730 191327 -41698 161692 334187 158690 -147393 203711 49074 -69808 52438 116794
17720 116794 -165037 -121797 -135663 -99871 89741 16906 -57156 -5263 -121267 -239008 145947
17708 87525 -135850 77531 77152 6473 -245043 -31653 -30251 139554 122994 -95794 266249 122423
17695 130520 85393 -102430 -208596 -187377 21945 80667 -10756 -90805 27848 73616 11935
17683 8003 265630 -432375 203844 43414 203591 -32773 -105428 88743 210237 64570 -144654
17671 -31833 -163250 180255 -163924 13254 -84361 16143 39446 38147 9157 141048 -165233
$$ packed form
17751c4134k1563A47321m5928b91581i0417G7817j4376h2866O848q0820n4551
17740b11389J03201b9442q3796l1924o7519C38589i9525A48712K18032j75417
17730A91327d1698A61692J72495A58690a47393B03711D9074f9808E2438O4356
17720A16794a65037M3240j3866L5792H9741A6906e7156e263j16004j17741A45947
17708H7525a35850G7531l79F473b45043c1653J402A39554j6560i5794B66249A22423
17695A30520m5127a02430j06166K1219B1945N8722a0756q0049B7848M5768A1935
17683H003K57627d32375B03844D3414J60177c2773p2655H8743J21494F4570a44654
17671c1833j31417A80255a63924A3254h4361A6143K3303j299I157J31891a65233
$$ plain form
17659 169349 105362 -190100 -201641 -62922 -4700 261818 177004 -127592 184541 -193654 -13917
17647 -19539 -91868 58470 -245500 89422 -45191 23181 474389 -59182 -128851 2090 80786
17636 80786 84300 -89836 51222 -7701 -127739 284454 118108 119218 -481477 252511 115091
17624 11891 -96061 -12055 245975 92289 -146275 59465 -371817 87773 -85408 129005 -58377
17612 206860 -24667 -158590 -225475 -47308 254238 206245 -41815 67325 -247190 2694 -175577
17600 47415 367637 27750 -658835 -98073 -129481 164634 260103 -158449 -233235 345732 416753
17589 416753 -55005 -84833 156599 90930 -35207 102341 286863 -206043 -18101 92594 -205123
17577 40107 162440 10120 24342 250753 -88352 239997 148926 -12282 53105 332854 -160585
$$ packed form
17659A69349o3987a90100j1541f2922d700B61818q4814a27592A84541a93654a3917
17647a9539p2329E8470b45500H9422d5191B3181M51208e9182o9669B090P8696
17636H0786L514h9836E1222g701j20038B84454A18108J110d81477B52511A15091
17624A1891i6061a2055B45975I2289a46275E9465c71817H7773h5408A29005e8377
17612B06860b4667j33923o6885d7308B54238m7993d1815F7325b47190B694a75577
17600D7415L20222B7750f58835i8073l1408A64634R5469a58449p4786C45732P1021
17589D16753e5005k9828A56599o5669c5207A02341J84522b06043a8101I2594b05123
17577D0107J22333A0120J4222K26411h8352B39997r1071a2282E3105K79749a60585
$$ plain form
17565 -221660 154381 43328 58937 -48443 87113 190521 101098 -208266 -122896 186158 44078
17553 -129343 95983 45754 -64397 -319982 -93927 -119336 129364 102238 125786 -41097 -292725
17542 -292725 -160942 -71982 32979 -74927 42782 -61300 69241 -390545 -216587 207377 177048
17531 177048 -151127 -184101 160729 69480 90513 84531 -8770 -70776 197189 301830 3684
17519 -227792 123369 -54070 111832 -74896 141754 -98909 116760 -32474 18541 -110331
17508 -52128 11967 264492 36437 42248 339413 151717 3887 121596 -76075 -5835 -166361
17497 -166361 -69225 189116 -470035 115458 136036 26988 121068 -120335 209153 19263
17486 72189 17116 292321 100455 57210 114835 -4986 231042 -91495 199374 274493 -54750
$$ packed form
17565b21660A54381D3328J5609d8443H7113J03408q9423b08266Q5370A86158D4078
17553a29343I5983D5754f4397k55585i3927k5409A29364k7126K3548d1097k51628
17542b92725J31783g1982C2979g4927D2782f1300F9241c90545J73958B07377l0329
17531A77048a51127l2974A60729F9480K1033n982h770o2006A97189J04641C684
17519b27792A23369e4070A11832g4896A41754i8909A16760c2474A8541a10331
17508e2128A1967K52525C6437N811K97165A51717C887J17709g6075e835j60526
17497a66361f9225A89116d70035A15458K0578B6988R4080a20335B09153A9263
17486G2189A7116K75205A00455m3245N7625d986B31042i1495A99374P5119e4750
$$ plain form
17474 -57584 31822 62001 77995 39329 -14325 87977 -92356 13892 113488 -48395 -14838 151548
17461 232888 224479 275381 -64014 -161846 250870 247831 61434 293939 285428 75826 -76699 139465
17448 303329 58707 356962 176357 691355 163971 58303 -44970 8694 664129 414514
17438 414514 140583 337220 80057 258052 96073 -34419 412146 178997 140890 37677
17427 247912 260296 32942 307854 96459 411018 65565 205263 128942 193415 56810 209190
17416 209190 66966 386450 601168 26856 214394 44130 -46557 381964 104763 202858
17406 202858 -74838 123328 -1755 47731 115033 -37910 140181 -71794 97213 163510 9278
17394 -21956 76003 80009 268273 91038 93427 -91782 126772 -52986 65085 -142008 -181963
$$ packed form
17474e7584C1822L0179J5994l8666a4325H7977i2356A3892R9596d8395a4838A51548
17461B32888q409N0902f4014r7832B50870l039F1434K32505q511G5826g6699A39465
17448C03329E8707K98255A76357N14998A63971E8303d4970H694O55435k49615
17438D14514A40583J96637H0057J77995I6073c4419D12146A78997l8107C7677
17427B47912J2384C2942K74912I6459L14559F5565J39698p6321O4473E6810J52380
17416B09190F6966L19484K14718B6856J87538D4130d6557C81964A04763R8095
17406B02858g4838A23328a755D7731O7302c7910A40181g1794I7213O6297I278
17394b1956G6003M006J88264I1038K389i1782A26772e2986F5085a42008l9955
$$ plain form
17383 -181963 294605 79662 298907 11176 95097 -192069 121135 -6450 158174 202120 536034
17372 536034 96718 377530 123465 4319 -233007 247044 -51338 41797 -109015 631857
17361 -121317 21060 219724 185581 80219 3550 -180246 97729 229066 74320 102873 -107212
17349 -222042 41406 41911 -131376 405659 283433 19375 63949 616 -144312 -162704 97012
17337 121399 -107664 -196543 204875 -24991 236254 -176298 -78969 301819 79409 -22032
17326 -34171 148124 -91983 -92050 170733 -71885 94879 123360 152729 317783 314010 136295 253226
17314 253226 319143 29627 69503 532106 -79901 132002 198946 -111762 -113759 -284531 392465
17302 10751 196046 69588 -261011 276437 -136201 96636 173308 174715 446817 119883 333003
$$ packed form
17383a81963B94605G9662K19245A1176Q3921a92069A21135f450A58174M3946L33914
17372E36034I6718K80812A23465D319b33007B47044e1338D1797a09015F31857
17361a21317B1060J98664l4143H0219C550a80246I7729J31337G4320K8553a07212
17349b22042D1406N05a31376D05659j22226A9375M4574F16a44312j8392I7012
17337A21399a07664q8879B04875b4991B36254a76298g8969C01819G9409b2032
17326c4171A48124i1983o7A70733g1885I4879K8481K9369J65054l773A36295J16931
17314B53226O5917B9627L9876M62603g9901A32002O6944a11762j997j70772C92465
17302A0751J85295F9588b61011B76437a36201I6636P6672J407K72102A19883K13120
$$ plain form
17291 333003 256250 71644 170592 -9405 -94461 -64690 -57146 14363 217761 68683 20133 285781
17279 285781 207075 -52170 -11356 -130541 254006 -115542 408747 115189 184540 273941
17269 273941 285202 199906 -334138 17663 -36920 184378 -7972 59017 371083 96610 194666
17258 194666 -11491 25813 272059 288413 192284 580344 370149 142312 11407 47100 5608
17246 171426 176208 -9640 433048 145147 -4303 -199047 -113557 246138 105044 190480 125780
17235 125780 279321 -93079 314381 286912 287531 256292 149779 116257 57169 201771 29728
17223 -217676 -7089 133563 171523 -81707 325780 271965 81681 125294 233888 200230 581463
17212 581463 296824 -19963 139800 208475 71801 52817 -161914 -289162 243934 348126
$$ packed form
17291C33003p6753G1644R8948i405q5056K9771P544A4363K03398F8683B0133K65648
17279B85781p8706e2170a1356j19185B54006a15542D08747A15189O9351Q9401
17269B73941J1261q5296c34138A7663c6920A84378g972E9017L12066I6610R8056
17258A94666a1491B5813K46246J6354r6129L88060k10195A42312A1407L5693E608
17246A71426M782i640D33048A45147d303j94744Q5490B46138A05044Q5436o4700
17235A25780J53541i3079C14381k7469O19l1239j06513l3522E7169J44602B9728
17223b17676g089A33563L7960h1707C25780n3815H1681M3613J08594l3658L81233
17212E81463k84639a9963A39800O8675G1801j8984a61914j27248B43934J04192
$$ plain form
17202 348126 201424 231890 224666 244825 352260 195387 286114 -60725 170837 665379 349197
17191 349197 122234 127643 306306 71666 -162863 351657 -33913 2560 436560 -272777 173849
17179 -39875 279229 -100128 284697 99840 324126 80166 415112 486824 -112461 210034
17168 69723 110705 218462 341130 141540 -21507 204130 -23587 244643 527204 32971
17157 243335 253826 198722 92619 203160 153467 352110 -101153 597615 119427 315850
17147 315850 255302 231197 409104 110196 234277 140833 205667 226045 565535 185464
17136 294761 236695 162663 -112308 149743 271646 505806 554913 324782 293332 303241 340745
17125 340745 239869 307645 209366 191778 420102 337499 316035 435003 369708 566257 351088
$$ packed form
17202C48126j46702L0466p224K0159J07435j56873R0727f0725A70837M94542l16182
17191C49197A22234N409J78663G1666a62863C51657c3913B560M34000b72777A73849
17179c9875B79229a00128B84697I9840K24286H0166L34946P1712a12461B10034
17168F9723M0982J07757J22668A41540b1507B04130b3587B44643K82561C2971
17157B43335J0491n5104I2619J10541m9693J98643a01153E97615A19427J96423
17147C15850o0548k4105J77907A10196J24081r3444O4834K0378L39490A85464
17136B94761n8066p4032a12308A49743J21903K34160M9107k30131l1450R909L7504
17125C40745j00876O7776r8279j7588K28324q2603k1464J18968o5295J96549k15169
$$ plain form
17114 351088 213890 147837 327977 141976 394810 573686 203139 106884 353055 574983
17104 574983 316972 390643 117658 508831 424582 106366 -181909 362081 -80144 104469
17093 104522 504671 317475 302980 453940 30562 440953 460338 291214 496409 270078
17083 270078 454508 245978 422455 241479 596435 -39994 608231 345329 264832 616258
17073 616258 528267 185182 549985 205238 223800 45061 401109 575279 608710 300349
17062 225744 219400 170460 522404 271256 468121 506520 388450 389679 198019 178780 517928
17051 517928 559037 347384 491522 52624 332280 158143 657595 315244 216910 197024
17041 197024 448204 239384 161834 525720 -49469 258325 184404 433587 434003 530690 432376
$$ packed form
17114C51088j37198o6053J80140A41976K52834J78876B03139r6255K46171K21928
17104E74983k58011P3671A17658L91173q4249A06366a81909C62081h0144A04469
17093A04522M00149j87196j4495J50960C0562M10391J9385j69124K05195k26331
17083B70078J84430k08530J76477j80976L54956c9994F08231k62902q0497L51426
17073F16258q7991A85182L64803B05238J8562D5061L56048J74170L3431C00349
17062B25744o344m8940L51944k51148J96865L8399j18070J229j91660j9239L39148
17051E17928M1109k11653J44138E2624K79656A58143M99452C15244r8334j9886
17041A97024K51180k08820p7550L63886d9469B58325p3921K49183M16R6687r8314
$$ plain form
17030 432376 557683 401177 432530 398495 274387 474119 480173 295177 228860 315397 514461
17019 514461 477683 499832 516793 737985 577472 358244 477230 601181 83831 150225
17009 150225 507121 614139 842408 679265 444450 577840 703778 404472 181301 566318
16999 566318 309027 493761 759505 487078 896671 610638 637265 628832 797719 862933
16989 862933 659571 856927 743958 576720 874756 867379 618975 581348 862312 514430
16979 514430 770211 744326 722910 411347 840929 887745 379809 608098 779192 406238
16969 406238 631991 709544 502888 840211 718738 627930 884845 952997 434735 824143
16959 824143 856844 789178 790188 931288 764452 460530 612176 991881 867116 748058
$$ packed form
17030D32376J25307j56506L1353l4035j24108J99732O054j84996o6317Q6537J99064
17019E14461l6778K2149J6961K21192j60513k19228J18986J23951H3831O6394
17009A50225L56896J07018K28269j63143k34815J33390J25938k99306A81301L85017
16999E66318k57291J84734K65744k72427M09593k86033K6627q433J68887O5214
16989H62933k03362J97356j12969j67238K98036p377k48404l7627K80964l47882
16979E14430K55781k5885k1416l11563M29582M6816C79809K28289J71094l72954
16969D06238K25753P7553k06656L37323j21473r0808K56915O8152D34735L89408
16959H24143L2701o7666J010J41100j66836l03922J51646L79705j24765j19058
$$ plain form
16949 748058 621769 826516 984140 857856 813810 779543 709487 1003798 957478 1030487
16939 1030487 829753 879181 884102 895539 1227928 1160607 731897 1255077 1022489 844717
16929 844717 1196531 705507 1002323 709460 975198 880508 1115545 1077536 888049 1125638
16919 1125638 813178 1047706 901533 1184246 1232425 1408648 1135085 926552 1086729 1468969
16909 1468969 1190208 1267461 1046362 1191944 1156409 1215613 1279190 1466820 1203415 1165537
16899 1165537 1273359 1389918 1741526 1330966 1835053 1335721 1419295 1353354 1463413 1473874
16889 1473874 1819153 1384677 1244683 1447798 1608337 1681086 1626115 1935509 1665806 1379974
16879 1379974 1636746 1796398 1837446 1703989 1700222 1443606 1844198 1941863 2289041 1572223
$$ packed form
16949G48058j26289K04747J57624j26284m4046l4267p0056K94311m6320P3009
16939A030487k00734M9428M921J1437L32389o7321m28710N23180k32588j77772
16929H44717L51814m91024K96816k92863K65738r4690K35037l8009j89487K37589
16919A125638l12460K34528j46173K82713M8179J76223k73563k08533J60177L82240
16909A468969k78761P7253k21099J45582l5535N9204O3577J87630k63405l7878
16899A165537J07822J16559L51608m10560N04087m99332Q3574o5941J10059J0461
16889A473874L45279m34476j39994K03115J60539P2749n4971L09394k69703k85832
16879A379974K56772J59652M1048j33457l767k56616M00592R7665L47178p16818
$$ plain form
16869 1572223 2193005 1717284 2039693 1908809 1785439 2271675 1849866 2293286 2282432 2027361
16859 2027361 2128006 2122259 2204522 2463083 2180991 2293473 2370362 2337486 2254366 2491833
16849 2491833 2635775 2355441 2593266 2447542 2810241 2698714 2603309 2979749 2651859 2869969
16839 2869969 3006828 2883135 2928223 3179576 3263783 3268110 3368782 3487448 3339282 3498561
16829 3498561 3790931 3904270 3683747 3657246 3983048 4018666 3845765 4248367 3778347 4020615
16819 4020615 3851433 4403947 4076233 4637127 4463219 4202045 4811306 4630038 4720038 4833918
16809 4833918 5273393 5190179 5305726 5480897 5541830 5818960 5523472 5770696 6296957 6243174
16799 6243174 6377488 6156671 6506744 6617292 7102244 7212170 7262770 7490524 7698495 7701726
$$ packed form
16869A572223O20782m75721L22409j30884j23370M86236m21809M43420j0854k55071
16859B027361J00645n747Q2263K58561k82092J12482P6889l2876q3120K37467
16849B491833J43942k80334K37825j45724L62699j11527r5405L76440l27890K18110
16839B869969J36859j23693M5088K51353Q4207M327J00672J18666j48166J59279
16829C498561K92370J13339k20523k6501L25802L5618j72901M02602m70020K42268
16819D020615j69182N52514l27714N60894j73908k61174O09261j81268R0000J13880
16809D833918M39475q3214J15547J75171O0933K77130k95488K47224N26261n3783
16799F243174J34314k20817L50073J10548M84952J09926N0600K27754K07971L231
$$ plain form
16789 7701726 7998956 8105203 8566254 8530446 8852594 9177374 9430267 9462675 9882097 10021752
16779 10021752 10455101 10768403 11208816 11241888 11713660 12353930 12485405 12786454 13527409
16770 13527409 13614200 14511680 14876011 15109944 16083473 16436530 16933296 17569955 18584177
16761 18584177 19045881 19566301 21032780 21653674 22760785 23342354 24574228 25710462 26939193
16752 26939193 28172694 29892944 31086985 32761951 34313743 36095510 37746402 39812654
16744 39812654 42163877 44511741 46988428 50121356 52812964 55816029 59757994 63231149
16736 63231149 67534638 71449726 76481608 81896344 86969590 92986133 99800888 106564696
16728 106564696 113878077 121459674 129879896 138443750 146862653 155702643 164304280 172909292
$$ packed form
16789G701726K97230J06247M61051l5808L22148L24780K52893L2408M19422J39655
16779A0021752M33349L13302M40413L3072M71772O40270J31475L01049P40955
16770A3527409Q6791Q97480L64331K33933R73529L53057M96766O36659J014222
16761A8584177M61704N20420J466479O20894J107111N81569J231874J136234J228731
16752B6939193J233501J720250J194041J674966J551792J781767J650892K066252
16744C9812654K351223K347864K476687L132928K691608L003065L941965L473155
16736F3231149M303489L915088N031882N414736N073246O016543O814755O763808
16728A06564696P313381P581597Q420222Q563854Q418903Q839990Q601637Q605012
$$ plain form
16720 172909292 180486315 187632361 193077141 197903994 200593518 202061508 201722438 199588468
16712 199588468 196117579 190846642 184641300 177279613 169150453 160433361 152163892 142874568
16704 142874568 134097106 125774605 117653160 109859244 102726753 95739568 89593103 83362560
16696 83362560 77854194 73098467 68403769 63970039 59798461 56359245 52904901 49889156
16688 49889156 46641887 44009217 41870324 39534994 37581173 35639025 33831379 32039536
16680 32039536 30381355 29060099 27699886 26201311 24967886 23839199 22913546 21684368
16672 21684368 20759766 20216561 19366782 18642597 17604995 17133825 16629345 15816566 15238041
16663 15238041 14767288 14372717 13618079 13202188 12962210 12436327 11536382 11638534 11294589
$$ packed form
16720A72909292P577023P146046N444780M826853K689524J467990l39070k133970
16712A99588468l470889n270937o205342p361687q129160q717092q269469r289324
16704A42874568q777462q322501q121445p793916p132491o987185o146465o230543
16696H3362560n508366m755727m694698m433730m171578l439216l454344l015745
16688D9889156l247269k632670k138893k335330j953821j942148j807646j791843
16680C2039536j658181j321256j360213j498575j233425j128687r25653j229178
16672B1684368r24602n43205q49779p24185j037602m71170n04480q12779n78525
16663A5238041m70753l94571p54638m15891k39978n25883q99945J02152l43945
$$ plain form
16654 11294589 10861216 10565999 10075416 10094576 9511338 9567149 9171389 8849993 8589523 7895275
16644 7895275 7932501 7935946 7860668 7378904 6982524 6892358 7022206 6607280 6231887 6198114
16634 6198114 6291055 5740921 5672074 5723806 5709459 5544325 5333536 5296659 4993688 4672873
16624 4672873 4649023 4803368 4874832 4238809 4614393 4454986 4240836 3857902 4273359 3641137
16614 3641137 3926247 3515731 3827893 3671900 3676972 3522307 3079993 3463068 3321379 2972397
16604 2972397 3124873 3112828 2703943 2910429 3220538 2788579 2883715 2723563 2724735 2485333
16594 2485333 2602775 2702549 2581144 2727376 1939518 2340622 2638842 2510293 2210670 2340982
16584 2340982 2373434 2259090 2122557 2244078 1980160 1980819 2333746 2162318 2013525 1877085
$$ packed form
16654A1294589m33373k95217m90583J9160n83238N5811l95760l21396k60470o94248
16644G895275L7226L445p5278m81764l96380r0166J29848m14926l75393l3773
16634F198114R2941n50134o8847N1732j4347j65134k10789l6877l02971l20815
16624D672873k3850J54345P1464o36023L75584j59407k14150l82934M15457o32222
16614C641137K85110m10516L12162j55993N072j54665m42314L83075j41689l48982
16604B972397J52476j2045m08885K06486L10109m31959R5136j60152J172k39402
16594B485333J17442R9774j21405J46232p87858M01104K98220j28549k99623J30312
16584B340982L2452j14344j36533J21521k63918O59L52927j71428j48793j36440
$$ plain form
16574 1877085 1783949 2005167 1828576 1772463 2145866 1599523 1834394 1654029 1686207 1810694
16564 1810694 1695936 1536450 1424141 1456965 1753156 1717247 1649188 1548437 1678528 1517707
16554 1517707 1503849 1142727 1233827 1675516 1323469 1288795 1498381 1179182 1183244 1229694
16544 1229694 1144698 1357116 1084824 1492305 1234785 1178529 801893 1121931 1037184 1318101
16534 1318101 1070789 1400724 1192641 1004314 1103959 1038353 1221378 933221 1104722 1053818
16524 1053818 1144892 839140 662305 870807 576667 933195 974023 513150 1290667 981931
16514 981931 713437 796795 906873 968405 855461 749363 895414 1027940 710556 935204
16504 935204 863194 763912 595273 1050660 496605 591747 736189 731525 699403 709360 762325
$$ packed form
16574A877085r3136K21218j76591n6113L73403n46343K34871j80365L2178J24487
16564A810694j14758j59486j12309L2824K96191l5909o8059j00751J30091j60821
16554A517707j3858l61122R1100M41689l52047l4674K09586l19199M062M6450
16544A229694q4996K12418k72292M07481k57520n6256l76636L20038q4747K80917
16534A318101k47312L29935k08083j88327R9645o5606J83025k88157J71501n0904
16524A053818R1074l05752j76835K08502k94140L56528M0828m60873P77517l08736
16514I81931k68494Q3358J10078O1532j12944j06098J46051J32526l17384K24648
16504I35204p2010r9282j68639M55387D96605R5142J44442m664l2122R957N2965
$$ plain form
16493 762325 841995 619721 613971 975079 636057 690176 763024 654577 766199 828096 511473
16482 511473 633512 867487 545888 818320 406687 804569 697662 375821 872043 334501
16471 888274 148698 426256 574158 797375 783283 628747 745323 551657 680995 577872
16461 577872 511322 670101 495571 558164 665885 556501 327876 253459 274953 225785
16451 225785 506922 437953 670333 590890 594797 322380 520768 373060 406804 646417
16441 646417 425580 490696 479044 333747 272260 95912 536551 502430 428887 510214 350560
16430 350560 643827 665945 562246 313067 523029 532455 333997 461129 564822 227232
16419 564930 836385 792004 534584 231354 2554 291029 151795 192425 79055 504541
$$ packed form
16493G62325P9670k22274n750L61108l39022N4119P2848j08447J11622O1897l16623
16482E11473J22039K33975l21599K72432D06687L97882j06907l21841M96222C34501
16471H88274A48698K77558J47902K23217j4092j54536J16576j93666J29338j03123
16461E77872o6550J58779j74530O2593J07721j09384k28625p4417K1494m9168
16451B25785K81137o8969K32380p9443L907k72417J98388j47708L3744K39613
16441F46417k20837O5116j1652j45297o1487I5912M40639l4121p3543Q1327j59654
16430C50560K93267K2118j03699k49179K09962R426j98458J27132J03693B27232
16419E64930K71455m4381k57420B31354B554K88475j39234M0630G9055M25486
$$ plain form
16409 504541 338885 505532 57500 450155 506131 128650 -34120 -118978 806 186666 202408
16398 202408 98316 211623 69628 376230 317470 204621 323808 120636 280619 80473
16387 245540 138274 444293 168002 294846 359294 416343 345764 -231553 117687 453111
16377 453111 244098 324933 520042 398746 148007 203451 301491 223766 103426 248200
16367 248200 661820 -45708 328571 106628 374475 118917 266804 375890 162254 117507
16357 117507 250492 182447 557589 208904 256613 46837 279352 -100454 346072 109193
16346 315244 149343 193781 123429 275951 194329 43409 13561 193927 247511 404386 114033
16334 26833 11818 97529 283879 -380752 219372 -63469 7151 155250 272809 -143146 291317
$$ packed form
16409E04541j65656J66647E7500L92655N5976A28650c4120q4858H06J85860J5742
16398B02408I8316J13307F9628L06602n8760j12849J19187A20636J59983H0473
16387B45540j07266L06019A68002J26844O4448N7049p0579b31553A17687L35424
16377D53111k09013Q0835J95109j21296A48007N5444R8040p7725A03426J44774
16367B48200M13620d5708C28571A06628K67847A18917J47887J09086A62254m4747
16357A17507J32985o8045L75142B08904M7709D6837K32515a00454C46072A09193
16346C15244A49343M4438p0352J52522q1622D3409A3561J80366N3584J56875A14033
16334B6833A1818Q5711J86350c80752B19372f3469G151J48099J17559a43146B91317
$$ plain form
16322 182958 100543 177328 612421 121479 394407 355729 196284 333650 38 154752 125744
16311 125744 109671 371453 362624 -6920 143362 6115 -88311 132522 266956 143058 287502
16300 287502 45103 553032 333240 193318 32730 304935 144686 74077 195662 10317
16289 186780 -39449 -129955 163361 74326 -50808 382164 134735 141181 571601 -92520 390567
16277 271066 274036 188423 -67550 339251 133930 107861 36830 58897 184993 476028 408928
16266 408928 -140442 1010 148256 9502 264759 22717 276025 -85636 207494 5360 472978
16255 472978 14191 298284 75863 138425 195558 308361 -41356 92858 110398 383991 584515
16244 584515 155843 197142 -413790 144862 -46728 74269 -55209 236646 363251 28322
$$ packed form
16322A82958q2415P6785M35093A21479K72928l8678j59445J37366C8J54714k9008
16311A25744j6073K61782q829f920A43362F115h8311A32522J34434j23898J44444
16300B87502D5103N07929k19792j39922C2730K72205A44686p0609J21585A0317
16289A86780c9449r0506A63361G4326e0808C82164A34735O446M30420i2520C90567
16277B71066K970q5613f7550C39251A33930k6069C6830K2067J26096K91035o7100
16266D08928a40442A010J47246I502K55257B2717K53308h5636B07494E360M67618
16255D72978A4191K84093G5863O2562N7133J12803d1356I2858J7540K73593K00524
16244E84515A55843M1299d13790A44862d6728G4269e5209B36646J26605B8322
$$ plain form
16233 -5496 174105 431860 -7651 215055 -46613 -104768 213204 230970 37813 215453 -70149
16221 255945 112843 -204240 -222080 -66083 29777 -111120 -71567 -55427 61138 126618 73950
16210 73950 -93788 -188593 113451 202727 196794 18170 74090 -340219 43955 -148024 212329
16198 12312 172372 -52610 177624 196596 -195047 35802 282425 151878 248625 114650
16187 -161023 307416 -148472 88005 -72716 -103131 -21923 24154 261710 86311 136204 154336
16176 154336 190405 196099 87335 -112019 88207 -226592 203326 -97594 107576 71540 22487
16164 75014 -107566 -220567 -5421 68595 -226093 36761 -200438 221155 104115 51005 214948
16153 214948 123097 -199315 -20649 212447 75515 -82621 41093 39691 -63463 -101021 79571
$$ packed form
16233e496A74105K57755g651B15055d6613n8155B13204J7766C7813J77640g0149
16221B55945A12843b04240j7840f6083B9777a11120L9553J6140F1138O5480n2668
16210G3950i3788r4805A13451Q9276n933A8170N5920c40219D3955a48024B12329
16198A2312J60060e2610A77624J8972a95047C5802K46623j30547R6747A14650
16187a61023C07416a48472H8005g2716l0415b1923B4154K37556H6311M9893J8132
16176A54336L6069N694H7335a12019H8207b26592B03326i7594A07576l6036B2487
16164G5014a07566j13001e421F8595b26093C6761b00438B21155A04115E1005J63943
16153B14948r1851a99315b0649B12447G5515h2621D1093j402f3463l7558G9571
$$ plain form
16141 283103 103143 293218 -219583 32121 97791 -117854 -129413 -132571 -369 110873 -163840
16129 131877 -101184 94574 -102860 18917 27273 -151341 28578 227703 130887 136675 98444
16118 98444 177795 -181916 -46929 98724 3448 46402 157846 -166017 -92144 312113 170298
16107 170298 -74163 101933 -263016 255127 349398 42386 17108 187698 -18028 -29397 -201240
16096 -201240 100147 300678 25329 84222 -50509 -175692 -39783 179934 -127247 -3681 -12576
16085 -12576 -30020 -125045 -48195 24587 -101584 -197468 71661 111739 -276736 75708 -48964
16073 251944 -118066 303050 -93015 -240300 151786 221974 -26160 -139485 -110617 -83355
16063 -83355 -59775 -30708 -104371 -80642 -245111 -345389 14460 -6526 -482094 -76405 129644
$$ packed form
16141B83103A03143J90075b19583C2121O5670a17854j1559l158c69A10873a63840
16129A31877a01184I4574a02860A8917Q356a51341B8578J99125r6816N788l8231
16118I8444P9351a81916d6929I8724C448M2954J11444a66017P3873C12113j41815
16107A70298g4163A01933b63016B55127R4271D2386A7108J70590a8028j1369j71843
16096b01240A00147K00531B5329N8893e0509j25183c9783A79934a27247c681q895
16085a2576j7444r5025d8195B4587a01584r5884G1661M0078b76736G5708d8964
16073B51944a18066C03050i3015j47285A51786P0188b6160j13325K8868K7262
16063h3355K3580K9067p3663K3729j64469j00278A4460f526m75568g6405A29644
$$ plain form
16051 127821 282706 22643 -32472 -223000 -212921 67447 155714 -162345 -167250 150009 10857
16039 437422 137685 -274807 92330 49743 11772 42155 -117047 92169 69972 -116605 48958
16027 -105952 74073 103000 -22098 -163721 -31761 -6014 -233836 -27007 -335891 -131770 -260486
16016 -260486 -292842 -85028 -9646 -115907 -223857 -150975 385793 -247230 115278 130566 -200229
16004 131998 127772 21883 249859 127274 331847 -364288 -212971 -124793 -27747 272320
15993 -79916 -143218 192917 -227448 28633 -3406 92282 54902 124608 -338447 109900 343364
15982 343364 151402 99973 99410 126441 221129 -43909 80398 206748 -137598 -166965 89355
15970 51927 92427 88421 244892 -196656 -87528 116664 -37608 20408 243023 120500 -258153
$$ packed form
16051A27821J54885B2643c2472j90528J0079F7447Q8267a62345m905A50009A0857
16039D37422A37685b74807I2330m2587A1772L0383a17047I2169k2197a16605D8958
16027a05952G4073K8927b2098j41623c1761f014k27822b7007l08884a31770j28716
16016b60486l2356h5028i646j06261j07950P2882C85793b47230A15278J5288b00229
16004A31998m226B1883K27976j22585K04573c64288J51317Q8178b7747B72320
15993g9916o3302A92917b27448B8633c406I2282l7380O9706c38447A09900K33464
15982C43364A51402n1429n63K7031R4688d3909H0398J26350a37598k9367H9355
15970E1927M0500m006J56471a96656h7528A16664c7608B0408K22615A20500b58153
$$ plain form
15958 89310 -132866 -107156 64824 -151139 16266 -95906 -68034 7180 -146343 -104419 -32485
15946 -115263 233946 165565 11336 265183 -67130 46685 -45585 -53352 -210065 238162 -168220
15934 76500 -22430 -303498 -125630 196408 -179243 46696 251379 -95691 -120756 -102799 -292765
15923 -292765 35956 -10886 -180614 295133 74290 153490 30071 -65702 -16450 14503 -16636
15911 -47749 63852 -296660 -155691 -59766 -245522 -242221 460230 -143318 40007 -83243 -134290
15900 -134290 -4181 -143677 -151171 -136019 126598 -48154 131943 191063 79197 -322650 123855
15888 69152 -23074 65009 -256730 -172691 89383 -102559 -111169 -247524 -2849 139878 64051
15876 107010 3361 40412 -64924 -61478 167303 -196657 -119289 125705 117718 180753 -210507
$$ packed form
15958H9310a32866K5710F4824a51139A6266i5906K7872G180a46343M1924c2485
15946a15263B33946o8381A1336K53847f7130D6685d5585p767j56713B38162a68220
15934G6500b2430k81068a25630A96408a79243D6696K04683i5691k5065J7957j89966
15923b92765C5956a0886j69728B95133G4290P9200C0071f5702a6450A4503a6636
15911d7749F3852b96660J40969e9766j85756L301D60230a43318D0007h3243n1047
15900a34290d181j39496p494J5152A26598d8154A31943N9120G9197c22650A23855
15888F9152b3074F5009b56730Q4039H9383a02559q610j36355b849A39878F4051
15876A07010C361L7051f4924L446A67303a96657P7368A25705p987O3035b10507
$$ plain form
15864 -380974 -1977 -32119 -30941 -101747 -306815 -141564 29544 45 -97 83732 -118704 229839
15851 139359 -232116 -114363 -117097 307953 -269366 -150581 -29697 -171224 -211360 -30948
15840 195266 87256 -167167 -401458 130616 -231604 -151512 93590 -168967 205793 -146926
15829 166757 19673 -287983 -27649 -75790 -133059 35865 -100861 8214 85632 -13262 -307403
15818 -307403 -351883 -60559 37751 -13157 -133879 -444204 -117095 371640 111092 -87645
15807 222072 102634 65679 -331306 68394 29347 -130551 -173444 -123133 -93983 -64612 -86226
15796 -86226 -174593 -234700 -243628 -151361 -139746 121310 -177774 151857 55788 -115714 109500
15784 -303274 -456141 321483 97189 -22480 -355912 32947 -218926 -251775 8036 -136045 -74810
$$ packed form
15864c80974a977l0142J178p0806k05068a41564B9544D5i7H3732a18704B29839
15851A39359b32116a14363k734C07953b69366J18785b9697j41527m0136c0948
15840A95266H7256a67167k34291A30616b31604Q0092I3590a68967B05793a46926
15829A66757A9673b87983b7649m8141n7269C5865a00861H214P7418a3262k94141
15818c07403m4480f0559C7751a3157j20722l10325a17095C71640A11092h7645
15807B22072A02634l6955c31306F8394B9347a30551m2893N0311K9150K9371k1614
15796h6226q8367o0107q928R2267J1615A21310a77774A51857E5788a15714A09500
15784c03274j52867C21483I7189b2480l33432C2947b18926l2849H036a36045O1235
$$ plain form
15773 -74810 -79589 -81184 -38916 -132300 49009 -129391 67777 -263823 -259505 -17482 -85747 -237230
15761 -237230 -146821 199249 -410221 171753 356781 -124889 236213 -498090 -214785 166256
15750 174883 -38341 -135742 -259420 -154912 68346 -112892 -179665 -145601 -7922 -2260 318890
15738 -237282 77425 36259 -124935 -174922 -20120 43452 -86863 -129483 -324187 11766 9469
15727 9469 -212802 -133495 -90542 -32177 -46168 -67914 106907 133817 -228440 -84581 -311968
15716 -311968 -10389 -277270 45483 62994 -175102 -211139 -215870 23349 62767 -130096 38841
15704 -386071 250949 -219731 94527 174437 217932 -214094 -326982 187245 -95591 198835
15693 -270522 -134054 245364 377133 59490 -133760 -193063 66214 -117525 49613 116388
$$ packed form
15773g4810m779j595c8916r3384D9009a29391F7777b63823M318a7482o8265j51483
15761b37230R0409A99249d10221A71753J85028a24889B36213d98090b14785A66256
15750A74883c8341r7401j23678J04508F8346a12892o6773L4064g922b260C18890
15738b37282G7425C6259a24935m9987b0120D3452h6863m2620j94704A1766k297
15727I469b12802P9307M2953c2177j3991k1746A06907K6910b28440h4581k27387
15716c11968a0389k66881D5483J7511a75102l6037m731B3349L9418a30096C8841
15704c86071B50949b19731I4527P9910M3495b14094j12888A87245i5591A98835
15693b70522a34054B45364J31769E9490a33760n9303F6214a17525D9613O6775
$$ plain form
15683 116388 -22999 -161575 -2687 -71777 -87186 -31725 -126365 91076 -187531 -266063 -211521
15672 -211521 68887 194245 -2265 -201518 -87140 55360 -172856 -29510 32222 -210728 -337236
15661 -337236 148230 -170679 362387 42605 -172267 -209266 17138 167376 -24783 72807
15650 -17503 -217896 255766 -165148 -247829 173309 12205 -12932 -15343 -178486 -215745 -271673
15639 -271673 -194433 163244 -221526 -67701 -230444 30390 -26692 -129944 140297 209990
15629 209990 -69117 199382 -135446 -46905 106802 -206923 159709 -184119 -70999 -292094
15619 -292094 162768 32615 -138721 -24338 105082 63416 278893 -73082 14962 -12975 -65365
15608 -65365 182119 -177995 -19648 174676 -188653 -161086 5348 -23223 -223987 -73491 -48257
$$ packed form
15683A16388b2999j38576b687o9090j5409c1725r4640I1076a87531p8532N4542
15672b11521F8887J25358b265j99253h7140E5360a72856b9510C2222b10728j26508
15661c37236A48230a70679C62387D2605a72267l6999A7138J50238b4783G2807
15650a7503k00393B55766a65148q2681A73309A2205a2932k411j63143l7259n5928
15639b71673P7240A63244b21526f7701j62743C0390b6692j03252A40297O9693
15629B09990f9117A99382a35446d6905A06802b06923A59709a84119g0999k21095
15619b92094A62768C2615a38721b4338A05082m1666K15477g3082A4962a2975n2390
15608f5365A82119a77995a9648A74676a88653K7567E348b3223k00764g3491K5234
$$ plain form
15597 -48257 28905 -437720 -115509 -94227 173546 292509 -18678 -25983 159144 198538 58015
15585 216636 88405 -33442 153718 -98217 -55244 33001 -235457 -162050 148118 -91286 -255647
15574 -255647 -77803 -173584 15891 -395489 48921 44077 163039 -124156 8787 -427326 17628
15562 59572 -28370 38090 -199496 142980 7484 291471 -306227 -240517 -73468 -68299 281993
15550 187342 189975 35936 108510 -183792 83268 98451 215729 -208248 242483 126318 -109598
15538 95497 -6633 -229402 141572 -53627 196975 109324 57574 -15884 247131 95086 -59132
15526 -178967 41411 -22156 -69662 -447512 -29791 -171343 155323 107026 -131103 -220093 44316
15514 -17276 210226 73298 107330 -198892 -82403 110652 -224338 -243422 2952 -192997 -90682
$$ packed form
15597d8257B8905d37720a15509K1282A73546J18963a8678p305A59144L9394E8015
15585B16636H8405c3442A53718i8217M2973C3001b35457P3407A48118i1286j64361
15574b55647g7803r5781A5891c95489D8921m844J18962a24156H787d27326A7628
15562E9572b8370C8090a99496A42980G484K83987c06227O5710g3468N169B81993
15550A87342K633C5936P2574a83792H3268J5183J17278b08248B42483j16165a09598
15538I5497f633k22769A41572e3627A96975q7651n1750a5884B47131I5086e9132
15526a78967D1411b2156m7506l77850b9791j41552A55323m8297a31103q8990D4316
15514a7276B10226G3298L4032a98892h2403A10652b24338j9084B952a92997i0682
$$ plain form
15502 -94072 142984 24301 87852 -85681 -7149 100765 -80533 55572 -394550 -249300 -192826
15491 -192826 -215361 -7401 145442 166544 -270197 -87803 -234154 -70974 56168 -124741 167396
15479 127977 -36259 354211 106537 -79725 144303 -5524 -42801 -19418 -4186 22693 9275
15467 -95644 -117786 170676 13805 -259306 -157017 253171 -65820 -15278 40031 163149 125252
15456 125252 -56167 -23433 -7031 250305 173591 85766 -44231 -155784 307795 -8807 -212019
15445 -212019 3361 95725 -233928 219795 -52489 -27952 -63477 -25172 -156563 -138134 -9969
15433 -112374 215292 49418 -283414 46653 -160822 -333706 102644 42518 38559 -132151
15422 45254 -137765 140139 62151 -158045 -27966 -82094 154687 -350730 201240 14881
$$ packed form
15502i4072A42984B4301O3551h5681g149A00765h0533E5572c94550J45250N6474
15491a92826k2535g401A45442K1102b70197h7803j46351g0974E6168a24741A67396
15479A27977c6259C54211A06537g9725A44303e524l7277a9418d186B2693I275
15467i5644k2142A70676A3805b59306J02289B53171f5820a5278D0031J23118l7897
15456A25252e6167b3433g031B50305p6714H5766d4231j11553C07795h807k03212
15445b12019C361R2364b33928B19795e2489K4537l5525b5172j31391J8429i969
15433a12374B15292D9418b83414D6653a60822j72884A02644D2518l959a32151
15422D5254a37765A40139F2151a58045b7966n4128A54687c50730B01240A4881
$$ plain form
15411 -77181 -243143 -40444 27419 68417 -192948 192796 58716 -98354 -154226 126036 5301
15399 -62365 -65197 -383335 239306 18549 50779 -378509 144136 -199346 297755 153388
15389 153388 143966 -134642 -59403 -132584 -145361 145025 -96943 213352 137692 480742 122608
15377 -132403 -66471 -70662 12136 145205 -42134 102468 -245749 -124282 343000 -100204
15366 128282 -171774 -203419 -39934 -102861 -264626 -81929 401109 11988 -46905 -5666 -88168
15355 -88168 -11836 -82082 -202857 93434 214755 171733 45303 51944 -125066 255703 -257489
15343 -24831 -279104 96658 -70024 -68270 67793 108871 -120404 111668 -36805 -44736 34149
15331 -26344 -56887 11974 108133 241680 -151388 175047 12816 -189808 217760 88819 266183
$$ packed form
15411g7181j65962d0444B7419M0998a92948A92796E8716i8354n5872A26036E301
15399f2365k832l18138B39306A8549L2230c78509A44136a99346B97755j44367
15389A53388r422a34642e9403p3181j2777A45025i6943B13352p5660L43050A22608
15377a32403O5932m191A2136J33069d2134A02468b45749J21467C43000a00204
15366A28282a71774l1645c9934o2927j61765h1929D01109A1988d6905e666q2502
15355h8168a1836p0246j20775I3434J21321m3022D5303O641a25066B55703b57489
15343b4831k54273I6658g0024J754F7793M1078a20404A11668c6805p931C4149
15331b6344l0543A1974R6159J33547a51388A75047A2816a89808B17760H8819J77364
$$ plain form
15320 266183 -30960 -119194 -162075 -5037 62935 -199687 30748 -170421 -101275 -25198 77257
15308 79479 38140 62117 -46300 87265 239805 419831 -217325 334379 -285787 -122087
15297 155803 6848 -82347 261406 198827 -2103 155844 -338426 161654 -318381 -45532 219181
15285 -8140 -49851 -42588 -23823 254497 110171 169595 -475085 145261 63970 162640 -152901
15273 -151767 92889 178272 46100 7084 125261 -83683 53305 -171994 246654 -128256 113489
15261 -223747 1390 115298 -172737 433868 32823 242871 121992 245567 -184407 249979
15250 196693 195795 336480 -124915 663828 1186778 2627166 2302471 2238036 2125251 1056587
15239 421563 81756 70404 -117170 -5981 -165036 30479 271931 -87880 -117389 13894 267260
$$ packed form
15320B66183c0960q8234m2881e037F2935a99687C0748a70421O9146b5198G7257
15308G9479C8140K3977d6300H7265J52540J80026b17325C34379b85787a22087
15297A55803F848h2347B61406o2579b103A55844c38426A61654c18381d5532B19181
15285h140m1711P263J8765B54497A10171N9424d75085A45261F3970R8670a52901
15273a51767I2889Q5383D6100G084J18177h3683E3305a71994B46654a28256A13489
15261b23747A390J13908a72737D33868C2823K10048j20879J23575a84407B49979
15250A96693q98J40685a24915F63828N22950J440388l24695o4435j12785A056587
15239D21563H1756j1352a17170e981j59055C0479K41452h7880k9509A3894K53366
$$ plain form
15228 267260 -60883 26046 216133 -195284 -29499 -21917 -346391 141021 67098 367918 187340
15217 187340 7752 57892 -206695 146891 145342 106367 -25416 -143791 147763 -85416 -62837
15206 -62837 -262009 -1449 75618 -34446 -176381 95615 -63585 -1251 329407 -102613 21500
15194 88880 -8503 148380 -19356 -274264 13304 -196367 278223 -4473 -232834 152751 35335
15182 264072 170447 18682 55349 167985 61854 62995 -7797 -132680 -25551 170213 460412
15171 460412 180475 92224 -96110 -56345 38036 37543 97802 -36848 -27918 220351 23915 -223772
15158 -71856 252708 -222670 24071 391432 -1965 89866 16117 232418 281449 -45457 -310813
15147 -310813 151352 228171 63732 -55370 239004 218083 66862 297496 512395 65460 29888
$$ packed form
15228B67260f0883B6046J90087a95284b9499P582l24474A41021F7098L00820j80578
15217A87340G752N0140b06695A46891j549l8975b5416j18375A47763h5416K2579
15206f2837j99172a449G5618c4446j41935I5615f3585a251C29407a02613B1500
15194H8880h503A48380a9356k54908A3304a96367B78223d473k28361A52751C5335
15182B64072r3625A8682L6667J12636F1854J141g797j24883b5551A70213K90199
15171D60412A80475q8251i6110L9765C8036m93O0259c6848Q930B20351B3915b23772
15158g1856B52708b22670B4071L67361a965H9866A6117K16301M9031d5457k65356
15147c10813A51352P6819F3732e5370B39004k0921F6862K30634K14899F5460B9888
$$ plain form
15135 -79442 234085 -99059 321263 -184325 84514 321382 179524 359601 163092 160877
15125 160877 69567 271902 55408 -113800 55490 408109 137377 266889 182861 52231
15114 380074 35629 -150833 -65884 -232336 150406 264052 19346 398784 -214637 179451
15103 191898 -24163 191470 133189 -1958 -146025 399801 -249552 -16454 223513 104474
15092 69321 56314 129341 132798 129174 112309 1062 -143550 -20896 379291 -196520 62931 43127
15080 43127 250752 -146196 168908 71939 -11198 181389 -93853 82942 122988 244270 105609
15068 99817 209622 158212 179572 80154 83235 171674 192899 86546 -27235 -339167 310822
15056 7362 52581 93934 -31511 141805 129776 294290 309732 6416 -35025 180790 89884
$$ packed form
15135g9442B34085i9059C21263a84325H4514K36868j41858J80077A63092k215
15125A60877F9567K02335E5408a13800E5490L52619A37377J29512q4028E2231
15114C80074C5629a50833f5884j66452A50406J13646A9346L79438b14637A79451
15103A91898b4163A91470n8281a958j44067C99801b49552a6454B23513A04474
15092F9321j3007P3027L457l624j6865A062a43550b0896C79291a96520F2931j9804
15080D3127K07625a46196A68908G1939a1198A81389i3853H2942M0046J21282A05609
15068I9817J09805n1410K1360H0154L081Q8439K1225H6546b7235l11932C10822
15056G362M5219M1353c1511A41805j2029J64514J5442F416c5025A80790H9884
$$ plain form
15044 239015 279920 -46589 -135948 235872 362586 218867 200830 425142 138439 154360
15034 154360 -49993 149443 82168 93570 -163008 334600 52027 202813 7625 320487 28688
15022 107899 101772 -19685 126956 -94738 -126803 505085 114856 343494 30067 -69010 19956
15010 24203 163822 309690 145064 129142 265884 107446 -87896 356364 213179 246182
15000 246182 222138 -45764 -71521 -103801 416734 -62040 335170 33777 132571 129972 52516
14988 313269 293499 -110544 93573 371438 24438 291240 82078 53681 50895 171488 184024
14977 184024 403235 -25355 11950 264038 572702 98176 243241 352961 163625 233000
14967 233000 289888 348480 -106212 441317 9887 444249 403204 250756 21168 64380 125324
$$ packed form
15044B39015M0905d6589q9359B35872J26714j43719j8037K24312A38439J5921
15034A54360d9993A49443o7275J1402a63008C34600E2027J50786G625L12862B8688
15022A07899o127a9685A26956i4738l2065E05085A14856K28638C0067f9010A9956
15010B4203J39619J45868A45064j5922J36742A07446h7896C56364j43185L3003
15000B46182k4044d5764k5757l2280D16734f2040C35170C3777R8794k599E2516
14988C13269j9770a10544I3573K77865B4438K66802H2078k8397k786J20593J2536
14977A84024K19211b5355A1950K52088L08664I8176J45065J09720A63625O9375
14967B33000N6888N8592a06212D41317I887M34362m1045j52448B1168M3212O0944
$$ plain form
14956 125324 166444 453263 394748 277394 292109 242277 207269 106978 249855 424407
14946 424407 168953 323582 286617 84532 214945 219299 12277 172935 343048 114152
14935 165541 -91237 138971 -141294 187315 91962 511399 -5907 334421 -226765 125590
14924 171684 320000 245258 322257 219114 65357 230781 329182 317646 231040 258502 51660
14912 270831 370293 610312 429640 161755 317857 46577 126182 171797 437073 202472
14901 209687 555520 484013 53186 103043 103466 294027 -45100 224057 41266 143746 403535
14890 403535 97506 437082 481675 478948 222687 443776 101308 -25749 346674 122652
14879 416789 234183 177520 39622 537538 259695 577149 -43713 70057 273060 614228
$$ packed form
14956A25324M1120K86819n8515j17354J4715m9832l5008j00291J42877J74552
14946D24407A68953J54629l6965H4532J30413M354A2277J60658J70113A14152
14935A65541i1237A38971a41294A87315I1962M19437e907C34421b26765A25590
14924A71684J48316p4742P6999j03143F5357J65424R8401j1536q6606K7462E1660
14912B70831R9462K40019j80672A61755J56102D6577P9605M5615K65276B02472
14901B09687L45833p1507E3186M9857M23J90561d5100B24057D1266J02480K59789
14890D03535I7506L39576M4593k727B22687K21089A01308b5749C46674A22652
14879D16789j82606n6663C9622M97916B59695L17454d3713G0057K03003L41168
$$ plain form
14869 614228 108771 376451 318332 441325 160093 316982 417026 454198 441567 473992
14859 473992 284008 491768 326798 236379 570529 552350 286571 141759 461757 241580
14849 241580 449643 386153 402188 534378 256601 246301 335686 112797 342874 375401
14839 375401 376761 429002 244692 705399 424846 367325 277303 92139 353958 132896 641090
14828 641090 217644 402229 -6258 498065 320930 389602 436396 251821 443579 430642
14818 430642 347708 439845 623211 594833 421648 460024 303085 708811 110707 480453
14808 480453 403320 446998 290888 568093 465397 599355 617711 325790 725211 629420
14798 629420 209293 473933 436698 353679 499625 335146 638537 567298 428247 326773
$$ packed form
14869F14228A08771K67680n8119J22993A60093J56889J00044L7172j2631L2425
14859D73992j89984K07760j64970r0419L34150j8179k65779A41759L19998k20177
14849B41580K08063o3490J6035J32190B56601j0300Q9385A12797K30077L2527
14839C75401J360N2241j84310M60707k80553n7521r0022I2139K61819A32896N08194
14828F41090B17644J84585f258D98065j77135O8672M6794j84575J91758j2937
14818D30642q2934R2137J83366k8378j73185L8376j56939M05726A10707L69746
14808D80453p7133M3678j56110K77205j02696J33958J8356k91921L99421r5791
14798F29420B09293K64640l7235q3019J45946j64479L03391p1239j39051j01474
$$ plain form
14788 326773 560240 368181 462926 496379 536063 266600 362366 610724 399033 461211
14778 461211 332583 296889 852572 673928 366439 543783 681882 272797 812186 293839
14767 457062 435311 563500 363246 476648 463532 476417 546251 641064 446706 623224
14757 623224 465025 619782 469491 632966 300364 825176 559684 580513 601686 623248
14747 623248 589682 264838 676098 451488 685900 607231 713708 449828 517108 757238
14737 757238 463061 352579 516510 693640 482788 314362 794906 680412 529036 523691
14727 523691 690120 764808 408982 625844 572240 592201 994412 699867 485373 1082328
14717 1082328 797657 284634 510961 759414 619092 739344 685126 880225 1046123 869396
$$ packed form
14788C26773K33467j92059R4745L3453L9684B66600R5766K48358k11691O2178
14778D61211j28628l5694N55683j78644l07489J77344J38099B72797N39389B93839
14767D57062k1751J28189k00254J13402j3116J2885O9834R4813j94358J76518
14757F23224j58199J54757j50291J63475C00364N24812k65492K0829K1173K1562
14747F23248l3566B64838M11260k24610K34412p8669J06477k63880O7280K40130
14737G57238k94177j10482J63931J77130k10852j68426M80544j14494j51376n345
14727E23691J66429P4688l55826K16862n3604J9961M02211k94545k14494N96955
14717A082328k84671B84634K26327K48453j40322J20252n4218J95099J65898j76727
$$ plain form
14707 869396 888803 762825 975277 787099 1038681 463919 739721 705541 605432 237281
14696 640560 617966 798240 909849 547628 532305 968896 786576 735909 813053 755153
14686 755153 589082 469402 881775 871466 542240 904223 990573 956997 668353 893332
14676 893332 755977 931919 820854 912276 1020149 734265 1222939 714871 972820 1019446
14666 1019446 969498 506144 967096 911374 677346 1258937 959683 676467 675888 1273429
14656 1273429 1138095 879838 954591 616738 886455 1071702 1080287 977164 873734 942326
14646 942326 669312 1337577 1010846 842482 789562 1192161 1184332 688128 1435963 1480274
14636 1480274 1362105 1024772 1023139 1337095 1023422 977892 1054752 1012176 1008607 1372052 1241612
$$ packed form
14707H69396J9407j25978K12452j88178K51582D63919K75802l4180j00109B37281
14696F40560k2594J80274J11609l62221j5323M36591j82320n0667P7144n7900
14686G55153j66071j19680M12373j0309l29226L61983Q6350l3576k88644K24979
14676H93332j37355J75942j11065R1422J07873k85884M88674n08068K57949M6626
14666A019446m9948m63354M60952n5722k34028N81591k99254k83216n79N97541
14656A273429j35334k58257P4753l37853K69717J85247Q585j03123j03430O8592
14646I42326k73014O68265l26731j68364n2920M02599p829m96204P47835M4311
14636A480274j18169l37333j633L13956l13673m5530P6860m2576l569L63445j30440
$$ plain form
14625 1241612 1121898 1039647 1310736 1171051 1153813 956108 1305647 1055248 1310544 954096
14615 954096 1193192 1637984 1325357 1350109 1292270 1177384 1167548 1691649 1434118 1388386
14605 1388386 1591735 1572764 1213442 1228782 1327993 1466072 1584845 1673708 1116591 1686977
14595 1686977 1266630 1725706 1489011 1595510 1291654 1578644 1406096 1734790 1219461
14586 1219461 1567936 1517706 1564445 1652146 1588903 1972589 1445654 1458574 1818921 1571720
14576 1571720 2027353 1714883 1928966 2091675 1950933 1901657 1871050 2118413 1812431 2066487
14566 2066487 2083246 1998239 2331139 2059496 2181893 2095785 2349728 2300055 2266369 2560105
14556 2560105 2509429 2751302 3016067 3524455 3755829 4223414 4941522 6927893 10631087
$$ packed form
14625A241612j19714q2251K71089j39685j7238j97705L49539k50399K55296l56448
14615I54096K39096M44792l12627K4752n7839j14886r836N24101k57531m5732
14605A388386K03349j8971l59322J5340R9211J38079J18773Q8863n57117N70386
14595A686977m20347M59076k36695J06499l03856K86990j72548L28694n15329
14586A219461L48475n0230M6739Q7701o3243L83686n26935J2920L60347k47201
14576A571720M55633l12470K14083J62709j40742m9276l0607K47363l05982K54056
14566B066487J6759q5007L32900k71643J22397q6108K53943m9673l3686K93736
14556B560105n0676K41873K64765N08388K31374M67585P18108J986371L703194
$$ plain form
14547 10631087 18984921 36579203 36920278 19934090 9971487 5658882 5719020 6721686
14539 6721686 4046465 2527253 1901363 1515493 1937633 1709011 1859265 1772778 1740546
14530 1740546 1869455 2161961 2230378 1762236 2115365 2244974 1650715 2023142 2171294 2039868
14520 2039868 2156002 2224994 2322252 2175348 2255795 2447278 2130898 2362805 2558675 2291816
14510 2291816 2139138 2108931 2780554 2845085 2376504 2662366 2692561 2689464 2339671 2626513
14500 2626513 2663212 2631232 2836623 2695031 2851902 2943896 2941564 3089254 3065826 2774089
14490 2774089 3089684 3152418 3102337 3151817 3488257 3498412 3215851 3088984 3089058 3011648 3712386
14479 3712386 3716862 3389828 3375382 3383745 3491387 3228907 3826013 3670013 3860523 3986561
$$ packed form
14547A0631087Q353834J7594282L41075j6986188r962603m312605O0138J002666
14539F721686k675221j519212o25890l85870M22140k28622J50254q6487l2232
14530A740546J28909K92506O8417m68142L53129J29609n94259L72427J48152j31426
14520B039868J16134O8992R7258j46904Q0447J91483l16380K31907J95870k66859
14510B291816j52678l0207O71623O4531m68581K85862L0195l097l49793K86842
14500B626513L6699l1980K05391j41592J56871R1994k332J47690k3428k91737
14490B774089L15595O2734n0081M9480L36440J0155k82561j26867P4p7410P00738
14479C712386M476l27034j4446Q363J07642k62480N97106j56000J90510J26038
$$ plain form
14469 3986561 4018788 3804360 3832100 3769445 4011359 3930562 4246002 4085811 4371849 4114071
14459 4114071 4130504 4412861 4273255 4169798 4143342 4283046 4289025 4463185 4532709 4454990
14449 4454990 4697823 4681009 4335788 5033999 4732651 4576698 4893937 5182917 5456430 5281791
14439 5281791 5162012 5687410 5726311 5788003 5548650 5704163 5868292 5644518 5831850 6020777
14429 6020777 5776452 6146300 6401329 6524602 6164120 6284061 6742102 6737635 6809222 6943694
14419 6943694 7027505 6836825 7510952 7283149 7513022 7355675 7553142 7743191 8152532 7816900
14409 7816900 8351309 8112302 8218605 8352224 8483780 8692592 8467133 8981916 9047748 9285386
14399 9285386 9358411 9556847 9874872 9910571 10124815 10089075 10070114 10189365 10406320 11088797
$$ packed form
14469C986561L2227k14428K7740o2655K41914q0797L15440j60191K86038k57778
14459D114071J6433K82357j39606j03457k6456J39704N979J74160O9524p7719
14449D454990K42833j6814l45221O98211l01348j55953L17239K88980K73513j74639
14439E281791j19779N25398L8901O1692k39353J55513J64129k23774J87332J88927
14429F020777k44325L69848K55029J23273l60482J19941M58041m467P1587J34472
14419F943694Q3811j90680O74127k27803K29873j57347J97467J90049M09341l35632
14409G816900N34409k39007J06303J33619J31556K08812k25459N14783O5832K37638
14399I285386P3025J98436L18025L5699K14244l5740j8961J19251K16955O82477
$$ plain form
14389 11088797 11553509 11436516 11684484 11745649 11935725 11793980 12363089 12677311 12876068
14380 12876068 12661602 13284712 13513580 13697536 13984245 14111837 14607196 14815347 15010880
14371 15010880 15176908 15582721 15829203 16037600 16582351 17030093 17377970 17835120 18110782
14362 18110782 18472824 18976597 19012785 19545901 19972688 20461021 20867481 21484011 21699969
14353 21699969 22369916 22853161 23774247 24236891 24542610 25232361 26016586 26589621 27367068
14344 27367068 28151986 28524260 29363272 30114800 30771316 31809480 33072101 33647948 34740527
14335 34740527 35601363 36587339 37576740 38838281 40119529 41345727 42841368 43826234 45203047
14326 45203047 46797636 48824911 50262914 51880959 53587078 55486920 57700793 59281167
$$ packed form
14389A1088797M64712j16993K47968O1165J90076j41745N69109L14222J98757
14380A2876068k14466O23110K28868J83956K86709J27592M95359K08151J95533
14371A5010880J66028M05813K46482K08397N44751M47742L47877M57150K75662
14362A8110782L62042N03773L6188N33116M26787M88333M06460O16530K15958
14353B1699969O69947M83245R21086M62644L05719O89751P84225N73035P77447
14344B7367068P84918L72274Q39012P51528O56516J038164J262621N75847J092579
14335C4740527Q60836R85976R89401J261541J281248J226198J495641R84866J376813
14326D5203047J594589K027275J438003J618045J706119J899842K213873J580374
$$ plain form
14318 59281167 62043749 64133106 67031979 69222837 71702368 74583972 77654102 81195788
14310 81195788 84495361 88379991 92020798 96277846 100459910 105065855 109733620 115232843
14302 115232843 120371973 126185908 132295804 138859919 146048480 153713968 161397796 170002211
14294 170002211 179066974 188142983 198601206 209183033 220555519 232686519 244991739
14287 244991739 258395797 272218672 286536408 301517622 316848570 332526393 348176667
14280 348176667 363841603 379460241 394581071 408688220 422032112 433313907 443017477
14273 443017477 448557919 450596561 450603780 448889039 446671637 443514558 440580983 434784561
14265 434784561 426915537 416829911 404791472 391656829 376840221 361075805 344709547
$$ packed form
14318E9281167K762582K089357K898873K190858K479531K881604L070130L541686
14310H1195788L299573L884630L640807M257048M182064M605945M667765N499223
14302A15232843N139130N813935O109896O564115P188561P665488P683828Q604415
14294A70002211R064763R076009J0458223J0581827J1372486J2131000J2305220
14287B44991739J3404058J3822875J4317736J4981214J5330948J5677823J5650274
14280C48176667J5664936J5618638J5120830J4107149J3343892J1281795R703570
14273D43017477N540442K038642P219j714741k217402l157079k933575n796422
14265D34784561p869024j0085626j2038439j3134643j4816608j5764416j6366258
$$ plain form
14258 344709547 328935806 312914043 297328840 282065448 267265582 253037776 239882713
14251 239882713 228932503 217868474 206314941 195749761 185263331 175767588 167034622
14244 167034622 158793814 151417115 144010990 136709125 130287557 124220508 119229770 113638569
14236 113638569 108495843 103589825 99102528 94607062 91300450 87817699 84132450 80371908
14228 80371908 77182189 74205228 71366672 68985624 66283888 63871418 61466249 59462341
14220 59462341 57593114 55636739 53783519 52291818 50261691 48308633 47404884 45955610
14212 45955610 44391659 42755671 41692551 40475140 39450395 38734700 37400285 36465878
14204 36465878 34925780 34068634 32874769 32421460 31522541 30525849 29916168 28861548 28070849
$$ packed form
14258C44709547j5773741j6021763j5585203j5263392j4799866j4227806j3155063
14251B39882713j0950210j1064029j1553533j0565180j0486430r495743q732966
14244A67034622q240808p376699p406125p301865o421568o067049m990738n591201
14236A13638569n142726m906018m487297m495466l306612l482751l685249l760542
14228H0371908l189719k976961k838556k381048k701736k412470k405169k003908
14220E9462341j869227j956375j853220j491701k030127j953058r03749j449274
14212D5955610j563951j635988j063120j217411j024745p15695j334415r34407
14204C6465878j540098q57146j193865m53309q98919r96692o09681j054620p90699
$$ plain form
14195 28070849 27783443 27158181 26423240 25508153 24985466 24176877 23410049 23134825 22367632
14186 22367632 22116711 21239379 21003918 20968531 20352385 19678247 19435830 18862684 18569223
14177 18569223 18335294 17640013 17421711 17139117 16510974 16313816 15849121 15974104 15341074
14168 15341074 15239375 14746098 14346759 14342391 14036341 13274680 13547301 13188890 12885992 12982692
14158 12982692 12721966 12288065 11838747 11648000 11451820 11519212 11258103 11020695 10832186
14149 10832186 10965232 10637039 10481801 10223180 10126812 10157551 9998566 9494004 9779891 9562607
14139 9562607 9352883 9075680 8793324 9026520 8874250 8469447 8375945 8476781 8176066 8008493
14129 8008493 8061244 7786021 7922865 7606503 7850515 7513239 7661223 7112069 7177510 7064682
$$ packed form
14195B8070849k87406o25262p34941r15087n22687q08589p66828k75224p67193
14186B2367632k50921q77332k35461l5387o16146o74138k42417n73146k93461
14177A8569223k33929o95281k18302k82594o28143j97158m64695J24983o33030
14168A5341074j01699m93277l99339m368l06050p61661K72621l58411l02898R6700
14158A2982692k60726m33901m49318j90747j96180O7392k61109k37408j88509
14149A0832186J33046l28193j55238k58621r6368L0739j58985n04562K85887k17284
14139I562607k09724k77203k82356K33196j52270m04803r3502J00836l00715j67573
14129H008493N2751k75223J36844l16362K44012l37276J47984n49154O5441j12828
$$ plain form
14119 7064682 7159388 6908209 7118225 6765422 6496765 6547714 6303320 6500078 6698311 6419024
14109 6419024 6140501 5924991 6188052 5911584 5834305 5668052 5698254 5877714 5403990 5550163
14099 5550163 5401659 5388750 5425784 5088269 5207148 5256417 5108616 5350128 5000463 4890821
14089 4890821 4742936 4702942 4812942 4797517 4747755 4743465 4322854 4421997 4170395 4249443 4359732
14078 4359732 4527780 4141701 4091685 4107867 3993894 4273699 4179227 3998731 3968058 4036161
14068 4036161 3644360 3801486 3504878 3762612 3842092 3606578 3672420 3726097 3279947 3418654
14058 3418654 3707486 3356547 3511023 3101056 3329152 3567478 3412330 3053875 3341256
14049 3341256 2962423 3120994 3113227 2991749 3016414 3109757 2996589 2785719 2956340 3020233
$$ packed form
14119G064682R4706k51179K10016l52803k68657N0949k44394J96758J98233k79287
14109F419024k78523k15510K63061k76468p7279j66253L0202J79460m73724J46173
14099E550163j48504j2909L7034l37515J18879M9269j47801K41512l49665j09642
14089D890821j47885l9994J10000j5425m9762m290m20611R9143k51602P9048J10289
14078D359732J68048l86079n0016J6182j13973K79805r4472j80496l0673O8103
14068D036161l91801J57126k96608K57734P9480k35514O5842N3677m46150J38707
14058C418654K88832l50939J54476m09967K28096K38326j55148l58455K87381
14049C341256l78833J58571p767j21478K4665R3343j13168k10870J70621O3893
$$ plain form
14039 3020233 2770860 2834512 2897501 2927918 2768860 3012694 2817179 2773025 2879748 2910163
14029 2910163 2584426 2878034 2821976 2735691 2673418 2530063 2335466 2479191 2788276 2320464
14019 2320464 2350531 2261871 2304330 2261505 2231831 2211119 2185414 2238175 2374608 2178549 2221772
14008 2221772 2152242 2339935 2213028 1867528 1939121 2007198 2098806 1873857 2132584 1951429
13998 1951429 1933754 1516758 2146719 2082922 1739088 1924165 2034466 2078281 2514012 3537031
13988 3537031 6218502 13445120 31657432 38386901 24415504 14096033 8214582 5890955
13980 5890955 4851859 3720547 3170318 3217278 2735390 2726615 2563422 2526630 2621044 2479495
13970 2479495 2660176 2285617 2285934 2459514 2001126 2205197 2094652 2137723 1856432 2055197
$$ packed form
14039C020233k49373O3652O2989L0417j59058K43834j95515m4154J06723L0415
14029B910163l25737K93608n6058q6285o2273j43355j94597J43725L09085m67812
14019B320464L0067q8660M2459m2825k9674k0712k5705N2761J36433j96059M3223
14008B221772o9530J87693j26907l45500P1593O8077R1608k24949K58727j81155
13998A951429j7675m16996O29961o3797l43834J85077J10301M3815M35731J023019
13988C537031K681471P226618J8212312O729469j3971397j0319471n881451k323627
13980E890955j039096j131312n50229M6960m81888q775j63193l6792R4414j41549
13970B479495J80681l74559L17J73580m58388K04071j10545M3071k81291J98765
$$ plain form
13960 2055197 1956439 1664571 1953715 2111964 1825744 2131546 1779124 1679452 1445843 1663084
13950 1663084 1766354 1843939 1724131 1855038 1563229 1766843 1794635 1710906 1684417 1255374
13940 1255374 1519479 1968764 1514390 1537354 1863589 1503763 1530697 1643257 1497495 1331554
13930 1331554 1283057 1551406 1414524 1368789 1585418 1403502 1354545 1510603 1598889 1417260
13920 1417260 1230850 1353641 1427758 1694511 1300527 1411333 1584503 1251427 1325216 1147596
13910 1147596 1296845 1471036 1316607 1262596 1324319 1443595 1234192 1128937 1138624 1263291
13900 1263291 1222162 963167 1217479 1264949 1112960 1224725 1045379 1188463 1281184 1017422
13890 1017422 1419812 1179076 1060663 1119682 1251580 870037 1004843 1181446 1093633 1159379
$$ packed form
13960B055197r8758k91868K89144J58249k86220L05802l52422r9672k33609K17241
13950A663084J03270P7585j19808J30907k91809K03614K7792q3729k6489m29043
13940A255374K64105M49285m54374K2964L26235l59826K6934J12560j45762j65941
13930A331554m8497K68349j36882m5735K16629j81916m8957J56058Q8286j81629
13920A417260j86410J22791P4117K66753l93984J10806J73170l33076P3789j77620
13910A147596J49249J74191j54429n4011O1723J19276k09403j05255R687J24667
13900A263291m1129k58995K54312M7470j51989J11765j79346J43084R2721k63762
13890A017422M02390k40736j18413N9019J31898l81543J34806J76603q7813O5746
$$ plain form
13880 1159379 1226855 1293894 1156767 1063314 950332 1042033 1038449 1114253 1174544 932244 1213713
13869 1213713 1082349 1015928 1158539 1214249 1462919 1074059 1013674 1106481 1287277 956856
13859 956856 866542 959093 975677 1030168 1025638 981361 915984 1143282 1094536 813028 1343728
13848 1343728 727924 934237 1101772 894130 668770 942610 913132 785898 998741 897020
13838 897020 1013645 875240 820449 784940 875557 732216 896960 536835 777375 1145780
13828 1145780 926379 722793 1029088 934150 792010 674900 1017760 678026 852875 757279
13818 757279 619774 850703 860230 1158132 882232 1081279 556398 560829 918316 895464
13808 895464 800553 786462 841166 568950 871830 508248 993126 471338 665595 716526
$$ packed form
13880A159379O7476O7039j37127r3453j12982R1701l584P5804O0291k42300K81469
13869A213713j31364o6421J42611N5710K48670l88860o0385R2807J80796l30421
13859I56856r0314R2551J6584N4491m530m4277o5377K27298m8746k81508N30700
13848A343728o15804K06313J67535k07642k25360K73840k9478j27234K12843j01721
13838H97020J16625j38405n4791l5509R0617j43341J64744l60125K40540L68405
13828A145780k19401k03586L06295r4938j42140j17110L42860l39734J74849r5596
13818G57279j37505K30929R527K97902k75900J99047n24881M431L57487k2852
13808H95464r4911j4091N4704k72216L02880l63582M84878D71338J94257N0931
$$ plain form
13798 716526 822823 881413 756208 584778 796089 805770 322756 609058 757377 330337
13787 789824 887403 723342 790677 962804 685913 870427 380637 698166 567718 704640
13777 704640 442840 692689 624800 794731 716203 785584 354796 678903 871574 809359
13767 809359 618821 739672 555390 891826 555711 696473 684742 790950 648930 719160
13757 719160 511192 641547 723160 665091 462054 731344 743927 746128 762512 506615 642243
13746 642243 651203 556699 856980 664442 431458 627505 121504 418539 264779 355914
13736 355914 661317 670634 476042 314972 234411 655120 640170 462426 698092 453010
13726 453010 491350 381420 286746 360201 469307 530944 795025 684138 617560 318213
$$ packed form
13798G16526J06297N8590j25205j71430K11311R681C22756K86302J48319C30337
13787G89824R7579j64061O7335J72127k76891J84514C80637L17529j30448J36922
13777G04640k61800K49849o7889J69931p8528O9381C54796L24107J92671o2215
13767H09359j90538J20851j84282L36436l36115J40762j1731J06208j42020P0230
13757G19160k07968J30355Q1613n8069k03037K69290J2583K201J6384k55897J35628
13746F42243Q960r4504L00281j92538k32984J96047A21504K97035j53760R1135
13736C55914L05403R317j94592j61070q0561M20709j4950j77744K35666k45082
13726D53010L8340j09930r4674P3455J09106O1637K64081j10887o6578k99347
$$ plain form
13716 318213 674860 245479 327853 497837 672802 814880 730005 539460 48355 504016
13706 504016 918307 482889 380594 677779 460990 424583 481618 699992 667753 455231
13696 455231 111207 496439 599208 530665 477282 230387 530890 550618 392002 180749
13685 618021 471772 579324 333810 249717 553321 659098 633421 812393 503593 437589
13675 437589 539321 382237 343109 352386 448722 240638 545629 560548 524643 431047 893605
13664 893605 544754 525526 493418 442664 158811 466223 562089 637516 580017 426790 263052
13653 263052 433755 522537 397768 224550 401798 696731 289567 459167 387710 347159
13643 347159 270893 312731 249083 434373 375407 319498 440442 365639 402714 530366 255882
$$ packed form
13716C18213L56647B45479Q2374J69984J74965J42078q4875j90545D8355M55661
13706E04016M14291m35418j02295K97185k16789l6407N7035K18374l2239k12522
13696D55231A11207L85232J02769o8543n3383B30387L00503J9728j58616A80749
13685F18021j46249J07552k45514q4093L03604J05777k5677J78972l08800o6004
13675D37589J01732j57084l9128R277R6336k08084L04991J4919l5905r3596M62558
13664H93605l48851j9228l2108n0754A58811L07412R5866P5427n7499j53227j63738
13653B63052J70703Q8782j24769j73218J77248K94933B89567J69600p1457m0551
13643C47159p6266M1838o3648J85290n8966n5909J20944p4803L7075J27652B55882
$$ plain form
13631 584046 99046 312414 167148 265011 291770 250282 267236 495775 571983 476340 553954
13620 553954 521464 397348 216020 305788 505953 376002 247887 222496 368891 192218
13610 192218 101525 161555 536005 688594 303143 285559 388675 204271 238943 425897
13600 425897 279733 394841 499851 272162 794224 295709 716454 175574 397994 362493
13590 362493 244269 339441 100370 329046 288791 152931 702671 360313 258392 285952
13580 285952 376275 298478 228879 696044 440350 111145 317843 234811 382693 302831
13570 302831 90549 402013 176079 281880 89895 308576 176488 355728 437086 113207
13559 157694 -61041 266903 271995 106736 458622 101374 164925 394845 352522 247370
$$ packed form
13631E84046I9046K13368j45266R7863K6759m1488J6954K28539P6208r5643P7614
13620E53954l2490j24116j81328Q9768K00165j29951j28115k5391J46395j76673
13610A92218r0693O0030L74450J52589C03143j7584J03116j84404L4672J86954
13600D25897j46164J15108J05010k27689N22062B95709M20745A75574K22420l5501
13590C62493j18224R5172A00370K28676m0255j35860N49740l42358j01921K7560
13580B85952R0323p7797o9599M67165k55694A11145K06698q3032J47882p9862
13570C02831I0549L11464A76079J05801H9895K18681j32088J79240Q1358A13207
13559A57694f1041B66903N092A06736L51886A01374O3551K29920m2323j05152
$$ plain form
13549 247370 591621 419418 28413 158013 689034 275192 296342 244704 643525 106124
13538 262676 314928 487827 449714 439616 236030 120452 271030 454514 183030 218013
13528 218013 532176 144521 251373 372993 428383 -38590 635658 299998 359898 404053
13518 404053 24542 583556 211498 63027 282051 187731 115222 396145 342938 427414 651077
13507 651077 360390 555074 130495 387205 399220 300167 312931 230766 223217 374698 133373
13495 75711 289494 273845 151140 117445 273339 96944 376699 8943 498567 50297 161293
13484 161293 460690 -41749 491853 -100358 -127737 484269 458130 294963 160967 551015
13474 551015 333797 -211213 101025 184462 199182 219108 234722 171609 493218 531580 136964
$$ packed form
13549B47370L44251j72203B8413J29600N31021B75192K1150n1638L98821A06124
13538B62676N2252J72899l8113j0098k03586j15578J50578J83484A83030L4983
13528B18013L14163A44521J06852J21620N5390c8590F35658B99998N9900M4155
13518D04053B4542N59014B11498F3027K19024r4320p2509K80923n3207Q4476K23663
13507F51077k90687J94684A30495K56710J2015r9053J2764q2165p549J51481A33373
13495G5711K13783j5649j22705l3695J55894I6944K79755H943M89624E0297J10996
13484A61293K99397d1749D91853a00358k7379D84269k6139j63167j33996L90048
13474E51015k17218b11213A01025Q3437J4720J9926J5614o3113L21609L8362A36964
$$ plain form
13462 -170812 261937 -7924 58218 191024 -122417 78043 -207015 190330 -130640 139069
13451 230296 69025 156989 184552 -49264 449110 399878 353658 81488 -34631 292217 233991
13440 233991 317406 244948 268025 -97762 166115 464400 272876 153073 217226 280375 442716
13429 442716 394497 157128 186367 25231 178452 153630 110197 136578 161914 189011 343451
13418 343451 45532 309199 303577 562232 180473 333199 166193 470397 295921 200109
13408 200109 487940 371353 342010 148088 -165609 180662 -12111 -130270 497723 241779
13397 176428 204012 94639 86828 453576 97303 296817 77273 2865 248483 368489 15628
13385 326855 176465 -79464 630465 60232 25752 -148295 22632 32249 103976 182224 423418
$$ packed form
13462a70812B61937g924E8218J32806a22417G8043b07015A90330a30640A39069
13451B30296F9025Q7964K7563d9264D49110m9232m6220H1488c4631B92217n8226
13440B33991Q3415p2458K3077i7762A66115K98285j91524j19803O4153O3149J62341
13429D42716m8219A57128K9239B5231J53221k4822m3433K6381K5336K7097J54440
13418C43451D5532K63667n622K58655A80473J52726A66193L04204j74476r5812
13408B00109K87831j16587k9343A48088a65609A80662a2111j18159D97723B41779
13397A76428K7584I4639p811L66748I7303J99514G7273B865K45618J20006A5628
13385C26855j50390g9464F30465F0232B5752a48295B2632R617P1727P8248K41194
$$ plain form
13374 423418 171331 -32262 281271 10644 101598 302516 235299 437314 340739 305183 2885
13362 371058 69362 200449 235299 234876 327744 138074 -93970 308841 71579 37075 384299
13351 384299 19029 289563 85870 444767 424376 184264 151144 616125 214763 55118
13340 204521 215505 49847 91431 99314 163398 177735 379371 -196167 152328 359815 388204
13329 388204 281616 151207 190492 262949 22528 136782 353008 56766 58792 324943 106056
13317 14315 -92453 224366 413020 336180 -59310 112059 204663 197504 206352 -146872 106158
13305 100406 465859 454329 430334 89800 101202 393106 264114 440001 15593 -109803
13294 538863 190069 281265 83555 91319 137552 145021 -89134 249243 134704 76633 183145
$$ packed form
13374D23418A71331c2262B81271A0644R0954K00918o7217K02015r6575l5556B885
13362C71058F9362J31087L4850m23R2868A38074i3970C08841G1579l4504L47224
13351C84299A9029K70534H5870L58897k0391A84264l3120M64981B14763E5118
13340B04521J0984D9847M1584P883O4084J4337K01636a96167A52328K07487K8389
13329C88204j06588j30409L9285P2457B2528J14254K16226E6766K026K66151A06056
13317A4315i2453B24366J88654p6840e9310A12059R2604p159Q848a46872A06158
13305A00406L65453j1530k3995H9800J1402K91904j28992J75887A5593a09803
13294E38863A90069R1196H3555P764M6233P469h9134B49243j14539n8071J06512
$$ plain form
13283 183145 512654 359410 -164621 92693 99404 413234 109042 -125103 289359 121098
13272 494455 -37199 261117 223265 -183028 76262 15848 -197712 -49779 134467 468400
13262 468400 125449 264099 190217 70393 249632 220246 218109 59366 362021 19943 291567
13251 291567 -48008 -23033 135723 -37323 132664 213699 168224 318683 -201257 -170119 -136198
13240 -136198 -140039 -177246 -70392 144059 130094 97319 164848 106335 249181 179185 56514
13228 258403 -177543 421238 251595 -35035 269544 239151 223490 195270 -93486 435355
13217 -150941 32753 -154638 321724 35031 24954 3805 329272 -37517 -329719 21620 141018
13206 141018 -57657 236003 15033 226302 44201 24719 193305 111626 -11664 391603 -94228
$$ packed form
13283A83145L29509j53244a64621I2693O711L13830A09042a25103B89359A21098
13272D94455c7199B61117l7852a83028G6262A5848a97712d9779A34467L33933
13262D68400A25449J38650p3882G0393J79239k9386k137E9366L02655A9943K71624
13251B91567d8008b3033A35723c7323A32664Q1035m5475J50459b01257L1138L3921
13240a36198l841l7207g0392A44059j3965l2775O7529n8513J42846o9996E6514
13228B58403a77543D21238j69643c5035B69544l0393j5661k8220i3486D35355
13217a50941C2753a54638C21724C5031j0077C805L25467c7517k92202B1620J19398
13206A41018e7657B36003A5033K11269D4201j9482J68586q1679a1664C91603i4228
$$ plain form
13194 -19184 88189 -117455 167029 -123785 216281 248845 -64916 113599 376496 396404
13184 396404 -29593 137927 -226388 -182936 290522 112950 88823 45289 43150 75142 -10598
13172 300723 21748 51968 188323 122702 347789 11226 86082 -28950 338917 -166324 179488
13160 -22621 -160056 -68781 31106 -113379 310664 94818 190557 93527 107217 -99394 -266008
13149 -266008 -123107 327399 188464 70484 61740 -47620 152134 -218349 48119 108509 -273467
13137 44872 258520 205492 -9025 -96020 130946 341672 -18824 -84682 -35462 36659 -54722
13125 39674 220693 -21581 -159785 -39555 321007 377136 48417 27093 244635 196005 218794
13114 218794 191001 21927 222430 -39 269071 132853 -524911 289705 150503 122764 276849
$$ packed form
13194a9184H8189a17455A67029a23785B16281L2564f4916A13599K62897J9908
13184C96404b9593A37927b26388M3452B90522A12950k4127m3534k139L1992a0598
13172C00723B1748L0220J36355o5621K25087A1226P4856b8950C38917a66324A79488
13160b2621j37435f8781C1106a13379C10664I4818R5739I3527J3690i9394j66614
13149b66008a23107C27399j38935G0484q744d7620A52134b18349D8119O0390b73467
13137D4872K13648n3028i025q6995A30946K10726a8824o5858c5462C6659e4722
13125C9674J81019b1581j38204c9555C21007N6129D8417k1324K17542m8630K2789
13114B18794k7793B1927K00503c9B69071A32853e24911B89705j39202k7739J54085
$$ plain form
13103 276849 161724 199129 -71466 190561 -55201 320868 40737 36488 -49069 -14071 22752
13091 -68746 234791 416529 98208 -273617 104714 -25372 -156693 -93922 418234 243276
13081 243276 519241 -31129 118890 291813 48691 127068 101721 328107 128819 224469
13071 224469 191782 34309 -74641 222440 -33877 1441 -142928 134114 -157168 4519 -52117
13059 327109 221673 53641 86754 102035 -323210 253558 176208 326070 -32250 -199421
13049 -199421 113112 148684 155432 229628 230433 -180103 219368 -134292 221100 -190999 40795
13037 -217177 1307 184482 292366 106270 -77318 -194842 218880 41162 270211 408534
13027 408534 101138 109563 -78609 -269654 -181052 283833 28325 177677 287164 -81709 79504
$$ packed form
13103B76849j15125L7405g1466A90561e5201C20868D0737m249d9069a4071B2752
13091f8746B34791J81738I8208b73617A04714b5372j31321O2771D18234j74958
13081B43276K75965c1129A18890J72923D8691P8377k5347K26386A28819R5650
13071B24469l2687C4309g4641B22440c3877A441a42928A34114a57168D519e2117
13059C27109j05436E3641L3113J5281c23210B53558p7350J49862c2250j67171
13049a99421A13112L5572O748P4196Q05a80103B19368a34292B21100a90999D0795
13037b17177A307J83175J07884A06270g7318j17524B18880D1162K29049J38323
13027D08534A01138Q425g8609j91045Q8602B83833B8325J49352J09487h1709G9504
$$ plain form
13015 92260 204440 -406863 290021 -15321 131811 -173313 128739 365736 124321 54759
13004 91035 234873 -120860 -350615 140085 100161 141272 76757 -225691 43105 196329
12994 196329 -17750 36886 381136 173289 224764 62606 66782 124949 183674 103145 73243
12983 73243 -61273 -329732 239942 571362 109497 173253 -135883 119046 19295 -285971
12972 -98013 4986 93328 -152807 243221 117635 -59050 -27514 -91777 167780 81098 360069
12961 360069 69874 194478 -53099 -42863 193873 307631 200941 316394 -120143 -106771
12951 -106771 70008 248449 -10538 353105 57977 -73202 131153 -74813 -64799 -23336 9170
12939 70489 43743 166079 368929 251752 245899 -34184 -82420 37366 50965 203955 -113998
$$ packed form
13015I2260J12180d06863B90021a5321A31811a73313A28739K36997A24321E4759
13004I1035J43838a20860k29755A40085l9924M1111o4515b25691D3105J53224
12994A96329a7750C6886L44250A73289N1475F2606M176N8167N8725q0529k9902
12983G3243f1273k68459B39942L31420A09497O3756a35883A19046A9295b85971
12972i8013D986Q8342a52807B43221A17635e9050b7514o4263A67780H1098K78971
12961C60069F9874J24604e3099J0236A93873J13758j06690J15453a20143J3372
12951a06771G0008J78441a0538C53105E7977g3202A31153g4813J0014b3336I170
12939G0489k6746J22336K02850j17177n853c4184m8236C7366J3599J52990a13998
$$ plain form
12927 -133647 118416 -94908 365197 32964 317743 -254393 14402 175188 -98700 180492
12916 10090 -9965 -100653 -140765 15992 -8798 -85600 297948 -183106 332919 154575 140157
12905 140157 -150962 42241 -151031 -1822 9875 -122665 -42461 -136805 320450 -12307 124119
12893 -188816 -22027 -23420 50148 -34759 220380 228741 47193 44779 100666 328475 404273 98027
12880 90241 -5830 -200513 206638 203873 173427 102475 359097 -157315 318208 -70639 197121
12868 266707 2438 313813 -22023 -19905 -140264 -21696 119309 -43969 220630 4151 -42229
12856 -70517 105101 196653 360605 -108539 142386 140540 -124173 228856 -201290 110875
12845 -564793 239210 295617 -241961 145800 -26525 39702 -378356 283229 104984 -308446
$$ packed form
12927a33647A18416i4908C65197C2964K84779b54393A4402J60786i8700A80492
12916A0090i965r0688m0112A5992h798p6802B97948a83106C32919A54575j4418
12905A40157a50962D2241a51031a822I875a22665d2461r4344C20450a2307A24119
12893a88816b2027j393E0148c4759B20380Q361D7193k414N5887K27809P5798I8027
12880I0241e830j94683B06638k765l0446p0952K56622a57315C18208g0639A97121
12868B66707B438L11375b2023K118j20359b1696A19309d3969B20630D151d2229
12856g0517A05101R1552J63952a08539A42386j846a24173B28856b01290A10875
12845e64793B39210N6407b41961A45800b6525C9702c78356B83229A04984c08446
$$ plain form
12834 -281396 -199771 -163384 -21327 53125 200021 -194341 133195 42382 -25497 -202242 259049
12822 235729 222530 143090 292830 -10509 -39797 38072 115155 68405 102385 305363 2280
12810 17322 -188034 -57528 85712 -255731 -19365 -385947 20889 36290 -215806 53056 270811
12799 270811 -260754 318280 -47917 40734 -91297 137518 520664 427753 150834 -187594
12788 308635 -225745 -44744 -114007 144329 -2411 102203 116072 -13983 194059 -54186 188972
12776 -161225 149109 78339 220848 136098 165276 214003 -135976 217389 77932 112676 359042
12765 359042 289347 200418 185352 -347708 -54677 -90480 100146 262155 -518773 94496 304324
12754 304324 14318 138085 -132318 -179360 -281002 39225 -70045 311154 -208675 -284119
$$ packed form
12834b81396Q1625L6387b1327E3125J46896a94341A33195D2382b5497j76745B59049
12822B35729j3199p9440J49740a0509k9288C8072P7083m6750L3980K02978B280
12810A7322a88034e7528H5712b55731a9365l66582B0889J5401b15806E3056K17755
12799B70811b60754C18280d7917D0734i1297A37518L83146r2911A50834a87594
12788C08635b25745d4744o9263A44329b411A02203J3869a3983A94059e4186A88972
12776a61225A49109p0770J42509q4750K9178M8727a35976B17389G7932L4744K46366
12765C59042o9695q8929j5066c47708e4677l5803A00146J62009e18773I4496K09828
12754C04324A4318J23767a32318m7042j01642C9225g0045C11154b08675p5444
$$ plain form
12744 -284119 25865 -171003 -93208 244878 5668 -14831 -79191 96545 14722 -34368 97421
12732 -109935 59082 76293 -36971 -77140 76529 272983 -32546 -148896 -47650 138249 -83272
12720 215902 -307410 127970 -43489 180451 -62036 -60104 185482 -94914 86756 184022 -75573
12708 97632 -190443 -215952 -44644 -105327 198223 243923 218530 19308 -64981 -101718 262884
12696 -78878 61523 145160 104881 114329 146318 34888 8925 134370 282760 -30974 113424
12684 326745 197764 -236596 -76642 139973 -224558 155519 128273 -7400 -286769 -156999
12674 -156999 174418 -140495 -229431 -93419 -290818 -109503 170587 2055 40107 -8498 160476
12662 -182341 255640 89241 -99592 24515 172373 -55043 7000 -20980 324602 -220689 86743
$$ packed form
12744b84119B5865a71003P7795B44878E668a4831o4360I6545A4722c4368I7421
12732a09935E9082J7211c6971m0169G6529J96454c2546j16350d7650A38249h3272
12720B15902c07410A27970d3489A80451f2036J932A85482i4914H6756R7266g5573
12708I7632a90443k5509d4644o0683A98223M5700k5393A9308f4981l6737B62884
12696g8878F1523Q3637m0279R448L1989C4888H925J25445J48390c0974A13424
12684C26745j28981b36596g6642A39973b24558A55519k7246g400k79369J29770
12674a56999A74418a40495q8936i3419j97399a09503A70587B055L8052h498A60476
12662a82341B55640H9241i9592B4515J47858e5043G000b0980C24602b20689H6743
$$ plain form
12650 443629 164341 23734 296849 -22392 3571 -247019 -108021 6136 249969 101437 5783
12638 56089 -187765 -248570 25466 169133 34786 166396 222542 -85230 -136102 101114 134439
12627 134439 -197841 367827 148022 145880 -67388 344854 130112 259108 5054 334939
12617 334939 190168 104852 375080 -50263 -68387 -112959 -171467 -171019 258167 -108597 404266
12605 -33416 132365 131085 -78363 7107 -93377 255661 343698 423661 236529 134954 286909
12594 286909 3427 185206 -132865 -228320 370291 322595 -32250 159237 165230 -112243 69015
12582 24094 -31900 -213764 -92855 10361 103781 -11721 -192066 -141842 121487 -6245 -143088
12571 -143088 67091 -2425 399621 -143030 -300903 85026 91123 -81242 -33063 -32464 60547 -27422
$$ packed form
12650D43629A64341B3734K73115b2392C571b47019a08021F136K43833A01437E783
12638E6089a87765o0805B5466J43667C4786J31610N6146h5230n0872A01114L3325
12627A34439a97841C67827A48022k142f7388C44854A30112J28996E054L29885
12617C34939j44771q5316K70228e0263j8124m4572n8508M48B58167a08597D04266
12605c3416A32365j280g8363G107i3377B55661Q8037P9963j87132j01575J51955
12594B86909C427J81779a32865r5455C70291m7696c2250A59237N993a12243F9015
12582B4094c1900j81864i2855A0361R3420a1721j80345N0224A21487f245j36843
12571a43088F7091b425C99621a43030j57873H5026O097h1242c3063N99F0547b7422
$$ plain form
12558 -151390 -217327 2464 -180690 5234 -65207 -209521 -69888 109709 32633 -210171 -32693
12546 -98188 180525 -180356 236242 -66790 216096 -89710 96958 -60160 171481 227108 22373
12534 41385 40016 20712 53062 11239 216610 175938 110807 171166 5058 -251635 -167340 56469
12521 97823 -155736 385172 -146426 36843 -451084 -26758 252160 100098 -132257 -118341
12511 -118341 97832 307134 121853 -358161 -24527 61237 -35820 -61690 90749 160589 -48281
12499 209860 273276 3927 269150 73891 -145365 362539 47694 169751 229770 58854 110875
12488 110875 99637 115791 177457 -206514 -202314 113485 -131801 -112261 137513 -265139 -22902
12476 -77219 202090 95185 -110975 93772 -147699 352026 -206522 -58742 145708 -91972
$$ packed form
12558a51390o5937B464a80690E234f5207j44314f9888A09709C2633b10171c2693
12546i8188A80525a80356B36242f6790B16096h9710I6958f0160A71481N5627B2373
12534D1385j369j9304L2350A1239K05371m0672o5131O0359E058b51635Q4295E6469
12521I7823a55736C85172a46426C6843d51084b6758B52160A00098a32257J3916
12511a18341I7832K09302A21853c58161b4527F1237c5820k5870I0749O9840d8281
12499B09860O3416C927K65223G3891a45365C62539D7694J22057O0019E8854N2021
12488A10875j1238J6154O1666b06514M200A13485a31801J9540A37513b65139b2902
12476g7219B02090I5185a10975I3772a47699C52026b06522e8742A45708i1972
$$ plain form
12465 -153171 65517 -25158 -241245 286130 -169294 -237425 16548 300349 -256491 302177
12454 96456 -100050 156426 -255209 -30669 136216 -39938 -66584 -373294 189219 -125903
12443 -84665 101456 10549 24131 74863 -24198 15905 -131969 235860 95806 -141183 -60370
12431 318839 301 -122265 148654 178311 90407 167788 177631 -243839 -179442 -80427 189179
12419 65914 76635 -10827 26411 68230 -231738 84917 192276 109393 -186728 -14015 32831
12407 -1680 129820 -88740 102334 157598 -126860 143847 346089 186320 -205029 18447
12396 389084 10091 -236882 63055 155624 134458 119156 4738 323638 65187 212593 -251040
12384 -60218 80955 -166800 12407 110459 -188977 -10228 189756 -46477 -127632 112569 10042
$$ packed form
12465a53171F5517b5158k16087B86130a69294o8131A6548K83801b56491C02177
12454I6456a00050A56426b55209c0669A36216c9938k6646l06710A89219a25903
12443h4665A01456A0549J3582N0732b4198A5905a31969B35860I5806a41183f0370
12431C18839C01a22265A48654K9657q7904P7381R843b43839O4397h0427A89179
12419F5914J0721a0827B6411M1819b31738H4917J07359q2883a86728a4015C2831
12407a680A29820h8740A02334N5264a26860A43847K02242j59769b05029A8447
12396C89084A0091b36882F3055R2569k1166j5302D738L18900F5187J47406b51040
12384f0218H0955a66800A2407R8052a88977a0228A89756d6477q1155A12569A0042
$$ plain form
12372 -216216 113114 305734 131837 14674 -184868 -193693 47399 -132000 -59817 14868 109628
12361 109628 357408 -44865 -99489 355985 -141775 298450 -14275 273330 70702 181480
12351 181480 228319 312324 -54121 117006 34447 266803 253389 454041 -327311 -170790
12341 -170790 131326 583 72503 234233 15600 35157 274173 33594 -104266 -246688 -126573
12330 -126573 39723 -163061 118660 17067 136700 167785 -137553 -189069 -20623 90144 -88464
12318 -71041 161725 -10266 362167 -217967 -89297 -7425 -136614 163036 -152019 157867
12307 -256474 -96241 -194911 -94871 108121 -19262 11262 -64081 -147973 287801 -111694 -118175
12296 -118175 93001 373959 143443 -298725 -47754 -8899 186152 230456 -81807 103752 -466736
$$ packed form
12372b16216A13114J92620A31837A4674a84868q825D7399a32000e9817A4868R4760
12361A09628K47780d4865n4624C55985a41775B98450a4275B73330G0702J10778
12351A81480M6839Q4005e4121A17006C4447K32356j3414K00652c27311J56521
12341a70790A31326E83P1920J61730A5600J9557K39016C3594a04266j42422J20115
12330a26573C9723a63061A18660A7067J19633L1085a37553n1516b0623I0144h8464
12318g1041A61725a0266C62167b17967h9297g425j29189A63036a52019A57867
12307b56474i6241r8670i4871A08121a9262A1262f4081q3892B87801a11694o481
12296a18175I3001K80958A43443b98725d7754h899A86152M4304h1807A03752d66736
$$ plain form
12284 115360 224327 44152 70156 92241 -164619 139614 -32021 65423 -65754 -47887 117841
12272 -92411 99244 36848 25431 59044 49659 266424 132731 -203909 122939 -86525 111214
12260 128222 120630 -96282 413563 -144238 210476 -186614 -104670 442684 253513 -72203
12249 2373 144206 332852 180196 219472 163561 -313404 249621 167885 -223338 28018 129351
12238 129351 263820 355350 -8841 -70220 149909 -56398 99746 347151 -133545 330009 -97551
12226 -154375 164984 -6165 253 665364 105598 413082 35952 307045 219874 101370 167708
12215 167708 211855 50164 124099 66547 20836 247140 -70323 -33818 219132 -180577 -92359
12204 -92359 273852 45403 77559 102779 -38180 223224 528318 183382 109445 247711 308462
$$ packed form
12284A15360J08967D4152K6004K2085a64619A39614c2021F5423f5754J7867A17841
12272i2411I9244C6848j1417L3613r385K16765A32731b03909A22939h6525A11214
12260A28222p592i6282D13563a44238B10476a86614Q1944D42684j89171g2203
12249B373J41833J88646j52656L9276n5911c13404B49621q1736b23338B8018J01333
12238A29351J34469R1530h841o1379A49909e6398I9746K47405a33545C30009i7551
12226a54375A64984f165B53O65111A05598L07484C5952K71093q7171A01370O6338
12215A67708M4147E0164P3935n7552B0836K26304g0323c3818B19132a80577Q8218
12204i2359B73852D5403L2156K5220c8180B23224L05094A83382p3937J38266O0751
$$ plain form
12193 308462 105508 -93113 -60346 114795 60401 68222 -99489 -193658 77677 380337 -156863
12181 11388 358068 12311 91935 -151923 145790 -178977 286574 147777 124052 332261
12171 332261 424307 316405 -179837 309791 105713 127300 256824 20239 40779 -70331
12160 262714 -161741 -48574 503548 42691 138116 -23708 53460 83563 83854 83345 439591 -66826
12147 234899 158150 -100445 94329 24654 -192296 182480 148142 143983 107441 -115465 220761
12135 195539 -83047 -114202 37425 225141 206558 201153 55052 -327424 62456 -187865 263390
12123 110663 234468 -16650 318194 199678 140608 -107711 224240 45607 58014 -47083
12112 -301719 2846 295888 -257790 83923 182236 -435729 -71661 -300423 143078 94789 94840
$$ packed form
12193C08462A05508i3113L2767A14795n4394P821i9489r4169G7677L02660a56863
12181A1388L46680A2311P9624a51923A45790a78977B86574j38797k3725K08209
12171C32261R2046j07902a79837C09791A05713K1587J29524B0239K0540g0331
12160B62714a61741d8574E03548D2691R5425b3708E3460L0103K91n09L56246f6826
12147B34899p6749a00445I4329B4654a92296A82480l4338m159l6542a15465B20761
12135A95539h3047l1155C7425J87716j8583n405E5052c27424F2456a87865B63390
12123A10663J23805a6650C18194j18516n9070a07711B24240D5607J2407d7083
12112c01719B846K93042b57790H3923R8313d35729g1661k28762A43078m8289N1
$$ plain form
12101 94840 -203821 -243254 148292 168406 103389 249803 -179343 379560 86593 -222013
12090 -15906 -160308 -380294 10581 -106756 -328382 -122586 -15804 -73657 18171 88808 -47752
12078 -99474 195336 108395 -210068 -73305 89653 -29268 -44064 -79287 -84272 -89439 -406153
12067 -406153 203001 82514 66163 247936 340713 -207177 288721 19005 -110467 59805
12056 63187 195831 -244097 16892 107717 90343 440300 1391132 708008 354218 250460
12046 250460 9209 -128527 -159524 178382 -108697 357694 105772 -125619 170745 -152616
12035 242816 -19213 2294 -127161 -276538 112660 -63724 -254947 -31916 205636 -73357 -216724
12024 -216724 250842 122552 161361 -88054 69994 -62691 -101732 -168177 -99398 73630 -14343
$$ packed form
12101I4840b03821l9433A48292K0114o5017J46414a79343C79560H6593b22013
12090a5906j44402k19986A0581a06756k21626a22586a5804n7853A8171P0637d7752
12078i9474A95336q6941b10068g3305H9653b9268j4796l5223m985n167l16714
12067d06153B03001H2514j6351J81773R2777b07177B88721A9005a10467E9805
12056F3187J32644b44097A6892R0825j7374L49957R50832o83124l53790j03758
12046B50460I209a28527l0997A78382a08697C57694A05772a25619A70745a52616
12035B42816a9213B294a27161j49377A12660f3724j91223c1916B05636g3357j43367
12024b16724B50842A22552L8809h8054F9994f2691l9041o6445O8779G3630a4343
$$ plain form
12012 21546 161154 115384 -40113 116621 242475 150132 -288477 -231057 -868 398112 -61392
12000 -149201 177786 80894 24321 -153746 20769 105021 -322458 64887 377941 -65926 -104485
11989 -104485 174867 167151 288009 28570 117119 -215197 287256 -8427 106808 -146054 -437957
11978 -437957 -12366 -327013 -75865 -261300 -1921 -147618 -120688 249753 85935 107896 27489
11966 -117190 -54470 -260975 -67254 -159731 -124872 304909 112202 -96919 -235348 -85002 -141614
11955 -141614 -9893 37262 38315 -193142 -82548 -154296 -92426 -58087 142516 -160445 -105245
11944 -105245 121055 3725 -86123 182214 -232906 -52300 -147790 -126692 -137920 -6100 -7964
11933 -7964 33612 247063 179393 12065 78964 -81217 -11851 117086 76082 298566 -88939
$$ packed form
12012B1546J39608m5770d0113A16621J25854r2343b88477N7420h68C98112f1392
12000a49201A77786H0894B4321a53746B0769Q4252c22458F4887L13054f5926l8559
11989a04485A74867p716J20858B8570Q8549b15197B87256h427A06808a46054k91903
11978d37957a2366l14647g5865j85435a921j45697K6930B49753H5935K1961B7489
11966a17190e4470k06505f7254r2477L4859C04909A12202i6919j38429h5002n6612
11955a41614i893C7262J053a93142h2548p1748O1870L4339A42516a60445N5200
11944a05245A21055C725h6123A82214b32906e2300r5490K1098j1228f100j864
11933g964C3612K13451o7670A2065O6899h1217a1851A17086m1004K22484h8939
$$ plain form
11921 38112 171961 -342137 151582 -258203 -6219 -132631 82257 -22178 -60441 -208129 -269782
11910 -269782 -80359 -146481 -175114 -264257 5614 -609 -276699 270685 -57265 -210870 -113699
11899 -113699 211163 -294998 59952 202273 174158 -167666 -166362 127556 -4333 -62444 242514
11887 107347 -273029 152462 -182422 181762 37819 199169 -206369 -34918 -340110 52486
11876 28304 195218 -310280 -22578 -282946 -78244 105259 -332139 -84668 -126055 8220 -20640
11864 190193 38473 -412279 37931 147923 -258327 -167567 138150 183154 -245352 131358
11853 -266917 20799 9914 -287978 188715 -82582 2937 81693 -111012 -160582 142497 -220423
11841 -180012 405 -87394 -93139 349716 -222534 -237055 -55817 -279572 57741 78271 -80720
$$ packed form
11921C8112J33849c42137A51582b58203f219j26412H2257b2178l8263j47688o1653
11910b69782h0359o6122k8633q9143E614f09k76090B70685e7265j53605R7171
11899a13699B11163b94998E9952J42321k8115a67666J304A27556d333n8111B42514
11887A07347b73029A52462a82422A81762C7819J61350b06369c4918l05192E2486
11876B8304J66914c10280b2578k60368g8244A05259c32139h4668m1387H220b0640
11864A90193C8473d12279C7931J09992b58327R0760A38150M5004b45352A31358
11853b66917B0799I914b87978A88715h2582B937P8756a11012m9570A42497b20423
11841a80012D05h7394n745C49716b22534j4521e5817k23755E7741K0530h0720
$$ plain form
11829 81267 4499 359784 -309357 3540 -156127 38426 205823 5702 -160869 -238659 -77285
11817 30828 -269435 -255785 -145278 -179129 35883 -120657 -243528 215983 162679 42401 -467228
11805 -200115 83144 30062 133631 345164 -443966 44520 -116367 -32161 -24329 172082 2038
11793 -362643 -141891 321079 211646 24807 -97152 -133321 -312705 92988 64457 -213835
11782 -76098 109530 -107709 266691 377256 -12255 -2018 -164346 58537 -58820 77328 -33577
11770 -58093 165488 86309 -262468 -62124 -15595 -128789 162409 -335108 -354136 98396 -198681
11758 -141374 -189388 -208258 -285855 -303505 -2070 119779 -70741 -40590 266517 9167 192474
11747 192474 26279 143292 165380 -230559 -304718 124425 -46065 14503 -136134 -188191 -108937
$$ packed form
11829H1267D499L55285c09357C540a56127C8426J67397E702a60869p7790g7285
11817C0828b69435J3650J10507l3851C5883a20657j22871B15983n3304D2401d67228
11805b00115H3144C0062J03569K11533d43966D4520a16367c2161P832A72082B038
11793c62643a41891C21079j09433B4807i7152l6169j79384I2988k8531b13835
11782g6098A09530a07709B66691J10565a2255b018j62328E8537e8820G7328c3577
11770e8093A65488p9179b62468f2124a5595j13194A62409c35108j9028I8396a98681
11758a41374m8014j8870p7597j7650b070A19779g0741L0151B66517I167J83307
11747A92474B6279J17013K2088b30559p4159A24425d6065A4503a36134n2057P9254
$$ plain form
11736 -108937 -162865 -315806 -152021 -91858 324693 -187908 -59496 -138000 75316 53383 -171145
11724 163680 -25512 198669 183464 -133564 -133703 55467 -382035 193830 -77883 -244112 -58479
11712 80241 -13875 189641 385764 -103209 -2121 24446 -53666 -84028 -183309 121139 -316176
11700 -16458 87018 -142171 33584 -142447 -240066 -147985 230687 155551 -64054 -140520 -563618
11689 -563618 -148105 52308 -123365 71925 270746 -60630 -230976 -52662 -29795 -44750 190694
11677 23851 65956 -22321 6227 153914 -18876 -18180 143883 -244208 -196262 109019 -57795
11665 26734 -171122 49978 -131903 29512 -316476 -196487 -6762 -151767 -106683 42252 -42084
11653 149660 36346 94499 242674 61761 17983 201913 4021 -58584 70550 -89588 -65819
$$ packed form
11736a08937n3928j52941a52021O0163C24693a87908e9496p8504G5316k1933a71145
11724A63680b5512A98669j5205a33564j39E5467c82035A93830g7883j66229e8479
11712H0241a3875A89641J96123a03209b121B4446e3666l0362r9281A21139c16176
11700a6458H7018a42171C3584a42447r7619R2081B30687p5136f4054p6466m23098
11689e63618a48105E2308a23365G1925J98821f0630j70346e2662K2867j4955A90694
11677B3851M2105b2321F227J47687a8876O96A43883b44208M7946A09019e7795
11665B6734a71122D9978a31903B9512c16476J19989f762j45005M5084D2252d2084
11653A49660C6346N8153J48175F1761A7983J83930D021e8584G0550h9588K3769
$$ plain form
11642 -65819 118189 -121940 -110046 -315196 138549 -155329 386869 -72904 -47700 92458
11631 13680 -215160 65632 -71429 76612 -136203 268292 365316 -94332 -53272 91543 9116
11619 -309763 136175 187062 76904 36717 77065 59058 -52970 125500 -301712 -233503 54537
11607 33247 121628 20276 -44249 110956 -400675 315607 128469 -329120 41440 -122435
11596 -27922 68947 240470 68958 48457 -54111 -76386 167522 -88027 -233273 -408911 -242848
11585 -242848 -57673 337404 291383 143669 -141207 239874 129301 -272854 -116735 158806
11574 60708 -91749 -87628 -189912 56030 158846 -96969 -183819 220880 -18851 -141065 -217777
11563 -217777 54455 96982 53251 -104343 16042 -364337 52154 -8972 -21766 107230 195754
$$ packed form
11642f5819A18189a21940J1894k05150A38549a55329C86869g2904K5204I2458
11631A3680b15160F5632g1429G6612a36203B68292R7024i4332M1060I1543I116
11619c09763A36175N0887G6904C6717M0348j8007e2970A25500c01712O8209E4537
11607C3247Q8381B0276d4249A10956d00675C15607A28469c29120D1440a22435
11596b7922F8947J71523F8958k0501e4111k2275A67522h8027j45246j75638J66063
11585b42848e7673C37404m6021A43669a41207B39874j10573b72854a16735A58806
11574F0708i1749M121j02284E6030J02816i6969q6850B20880a8851j22214p6712
11563b17777E4455M2527m3731a04343A6042c64337E2154h972j2794A07230Q8524
$$ plain form
11552 195754 16484 196471 64503 -243084 -55646 48374 -112271 -140365 191545 -115307
11541 -65084 27172 130373 -195 -43756 149902 -79394 195050 -184944 -159996 404260 22963
11529 261103 -14881 50443 -91591 48985 -104275 427375 21727 459 -148830 -79881 -42624
11518 -42624 72402 -54042 -21569 158123 -84687 173956 254771 219145 -334837 118694 478459
11507 478459 184541 -49800 99106 275315 -10259 -19516 3952 -157833 53578 -231923 6179
11495 316259 123573 -63511 -163691 -63892 117039 -255960 -68032 -89061 33530 19816 1836
11483 -85433 -12697 284982 114679 12200 215189 116086 36303 -70445 23236 149714 -107577
11471 -94827 -45533 139789 58090 65559 185890 -55325 176299 50718 47836 -187910 157758
$$ packed form
11552A95754A6484J79987F4503b43084e5646D8374a12271k8094A91545a15307
11541f5084B7172J03201a95m3561A49902g9394A95050a84944K4948D04260B2963
11529B61103a4881E0443i1591D8985a04275D27375B1727D59a48830O8949L7257
11518d2624G2402e4042b1569A58123h4687A73956Q0815l5626c34837A18694L59765
11507D78459A84541d9800I9106J76209a0259r257C952a57833E3578b31923F179
11495C16259A23573f3511j00180f3892A17039b55960f8032k1029C3530j3714A836
11483h5433a2697B84982A14679A2200K02989r9103C6303g0445B3236J26478a07577
11471i4827d5533A39789E8090P469J20331e5325A76299E0718k882a87910A57758
$$ plain form
11459 119829 -202885 80304 321230 -76229 -159943 -47330 16190 -60903 263074 116097 -258671
11447 97628 -79681 78738 232742 307521 -189366 -129316 -228835 195713 -181247 149632 148496
11436 148496 -115736 -218331 54697 99376 16495 -48950 -307811 48883 228118 272357 -65204
11424 -45135 195366 237080 165536 -295028 -259464 -299934 -123903 176288 -163411 -72763 -430181
11413 -430181 -34758 -14496 -40396 -110488 337395 -139708 -56849 88385 -177059 187984 63640
11401 -297977 2259 -337738 -54519 395835 26149 -59920 40416 95293 -33506 182302 -116453
11389 -196874 231658 -285302 15844 -49015 -71209 77092 196608 -84809 -380554 -284744 -304410
11378 -304410 216995 -77262 37147 101156 20629 -61180 81211 -7323 66681 -39737 -372641
$$ packed form
11459A19829b02885H0304K40926g6229q3714d7330A6190f0903B63074A16097b58671
11447I7628g9681G8738J54004P4779a89366O0050r9519A95713a81247A49632j136
11436A48496a15736j02595E4697M4679A6495d8950k58861D8883J79235M4239f5204
11424d5135A95366M1714p1544b95028L5564m0470a23903A76288a63411g2763l57418
11413d30181c4758a4496k5900p0092C37395a39708e6849H8385a77059A87984F3640
11401b97977B259c37738e4519C95835B6149e9920D0416N4877c3506A82302a16453
11389a96874B31658b85302A5844d9015k2194G7092J19516h4809k95745R5810j9666
11378c04410B16995g7262C7147O4009B0629f1180H1211g323F6681c9737l32904
$$ plain form
11367 -372641 -76138 104243 81098 -53545 36228 -136331 -86207 11544 209294 76540 -248297
11355 -169274 -147158 -106338 -218763 -139345 83469 7376 5761 55405 -80005 -104645 -39354 -169222
11343 -169222 -75839 -43764 361415 -201575 129639 -73493 273978 -272033 -175864 88238
11332 -98408 -119840 66645 62984 -322054 -170755 -335557 -9042 132612 121042 115262 181554
11321 181554 -121793 -197960 63407 -235097 -101455 209143 30438 -283281 88304 301783
11311 301783 62941 -68739 -146819 -520464 130228 107 -115898 212985 -65897 -106854 53483
11299 -129997 30457 -71324 -69460 -247265 -158724 -133099 -250955 309974 110102 225791 154284
11288 154284 162762 138745 133652 -69242 219739 -237839 152953 -171804 -34098 213588 -46787
$$ packed form
11367c72641g6138A04243k3145e3545C6228a36331N0124A1544J97750G6540b48297
11355a69274K2116M0820j12425P9418H3469G376j615M9644h0005k4640c9354j29868
11343a69222g5839L2075C61415b01575A29639g3493B73978b72033R6169H8238
11332i8408k1432F6645l661c22054J51299j64802i042A32612j1570n780O6292
11321A81554a21793p6167F3407b35097a01455B09143C0438b83281H8304K13479
11311C01783F2941f8739p8080l73645A30228A07a15898B12985f5897m0957E3483
11299a29997C0457g1324J864j77805Q8541K5625j17856C09974A10102J15689p1507
11288A54284Q478k4017n093f9242B19739b37839A52953a71804c4098B13588d6787
$$ plain form
11276 -83499 -190119 -77114 57449 59356 26599 232893 -89761 -66995 5085 -47638 -44310 -203628
11264 -203628 -67025 -319729 -147387 116491 145435 -270939 19601 291715 234994 -74314
11253 12365 61992 -24988 -106158 107022 -342191 161875 121322 -263161 286706 -26743 24345
11241 114118 69978 104794 -1228 -21593 -59574 -218913 57280 95479 -441354 -172104 172217
11229 14011 1161 36709 -151210 -143311 -191862 10355 -173734 -146277 -229775 -9293 -340966 93825
11216 30033 -132583 85023 -116429 -211722 -182407 -208792 -47241 107768 -54870 192271 47550
11204 52572 206668 211843 6867 -108829 -244671 -6456 -183097 101772 71565 -197100 -244356
11193 -244356 240340 -148118 -106283 8198 -139991 -290467 -259824 60381 -272764 -127472
$$ packed form
11276h3499j06620g7114E7449J907B6599K06294h9761K2766E085d7638L328j59318
11264b03628f7025k52704a47387A16491K8944b70939A9601K72114n6721g4314
11253A2365M9627b4988q1170A07022c42191A61875m0553b63161B86706b6743B4345
11241A14118m4140L4816a228k0365l7981j59339E7280L8199d41354a72104A72217
11229A4011A161L5548a51210P899m8551A0355a73734K7457q3498i293l31673I3825
11216C0033a32583H5023a16429r5293K9315k6385d7241A07768e4870A92271D7550
11204E2572J54096N175F867a08829j35842f456j76641A01772l0207a97100m7256
11193b44356B40340a48118M1835H198a39991j50476L0643F0381b72764a27472
$$ plain form
11182 -37832 -221581 78337 205364 -8598 18944 -74193 267772 -108282 -47782 -162500 47402
11170 220591 -243281 -118012 157213 76627 81733 -329908 -98278 -24030 -33896 -99743 -32746
11158 -152299 144208 90702 -492862 193004 11758 106781 29370 -159160 -148886 -45087 -66927
11147 -66927 184267 -172089 48632 -361132 60300 -163804 -141990 -139355 215791 -58030 30917
11135 -5817 -52417 -49942 -166088 -24548 157858 190076 254594 5099 64435 -73575 -33729 243437
11122 -37831 188631 -21027 60824 -167061 -39736 -68721 -141236 -45776 -223949 43622 -303013
11110 47649 230102 -263966 95837 69751 136945 29752 -120597 49376 69278 -8465 317608
11098 102494 -60600 -35483 -316610 127228 -93265 154966 322219 -320304 403785 -236068
$$ packed form
11182c7832j83749G8337J27027h598A8944g4193B67772a08282d7782j14718D7402
11170B20591b43281a18012A57213G6627N106c29908i8278b4030r866o5847c2746
11158a52299A44208n3506d92862A93004A1758R5023B9370a59160J0274d5087k1840
11147f6927A84267a72089D8632c61132F0300a63804K1814K635B15791e8030C0917
11135e817m6600K475j16146b4548A57858L2218O4518E099N9336g3575c3729B43437
11122c7831A88631b1027F0824a67061c9736k8985p2515d5776j78173D3622c03013
11110D7649J82453b63966I5837k6086O7194B9752a20597D9376J9902h465C17608
11098A02494f0600K5117k81127A27228i3265A54966J67253c20304D03785b36068
$$ plain form
11087 137302 192293 185282 61432 89808 -138935 127581 185830 -48794 333639 294901 8515
11075 410738 -688 188180 270965 287415 405890 655694 199225 702650 -26009 185093 170273
11064 170273 455308 155764 271306 323431 468775 289449 346491 257828 575669 259707
11053 518191 518619 682049 244899 247299 380492 712699 382074 611077 303421 464763
11043 464763 531816 417381 504137 480662 462409 393548 864343 610118 292236 293414 659569
11032 659569 496365 190643 528542 859459 581154 330542 695016 431765 434964 541741
11022 541741 548929 596191 437945 372511 703788 589422 117728 416968 616213 280810
11011 429868 499917 317243 499975 576331 143818 191476 442414 537498 454400 472763 642659
$$ packed form
11087A37302N4991p011F1432K8376a38935A27581N8249d8794C33639l8738H515
11075D10738f88A88180Q2785J6450J18475K49804A99225N03425b6009A85093j4820
11064A70273K85035A55764J15542N2125J45344j79326N7042q8663L17841B59707
11053E18191M28J63430B44899K400J33193L32207l30625K29003C03421J61342
11043D64763O7053j14435Q6756k3475j8253o8861M70795k54225B92236J178L66155
11032F59569j63204A90643L37899L30917k78305k50612L64474k63251L199J06777
11022E41741P188M7262j58246o5434L31277j14366A17728K99240J99245B80810
11011D29868P0049j82674J82732P6356A43818M7658K50938R5084q3098J8363J69896
$$ plain form
11000 642659 738813 375510 548966 326472 277742 516103 509738 473448 589723 737723
10990 737723 285007 484881 464154 429634 640809 1010653 606570 745745 797601 777540
10980 777540 666869 990409 1354662 1167187 1567512 1496924 2070147 2212175 2305291 2353076
10970 2353076 2232739 2078581 1942257 1833702 1308313 1346556 1172145 744718 698849 996448
10960 996448 983034 1052817 611064 1062140 807584 631157 785672 859429 240472 265786
10950 265786 219619 29423 239781 57898 139000 -263118 -3310 206870 384491 -303544 86850
10938 220646 69181 -19982 -457 63177 7369 286447 -101126 65179 326910 20352 38846
10927 38846 -153695 -147351 264916 -105099 129820 39041 -20989 216383 -229317 -42824 -17381
$$ packed form
11000F42659R6154l63303J73456k22494m8730K38361o365l6290J16275J48000
10990G37723B85007J99874k0727l4520K11175L69844m04083J39175N1856k0061
10980G77540j10671L23540L64253j87475M00325p0588N73223J42028R3116M7785
10970B353076j20337j54158j36324j08555n25389L8243j74411m27427m5869K97599
10960I96448j3414O9783m41753M51076k54556j76427J54515P3757B40472K5314
10950B65786m6167B9423K10358E7898Q1102b63118c310B06870J77621c03544H6850
10938B20646F9181a9982d57F3177G369K79078a01126F5179K61731B0352J8494
10927C8846a53695O344B64916a05099A29820C9041b0989B16383b29317d2824a7381
$$ plain form
10915 -124215 -70523 36080 -323591 11306 395681 -143377 130580 168311 -123498 -173630
10905 -173630 63988 20436 12916 -158309 -247230 126044 121611 -28340 -241490 71871 239638
10894 239638 106914 -83833 -447508 153609 239148 -51810 303725 41015 -183397 130547
10883 -125355 55620 -259910 -6617 -37482 -153534 27908 -170177 67944 139049 -160960 -295409
10872 -295409 61454 -13225 -99074 -139978 46397 -393818 33307 -19898 -1152 -52657 -202424
10861 -202424 45583 192552 -125192 -27431 59063 -41136 -175955 -233646 -314365 -146254 -229541
10850 -229541 -53861 -88183 -251238 64563 -246201 -217895 -345006 267260 -153862 -511771
10840 -511771 -87656 -78180 -284065 186666 23781 -23638 -5280 -72297 -169409 -229881 128240
$$ packed form
10915a24215N3692C6080c23591A1306L84375a43377A30580L7731a23498n0132
10905a73630F3988B0436p520a58309q8921A26044m433b8340k13150G1871J67767
10894B39638A06914h3833l63675A53609Q5539e1810C03725D1015a83397A30547
10883a25355E5620b59910f617l0865j16052B7908a70177F7944P1105a60960j34449
10872b95409F1454a3225q5849m0904D6397c93818C3307a9898a152n1505j49767
10861b02424D5583J46969a25192b7431E9063d1136j34819n7691q0719a46254q3287
10850b29541e3861l4322j63055F4563b46201K8306j27111B67260a53862l57909
10840e11771h7656R476k05885A86666B3781b3638e280o7017r7112o0472A28240
$$ plain form
10828 173961 -97722 83440 191537 63982 219670 278266 -51917 -151277 296720 -324168 -75430
10816 -375883 8603 287734 240512 -15884 -82703 -40666 -28487 -143291 -104535 232589 -179726
10804 38613 -144907 109024 -197745 232468 158212 39079 243239 45703 -120276 -66206
10794 -66206 -138443 57338 382509 -182460 115956 -184090 -1417 -150746 -491522 53397 63330
10783 63330 -179031 -29847 -197776 -158318 -206290 -39390 -152818 -104757 -152068 185691 -96952
10771 108362 -80010 -15915 41595 -122566 196884 50880 -86007 313896 -167661 -224752 -415846
10760 -415846 -173328 403765 -61604 19527 120468 -8308 80447 -245373 -110086 -184038 71861
10748 24453 97378 -7776 -37086 265065 -53719 224577 80260 331532 -116974 -31227 70162
$$ packed form
10828A73961i7722H3440J08097F3982J55688N8596e1917r9360B96720c24168g5430
10816c75883H603K79131m7222a5884o6819d0666J2179j14804L8756B32589a79726
10804C8613a44907A09024a97745B32468p4256C9079K04160D5703a20276N4070
10794f6206p2237E7338L25171a82460A15956a84090a417j49329l40776E3397R933
10783F3330a79031b9847j67929L9458m7972c9390j13428M8061m7311A85691i6952
10771A08362h0010a5915D1595a22566A96884E0880h6007C13896a67661n7091j91094
10760d15846a73328D03765f1604A9527J00941h308H0447b45373a10086p3952G1861
10748B4453P2925g776k9310B65065e3719B24577H0260K51272a16974c1227G0162
$$ plain form
10736 -337176 190862 -113626 -202854 87882 16023 -237693 -92373 -310914 -538792 -300740
10726 -300740 -21966 4903 15755 -276270 1389 -120651 -82919 -259311 26726 -115430 56871
10714 95461 9005 -223293 273309 94532 -190859 -111163 5644 361655 -131875 81194 -358850
10702 -191740 -214094 117628 -152454 -287584 10220 -201990 -68750 -60012 173888 61403 -306803
10690 -147577 -353846 -76700 -91784 -60500 -6565 -99717 4596 202394 -283560 -12339 133579
10678 -55306 -202671 -86977 156938 -234301 -341931 -83311 103208 41728 69547 79238 101694
10667 101694 -41649 -105167 -1595 59529 -63166 211934 -156268 87589 89188 -84492 -55003
10656 -55003 -29018 -129937 127326 -139547 -159079 -39752 -5348 138448 -171085 11916 -113710
$$ packed form
10736c37176A90862a13626q9228H7882A6023b37693i2373k18541k27878K38052
10726c00740b1966D903J0852b76270A389a20651L7732j76392B6726a15430E6871
10714I5461I005b23293B73309I4532a90859P9696E644L56011a31875H1194c58850
10702a91740k2354A17628a52454j35130A0220b01990f8750Q738A73888F1403c06803
10690a47577k06269g6700j5084L1284f565r3152D596J97798b83560a2339A33579
10678e5306j47365h6977A56938b34301j07630h3311A03208D1728K7819R691K2456
10667A01694d1649o3518a595E9529f3166B11934a56268H7589J599h4492K9489
10656e5003K5985j00919A27326a39547j9532c9752e348A38448a71085A1916a13710
$$ plain form
10644 -207067 -298231 -50215 30031 -56080 81642 -7123 -209197 -365981 159229 144885 153929
10633 153929 186485 -353540 -230030 -138708 -79382 -115703 6478 -226169 131114 -240397 -355478
10622 -355478 -238968 176993 139600 297997 -81491 60051 -147358 434123 -153713 29206
10611 -165004 -144590 52297 31080 345472 164455 -73395 67626 17613 -68053 -116560 -216554
10600 -216554 -195862 76442 -61300 -93614 143925 83026 -42570 -106932 169934 -19802 -5001
10588 252628 -30839 17810 179013 5386 -58813 153043 -235174 35273 -226242 19685 -136631
10576 -33947 146379 -129875 -214608 -82390 224479 272233 -2945 214676 263933 -244844 -70020
10564 -171622 -177861 -67926 -123938 -32029 -38474 15790 160407 -65073 -110708 -169371 184425
$$ packed form
10644b07067r1164e0215C0031e6080H1642g123k02074j56784A59229j4344R044
10633A53929L2556c53540J23510R1322N9326l6321F478b26169A31114b40397j15081
10622c55478J16510A76993l7393J58397h1491F0051a47358D34123a53713B9206
10611a65004K0414E2297k1217L14392A64455g3395F7626A7613f8053m8507r9994
10600b16554K0692G6442f1300l2314A43925o0899d2570o4362A69934a9802e001
10588B52628c0839A7810J61203E386e8813A53043b35174C5273b26242A9685a36631
10576c3947A46379a29875q4733h2390B24479M7754b945B14676M9257b44844g0020
10564a71622o239f7926n6012c2029o445A5790J44617f5073m5635n8663A84425
$$ plain form
10552 114290 -82139 91617 -232353 -39249 -117917 -48499 120664 -256715 -193258 -234627 -414302
10541 -414302 129957 179919 201881 119555 -132361 -69619 -109044 -74611 91473 90639 -27680
10529 -27223 -37007 -104970 117550 -203862 -60116 -33139 273388 -111569 467987 -112423 -127036
10518 -127036 253164 124481 -29054 -72800 -175992 -486014 203699 -14823 225599 18234
10507 -130950 -145501 -163178 -276878 -126338 102078 -191699 9801 179471 -90068 97486 443534
10496 443534 -330694 60936 267749 45740 -269155 -30815 47177 -62892 59217 -89795 -45432
10485 -45432 -5667 307867 -156207 25705 -82668 -261313 -145172 255600 -129493 45830 -62800
10473 158225 -50177 -76572 -98463 -171321 -233517 -5599 284910 29867 -178124 -50602 5201
$$ packed form
10552A14290h2139I1617b32353c9249p8668d8499A20664b56715O3457m1369j79675
10541d14302A29957M9962K1962q2326a32361O2742l9425L4433I1473q34b7680
10529b7223r784o7963A17550b03862f0116K6977B73388a11569D67987a12423j4613
10518a27036B53164A24481b9054m3746j03192l10022B03699a4823B25599A8234
10507a30950j4551j7677j13700a26338A02078a91699I801J69670i0068I7486L46048
10496D43534c30694F0936K06813D5740b69155c0815D7177f2892E9217h9795M4363
10485d5432e667C07867a56207B5705h2668j78645J16141B55600a29493D5830f2800
10473A58225e0177k6395k1891p2858o2196e599B84910B9867a78124e0602E201
$$ plain form
10461 -4934 89287 -32740 9001 -87502 97601 -121092 -44535 172816 63927 -22775 184900
10449 -78820 69507 153220 -24624 22979 6689 -11635 22363 159887 -157030 -179687 -7628 -259813
10437 -259813 57995 -80248 -266936 -75686 -214153 -166494 -4571 -194953 -35932 -179932 -101004
10426 -101004 105150 51059 -158772 -3456 101202 121318 -188632 -72715 -60444 -132260 -103115
10415 -103115 -256355 -38002 404055 -148659 -3121 329418 408645 -29796 148747 -311956
10404 61310 70158 -85069 -38295 411711 -63788 264770 75060 75353 62258 -24983 394609 129928
10391 227232 -9569 99133 -1986 122299 153046 243316 -56106 -66171 284534 51838 242933
10380 242933 -208918 -97719 221781 274710 292588 184538 241608 -36028 67130 -26430 98415
$$ packed form
10461d934H9287c2740I001h7502I7601a21092d4535A72816F3927b2775A84900
10449g8820F9507Q3713b4624B2979F689a1635B2363J37524a57030k2657g628k52185
10437b59813E7995h0248j86688g5686j38467M7659d571j90382c5932j44000P8928
10426a01004A05150E1059a58772c456A01202K0116a88632g2715J2271p1816K9145
10415a03115j53240c8002D04055a48659c121C29418P9227b9796A48747c11956
10404F1310Q848h5069c8295D11711f3788B64770G5060K93j3095b4983C94609A29928
10391B27232i569I9133a986A22299L0747R0270e6106j0065B84534E1838J91095
10380B42933b08918i7719B21781N2929J7878j08050N7070c6028F7130b6430I8415
$$ plain form
10368 97431 343101 430682 138575 566345 221367 263295 465473 214413 145835 84074
10358 84074 240720 -235402 104471 305883 -17700 184696 477950 178923 175319 169592 286386
10347 286386 -109590 115803 118456 191199 192064 203821 541969 -29309 68861 -9207 154059
10335 -151186 -159151 336837 365322 22755 -287474 32699 -76566 -135098 96653 -52562 68728
10323 -4362 444921 111649 295852 356888 -161780 390141 -208440 7280 225450 39375 -60154
10311 -49597 262711 3864 162208 100449 754 -214192 84853 -74419 -179958 -79231 -59863
10300 -59863 138819 -187852 -24568 88939 133688 79869 -228530 43492 246569 -241325 -46882
10288 -98682 -177621 -306760 -57983 36095 -413822 -94026 120590 2150 9000 227588 -16608
$$ packed form
10368I7431K45670Q7581A38575M27770B21367M1928K02178B14413o8578o1761
10358H4074J56646b35402A04471K01412a7700A84696K93254A78923l604n727J16794
10347B86386a09590A15803K653P2743Q65J1757L38148b9309F8861i207A54059
10335a51186p965C36837K8485B2755b87474C2699g6566n8532I6653e2562F8728
10323d362D44921A11649J84203O1036a61780C90141b08440G280K18170C9375f0154
10311d9597B62711C864J58344o1759G54b14192H4853g4419j05539g9231J9368
10300e9863A38819a87852b4568H8939M4749n3819b28530D3492K03077b41325d6882
10288i8682p8939j29139e7983C6095d13822i4026A20590B150O850K18588a6608
$$ plain form
10276 -129406 -87901 -207059 79326 -10768 -244587 -126229 -271542 60069 187523 -340246
10265 163424 -5838 126257 275615 -182504 -98632 -292651 -123240 115989 -113316 104978
10254 7748 -21549 -335161 58956 131794 12243 -109182 200368 -146819 185930 -142199 -340518
10243 -340518 273615 127243 -267775 -166773 297758 -21006 -58901 -171947 89311 -39201
10232 -210002 282272 19072 77021 -212944 98280 193748 -25448 -94987 -63248 -144244 -67702
10220 59514 75222 122837 35230 -77755 -185301 3548 34770 26413 -25504 -249357 218313
10208 -35669 98698 -39501 256306 12820 207607 230193 -24180 -212829 36500 -91603 7925
10196 -1386 76870 129898 -154306 66080 -33316 235077 245103 163862 -272065 39836 -219567
$$ packed form
10276a29406M1505j19158G9326a0768k33819J18358j45313F0069J27454c40246
10265A63424e838A26257J49358a82504Q3872j94019a23240A15989a13316A04978
10254G748b1549l13612E8956P2838A2243a09182B00368a46819A85930a42199j98319
10243c40518B73615A27243b67775J01002B97758b1006l7895j13046H9311c9201
10232b10002B82272A9072N7949b12944I8280R5468b5448o9539L1739q0996f7702
10220E9514J5708M7615C5230g7755j07546C548L1222q357b5504k23853B18313
10208c5669I8698c9501B56306A2820J94787K2586b4180j88649C6500i1603G925
10196a386G6870N3028a54306F6080c3316B35077J0026q1241b72065C9836b19567
$$ plain form
10184 -205560 105555 -230183 -172086 149802 -160314 34450 -106421 87384 61238 8751 -228461
10172 -66835 81457 -182354 -260036 -280103 -57683 -298770 -450849 -106175 170112 -241446
10161 -151715 26858 -83609 -189632 -243944 -108576 -129900 101126 -218483 154914 -149757
10150 -351837 310859 -210855 16180 68094 -163741 194974 -118778 -288694 171054 91162
10140 91162 -48118 -3494 -234859 -639506 -83738 158504 -266566 6618 -169931 -134295 -48209
10128 65892 -118465 -106196 -75090 284469 27851 -40194 -31613 74297 -112617 -82048 -50188
10117 -50188 -132713 24648 92281 -18453 296207 -221547 175054 240528 278436 -59802 44948
10105 -102471 -108882 -102844 -77954 -23725 120855 -17180 -96698 -102378 -84121 -187713 -74790 -46389
$$ packed form
10184b05560A05555b30183N8097A49802a60314C4450a06421H7384k6146H751b28461
10172f6835H1457a82354p7682k0067e7683k41087j52079a06175A70112b41446
10161a51715B6858h3609j06023n4312a08576k1324A01126b18483A54914a49757
10150c51837C10859b10855A6180N1914a63741A94974a18778j69916A71054p9892
10140I1162d8118c494k31365m04647h3738A58504b66566F618a69931L5636d8209
10128F5892a18465J2269L1106B84469B7851d0194Q581G4297a12617L0569L1860
10117e0188q2525B4648O7633a8453B96207b21547A75054O5474L7908e9802D4948
10105a02471o411O038K4890b3725A20855a7180p9518n680J8257j03592g4790K8401
$$ plain form
10093 -46389 131009 374046 288042 -112515 -427909 -67167 57081 16319 -346764 -396468 -118813
10081 86505 56855 231487 -156355 -163546 140987 -213621 -193476 125995 -133519 222965
10070 -98142 -73671 245682 -334987 11754 359244 -70902 67470 -193507 -136749 192085 -357025
10058 -158955 -234126 -103304 -111826 -337418 146249 -193850 153274 45483 -409672 -269280
10048 -269280 22097 135882 145610 -83195 -42721 33807 -101566 -276928 25622 104355 -1662
10036 55310 -141617 52297 512 -82981 -167438 -11778 -409024 157076 -100828 -466033 220161
10024 -145228 168336 -149640 -348384 -300802 -153160 -72559 -142120 123056 -267488 -235303
10014 -235303 39651 -179842 -99401 -126105 244369 -178923 -77155 -247672 -175470 73172 105963
$$ packed form
10093d6389A31009K43037q6004a12515l15394f7167E7081A6319c46764m9704a18813
10081H6505k9650J74632a56355p191A40987b13621K0145A25995a33519B22965
10070i8142K4471B45682c34987A1754L47490g0902F7470a93507N6758A92085c57025
10058a58955p5171a03304q522k25592A46249a93850A53274D5483d09672J40392
10048b69280B2097J13785R728h3195M0474C3807a01566j75362B5622P8733a662
10036E5310a41617E2297E12h2981q4457a1778l97246A57076a00828l65205B20161
10024a45228A68336a49640j98744M7582J47642g2559o9561A23056b67488L2185
10014b35303C9651a79842Q0441k6704B44369a78923g7155j70517P2202G3172L2791
$$ plain form
10003 105963 -8097 -161857 -75712 293698 -1397 185573 251863 -94710 -292766 11818 198793
9992 198793 -32592 -199508 168622 159135 182507 -131218 89429 108680 -48510 -177355 120694
9980 21812 -330592 95726 -79149 106410 -146929 211199 133532 8152 108903 -410719 -228669
9969 -228669 -164195 -242381 -4287 43011 -47475 -152520 -33067 -28077 -306030 -37433 -175889
9958 -175889 11425 105730 -189950 108706 -100377 -71119 -274553 -160258 52933 -91791 64744
9946 9629 -134634 -213114 -342459 -93885 60470 -209150 -12600 -124721 -7526 196385 -37497
9934 314121 47148 43975 -386421 -152998 -41265 220683 -215464 -8324 -28587 6606 -54484
9922 -214028 -186244 -141419 -284214 113432 -5497 238532 67318 83270 -57232 -169818 233720
$$ packed form
10003A05963h097j53760g5712B93698a397A85573O6290i4710j98056A1818J86975
9992A98793c2592j66916A68622r487K3372a31218H9429J9251d8510j28845A20694
9980B1812c30592I5726g9149A06410a46929B11199p7667H152J00751d10719J82050
9969b28669O4474p8186d287D3011d7475j05045c3067M990k77953c7433j38456
9958a75889A1425R4305a89950A08706a00377K9258k03434J14295E2933i1791F4744
9946I629a34634p8480j29345i3885F0470b09150a2600j12121g526A96385c7497
9934C14121D7148l173c86421a52998d1265B20683b15464h324k0263F606e4484
9922b14028K7784M4825j42795A13432e497B38532F7318J5952e7232j12586B33720
$$ plain form
9910 -140302 32739 162107 71737 -71003 -414395 -360929 -110725 -14409 -239601 -131879 179450
9898 148477 -80834 -13164 -89985 79530 -54332 -131688 -127216 -60642 81928 88294 286002 -278225
9885 97304 -80607 -249774 312873 -152801 188024 -31187 146002 -113301 298988 -236688
9874 66934 -168830 27253 -216627 -121221 151930 -39695 -622 -204937 -17619 -70714 -186144
9863 -186144 -325518 68737 -194823 74293 -175339 -10658 26549 190371 -272588 -76913 21110
9851 68410 153030 114433 145641 -212378 -67731 -209983 199041 -79377 170796 -114500 146303
9839 -213238 -34402 -163924 -5673 -90581 64688 -30989 66147 33474 -24886 -31460 -215669 15807
9826 -406403 190389 114423 -304280 -82263 206278 -18562 341638 22013 -261212 -337999 -74329
$$ packed form
9910a40302C2739J29368G1737g1003l43392N3466a10725a4409k25192J07722A79450
9898A48477h0834a3164p6821G9530e4332p7356M472f0642H1928O366J97708b78225
9885I7304h0607j69167C12873a52801A88024c1187A46002a13301B98988b36688
9874F6934a68830B7253b16627R5406A51930c9695f22k04315a7619n3095j15430
9863a86144j39374F8737a94823G4293a75339a0658B6549J63822b72588g6913B1110
9851F8410Q4620l8597L1208b12378f7731j42252A99041g9377A70796a14500A46303
9839b13238c4402j29522e673q4908F4688c0989F6147l2673b4886o574j84209A5807
9826d06403A90389p5966c04280h2263B06278a8562C41638B2013b61212p6787g4329
$$ plain form
9814 76716 -112077 -191996 2030 -118847 113656 -17079 -298150 138237 17125 -7300 118094
9802 -33110 -55149 20130 -486456 -69455 75456 105935 168284 25301 81329 193070 -256743
9790 -123097 -121661 13680 -133482 31506 -251021 -166570 -91227 -156810 42887 -116437 53739
9778 240316 82665 -164018 -445955 173753 -79697 -23306 -87081 147486 46899 193745 -166784
9766 -26554 -158650 -39720 -485464 57652 219540 -21612 -290126 -140095 138222 -170407
9755 -135355 -98671 -235869 -335879 -57189 31316 706 30293 122163 -196973 -96383 -76557
9744 -76557 6253 -82626 275988 125137 -67341 -94722 -67339 59168 3077 183923 -167120
9732 278216 177657 -53251 236570 -40346 233803 231311 -100355 -48645 119483 -283498 13830
$$ packed form
9814G6716a12077p9919B030a18847A13656a7079k81071A38237A7125g300A18094
9802c3110k2039B0130d86456f9455G5456L0479O2349B5301N6028J11741b56743
9790a23097J436A3680a33482C1506b51021Q4451P5343o5583D2887a16437E3739
9778B40316H2665a64018k81937A73753g9697b3306o3775A47486D6899J46846a66784
9766b6554j32096c9720m45744E7652J61888b1612k68514a40095A38222a70407
9755a35355L6684j37198j00010e7189C1316G06K9587R1870a96973i6383J9826
9744g6557F253h2626B75988A25137f7341k7381K7383E9168C077J80846a67120
9732B78216j00559e3251B36570d0346B33803k492a00355d8645A19483b83498A3830
$$ plain form
9720 56106 -67654 -124799 -177443 115264 108671 164602 -352161 319022 38883 -337079 -20512
9708 208351 -7971 40686 -362695 -81962 -35950 -74268 121059 -303208 -179099 130513 99317
9697 99317 114662 29381 -137723 134073 -89789 62208 25300 -41317 42193 -114100 -259323
9686 -259323 82410 19337 -77596 165561 -104479 -176789 -27426 -70689 265377 84477 -261150
9674 87407 -308991 -284428 -216497 -65709 144109 214810 317543 -298031 28090 -9336 -9664 283449
9661 -51065 106559 148545 -95818 319010 -281946 32101 -493387 -266300 235533 183174 64267
9649 -291452 24765 39579 -95781 50054 -404284 -302941 -366597 -217637 -83477 148975 -14173
9637 -203121 232242 100840 -142929 -9111 -282419 32301 -288715 198622 -239947 230395
$$ packed form
9720E6106f7654n7145n2644A15264o593N5931c52161C19022C8883c37079b0512
9708B08351g971D0686c62695h1962c5950l8318A21059c03208J24109A30513l1196
9697I9317J5345B9381a37723A34073h9789F2208B5300d1317D2193a14100j45223
9686b59323H2410A9337g7596A65561a04479p2310b7426m3263B65377H4477b61150
9674H7407c08991K4563O7931f5709A44109P0701J02733b98031B8090i336l28B83449
9661e1065A06559M1986i5818C19010b81946C2101d93387K27087B35533n2359F4267
9649b91452B4765J4814i5781E0054d04284J01343o3656J48960h3477A48975a4173
9637b03121B32242A00840a42929i111k73308C2301b88715A98622b39947B30395
$$ plain form
9626 -57891 -137555 21373 -109823 -127161 -222744 -267523 123528 -8356 -58548 -151472 -81665 -141460
9614 -141460 47358 -29913 -87012 141731 398 -211449 -62613 -388443 -23624 -12784 107839
9602 -109470 223688 62253 -238617 -113243 41204 -158827 -324187 336560 -280692 -11945
9591 -120892 -252961 -40529 -19199 201139 70649 -124500 71244 241348 35488 -34729 -77412
9580 -77412 -351398 164578 54052 76505 -362466 -234161 69542 -57478 -195390 -247871 130696
9568 19971 -125084 -388 -466440 141285 217076 209143 48381 82169 167091 53127 -156033 175784
9555 -237136 -412161 40925 -555036 -109617 -307403 125309 -163337 -80262 23399 -138060
9544 145436 -212590 83279 -117473 -161765 67676 25314 27915 -83402 148686 -55782 -55741 -214495
$$ packed form
9626e7891p9664B1373a09823j7338r5583m4779A23528h356n0192r2924O9807n9795
9614a41460D7358b9913n7099A41731C98b11449f2613l25830b3624J0840A07839
9602a09470B23688F2253b38617a13243D1204a58827j65360C36560b80692a1945
9591a20892j32069d0529a9199B01139G0649a24500G1244J70104C5488c4729m2683
9580g7412k73986A64578E4052K2453c62466J28305F9542e7478j37912n2481A30696
9568A9971a25084c88m66052A41285P5791p933D8381L3788Q4922E3127a56033A75784
9555b37136j75025D0925e55036a09617j97786A25309a63337h0262B3399a38060
9544A45436b12590H3279a17473m4292F7676B5314K601h3402A48686e5782M1j58754
$$ plain form
9532 -214495 -202536 45422 -155745 -137889 -28373 -25986 -157536 -2566 86833 -5608 17715 412433
9520 412433 77654 -79784 -79659 293442 14523 -168332 -145924 75454 203526 -94409 -104642
9509 -104642 -124640 -203251 -86761 -44711 154492 -38180 -96844 232017 151731 -119595 -248946
9498 -248946 22301 131817 -236315 51119 -224842 -133472 -123073 -301481 159151 -60728 -163377
9487 -163377 166888 -101811 -9501 -229669 -106939 -136740 -111390 113307 107582 -75746 62153
9475 12973 -243057 -163129 20713 59761 38876 16559 -146185 292631 -70371 24488 -49781
9463 114171 -266649 173856 52025 -251423 -198974 -228606 102202 -257 226455 -51248 -209936
9452 -209936 -281632 -217118 -192991 -429558 -63744 -105142 -201537 -104596 204421 -172221 -79080
$$ packed form
9532b14495J1959D5422a55745J7856b8373K387j31550b566H6833e608A7715L94718
9520D12433G7654g9784J25B93442A4523a68332K2408G5454J28072i4409j0233
9509a04642j9998p8611h6761M2050A54492c8180n8664B32017q0286a19595j29351
9498b48946B2301J09516b36315E1119b24842R1370J0399j78408A59151f0728j02649
9487a63377A66888a01811i501k20168a06939k9801K5350A13307n725g5746F2153
9475A2973b43057P9928B0713L9048k0885A6559a46185B92631g0371B4488d9781
9463A14171b66649A73856E2025b51423N2449k9632A02202b57B26455e1248j58688
9452b09936p1696O4514K4127k36567f3744m1398r6395R6941B04421a72221g9080
$$ plain form
9440 150448 -186885 107885 -129588 -15022 111876 8543 -187227 -20898 -135704 -372291
9430 -372291 -142089 -179956 -14126 172217 -139222 -51908 -135543 162204 -75458 -308618 -12003
9418 -171978 145446 -392540 13304 -149852 -223033 12494 58029 -665303 -160383 167509
9407 -247077 -47096 213976 -224537 92385 -113505 -211919 -10727 -199409 -85292 191554 -69498
9395 -178676 -216716 -112742 -113724 -98847 -152784 179276 -124449 -169245 -172784 -150583 139408
9383 -311850 124659 -387189 146989 103946 -187389 -338048 -95307 -49333 114748 74671
9373 74671 -169878 -221651 -250493 -344042 -29767 70737 -38083 248606 -2777 84085 87280 -243104
9360 -238834 -14002 -398691 140910 -136767 -32895 102508 -63972 103510 -132283 -36934
$$ packed form
9440A50448a86885A07885a29588a5022A11876H543a87227b0898j14806k36587
9430c72291a42089l7867a4126A72217a39222e1908q3635A62204g5458k33160a2003
9418a71978A45446c92540A3304a49852p3181A2494M5535f65303a60383A67509
9407b47077d7096B13976b24537I2385a13505r8414a0727j88682h5292A91554f9498
9395a78676l8040J03974r82J4877n3937A79276a24449m4796l539K2201A39408
9383c11850A24659c87189A46989m3043a87389j50659i5307M5974A14748m0077
9373G4671a69878n1773k8842r3549b9767G0737c8083B48606b777H4085L195b43104
9360b38834a4002l84689A40910a36767c2895A02508f3972A03510a32283c6934
$$ plain form
9349 -193381 -187887 77512 57929 67507 -27879 36303 71521 -97438 -158257 -92487 -152910 -137826
9337 -137826 -25094 259659 167969 -21017 121289 -27194 163684 -41117 100700 -503720 -18281
9325 -21726 -333064 -166036 -291839 -157603 -166480 -140865 41133 258897 126799 -193658 -94218
9313 212541 -37850 -283723 -118897 118067 77542 51539 162424 11137 37355 -49612 6255
9301 183374 93832 15006 -18502 -378987 -77749 -170617 -203613 -171234 21723 171294 -221924
9289 -95586 -16882 -154392 -65905 -50124 -176651 -12231 80671 -120400 -51873 -155053 -94416
9278 -94416 -77259 -81569 -95628 -245165 393464 -4636 -99337 -58497 -29897 -232967 -12250 263638
9265 -414580 -71503 -97490 -339249 261020 -360491 -120399 -108744 -322387 -221319 -281972
$$ packed form
9349a93381N494G7512j9583R578b7879C6303L5218i7438o0819O5770o0423J5084
9337a37826b5094B59659r1690b1017A21289b7194A63684d1117A00700e03720a8281
9325b1726l11338a66036j25803J34236q877K5615D1133K17764A26799a93658i4218
9313B12541c7850k45873a18897A18067m0525k6003J10885A1137K6218d9612F255
9301A83374q9542A5006a8502l60485g7749r2868l2996L2379B1723J49571b21924
9289i5586a6882j37510f5905J5781j26527a2231H0671a20400e1873j03180O0637
9278i4416J7157m310j4059j49537C93464d636r4701M0840K8600k03070a2250B63638
9265d14580g1503k5987k41759B61020c60491a20399J1655k13643J01068o0653
$$ plain form
9255 -281972 -35528 62273 -336128 -174531 53883 -193519 -218650 23455 -155868 -282869 -33289
9243 -318681 -130883 -104524 40694 59685 33255 -370549 -395400 -180354 -107030 90660 -75397
9231 73495 149750 61885 -5227 -47138 -57335 105586 196037 -168481 -37313 -182869 -341083
9220 -341083 -138119 331311 -134477 100475 6166 79377 30317 -37752 -91205 -224775 -132079
9209 -132079 -102925 -14070 76268 92141 -132192 104983 15555 293092 -100925 -125443 -7652
9197 -240581 206557 91748 63267 70095 -211978 -120964 -313027 -118034 9249 12179 -164203
9185 -109871 7481 -85065 -76604 -70963 -144670 -67862 186449 -92037 -235228 158022 -99315 -57416
9173 -57416 102819 163514 199538 190376 -168560 87185 -63 -434445 126344 -122339 -19903 -258909
$$ packed form
9255b81972c5528F2273c36128J61597E3883a93519k5131B3455a55868j27001c3289
9243c18681a30883K6359D0694J8991k6430c70549k4851a80354P3324I0660g5397
9231G3495P6255F1885e227m1911j0197A05586R0451a68481c7313j45556j58214
9220c41083a38119C31311a34477A00475F166P3211C0317c7752n3453j33570R2696
9209a32079K9154a4070G6268J5873a32192A04983A5555K77537a00925k4518g652
9197b40581B06557I1748k8481O828b11978R1014j92063a18034I249K930a64203
9185a09871G481h5065Q461N641p3707f7862A86449i2037j43191A58022i9315M1899
9173e7416A02819O0695L6024r162a68560H7185f3m34382A26344a22339a9903k39006
$$ plain form
9161 -258909 112549 -130095 -86440 247195 125268 48015 14048 -221981 145178 8843 -256836
9149 77575 -275638 -273048 91170 3046 -12027 -98214 -152729 159388 -19160 10468 -560973 391755
9136 48905 -341027 31300 -213511 55500 -70301 38890 -208836 125686 -130559 -179567 -62736
9124 -12666 884 32307 -207936 82797 59286 -221130 179301 199966 -383593 -894 -232525 -164914
9112 -164914 85764 -111096 -246085 129557 -177550 41235 -172285 -107635 -309824 -83020
9101 -106405 -282394 -276711 218909 85488 -183319 132106 -450970 -121171 -392072 7722 -248371
9089 38476 20108 -132296 -192878 -151144 -148774 -129588 117827 48353 -128573 -15369 -44440
9078 -44440 107504 200436 -131409 -151788 253288 -187217 93937 -157105 -201110 221959 18953
$$ packed form
9161b58909A12549a30095M3655B47195j21927D8015A4048b21981A45178H843b56836
9149G7575b75638K590I1170C046a2027q6187n4515A59388a9160A0468e60973C91755
9136D8905c41027C1300b13511E5500g0301C8890b08836A25686a30559m9008f2736
9124a2666H84L1423b07936H2797k3511b21130A79301K0665c83593h94k31631O7611
9112a64914H5764a11096j34989A29557a77550D1235a72285O4650k02189h3020
9101a06405j75989N683B18909H5488a83319A32106d50970a21171k70901G722b48371
9089C8476j8368a32296o0582M1734K370J9186A17827D8353a28573a5369k9071
9078d4440A07504R2932a31409k0379B53288a87217I3937a57105m4005B21959A8953
$$ plain form
9066 -193248 43245 -63926 -809105 -33193 -124981 -23387 -57342 153791 -104382 24892 -234974
9054 -227760 -10762 -231211 357018 228557 58474 -98942 198303 18770 78241 58466 -150255
9042 -42507 59731 -211812 122137 -138633 -231919 -380081 -7397 324430 277970 -130503 6551
9030 -97038 67355 18457 -55761 -47672 63478 132847 137781 -443636 243623 209046 -315195 -290609
9018 -290609 -101975 -178614 -22751 -124540 -90971 -537841 216269 159387 -230346 -48891 -6369
9006 -337137 34041 -26007 -204045 136569 -338295 -64629 -55084 49570 -368923 -345681 -23337
8994 156971 167979 20830 -19127 -252788 -136341 126213 -155405 -154381 -125087 -53494 -197603
8983 -197603 64573 44433 -2696 -217435 -5660 229968 -179026 -294343 -286759 -108593 -18959
$$ packed form
9066a93248D3245f3926p45179c3193r1788b3387l3955A53791a04382B4892b34974
9054b27760a0762k20449C57018j28461E8474i8942A98303A8770N9471j9775a50255
9042d2507E9731b11812A22137a38633r3286j48162g397C24430m6460a30503F551
9030i7038F7355A8457e5761Q089F3478O9369M934d43636B43623l4577c15195K4586
9018b90609a01975p6639b2751j01789L3569m46870B16269n6882b30346d8891f369
9006c37137C4041b6007j78038A36569c38295f4629R545D9570c68923K3242b3337
8994A56971J1008B0830a9127k33661J16447A26213a55405J024K9294e3494j44109
8983a97603F4573k0140b696k14739e660B29968a79026j15317P584a08593a8959
$$ plain form
8971 -26642 -240472 -228310 -102827 94133 35669 321166 -331948 -67939 -46498 2890 10418
8960 10418 8508 118824 -135967 185561 -109655 67944 251788 38935 21804 -142871 -8802
8948 -2536 173788 243392 -303575 -300461 -40422 -373820 -212455 -66214 39776 -15591 -147005
8937 -147005 -190099 123724 187950 507962 110794 368698 200114 298578 -42447 194034
8926 86806 263340 529842 1321605 3206715 12350056 13918220 5515682 2005168 899105
8916 609474 236109 224001 -99570 159878 -163742 160260 -121082 459461 302966 191099
8906 191099 -10043 17836 130490 -77594 -176887 -37931 -204655 -13039 173773 77714 -59080
8894 -205407 206565 -75637 -168932 122918 -194104 193850 -56641 51979 -225613 -22743 60198
$$ packed form
8971b6642k13830J2162a02827I4133C5669K85497c31948f7939K1441B890P528
8960A0418j910J10316a35967A85561a09655F7944J83844C8935j7131a42871h802
8948b536A73788O9604c03575L114d0422l33398J61365f6214C9776a5591j31414
8937a47005m3094A23724O4226L20012A10794K57904j68584R8464d2447A94034
8926H6806J76534K66502P91763J885110R143341J568164E515682B005168H99105
8916F09474B36109j2108i9570A59878a63742A60260a21082D59461j56495j11867
8906A91099a0043A7836J12654g7594r9293c7931j66724a3039A73773G7714e9080
8894b05407B06565g5637r3295A22918a94104A93850e6641E1979b25613b2743F0198
$$ plain form
8882 148331 -37042 -165324 67779 -30595 209010 -160096 95560 17187 134269 180083 -47508
8870 -480150 -219889 146848 19837 238707 -201015 -430779 -182029 21835 -112306 156128
8859 -338516 -84371 -359298 244430 225340 108979 -80416 -84909 -145505 40070 90454 -39313
8847 17388 -27315 20635 -214212 185843 -97697 -87018 196349 168163 5386 -231423 38952
8835 179187 -61473 225504 -3041 -251875 -158651 -205888 -263441 -38141 -175439 -122877 482 -15632
$$ packed form
8882A48331c7042j28282F7779c0595B09010a60096I5560A7187J17082M5814d7508
8870d80150b19889A46848A9837K18870b01015k29764a82029B1835a12306A56128
8859c38516h4371k74927B44430j9090A08979h0416m493o0596D0070N0384c9313
8847A7388b7315B0635b14212A85843i7697J0679A96349k8186E386b31423C8952
8835A79187f1473B25504c041k48834R3224m7237n7553c8141j37298N2562D82a5632
$$ [...]
##END NTUPLES=NMR SPECTRUM
##END=
