##TITLE=AC1502_INDRS13309_8125441_JUPnpALMwU
##JCAMPDX= 6.0         $$ Bruker NMR JCAMP-DX V2.0
##DATA TYPE= NMR SPECTRUM
##DATA CLASS= NTUPLES
##ORIGIN= BRUKER
##OWNER= Administrator
$$ 1.72 TOPSPIN		Version 2.1
$$ 2013-08-15 20:31:34.172 -0700  Administrator@X
$$ Compression mode = diff/dup
##.OBSERVE FREQUENCY= 400.02188249412
##.OBSERVE NUCLEUS= ^1H
##.ACQUISITION MODE= SIMULTANEOUS (DQD)
##.ACQUISITION SCHEME= undefined
##.AVERAGES= 64
##.DIGITISER RES= 22
##SPECTROMETER/DATA SYSTEM= spect
##.PULSE SEQUENCE= noesygpps1d.comp
##.SOLVENT NAME= COFFEE_meoh
##.SHIFT REFERENCE= INTERNAL, COFFEE_meoh, 1, 14.961
##AUDIT TRAIL= $$ (NUMBER, WHEN, WHO, WHERE, PROCESS, VERSION, WHAT)
$$ ##TITLE= Audit trail, TOPSPIN		Version 2.1
$$ ##JCAMPDX= 5.01
$$ ##ORIGIN= Bruker BioSpin GmbH
$$ ##OWNER= Administrator
$$ $$ E:\/data/COFFEE/nmr/AC1502_INDRS13309_8125441_JUPnpALMwU/12/pdata/1/auditp.txt
$$ ##AUDIT TRAIL=  $$ (NUMBER, WHEN, WHO, WHERE, PROCESS, VERSION, WHAT)
(   1,<2013-08-15 20:31:29.282 -0700>,<Administrator>,<X>,<go>,<TOPSPIN 2.1>,
      <created by zg
	started at 2013-08-15 20:19:59.584 -0700,
	POWCHK enabled, PULCHK disabled,
       configuration hash MD5:
       C8 4E 4E 5D D3 5C D8 9E 9F 52 82 E0 59 8A DE 15
       data hash MD5: 64K
       8D 83 05 13 38 BF FF FD 51 72 39 BB D0 43 43 CF>)
(   2,<2013-08-15 20:31:32.157 -0700>,<Administrator>,<X>,<proc1d>,<TOPSPIN 2.1>,
      <Start of raw data processing
       efp LB = 0.3 FT_mod = 6 PKNL = 1 PHC0 = 0 PHC1 = 0 SI = 128K 
       data hash MD5: 128K
       24 FF 92 0B 58 11 8F 97 E5 11 08 6E 58 BC FC 10>)
(   3,<2013-08-15 20:31:33.157 -0700>,<Administrator>,<X>,<proc1d>,<TOPSPIN 2.1>,
      <pk PHC0 = -79.54651 PHC1 = 0 
       data hash MD5: 128K
       99 7D 1D B5 1C 47 D7 32 F9 D3 50 62 5A 55 A1 67>)
(   4,<2013-08-15 20:31:33.594 -0700>,<Administrator>,<X>,<proc1d>,<TOPSPIN 2.1>,
      <abs ABSG = 1 
       data hash MD5: 128K
       14 15 8E 57 54 7B 15 C0 76 7A 13 61 92 E5 08 AA>)
(   5,<2013-08-15 20:31:33.704 -0700>,<Administrator>,<X>,<proc1d>,<TOPSPIN 2.1>,
      <abs ABSG = 2 
       data hash MD5: 128K
       0B 9C A0 DB F5 E6 CD AD 31 52 56 0F 2B E4 05 2D>)
(   6,<2013-08-15 20:31:33.797 -0700>,<Administrator>,<X>,<proc1d>,<TOPSPIN 2.1>,
      <abs ABSG = 3 
       data hash MD5: 128K
       D3 CC 2A 42 FB 7A 76 47 2E 2B FC 4B E0 5D 56 2A>)
(   7,<2013-08-15 20:31:33.875 -0700>,<Administrator>,<X>,<proc1d>,<TOPSPIN 2.1>,
      <abs ABSG = 4 
       data hash MD5: 128K
       61 FC E0 60 C1 1A 8C 56 24 BF 7E 72 FE C2 44 EA>)
(   8,<2013-08-15 20:31:33.969 -0700>,<Administrator>,<X>,<proc1d>,<TOPSPIN 2.1>,
      <abs ABSG = 5 
       data hash MD5: 128K
       44 ED B2 80 FC DC 6E 82 64 E0 1F E6 CB C2 B8 FF>)
$$ ##END=
$$ 
$$ $$ hash MD5
$$ $$ 9C B8 D6 36 62 FE 35 33 AF E4 13 AF 61 9B DC 3E
##$RELAX= 
##$RELAX= 
##$RELAX= 
##$RELAX= 
##$RELAX= 
##$RELAX= 
##$RELAX= 
##$RELAX= 
$$ Bruker specific parameters
$$ --------------------------
##$DU= <E:\>
##$EXPNO= 12
$$ [...]
150 150 150 150 150 150 150 150
##$TP07= 0
##$TPNAME0= <>
##$TPNAME1= <>
##$TPNAME2= <>
##$TPNAME3= <>
##$TPNAME4= <>
##$TPNAME5= <>
##$TPNAME6= <>
##$TPNAME7= <>
##$TPOAL= (0..7)
0.5 0.5 0.5 0.5 0.5 0.5 0.5 0.5
##$TPOFFS= (0..7)
0 0 0 0 0 0 0 0
##$TUNHIN= 0
##$TUNHOUT= 0
##$TUNXOUT= 0
##$USERA1= <user>
##$USERA2= <user>
##$USERA3= <user>
##$USERA4= <user>
##$USERA5= <user>
##$V9= 5
##$VALIST= <valist>
##$VCLIST= <CCCCCCCCCCCCCCC>
##$VD= 0
##$VDLIST= <DDDDDDDDDDDDDDD>
##$VPLIST= <PPPPPPPPPPPPPPP>
##$VTLIST= <TTTTTTTTTTTTTTT>
##$WBST= 1024
##$WBSW= 4
##$XGAIN= (0..3)
0 0 0 0
##$XL= 0
##$YL= 0
##$YMAX_a= 5709016
##$YMIN_a= -11308917
##$ZGOPTNS= <>
##$ZL1= 120
##$ZL2= 120
##$ZL3= 120
##$ZL4= 120
##$ABSF1= 14.961
##$ABSF2= -5.597181
##$ABSG= 5
##$ABSL= 3
##$ALPHA= 0
##$AQORDER= 0
##$ASSFAC= 0
##$ASSFACI= 0
##$ASSFACX= 0
##$ASSWID= 0
##$AUNMP= <proc_prof1d_extract.lims>
##$AXLEFT= 0
##$AXNAME= <>
##$AXNUC= <1H>
##$AXRIGHT= 0
##$AXTYPE= 0
##$AXUNIT= <>
##$AZFE= 0.1
##$AZFW= 0.1
##$BCFW= 0
##$BC_mod= 0
##$BYTORDP= 0
##$COROFFS= 0
##$CY= 15
##$DATMOD= 1
##$DC= 0
##$DFILT= <>
##$DTYPP= 0
##$F1P= 0
##$F2P= 0
##$FCOR= 0.5
##$FTSIZE= 131072
##$FT_mod= 6
##$GAMMA= 0
##$GB= 0
##$INTBC= 1
##$INTSCL= 1
##$ISEN= 128
##$LB= 0.3
##$LEV0= 0
##$LPBIN= 0
##$MAXI= 10000
##$MC2= 0
##$MEAN= 0
##$ME_mod= 0
##$MI= 0
##$NCOEF= 0
##$NC_proc= -2
##$NLEV= 6
##$NOISF1= 0
##$NOISF2= 0
##$NSP= 0
##$NTH_PI= 0
##$NZP= 0
##$OFFSET= 14.961
##$PC= 1
##$PHC0= -79.54651
##$PHC1= 0
##$PH_mod= 1
##$PKNL= yes
##$PPARMOD= 0
##$PPDIAG= 0
##$PPIPTYP= 0
##$PPMPNUM= 2147483647
##$PPRESOL= 1
##$PSCAL= 4
##$PSIGN= 0
##$PYNMP= <proc.py>
##$REVERSE= no
##$SF= 400.020009638695
##$SI= 131072
##$SIGF1= 0
##$SIGF2= 0
##$SINO= 400
##$SIOLD= 131072
##$SPECTYP= <>
##$SREGLST= <1H.CDCl3>
##$SSB= 0
##$STSI= 131072
##$STSR= 0
##$SW_p= 8223.68421052631
##$SYMM= 0
##$S_DEV= 0
##$TDeff= 65536
##$TDoff= 0
##$TI= <>
##$TILT= no
##$TM1= 0
##$TM2= 0
##$TOPLEV= 0
##$USERP1= <user>
##$USERP2= <user>
##$USERP3= <user>
##$USERP4= <user>
##$USERP5= <user>
##$WDW= 1
##$XDIM= 131072
##$YMAX_p= 386252537
##$YMIN_p= -16401
##$CURPLOT= <Network HP LaserJet P1505>
##$CURPRIN= <$Network HP LaserJet P1505>
##$DFORMAT= <normdp>
##$LAYOUT= <+/1D_H.xwp>
##$LFORMAT= <normlp>
##$PFORMAT= <normpl>
##$SURQMSG= 1
$$ End of Bruker specific parameters
$$ ---------------------------------
##NTUPLES= NMR SPECTRUM
##VAR_NAME=  FREQUENCY,     SPECTRUM/REAL,   SPECTRUM/IMAG
##SYMBOL=    X,             R,               I
##VAR_TYPE=  INDEPENDENT,   DEPENDENT,       DEPENDENT
##VAR_FORM=  AFFN,          ASDF,            ASDF
##VAR_DIM=   131072,        131072,          131072
##UNITS=     HZ,            ARBITRARY UNITS, ARBITRARY UNITS
##FACTOR=    0.0627417313425164, 1,          1
##FIRST=     8223.62146879497, -651,         -50313
##LAST=      0,             -24,             -50807
##MIN=       0,             -16401,          0
##MAX=       8223.62146879497, 386252537,    0
$$ Real data points
##PAGE= N=1
##DATA TABLE= (X++(R..R)), XYDATA
$$ [...]
63914C885268j09313j35386j58161j76363j89308j96981j99869j98836j94917
$$ 3885268 3775955 3640569 3482408 3306045 3116737 2919756 2719887 2521051 2326134
63905B326134j88927j81195j71693j60388j47497j33543j19253j05289r2000p9551
$$ 2326134 2137207 1956012 1784319 1623931 1476434 1342891 1223638 1118349 1026349 946798
63895I46798o8244n8521n0502m3802l7971l2956k8876k5517k2465j9634j7381
$$ 946798 878554 820033 769531 725729 687758 654802 625926 600409 577944 558310 540929
63884E40929j5858j4669j3322j1818j0469r354q280p210o353n768n233m573l780
$$ 540929 525071 510402 497080 485262 474793 465439 457159 449949 443596 437828 432595 428022 424242
63871D24242k671r38J209K877L454L458L955N279O979Q791J0941J3377J5501J7024
$$ 424242 421571 420633 421842 424719 428173 431631 435586 440865 447844 456635 467576 480953 496454 513478
63857E13478J8460K0393K2717K5051K7464L0190L2957L5210L6844L8239L9618
$$ 513478 531938 552331 575048 600099 627563 657753 690710 725920 762764 801003 840621
63846H40621M0814M1551M1591M0706L8918L6720L4604L2416K9493K5476K0589
$$ 840621 881435 922986 964577 1005283 1044201 1080921 1115525 1147941 1177434 1202910 1223499
63835A223499J5229R655M070j454p166j3360j9759k5538l0050l3362l6035l8538
$$ 1223499 1238728 1248383 1252453 1250999 1243833 1230473 1210714 1185176 1155126 1121764 1085729 1047191
63823A047191m0932m2795m3539m3030m1854m0735l9770l8610l7178l5638l3744
$$ 1047191 1006259 963464 919925 876895 835041 794306 754536 715926 678748 643110 609366
63812F09366l0941k7330k3927k1542j9884j8132j6034j3978j2215j0521q591o498
$$ 609366 578425 551095 527168 505626 485742 467610 451576 437598 425383 414862 406271 399773
63800C99773m754m020m547n786o798p181p339p710q128q283q322q416q090o770
$$ 399773 395019 390999 386452 380666 373868 366687 359348 351638 343510 335227 326905 318489 310399 303629
63786C03629m959m020m495n331n203m130l236l148l352l076k209j199m81l40r05
$$ 303629 298670 294650 290155 284824 279621 275491 272255 269107 265755 262679 260470 259271 258790 258450 257545
63771B57545j914k635k533j906j519j619j732j485j191j314j698j777j385q82
$$ 257545 255631 252996 250463 248557 247038 245419 243687 242202 241011 239697 237999 236222 234837 233955
63757B33955n68l16M2K91Q9m95r42q54l92o7j48m17n31m31k54J0M40Q38Q63N95
$$ 233955 233387 233071 233113 233404 233493 232998 232056 231202 230810 230743 230595 230178 229647 229216 228962 228972 229412 230250 231113 231708
63737B31708N52R41J326J351J427K146L217L649L071K317K378L188L791L587L044
$$ 231708 232260 233201 234527 235878 237305 239451 242668 246317 249388 251705 254083 257271 261062 264649 267693
63722B67693L083L983N054N405M915M355M529N469O489O857O299N006L376J774
$$ 267693 270776 274759 279813 285218 290133 294488 299017 304486 310975 317832 324131 329137 332513 334287
63708C34287M32n32j139j660k552l928n128n283m410l453l078k871k098p82L95
$$ 334287 334719 334187 333048 331388 328836 324908 319780 314497 310087 306634 303556 300685 298587 297805 298200
63693B98200R59R41O02L66O78J429J789J242M88O02J550K336K485K392K205J413
$$ 298200 299159 300100 300702 301068 301746 303175 304964 306206 306694 307296 308846 311182 313667 316059 318264 319677
63677C19677Kr98p20L74J167J288J232J506K193L113L904M072L514K852K883L697
$$ 319677 319679 318681 317961 318335 319502 320790 322022 323528 325721 328834 332738 336810 340324 343176 346059 349756
63661C49756M622M911M329L156J862O38q39k898n036o090n546m331l784m192m779
$$ 349756 354378 359289 363618 366774 368636 369274 368435 365537 360501 354411 348865 344534 340750 336558 331779
63646C31779m915m672m252l569k620j760j325j139o42N44K256L870M757M753M247
$$ 331779 326864 322192 317940 314371 311751 309991 308666 307527 306885 307429 309685 313555 318312 323065 327312
63631C27312L756L569L784M482N482O161N937N066M504M898N859O556O717O812
$$ 327312 331068 334637 338421 342903 348385 354546 360483 365549 370053 374951 380810 387366 394083 400895
63617D00895P307Q184R307J0871J3159J5952J8577K0660K2481K4461K6582K8559
$$ 400895 408202 416386 425693 436564 449723 465675 484252 504912 527393 551854 578436 606995
63605F06995L0381L2267L4223L5977L7301L8058L7891L6257L2834K7721K1164
$$ 606995 637376 669643 703866 739843 777144 815202 853093 889350 922184 949905 971069
63594I71069J3460N314k090p648j1007j2649j3415j3910j4290j4555j5060j6432
$$ 971069 984529 989843 987753 980105 969098 956449 943034 929124 914834 900279 885219 868787
63582H68787j8770k1297k3204k4589k5959k7039k6835k5000k2341j9729j7198
$$ 868787 850017 828720 805516 780927 754968 727929 701094 676094 653753 634024 616826
63571F16826j4475j1719r243o953m635k438n80J089K712L940M403M406M665N381
$$ 616826 602351 590632 581389 574436 569801 567363 566783 567872 570584 574524 578927 583333 587998 593379
63557E93379O106O481O698P185Q153R524J1085J2741J4668J7056J9663K1996K4131
$$ 593379 599485 605966 612664 619849 628002 637526 648611 661352 676020 693076 712739 734735 758866
63544G58866K6936L1123L6459M2230M8031N3393N6906N6445N0531L9242K4171
$$ 758866 785802 816925 853384 895614 943645 997038 1053944 1110389 1160920 1200162 1224333
63533A224333P965o409j6845k3014k5860k6305k4811k2047j9204j7392j7072j8205
$$ 1224333 1232298 1225889 1209044 1186030 1160170 1133865 1109054 1087007 1067803 1050411 1033339 1015134
63521A015134k0541k3603k6801k9794l2510l4707l5920l5967l5155l3739l1525
$$ 1015134 994593 970990 944189 914395 881885 847178 811258 775291 740136 706397 674872
63510F74872k8357k4772k1713j9607j7958j6020j3685j1576j0242r456q513p174
$$ 674872 646515 621743 600030 580423 562465 546445 532760 521184 510942 501486 492973 485799
63498D85799o037n750o125o289n706m699l997l950m289m506m366m005l626l175
$$ 485799 479762 474012 467887 461598 455892 451193 447196 443246 438957 434451 430085 426080 422454 419279
63484D19279k501j669r54m77j29J93N97J341K525L582L735L152K933L602M296
$$ 419279 416778 415109 414155 413678 413549 413742 414339 415680 418205 421787 425522 428674 431607 435209 439505
63469D39505M001K958J996J102l19k063l160l315l292l665m070m050l785l545
$$ 439505 443506 446464 448460 449562 449243 447180 444020 440705 437413 433748 429678 425628 421843 418298
63455D18298l185k637k333k526k629j880m15Q76J437J509J622K042K798L850N082
$$ 418298 415113 412476 410143 407617 404988 403108 402693 403569 405006 406515 408137 410179 412977 416827 421909
63440D21909O249P103P628Q151R114J0744J2930J5472J8306K1511K5325L0185
$$ 421909 428158 435261 442889 451040 460154 470898 483828 499300 517606 539117 564442 594627
63428E94627L6222M2382M6498M6789M3108L6429K7634J7653Q309J777j105j208
$$ 594627 630849 673231 719729 766518 809626 846055 873689 891342 899651 901428 900323 899115
63416H99115M57L851R168J5817K2754K9234L4751L8690M0590M0334L7672L2057
$$ 899115 899572 903423 912591 928408 951162 980396 1015147 1053837 1094427 1134761 1172433 1204490
63404A204490K3558J3614M208l567r791j4797j8540k0802k1582k1383k1276k2404
$$ 1204490 1228048 1241662 1245870 1242303 1232512 1217715 1199175 1178373 1156791 1135408 1114132 1091728
63392A091728k5028k8230l0915l2938l4831l6676l7794l7541l5961l3539l0611
$$ 1091728 1066700 1038470 1007555 974617 939786 903110 865316 827775 791814 758275 727664
63381G27664k7206k3334j9325j5878j3543j2130j0841r095p015n034l354j912
$$ 727664 700458 677124 657799 641921 628378 616248 605407 596312 589297 584263 580909 578997
63369E78997m47J586M657Q327J1290J2766J3435J4438J5893J7181J8318K0049
$$ 578997 578550 580136 584793 593120 604410 617176 630611 645049 660942 678123 696441 716490
63357G16490K2585K5278K7755L0502L3874L7290L9979M1978M3725M4951M4629
$$ 716490 739075 764353 792108 822610 856484 893774 933753 975731 1019456 1064407 1109036
63346A109036M1959L6966L0164K2132J3446M778l203r881j4774j7753j9253k0052
$$ 1109036 1150995 1187961 1218125 1240257 1253703 1258481 1255278 1245397 1230623 1212870 1193617 1173565
63334A173565k0803k1784k3060k4656k6566k8765l1262l3949l6280l7406l6866
$$ 1173565 1152762 1130978 1107918 1083262 1056696 1027931 996669 962720 926440 889034 852168
63323H52168l5100l2942l0632k7637k3544j8778j4132r783n147J59N375Q591P795
$$ 852168 817068 784126 753494 725857 702313 683535 669403 659620 654473 654632 660007 668598 676393
63310F76393K285o509j5652k2488k6044k6853k5884k3927k1642j9404j7039j4259
$$ 676393 678678 672169 656517 634029 607985 581132 555248 531321 509679 490275 473236 458977
63298D58977j1494r684r067q762p897o680n924n909o213o399o333o030n594n261
$$ 458977 447483 437799 428732 419970 412073 405393 399469 393560 387347 380948 374615 368585 362991 357730
63284C57730n135m969m501l842l280k816k312j907j867k072k049j625j167j127
$$ 357730 352595 347626 343125 339283 336003 333187 330875 328968 327101 325029 322980 321355 320188 319061
63270C19061j527j999k149j883j437j107q95n67o4M35Q44J218J288N09j034k286
$$ 319061 317534 315535 313386 311503 310066 308959 308064 307497 307433 307868 308712 309930 311218 311727 310693 308407
63254C08407k345j571r29n60J26J127J585J053K00j41M4L47P34J366J951J904
$$ 308407 306062 304491 303562 303002 303128 304255 305840 306893 307093 306952 306996 307343 308077 309443 311394 313298
63238C13298J088J7o74p50m65l02n33q92q20j41O56R62P06K91M0j03l86r36j617
$$ 313298 314386 314403 313729 312979 312514 312212 311679 310787 309967 309826 310482 311444 312150 312441 312481 312378 311992 311056 309439
63219C09439k051j821p82P44K128K813K665K042J492J252J123R05P88J085J689
$$ 309439 307388 305567 304785 305529 307657 310470 313135 315177 316669 317921 319044 319949 320737 321822 323511
63204C23511K136K176K021K024K315K756K943K364R95l20n24M69J716K475K970
$$ 323511 325647 327823 329844 331868 334183 336939 339882 342246 343241 342921 342397 342866 344582 347057 350027
63189C50027L682M467M996N593O893Q764J0270J0812J0753J0780J1136J1694J2342
$$ 350027 353709 358176 363172 368765 375658 384422 394692 405504 416257 427037 438173 449867 462209
63176D62209J2878J2906J2279J1462J1022J0848J0272R038P635O518N501M299
$$ 462209 475087 487993 500272 511734 522756 533604 543876 552914 560549 567067 572568 576867
63164E76867L233K818K771K131M33j788l828n575p157q454r486j0780j2681j4556
$$ 576867 580100 582918 585689 587820 588253 586465 582637 577062 569905 561451 551965 541185 528504 513948
63150E13948j5424j5245j4864j4653j3984j2365j0367q956q285p656o512n057
$$ 513948 498524 483279 468415 453762 439778 427413 417046 408090 399805 392149 385637 380580
63138C80580l845l090k495j737r25m24k34J02P74J296J212R17J133J837K395K728
$$ 380580 376735 373645 371150 369413 368488 368064 367830 367932 368706 370002 371214 372131 373264 375101 377496 380224
63122C80224L402M521N399N684N948O660P329P345P035P093P422P313O575N729
$$ 380224 383626 388147 393546 399230 405178 411838 419167 426512 433547 440640 448062 455375 461950 467679
63108D67679N202M962M869M850M785M648M669M937N070M748M347M455M919N077
$$ 467679 472881 477843 482712 487562 492347 496995 501664 506601 511671 516419 520766 525221 530140 535217
63094E35217M814M781N446O612P882R070J0022J0587J0812J0733R912P825M778
$$ 535217 540031 544812 550258 556870 564752 573822 583844 594431 605243 615976 625888 633713 638491
63081F38491J833l36k041l833n734p411q622r312r626j0002j0748j1440j1298
$$ 638491 640324 639988 637947 634114 628380 620969 612347 603035 593409 583407 572659 561219 549921
63068E49921j0309r319q849q473p712o783o039n335m473l693l116k296r82J86
$$ 549921 539612 530293 521444 512971 505259 498476 492437 487102 482629 478936 475820 473524 472542 472728
63054D72728M98L06N76J604K861L874M549M868M975N349O190O832O582N870N752
$$ 472728 473226 473532 474108 475712 478573 482447 486996 491864 496839 502188 508378 515210 521792 527662 533414
63039E33414O363O915P096P412P963Q019P246O343N861N307M128K849K348K533
$$ 533414 539777 546692 553788 561200 569163 577182 584428 590771 596632 601939 606067 608916 611264 613797
63025F13797K538J957J084J50r71k233l211l579l522l598m233n216n640m708k804
$$ 613797 616335 618292 619376 619526 618555 616322 613111 609532 606010 602412 598179 592963 587323 582615 579811
63010E79811j274r02j006m44R80K639M232O041Q231J0473J2375J3843J5023J6152
$$ 579811 578537 577635 576629 576185 577165 579804 584036 590077 598308 608781 621156 634999 650022 666174
62996F66174J7331J8221J8242J7457J6809J6949J7222J6435J4436J2225J0757
$$ 666174 683505 701726 719968 737425 754234 771183 788405 804840 819276 831501 842258
62985H42258J0282J0637J1299J1346J0225Q521P094N543K699j310m879p165r259
$$ 842258 852540 863177 874476 885822 896047 904568 911662 917205 919904 918594 913715 906550 897291
62972H97291j2337j5846j8539k0332k1902k3103k3163k2188k1203k0668k0002
$$ 897291 884954 869108 850569 830237 808335 785232 762069 739881 718678 698010 678008
62961F78008j8714j7060j5437j3905j2567j1691j1175j0496r441q428p895p850
$$ 678008 659294 642234 626797 612892 600325 588634 577459 566963 557522 549094 541199 533349
62949E33349q222r043j0033j0537j0275r761r609r755r716r302q693q004p176
$$ 533349 525127 516084 506051 495514 485239 475478 465869 456114 446398 437096 428403 420399 413223
62936D13223o205n237m466m101m209m485m393l743k965k565k536k511k339k197
$$ 413223 407018 401781 397315 393214 389005 384520 380127 376384 373419 370854 368318 365807 363468 361271
62922C61271k236k358k323j917j052P2R61J194Q09K37q7M7O38J463K105K234J876
$$ 361271 359035 356677 354354 352437 351385 351457 352418 353612 354421 354658 354571 354618 355256 356719 358824 361058 362934
62905C62934J299O42j02p44q43j98P37J253J269J527K659M228N115N021N050O380
$$ 362934 364233 364875 364773 364029 363186 362988 363725 364978 366247 367774 370433 374661 379776 384797 389847 396227
62889C96227Q604J0059R825Q708P988P780P243O006M592L452K346R79l03r87j321
$$ 396227 404831 414890 424715 433423 441411 449191 456434 462440 467032 470484 472830 473809 473506 472519 471198
62874D71198k201m044o102p223p132o715o921p632p879p087n763m839m633m757
$$ 471198 468997 464953 458851 451628 444496 437781 430860 423228 415349 408262 402499 397660 393027 388270
62860C88270m795m670m442m168m055m289m582m264l118j777r81o91l52J37K62
$$ 388270 383475 378805 374363 370195 366140 361851 357269 353005 349887 348110 347129 346438 346086 346223 346485
62845C46485k59r41j033l50N38Q33J71r58j542r83K22J025J060Q73R19Q77L62
$$ 346485 346226 345285 344252 343902 344440 345273 345444 344486 342944 341961 342183 343208 344268 345141 346060 346937 347299
62828C47299k51k42M54J240J706J899J856J484R67P79J044J320J181O55k7o92
$$ 347299 347048 346806 347260 348500 350206 352105 353961 355445 356412 357191 358235 359555 360736 361391 361364 360672
62812C60672j088r89o22n87j045j427j272r21r38j194j145p86o52r53j266j209
$$ 360672 359584 358595 357973 357386 356341 354914 353642 352721 351783 350589 349444 348658 348006 347053 345787 344578
62796C44578r17o65m24MO19J167J321Q69l4p69p16N4O95M68m11r19k85J247K732
$$ 344578 343661 342996 342572 342576 343195 344362 345683 346552 346518 345749 345033 345087 345782 346250 345839 344920 344635 345882 348614
62777C48614L524L748L812L783L609L644M328N323N667N031M205L907L762L041
$$ 348614 352138 355886 359698 363481 367090 370734 375062 380385 386052 391083 395288 399195 402957 405998
62763D05998J841P61j38j165j968j828q76j28j32n09j030k088l684m867m909m378
$$ 405998 407839 408600 408462 407297 405329 403501 402625 402497 402365 401856 400826 398738 395054 390187 385278 380900
62747C80900m285m740n128n153m976m675m285m068m090l728k467r50m50j225k260
$$ 380900 376615 371875 366747 361594 356618 351943 347658 343590 339500 335772 333305 332355 331905 330680 328420
62732C28420k684k685k693k491j667m01P27J463J906K041J737J136O75O79J177
$$ 328420 325736 323051 320358 317867 316200 315799 316526 317989 319895 321936 323673 324809 325484 326163 327340
62717C27340K027K913L349L059K466K422L244M318M891N043N497O587P874Q860
$$ 327340 329367 332280 335629 338688 341154 343576 346820 351138 356029 361072 366569 373156 381030 389890
62703C89890R642J0634J1950J3391J4808J6138J7313J8452J9977K2054K4112K5384
$$ 389890 399532 410166 422116 435507 450315 466453 483766 502218 522195 544249 568361 593745
62691E93745K5924K6519K7585K8637K9034K8669K7731K6255K4182K1491J8030
$$ 593745 619669 646188 673773 702410 731444 760113 787844 814099 838281 859772 877802
62680H77802J3678Q800M039o29n913j1876j7300k1119k3826k6609k9464l1225
$$ 877802 891480 900280 904319 903690 897777 885901 868601 847482 823656 797047 767583 736358
62668G36358l1316l0450k9477k8419k6989k5253k3420k1473j9435j7560j5985
$$ 736358 705042 674592 645115 616696 589707 564454 541034 519561 500126 482566 466581
62657D66581j4520j3013j1584j0362r360q659q295p820o590m686l039k359k440
$$ 466581 452061 439048 427464 417102 407742 399083 390788 382968 376378 371692 368653 366294 363854
62644C63854k805l370m051m306l748k812k207j921j439p16j96M7M73J293K026
$$ 363854 361049 357679 353628 349322 345574 342762 340555 338634 337195 336479 336283 336330 336803 338096 340122
62629C40122K131J612Q19J8p24j393j973k367k377k018j759k046k588k519j468
$$ 340122 342253 343865 344684 344702 343978 342585 340612 338245 335868 333850 332091 330045 327457 324938 323470
62614C23470j52L40l37j543k330k189j361n66l36m90l82L11J224J780J758J326
$$ 323470 323318 323658 323321 321778 319448 317259 315898 315332 314996 314506 314124 314435 315659 317439 319197 320523
62598C20523P95M97O03Q42O69k1n40j69R08J774J792J153M86K35L96N81L67k15
$$ 320523 321318 321815 322418 323260 323929 323908 323368 323199 324107 325881 327673 328826 329312 329547 329943 330524 330891 330676
62580C30676n48r6Q50J466J389J015P08K83n05j357j720j488j097j070j610k463
$$ 330676 330128 330032 330882 332348 333737 334752 335460 335743 335238 333881 332161 330673 329576 328506 326896 324433
62564C24433l000k738j994j672k115k521j999q37j03j68l30L6O67J002R54P88
$$ 324433 321433 318695 316701 315029 312914 310393 308394 307557 307454 307286 306956 306992 307659 308661 309615 310403
62548C10403O09M32L94N28N42J62m02o70m43R4O78J157J462J579J543J334R50
$$ 310403 311012 311444 311838 312366 312908 313070 312668 311998 311555 311649 312327 313484 314946 316525 318068 319402 320352
62531C20352O68R27J728K357K078J033J80L52J540L037M081M395M311M397M922
$$ 320352 321020 321947 323675 326032 328110 329143 329323 329675 331215 334252 338333 342728 347039 351436 356358
62516C56358N736O612P495Q351R172J0211J1899J4126J6050J6972J7232J7695
$$ 356358 362094 368706 376201 384552 393724 403935 415834 429960 446010 462982 480214 497909
62504D97909J8585J9329J9456J9083J8485J7611J6186J3956J0874P309M051J632
$$ 497909 516494 535823 555279 574362 592847 610458 626644 640600 651474 658783 662834 664466
62492F64466k30k084l748m457l979k901j678j29J837L746N368P341J0304J3811
$$ 664466 664236 662152 658404 653947 649968 647067 645389 645260 647097 650843 656211 663552 673856 687667
62478F87667J6749J8620J9838K0882K1707K1822K0504J7092J1718N681N72l155
$$ 687667 704416 723036 742874 763756 785463 807285 827789 844881 856599 862280 862852 859697
62466H59697o407j0283j5045k0189k5004k8902l1595l3133l3643l3116l1733l0150
$$ 859697 853290 843007 827962 807773 782769 753867 722272 689139 655496 622380 590647 560497
62454E60497k8935k7734k5665k2580j9328j6532j3905j1138q761p391o662n742
$$ 560497 531562 503828 478163 455583 436255 419723 405818 394680 385919 378528 371866 366124
62442C66124m594l865l597k998j708m72j03l79m37L1N06L78l98j368j937j787
$$ 366124 361530 357665 354068 351070 349362 348890 348787 348408 347971 348002 348508 348886 348488 347120 345183 343396
62426C43396j133m78n3L57P84P17k31j518k101j650q50m38m49n52n56l07M43J571
$$ 343396 342263 341785 341732 342089 342873 343590 343359 341841 339740 338090 337240 336802 336353 335801 335245 334938 335381 336952
62408C36952K358K216J461Q58N32k6q85j315p87K46R81J256J435J573J391R75
$$ 336952 339310 341526 342987 343845 344377 344351 343466 342151 341364 341610 342591 343847 345282 346855 348246 349221
62392C49221R03J478K323K977L515M216M903N044M493L755L494L947M834N646
$$ 349221 350124 351602 353925 356902 360417 364633 369536 374580 379073 382828 386322 390269 395103 400749
62378D00749O053O237O761P855Q931R202Q825Q912J0168J1941J3045J3243J3378
$$ 400749 406802 413039 419800 427655 436586 445788 454613 463525 473693 485634 498679 511922 525300
62365E25300J4200J5625J7214J8839K0646K2748K5268K8498L2662L7608M2824
$$ 525300 539500 555125 572339 591178 611824 634572 659840 688338 721000 758608 801432
62354H01432M7804N2290N6321O0119O3769O6853O8505O7874O4553N8589N0299
$$ 801432 849236 901526 957847 1017966 1081735 1148588 1217093 1284967 1349520 1408109 1458408
62343A458408M0147K8618J6205L651p851j7137k4040k9614l5128m0883m6184n0165
$$ 1458408 1498555 1527173 1543378 1547029 1539178 1522041 1498001 1468387 1433259 1392376 1346192 1296027
62331A296027n2425n3050n2418n0940m8749m5729m2021l8326l5352l3078l0907
$$ 1296027 1243602 1190552 1138134 1087194 1038445 992716 950695 912369 877017 843939 813032
62320H13032k8511k6133k4116k2556k1512k1135k1301k1456k1040j9961j8448
$$ 813032 784521 758388 734272 711716 690204 669069 647768 626312 605272 585311 566863
62309E66863j6675j4728j2805j1175r928q938q037p126o124m982l775k672j795
$$ 566863 550188 535460 522655 511480 501552 492614 484577 477451 471327 466345 462570 459898 458103
62296D58103j115n77k19j00r8Q6N80J142J412J404J536K132L030L757L966L662
$$ 458103 456988 456411 456192 456092 455994 456080 456660 457802 459214 460618 462154 464286 467316 471073 475039 478701
62280D78701L189L038L432L970L949L179K275J944K246K830L628M805O182P192
$$ 478701 481890 484928 488360 492330 496279 499458 501733 503677 505923 508753 512381 517186 523368 530560
62266E30560P624Q004R054J0992J3507J6289J9357K2882K6843L0997L5221L9759
$$ 530560 538184 546188 555242 566234 579741 596030 615387 638269 665112 696109 731330 771089
62254G71089M4888N0436N5884O0926O5499O9163P1002P0422O7557O2463N4551
$$ 771089 815977 866413 922297 983223 1048722 1117885 1188887 1259309 1326866 1389329 1443880
62243A443880M3499L0367J7001M472p141j7681k6649l4148m1122m8153n4663n9638
$$ 1443880 1487379 1517746 1534747 1539219 1532078 1514397 1487748 1453600 1412478 1364325 1309662 1250024
62231A250024o2569o3414o2345n9948n7074n3966n0037m4967l9575l4970l1317
$$ 1250024 1187455 1124041 1061696 1001748 944674 890708 840671 795704 756129 721159 689842
62220F89842k8028k4848k2014j9545j7154j4855j3046j1869j0960r975q993q254
$$ 689842 661814 636966 614952 595407 578253 563398 550352 538483 527523 517548 508555 500301
62208E00301p765p306o694n931n190m628m168l604k895k174j395l05J041K121
$$ 500301 492536 485230 478536 472605 467415 462787 458619 455015 452120 449946 448551 448246 449287 451408
62194D51408K570K702L081L866M896O085P327Q279Q711Q918R301R794J0109J0422
$$ 451408 453978 456680 459761 463627 468523 474608 481935 490214 498925 507843 517144 526938 537047 547469
62180E47469J1186J2363J3379J3840J3792J3339J2450J1265J0048Q881P836P414
$$ 547469 558655 571018 584397 598237 612029 625368 637818 649083 659131 668012 675848 683262
62168F83262Q267J0409J3336J6930K1619K7317L3008L7830M2007M6053M9508N1195
$$ 683262 691529 701938 715274 732204 753823 781140 814148 851978 893985 940038 989546 1040741
62156A040741N0512M7837M3547L7409K9158J9337R191j39q166j4971k0865k6183
$$ 1040741 1091253 1139090 1182637 1220046 1249204 1268541 1277732 1277593 1269427 1254456 1233591 1207408
62144A207408l1238l6257m1159m5428m8319m9344m8605m6672m4107m1053l7297
$$ 1207408 1176170 1139913 1098754 1053326 1005007 955663 907058 860386 816279 775226 737929
62133G37929l2783k8068k3989k0887j8285j5557j2703j0236q572p758p609p687
$$ 737929 705146 677078 653089 632202 613917 598360 585657 575421 566849 559091 551482 543795
62121E43795p288n938l892j841j12J385K623L470M263N705P935J0362J2641J5252
$$ 543795 536507 530569 526677 524836 524724 526109 528732 532202 536465 542170 550105 560467 573108 588360
62107E88360J8682K2592K6215K9005L0311K9113K5045J9407J4215J0409P749O272
$$ 588360 607042 629634 655849 684854 715165 744278 769323 788730 802945 813354 821103 827375
62095H27375O602Q535J0324J0047P184K419l334r073j3509j5694j5784j4665j2926
$$ 827375 833977 842512 852836 862883 870067 872486 869152 860079 846570 830876 815092 800427 787501
62082G87501j0681q094n448k733K89L559O790R959J3193J6152J8265J9671K1284
$$ 787501 776820 768726 763278 760545 760834 764393 771183 781142 794335 810487 828752 848423 869707
62069H69707K3537K5732K7064K7738K8548K9673L0628L1221L1943L3322L5372
$$ 869707 893244 918976 946040 973778 1002326 1031999 1062627 1093848 1125791 1159113 1194485
62058A194485L7670L9600M0412L9459L6485L1488K4520J5926O819j354p983j3683
$$ 1194485 1232155 1271755 1312167 1351626 1388111 1419599 1444119 1460045 1466864 1465510 1457527 1443844
62046A443844j9367k5197l0669l5401l9435m2890m5687m7621m8522m8332m7142
$$ 1443844 1424477 1399280 1368611 1333210 1293775 1250885 1205198 1157577 1109055 1060723 1013581
62035A013581m5181m2731m0023l7203l4279l1099k7559k3875k0477j7600j5078
$$ 1013581 968400 925669 885646 848443 814164 783065 755506 731631 711154 693554 678476
62024F78476j2675j0477q827p940p591p250o561n813n720o516p410p363o355n412
$$ 678476 665801 655324 646497 638557 630966 623716 617155 611342 605622 599106 591696 584333 577978 572566
62010E72566n232n346m891l835k899k486k217j521l22J028K211L269M479N951
$$ 572566 567334 561988 557097 553262 550363 547877 545660 544139 543817 544845 547056 550325 554804 560755
61996E60755P344Q050P724O558N034L581K505J959J738J327L04j286l074m715
$$ 560755 568099 576149 583873 590431 595465 599046 601551 603510 605248 606575 606879 605593 602519 597804
61982E97804n976o802p415q196r190r932r946r280q321p308o307n486n036m878
$$ 597804 591828 585026 577611 569415 560225 550293 540347 531067 522746 515438 509131 503645 498609 493731
61968D93731m698m278l651k963k372k079k193k617l081l231k772j726o56k48m78
$$ 493731 489033 484755 481104 478141 475769 473690 471497 468880 465799 462568 459796 458070 457414 457166 456688
61953D56688n75m1O61Q49P33J183K554M251N513O179O526O840P351Q351J0055
$$ 456688 456113 456072 456733 457582 458315 459498 462052 466303 471816 477995 484521 491361 498712 507063 517118
61938E17118J2353J4778J6792J8170J9111J9889K0489K0758K0785K0751K0397
$$ 517118 529471 544249 561041 579211 598322 618211 638700 659458 680243 700994 721391
61927G21391J9225J7372J5668J4561J3533J1998J0125Q174N703K317j291m065
$$ 721391 740616 757988 773656 788217 801750 813748 823873 832047 837750 840067 838776 834711
61915H34711o035q031r946j0489q943o211l674j669M03L073O375R978J3318J5810
$$ 834711 828676 820645 810699 800210 791267 785056 781382 779713 780116 783189 789564 799542 812860 828670
61901H28670J7251J7842J7701J6697J4766J2003Q380L806j371o357j0611j4128
$$ 828670 845921 863763 881464 898161 912927 924930 933310 937116 935745 929388 918777 904649
61889I04649j6968j8978k0151k0780k1054k0920k0504k0160j9903j9262j7966
$$ 904649 887681 868703 848552 827772 806718 785798 765294 745134 725231 705969 688003
61878F88003j6346j4895j3835j3273j3234j3398j3327j3093j3047j2863j1631
$$ 688003 671657 656762 642927 629654 616420 603022 589695 576602 563555 550692 539061
61867E39061r288p044n797m976l708k351j748j548m44J970M755P084R172J1441
$$ 539061 529773 522729 516932 511956 508248 505897 504149 502601 502157 504127 508882 515966 525138 536579
61853E36579J3603J5186J6475J8347K1278K4768K7810K9826L1170L2633L4506
$$ 536579 550182 565368 581843 600190 621468 646236 674046 703872 735042 767675 802181
61842H02181L6229L6985L6365L4327L0918K6355K1114J5570R732L613k393p752
$$ 802181 838410 875395 911760 946087 977005 1003360 1024474 1040044 1049776 1053389 1050996 1043244
61830A043244j2121j5125j6150j4965j2242q935n248p54M569R962J4530J7783
$$ 1043244 1031123 1015998 999848 984883 972641 963706 958458 957704 962273 972235 986765 1004548
61818A004548J9536J9808J8812J6643J2928P330L42o889j3669k0121k6304l1579
$$ 1004548 1024084 1043892 1062704 1079347 1092275 1099605 1099947 1093058 1079389 1059268 1032964 1001385
61806A001385l5224l7296l8383l8739l8067l6170l3493l0881k8844k7120k5002
$$ 1001385 966161 928865 890482 851743 813676 777506 744013 713132 684288 657168 632166
61795F32166k2082j8674j5489j3017j1360j0375r740q936p615n975m574l650k953
$$ 632166 610084 591410 575921 562904 551544 541169 531429 522493 514878 508903 504329 500679 497726
61782D97726k213j563j273j292j266r34l15M71J418K507L413L593K816J569O01
$$ 497726 495513 493950 492677 491385 490119 489185 488870 489341 490759 493266 496679 500272 503088 504657 505258
61767E05258K07J49K73P35J490K009J863J263P52N98P57J120J472J479J178J141
$$ 505258 505465 505614 505887 506622 508112 510121 511984 513247 513999 514597 515354 516474 517946 519425 520603 521744
61751E21744J752K536K698K129J303M22o11j505j724j448j587k485l284l112k342
$$ 521744 523496 526032 528730 530859 532162 532584 531973 530468 528744 527296 525709 523224 519940 516828 514486
61736E14486k009k300k444j946j267j013r80m85O28J684J999J695J531K063L100
$$ 514486 512477 510177 507733 505787 504520 503507 502527 502042 502670 504354 506353 508048 509579 511642 514742
61721E14742L967M100L500K693K290K400K526K229J754J712K197K592K342J506
$$ 514742 518709 522809 526309 529002 531292 533692 536218 538447 540201 541913 544110 546702 549044 550550
61707E50550M45o49j674k473l068l699m392m786m688m359m009l459k664k070j896
$$ 550550 550995 550346 548672 546199 543131 539432 535040 530254 525566 521207 517198 513739 511075 509005 507109
61692E07109j519l38J138J870J770J747K282K867L018L044L397L886M049L899
$$ 507109 505590 505252 506390 508260 510030 511777 514059 516926 519944 522988 526385 530271 534320 538219
61678E38219L864M117M291L859K745J548J024J215J377R89M78M73P49N77j21p91
$$ 538219 542083 546200 550491 554350 557095 558643 559667 560882 562259 563248 563726 564199 564948 565525 565404 564613
61662E64613j317k132l148l485k722j608j006p93l05N52J278J552J482J270J058
$$ 564613 563296 561164 558016 554531 551809 550201 549195 548402 548097 548649 549927 551479 552961 554231 555289
61647E55289J012J231J592J870J966J970K083K473K981L115K661K154K255K732
$$ 555289 556301 557532 559124 560994 562960 564930 567013 569486 572467 575582 578243 580397 582652 585384
61633E85384K709J899Q20k74j679l208l873l356k860l535m733m889l809k824k767
$$ 585384 588093 589992 590812 590538 588859 585651 581778 578422 575562 572027 567294 562405 558596 555772 553005
61618E53005k989k653j981j653j727j781j712j791k127k527k847l075l185l267
$$ 553005 550016 547363 545382 543729 542002 540221 538509 536718 534591 532064 529217 526142 522957 519690
61604E19690l786n253p447r253r600q487o869n628m916m408l866l297k884k911
$$ 519690 515904 510651 503204 493951 484351 475864 468995 463367 458451 454043 450177 446880 443996 441085
61590D41085l429l916l682k830k327k654l013k439j274o66q63j074q91p67r42
$$ 441085 437656 433740 430058 427228 424901 422247 419234 416795 415521 414855 413992 412918 412027 411260 410318
61575D10318r54o73p53j433j816j102J02N77Q1o21r70j021r13o66l75r6L37Q19
$$ 410318 409364 408691 407938 406505 404689 403587 403689 404266 404347 403726 402756 401735 400822 400156 399781 399685 400022 400841
61557D00841P43j89j240j455r47n05k19M79J475J757R18r6k09M43R70R23N55J84
$$ 400841 401584 401395 400155 398700 397753 397248 397029 397508 398983 400740 401658 401562 401353 401796 402766 403689 404244 404428
61539D04428n7n5J97M15K29l21p63o80j06N76J041J251J272R82K11q33j639k058
$$ 404428 404371 404316 404513 404928 405157 404836 404073 403393 403287 403863 404904 406155 407427 408409 408620 407787 406148 404090
61521D04090k508l220l687l428k960l185l941m029k938j633j176j359j377j236
$$ 404090 401582 398362 394675 391247 388287 385102 381161 377132 374194 372561 371385 370026 368649 367413
61507C67413j514k074k045j232o25j065k051k437j876j010m47j66O2J97Q3k79
$$ 367413 365899 363825 361780 360548 359923 358858 356807 354370 352494 351484 351037 350871 350933 351130 351213 350934
61491C50934p93j352j745j706j238o74k52P0K97J98k84p66r27r05r08o84j9O33
$$ 350934 350141 348789 347044 345338 344100 343426 343174 343244 343541 343739 343455 342689 341762 340857 339949 339265 339246 339879
61473C39879O92M75Q30J748K223J697Q32M46M73M93O05J034J456J383R46N92K99
$$ 339879 340571 341046 341876 343624 345847 347544 348376 348822 349295 349788 350393 351427 352883 354266 355212 355804 356103
61456C56103k44q47r46m49P6J54j98p08j074r05J9J315K218K315J873J395J123
$$ 356103 355859 355012 354066 353617 353693 353847 353649 352941 351867 350962 350981 352296 354514 356829 358702 360097 361220
61439C61220R86Q34O88P95J313J934K137J963K106K929L904M335M254M040L636
$$ 361220 362206 363040 363728 364523 365836 367770 369907 371870 373976 376905 380809 385144 389398 393438 397074
61424C97074K739J508L60o46j555j951j387k73N09P87J145J871K608L083L339
$$ 397074 399813 401321 401681 401035 399480 397529 396142 395869 396378 397165 398310 400181 402789 405872 409211
61409D09211L151K104M60q63j441j737k173k504k477k308k205k054j960k377l252
$$ 409211 412362 414466 414926 414063 412622 410885 408712 406208 403731 401423 399218 397164 395204 392827 389575
61394C89575l772l489k986k862k701j880p59k03l13l91j9N84J116J453J421R11
$$ 389575 385803 382314 379328 376466 373765 371885 371126 370923 370610 370219 370200 370784 371900 373353 374774 375685
61378C75685K81P5M20J015J573J895J728J091N76P27J200J171N78K90R10J964
$$ 375685 375966 376041 376461 377476 379049 380944 382672 383763 384339 385066 386266 387437 388015 388305 389215 391179
61362C91179K571K457J970J479J128J049J382K010K464K340J811J612K279L531
$$ 391179 393750 396207 398177 399656 400784 401833 403215 405225 407689 410029 411840 413452 415731 419262
61348D19262M665N485O339P222P534P185P225Q629J0803J2211J2309J1907J1577
$$ 419262 423927 429412 435751 442973 450507 457692 464917 473546 484349 496560 508869 520776 532353
61335E32353J0738Q746O106L850K254Q51n47j532j850j920k463l812n627p117
$$ 532353 543091 551837 557943 561793 564047 564898 564351 562819 560969 559049 556586 552774 547147 540030
61321E40030p600p060o058n055l996k798j942k010k703k916k061q52l86p40r69
$$ 540030 532430 525370 519312 514257 510261 507463 505521 503511 500808 497892 495831 494979 494593 493853 492884
61306D92884m09O08J446K095K983M142N078N439N476N716O425P513Q685R509R440
$$ 492884 492475 493083 494529 496624 499607 503749 508827 514266 519742 525458 531883 539396 548081 557590 567030
61291E67030Q096N538K270j043l859n975p491q472q693p927o591n653n608n785
$$ 567030 575126 580664 582934 581891 578032 572057 564566 556094 547401 539474 532883 527230 521622 515837
61277E15837n104l426j658n67L5P15J612K502L371M418N574O465O913P199P732
$$ 515837 510733 507307 505649 505082 505117 505832 507444 509946 513317 517735 523309 529774 536687 543886 551618
61262E51618Q569R430R969J0044R738R249Q766Q456Q550R314J0744J2479J4118
$$ 551618 560187 569617 579586 589630 599368 608617 617383 625839 634389 643703 654447 666926 681044
61249F81044J5547J6678J6962J5630J2549Q538M550Q26k889o615r951j2495j4037
$$ 681044 696591 713269 730231 745861 758410 766948 771498 772324 769435 762820 752869 740374 726337
61236G26337j4439j3733j2379j1041r943q732p101n270l664k391j296l79R5k9
$$ 726337 711898 698165 685786 674745 664802 656070 648969 643699 640035 637644 636348 635969 636064 636035
61222F36035m89p01k08R21K185L143L729L997L814L129K297J688J083M6j129j533
$$ 636035 635546 634845 634637 635558 637743 640886 644615 648612 652426 655555 657852 659540 660623 660669 659540 658007
61206F58007q61P0L92J87L0j5k76p60j078r66m27M20J381K228L098M461O409Q321
$$ 658007 657146 657216 657608 657795 657825 657810 657534 656774 655696 654730 654303 654723 656104 658332 661430 665891 672300 680621
61188F80621R797J1438J4048J7376K0470K2964K5092K6509K6137K3464J9306J4988
$$ 680621 690418 701856 715904 733280 753750 776714 801806 828315 854452 877916 897222 912210
61176I12210J1374Q838P427O721O044N196M560M277L796K506L32k422n331p777
$$ 912210 923584 932422 939849 946570 952614 957810 962370 966647 970443 972949 973281 970859 965528 957751
61162I57751r273j0141j1331j3189j4998j6015j6398j6632j6722j6487j6164j6022
$$ 957751 948478 938337 927006 913817 898819 882804 866406 849774 833052 816565 800401 784379
61150G84379j5748j4857j3448j1982j0514q760o672m386j785J224M071N862O393
$$ 784379 768631 753774 740326 728344 717830 709070 702398 698012 696227 697451 701522 707384 713777
61137G13777O269N899M950K954N9l069n823p878r065r281q523o975n062l250j669
$$ 713777 720046 725945 730895 733849 733908 730839 725016 717138 708073 698792 690269 683294 678232 674982 673313
61122F73313rK029M271O259P852R386J1271J3574J6054J8393K0396K2067K3481
$$ 673313 673304 675333 679604 685863 693715 703101 714372 727946 744000 762393 782789 804856 828337
61109H28337K4602K5270K5479K5528K5746K6172K6532K6480K5768K4366K2539
$$ 828337 852939 878209 903688 929216 954962 981134 1007666 1034146 1059914 1084280 1106819
61098A106819K0649J8789J6770J4536J2401J0625Q864O283K311k859q455j3788
$$ 1106819 1127468 1146257 1163027 1177563 1189964 1200589 1209453 1215736 1218047 1215188 1206733 1192945
61086A192945j8636k2963k6446k8545k9132k8720k7913k6872k5650k4622k4116
$$ 1192945 1174309 1151346 1124900 1096355 1067223 1038503 1010590 983718 958068 933446 909330
61075I09330k3822k3115k1812k0110j7973j5286j2484j0309q851p524o073m831
$$ 909330 885508 862393 840581 820471 802498 787212 774728 764419 755568 748044 741971 737140
61063G37140l943l077k124j404r76m66J81O58J100K093L557M632N099N829P377
$$ 737140 733197 730120 727996 726592 725616 725150 725331 725989 727089 729182 732739 737371 742470 748299 755676
61048G55676R142J0560J1972J3602J4795J5371J6542J9270K2510K4516K5211K5885
$$ 755676 764818 775378 787350 800952 815747 831118 847660 866930 889440 913956 939167 965052
61036I65052K7111K8346K9248L0011L0558L0659L0743L1460L2586L3434L4081
$$ 965052 992163 1020509 1049757 1079768 1110326 1140985 1171728 1203188 1235774 1269208 1303289
61025A303289L5150L6598L7875L9076M0733M2774M4842M7405N1251N6040O0586
$$ 1303289 1338439 1375037 1412912 1451988 1492721 1535495 1580337 1627742 1678993 1735033 1795619
61014A795619O4255O6906O8058O7823O8302P2111P9608Q9404J01481J17421J37385
$$ 1795619 1859874 1926780 1994838 2062661 2130963 2203074 2282682 2372086 2473567 2590988 2728373
61003B728373J59280J81780K06203K34928K70192L15133L73497M47170N36293
$$ 2728373 2887653 3069433 3275636 3510564 3780756 4095889 4469386 4916556 5452849
60994E452849O42858P71569R26208J108804J324379J582655J892549K259562K689050
$$ 5452849 6095707 6867276 7793484 8902288 10226667 11809322 13701871 15961433 18650483
60985A8650483L173848L651767L970591L927832L393681K426081J269109K28804
$$ 18650483 21824331 25476098 29446689 33374521 36768202 39194283 40463392 40692196
60977D0692196m67245p26974n74940j31629L84687O90342N46332j10229j123662
$$ 40692196 40224951 39497977 38923037 38791408 39176095 39866437 40412769 40302540 39178878
60968C9178878k208002l094153l630911l798756l667387l342594k925289k489102
$$ 39178878 36970876 33876723 30245812 26447056 22779669 19437075 16511786 14022684
60960A4022684k077313j711763j401171j144411r33995p61947o22905n12294m24789
$$ 14022684 11945371 10233608 8832437 7688026 6754031 5992084 5369179 4856885 4432096
60951D432096l56003l03402k64052k33386k07660j85876j67846j51996j36710
$$ 4432096 4076093 3772691 3508639 3275253 3067593 2881717 2713871 2561875 2425165
60942B425165j22269j09658r8485q7924p8835p3067p1066p1632p3526p5817p6971
$$ 2425165 2302896 2193238 2094753 2006829 1927994 1854927 1783861 1712229 1638703 1562886 1485915
60931A485915p5426p1313o6363o1851n7572n2913m7977m3360l9540l6658l4378
$$ 1485915 1410489 1339176 1272813 1210962 1153390 1100477 1052500 1009140 969600 932942 898564
60920H98564l1925k8811k5561k3123k1633k0350j8778j7185j5911j4722j3086
$$ 898564 866639 837828 812267 789144 767511 747161 728383 711198 695287 680565 667479
60909F67479j0769q030n510l887l291l094k573j691r26n27l90m94r75j679k128
$$ 667479 656710 648680 643170 639283 635992 632898 630325 628634 627708 627181 626791 626297 625322 623643 621515
60894F21515k107j972k264l161m364n331n687n521n190m805m148l254k715l024
$$ 621515 619408 617436 615172 612011 607647 602316 596629 591108 585918 581113 576965 573711 570996 567972
60880E67972l864m473m520m223l787l252k771k575k557k323j785j406j742k883
$$ 567972 564108 559635 555115 550892 547105 543853 541082 538507 535950 533627 531842 530436 528694 525811
60866E25811m363n501n896n739n564n602n638n519n390n191m524l461k935l499
$$ 525811 521448 515947 510051 504312 498748 493146 487508 481989 476599 471408 466884 463423 460488 456989
60852D56989m173l460j365O10J492J798K240K633K569K386K595K985K999K636
$$ 456989 452816 449356 447991 448601 450093 451891 454131 456764 459333 461719 464314 467299 470298 472934
60838D72934K266J927J446R90P78M94k90j183j251k78R21J557J616J450J317J571
$$ 472934 475200 477127 478573 479563 480341 480835 480545 479362 478111 477833 478754 480311 481927 483377 484694 486265
60822D86265K577L976M638L930K589J775J599J328P03K24J03j42q62j741k415
$$ 486265 488842 492818 497456 501386 503975 505750 507349 508677 509380 509604 509707 509565 508703 506962 504547
60807E04547l012l654l983l719l266l191l490l867m432n454o624p306p389p275
$$ 504547 501535 497881 493898 490179 486913 483722 480232 476365 471933 466479 459855 452549 445160 437885
60793D37885p056o467n624n023m698m181l495l310l758l934l209k237j924k039
$$ 437885 430829 424362 418738 413715 409017 404836 401341 398031 394273 390339 387130 384893 382969 380930
60779C80930j714r33n05p64j161j151p69k90O1Q8j11O5J026K203K700K612K896
$$ 380930 379216 378283 377778 377014 375853 374702 373933 373643 373704 373792 373681 373746 374772 376975 379675 382287 385183
60762C85183L868M837N387O004P003P763P773P578P885Q362Q257P722P488P543
$$ 385183 389051 393888 399275 405279 412282 420045 427818 435396 443281 451643 459900 467622 475110 482653
60748D82653P157O239N618N756O017N591M511L284K078P85m41j319j941k670l587
$$ 482653 489810 496049 501667 507423 513440 519031 523542 526826 528904 529689 529248 527929 525988 523318 519731
60733E19731m416n065n822o829p669p778p261o933p380q163q266p292n906n000
$$ 519731 515315 510250 504428 497599 489930 482152 474891 467958 460578 452415 444149 436857 430951 425951
60719D25951m736m705m696m865n207n343n007m376l743l101k331j549r27k84P02
$$ 425951 421215 416510 411814 406949 401742 396399 391392 387016 383273 380172 377841 376292 375365 375081 375783
60704C75783J846K459K228J791K001K785L269L051K819L365M439N130N135N075
$$ 375783 377629 380088 382316 384107 386108 388893 392162 395213 398032 401397 405836 410966 416101 421176
60690D21176N481O107O374O078N379M456L542K875K368J495pj584k494k805l249
$$ 421176 426657 432764 439138 445216 450595 455051 458593 461468 463836 465331 465324 463740 461246 458441 455192
60675D55192m026m382l649k247j275j259j699j781j255n51j57o0J80Q06J486J666
$$ 455192 451166 446784 443135 440888 439613 438354 436655 434874 433619 433068 432911 432851 433031 433837 435323 436989
60659D36989J235O72N20Q48J360J832K349L056L876M559N031N555O472P789R112
$$ 436989 438224 438896 439416 440264 441624 443456 445805 448861 452737 457296 462327 467882 474354 482143 491255
60644D91255J0085J0656J0977J1179J1406J1850J2547J3220J3623J3972J4775
$$ 491255 501340 511996 522973 534152 545558 557408 569955 583175 596798 610770 625545
60633F25545J6197J7801J9109K0274K1961K4508K7319K9330L0074L0088L0062
$$ 625545 641742 659543 678652 698926 720887 745395 772714 802044 832118 862206 892268
60622H92268K9836K8627K6111K2714J8769J4004Q303K368k927p481j1660j5370
$$ 892268 922104 950731 976842 999556 1018325 1032329 1040632 1043000 1040073 1032592 1020932 1005562
60610A005562j8190k0258k2223k4182k5399k5366k4524k3655k3089k2788k2743
$$ 1005562 987372 967114 944891 920709 895310 869944 845420 821765 798676 775888 753145
60599G53145k2805k2486k1379j9664j7915j6540j5595j4896j4165j3223j2166
$$ 753145 730340 707854 686475 666811 648896 632356 616761 601865 587700 574477 562311
60588E62311j1162j0106q789p409o419n786m987l931l237l196l197k642j894j614
$$ 562311 551149 541043 532254 524845 518426 512640 507653 503722 500485 497289 494092 491450 489556 487942
60574D87942j651j385q07l56R8J202K980M602N500O112P241R214J1856J4773J7360
$$ 487942 486291 484906 484099 483743 483841 485043 488023 492625 498125 504237 511478 520692 532548 547321 564681
60559E64681J9047J9776J9994J9887J8998J6836J3541R592N199L30m716r086j1844
$$ 564681 583728 603504 623498 643385 662383 679219 692760 702352 707551 707881 703165 694079 682235
60546F82235j2627j1860j0308q372n889k719P75M085P264J0773J4710J8625K2119
$$ 682235 669608 657748 647440 639068 633179 630460 631235 635320 642584 653357 668067 686692 708811
60533G08811K5065K7164K7726K6222K2717J7553J1055L778l288r173j3437j6024
$$ 708811 733876 761040 788766 814988 837705 855258 866313 870091 866803 857630 844193 828169
60521H28169j6905j6148j4093j1193p829m530k073j001j126j772k380k616k198
$$ 828169 811264 795116 781023 769830 762001 757471 755398 754397 753271 751499 749119 746503 744305
60508G44305j046M83J872K995M066N175O276P604R654J2605J6122J9888K4038
$$ 744305 743259 743742 745614 748609 752675 757850 764126 771730 781384 793989 810111 829999 854037
60495H54037K8883L4507M0878M8127N6324O5101P3712Q1428Q7648R1729R2981
$$ 854037 882920 917427 958305 1006432 1062756 1127857 1201569 1282997 1370645 1462374 1555355
60484A555355R0807Q4551P3283N6314L4281R345j6059m0451o2961q2201r6317
$$ 1555355 1646162 1730713 1803996 1860310 1894591 1903936 1887877 1847426 1784465 1702264 1605947
60473A605947j04303j06603j04286r8258q9553p9659o9859o0569n1876m4360l8700
$$ 1605947 1501644 1395041 1290755 1192497 1102944 1023285 953426 892857 840981 796621 757921
60462G57921l4620l1025k7257k3632k0686j8453j6614j4871j2982j0847q767p261
$$ 757921 723301 692276 665019 641387 620701 602248 585634 570763 557781 546934 538167 530906
60450E30906o474o029n565n056m547l991l493l251l170k899k414k063j924j575
$$ 530906 524432 518403 512838 507782 503235 499244 495751 492500 489330 486431 484017 481954 480030 478455
60436D78455p67J13N69N24J65l35o27l32K82L34n64j693k286k596l262m107m423
$$ 478455 477688 477801 478370 478894 479059 478724 478097 477765 478047 478381 477817 476124 473838 471242 467980 463873 459450
60419D59450m183m009l986l449k148q43l40n09n87r1R01K035K875L027K397J299
$$ 459450 455267 451258 447272 443823 441675 440832 440492 439983 439396 439305 440206 442241 445116 448143 450540 451839
60403D51839K17m65n10J33J128J827J763J098M47K49M03N22M49L83M61N14M58
$$ 451839 452056 451591 451081 451214 452342 454169 455932 457030 457477 457726 458129 458651 459100 459483 459944 460458 460916
60386D60916O83J549K597K849K047J049O66P34P78R44J573K216J994R42J67N48
$$ 460916 461599 463148 465745 468594 470641 471690 472356 473090 473868 474812 476385 478601 480595 481537 481704 482252
60370D82252J827L102L754L706L269K935K985L180L063K581K093J809J682J783
$$ 482252 484079 487181 490935 494641 497910 500845 503830 507010 510073 512654 514747 516556 518238 520021
60356E20021K271K876K948K217J101J36n72j099j408j502j509j390r03j05N30
$$ 520021 522292 525168 528116 530333 531434 531570 530998 529899 528491 526989 525480 524090 523187 523082 523612
60341E23612P25Q40J402K452L630M531M783M149K953K020J819J878J505P89L29
$$ 523612 524337 525177 526579 529031 532661 537192 541975 546124 549077 551097 552916 554794 556299 557088 557417
60326E57417K27K2l81m66n4J33o35k022k959k925k359j843j410q60k63K64J010
$$ 557417 557644 557666 557285 556819 556765 556898 556263 554241 551282 548357 545998 544155 542745 541885 541622 541886 542896
60309E42896K396M288O033P242Q139R135J0354J1687J2951J4005J5124J7311K1397
$$ 542896 545292 549580 555613 562855 570994 580129 590483 602170 615121 629126 644250 661561 682958
60296F82958K6428K9723K9298K5731K0851J5180P838j239j0421j8006k3551k7104
$$ 682958 709386 739109 768407 794138 814989 830169 838007 836768 826347 808341 784790 757686
60284G57686k8230k6751k3691k0499j7584j4404j0799p408m877l338k696k783
$$ 757686 729456 702705 679014 658515 640931 626527 615728 608320 603443 600105 597409 594626
60272E94626l137l223l106l422m442n522n852n412m870m644m474m011l389k941
$$ 594626 591489 588266 585160 581738 577296 571774 565922 560510 555640 550996 546522 542511 539122 536181
60258E36181k552j687k57J004J278O59Jj60j41m62j129j722j997k055k070k122
$$ 536181 533629 531942 531685 532689 533967 534626 534627 534467 534326 533864 532735 531013 529016 526961 524891 522769
60242E22769k204k219k031j606j104o59k31K06L93j9r63j763j665n55R06J971
$$ 522769 520565 518346 516315 514709 513605 512946 512715 512921 513314 513295 512332 510569 508904 508349 509255 511226
60226E11226K490K779K952K833K600K930M073N176N187M184L184K722K385J870
$$ 511226 513716 516495 519447 522280 524880 527810 531883 537059 542246 546430 549614 552336 554721 556591
60212E56591J652K195L075L483L265K964K998L273L476L457L247K947K618K293
$$ 556591 558243 560438 563513 566996 570261 573225 576223 579496 582972 586429 589676 592623 595241 597534
60198E97534K141K460L207L678L120J772P35O21Q45N89p9n37o67r41j571k170
$$ 597534 599675 602135 605342 609020 612140 613912 614647 615268 616113 616702 616623 616086 615419 614478 612907 610737
60182F10737k303j990j643j648k098k803l522m143m574m542l928l120k688k539
$$ 610737 608434 606444 604801 603153 601055 598252 594730 590587 586013 581471 577543 574423 571735 569196
60168E69196j994q29K68O21M22K58L05M40P26J188J485J373J267J718K541K977
$$ 569196 567202 566373 566641 567262 567684 567942 568247 568687 569413 570601 572086 573459 574726 576444 578985 581962
60152E81962K641J801Q60K6o09j101j620k023j723m56J100K102K685L616M960
$$ 581962 584603 586404 587264 587290 586681 585580 583960 581937 580214 579758 580858 582960 585645 589261 594221
60137E94221N940O218O456P299Q481R320R654R763R702R154P888O056M048K111
$$ 594221 600161 606379 612835 620134 628615 637935 647589 657352 667054 676208 684096 690152 694200 696311
60123F96311J93j805l645m856n282n224m868m003k581j149j77O23J716K818L250
$$ 696311 696504 694699 691054 686198 680916 675692 670824 666821 664240 663091 662914 663537 665253 668071 671321
60108F71321L042K887L092L370L627M123M684M618L667K384J235jj598l185m184
$$ 671321 674363 677250 680342 683712 687339 691462 696146 700764 704431 706815 708050 708049 706451 703266 699082
60093F99082m544m680m948n353n531m943l431j616k86N77J559K675L312L433L905
$$ 699082 694538 689858 684910 679557 674026 669083 665652 664036 663750 664327 665886 668561 671873 675306 679211
60078F79211N148O281O225N016L427J794p2k213m388o367p905q730q968r162r440
$$ 679211 684359 690640 696865 701881 705308 707102 707030 704817 700429 694062 686157 677427 668459 659297 649857
60063F49857r168p978o573n840n634n249m662m453m643m583m042l491l251l024
$$ 649857 640689 632711 626138 620298 614664 609415 604753 600300 595657 591074 587032 583541 580290 577266
60049E77266k561k152k176k569k890k676j753n48Q0k29o63j05J410K818L492L854
$$ 577266 574705 572553 570377 567808 564918 562242 560489 559941 560021 559792 559129 559024 560434 563252 566744 570598
60033E70598M342M685M581M406M582M792M413L394K174J000j60j251k186l156
$$ 570598 574940 579625 584206 588612 593194 597986 602399 605793 607967 608967 608807 607556 605370 602214
60019F02214m378n587o246o345o480p056p696p693o837n581m516l859l467l155
$$ 602214 597836 592249 586003 579658 573178 566122 558426 550733 543896 538315 533799 529940 526473 523318
60005E23318k910k814k818k752k500k146j871j755j694j493j036m29J05M64P77
$$ 523318 520408 517594 514776 512024 509524 507378 505507 503752 502058 500565 499529 499100 499205 499669 500446
59990E00446J214J769K338K883L370L596L406L042L002L452M059M484M744M930
$$ 500446 501660 503429 505767 508650 512020 515616 519022 522064 525066 528518 532577 537061 541805 546735
59976E46735M840M215L155K009Q89k92j382j950j867j608j671j892j644p57J28
$$ 546735 551575 555790 558945 560954 561843 561551 560169 558219 556352 554744 553073 551181 549537 548780 548908
59961E48908L14r3l52l1O42J317J976K626K919K538J728R96L38o43j927k912l275
$$ 548908 549222 549129 548777 548746 549388 550705 552681 555307 558226 560764 562492 563488 563826 563183 561256 558344 555069
59944E55069l361l434l054j854m67M5m77j183j454j506j633j625j380j421k162
$$ 555069 551708 548274 545220 543366 542899 542944 542467 541284 539830 538324 536691 535066 533686 532265 530103
59929E30103k973k761j362K72J277J704J949K052J885J674J756K079K361K668
$$ 530103 527130 524369 523007 523279 524556 526260 528209 530261 532146 533820 535576 537655 540016 542684
59915E42684L270M018M333M023L597L460L260K503J504J035J154J014J23q75j114
$$ 542684 545954 549972 554305 558328 561925 565385 568645 571148 572652 573687 574841 575855 575978 575103 573989
59900E73989p01m30o12p94o60m68n40p78r56j001p78j9J214K338K909L171L612
$$ 573989 573288 572858 572246 571452 570792 570324 569784 569006 568050 567049 566271 566252 567466 569804 572713 575884 579496
59883E79496M295N010N824O940Q135Q888R013Q769Q400P993P678P457O903N545
$$ 579496 583791 588801 594625 601565 609700 618588 627601 636370 644770 652763 660441 667898 674801 680346
59869F80346L571J607j70k074m020n358n865o155o712p134o873o133n430m760
$$ 680346 683917 685524 685354 683280 679260 673902 668037 661882 655170 648036 641163 635030 629600 624840
59855F24840l902l162l087l577m022m149m156m089l733l032k054o31J332L236
$$ 624840 620938 617776 614689 611112 607090 602941 598785 594696 590963 587931 585877 585246 586578 589814
59841E89814M300M672N369O955R095J1542J4578J7922K0025J9358J6040J1543
$$ 589814 594114 598786 604155 611110 620205 631747 646325 664247 684272 703630 719670 731213
59829G31213P121L296N90k43R38L129M799M809K678j508p068j2788j7414k0234
$$ 731213 738334 741630 742220 741977 742915 746044 750843 755652 758330 756822 749754 736966 719552 699318
59815F99318k1252k0928j9883j8601j7162j5313j2911j0316q144o610n369m115
$$ 699318 678066 657138 637255 618654 601492 586179 573268 562952 554808 548198 542829 538714
59803E38714l104k774k996l116k802k424k437k703k789k639k593k825l133l160
$$ 538714 535610 532836 529840 526724 523922 521498 519061 516358 513569 510930 508337 505512 502379 499219
59789D99219k629j506k48K99k74j323j836j555r91m27L35J142J262M18n36o13
$$ 499219 496590 495084 494836 495135 494861 493538 491702 490147 489156 488729 489064 490206 491468 491886 491350 490737
59773D90737J8L54o2p04j000j081j336j681j626j042m92o39j319j542o06R84J991
$$ 490737 490755 491109 491047 490343 489343 488262 486926 485245 483619 482577 482085 481446 480127 478585 477979 478963 480954
59756D80954J904J521J905L112M196M376L894L694M411N685O555O505N989N729
$$ 480954 482858 484379 486284 489396 493592 497968 501862 505556 509967 515652 522207 528712 534701 540430
59742E40430N752N460M645L856L597L549K962J597oj127j542j621j863k353k707
$$ 540430 546182 551642 556287 560143 563740 567289 570251 571848 571842 570715 569173 567552 565689 563336 560629
59727E60629k618k253j972j854j831j997k352k406j775j052j259k296k868k298
$$ 560629 558011 555758 553786 551932 550101 548104 545752 543346 541571 540519 539260 536964 534096 531798
59713E31798j478j440j774j372j28J034J547J670J764J900K187K697L097K930
$$ 531798 530320 528880 527106 525734 525606 526640 528187 529857 531621 533521 535708 538405 541502 544432
59699E44432K398K154K416K887L518M576N827O582O817P373Q511R050P682M722
$$ 544432 546830 548984 551400 554287 557805 562381 568208 574790 581607 588980 597491 606541 614223 618945
59685F18945J732k70j509k462l062l114k781k243j316L5J067Q07o81k073k164
$$ 618945 620677 620407 618898 616436 613374 610260 607479 605236 603920 603955 605022 605829 605148 603075 600911
59670F00911j154k76l40j064j761k163k434k735l080l362l383k965k165j237l17
$$ 600911 599757 599481 599141 598077 596316 594153 591719 588984 585904 582542 579159 576194 574029 572792 572475
59655E72475N92J272J375J024R56J718L017M149M764M883M514L694K659J457k96
$$ 572475 573067 574339 575714 576738 577694 579412 582429 586578 591342 596225 600739 604433 607092 608549 608253
59640F08253k780n321o950p501p465p069o198n141m458l971k904j272k30l98q20
$$ 608253 605473 600152 593202 585701 578236 571167 564969 559828 555370 551399 548495 547223 546993 546595 545775
59625E45775l80M41L32p25j327o84L50O55L33K08M66N54J57n14j269k161l060
$$ 545775 545395 545836 546168 545443 544116 543432 543782 544437 544770 544978 545444 545998 546155 545641 544372 542211 539151
59608E39151l513l304k714k036j197j70N62N20J6o8O20J490J774J397P92K07m40
$$ 539151 535638 532334 529620 527584 526387 526217 526779 527299 527315 527247 527867 529357 531131 532528 533320 533527 533087
59591E33087j145j593j465q75l62l40o27o70k90Qk59q45j178j239j503k123k768
$$ 533087 531942 530349 528884 528009 527647 527307 526680 526010 525720 525728 525469 524624 523446 522207 520704 518581 515813
59574E15813l323m004m619m514l654k996l235l713l377k294j458j383j697j916
$$ 515813 512490 508486 503867 499353 495699 492703 489468 485755 482378 480084 478626 477243 475546 473630
59560D73630j844j273j23J045J404R29M84P23J422K052K425K563K472K342K471
$$ 473630 471786 470513 470390 471435 472839 473768 474252 474975 476397 478449 480874 483437 485909 488251 490722
59545D90722K717K493J656R92J360K561L573L820L913M945P301J0306J3156J5882
$$ 490722 493439 495932 497588 498580 499940 502501 506074 509894 513807 518752 526053 536359 549515 565397
59531E65397J8925K1642K1887J7871J0306K077m210p789r011q162n602k301N80
$$ 565397 584322 605964 627851 645722 656028 658105 653895 646106 637095 628933 623331 621030 621610
59518F21610K612M098N259N917N964N691N418N047M160K538M18j730l639n339
$$ 621610 624222 628320 633579 639496 645460 651151 656569 661616 665776 668314 668732 667002 663363 658024
59504F58024o873q096q807q984q795q474q256q240q188p662o543n195m024l092
$$ 658024 651151 643055 634248 625264 616469 607995 599739 591499 583311 575649 569106 563911 559887 556795
59490E56795k345j869j595j163m53J03J91K71R66K148L299M507O259Q346R948
$$ 556795 554450 552581 550986 549823 549370 549473 549664 549935 550901 553049 556348 560855 567114 575460 585408
59475E85408J0842J1683J2827J3715J3784J3217J2391J1181R228O447K996p99
$$ 585408 596250 607933 620760 634475 648259 661476 673867 685048 694276 700723 703719 702920
59463G02920m187o266o896o778o284m821j906J724M787O889Q731J1054J3912J6822
$$ 702920 698733 692467 685571 678793 672509 667688 665782 667506 672293 679182 687913 698967 712879 729701
59449G29701J9234K0986K2579K4717K7295K9239K9717K8911K7095K3522J7080
$$ 729701 748935 769921 792500 817217 844512 873751 903468 932379 959474 982996 1000076
59438A000076P856k795j3463k3070l0170l3163l1936k8601k5796k4456k3696k2581
$$ 1000076 1007932 1005137 991674 968604 938434 905271 873335 844734 818938 794482 770786 748205
59426G48205k1271k0320j9500j7910j5057j1399p713m209n68L356P199J0490J3091
$$ 748205 726934 706614 687114 669204 654147 642748 635035 630826 630258 633614 640813 651303 664394
59413F64394J5242J7299J9565K2262K5561K9524L3699L6580L5790K9392J7437
$$ 664394 679636 696935 716500 738762 764323 793847 827546 864126 899916 929308 946745
59402I46745K379j1982k2138k6360k5288k0988j5036p731M37P236R613O149k142
$$ 946745 949124 937142 915004 888644 863356 842368 827332 819601 820038 827274 836887 843036 840894
59389H40894j3100k4407l3463l7920l7357l3621k8954k4359k0116j6692j4243
$$ 840894 827794 803387 769924 732004 694647 661026 632072 607713 587597 570905 556662
59378E56662j1994r197o305m339l478l015k417j598n33N91J090M91o19j180r17
$$ 556662 544668 535471 529166 524827 521349 518334 515917 514319 513786 514377 515467 515958 515339 514159 513242
59363E13242l44K63J051J775J792J023K39J57P73J726K849M144N587P074Q351
$$ 513242 512898 513161 514212 515987 517779 518802 519041 519198 519971 521697 524546 528690 534277 541351 549702
59348E49702R195R888J1206J3397J5556J6649J6936J7590J9053K0631K1662K2153
$$ 549702 558897 568785 579991 593388 608944 625593 642529 660119 679172 699803 721465 743618
59336G43618K2137K1324J9718J7741J5341J1834P146K516p89k969n191p987j0850
$$ 743618 765755 787079 806797 824538 839879 851713 858859 861375 860586 857617 852426 844439 833589
59323H33589j3227j5102j6533j7295j7264j6704j5868j4622j2843j0989r822r448
$$ 833589 820362 805260 788727 771432 754168 737464 721596 706974 694131 683142 673320 663872
59311F63872r086p970o307m849l808k732j471n93m60n25pJ046K083L018M190N418
$$ 663872 654786 646816 640509 635660 631852 629120 627649 627056 626596 626071 626064 627110 629193 632211 636401 641819
59295F41819N952N555N047N389O623Q079R360J0694J2375J4222J5841J7411J9876
$$ 641819 647771 653326 658373 663762 670385 678464 687824 698518 710893 725115 740956 758367 778243
59282G78243K3881K8341L0453K7583J9299P599m472j4255k0192k2120k1033j8140
$$ 778243 802124 830465 860918 888501 907800 915399 910927 896672 876480 854360 833327 815187
59270H15187j4016q780k950K422O524R296J1131J2345J3048J3214J2700J1372
$$ 815187 801171 792391 789441 791863 798387 807683 818814 831159 844207 857421 870121 881493
59258H81493R256O423K913j107n101q475j1062j3107j4788j5997j6515j6192j4970
$$ 881493 890749 897172 900085 898978 893877 885402 874340 861233 846445 830448 813933 797741 782771
59245G82771j3018j0773q709p088n985n351m869m079k861j558m44N91J547K023
$$ 782771 769753 758980 750271 743183 737198 731847 726978 722899 720038 718480 718036 718627 720174 722197
59231G22197J855J632J998K725L085K840K277J487L27j093k561m260o435q702
$$ 722197 724052 725684 727682 730407 733492 736332 738609 740096 740423 739330 736769 732509 726074 717372
59217G17372j0404j1528j2502j3186j2937j1783j0634j0095r803r219q392p660
$$ 717372 706968 695440 682938 669752 656815 645032 634398 624303 614500 605281 596889 589229
59205E89229p146o831o632o155m987l358k099j713j934k278k424k009p28J035
$$ 589229 582083 575252 568620 562465 557478 554120 552021 550308 548374 546096 543672 541663 540935 541970
59191E41970K335K707K596K618K888L320L837M122L768L061K971L916N074N397
$$ 541970 544305 547012 549608 552226 555114 558434 562271 566393 570161 573222 576193 580109 585183 590580
59177E90580M845M242M244M792N262M967L898L036L470N138O941Q122Q816R238
$$ 590580 595425 599667 603911 608703 613965 618932 622830 625866 629336 634474 641415 649537 658353 667591
59163F67591R298R265R728J0511J0605R779R191R636J0188R567P977O464N174
$$ 667591 676889 686154 695882 706393 716998 726777 735968 745604 755792 765359 773336 779800 784974
59150G84974L536J622j2j561l676o002p323p296o962p228p816q083p950p659p252
$$ 784974 788510 790132 790120 788559 784883 778881 771558 764262 757300 750072 742256 734173 726223 718564 711312
59135G11312o745o248n597m423k824j529j068j184j304j153o60K45J457K602L481
$$ 711312 704567 698319 692722 688299 685475 683946 682878 681694 680390 679237 678577 678822 680279 682881 686362
59120F86362M337N489O962Q614J0298J1734J2582J2937J3369J4173J4856J4757
$$ 686362 690699 696188 703150 711764 722062 733796 746378 759315 772684 786857 801713 816470
59108H16470J3936J3009J2224J1190R578P683O093N090M502M046L583L093K570
$$ 816470 830406 843415 855639 866829 876407 884090 890183 895273 899775 903821 907404 910497 913067
59095I13067J964J188K06q01j470j602j486j657k194k591k409j949j927k666l879
$$ 913067 915031 916219 916425 915624 914154 912552 911066 909409 907215 904624 902215 900266 898339 895673 891794
59080H91794n225o691q404j0391j2603j4879j6796j7811j7673j6539j4741j2722
$$ 891794 886569 879878 871474 861083 848480 833601 816805 798994 781321 764782 750041 737319
59068G37319j1119j0382j0150r471p968o384n642n700n732n214m364l586k964
$$ 737319 726200 715818 705668 696197 688229 681845 676203 670503 664771 659557 655193 651607 648643
59055F48643k417k059k178k879l816m380m247l664l058k506j882j406j519k090
$$ 648643 646226 644167 641989 639110 635294 630914 626667 623003 619945 617439 615557 614151 612632 610542
59041F10542k280j503j72Q12J081R17P01N97O87J085J860K993M305N364N757N648
$$ 610542 608262 606759 606587 607399 608480 609397 610098 610695 611382 612467 614327 617320 621625 626989 632746 638394
59025F38394N766O627P983R268J0294J1174J1863J2242J2453J2685J2712J2081
$$ 638394 644160 650787 658770 668038 678332 689506 701369 713611 726064 738749 751461 763542
59013G63542J0805R330P793N696K667q08l720n447o073n865m925l434j875o00
$$ 763542 774347 783677 791470 797166 799833 799025 795305 789858 783785 777920 772995 769561 767686 767086
58999G67086O33K233M012N354O170P007P952Q153P009N289M262M079L736K513
$$ 767086 767719 769952 773964 779318 785488 792495 800447 808600 815609 820898 825160 829239 832975 835488
58985H35488O00j585l881o105q044r844j1690j3060j3054j1598r658q012o558
$$ 835488 836088 834503 830622 824517 816473 806629 794939 781879 768825 757227 747569 739557 732999
58972G32999m946l206j435L88K120L587N148P292R578J0948J1313J1784J2896
$$ 732999 728053 724847 723412 723800 725920 729507 734655 741947 751525 762473 773786 785570 798466
58959G98466J3765J3616J2970J2456J1462R084N545J675k386o774j0803j3509
$$ 798466 812231 825847 838817 851273 862735 871819 877364 879039 876653 869879 859076 845567
58947H45567j4961j5970j6717j6711j5919j4897j3865j2549j0857q975o880m495
$$ 845567 830606 814636 797919 781208 765289 750392 736527 723978 713121 704146 697266 692771
58935F92771k266q23k46k72r43k277l569l961l581l343l616l937l972l978m266
$$ 692771 690505 689682 689436 689164 688221 685944 682375 678414 674833 671490 667874 663937 659965 655987 651721
58920F51721m847n587o118n797m429k829j955j703j283m88L27J200K430L620M045
$$ 651721 646874 641287 635169 629372 624943 622114 620159 618456 617173 616685 617012 618212 620642 624262 628307
58905F28307M010M664O289P932Q994J0148J2165J4759J7152J8994K0162K0372
$$ 628307 632317 636981 643270 651202 660196 670344 682509 697268 714420 733414 753576 773948
58893G73948J9514J7989J6281J4597J3242J2773J3459J5020J7130J9727K2561
$$ 773948 793462 811451 827732 842329 855571 868344 881803 896823 913953 933680 956241
58882I56241K4956K6290K6393K5376K3417K0780J7522J3243P683J548l969q517
$$ 956241 981197 1007487 1033880 1059256 1082673 1103453 1120975 1134218 1141901 1143449 1139480 1130963
58870A130963j2665j6615j9792k1884k3288k4085k3572k1511j9018j7408j6721
$$ 1130963 1118298 1101683 1081891 1060007 1036719 1012634 989062 967551 948533 931125 914404
58859I14404j6132j5349j4791j4678j4799j5064j5616j6370j6827j6529j5448
$$ 914404 898272 882923 868132 853454 838655 823591 807975 791605 774778 758249 742801
58848G42801j3956j2572j1580j0821r960r009q292p865p346o588o054o231o927
$$ 742801 728845 716273 704693 693872 683912 674903 666611 658746 651400 644812 638758 632527 625600
58835F25600p478p464o945o219n595n242n064m770m224l650l342l254k999k205
$$ 625600 618122 610658 603713 597494 591899 586657 581593 576823 572599 568949 565607 562353 559354 557149
58821E57149r68M6J19p56j754k037j465l64J028K468L469L720L553L415L152K389
$$ 557149 556181 556227 556346 555590 553836 551799 550334 549970 550998 553466 556935 560655 564208 567623 570775 573164
58805E73164J441J029J152J046M10j39k7M87P96O81K62l06q17j035r70q50p50
$$ 573164 574605 575634 576786 577832 578242 578103 578076 578563 579359 580040 580302 579996 579179 578144 577174 576324 575574
58788E75574m95J7P01J479K350L354M660O426Q232R147Q865Q297Q395Q894R021
$$ 575574 575079 575096 575797 577276 579626 582980 587640 594066 602298 611445 620310 628607 637002 645896 654917
58773F54917Q786Q446P267M348M77k468m015n422p210q171p449o022n178m816
$$ 654917 663703 672149 679416 683764 684241 681773 677758 672336 665126 656955 649506 643484 638306 633490
58759F33490m325l959m141m314l689k510j444l69J153K696L388L241L053L163
$$ 633490 629165 625206 621065 616751 613062 610552 609108 608739 609892 612588 615976 619217 622270 625433
58745F25433L201K984K821K969L404M140N222O466P622Q692R747J0629J1124J1254
$$ 625433 628634 631618 634439 637408 640812 644952 650174 656640 664262 672954 682701 693330 704454 715708
58731G15708J1075J0541R826R423R524R707R492Q908Q265P752P504P596P728P513
$$ 715708 726783 737324 747150 756573 766097 775804 785296 794204 802469 810221 817725 825321 833049 840562
58717H40562P267P801R201J0529J1095J1206J1157J0505R083P789P355P010N408
$$ 840562 847829 855630 864831 875360 886455 897661 908818 919323 928406 936195 943550 950560 955968
58704I55968K409j040m405p869j1448j4768j7658k0119k1934k3046k4076k5523
$$ 955968 958377 957337 952932 945063 933615 918847 901189 881070 859136 836090 812014 786491
58692G86491k6645k6167k4062k1662j9892j8279j6066j3421j1112r573q686q164
$$ 786491 759846 733679 709617 687955 668063 649784 633718 620297 609185 599612 590926 582762
58680E82762p746p218o544n855n288m885m620m300l573k297q63J58P36J507L086
$$ 582762 575016 567798 561254 555399 550111 545226 540606 536306 532733 530436 529573 529731 530467 531974 535060
58665E35060N414P836R762J1174J2372J3287J3319J2032R765P175M447J513j155
$$ 535060 540474 548310 558072 569246 581618 594905 608224 620256 630021 637196 641643 643156 642001
58652F42001k732l094l035l257l745m243m675m900m699m306m318m820n177m959
$$ 642001 639269 636175 633140 629883 626138 621895 617220 612320 607621 603315 598997 594177 589000 584041
58638E84041m461m090l878l801l881l729k723j032L59R25J167J539J743J525J225
$$ 584041 579580 575490 571612 567811 563930 560201 557478 556446 556805 557730 558897 560436 562179 563704 564929
58623E64929J029M94n11j274j285r94q18k96R98K509L563M468N847P526Q915R947
$$ 564929 565958 566452 565941 564667 563382 562388 561570 561274 562272 564781 568344 572812 578659 586185 595100 605047
58607F05047J0738J0888R926Q084N940L790J895O27j93j314k792l615l368l135
$$ 605047 615785 626673 636599 644683 650623 654413 656308 656935 656742 655428 652636 649021 645653 642518
58593F42518l758m239l308j575o49p17n31N83K184L913N838P686Q993R980J1246
$$ 642518 638760 634521 631213 629638 628989 628272 627741 628324 630508 634421 640259 647945 656938 666918 678164
58578F78164J2638J3318J2936J1868J0551R240Q145P152N901M830N271P589J0104
$$ 678164 690802 704120 717056 728924 739475 748715 756860 764012 769913 774743 780014 787603 797707
58565G97707J1177J1511J2985J5871J8847K1208K3227K4664K4767K3795K2869
$$ 797707 808884 820395 833380 849251 868098 889306 912533 937197 961964 985759 1008628
58554A008628K2081K0287J6949J2783Q388L577j600o416j0340j3355j5274j5882
$$ 1008628 1030709 1050996 1067945 1080728 1089116 1092693 1091093 1084677 1074337 1060982 1045708 1029826
58542A029826j5735j5750j5972j5831j5568j6080j7355j8407j8826j9113j9371
$$ 1029826 1014091 998341 982369 966538 950970 934890 917535 899128 880302 861189 841818
58531H41818j9100j8402j8004j7734j6475j3949j1253r118p043m616k462j145
$$ 841818 822718 804316 786312 768578 752103 738154 726901 717783 710740 706124 703662 702517
58519G02517k95M93R08P10M07M35N03K69k8j06j45l21m44l49q5M88J575K852L644
$$ 702517 702222 702715 703623 704333 704740 705175 705678 705947 705919 705813 705668 705347 704903 704554 704469 704957 706532 709384 713028
58500G13028L801L654L244K453J780J921K462K120M69j516k775k994k193o21P30
$$ 713028 716829 720483 723727 726180 727960 729881 732343 734463 734932 733416 730641 727647 725454 724833 725563
58485G25563P84j08m20N33J953L140M477O347Q324R947J1354J2576J3156J2931
$$ 725563 726347 726239 725819 726352 728305 731445 735922 742269 750593 760540 771894 784470 797626 810557
58471H10557J2302J1342R554O838L791O76k828o457r062j0064j0239j0422j0318
$$ 810557 822859 834201 843755 850593 854384 855060 852232 845775 836713 826649 816410 805988 795670
58458G95670r278p494n709m236k842j233P21K916M967O451P207P074N818L792
$$ 795670 786392 778898 773189 768953 766111 764878 765599 768515 773482 779933 787140 794214 800032 803824
58444H03824K108J297L79j691m221n750o193o471o475n240l063j487r72l62J071
$$ 803824 805932 807229 807608 805917 801696 795946 789753 783282 776807 771567 768504 767017 766045 765683 766754
58429G66754K708M033N254O134N936N074N085O374P611P932Q078Q591Q671P720
$$ 766754 769462 773495 778749 784883 790819 795893 800978 807352 814963 822895 830973 839564 848235 855955
58415H55955O495N701M783L117J167l90j634k672l111l025l361m640o219p281
$$ 855955 862450 868151 872934 876051 877218 876828 875194 872522 869411 866386 863025 858385 852166 844885
58401H44885p575o902n192l355k635k779k384j291p81j017m00J653L352L114J663
$$ 844885 837310 830408 825216 821861 819226 816447 814063 812772 811991 810974 810574 812227 815579 818693 820356
58386H20356L96n73j488j726r33J9N72J537L320M541L917K279J319J308J532J834
$$ 820356 820752 820179 818691 816965 816032 816051 816623 818160 821480 826021 829938 832217 833536 834844 836376 838210
58370H38210K411K914L079L520M795O412P633Q526R406J0105J0529J1020J1584
$$ 838210 840621 843535 846614 850134 854929 861341 868974 877500 886906 897011 907540 918560 930144
58357I30144J1804J1970J2963J4505J4945J3502J1262R313P400N245L516K561
$$ 930144 941948 953918 966881 981386 996331 1009833 1021095 1030408 1037808 1043053 1046569 1049130
58345A049130J746R25J036K344L722M541N585P253Q636R318J0286J1933J3083
$$ 1049130 1050876 1051801 1052837 1055181 1058903 1063444 1069029 1076282 1084918 1094236 1104522 1116455 1129538
58332A129538J3035J2767J2965J2822J1986J1702J2725J3967J4423J4495J4300
$$ 1129538 1142573 1155340 1168305 1181127 1193113 1204815 1217540 1231507 1245930 1260425 1274725
58321A274725J2905J0519R097R268R076P305N630N637O214N971N802O848Q104
$$ 1274725 1287630 1298149 1307246 1316514 1325590 1332895 1338525 1344162 1350376 1356347 1362149 1368997 1377101
58308A377101Q383Q626R984J1598J2535J3773J5988J7509J7036J6339J7514J9493
$$ 1377101 1385484 1394110 1404094 1415692 1428227 1442000 1457988 1475497 1492533 1508872 1526386 1545879
58296A545879K0024J9355J9194J9516J9183J8403J8075J7950J7624J7984J9545
$$ 1545879 1565903 1585258 1604452 1623968 1643151 1661554 1679629 1697579 1715203 1733187 1752732
58285A752732K1038K1619K2639K5050K7170K7214K5988K4773K2998K0496J9652
$$ 1752732 1773770 1795389 1818028 1843078 1870248 1897462 1923450 1948223 1971221 1991717 2011369
58274B011369K2289K6647L0306L3907L8952M4259M7776M9940N2131N3781N4060
$$ 2011369 2033658 2060305 2090611 2124518 2163470 2207729 2255505 2305445 2357576 2411357 2465417
58263B465417N4416N6427N9186O1464O4132O7696P0182P0505P0888P2846P4034
$$ 2465417 2519833 2576260 2635446 2696910 2761042 2828738 2898920 2969425 3040313 3113159 3187193
58252C187193P2570P1018P2078P3887P3983P4452P8236Q3581Q7283R0522R6259
$$ 3187193 3259763 3330781 3402859 3476746 3550729 3625181 3703417 3786998 3874281 3964803 4061062
58241D061062J03567J09834J15903J23896J32516J39781J47641J58671J70965
$$ 4061062 4164629 4274463 4390366 4514262 4646778 4786559 4934200 5092871 5263836
58232E263836J81638J92275K05525K19721K32650K47075K66327K88080L08804
$$ 5263836 5445474 5637749 5843274 6062995 6295645 6542720 6809047 7097127 7405931
58223G405931L30614L57134L86673M16561M49925M90718N36479N83833O36451
$$ 7405931 7736545 8093679 8480352 8896913 9346838 9837556 10374035 10957868 11594319
58214A1594319O99276P70142Q46054R32561J037394J160615J301367J468381J673201
$$ 11594319 12293595 13063737 13909791 14842352 15879746 17040361 18341728 19810109 21483310
58205B1483310J920261K216054K580833L037559L595834M259554N041416N956510
$$ 21483310 23403571 25619625 28200458 31238017 34833851 39093405 44134821 50091331
58197E0091331P015696Q245294R700443J1436429J3479868J5850613J8590757
$$ 50091331 57107027 65352321 75052764 86489193 99969061 115819674 134410431
58190A34410431K1736316K5266958K9071156L2822706L5708921L6299862L2993806
$$ 134410431 156146747 181413705 210484861 243307567 279016488 315316350 348310156
58183C48310156K4976420J2965961r32802j4154936k4662448l1437686l4457949
$$ 348310156 373286576 386252537 385319735 371164799 346502351 315064665 280606716
58176B80606716l4385724l2170819k8714581k4710558k0641286j6807376j3340432
$$ 280606716 246220992 214050173 185335592 160625034 139983748 123176372 109835940
58169A09835940j0250381p499853n031762k777802p59093P71727J380344P65625
$$ 109835940 99585559 92085706 87053944 84276142 83517049 84288776 85669120 86434745
58161H6434745r37029l176519n295046o825170p586792p634716p163343o404855
$$ 86434745 85497716 82321197 77026151 70200981 62614189 54979473 47816130 41411275
58153D1411275n544209m692348l912305l241709k689732k240436j874810j581814
$$ 41411275 35867066 31174718 27262413 24020704 21330972 19090536 17215726 15633912
58145A5633912j348247j155101r90476q54375p46394o59201n87203n30883m88903
$$ 15633912 14285665 13130564 12140088 11285713 10539319 9880118 9292915 8762032 8273129
58136H273129m55081m26056m03393l85483l65599l40482l13478k87257k60499
$$ 8273129 7818048 7391992 6988599 6603116 6237517 5897035 5583557 5296300 5035801
58127E035801k33385k09104j88053j67184j46817j31872j24766j22758j23397
$$ 5035801 4802416 4593312 4405259 4238075 4091258 3959386 3834620 3711862 3588465
58118C588465j26664j30711j31426j27819j22745j17417j10172j01259r3399q6908
$$ 3588465 3461801 3331090 3199664 3071845 2949100 2831683 2721511 2620252 2526853 2439945
58108B439945p9469p1461o6097o3512o0065n4568n0083m8216m6602m3489m0251
$$ 2439945 2360476 2289015 2222918 2159406 2099341 2044773 1994690 1946474 1899872 1856383 1816132
58097A816132l7961l5760l3915l4313l6684l8217l8028l8079l8731l7573l3851
$$ 1816132 1778171 1742411 1708496 1674183 1637499 1599282 1561254 1523175 1484444 1446871 1413020
58086A413020l0149k8220k6760k4583k2634k1517k0343j9069j8999j9967k0097
$$ 1413020 1382871 1354651 1327891 1303308 1280674 1259157 1238814 1219745 1200746 1180779 1160682
58075A160682j9109j8822j9720k0214j9898k0268k1444k1573k0239j9216j8955
$$ 1160682 1141573 1122751 1103031 1082817 1062919 1042651 1021207 999634 979395 960179 941224
58064I41224j7652j4871j2746j2484j2639j2044j1479j1373j0782r737r764j0965
$$ 941224 923572 908701 895955 883471 870832 858788 847309 835936 825154 815417 805653 794688
58052G94688j1349j0200r232r398r348q295p585q025q221p100n677n079m932m873
$$ 794688 783339 773139 763907 754509 745161 736866 729281 721256 713035 705935 700258 695179 690247 685374
58038F85374n373o121n808m550m199n300o185o042o322p928r474r794r744j0148
$$ 685374 680001 673880 668072 663522 659323 654023 647838 641796 635474 627546 618072 608278 598534 588386
58024E88386j0221r456q843q743p764n342l354l425m484m685m047l553l217k752
$$ 588386 578165 568709 559866 551123 543359 538017 534663 531238 526754 522069 518022 514469 511252 508500
58010E08500k765l624m310l862k854k237j861j220n12N1R18K153K889K667K178
$$ 508500 505735 502111 497801 493939 491085 488848 486987 485767 485255 485306 486224 488377 491266 493933 496111
57995D96111J988J764J430J616K356K733K567K857L840M339L849L511L971M035
$$ 496111 498099 499863 501293 502909 505265 507998 510565 513422 517262 521601 525450 528961 532932 536967
57981E36967K720R09k38j058k215l217l528l826m778n705n771n480n669o058n976
$$ 536967 539687 540596 540358 539300 537085 533868 530340 526514 521736 516031 510260 504780 499111 493053 487077
57966D87077n587n311m920m314m139m631m830m048l124l133l738l941l637l370
$$ 487077 481490 476179 471259 466945 462806 458175 453345 449297 446173 443040 439302 435361 431724 428354
57952D28354l306l439l988m709m611l272j642p19k25N88J676K565L115L227K641
$$ 428354 425048 421609 417621 412912 408301 405029 403387 402668 402443 403031 404707 407272 410387 413614 416255
57937D16255J826K048L711N520O202O081O106O236N888N207M752M525M170L727
$$ 416255 418081 420129 423840 429360 435562 441643 447749 453985 459873 465080 469832 474357 478527 482254
57923D82254L392L072K783K840L161L051K229J274N98k12j514l016m579o567q823
$$ 482254 485646 488718 491501 494341 497502 500553 502782 504056 504654 504442 502928 499912 495333 488766 479943
57908D79943j0290j0431j0000r830r791r615r622r932r993r657r610r994r784
$$ 479943 469653 459222 449222 439392 429601 419986 410364 400432 390439 380782 371172 361178 351394
57895C51394q500p230o924o794n685l997k932k580k070j069M6J048J920K461K689
$$ 351394 342894 335664 328740 321946 316261 312264 309332 306752 304682 303613 303659 304707 306627 309088 311777
57880C11777L087L810M277M205M257M912N564N559N300N279M952L591J640J63
$$ 311777 314864 318674 322951 327156 331413 336325 341889 347448 352748 358027 362979 366570 368210 368373
57866C68373n10p10o42n09q06j626k268k295k205k327j977o25R09J463J064M87
$$ 368373 367863 367153 366511 366002 365196 363570 361302 359007 356802 354475 352498 351873 352782 354245 355309 355796
57850C55796R2K3P27K155L282L472L572M492N567N622M941M684M913M686L797
$$ 355796 355888 355911 356638 358793 362075 365547 369119 373611 379178 384800 389741 394425 399338 404024 407821
57835D07821K946K322J357j42j707k996m000m545m543m471m710m753m000l001
$$ 407821 410767 413089 414446 414304 412597 409601 405601 401056 396513 392042 387332 382579 378579 375578
57821C75578k811l321l346k304q21L25R33J052Q22P26J259K236L000L298L380
$$ 375578 372767 369446 366100 363796 362975 363300 364233 365285 366107 366833 368092 370328 373328 376626 380006
57806C80006L299K686J306n37k180l102l513m366o276q431r386r043q744r113
$$ 380006 383305 385991 387297 386760 384580 381478 377965 373599 367323 358892 349506 340463 331719 322606
57792C22606r125q000o586n891n498m702m042m263m681m145k947k188j917j421
$$ 322606 313481 305481 298895 293004 287506 282804 278762 274499 269818 265673 262726 260538 258621 257200
57778B57200q59q61r05Q7J713K449K104K141L296M559N044N335O182P106P235
$$ 257200 256341 255480 254575 254662 256375 258824 260928 263069 266365 270924 275968 281303 287485 294591 301826
57763C01826O726O455O732O973O437M959L044J348p5j755l796n366n743n418n410
$$ 301826 308552 315007 321739 328712 335149 340108 343152 344500 344425 342670 338874 333508 327765 322347 316937
57748C16937n808n886n392m810m419l997l495l234l268l179k623j698q52p11j607
$$ 316937 311129 305243 299851 295041 290622 286625 283130 279896 276628 273449 270826 269128 268276 267565 265958
57733B65958k871l170k159j153j350k073j832n72M24N63M80O63Q67J023J556K467
$$ 265958 263087 259917 257758 256605 255255 253182 251350 250778 251202 251765 252245 252908 253775 254798 256354 258821
57717B58821L043K825K116J361O98K30L7j21n38r81r87o18k94q3J67K81J20K08
$$ 258821 261864 264689 266805 268166 268864 269094 269131 269010 268472 267491 266504 265886 265592 265509 265676 265957 266077 266285
57699B66285J027K034K308K042K291L374M584N441O174O811O825N799L806J152
$$ 266285 267312 269346 271654 273696 275987 279361 283945 289386 295560 302371 309196 314995 318801 319953
57685C19953j541l292l765l960m779n299l884p43K200M147O348R844J3979J7932
$$ 319953 318412 315120 311355 307395 302616 297317 293433 292690 294890 299037 305385 315229 329208 347140
57671C47140K2237K7852L4746M2345N0571N9573O8950P7563Q3103Q1572O8744
$$ 347140 369377 397229 431975 474320 524891 584464 653414 730977 814080 895652 964396
57660I64396M3751J0918k2569n0602o9862p9421q0369p5483o7817n9190n0224
$$ 964396 1008147 1019065 996496 945894 876032 796611 716242 640759 572942 513752 463528
57649D63528m1483l3732k7286k1867j7224j3504j0864r044p458n756m241l541
$$ 463528 422045 388313 361027 339160 321936 308432 297568 288524 281066 275310 271069 267528
57637B67528l633l579k631j267n07m10j94L33M71m9m53j64L00K27j99l55k55m89
$$ 267528 263895 260316 257685 256418 255911 255501 255307 255640 256111 256062 255609 255445 255745 255972 255773 255418 255163 254674
57619B54674j345k479l276l320k699k022j787j722j175k15K75k54j280j939j885
$$ 254674 253329 250850 247574 244254 241555 239533 237746 236024 234849 234634 234909 234655 233375 231436 229551
57604B29551j279m70K5k24r09j135m66N35J096J051N72l17j496k445k705k421
$$ 229551 228272 227802 227827 227603 226694 225559 225093 225628 226724 227775 228347 228030 226534 224089 221384 218963
57588B18963k114k090k321k660k917k970k869k702k320j614r68r28j358j444q21
$$ 218963 216849 214759 212438 209778 206861 203891 201022 198320 196000 194386 193418 192490 191132 189688 188867
57573A88867j35k73j378k754l420k718q69Q54J091k81k058l063l090k512j682
$$ 188867 188732 188459 187081 184327 180907 178189 177320 178174 179265 178984 176926 173863 170773 168261 166579
57558A66579r99r35j498j970j612m10R65J747J497M04o63p93J29J348K119K305
$$ 166579 165580 164645 163147 161177 159565 159155 160120 161867 163364 163768 163105 162312 162441 163789 165908 168213
57542A68213K117J703J137N57J13k1K76Q16J144J128J213J647J863J267K71k47
$$ 168213 170330 172033 173170 173727 173840 173819 174095 174911 176055 177183 178396 180043 181906 183173 183444 183197
57526A83197k68m84j062j475j543j571j487q37J99Q27R17J189J867K160J559O73
$$ 183197 182929 182445 181383 179908 178365 176794 175307 174470 174669 175496 176413 177602 179469 181629 183188 183861
57510A83861K85L62N55R02J374J442P01m89j392j593j067j77K40n13k001k919
$$ 183861 184146 184508 185063 185965 187339 188781 189482 188993 187601 186008 184941 184764 185004 184491 182490 179571
57494A79571k570j498n20M3O8m69j004p63l7j1r45j653j351q14r08j135o73P4
$$ 179571 177001 175503 174983 175026 175094 174625 173621 172858 172821 172810 171865 170212 168861 168047 167139 166004 165331 165405
57476A65405J72k90n30m53n84r47j064q15n10j87J95K60l25j054j095m92j22m17
$$ 165405 165577 165287 164757 164304 163720 162773 161709 160894 160384 160197 160392 160652 160327 159273 158178 157686 157564 157147
57458A57147q50p19J18J253K083K142J499P74M35L22Q0k47m16m46m98n14l56o3
$$ 157147 156297 155578 155696 156949 159032 161174 162673 163447 163882 164204 164284 164037 163621 163175 162677 162163 161807 161744
57440A61744L56J021J751J941J277K94k06m6L68O51O85N12L40L23J99m34j307
$$ 161744 162100 163121 164872 166813 168090 168384 168178 168132 168500 169151 169836 170348 170688 171011 171210 170776 169469
57423A69469j470n44N97Q86L77p8l8J59P7k95o00m40K44R93J266J052P04L04k30
$$ 169469 167999 167455 168052 168938 169315 169237 169199 169358 169435 169140 168540 168100 168344 169337 170603 171655 172359 172663 172433
57404A72433n31r8P13R19L15k57k49m4J6K25O63P92M49K00K41ln66n00N18J374
$$ 172433 171902 171804 172517 173436 173751 173494 173245 173201 173217 173442 174105 174897 175346 175546 175787 175784 175218 174718 175236 176610
57384A76610J272J042J551K037J465M98M52J141J366J046J055J419J358R26R69
$$ 176610 177882 178924 180475 182512 183977 184475 184927 186068 187434 188480 189535 190954 192312 193238 194207
57369A94207J429J315M64j21M6K81O2l05o03j102j616j359k81M20j79j479k195
$$ 194207 195636 196951 197415 197294 197340 197621 197683 197378 196775 195673 194057 192698 192417 192837 192658 191179 188984
57352A88984j798p30K73O54L25j37j7O40J047P23Q1j81J64P86J160R37K97j64
$$ 188984 187186 186456 186729 187383 187708 187571 187554 188194 189241 189964 190045 189864 190028 190814 191974 192911 193208 193044
57334A93044j53r8m14o97l00N96J237J459J746K175K141J260j44j505k406k399
$$ 193044 192891 192793 192379 191682 191382 191978 193215 194674 196420 198595 200736 201996 201852 200347 197941 195542
57318A95542j291K47J007N12m21o51J10J173J639J233N49M48J049J641J694J524
$$ 195542 194251 194498 195505 196017 195596 194945 195055 196228 197867 199100 199649 200097 201146 202787 204481 206005
57302B06005J553J547J180Q56J154J850K246K150J800J209M25L6M73J089R96M62
$$ 206005 207558 209105 210285 211141 212295 214145 216391 218541 220341 221550 221975 222011 222484 223573 224569 225031
57286B25031M88J143J477J041L71o2k55l2R37K276L163L550M102M795M740L719
$$ 225031 225519 226662 228139 229180 229551 229489 229234 229202 230139 232415 235578 239128 243230 248025 252765 256484
57270B56484K731K565K811K728K177J297J60p72p32K44J103J101O49L70K21O4
$$ 256484 259215 261780 264591 267319 269496 270793 270953 270181 269449 269693 270796 271897 272546 272916 273137 273201
57254B73201K70J056J852J974J470Q36M12M64J171K092K308J632R97J103J398
$$ 273201 273471 274527 276379 278353 279823 280659 281071 281535 282706 284798 287106 288738 289735 290838 292236
57239B92236J109N94P40J495J994J876J588J512J583J798K303K843K800K071J433
$$ 292236 293345 293939 294679 296174 298168 300044 301632 303144 304727 306525 308828 311671 314471 316542 317975
57224C17975J615K363K791K553K241K494L099L368L182L141L560L980M004M026
$$ 317975 319590 321953 324744 327297 329538 332032 335131 338499 341681 344822 348382 352362 356366 360392
57210C60392M562N311N624N548N618N859N848N721O099O921P255O589N566N081
$$ 360392 364954 370265 375889 381437 387055 392914 398762 404483 410582 417503 424758 431347 436913 441994
57196D41994N284N820O417O876P043P118P527Q247Q765Q974R463J0574J1743J2282
$$ 441994 447278 453098 459515 466391 473434 480552 488079 496326 505091 514065 523528 534102 545845 558127
57182E58127J2351J2586J3115J3456J3241J2615J1998J1652J1529J1396J1200
$$ 558127 570478 583064 596179 609635 622876 635491 647489 659141 670670 682066 693266
57171F93266J1207J1646J2302J2849J3320J3840J4066J3563J2683J2383J2979
$$ 693266 704473 716119 728421 741270 754590 768430 782496 796059 808742 821125 834104
57160H34104J3702J3711J3029J2273J1975J2400J3508J4852J5913J6669J7478
$$ 834104 847806 861517 874546 886819 898794 911194 924702 939554 955467 972136 989614
57149I89614J8369J9009J9450K0252K1593K2918K3747K4308K5027K5894K6771
$$ 989614 1007983 1026992 1046442 1066694 1088287 1111205 1134952 1159260 1184287 1210181 1236952
57138A236952K7836K9261L0771L1979L2913L3862L4875L5839L6935L8629M1080
$$ 1236952 1264788 1294049 1324820 1356799 1389712 1423574 1458449 1494288 1531223 1569852 1610932
57127A610932M3789M6023M7635M9209N1310N3769N6159N8742O2312O6936P1781
$$ 1610932 1654721 1700744 1748379 1797588 1848898 1902667 1958826 2017568 2079880 2146816 2218597
57116B218597P6610Q2699R1500J02910J15701J29333J44484J61953J81733K03303
$$ 2218597 2295207 2377906 2469406 2572316 2688017 2817350 2961834 3123787 3305520 3508823
57106C508823K26462K52125K82606L20945L69823M31584N09219O06420P26496
$$ 3508823 3735285 3987410 4270016 4590961 4960784 5392368 5901587 6508007 7234503
57097G234503Q72359J047486J255125J495481J764911K057948K368127K686516
$$ 7234503 8106862 9154348 10409473 11904954 13669865 15727813 18095940 20782456
57089B0782456L002550L307712L595143L853690M064973M205100M238322M101860
$$ 20782456 23785006 27092718 30687861 34541551 38606524 42811624 47049946 51151806
57081E1151806L711354L010310K031866R07454j97031j161610j942955k550478
$$ 51151806 54863160 57873470 59905336 60812790 60615759 59454149 57511194 54960716
57073E4960716l010861l350287l589030l737693l797698l768341l653467l462545
$$ 54960716 51949855 48599568 45010538 41272845 37475147 33706806 30053339 26590794
57065B6590794l209835k914323k597619k279111j973170j690188j437377j217586
$$ 26590794 23380959 20466636 17869017 15589906 13616736 11926548 10489171 9271585
57057I271585j029565q70926p39985o34741n52024m88471m40714m04012l72529
$$ 9271585 8242020 7371094 6631109 5996368 5444344 4955873 4515159 4111147 3738618
57048C738618l42153l11997k82587k53919k25966j99582j75677j54212j34897
$$ 3738618 3396465 3084468 2801881 2547962 2321996 2122414 1946737 1792525 1657628
57039A657628j18051j04034r2411q2441p3916o6925o1131n5762n0180m4304l8607
$$ 1657628 1539577 1435543 1343132 1260691 1186775 1119850 1058719 1002957 952777 908473 869866
57028H69866l3684k9537k5547k1438j7659j4274j0243m761J404P257J3681K2477
$$ 869866 836182 806645 781098 759660 742001 727727 717484 712723 714127 721384 735065 757542
57016G57542L3618M5437N7770P3067R3658J19471J48639J77658J98679J98710
$$ 757542 791160 836597 894367 967434 1061092 1180563 1329202 1506860 1705539 1904249
57006A904249J65829R8929J1484p5048j42574j83515j99973j98286j84594j63776
$$ 1904249 2070078 2169007 2180491 2105443 1962869 1779354 1579381 1381095 1196501 1032725
56996A032725j39987j16586r5520p7482o2596n0649m1054l3190k6665k0902j5055
$$ 1032725 892738 776152 680632 603150 540554 489905 448851 415661 388996 368094 353039
56985C53039r056m199j743j337j863l362o732j1587j5888j8132j8654j8380j7459
$$ 353039 343983 339784 338041 336704 334841 331479 324747 313160 297272 279140 260486 242106 224647
56972B24647j5756j3656j1614r572p472n660m257k672l98K184M429O408Q649J1250
$$ 224647 208891 195235 183621 174049 166577 160917 156660 153988 153590 155774 160203 166611 175260 186510
56958A86510J3768J5837J7335J7947J6942J3543P575np331j2731j5755j6997j7003
$$ 186510 200278 216115 233450 251397 268339 281882 289457 289452 282121 269390 253635 236638 219635
56945B19635j5853j3677j1010q359n816l251o23K053M741P305R691J2213J5371
$$ 219635 203782 190105 179095 170736 164920 161669 161046 163099 167840 175145 184836 197049 212420
56932B12420J9253K3273K6396K7370K4995J8839R803k81r687j7332k2638k5465
$$ 212420 231673 254946 281342 308712 333707 352546 362349 362068 352381 335049 312411 286946
56920B86946k6108k5031k2614j9447j6478j4303j2499j0296p797n891n047m823
$$ 286946 260838 235807 213193 193746 177268 162965 150466 140170 132373 126482 121435 116612
56908A16612m573m098l473k778k075j395o58P5N61Q77J602L000M398M984M959
$$ 116612 112039 107941 104468 101690 99615 98220 97562 97637 98198 99075 100677 103677 108075 113059 118018
56893A18018N161N863O683P520Q752J0552J2691J4939J6963J7922J6920J3841
$$ 118018 123179 129042 135725 143245 151997 162549 175240 190179 207142 225064 241984 255825
56881B55825R218L587k385p464j0516j1563j1427j0547q905o745m373j467K273
$$ 255825 265043 268630 266245 258781 248265 236702 225275 214728 205823 199078 194705 193238 195511
56868A95511O073Q920J1287J4679J9441K4409K8923L3606L8714M2984M4791M3210
$$ 195511 201584 210504 221791 236470 255911 280320 309243 342849 381563 424547 469338 512548
56856E12548L7465K6826J2180l269j6035k4689k9636l1494l0622k7621k3207j7740
$$ 512548 550013 576839 589019 585750 569715 545026 515390 483896 453274 425653 402446 384706
56844C84706j1473m978J259P376J3793K0586K7560L4677M2041M9729N7687O5231
$$ 384706 373233 368255 369514 376890 390683 411269 438829 473506 515547 565276 622963 688194
56832F88194P0270O9581O0587M3080J9400o551l0567m9294o1144o6292o5922o1614
$$ 688194 758464 828045 888632 931712 951112 944561 913994 864700 803556 737264 671342 609728
56820F09728n5041m7444l9186l0233k1038j2451m876J974Q574J5387K2845L0800
$$ 609728 554687 507243 468057 437824 416786 404335 399459 401433 410007 425394 448239 479039
56808D79039L8258M4313M8805N0968M8109L7448J9538j474k1177l7158m8231n3644
$$ 479039 517297 561610 610415 661383 709492 746940 766478 765004 743827 706669 658438 604794
56796F04794n4006n1343m7079m1075l3402k5706j9565j4688r874m844K7M860R860
$$ 604794 550788 499445 452366 411291 377889 352183 332618 317930 308056 303212 303239 308099 317959
56783C17959J4398J7845K0722K3715K5835K4763J9123R623j766j2957k2288k8859
$$ 317959 332357 350202 370924 394639 420474 445237 464360 473983 472217 459260 436972 408113
56771D08113l2624l3953l3224l1007k8102k4994k1692j8339j5390j2936j0596
$$ 408113 375489 341536 308312 277305 249203 224209 202517 184178 168788 155852 145256
56760A45256q421p102o749o377n269l942l137k668k117j788k060k554k837l162
$$ 145256 136835 129733 122984 116607 111338 107396 104259 101591 99474 97686 95626 93072 90235 87073
56746H7073l641l490k220p79l11m54k18J59k59j122j032J80J017M92n59q37l00
$$ 87073 83432 79942 77722 76943 76632 76178 75960 76119 75860 74738 73706 73886 74903 75395 74836 73999 73699
56729G3699R7k49r78j227n36M99O94k78j225q12P24J906J836R28M0l43j11N55
$$ 73699 73796 73547 72569 71342 70806 71305 71999 71721 70496 69684 70408 72314 74150 75078 75118 74775 74664 75219
56711G5219J149J276J089R24P19K99q3r0N0j2j6M86J158J214O54K53L19L19q1
$$ 75219 76368 77644 78733 79657 80376 80675 80592 80502 80552 80540 80524 81010 82168 83382 84036 84289 84608 84927 84846
56692H4846m12j85L49N67K16m37r32q94l02M83J065J411J666J800J665J271O84
$$ 84846 84434 84249 84598 85165 85381 84944 84012 83118 82816 83299 84364 85775 87441 89241 90906 92177 92861
56675I2861j34j045j536j240m65J47K85L4m44q38o13M21J571J826R75j57n79M4
$$ 92861 92727 91682 90146 88906 88441 88588 88873 88907 88463 87625 87012 87433 89004 90830 91805 91648 91069 91113
56657I1113J237K089J883P20n27r73l91P91J796J920J129K79J70M46J47o23p38
$$ 91113 92350 94439 96322 97042 96515 95542 95151 95942 97738 99658 100787 101066 101236 101682 101829 101206 100468
56640A00468R0P10L98Q0P45J779J960J349Q46N77J6n96l78P43J796J974J274N1
$$ 100468 100558 101268 101666 101746 102491 104270 106230 107579 108425 109002 109018 108422 108044 108787 110583 112557 113831 113882
56622A13882j160j504m41J376K550K341J196L4m04J43J191J780J536J126J148
$$ 113882 112722 111218 110777 112153 114703 117044 118240 118274 117870 118013 119204 120984 122520 123646 124794
56607A24794J194P66L84P43J298R12l26j159r78m17j31m3K7o1l19m37k41K14Q87
$$ 124794 125988 126754 127138 127881 129179 130091 129765 128606 127628 127211 127080 127037 127064 127003 126684 126247 126006 126220 127107
56588A27107J560J592N95q07j618j674j495j227o05K16O98P66P97Q59P72P37J105
$$ 127107 128667 130259 130854 130047 128429 126755 125260 124033 123428 123644 124342 125108 125905 126764 127536 128273 129378
56571A29378J624J770J692K017K801L526M009M396M451L795K915K935M225O005
$$ 129378 131002 132772 134464 136481 139282 142808 146817 151213 155664 159459 162374 165309 169534 175539
56557A75539P410Q188Q347P892P075O234N358M320L366K793K324J507M84k46n48
$$ 175539 182949 191137 199484 207376 214451 220685 226043 230363 233729 236522 238846 240353 240837 240591 240043
56542B40043n06m4N48L01j191k803l285l090l468m299m375l582l077l246l182
$$ 240043 239537 239493 240041 240342 239151 236348 233063 229973 226505 222206 217831 214249 211172 207926 204744
56527B04744k461j965k419l295l686l267k145p04J61l37j784k946l301l266l092
$$ 204744 202283 200318 197899 194604 190918 187651 185506 184802 184963 184626 182842 179896 176595 173329 170237
56512A70237k654k261k389k628k152j275j116j698j886j360j060j347j300l42
$$ 170237 167583 165322 162933 160305 158153 156878 155762 154064 152178 150818 149758 148411 147111 146769
56498A46769Q70J670K105K023R66n16j013l55l4q41j643j350n50j31K25J035J713
$$ 146769 147639 149309 151414 153437 154403 153887 152874 152519 152485 151644 150001 148651 148101 147970 148195 149230 150943
56481A50943J570J073R42R19M82m0j85k73n89m95N33J724J888R55j83p63l79J033
$$ 150943 152513 153586 154528 155447 155929 155889 155704 155431 154842 154347 154880 156604 158492 159447 159264 158501 158122 159155
56463A59155K698L285K484J476J130Q61J24k05P48K102K354J561R05P63O36N78
$$ 159155 161853 165138 167622 169098 170228 171089 171213 171008 171756 173858 176212 177773 178678 179441 180077 180655
56447A80655J146K066K369J869J418J542J782J489N88m94j125q50qL50l33j335
$$ 180655 181801 183867 186236 188105 189523 191065 192847 194336 194924 194430 193305 192455 192447 192797 192464 191129
56431A91129j689j429j128p71J0R21J247R38N96N09M44K18j30o28j174j306p55
$$ 191129 189440 188011 186883 186112 186122 187043 188290 189228 189824 190333 190777 190995 190865 190237 189063 187757 187002
56414A87002lL44M10O67J049J124R36Q86R37O89J33k63k34N6M41Q86J263J384
$$ 187002 186999 187343 187753 188420 189469 190593 191529 192415 193352 194041 194174 193911 193677 193733 194174 195060 196323 197707
56396A97707J238R02M06j41m46l91k29j85j28J07M45Q02J164J257O21o58j735
$$ 197707 198945 199847 200253 200112 199666 199275 199046 198861 198733 198840 199285 200087 201251 202508 203129 202471 200736
56379B00736j884j137P5J452K695L445L693L732L588L051K395K254K565K519J843
$$ 200736 198852 197715 197790 199242 201937 205382 209075 212807 216395 219446 221841 224095 226660 229179 231022
56364B31022J212R97O83Ql84j72j07p25j297j036m64m76q11o30nL47L69N74R26
$$ 231022 232234 233231 233914 233922 233538 233366 233259 232534 231237 230201 229737 229261 228450 227820 227815 228162 228531 229105 230031
56345B30031R11N63M58P87J119J083O84P6m87o85m92j53L47J299K427K859K336
$$ 230031 230942 231505 231963 232750 233869 234952 235636 235712 235225 234540 234048 233895 234242 235541 237968 240827 243163
56328B43163J716J682J826J613J368J534J795J820K044K755L221K817K239K482
$$ 243163 244879 246561 248387 250000 251368 252902 254697 256517 258561 261316 264537 267354 269593 272075
56314B72075L160L058K002R75O94J011J438J449N85q44j588q77L87Q02L75L21
$$ 272075 275235 278293 280295 281270 281964 282975 284413 285862 286447 285603 284015 283138 283525 284327 284702 285023
56298B85023J281K787M173N063N047L881K000K26r58j484j450j275j556k170k170
$$ 285023 286304 289091 293264 298327 303374 307255 309255 309481 308523 307039 305589 304314 302758 300588 298418
56283B98418j139jL38L50R98K138K805K676K242J955J945K183K342K017J564J919
$$ 298418 297279 297278 297616 297966 298964 301102 303907 306583 308825 310780 312725 314908 317250 319267 320831 322750
56267C22750L050L672L254L038L995N114N090M447M429M785M528M051M561N921
$$ 322750 325800 329472 332726 335764 339759 344873 349963 354410 358839 363624 368152 372203 376764 382685
56253C82685O915P313P879Q642Q958R120J0193J2156J3813J4667J5399J6421J7341
$$ 382685 389600 396913 404792 413434 422392 431512 441705 453861 467674 482341 497740 514161 531502
56240E31502J7993J8751J9673K0371K0720K0713J9897J8004J5809J4166J2592
$$ 531502 549495 568246 587919 608290 629010 649723 669620 687624 703433 717599 730191
56229G30191J0048O725L619Q50k131n030p128q860j1189j3515j4202j3208j2367
$$ 730191 740239 746964 750583 751433 749302 744272 737144 728284 717095 703580 689378 676170 663803
56216F63803j2671j3044j2341j0915r647q732q137q093q530q892q864q570p995
$$ 663803 651132 638088 625747 614832 605185 596453 588316 580223 571693 562801 553937 545367 537372
56203E37372p075o287o160o309n953n232m853m661l846k400j064k8R78J498Q69
$$ 537372 530297 524010 517850 511541 505588 500356 495503 490842 486996 484596 483532 483504 484482 485980 486849
56188D86849k38l45O38J385J356J405J950K240J889J593J734J720J251R99J437
$$ 486849 486611 486266 486904 488289 489645 491050 493000 495240 497129 498722 500456 502176 503427 504426 505863
56173E05863K021K147J927J692J482J404J672K141K473K737L088L194K851K732
$$ 505863 507884 510031 511958 513650 515132 516536 518208 520349 522822 525559 528647 531841 534692 537424
56159E37424L469M435M734M834N781P256Q090Q289Q839R764J0213J0278J0907
$$ 537424 540893 545328 550062 554896 560677 567933 576023 584312 593151 602915 613128 623406 634313
56146F34313J2025J2647J2874J3936J6077J8268K0229K2899K6595L0374L3555
$$ 634313 646338 658985 671859 685795 701872 720140 740369 763268 789863 820237 853792
56135H53792L6395L9265M2686M8041N6422O6954P8084R0257J04952J21122J35048
$$ 853792 890187 929452 972138 1020179 1076601 1143555 1221639 1311896 1416848 1537970 1673018
56124A673018J43955J47410J44947J35313J19146J00047Q1779O6212N4463M7534
$$ 1673018 1816973 1964383 2109330 2244643 2363789 2463836 2545615 2611827 2666290 2713824
56114B713824M4319M1027L4179K3127R193n812j9316k8467l2602l4372l7608m4982
$$ 2713824 2758143 2799170 2833349 2856476 2865669 2859857 2840541 2812074 2779472 2745100 2707492 2662510
56102B662510n7715p5497r5711j14274j28158j36271j38027j32952j22183j08426
$$ 2662510 2604795 2529298 2433587 2319313 2191155 2054884 1916857 1783905 1661722 1553296
56092A553296r3815p9215o5628n4254m4815l5926k7524k0966j6445j2558q783
$$ 1553296 1459481 1380266 1314638 1260384 1215569 1179643 1152119 1131153 1114708 1102150 1093367
56081A093367o057m358k234N72K507L022L655N419P350Q577R598J0726J1417J1862
$$ 1093367 1087310 1082952 1080718 1081290 1083797 1086819 1090474 1095893 1103243 1111820 1121418 1132144 1143561 1155423
56067A155423J3025J4463J4536J3333J2878J3793J4469J4219J4480J5957J7448
$$ 1155423 1168448 1182911 1197447 1210780 1223658 1237451 1251920 1266139 1280619 1296576 1314024
56056A314024J8308J9321K0248J9613J7796J7143J7997J7916J6028J4690J5369
$$ 1314024 1332332 1351653 1371901 1391514 1409310 1426453 1444450 1462366 1478394 1493084 1508453
56045A508453J6408J6496J6892J8340J9217J8733J8633J9747K0103J8612J7379
$$ 1508453 1524861 1541357 1558249 1576589 1595806 1614539 1633172 1652919 1673022 1691634 1709013
56034A709013J8261K0300K2617K6486L2265L7568M0786M3268M5972M7385M6974
$$ 1709013 1727274 1747574 1770191 1796677 1828942 1866510 1907296 1950564 1996536 2043921 2090895
56023B090895M7085M9012N0751N1063N2039N5095N8202N9752O1331O3981O5821
$$ 2090895 2137980 2186992 2237743 2288806 2340845 2395940 2454142 2513894 2575225 2639206 2705027
56012B705027O6195O7979P2632P7232P9687Q2422Q7471R2507R5602R9277J05604
$$ 2705027 2771222 2839201 2911833 2989065 3068752 3151174 3238645 3331152 3426754 3526031 3631635
56001C631635J11854J15501J19245J26287J34910J42424J50289J60492J71017
$$ 3631635 3743489 3858990 3978235 4104522 4239432 4381856 4532145 4692637 4863654
55992D863654J79901J89587K02421K16058K28252K41705K59146K78342K97163
$$ 4863654 5043555 5233142 5435563 5651621 5879873 6121578 6380724 6659066 6956229
55983F956229L18521L44925L73469M01950M34221M73537N16753N61449O12283
$$ 6956229 7274750 7619675 7993144 8395094 8829315 9302852 9819605 10381054 10993337
55974A0993337O73313P41165Q13477Q96852R98240J116338J250608J410681J607269
$$ 10993337 11666650 12407815 13221292 14118144 15116384 16232722 17483330 18894011 20501280
55965B0501280J843042K124029K470913K906477L440345M077533M830821N712281
$$ 20501280 22344322 24468351 26939264 29845741 33286086 37363619 42194440 47906721
55957D7906721O728758P904988R296755J0959859J2920942J5200660J7842927
$$ 47906721 54635479 62540467 71837222 82797081 95718023 110918683 128761610
55950A28761610K0887380K4323981K8068582L1850852L4938596L5967021L3315948
$$ 128761610 149648990 173972971 202041553 233892405 268831001 304798022 338113970
55943C38113970K6029271J4606162R67488j2381485k3334528l0735075l4413018
$$ 338113970 364143241 378749403 379716891 367335406 344000878 313265803 278852785
55936B78852785l4922258l3173172l0090788k6411448k2645499j9117332j5997083
$$ 278852785 243930527 210757355 180666567 154255119 131609620 112492288 96495205
55929I6495205j3330673j1095175r249280p744211o519135n515009m690984m017463
$$ 96495205 83164532 72069357 62820077 55075866 48556731 43041722 38350738 34333275
55921C4333275l462845k998892k610546k288328k017230j782519j579367j406658
$$ 34333275 30870430 27871538 25260992 22972664 20955434 19172915 17593548 16186890
55913A6186890j256985j121663r99999q94806q03476p21241o48524n87325n34562
$$ 16186890 14929905 13808242 12808243 11913437 11109961 10388720 9740196 9152871 8618309
55904H618309m86088m43283m08863l80008l52182l26078l04498k85777k66456
$$ 8618309 8132221 7688938 7280075 6900067 6547885 6221807 5917309 5631532 5365076
55895E365076k47287k30752k15509j98947j82427j68630j56403j43304j30527
$$ 5365076 5117789 4887037 4671528 4472581 4290154 4121524 3965121 3821817 3691290
55886C691290j20155j10231r7649q3570p0911n8737m4141k7655j1856L571K0562
$$ 3691290 3571135 3460904 3363255 3279685 3208774 3150037 3105896 3078241 3066385 3069956 3090518
55875C090518L7817N1633O0181O2830N6933L9927J3954j5421m4274p1056r3966
$$ 3090518 3128335 3179968 3240149 3302979 3359912 3399839 3413793 3398372 3354098 3283042 3189076
55864C189076j11571j25111j36576j45120j48227j45437j38201j27461j14300
$$ 3189076 3077505 2952394 2815818 2670698 2522471 2377034 2238833 2111372 1997072
55855A997072j01473r1236q2846p4926o8470o4636o1491n6545n0916m7405m5766
$$ 1997072 1895599 1804363 1721517 1646591 1578121 1513485 1451994 1395449 1344533 1297128 1251362
55844A251362m3472m0001l6816l3995l0553k7280k5815k5407k3919k1435j9693
$$ 1251362 1207890 1167889 1131073 1097078 1066525 1039245 1013430 988023 964104 942669 922976
55833I22976j8556j6434j3748j2568j2968j2955j1964j1399j1682j1701j1286
$$ 922976 904420 887986 874238 861670 848702 835747 823783 812384 800702 789001 777715
55822G77715j1447j2074j2057j1718j2473j3978j4314j3168j2201j1954j1050
$$ 777715 766268 754194 742137 730419 717946 703968 689654 676486 664285 652331 641281
55811F41281q949o984n993n087l505j758k77J356L284M984O310P524Q278Q051
$$ 641281 632332 625348 619355 614268 610763 609005 608728 610084 613368 618352 624662 632186 640464 648515
55797F48515P493P650Q037P275N503M157L427K060j54j813k282k649l776n177
$$ 648515 656008 663658 671695 678970 684473 688630 692057 694117 693963 692150 689868 687219 683443 678266
55783F78266o455q022r726j0383r625q892r740j2168j5148j7806j9463j9545j8092
$$ 678266 671811 663789 654063 643680 634055 625163 615423 603255 588107 570301 550838 531293 513201
55770E13201j5735j2869r416n498j580J988M825O093N179K750J57k132m521o926
$$ 513201 497466 484597 475181 469683 468103 470091 474916 481009 486188 488938 489095 486963 482442 475516
55756D75516q563r141r270r532r996j0591j1189j1394j0950j0218r585q859p942
$$ 475516 466953 457812 448542 439010 429014 418423 407234 395840 384890 374672 365087 356228 348286
55743C48286p432p661p780o969n860n471n444m708l334k219j438n08J62k04j079
$$ 348286 340854 333193 325413 318444 312584 307113 301669 296961 293627 291408 289970 289462 289624 289420 288341
55728B88341j265j024j811l869n789o568o467n821m654l606l564m083l771k467
$$ 288341 287076 286052 284241 280372 274583 268015 261548 255727 251073 247467 243903 239820 236049 233582
55714B33582j452j217q06K20Q93O26L44R92K202L238M071M731M657L413J303j263
$$ 233582 232130 230913 230107 230327 231220 231846 232190 233182 235384 238622 242693 247424 252081 255494 256797 255534
55698B55534m073o463p433o966o242o025n810n073m253l903l676k985j908r57
$$ 255534 251461 244998 237565 230599 224357 218332 212522 207449 203196 199293 195617 192632 190724 189767
55684A89767m47m87j001j468j288n89j8L78J121K137K603K202J527R66J59j097
$$ 189767 189320 188833 187832 186364 185076 184487 184469 184847 185968 188105 190708 192910 194437 195403 195562 194465
55668A94465k353l310m113m574m101k786j635j215j021n60j02J55O70J757K945
$$ 194465 192112 188802 184689 180115 176014 173228 171593 170378 169357 168797 168695 168850 169520 171277 174222
55653A74222L697M059M172M003L886M441N484N912N193M134L610L428L025K370
$$ 174222 177919 181978 186150 190153 194039 198480 203964 209876 215069 219203 222813 226241 229266 231636
55639B31636J506M7k101m091n027n022m872n098n766o670p228o820n625m590m174
$$ 231636 233142 233189 231088 226997 221970 216948 212076 206978 201212 194542 187314 180494 174869 170279 166105
55624A66105l815k968j887r49r8N58M44n16j434j651j630j930k100j483m76Lj79
$$ 166105 162290 159322 157435 156486 156388 156946 157390 156874 155440 153789 152159 150229 148129 146646 146170 146173 145994
55607A45994n02q16j345j950k231k191k117j979j632j306j259j139m68M51Q15
$$ 145994 145492 144676 143331 141381 139150 136959 134842 132863 131231 129925 128666 127527 127059 127510 128325
55592A28325M85J04O0J0l64p33n41J87Q85J090Q98O83O15O26Q48J647K993M142
$$ 128325 128810 128914 128974 128984 128620 127887 127346 127533 128418 129508 130406 131089 131704 132330 133178 134825 137818 141960
55574A41960M492M430M818N761O649P309Q273R814J1462J2641J3097J2525J0598
$$ 141960 146452 150882 155700 161461 168110 175419 183692 193506 204968 217609 230706 243231 253829
55561B53829P623M470J552j375m240o333p447q377r754j1130j1805j1841j1611
$$ 253829 261452 265922 267474 266099 261859 255526 248079 239702 229948 218818 207013 195172 183561
55548A83561j1044j0004q808p692o392m889l910l834l810k880j510r46j408j975
$$ 183561 172517 162513 153705 146013 139621 134732 130822 126988 123178 120298 118788 117842 116434 114459
55534A14459k045j857j581r29J21R75J108O03j50p94j035p57k78j22m45r69j386
$$ 114459 112414 110557 108976 108047 108168 109143 110251 110854 110704 109910 108875 108118 107840 107718 107273 106304 104918
55517A04918j532j275o66q3J14L9K2N0j12l79m27k69k78n27n53K3R00J319P96
$$ 104918 103386 102111 101445 101362 101476 101515 101537 101587 101475 101096 100669 100400 100122 99595 99042 99065 99965 101284 102080
55498A02080m37j665k287k242j843j284n70J06L63J05k25k05N1J60M1p3rK04M59
$$ 102080 101643 99978 97691 95449 93606 92322 91752 91858 92221 92326 92101 91896 91947 92107 92148 92075 92066 92270 92729
55479I2729O35O19M35K38J58K67O60J231J395N51r97k056j809p57p0k65q20r13
$$ 92729 93364 93983 94418 94656 94814 95081 95741 96972 98367 98918 97921 95865 94056 93299 93229 92964 92144 91231
55461I1231k57O68J046N70j94m45q6L63O26Q46R62O88K04J37N69Q35N82K34M6
$$ 91231 90974 91642 92688 93258 93064 92619 92533 92896 93522 94368 95330 96018 96222 96359 96928 97763 98345 98579 98625
55442I8625l49r58r65j8R21R54O63R68J328N17j125j797p54O80J030M58R0L91
$$ 98625 98276 97318 96353 96335 97256 98210 98873 99841 101169 101686 100561 98764 98010 98690 99720 100178 100268 100659
55424A00659R67J335J234N25n32j070k76J593L231L518K602J634J499K038K525
$$ 100659 101626 102961 104195 104720 104188 103118 102842 104435 107666 111184 113786 115420 116919 118957 121482
55409A21482K562K235J690J041N49K88k65j587l055l426k642k134k829l773l570
$$ 121482 124044 126279 127969 129010 129559 129847 129582 127995 124940 121514 118872 116738 113909 110136 106566
55394A06566k341j292r17p46m94l49l11k23l35r46j605j573j019p48q16m56M83
$$ 106566 104225 102933 102016 101270 100776 100427 100116 99893 99558 98612 97007 95434 94415 93667 92851 92395 92878
55377I2878J125Q88K86QP4K61N72P99L51q66j966k060j288m37OM5j75l44o7O23
$$ 92878 94003 94891 95177 95185 95259 95520 96092 96891 97242 96376 94410 92350 91062 90625 90631 90676 90501 90157 90090 90713
55357I0713J064P70Q4l54m69n34m61M3P35Q91K44o07r11n86j16N4r2l02l37j78
$$ 90713 91777 92547 92631 92277 91808 91274 90813 90856 91591 92482 92726 92119 91208 90622 90506 90560 90468 90166 89829 89651
55337H9651k6j11m28o18k60O24J415J449P58L2j84k7J03J31J61M6l84q25p39j19
$$ 89651 89625 89514 89086 88468 88208 88832 90247 91696 92454 92486 92302 92275 92378 92509 92670 92716 92332 91507 90768 90649
55317I0649L91K70l14q41r81p07j90K67M07L35N04J180K004K220J416j3j101j168
$$ 90649 91040 91310 90996 90155 89174 88467 88277 88544 88951 89286 89790 90970 92974 95194 96610 96597 95496 94328
55299I4328m70J06%n09q46p71l13N38J588K207J874R40L33M68R01J060Q86O90
$$ 94328 93858 93964 93964 93455 92609 91838 91525 92063 93651 95858 97732 98672 99005 99473 100374 101434 102320 103010
55281A03010P11R58J205J105M93l84j113j458j291n40M49Q40J70r29j436j215
$$ 103010 103721 104679 105884 106989 107482 107098 105985 104527 103236 102696 103145 103985 104155 103226 101790 100575
55265A00575q59n53j2N50M30l15p21l89j13m63p24j12Q28J046P01Q33J617K055
$$ 100575 99716 99163 99151 99701 100131 99816 99095 98706 98593 98130 97406 97294 98122 99168 99869 100702 102319 104374
55247A04374J445K26q06j332j374j022o12o09r94j216r16l11L03Q38J042M87o73
$$ 104374 105819 106045 105239 103907 102533 101511 100899 100290 99296 98080 97164 96853 97156 97994 99036 99523 98850
55230I8850j490j261m50J9l6j04Kj1j50pM49O80M70L49P31J151R82M64L20O08
$$ 98850 97360 96099 95649 95668 95632 95528 95530 95519 95369 95362 95811 96491 96961 97310 98041 99192 100174 100638 100958 101566
55210A01566O78K92J3L48J048J549J645J437J012M78N8j27j72j56k6J64J76m6
$$ 101566 102244 102536 102549 102897 103945 105494 107139 108576 109588 110066 110124 109997 109825 109669 109643 109807 109983 109937
55192A09937k67l50n12r30j422j660j418n77P10J665J383k1j304j576j259j091
$$ 109937 109670 109320 108808 107878 106456 104796 103378 102801 103511 105176 106559 106538 105234 103658 102399 101308
55176A01308q77n0J107J798J915J919J679N94j084k150j952j141o09l93l0O17
$$ 101308 100431 100381 101488 103286 105201 107120 108799 109393 108309 106159 104207 103066 102457 102064 102034 102651
55160A02651J288J624J368P07M26J048J832J486P3q22k28Q99J094K53p33j348
$$ 102651 103939 105563 106931 107638 108064 109112 110944 112430 112503 111681 111453 112352 113446 113699 112966 111618
55144A11618j543j069J25J161R99j40j002q90k61K43M18J47p09j780k260j893
$$ 111618 110075 109006 109131 110292 111291 111151 110149 109259 108998 109241 109659 109806 109097 107317 105057 103164
55128A03164j249q12l75L05Q40P55L08J83N68R56Q35J56p61j488j672j256n56
$$ 103164 101915 101103 100728 101033 101873 102628 102936 103119 103687 104643 105478 105634 104873 103385 101713 100457 99901
55111I9901J4L59N94O51K78m71j015p53K25J181J460J113O95O49R52J342J647
$$ 99901 99915 100274 100868 101519 101797 101326 100311 99558 99783 100964 102424 103537 104232 104881 105833 107175 108822
55094A08822J801J699J243N77J18J50M53M85J03j54L02J241J700R95m89j715j965
$$ 108822 110623 112322 113565 114142 114260 114410 114863 115348 115451 115297 115599 116840 118540 119535 119046 117331 115366
55077A15366j312l95O5k12p83q74l55p0q29k165k751j996o84J41L31L63L84J21
$$ 115366 114054 113659 113724 113512 112729 111855 111500 111430 110601 108436 105685 103689 103005 103146 103477 103840 104224 104345
55059A04345m35q28o10J83J069J428Q68m09j580j824j052P4Q81J269J478J571
$$ 104345 103910 103082 102472 102655 103724 105152 106020 105611 104031 102207 101155 101229 102110 103379 104857 106428
55043A06428J397J045R30J225J442R39j79j099j281j040r00p82k57O70J434J585
$$ 106428 107825 108870 109800 111025 112467 113406 113227 112128 110847 109807 108907 108125 107868 108538 109972 111557
55027A11557J201O81M19N98R85J074O59J46l2o2l03n39l26O6o8o91r68o08l57
$$ 111557 112758 113439 113858 114456 115441 116515 117174 117320 117288 117226 116923 116384 116058 116124 116056 115365 114397 113789 113432
55008A13432p26j159j002n63m71n15l8Q86J459J257O39J04j50j8N23J183J487
$$ 113432 112706 111547 110545 109982 109511 108996 108958 109844 111303 112560 113199 113303 113153 113135 113658 114841 116328
54991A16328J285Q36M37K43L22O01Q15Q44R03J138J255R15L23q7k28k34P3Q32
$$ 116328 117613 118449 118886 119129 119451 120052 120867 121711 122614 123752 125007 125922 126245 126158 125930 125696 125769 126601
54973A26601J454J076j84j164j042j96N54R05R58P80N29M85M98r9j409k327j741
$$ 126601 128055 129131 128947 127783 126741 126545 127099 128004 128962 129742 130271 130756 131254 131155 129746 127419 125678
54956A25678j17R55Q02L74P02J498J793J333O57R6m52r08q59k70K55K55oo8n2
$$ 125678 125561 126516 127318 127692 128394 129892 131685 133018 133675 133771 133319 132411 131552 131282 131537 131792 131786 131718 131666
54937A31666l76r71j268r62k96L85R94J489J744J719J544J271Q62M45L42P04J418
$$ 131666 131290 130319 129051 128089 127793 128178 129172 130661 132405 134124 135668 136939 137801 138246 138588 139292 140710
54920A40710K361L442M403M981N401O227P546Q731R215R024Q352P103N175K808
$$ 140710 143071 146513 150916 155897 161298 167525 175071 183802 193017 202041 210393 217496 222671 225479
54906B25479K55k453n036o812p459p489p489p345o777o062n482m590k987j480
$$ 225479 225734 223281 218245 211433 203974 196485 188996 181651 174874 168812 163330 158740 155753 154273
54892A54273j315k300k837k014n80L91Q15J044R97N41J19K29O91R98J098J293
$$ 154273 152958 150658 147821 145807 145227 145618 146433 147477 148474 149015 149134 149363 150054 151052 152150 153443
54876A53443J683K263L241M773O566Q138R249R762R374Q036O281M604K734K21
$$ 153443 155126 157389 160630 165403 171969 180107 189356 199118 208492 216528 222809 227413 230147 230368
54862B30368k499m396n230n848o881p839p900p041n874m749l632k683k383k918
$$ 230368 227869 223473 218243 212395 205514 197675 189775 182734 176860 172111 168479 165796 163413 160495
54848A60495l852m539m707m495m090l482k574j431m16J5l17j109j815k070j850
$$ 160495 156643 152104 147397 142902 138812 135330 132756 131325 130909 130924 130607 129498 127683 125613 123763
54833A23763j306o72k93m34r07j080n29M13J019J008P49O68P92R42R81P27J8q73
$$ 123763 122457 121785 121492 121058 120151 119071 118542 118955 119974 120982 121731 122399 123191 124133 125114 125841 125859 124986
54815A24986j225o83J85N74M85N89J090J371R09N9l75l1Q04J601J916J511N06
$$ 124986 123761 123078 123263 123837 124322 124911 126001 127372 128281 128340 127965 127934 128738 130339 132255 133766 134272
54798A34272o06j297j359r30l06J84L50L10L55N06M38M9k09J60R45J378J032K68
$$ 134272 133666 132369 131010 130080 129774 129958 130308 130618 130973 131479 131917 131966 131757 131917 132862 134240 135272 135540
54780A35540k58k55J41O82J122J207Q44L64L63J141K312L166L421L518L998M799
$$ 135540 135282 135027 135168 135850 136972 138179 139023 139387 139750 140891 143203 146369 149790 153308 157306 162105
54764A62105N386N574N861O754P990Q841R031Q964Q935Q528P147M834K170n87
$$ 162105 167491 173065 178926 185680 193670 202511 211542 220506 229441 237969 245116 249950 252120 251533
54750B51533l650o902r439j0447j0233r813r531q765p150n409m426l948k977j323
$$ 251533 247883 240981 231542 221095 210862 201049 191518 182753 175603 170194 165768 161820 158843 157520
54736A57520k4J8q62j671j955j901j586q11K77J073J226J073J111J375J680K231
$$ 157520 157496 157514 156652 154981 153026 151125 149539 148728 149005 150078 151304 152377 153488 154863 156543 158774
54720A58774L405M963O041O188N996O316P072P353O610N224L754K073l15l250
$$ 158774 162179 167142 173183 179371 185367 191683 198755 206108 212718 217942 221696 223769 223454 220204
54706B20204n713o820o760o552o869p330p065n872m547l933l899l571k498j221
$$ 220204 214491 207671 200911 194359 187490 180160 173095 167223 162676 158743 154844 151273 148775 147554
54692A47554n33n67q22q67p37o83q24j040j119r88q70j062j488j665j300p25m73
$$ 147554 147021 146454 145632 144765 144028 143345 142521 141481 140362 139374 138504 137442 135954 134289 132989 132264 131791
54675A31791n54n57l80m14q33j071m88O74J412J182N57L51M28j02j451k573k366
$$ 131791 131237 130680 130300 129886 129053 127982 127494 128168 129580 130762 131319 131670 132098 131996 130545 127972 125606
54658A25606j014L93J266J913K556K700J832K87j029j495j195o39l15l21l42j22
$$ 125606 124592 124985 126251 128164 130720 133420 135252 135539 134510 133015 131820 131181 130866 130545 130203 130081
54642A30081O4k28p77q18j30O86J245J952K974L455K537P41o22j112j305j507
$$ 130081 130145 129917 129140 128322 128192 128878 130123 132075 135049 138504 141041 141782 141160 140048 138743 137236
54626A37236j357q03m94q06j212j018k01P52J382J362N54o67j522j584j113n54
$$ 137236 135879 135076 134582 133776 132564 131546 131345 132097 133479 134841 135395 134728 133206 131622 130509 129955
54610A29955k2M29N42J78l04l36K73J194J819J578L48j284k386k433j569k36J030
$$ 129955 129933 130362 130904 131082 130778 130442 130715 131909 133728 135306 135654 134370 131984 129551 127982 127746 128776
54593A28776J569R71k68r68m73P26J716K103J953J327L73m40o42k56L17O91O17
$$ 128776 130345 131316 131048 130080 129607 130333 132049 134152 136105 137432 137805 137365 136723 136467 136784 137475 138092
54576A38092Lq60j340j097n06j37k6K33Q13J368J416Q18k9m56q7O93J069P05Q0
$$ 138092 138095 137235 135895 134798 134292 134155 134129 134362 135175 136543 137959 138777 138748 138292 138205 138898 139967 140672 140752
54557A40752k00j04K4N1J01K18K81K34R7j41m32n30j42P32J658J975J308Oj035
$$ 140752 140552 140448 140472 140523 140624 140842 141123 141357 141454 141313 140881 140351 140209 140941 142599 144574 145882 145888 144853
54538A44853j228q60n61l94P2R44J821K333K393J921J000L00N63J525K138J973
$$ 144853 143625 142765 142204 141810 141882 142826 144647 146980 149373 151294 152294 152594 153157 154682 156820 158793
54522A58793J638J517J136K12n54n09p5pk97n61q79j384j610j163o09p11j195
$$ 158793 160431 161948 163084 163296 162742 162233 162158 162151 161854 161293 160414 159030 157420 156257 155648 154937 153742
54505A53742j172n52o2p4k95m66n82n60l84m09p43p42R2J070J173O02L66O24O42
$$ 153742 152570 152018 151956 151882 151587 151121 150539 149979 149595 149186 148443 147701 147793 148863 150036 150638 151004 151628 152270
54486A52270K23j15l06o62p35K48J633J735M10m29L34J335R36k67n81K04R02R55
$$ 152270 152493 152378 152072 151410 150675 150923 152556 154291 154701 154272 154606 155941 156877 156610 156029 156233 157135 158090
54468A58090R37J337J997K599K858K428J445P84J020J533J462J028R24R21K63
$$ 158090 159027 160364 162361 164960 167818 170246 171691 172475 173495 175028 176490 177518 178442 179363 179626
54453A79626p65j081n16p0k96o22o04p15j292j675j128k1O14L35m07r66j089r90
$$ 179626 178861 177780 177264 177194 176898 176276 175672 174957 173665 171990 170862 170841 171455 171790 171383 170417 169328 168338
54435A68338j057j376j501r84p8N08N34L45R5l97q92o68L19J060Q31K66L33Q60
$$ 168338 167281 165905 164404 163420 163342 163850 164384 164729 164824 164427 163535 162867 163186 164246 165077 165343 165676 166536
54417A66536R54N39L54N84N32j00n75k05O23J077R45N56O0n31q53n05J70L05l51
$$ 166536 167490 168029 168383 168967 169499 169399 168824 168619 169242 170319 171264 171820 171880 171349 170496 169991 170161 170466 170115
54398A70115j040j050n73k23p5J61M18L96L34Q94K043K752K285J253Q13J115J244
$$ 170115 169075 168025 167452 167229 167154 167315 167733 168129 168463 169357 171400 174152 176437 177690 178503 179618 180862
54381A80862O20l06q64j040j157j234j134j041j265j707j901j607r90k79L95Q65
$$ 180862 181482 181176 180312 179272 178115 176881 175747 174706 173441 171734 169833 168226 167236 166957 167352 168217
54365A68217R85R23J008J232J208P89L27J57J76J77K57N02N62N2p92j340j447
$$ 168217 169202 170125 171133 172365 173573 174362 174689 174846 175022 175199 175456 175958 176520 176572 175780 174440 172993
54348A72993j555j920k212k074j605j032l23N28J099Q77j00j233j949k111j907
$$ 172993 171438 169518 167306 165232 163627 162595 162272 162800 163899 164776 164676 163443 161494 159383 157476
54333A57476j602j305r03k25O53J375J627J332N36n46j338j235m14J08l39j236
$$ 157476 155874 154569 153666 153441 154094 155469 157096 158428 158964 158418 157080 155845 155431 155539 155200 153964
54317A53964j576j105l60J82L66P2o17j035m98P14J606J730J510J234O65j30m34
$$ 153964 152388 151283 150923 151105 151471 151543 150926 149891 149393 150107 151713 153443 154953 156187 156852 156722 156288
54300A56288J13Q54J069R84J174J463J252N91J56K23M20M28L30K10j8k90l85l31
$$ 156288 156401 157255 158324 159308 160482 161945 163197 163788 163944 164167 164587 165015 165345 165555 165537 165247 164862 164531
54282A64531l27k94P2O53Q67M16l20q66j183j338j150n12K21O21P40Q04O20k00
$$ 164531 164204 163910 163982 164635 165502 165918 165598 164732 163549 162211 161061 160549 160770 161391 162131 162935 163555 163355
54264A63355j368j928j325j06P97J079J054R14N65J05r3K7J2l84p12m73Lp9p45
$$ 163355 161987 160059 158734 158628 159425 160504 161558 162472 163037 163142 163049 163076 163088 162704 161992 161519 161522 161443 160698
54245A60698j061l72P27J109N11l05o96q67j308j867j905j261n87m99p20m77L65
$$ 160698 159637 159265 159992 161101 161612 161307 160611 159744 158436 156569 154664 153403 152816 152317 151597 151120 151485
54228A51485J055R37K42l50n84o78p95q54p68m70J29Q82J294J119Q71J166J686
$$ 151485 152540 153477 153719 153369 152785 152107 151312 150458 149690 149220 149349 150231 151525 152644 153515 154681 156367
54211A56367J464K58j098j814j968j927j694j251r58j017j011m81L37Q93J105
$$ 156367 157831 158089 156991 155177 153209 151282 149588 148337 147379 146362 145351 144870 145207 146100 147205
54196A47205J227J211P85R4l10j08N37J320J995K289J969J080n0j010j397j036
$$ 147205 148432 149643 150428 150522 150212 150104 150641 151961 153956 156245 158214 159294 159244 158234 156837 155801
54180A55801l04L4l19q08p87l97k61n37q03o82k11L22N30J51n04o15J46J070J301
$$ 155801 155497 155531 155212 154404 153617 153220 152959 152422 151619 150937 150726 151048 151578 151729 151225 150610 150756 151826 153127
54161A53127R33N66K18m21r78p64m7J27l90n47J93Q68M17p54j424j152m61J26
$$ 153127 154060 154626 154844 154423 153445 152681 152634 152761 152371 151824 152017 152885 153302 152548 151124 149972 149511 149637
54143A49637N04O30M47J29p5j54k25k67k13q0J86O65J089R67L81J75Q18J607J586
$$ 149637 150141 150771 151218 151347 151272 151118 150893 150626 150413 150333 150519 151184 152273 153240 153621 153796 154614 156221 157807
54124A57807Q83L38J36l19j134j523r34Q3O34N82M28L91K22j30k30K37Q46Q54
$$ 157807 158690 159028 159164 158845 157711 156188 155254 155337 155971 156553 156981 157372 157594 157464 157234 157471 158317 159171
54106A59171J52n45o17l30l15n28l41L66Q67O19M6j17K01N79Q19Q47L04j003k289
$$ 159171 159323 158778 158161 157831 157516 156988 156647 157013 157880 158499 158545 158428 158629 159208 160027 160874 161178 160175 157886
54087A57886k328r23P16J379J071O47O58R80J218J065M93j38k92J33N66M10j59
$$ 157886 155558 154635 155351 156730 157801 158448 159106 160086 161304 162369 162862 162724 162432 162565 163131 163541 163382
54070A63382l39L22J336J756J193K19k69j9L68K52k34m53j42L39O38Q14R89R75
$$ 163382 163043 163365 164701 166457 167650 167869 167600 167581 167949 168201 167967 167514 167372 167711 168349 169163 170152 171127
54052A71127O56L75N26R02R20N23L27P07J209J197Q06P41J214J640J567J410J831
$$ 171127 171783 172158 172684 173586 174506 175029 175356 176063 177272 178469 179275 180016 181230 182870 184437 185847 187678
54035A87678K692L180K909K379K210K463K981L850M975N644N236M297M093M941
$$ 187678 190370 193550 196459 198838 201048 203511 206492 210342 215317 220961 226197 230494 234587 239528
54021B39528N661N138L752K767K631K667K275J696J425J416J252P45R2m40p26
$$ 239528 245189 250327 254079 256846 259477 262144 264419 266115 267540 268956 270208 270953 271045 270605 269879
54006B69879p79p43q17j066j425j929k734l770m566m656m080l257k512j929j537
$$ 269879 269100 268357 267540 266474 265049 263120 260386 256616 252050 247394 243314 240057 237545 235616 234079
53991B34079j348j251j193j374j952k554k539j876j348j570k177k311j709r28
$$ 234079 232731 231480 230287 228913 226961 224407 221868 219992 218644 217074 214897 212586 210877 209949
53977B09949n67o97j066j451j740j812j621j265q91n49j86K56P17J029J076R34
$$ 209949 209382 208685 207619 206168 204428 202616 200995 199730 198839 198290 198104 198360 199077 200106 201182 202116
53961B02116P59N65K17k62o04n61j21N54J263J733J809J789K191K966L312K685
$$ 202116 202875 203440 203657 203395 202791 202230 202109 202663 203926 205659 207468 209257 211448 214414 217726 220411
53945B20411J640J152J345J556J506J684K447L414M059M367M577M663M469M141
$$ 220411 222051 223203 224548 226104 227610 229294 231741 235155 239214 243581 248158 252821 257290 261431
53931B61431M073M517N436O538P411P816P989Q356Q938R368R600J0069J0875J1253
$$ 261431 265504 270021 275457 281995 289406 297222 305211 313567 322505 331873 341473 351542 362417 373670
53917C73670J0268P762M314N65k956n633o941o849n722l960k010m99J25J58L98
$$ 373670 383938 391700 396014 396579 393623 387990 381049 374200 368478 364518 362508 362009 362134 362292 362690
53902C62690J253K329K962K930K482J890J133Q8j088j895j986j641j471j717k135
$$ 362690 363943 366272 369234 372164 374646 376536 377669 377757 376669 374774 372788 371147 369676 367959 365824
53887C65824k576l168l833m157m116m337n146n881n780n225n188n725n881n182
$$ 365824 363248 360080 356247 352090 347974 343637 338491 332610 326830 321605 316417 310692 304811 299629
53873B99629m349m137m256l920k999k082j600j455j440j596k062k806l587m150
$$ 299629 295280 291143 286887 282967 279968 277886 276286 274831 273391 271795 269733 266927 263340 259190
53859B59190m348m170l704l127k667k419k211j830j392j233j353j329r96p81j015
$$ 259190 254842 250672 246968 243841 241174 238755 236544 234714 233322 232089 230736 229407 228411 227630 226615
53844B26615j348j281r94r93j233j278j163j311j574j265l03M81M92J34l5j66
$$ 226615 225267 223986 222992 221999 220766 219488 218325 217014 215440 214175 213872 214353 214845 214979 214944 214778
53828B14778n82r48p18rN45N71R2p86j732k004j213q5K15m36j057r95o22l91m8
$$ 214778 214196 213248 212530 212521 213066 213637 213729 212943 211211 209207 207994 207909 208124 207688 206631 205636 205014 204623 204575
53809B04575P43J500J487Q45M65P79J333J664J973K561L088K975K324J922K275
$$ 204575 205318 206818 208305 209150 209615 210394 211727 213391 215364 217925 221013 223988 226312 228234 230509
53794B30509L082L836M482N187N770N799N227M508M000L575K953K244J846J875
$$ 230509 233591 237427 241909 247096 252866 258665 263892 268400 272400 275975 278928 281172 283018 284893
53780B84893J889J395N19qK68Q67R22K32n84j093j583k359l012l022k651k631
$$ 284893 286782 288177 288696 288688 288956 289823 290745 290977 290393 289300 287717 285358 282346 279324 276673 274042
53764B74042l062l345l156k851k836l075l388l645l583k993k225j923k005j642
$$ 274042 270980 267635 264479 261628 258792 255717 252329 248684 245101 242108 239883 237960 235955 234313
53750B34313n88K15j12j075j505j178q62r19o92N17K462M243N284N707N938O135
$$ 234313 233725 233940 233828 232753 231248 230070 229208 228289 227597 228114 230576 234819 240103 245810 251748 257883
53734B57883O053N394M196K679Q42j449l830n449n851n559n317n132m512l427
$$ 257883 263936 269330 273526 276205 277047 275598 271768 266319 260468 254909 249592 244460 239948 236521
53720B36521k408j756j263q00o52r93j385j184l43M62N24p3m45J67J409K064J410
$$ 236521 234113 232357 231094 230294 229642 228649 227264 226080 225737 226199 226723 226650 226205 226372 227781 229845 231255
53703B31255J58l38L91J537K084J872J508J551J953K189J861J188Q53J253K001
$$ 231255 231413 231075 231466 233003 235087 236959 238467 240018 241971 244160 246021 247209 248062 249315 251316
53688B51316K358J991J158K61m75r22r78o40m1O66J347J931K398K672K491J599
$$ 251316 253674 255665 256823 257084 256609 255687 254709 254069 254028 254694 256041 257972 260370 263042 265533 267132
53672B67132K13j010j678k062k562l009k905k120j017m9M35K22n01j051q50j29
$$ 267132 267345 266335 264657 262595 260033 257024 254119 251999 250982 250933 251368 251590 251089 250038 249188 249059
53656B49059L46J42m68r33r06m49n6k16o97o25L17J235J150L84m7M3O2J5N76J705
$$ 249059 249405 249547 249079 248146 247240 246791 246735 246519 245822 245197 245514 246749 247899 248283 248236 248279 248341 248356 248932 250637
53636B50637K405K263K100K591L242L450L598M220M786M409L214K070J240L41
$$ 250637 253042 255305 257405 259996 263238 266688 270286 274506 279292 283701 286915 288985 290225 290566
53622B90566o26j134j070r30r31o69J07R51J282J119R73J276J985K581K502J786
$$ 290566 289940 288806 287736 286806 285875 285206 285313 286264 287546 288665 289638 290914 292899 295480 297982 299768
53606B99768J162J222J615J543R37N99J018J638J585Q18J09Q6N81R27P21J42l91
$$ 299768 300930 302152 303767 305310 306247 306846 307864 309502 311087 311905 312014 312100 312681 313608 314329 314471 314080
53589C14080p63j197j802k281k311k032j871j994k125j944j465r95q33r97j176
$$ 314080 313317 312120 310318 308037 305726 303694 301823 299829 297704 295760 294295 293300 292467 291470 290294
53574B90294j058p40o65j015j375j246p35m25n89q67p95l99j45l50p79q37k43
$$ 290294 289236 288496 287831 286816 285441 284195 283460 283035 282446 281579 280784 280385 280240 279890 279111 278274 278031
53557B78031O31J176J229J098J016R62J074J672K609L113K761K188K233K785L090
$$ 278031 278662 279838 281067 282165 283181 284143 285217 286889 289498 292611 295372 297560 299793 302578 305668
53542C05668K992L057L506L803L592L337L655M415M940M926M741M930N610O425
$$ 305668 308660 311717 315223 319026 322618 325955 329610 334025 338965 343891 348632 353562 359172 365597
53528C65597P056P701Q831J0366J1410J1264J0478J0336J1307J2586J3289J3519
$$ 365597 372653 380354 389185 399551 410961 422225 432703 443039 454346 466932 480221 493740
53516D93740J3948J4819J5814J6657J7430J8340J9441K0620K1700K2613K3347
$$ 493740 507688 522507 538321 554978 572408 590748 610189 630809 652509 675122 698469
53505F98469K3737K3402K2204K0698J9727J9530J9579J9352J8890J8555J8530
$$ 698469 722206 745608 767812 788510 808237 827767 847346 866698 885588 904143 922673
53494I22673J8740J8948J8845J8331J7821J7830J8232J8385J8108J7954J8216
$$ 922673 941413 960361 979206 997537 1015358 1033188 1051420 1069805 1087913 1105867 1124083
53483A124083J8265J7365J5767J4388J3673J3233J2514J1366R895Q199O217L796
$$ 1124083 1142348 1159713 1175480 1189868 1203541 1216774 1229288 1240654 1250549 1258748 1264965 1268761
53471A268761Q82k227n001p158q821j0176j1321j2551j4310j6545j8514j9602
$$ 1268761 1269643 1267416 1262415 1255257 1246436 1236260 1224939 1212388 1198078 1181533 1163019 1143417
53459A143417j9943j9958j9771j9526j9746k0747k1995k2740k3023k3316k3418
$$ 1143417 1123474 1103516 1083745 1064219 1044473 1023726 1001731 978991 955968 932652 909234
53448I09234k2589k0765j8803j7406j6437j5513j4646j4024j3621j3232j2588
$$ 909234 886645 865880 847077 829671 813234 797721 783075 769051 755430 742198 729610
53437G29610j1407r665p834o363m988l081o67J548L123M239N144N999P327R585
$$ 729610 718203 708538 700704 694341 689353 686272 685605 687153 690276 694515 699659 705658 712985 722570
53423G22570J2137J3659J4034J4725J6640J8749J9699J9911K0766K2397K3695
$$ 722570 734707 748366 762400 777125 793765 812514 832213 852124 872890 895287 918982
53412I18982K4265K4965K6468K8456L0459L2446L4265L5504L6315L7566L9700
$$ 918982 943247 968212 994680 1023136 1053595 1086041 1120306 1155810 1192125 1229691 1269391
53401A269391M2140M4228M6115M8144N0060N1440N2438N3363N3910N3490N2177
$$ 1269391 1311531 1355759 1401874 1450018 1500078 1551518 1603956 1657319 1711229 1764719 1816896
53390A816896N0725M9677M8977M8413M7908M7296M6182M4265M1555L8281L4791
$$ 1816896 1867621 1917298 1966275 2014688 2062596 2109892 2156074 2200339 2241894 2280175 2314966
53379B314966L1450K8327K4946K0620J5272R778N232J841j375n620j1036j6517
$$ 2314966 2346416 2374743 2399689 2420309 2435581 2445359 2450591 2452432 2451057 2445437 2434401 2417884
53367B417884k0964k4568k8547l3638l9293m4471m8756n2373n5499n8020n9829
$$ 2417884 2396920 2372352 2343805 2310167 2270874 2226403 2177647 2125274 2069775 2011755 1951926
53356A951926o0973o1501o1388o0614n9116n6843n4069n1435m9402m7828m6353
$$ 1951926 1890953 1829452 1768064 1707450 1648334 1591491 1537422 1485987 1436585 1388757 1342404
53345A342404m5000m4045m3437m2825m2015m0923l9220l6602l3422l0545k8454
$$ 1342404 1297404 1253359 1209922 1167097 1125082 1084159 1044939 1008337 974915 944370 915916
53334I15916k6876k5386k3829k2046j9803j7266j5006j3304j1817j0250q832p713
$$ 915916 889040 863654 839825 817779 797976 780710 765704 752400 740583 730333 721501 713788
53322G13788o457m621k565j046k90J07N79J404K835M751O350O890O793P322R057
$$ 713788 707331 702710 700145 699099 698809 698916 699495 700899 703734 708485 714835 721725 728518 735840 744897
53307G44897J1240J2879J3962J5242J7206J9577K1597K2619K2650K2481K3036
$$ 744897 756137 769016 782978 798220 815426 835003 856600 879219 901869 924350 947386
53296I47386K4447K6039K7261K8237K9206K9869K9736K8893K7934K7224K6552
$$ 947386 971833 997872 1025133 1053370 1082576 1112445 1142181 1171074 1199008 1226232 1252784
53285A252784K5501K3890K1840J9573J7179J4523J1442Q089M878J993q01l660
$$ 1252784 1278285 1302175 1324015 1343588 1360767 1375290 1386732 1394821 1399699 1401692 1400891 1397231
53273A397231o273q292j0013j2124j4799j7402j9230k0281k1111k2150k3401k4684
$$ 1397231 1390958 1382666 1372653 1360529 1345730 1328328 1309098 1288817 1267706 1245556 1222155 1197471
53261A197471k5934k7187k8365k9269k9799l0078l0320l0595l0951l1561l2453
$$ 1197471 1171537 1144350 1115985 1086716 1056917 1026839 996519 965924 934973 903412 870959
53250H70959l3039l2480l0728k8802k7602k6755k5282k3182k1578k1170k1290
$$ 870959 837920 805440 774712 745910 718308 691553 666271 643089 621511 600341 579051
53239E79051k0908j9981j9178j8670j7937j6663j5242j4158j3341j2410j1202
$$ 579051 558143 538162 518984 500314 482377 465714 450472 436314 422973 410563 399361
53228C99361r869q621p652p101o841o398n408m212l613m027m983n656n671n277
$$ 399361 389492 380871 373219 366118 359277 352879 347471 343259 339646 335619 330636 324980 319309 314032
53214C14032m874m674m723n040n539n940n894n204l993k687j754j386j425j636
$$ 314032 309158 304484 299761 294721 289182 283242 277348 272144 268151 265464 263710 262324 260899 259263
53200B59263j945k296k455k225j828j721j968k132j863j339q88n72l00j47k15
$$ 259263 257318 255022 252567 250342 248514 246793 244825 242693 240830 239491 238603 238031 237731 237584 237369
53185B37369m02o00r05j294j338o93K18N97L05KQ2J31l10q96r49m12J82N36Q47
$$ 237369 236967 236367 235462 234168 232830 232137 232355 232952 233257 233259 233341 233472 233162 232266 231317 230905 231087 231623 232470
53166B32470J183J140M24n21q54l33L62M04k08p11n68o1K15J55P9P9m5k35p9N21
$$ 232470 233653 234793 235217 234696 233842 233509 233871 234275 234067 233356 232788 232727 232942 233097 233176 233255 233210 232975 232896 233417
53146B33417R56O11l23j030r57k93L76O33M74K41K47M20M36K60K78O81J001O37
$$ 233417 234373 234984 234661 233631 232674 232381 232757 233390 233864 234105 234352 234772 235208 235468 235746 236427 237428 238065
53128B38065l18j135j321j087q85q36p13l68j9k05j236k621l236k405p48M01M55
$$ 238065 237747 236612 235291 234204 233319 232483 231770 231402 231383 231178 229942 227321 224085 221680 220932 221333 221788
53111B21788L1lM44P75M89l73j378k061k249k092j754j136j26Q97J209N04o89
$$ 221788 221819 221816 222260 223035 223524 223151 221773 219712 217463 215371 213617 212481 212355 213252 214461 214965 214276
53094B14276j493j426o93J9m9j064k197k243r16P44J517J266P48M77K31l63j210
$$ 214276 212783 211357 210664 210683 210634 209570 207373 205130 204214 204958 206475 207741 208489 208966 209197 208834 207624
53077B07624j803j701r30o4K11k37p88p61j62M02L95k23j098j691j579q70k77
$$ 207624 205821 204120 203190 203126 203337 203100 202312 201551 201389 201791 202186 201963 200865 199174 197595 196725 196448
53060A96448l95r38j086n40J10J70l35q20q41m69j02np8m2J33J59p4j81K24Q91
$$ 196448 196053 195115 194029 193489 193599 193769 193434 192614 191773 191304 191202 191197 191119 191077 191210 191369 191295 191114 191338 192229
53040A92229J252J221J232J432J438J017N03K50J01k16n41n39k89j37j21P3N56
$$ 192229 193481 194702 195934 197366 198804 199821 200324 200574 200675 200459 199918 199379 199090 198953 198832 198905 199461
53023A99461R90R65M88nl2M79J066J122M64n14j302j695j777j651j295o38K87
$$ 199461 200451 201416 201904 201899 201867 202346 203412 204534 204998 204484 203182 201487 199710 198059 196764 196126 196413
53006A96413J130J280N14m96p68k83j11r50k024k029q76J33r9j254k119j942r93
$$ 196413 197543 198823 199337 198841 198073 197790 197679 196729 194705 192676 191800 191933 191834 190580 188461 186519 185526
52989A85526k2O02J039J421J421P18k64o29j04N84P46N69N55O36M24k1l60n88
$$ 185526 185504 186106 187145 188566 189987 190705 190441 189812 189708 190292 191038 191607 192162 192798 193222 193201 192841 192253
52971A92253q63r35m64J90L24l4j81J44N33Q84J608K540K699J678M69J52M22K56
$$ 192253 191390 190455 189991 190181 190505 190471 190290 190434 190967 191851 193459 195999 198698 200376 200845 200997 201419 201675
52953B01675m31p86m27qk34j033j804k003j373p2J219J652Q80o76k147k773k334
$$ 201675 201244 200458 200031 200023 199789 198756 196952 194949 193576 193504 194723 196375 197255 196579 194432 191659 189325
52936A89325j326o05n48p23n69j69M0J8Q5K71K27j65n76o98n19r5M30N99k5j123
$$ 189325 187999 187394 186846 186123 185554 185385 185425 185443 185528 185799 186026 185861 185285 184587 184068 183973 184403 185002 184977 183854
52916A83854j702j238k87L21M93O49Q34O67J11k84m7O05J011P88J71k78k22J43
$$ 183854 182152 180914 180627 180948 181441 182090 182924 183591 183702 183418 183371 183976 184987 185775 185946 185668 185446 185589
52898A85589K99l3n86q49o33k61j36k76l72k43K0L59Q89J526J729J071K4l70J57
$$ 185589 185888 185855 185269 184420 183787 183526 183390 183114 182742 182499 182519 182878 183767 185293 187022 188093 188117 187747 187904
52879A87904O91L86l53n41j13P8l29o40k76K87K29m01q02m79L31J085J351R04
$$ 187904 188595 188981 188628 188087 187974 188052 187723 187083 186807 187094 187323 186922 186120 185641 185972 187057 188408 189312
52861A89312l9p56n87L10J193J652J900K089J952J382Q84R71J385J458J006M30
$$ 189312 189273 188517 187930 188240 189433 191085 192985 195074 197026 198408 199292 200263 201648 203106 204112 204542
52845B04542q3p47j467j560o60N02P69j21j371k178k464k509k424k275k290k514
$$ 204542 204459 203712 202245 200685 200025 200527 201296 201175 199804 197626 195162 192653 190229 187954 185664 183150
52829A83150k491j728m43N21O38L08L63J105J987K192J501M82j32j83q2k13m82
$$ 183150 180659 178931 178488 179009 179647 179955 180318 181423 183410 185602 187103 187585 187453 187270 187188 186975 186493
52812A86493n70l40P3M38N63M18K47M32J139K164L218M130M685M513L398J575
$$ 186493 185923 185583 185656 186094 186657 187075 187322 187754 188893 191057 194275 198405 203090 207603 211001 212576
52796B12576m33k154l304l862m123m383m418l685k329j370j466j913j600o28j30
$$ 212576 212143 209989 206685 202823 198700 194317 189899 186214 183885 182515 181049 179136 177536 176908 176778
52781A76778o07j334j465r63j82O68J276J177M44n9L23J153J507J112M72N1j09
$$ 176778 176171 174837 173372 172409 172227 172895 174171 175348 175792 175733 176056 177209 178716 179828 180300 180351 180242
52764A80242j16k7Q1J55K30K49Qn35j021j044o26j20J73J37j60l84j19N36Q53
$$ 180242 180126 180099 180180 180335 180565 180814 180822 180287 179266 178222 177596 177476 177649 177786 177626 177242 177123 177659 178512
52745A78512L36m77n83K08J076J287J014R04J162J460J519J443J388J178N25l24
$$ 178512 178848 178371 177788 177996 179072 180359 181373 182277 183439 184899 186418 187861 189249 190427 190952 190628
52729A90628n25M31J892K605K155J378J153J299J071L66j64r0K26J26n99j579
$$ 190628 190103 190534 192426 195031 197186 198564 199717 201016 202087 202453 202289 202199 202425 202551 201952 200373
52713B00373k289k491k352k144j899j509j091r35j019r83p38o79r90j179p58m2
$$ 200373 198084 195593 193241 191097 189198 187689 186598 185663 184644 183661 182923 182244 181254 180075 179317 179275
52697A79275K55l0m57o77o39l07K76O99N25j8k30J44O16O58K68j62k54J44Q25
$$ 179275 179530 179500 179043 178366 177727 177420 177696 178395 178920 178902 178672 178816 179432 180090 180358 180196 179942 180086 180911
52678A80911J261J141P72O88R53J237J400J492J342P28m2l78k03L0J35L55O57
$$ 180911 182172 183313 184085 184773 185726 186963 188363 189855 191197 191925 191883 191505 191302 191332 191467 191822 192479
52661A92479O10J61j33L0K84L37M83R33J259R53K30k44n2Q16K117L321L835L634
$$ 192479 193089 193250 193117 193147 193431 193768 194251 195184 196443 197396 197626 197382 197330 198146 200263 203584 207419 211053
52643B11053L275K996K255O11j476l152m075m341m002l241k562k203j687o51L33
$$ 211053 214328 217324 219579 220190 218714 215562 211487 207146 203144 199903 197341 195138 193451 192800 193133
52628A93133M55q2l24J40R36J772K632L122K591J199k1m55o24j164j788j795j165
$$ 193133 193588 193506 193182 193322 194258 196030 198662 201784 204375 205574 205553 205098 204474 203310 201522 199727 198562
52611A98562n65m27n29m70k40k05o35j313j627j261o09l15m45m73p6M52P04P02
$$ 198562 197997 197570 197041 196571 196331 196126 195491 194178 192551 191290 190681 190366 189921 189448 189372 189824 190528 191230
52593A91230P16Q23Q70P78O40O35Q56J208J451J442J217P72k8j008j460q03N30
$$ 191230 191946 192769 193639 194417 195057 195692 196548 197756 199207 200649 201866 202638 202610 201602 200142 199339 199869
52576A99869J423J317O82J97m0k33l33j91Rj23o72j202j100j21J250K058J757
$$ 199869 201292 202609 203291 203488 203448 203215 202882 202691 202700 202577 201905 200703 199603 199482 200732 202790 204547
52559B04547P21l12j089j673j747q71M68R67R4j142j455p67P0M32K34m35j233
$$ 204547 205268 204956 203867 202194 200447 199576 200044 201011 201105 199963 198508 197741 197811 198243 198477 198042 196809
52542A96809j460p49L02Q04O99O29Q75J099J033P50K82l69q20o13M1M03K61J54
$$ 196809 195349 194600 194902 195706 196405 197034 197909 199008 200041 200791 201073 200704 199884 199271 199312 199715 199976 200130
52524B00130L96N95M52M13R90J949K596K600K144J581J267J395J686J520P51N4
$$ 200130 200526 201121 201573 201986 202976 204925 207521 210121 212265 213846 215113 216508 218194 219714 220465 220519
52508B20519J13P41J265J458J616J891K121K196K083J585N44p03j599k082k522
$$ 220519 220632 221373 222638 224096 225712 227603 229724 231920 234003 235588 236132 235429 233830 231748 229226
52493B29226k926k802k031j271j074j061n27M09Q09J23j086j785j545q03k20j8
$$ 229226 226300 223498 221467 220196 219122 218061 217534 217943 218752 218875 217789 216004 214459 213656 213436 213418
52477B13418J18N89J445K307K679K376J710J216J163J329J361J273J395J820K197
$$ 213418 213536 214125 215570 217877 220556 222932 224642 225858 227021 228350 229711 230984 232379 234199 236396
52462B36396K234K091K090K247K426K675L027L061K241O52j044k411l488m188
$$ 236396 238630 240721 242811 245058 247484 250159 253186 256247 258488 259140 258096 255685 252197 248009
52448B48009m124l380k776k918l365l289k629j965j574j233q77p60q76q40n02
$$ 248009 243885 240505 237729 234811 231446 228157 225528 223563 221989 220756 219879 219119 218243 217403 216901
52433B16901k21l34p33j083j153q51k54L06M80L27R7l02j135k031k041q14Q07
$$ 216901 216680 216346 215613 214530 213377 212526 212272 212578 213058 213385 213482 213180 212045 210014 207973 207159 207966
52416B07966J778J970J836J504Q35P5k53o6K38M75Q21J357J892K366K933L642
$$ 207966 209744 211714 213550 215054 215889 215964 215711 215645 215883 216358 217179 218536 220428 222794 225727 229369
52400B29369M398N298O483P620P988P283N929M354K469Q8k402m305n256n361m858
$$ 229369 233767 239065 245548 253168 261156 268439 274368 278722 281191 281279 278877 274572 269316 263955 259097
52385B59097m002l128k455j872j180m58J5J63J83K43L50M99P10Q78Q59P81J021
$$ 259097 255095 251967 249512 247640 246460 246002 246017 246180 246363 246606 246956 247455 248165 249043 249902 250683 251704
52368B51704J724K491K777K505K121J993K010J792J178L43n04j294j993k512k819
$$ 251704 253428 255919 258696 261201 263322 265315 267325 269117 270295 270638 270134 268840 266847 264335 261516
52353B61516k966k875k325j344m81l10p03q95l93M22P99N38J78K97Q46J246J086
$$ 261516 258550 255675 253350 252006 251525 251215 250512 249617 249224 249646 250445 250983 251161 251458 252304 253550 254636
52336B54636O33N38J102J967K583K767K673K446K210K271K907L938M834N346N709
$$ 254636 255269 255807 256909 258876 261459 264226 266899 269345 271555 273826 276733 280671 285505 290851 296560
52321B96560O169O557O580O191N540M721L833L070K579K367K358K414K192J387
$$ 296560 302729 309286 315866 322057 327597 332318 336151 339221 341800 344167 346525 348939 351131 352518
52307C52518K70l91k06L50P29J145K114L360L892L285K299J976K533L389L965
$$ 352518 352788 352397 352191 352541 353270 354415 356529 359889 363781 367066 369365 371341 373874 377263 381228
52292C81228M067L690K798J476J02q60j243j364j686k324k976l299l147k484j317
$$ 381228 385295 388985 391783 393259 393361 392501 391258 389894 388208 385884 382908 379609 376462 373978 372661
52277C72661Q7J237J895K267K488K280J505Q09J074K291L506L970L822L504L126
$$ 372661 372748 373985 375880 378147 380635 382915 384420 385229 386303 388594 392100 396070 399892 403396 406522
52262D06522K665K416K663L188L535L660L940M519M968M792M057L368L191L418
$$ 406522 409187 411603 414266 417454 420989 424649 428589 433108 438076 442868 446925 450293 453484 456902
52248D56902L625L650L674L767L661L152K408J670Q83K4m55o7Q94J524J384R46
$$ 456902 460527 464177 467851 471618 475279 478431 480839 482509 483392 483416 482961 482894 483788 485312 486696 487642
52232D87642Q37J099J441J804K346L096L889M450M479L934L299L230L715M018
$$ 487642 488479 489578 491019 492823 495169 498265 502154 506604 511083 515017 518316 521546 525261 529279
52218E29279L656K981K530K282J995J893K381L305M081M463M660M766M600M175
$$ 529279 532935 535916 538446 540728 542723 544616 546997 550302 554383 558846 563506 568272 572872 577047
52204E77047L859L936M330M791N114N107M677M021L522L401L593L885L923L359
$$ 577047 580906 584842 589172 593963 599077 604184 608861 612882 616404 619805 623398 627283 631206 634565
52190F34565K311J547J770K727L505L678L697L996M254L868K797J614Q10L23l36
$$ 634565 636876 638423 640193 642920 646425 650103 653800 657796 662050 665918 668715 670329 671139 671462 671126
52175F71126j523k999m060m334m323m792n687o119n568m527l714l100k166q60
$$ 671126 669603 666604 662544 658210 653887 649095 643408 637289 631721 627194 623480 620380 618214 617354
52161F17354K46O99O97Q08J374K224K872K936K466J771R80k1j192k060k131j477
$$ 617354 617600 618299 618996 619804 621178 623402 626274 629210 631676 633447 634427 634406 633214 631154 629023 627546
52145F27546o51j01J98N33J043J594J979K130K044J577N17r87k260k640k134j317
$$ 627546 626895 626794 626992 627525 628568 630162 632141 634271 636315 637892 638409 637422 635162 632522 630388 629071
52129F29071o43j80J00K09M03J122K531M397O507Q806J0961J2290J2462J1951
$$ 629071 628428 628248 628348 628557 628960 630082 632613 637010 643517 652323 663284 675574 688036 699987
52115F99987J1451J1131J0698R904Q616O703M286J972L75n41j396k672m261n563
$$ 699987 711438 722569 733267 743171 751787 758490 762776 764748 765123 764582 763186 760514 756253 750690
52101G50690n872m932l280j826q91L1J361K743L718M538N667O797P139O566N696
$$ 750690 744818 739886 736606 734780 733889 733920 735281 738024 741742 746280 751947 758744 765883 772449 778145
52086G78145M848L618J655p94l233n369o936p636p442o609n263l392j347J53P52
$$ 778145 782993 786611 788266 787472 784239 778870 771934 764298 756856 750247 744984 741592 740245 740398 741150
52071G41150P38M64l9o75j065j037q92q27n04L36J256J560J181O89N36O39O06
$$ 741150 741888 742352 742313 741638 740573 739536 738644 737817 737313 737649 738905 740465 741646 742335 742871 743510 744116
52054G44116J37o72j320j416j283j639k509k979k392j306p43r16j368j975k983
$$ 744116 744253 743581 742261 740845 739562 737923 735414 732435 730043 728737 727994 727078 725710 723735 720752
52039G20752m165m749m448l875l705l882l827l128j799k72Q28J245J567K676M516
$$ 720752 716587 711838 707390 703515 699810 695928 692101 688973 687174 686902 687730 688975 690542 693218 697734
52024F97734N880N822M876M404N055O337P539Q397Q805Q556P743P038P050P507
$$ 697734 703614 709436 714312 718716 723771 730108 737647 746044 754849 763405 771148 778186 785236 792743
52010G92743P594P057O546O649P019O817N758M212K444K93k323n104p845j0651
$$ 792743 800337 807394 813940 820589 827608 834425 840183 844395 846839 847132 844809 839705 831860 821209
51996H21209j3451j5703j7071j7976j8932j9617j9297j8074j6913j6339j5795
$$ 821209 807758 792055 774984 757008 738076 718459 699162 681088 664175 647836 632041
51985F32041j4615j3010j1551j0182q454o545n361n427o205o768o826o792p101
$$ 632041 617426 604416 592865 582683 574229 567684 562323 556896 550691 543923 537097 530305 523204
$$ [...]
##END NTUPLES=NMR SPECTRUM
##END=
