##TITLE=AC1502_INDRS13309_8125441_JUPnpALMwU
##JCAMPDX= 6.0         $$ Bruker NMR JCAMP-DX V2.0
##DATA TYPE= NMR SPECTRUM
##DATA CLASS= NTUPLES
##ORIGIN= BRUKER
##OWNER= Administrator
$$ 1.72 TOPSPIN		Version 2.1
$$ 2013-08-16 17:25:35.432 -0700  Administrator@X
$$ Compression mode = diff/dup
##.OBSERVE FREQUENCY= 400.02188249412
##.OBSERVE NUCLEUS= ^1H
##.ACQUISITION MODE= SIMULTANEOUS (DQD)
##.ACQUISITION SCHEME= undefined
##.AVERAGES= 8
##.DIGITISER RES= 22
##SPECTROMETER/DATA SYSTEM= spect
##.PULSE SEQUENCE= zg30
##.SOLVENT NAME= COFFEE_meoh
##.SHIFT REFERENCE= INTERNAL, COFFEE_meoh, 1, 14.98509
##AUDIT TRAIL= $$ (NUMBER, WHEN, WHO, WHERE, PROCESS, VERSION, WHAT)
$$ ##TITLE= Audit trail, TOPSPIN		Version 2.1
$$ ##JCAMPDX= 5.01
$$ ##ORIGIN= Bruker BioSpin GmbH
$$ ##OWNER= Administrator
$$ $$ E:\/data/COFFEE/nmr/AC1502_INDRS13309_8125441_JUPnpALMwU/20/pdata/1/auditp.txt
$$ ##AUDIT TRAIL=  $$ (NUMBER, WHEN, WHO, WHERE, PROCESS, VERSION, WHAT)
(   1,<2013-08-16 17:25:28.995 -0700>,<Administrator>,<X>,<go>,<TOPSPIN 2.1>,
      <created by zg
	started at 2013-08-16 17:24:22.714 -0700,
	POWCHK enabled, PULCHK disabled,
       configuration hash MD5:
       C8 4E 4E 5D D3 5C D8 9E 9F 52 82 E0 59 8A DE 15
       data hash MD5: 64K
       2C C5 80 F1 64 04 45 EB 18 C5 96 08 AA DF C2 69>)
(   2,<2013-08-16 17:25:31.823 -0700>,<Administrator>,<X>,<proc1d>,<TOPSPIN 2.1>,
      <Start of raw data processing
       efp LB = 0 FT_mod = 6 PKNL = 1 PHC0 = 0 PHC1 = 0 SI = 32K 
       data hash MD5: 32K
       94 6F 68 0E B7 21 DA 4E E7 46 55 C2 DC 89 04 FB>)
(   3,<2013-08-16 17:25:32.120 -0700>,<Administrator>,<X>,<proc1d>,<TOPSPIN 2.1>,
      <pk PHC0 = 97.3114 PHC1 = 0 
       data hash MD5: 32K
       B7 6E 44 D5 F2 CC FD 7F DD 6F D0 74 29 22 E8 5F>)
(   4,<2013-08-16 17:25:32.261 -0700>,<Administrator>,<X>,<proc1d>,<TOPSPIN 2.1>,
      <abs ABSG = 1 
       data hash MD5: 32K
       0B ED 4F D1 E0 B5 43 98 1E 4F 5E 62 32 9F 73 29>)
(   5,<2013-08-16 17:25:32.307 -0700>,<Administrator>,<X>,<proc1d>,<TOPSPIN 2.1>,
      <abs ABSG = 2 
       data hash MD5: 32K
       B3 40 9B D5 0B 9B F9 B0 95 33 FC C0 DC E9 30 5B>)
(   6,<2013-08-16 17:25:32.386 -0700>,<Administrator>,<X>,<proc1d>,<TOPSPIN 2.1>,
      <abs ABSG = 3 
       data hash MD5: 32K
       11 72 7C F3 BC 9A 24 9D A5 72 D6 35 D6 A3 09 AF>)
(   7,<2013-08-16 17:25:32.432 -0700>,<Administrator>,<X>,<proc1d>,<TOPSPIN 2.1>,
      <abs ABSG = 4 
       data hash MD5: 32K
       1F 18 C1 53 C0 E8 CE CB F6 4D 2D E3 C2 98 53 38>)
(   8,<2013-08-16 17:25:32.479 -0700>,<Administrator>,<X>,<proc1d>,<TOPSPIN 2.1>,
      <abs ABSG = 5 
       data hash MD5: 32K
       85 1D BC 80 F5 03 CF B9 D9 27 E2 94 10 57 EA A9>)
$$ ##END=
$$ 
$$ $$ hash MD5
$$ $$ 99 B7 B0 AC A7 D8 17 53 E9 BF F5 5B 4D E5 B0 E9
##$RELAX= 
##$RELAX= 
##$RELAX= 
##$RELAX= 
##$RELAX= 
##$RELAX= 
##$RELAX= 
$$ Bruker specific parameters
$$ --------------------------
##$DU= <E:\>
##$EXPNO= 20
##$NAME= <AC1502_INDRS13309_8125441_JUPnpALMwU>
$$ [...]
##$TP= (0..7)
150 150 150 150 150 150 150 150
##$TP07= 0
##$TPNAME0= <>
##$TPNAME1= <>
##$TPNAME2= <>
##$TPNAME3= <>
##$TPNAME4= <>
##$TPNAME5= <>
##$TPNAME6= <>
##$TPNAME7= <>
##$TPOAL= (0..7)
0.5 0.5 0.5 0.5 0.5 0.5 0.5 0.5
##$TPOFFS= (0..7)
0 0 0 0 0 0 0 0
##$TUNHIN= 0
##$TUNHOUT= 0
##$TUNXOUT= 0
##$USERA1= <user>
##$USERA2= <user>
##$USERA3= <user>
##$USERA4= <user>
##$USERA5= <user>
##$V9= 5
##$VALIST= <valist>
##$VCLIST= <CCCCCCCCCCCCCCC>
##$VD= 0
##$VDLIST= <DDDDDDDDDDDDDDD>
##$VPLIST= <PPPPPPPPPPPPPPP>
##$VTLIST= <TTTTTTTTTTTTTTT>
##$WBST= 2048
##$WBSW= 25
##$XGAIN= (0..3)
0 0 0 0
##$XL= 0
##$YL= 0
##$YMAX_a= 656941
##$YMIN_a= -560018
##$ZGOPTNS= <>
##$ZL1= 120
##$ZL2= 120
##$ZL3= 120
##$ZL4= 120
##$ABSF1= 14.98509
##$ABSF2= -5.573092
##$ABSG= 5
##$ABSL= 3
##$ALPHA= 0
##$AQORDER= 0
##$ASSFAC= 0
##$ASSFACI= 0
##$ASSFACX= 0
##$ASSWID= 0
##$AUNMP= <proc_prof1d_extract_pilot.lims>
##$AXLEFT= 0
##$AXNAME= <>
##$AXNUC= <1H>
##$AXRIGHT= 0
##$AXTYPE= 0
##$AXUNIT= <>
##$AZFE= 0.1
##$AZFW= 0.1
##$BCFW= 0
##$BC_mod= 0
##$BYTORDP= 0
##$COROFFS= 0
##$CY= 15
##$DATMOD= 1
##$DC= 0
##$DFILT= <>
##$DTYPP= 0
##$F1P= 0
##$F2P= 0
##$FCOR= 0.5
##$FTSIZE= 32768
##$FT_mod= 6
##$GAMMA= 0
##$GB= 0
##$INTBC= 1
##$INTSCL= 1
##$ISEN= 128
##$LB= 0
##$LEV0= 0
##$LPBIN= 0
##$MAXI= 10000
##$MC2= 0
##$MEAN= 0
##$ME_mod= 0
##$MI= 0
##$NCOEF= 0
##$NC_proc= -8
##$NLEV= 6
##$NOISF1= 0
##$NOISF2= 0
##$NSP= 0
##$NTH_PI= 0
##$NZP= 0
##$OFFSET= 14.98509
##$PC= 1
##$PHC0= 97.3114
##$PHC1= 0
##$PH_mod= 1
##$PKNL= yes
##$PPARMOD= 0
##$PPDIAG= 0
##$PPIPTYP= 0
##$PPMPNUM= 2147483647
##$PPRESOL= 1
##$PSCAL= 4
##$PSIGN= 0
##$PYNMP= <proc.py>
##$REVERSE= no
##$SF= 400.02
##$SI= 32768
##$SIGF1= 0
##$SIGF2= 0
##$SINO= 400
##$SIOLD= 32768
##$SPECTYP= <>
##$SREGLST= <1H.CDCl3>
##$SSB= 0
##$STSI= 32768
##$STSR= 0
##$SW_p= 8223.68421052631
##$SYMM= 0
##$S_DEV= 0
##$TDeff= 65536
##$TDoff= 0
##$TI= <>
##$TILT= no
##$TM1= 0
##$TM2= 0
##$TOPLEV= 0
##$USERP1= <user>
##$USERP2= <user>
##$USERP3= <user>
##$USERP4= <user>
##$USERP5= <user>
##$WDW= 1
##$XDIM= 32768
##$YMAX_p= 457936385
##$YMIN_p= -884555
##$CURPLOT= <Network HP LaserJet P1505>
##$CURPRIN= <$Network HP LaserJet P1505>
##$DFORMAT= <normdp>
##$LAYOUT= <+/1D_H.xwp>
##$LFORMAT= <normlp>
##$PFORMAT= <normpl>
##$SURQMSG= 1
$$ End of Bruker specific parameters
$$ ---------------------------------
##NTUPLES= NMR SPECTRUM
##VAR_NAME=  FREQUENCY,     SPECTRUM/REAL,   SPECTRUM/IMAG
##SYMBOL=    X,             R,               I
##VAR_TYPE=  INDEPENDENT,   DEPENDENT,       DEPENDENT
##VAR_FORM=  AFFN,          ASDF,            ASDF
##VAR_DIM=   32768,         32768,           32768
##UNITS=     HZ,            ARBITRARY UNITS, ARBITRARY UNITS
##FACTOR=    0.250966925370066, 1,           1
##FIRST=     8223.43324360094, 26801,        65282
##LAST=      0,             84959,           -276414
##MIN=       0,             -884555,         0
##MAX=       8223.43324360094, 457936385,    0
$$ Real data points
##PAGE= N=1
##DATA TABLE= (X++(R..R)), XYDATA
$$ [...]
19551F9631d6162k82108B29950b52027a06539B7676a19367e7080B14551K33857
19541D48408E8134a14896B1419c53834B72834B2186J21376b75779A36560b64333
19530A02410b09423h7730j09756A50691b95646I1608K6108l9005c67176a6425
19519d72108f96q3248B4623a54693l8903B1707c58236d3206k17444d1126B7904
19507a877n6616k1631l368b9649k0379a771B9934h5640j68571B27394c04811A27318
19494a59084a9854n2005A36019j98F3768J87929I3568b4988H5084O4250M2693
19483A92027b73358j17191G1609E229K17491b29730H7774q428c06414a10651L2060
19472g8591G738c88977H1293b3788k80610J29617A55168L04759A68419F5837a96
$$ y = [69631, -46162, -328270, 229950, -252027, -106539, 27676, -119367, -57080, 214551, 448408, 58134, -114896, 21419, -353834, 272834, 22186, 143562, -275779, 136560, -264333, 102410, -209423, -87730, -197486, 150691, -295646, 91608, 117716, 78711, -367176, -16425, -472108, -696, -83944, 24623, -154693, -193596, 21707, -358236, -43206, -260650, -41126, 27904, -1877, -58493, -80124, -83492, -29649, -50028, -1771, 29934, -85640, -254211, 227394, -304811, 127318, -159084, -19854, -71859, 136019, 135821, 63768, 251697, 93568, -24988, 85084, 149334, 192027, -273358, -390549, 71609, 5229, 222720, -229730, 87774, 79346, -306414, -110651, -78591, 7738, -388977, 81293, -23788, -304398, -174781, 155168, 459927, 168419, 65837, -196]
19460E9100R7873i087j62474k9325k2212C6923b22563A33306a87057Q1114l80143
19449d86086K22098j0233Q8557O1812l6874k03766J15533J01119A39038b2786
19438A59418f1036A38123D6486L46026b82727j1126A5601c2295m39q4411B26216
19426c063A34022e8716j33407B03643o5666i3427l6544c6605q354k73655B95275
19414d8638M5j22569L9415c4431k16739A06738B220a3505k30854b2493B7234a21715
19401b55201e2096F7403a7365o9667C0669A0495R1445b56511J5353j1453h2741
19389d6034P032B88778c36894a05072J4973A70h6312A14276f8742A38694j9350
19378A19344a8972j54957l7979C63369A54246d6493j11749B2048c50090C5814
$$ y = [59100, 156973, -9087, -171561, -200886, -223098, 36923, -222563, 133306, -187057, -105943, -486086, -263988, -274221, -185664, -123852, -160726, -364492, -248959, -147840, 139038, -22786, 159418, -61036, 138123, 46486, 392512, -282727, -293853, 15601, -32295, -32734, -117145, 226216, -3063, 134022, -58716, -192123, 203643, 137977, -93427, -129971, -36605, -44959, -318614, 295275, -48638, -48593, -171162, -131747, -34431, -251170, 106738, 2220, -13505, -244359, -22493, 27234, -121715, -255201, -52096, 67403, -17365, -87032, 30669, 10495, 101940, -256511, -241158, -252611, -82741, -46034, -39002, 288778, -336894, -105072, -90099, 170, -86312, 114276, -68742, 138694, 119344, -18972, -173929, -211908, 363369, 154246, -46493, -158242, 22048, -350090, 35814]
19367B9741K13371D8905a15j95536a8605j06083j02981I3002a26743A30000m9434
19356H0566d7065F760b36730C03552a98081A59943m5328p582c8903F5651b02281
19344h7512F6227f2032B60759c05783A61530F1360a72007M2299B10030c3725n1180
19333h4905m251k33924G1881b03456A11715a37898b091B20903c38066C89474a80757
19321D1697R4501g325k14056A33970B6623b38319c0165A19788b69115c0034B4772
19309E4031a29980D7432j4287K27944g3565B85809H2204a88318g9604j11286E687
19297A38155f3641H4499D995b85469J08604E467a62212C2135O0185a77322g1160
19285h2786B34913i9593C7680e10809B80730d6228A39947a03690G6854b18561
$$ y = [29741, 243112, 48905, -115, -195651, -18605, -124688, -227669, 93002, -126743, 130000, 80566, -47065, 6760, -236730, 303552, -198081, 159943, 114615, 107033, -38903, 65651, -202281, -87512, 66227, -62032, 260759, -305783, 161530, 61360, -172007, -129708, 210030, -33725, -84905, -89156, -323080, 71881, -203456, 111715, -137898, -2091, 220903, -338066, 389474, -180757, 41697, 136198, -7325, -221381, 133970, 26623, -238319, -30165, 119788, -269115, -30034, 24772, 54031, -129980, 47432, 33145, 261089, -73565, 285809, 82204, -188318, -79604, -190890, 5687, 138155, -63641, 84499, 4995, -285469, -176865, 5467, -162212, 32135, 92320, -177322, -71160, -82786, 234913, -99593, 37680, -510809, 280730, -46228, 139947, -103690, 76854, -218561]
19274a17175k05050a05384a6704l07399A2981h6074j02204j23485b6347B86322
19263a10132q3140B10998b07230O0253C1144b15502N8054j8891B33825a05681
19252a11468A24984a89363B17462a72054k05199b4056B63804I9442a75857O9100
19242a06757j5432j20509E2643j8414K34930a09683d0696j87481f4853j37054
19232b01907C66382G5421J78183b57573O959A42215h4065b849k44659d9514l9882
19221h9396E1571L2293a38328A44905J07227H9777J34554b44784A0058f0672H7727
19209b38465b3133j13320d1248r0383A46041b94923h8184H0761K35473H2402a82250
19197G096f1130q7348p3146I1434b61763g8231o6664n7681A76114B726a70179
$$ y = [-117175, -322225, -105384, -16704, -324103, 12981, -86074, -188278, -311763, -26347, 286322, -110132, -193272, 210998, -207230, -146977, 31144, -215502, -157448, -176339, 233825, -105681, -111468, 124984, -189363, 217462, -172054, -377253, -24056, 263804, 99442, -175857, -106757, -122189, -242698, 52643, 34229, 269159, -109683, -40696, -228177, -64853, -201907, 366382, 75421, 253604, -257573, -250614, 142215, -84065, -2849, -247508, -49514, -89396, 51571, 83864, -138328, 144905, 252132, 89777, 224331, -244784, 10058, -60672, 87727, -238465, -23133, -136453, -41248, -131631, 146041, -294923, -88184, 80761, 316234, 82402, -182250, 7096, -61130, -148478, -221624, 91434, -261763, -78231, -144895, -202576, 176114, 2726, -170179]
19185b23519D39947c19482a44226E9715b74996D3064c24426B8884J34102c63574
19174A02218P5368b59664A1685J91926b25283c2861H2887a45702K8728j73695
19164b90669E9725a68572j67132A33901n4797b96015a02659A40638a66692G2940
19153e6605j4898j55347l7026i4667I9678a03812j3869A65296a85692c0991j58362
19142a89353G8102J13717c35261A52045L6246E6589b6540j61301g5952L4200E4615
19130G1275a4401j5941j79479i1872j72941R5023l404J8091H9832b58124L5543
19119b22581A66385f6498A18632a78325Q7143L3750B24169h3103j49650f206C5481
19107C06306b15124h9510C76868j78227h9829k5822q6790G8475k8509N7748a12624
$$ y = [-223519, 439947, -319482, -144226, 59715, -274996, 43064, -324426, 28884, 162986, -363574, 102218, 177586, -259664, 11685, 203611, -225283, -32861, 82887, -145702, -116974, -290669, 59725, -168572, -335704, 133901, 79104, -296015, -102659, 140638, -166692, 72940, -56605, -71503, -226850, -263876, -94667, 99678, -103812, -117681, 165296, -185692, -30991, -189353, 78102, 191819, -335261, 152045, 188291, 56589, -26540, -187841, -75952, -41752, 54615, 71275, -14401, -30342, -209821, -91872, -264813, -169790, -173194, -155103, 89832, -258124, -222581, 166385, -66498, 118632, -178325, -91182, -57432, 224169, -83103, -232753, -6206, 35481, 306306, -215124, -89510, 376868, 198641, -89829, -115651, -202441, 78475, 49966, 107714, -112624]
19095a7425E1282a90163N5650B43955d2253A85447d133m62488c3402l27022a21436
19083a79476H0759a86686a1633I1605f4799k8086A67215g1606J3446E014a63665
19071b86278B7319a08489n7072E0028a45318A29828c81322A09151a59305C08692
19060B13584E3059a07731B20923i4406K2458p849p5939k76795F5256e2993j43502
19049a96495R6128j66965P4333G4138a44933l85640C35320d0022k69375n704g7453
19037a48900C7172b4377C28759b47463J14353j68425A80523D7057J4461b5695
19026a11507A13495l2462b1586l78121C8781a23414D2191a98654E572b7690B79442
19014b6963k5691l0395F2864J87117a21536j20839a14383j10784i5069l3084o3226
$$ y = [-17425, 51282, -190163, -134513, 243955, -42253, 185447, -4133, -466621, -33402, -360424, -121436, -179476, 80759, -186686, -11633, 91605, -64799, -92885, 167215, -71606, -58160, 5014, -163665, -286278, 27319, -108489, -165561, 50028, -145318, 129828, -381322, 109151, -159305, 308692, 213584, 53059, -107731, 220923, -94406, -71948, -79797, -155736, -432531, 65256, -52993, -196495, -100367, -267332, -192999, 74138, -144933, -530573, 335320, -40022, -309397, -315101, -77453, -148900, 37172, -24377, 328759, -247463, -133110, -301535, 180523, 47057, 61518, -25695, -111507, 113495, 81033, -21586, -399707, 38781, -123414, 42191, -198654, 5572, -27690, 279442, -26963, -52654, -83049, 62864, 249981, -121536, -242375, -114383, -225167, -95069, -128153, -191379]
19003a91379A44087J47036h3585k7046A23461l6366b71372j67545A46629a66413
18992a10747j63253A54694l6826f5101K6007j32249r7055J23278c3688j10299
18982a43987A92108a568A2947b8623C0308a54115G9391J36957a61565A68932a56767
18970e4761A05275b91142B25452a48592M650I717J23784c3843o7707n4617F2770
18958B10429o8063c68523J55903f5048j94268B4483b41503M2101A41690g9185
18947B877c8556A30033g5377j11812E116c19900c9971B74509a21532j65325B43422
18935a81290C31100A52033a0857m6957j05664D2834R8434b14106c4715H9860J49958
18924B39818q3974m2223b44098a9224j76061L4431B39810h6580O387A02345R3373
$$ y = [-191379, 144087, 291123, -83585, -110631, 123461, 87095, -271372, -438917, 146629, -166413, -110747, -274000, 154694, 117868, -65101, -39094, -171343, -268398, -145120, -33688, -143987, 192108, -1568, 12947, -28623, 30308, -154115, 79391, 216348, -161565, 168932, -156767, -54761, 105275, -291142, 225452, -148592, -143942, 9717, 133501, -33843, -101550, -156167, 62770, 210429, 142366, -368523, -212620, -65048, -259316, 24483, -241503, -199402, 141690, -79185, 2877, -38556, 130033, -75377, -187189, 5116, -319900, -39971, 274509, -121532, -286857, 243422, -181290, 331100, 152033, -10857, -57814, -163478, 42834, 141268, -214106, -34715, 89860, 239818, 155844, 113621, -244098, -19224, -195285, -160854, 239810, -86580, -80193, 102345, 195718]
18913A95718b3044B78098b41802o7103c0301k13283E0292h8630j20566K7828a5205
18901a52552k90947e733I8733m2969M6940A2856h9639n2818K9125n7280A1478
18889B4666b96183A05337b98987a4663I2858J72437E8241f2289k60181I2419b62971
18877F3615L8719Q3082g6655B44325p1349a70960e7243k6724j15468f1466j05410
18866a66876B22842a06920k08258h7398j28994c3180k27529A04026J09294h84555
18855A76195a08707j31747i6107H6170a77289F9279a63456g3076j11892A79463
18844A9742g2809A32632c60064D070K02140e3270n8035A83111A7097J28915h1978
18832F1223b3060A16430b86476a23949C8231c7513D25557a46651h224l45628b8822
$$ y = [195718, -23044, 278098, -241802, -308905, -30301, -243584, 50292, -88630, -209196, -181368, -15205, -152552, -443499, -5733, 98733, 55764, 102704, 12856, -89639, -142457, -113332, -170612, 11478, 24666, -296183, 105337, -298987, -14663, 92858, 265295, 58241, -62289, -322470, 92419, -262971, 63615, 102334, 185416, -76655, 244325, 172976, -170960, -57243, -83967, -199435, -61466, -166876, 222842, -106920, -315178, -87398, -216392, -33180, -260709, 104026, 213320, -884555, 176195, -108707, -240454, -96107, 86170, -177289, 69279, -163456, -73076, -184968, 179463, 19742, -72809, 132632, -360064, 4070, 206210, -53270, -111305, 183111, 17097, 146012, -81978, 61223, -23060, 116430, -286476, -123949, 38231, -37513, 425557, -146651, -8224, -353852, -28822]
18820g4768E7543a8934E9046b3529E7144Q9990a46629B13285J01334g8212p5563
18809a53775A38939J95846G4305h1286q9265M9056M4629H5823L7558L43188j28293
18798C38276D2157b59956l3369J7359b1136j13238B65449a79502d3282k05854
18788b49136p8518D7652N4531b1921C5680i9500m4743E5772h4832C16780a72521
18776A52105g0566a0067G926L7072A6364K08587a32913A21709N1067B3559h9939
18764a09447A85824l3673B0356a65712J5542A00042c62698F1934J2118K8838a82530
18752g3154A82634c02899q6081i5085B4135e1382g984F0422a87417N5008C3083
18740a30770M9878B18889a5198n8481B09750A1603b13308H9985a13239j75321
$$ y = [-74768, 57543, -18934, 59046, -23529, 57144, 147134, -146629, 213285, 314619, -78212, -153775, 138939, 334785, 74305, -81286, -170551, -121495, -76866, 85823, 123381, 466569, 338276, 42157, -259956, -293325, -275966, -21136, -134374, 265449, -179502, -43282, -249136, -327654, 47652, 102183, -21921, 35680, -99500, -144243, 55772, -84832, 316780, -172521, 152105, -70566, -10067, 7926, 44998, 16364, 224951, -132913, 121709, 172776, 23559, -89939, -109447, 185824, 152151, 20356, -165712, -150170, 100042, -362698, 61934, 74052, 102890, -182530, -73154, 182634, -302899, -388980, -95085, 24135, -51382, -7984, 60422, -187417, -132409, 33083, -130770, -80892, 218889, -15198, -73679, 209750, 11603, -213308, 89985, -113239, -288560]
18730b88560f3468l8047l06901B4154a54377C9558c22201d8157A12902K3170f9100
18718A29673a57952O448k45903H2512c18241a0920m34075A07251c58969C0954
18707a00227L2018A60571K860k1725k7267a0993l5756p61A93138l878b66584g4997
18694a74390B9013c351n2459C162a23817O1277K5341o3473G0334J4050h3789g628
18681B81317I2464A5040c28071A75007e8635A41871c2498K796o0112a0635m8638
18670e9273j21696A63030a22193j37252c8727A30603b08103F3685M932K16220
18660B84837a4359l15383c9808m89025a14267G9057a52454p0751B14293b0841
18649B46537b4197E7582P8111f6358j10101p0845N3388Q2331j20512g8174k28532
$$ y = [-288560, -63468, -101515, -408416, 24154, -154377, 39558, -322201, -48157, 112902, 136072, -69100, 129673, -157952, -151504, -397407, 82512, -318241, -10920, -444995, 107251, -358969, 30954, -100227, -68209, 160571, 163431, 141706, 114439, -10993, -46749, -47510, 193138, 189260, -266584, -74997, -174390, 29013, -3351, -55810, 3162, -123817, -62540, -37199, -100672, 70334, 84384, -83789, -7628, 281317, 92464, 15040, -328071, 175007, -58635, 141871, -32498, -29702, -89814, -10635, -59273, -180969, 163030, -122193, -259445, -38727, 130603, -208103, 63685, 68617, 284837, -14359, -329742, -39808, -528833, -114267, 79057, -152454, -223205, 214293, -20841, 246537, -24197, 57582, 135693, -66358, -176459, -247304, -193916, -111585, -232097, -78174, -306706]
18638c06706C84387a98198D9597a36436j34552Q4815q9771D7260a64917l9828
18628b04745I4961h2804A17413a22028M0834j0924o4266B3984b34740N0312P8516
18617a05912B97578c17065C60J69342g8489B7943M5096e4248A6779d0844k7735
18606f8579C890d9681A90389a16080C9760O01a92474A12154h8691A42368b09837
18594A73696M6526r4912a9297C35742b96129L7247m678a21621k50267J79448h9854
18582a70658A59898a63689B84924a55061M9863j60092a3167j04906b4862B53802
18571c52724N3852J18464A59920d71124G7985e0349k7434F278g1821r9158B4198
18559a12118a2248l93934i0946K5931A93612n8212a55708c5521C8722d18915J94569
$$ y = [-306706, 384387, -198198, 49597, -136436, -270988, -186173, -275944, 47260, -164917, -204745, 94961, -82804, 117413, -122028, -81194, -92118, -156384, 23984, -234740, -184428, -105912, 297578, -317065, 360, 169702, -78489, 27943, 73039, -54248, 16779, -40844, -68579, 3890, -49681, 190389, -116080, 39760, 40361, -192474, 112154, -88691, 142368, -209837, 173696, 220222, 125310, -19297, 335742, -296129, -258882, -263560, -121621, -371888, -192440, -89854, -170658, 159898, -163689, 284924, -155061, -105198, -265290, -13167, -118073, -24862, 253802, -352724, -298872, -180408, 159920, -471124, 77985, -50349, -77783, 6278, -71821, -170979, 24198, -112118, -12248, -406182, -90946, -65015, 193612, 135400, -155708, -35521, 38722, -418915, -224346]
18548b24346B66756a86867n0958i4364I8534N6311c23404a13032p9933Q4870H5031
18536E1038a21869n8122a5000j90569H2690P2140n6569b1475B9969a86538B5042
18524b11724P0859q3541O027A79348a73531B08921b82237A14127l3344d1515r6357
18513a37872e6791j44150q3636C00318G3821c60539I5877m0036h461j01964j02179
18502b12604e3912r0309A63709K8436p9967a69330e7545F0543a14205j23830A6715
18490g1916A50901C7028K7065a89268d5190H0120a06984j48657P5257h6156j37651
18479b23807d986k18013g5368B4550h4533A8501a56335A87791p7391K3795b68596
18467c60012A5605P6959a66014A21422a34750H9262J0331O0906a22970d3462a0950
$$ y = [-224346, 266756, -186867, -237825, -94364, 98534, 154845, -323404, -113032, -192965, -108095, 85031, 51038, -121869, -179991, -15000, -205569, 82690, 154830, 98261, -21475, 29969, -186538, 25042, -211724, -140865, -224406, -218379, 179348, -173531, 208921, -282237, 114127, 80783, -41515, -137872, -56791, -200941, -284577, 300318, 73821, -360539, 95877, 55841, -8461, -110425, -212604, -53912, -144221, 163709, 192145, 112178, -169330, -57545, 60543, -114205, -238035, 16715, -71916, 150901, 37028, 64093, -189268, -45190, 80120, -106984, -255641, -180384, -86156, -223807, -4986, -222999, -75368, 24550, -84533, 18501, -156335, 187791, 110400, 134195, -268596, -360012, 15605, 92564, -166014, 121422, -134750, 89262, 99593, 160499, -122970, -43462, -10950]
18455A84478c0420j7757a3528j59723e3148L037I6066e7948j21508c149k2950
18444b6099H0343a48728G9635a40199c3143m00971f0507C6544c98490J25675E1261
18432a59029N9630A06778E1518h1976j46055D8379J04650b21356b8143o3980A98098
18420b2656h121l2904j77799m5091K0015K9056H4492a15391A32299c3183B2427
18408A31257a26118B40251H1034J35030a4112a882j67559k53178a42997d3007
18397a64858j44991G340J3399a0897B103g3429J3024o1349A49962a8672j02627
18386a21299p9892g6716p2861A86578C0055L9601h7943P752k11691P0049r4041
18375c15874A82452h7394g793A09761b19517j02268D4791b07962G9036a50315
$$ y = [184478, -30420, -48177, -13528, -173251, -53148, -50111, 96066, -57948, -179456, -3149, -26099, 80343, -148728, 79635, -140199, -33143, -434114, -60507, 36544, -398490, -272815, 51261, -159029, -99399, 106778, 51518, -81976, -228031, 48379, 153029, -221356, -28143, -92123, 198098, -22656, -8121, -41025, -218824, -263915, -243900, -214844, 84492, -115391, 132299, -33183, 22427, 131257, -126118, 240251, 81034, 216064, -14112, -1882, -169441, -422619, -142997, -43007, -164858, -309849, 7340, 20739, -10897, 2103, -73429, -60405, -121754, 149962, -18672, -121299, -201191, -76716, -149577, 186578, 30055, 69656, -87943, -80191, -291882, -221833, -315874, 182452, -87394, -7793, 109761, -219517, -321785, 44791, -207962, 79036, -150315]
18364a50260L2338B16019B5387b9718k30196C3927N6422d8604M492C04724A27287
18352D5994d4141a9449q1677F2979d1261B77907j21012C4982R1203N5513q4083
18341I7615f3931j52112Q0376B74548a6366k8721j73388N8113O0458A79192m0521
18330A38671d68118A79213A9507a64455R644j9699j88957b834B3984E958b05567
18318D1431E115L1186e703j63016B6134f2832B85522m2438j13565D2254K30132
18307B72386j36005j3879a16909C0084c19808J2195D5377a15544j31153Q8656
18297a58041A13333d5463o1989B15495P9303a0552j08267a9828l70745E4675R0604
18286A45279D9411a53174e6085A72691b66556e7102B8683J15722J93480i3521
$$ y = [-150260, -117922, 216019, 25387, -29718, -259914, 33927, 90349, -48604, -44112, 304724, 127287, 45994, -44141, -19449, -101126, 62979, -41261, 277907, 156895, 34982, 126185, 181698, 97615, -63931, -216043, -135667, 274548, -16366, -45087, -218475, -160362, -99904, 179192, 138671, -468118, 179213, 19507, -164455, -154811, -174510, -363467, -2834, 23984, 5958, -205567, 41431, 5115, 36301, -5703, -168719, 26134, -62832, 285522, 243084, 129519, 42254, 272386, 136381, 122502, -116909, 30084, -319808, -307613, 45377, -115544, -246697, -158041, 113333, -45463, -107452, 215495, 294798, -10552, -118819, -19828, -390573, 54675, 145279, 49411, -153174, -56085, 172691, -266556, -57102, 28683, 144405, 337885, -93521]
18275I4585f7489j75861a1811r6935k58170a29105B0409H919h7091A76913l8346
18264A38567c23682g1126D5103K29113a33315f4784a8107B27142d5898j68172
18254b14070P2348d3999m155k57665J31087P8159j11810b626A80148c36342G3915
18242g6339B0992b25403A40195c613B67807a24181e0575A0534a62493A86326g0327
18230A03858l2152b11354G2840l604Q4428a07035A47556B8956a89601B77750a22597
18218a03852k2894j37653J10696g0631C06189a93322D5358a47781E4221a4144
18207e9429k48274B78616I811a05223l1308d4057k32820A61992E1726f5722H4682
18195C58940H1839O8596e9338A14583c2064A53551c29114d0714k64764E5762P3257
$$ y = [94585, -67489, -243350, -11811, -108746, -366916, -129105, 20409, 8919, -87091, 176913, 138567, -323682, -71126, 45103, 274216, -133315, -64784, -18107, 227142, -45898, -214070, -141722, -43999, -48154, -305819, -174732, -96573, -208383, -2626, 180148, -336342, 73915, -76339, 20992, -225403, 140195, -3613, 267807, -124181, -50575, 10534, -162493, 186326, -70327, 103858, 71706, -211354, 72840, 69236, 153664, -107035, 147556, 28956, -189601, 277750, -122597, -103852, -126746, -264399, -153703, -70631, 306189, -193322, 45358, -147781, 54221, -14144, -59429, -307703, 278616, 9811, -105223, -136531, -44057, -276877, 161992, 51726, -65722, 84682, 358940, 81839, 150435, -59338, 114583, -32064, 153551, -329114, -40714, -305478, 55762, 129019]
18184A29019b05336d1971D0389L4616J11874H7108N2691h5697B46748b26207A22021
18172A5898A851b55895h2439k9095A78914a85684A62108a27650A68016c0936l54375
18161c85311a9621B3803R8168e8140C5445h6010q5936A78013a2830B35585I3601
18149a44874H8708c46522a60366F6182L63671a471A21714o0203h4441B22910g0232
18137A39861a92529B67214a44187A7502a43625j2355p4313C8827d82501J19879
18127c62622B2537K8676P1615L1745a7079B72415A2118b34307j12706c4793j35102
18116a69895C1089b67761A30402g7760K5938E2092h3513j14926J9652l034G6344
18104E459J02871J24467c2497F0469B0459L9178b6504r3800N077K6632A33885
$$ y = [129019, -205336, -41971, 40389, 75005, 186879, 87108, 139799, -85697, 246748, -226207, 122021, 15898, 1851, -255895, -82439, -111534, 178914, -185684, 162108, -127650, 168016, -30936, -385311, -19621, 23803, 121971, -58140, 35445, -86010, -171946, 178013, -12830, 235585, 93601, -144874, 88708, -346522, -160366, 66182, 429853, -1471, 121714, 61511, -84441, 222910, -70232, 139861, -192529, 267214, -144187, 17502, -143625, -155980, -230293, 38827, -482501, -362622, 22537, 51213, 122828, 154573, -17079, 272415, 12118, -234307, -347013, -34793, -169895, 31089, -267761, 130402, -77760, -51822, 52092, -83513, -198439, -178787, -181821, 76344, 5459, 108330, 232797, -32497, 60469, 20459, 59637, -26504, -120304, -115227, -88595, 133885]
18092A82353F3199i7327b5300k8144j88617c8432j74648e197m0395E677b50647
18080A94764q4820i1714j27145I4015a10386B0667l678M7002K12162J50p887a42196
18067A61916L2214a89788C4886a07432r0841B8135d00950a27223k22130A98348
18056A74790o6052C1720J58744k7961k0166a25100A0476L677c74344o6793B67952
18044a58900M6353b1739A40736i1203k7765L7195l22275A36967E3478a83846c9623
18032h6258C39201h258m19331C8901o635b83499a18630A85891P0555j1625J6879
18021B61700a78452Q576j98672a32602G8785l9342a7614I0916d50916a36210B19339
18009b34524B55223k7436a8274j7527G1491d55158D245a68392B11739b03979C1117
$$ y = [182353, 63199, -97327, -25300, -53444, -242061, -38432, -213080, -5197, -45592, 5677, -250647, 194764, 109944, -91714, -218859, 94015, -110386, 20667, 16989, 63991, 276153, 276303, 268416, -142196, 161916, 194130, -189788, 34886, -107432, -198273, 28135, -400950, -127223, -349353, 198348, 174790, 108738, 31720, 190464, 162503, 142337, -125100, 10476, 14153, -374344, -441137, 267952, -158900, -112547, -21739, 140736, -91203, -118968, -81773, -404048, 136967, 53478, -183846, -39623, -86258, 339201, -8258, -427589, 38901, 32266, -283499, -118630, 185891, 256446, 244821, 261700, -178452, -169876, -368548, -132602, 78785, 39443, -17614, 90916, -450916, -136210, 219339, -234524, 255223, 227787, -18274, -35801, 71491, -455158, 4245, -168392, 211739, -203979, 31117]
17997f1594l1124A04550D8362b68467C05846f0369B02692R1741A00621a83866
17986H187K23590A09724m1731J14612a1123o3328G934a71436m7743f2762a8107
17974a43801A36120e4703j711C1368f2423b1437j84861A55957d7488k6856j03296
17963a77640B17453d1396C81268A64415b49705L1171o6754e1201C2134c12766
17952A14462a93670A51049a5645o1674J7650p0504b8619C12731M8631a90054g0118
17940A4395a5945D9380J0012J60794O4517a22621j01049F8148a53585C65574N9155
17929D24729A04178c01826M8320g4262j03663C28167A39549E699K08332J6916
17919B30947Q3108E1135a40241l5402p7818i4234F0066b24893B56740o2316P4255
$$ y = [-61594, -92718, 104550, 48362, -268467, 305846, -60369, 202692, 294433, 100621, -183866, 8187, 231777, 109724, 67993, 182605, -11123, -74451, 7934, -171436, -219179, -62762, -18107, -143801, 136120, -54703, -56414, 31368, -62423, -21437, -206298, 155957, -47488, -74344, -177640, 217453, -41396, 381268, 164415, -249705, -218534, -285288, -51201, 32134, -312766, 114462, -193670, 151049, -15645, -77319, -59669, -130173, -28619, 312731, 361362, -190054, -70118, 14395, -15945, 49380, 59392, 220186, 284703, -122621, -223670, 68148, -153585, 365574, 424729, 104178, -301826, -253506, -74262, -177925, 328167, 139549, 5699, 214031, 230947, 314055, 51135, -140241, -175643, -253461, -94234, 60066, -224893, 256740, 194424, 268679]
17908B68679g8646A84448e6620A34805J8595b8035C50359b31534B36745b30484
17897I6994P7452a54060A52350L30735B066J08786i8052D668b0648B81363E6069
17885A8963N2766b19011C5180b11817b3415j32211m0964B68P5518i1490j7722
17874a09212A27348e34265e3322J866j5012j3693j20028A83010F5862J83880G9176
17862E921B724a95587B34097c33177c300k20537g53A13621a81155N5427A66444
17850a26836b8576o7910C8146e461n1261l7827l318A05911J42788a0530G1471
17838a66921B19279l6388c81357A37363n7853B0766b6916A17552e4264H0366a70172
17826b41113l2635a15150a3517E2923h2804B12023a507F9998e1745J1613A2850
$$ y = [268679, -78646, 184448, -56620, 134805, 153400, -28035, 350359, -231534, 236745, -230484, 96994, 174446, -154060, 152350, 483085, 2066, 110852, -98052, 4668, -20648, 281363, 56069, 18963, 71729, -219011, 35180, -211817, -23415, -155626, -196590, 268, 75786, -91490, -109212, 127348, -534265, -53322, -51456, -66468, -80161, -200189, 183010, 65862, 249742, 79176, 5921, 2724, -195587, 234097, -333177, -3300, -223837, -753, 113621, -181155, -125728, 166444, -126836, -28576, -96486, 38146, -5461, -56722, -94549, -97867, 105911, 248699, -10530, 71471, -166921, 219279, 182891, -381357, 137363, 79510, 20766, -26916, 117552, -54264, 80366, -170172, -241113, -273748, -115150, -13517, 52923, -82804, 212023, -1507, 69998, -51745, -40132, 12850]
17814G6387A6082a01217r6750A72793D535h4525a0760H4651i7163d0102a2963
17802i636p7851l9569q749i901A58687D6249g4742l6029E4176f3445F917K876
17790I793c62835H7935K6780J15596J79636f8851B28115b0200q4920A53926n6128
17779I7798a98946f7184A55231P7528b24599f3028A2396K99509A32190L7869h8232
17767D4001J47158g9219j69266I6696c88015J23920b8271F2113m892L3800J52214
17756B43235A3880M1263a64917O2713J7427k57190d1092F7517a52421j52364J09230
17745a95555g8654A01965A7223e1428A13757J99172j26959a11153B39704b29730
17734f29090E1497b94740i2064I7195K4190O9996a05164F8449J58296b85518h2136
$$ y = [76387, 16082, -101217, -197967, 172793, 4535, -84525, -10760, 84651, -97163, -40102, -12963, -9636, -87487, -127056, -135805, -9901, 158687, 46249, -74742, -110771, 54176, -63445, 6917, 9793, -362835, 87935, 114715, 230311, 409947, -68851, 228115, -20200, -105120, 153926, 97798, -198946, -67184, 155231, 232759, -224599, -63028, 12396, 311905, 132190, 170059, -88232, 44001, 191159, -79219, -248485, 96696, -388015, -264095, -28271, 62113, 57221, 91021, 243235, 13880, 55143, -164917, -102204, -84777, -341967, -41092, 67517, -152421, -304785, -195555, -78654, 101965, 17223, -51428, 113757, 312929, 185970, -111153, 239704, -229730, -629090, 51497, -294740, -92064, 97195, 121385, 191381, -105164, 68449, 226745, -285518, -82136]
17722A70680a12924m4246o7979i8734A34423K83331H2295h2176C487b03039B8183
17710C03640E2663J25795c1429B62038a28653G9282b51859C5441K75298g5635
17699A92550c378C32776f0646B30614b23186j0262A5317e0255r9031j582b0284
17687B85259p6005a46440q0580H2065J4695B2465P0772d27849f2567C7246J77332
17676B14578b44371c3479O598C4569a62016A13203J11246g4010A36973h2993A75802
17664a69494j38150Q4069A26108g286A43507J12368b7927B61353h8054D2543a095
17652a67404G2244J32250a4624j82682a3185A81315n8129K4489a97518N8509c0059
17640A00970J33454b0096A46992p1213J26275B774J5816H312K53347h1362m8010
$$ y = [170680, -112924, -157170, -225149, -98734, 134423, 417754, 82295, -82176, 3487, -203039, 28183, 303640, 52663, 178458, -31429, 262038, -128653, 79282, -251859, 35441, 310739, -75635, 192550, -3378, 332776, -60646, 230614, -223186, -233448, 15317, -50255, -149286, -150868, -20284, 285259, 209254, -146440, -227020, 82065, 96760, 22465, 93237, -427849, -62567, 37246, 214578, -244371, -33479, -26881, 34569, -162016, 113203, 224449, -74010, 136973, -82993, 175802, -169494, -307644, -223575, 126108, -7286, 143507, 255875, -27927, 261353, -88054, 42543, -1095, -167404, 72244, 204494, -14624, -197306, -13185, 181315, 123186, 147675, -197518, -139009, -30059, 100970, 234424, -20096, 146992, 75779, 202054, 2774, 18590, 8312, 261659, -81362, -129372]
17629a29372j02105D0532b13282L5456F2263J32558f1206q2419I871a07153D0875
17617C1272J42994m9667d8811D3343n279a14978H5560c1453A85099a36968d0149
17605B07416n583l8815n6336k4253h5098A76802n2514E7459a60964H203b20984
17593A55070I071J73032n5954g000j57079j28012J00606K9417h0304G1906K61112
17582C33018F5181b75490B36928d5417H8068A4348b29784A36037a46241I9863
17571c0046A67469f1985C40968a27782B9695K07594r4754J14100d9256A45857
17560A80031L002B0759a77081b8551d997n5428D5997L7465K0476D7342L2638O9066
17548A49046g8447I5529a72030B20280n1768q0336l2195g6444B66884d3296B64156
$$ y = [-129372, -231477, 40532, -213282, -177826, 62263, 194821, -61206, -143625, 9871, -107153, 40875, 31272, 174266, 124599, -48811, 43343, 38064, -114978, 85560, -31453, 185099, -136968, -40149, 207416, 201833, 163018, 106682, 82429, -85098, 176802, 124288, 57459, -160964, 8203, -220984, 155070, 9071, 182103, 126149, -7000, -164079, -292091, -191485, -162068, -80304, 71906, 333018, 65181, -275490, 236928, -45417, 88068, 14348, -229784, 136037, -146241, 99863, -30046, 167469, -61985, 340968, -127782, 29695, 237289, 142535, 256635, -49256, 145857, 180031, 183033, 20759, -177081, -28551, -4997, -60425, 45997, 83462, 103938, 47342, 79980, 149046, -78447, 95529, -172030, 220280, 168512, 88176, 55981, -76444, 266884, -43296, 264156]
17536b10000D8957o259a86430A53757n2064R0606e5126j44166A74891B316i2682
17524E2403d9A17556b3879E0418M66629B01241a16685D4649c8798j57306E086
17512A05476b47425A17264D9675a0645j29394a597A4963Q6235L04178R8588a13862
17500A22294J03213A09210c1137B37554g6983J8956E8433L7191m2192h4601F22435
17488c1364J4819A34316a52715E98609a23230A46951a45838A36010F4434a58849
17477B11004j03588O9318m4052J58043Md2347G9339J36167J67234a71280A72568
17465b25279A80720a12236E3367K4987J14017a15308A26191m1557K22496G0190
17454A11830Q2373K342F2582J19138L83920k82797D9491Q7467M8337K36918j46605
$$ y = [-210000, 48957, 42698, -186430, 153757, 101693, 192299, -55126, -199292, 174891, 2316, -92682, 52403, -49, 117556, -23879, 50418, 517047, 201241, -116685, 44649, -38798, -196104, 5086, 105476, -247425, 117264, 49675, -10645, -140039, -1597, 14963, 101198, 405376, 503964, -113862, 122294, 225507, 109210, -31137, 237554, -76983, -58027, 58433, 95624, 53432, -84601, 622435, -31364, -16545, 134316, -152715, 598609, -123230, 146951, -145838, 136010, 64434, -158849, 211004, 107416, 176734, 132682, 290725, 290729, -42347, 79339, 215506, 382740, -171280, 172568, -225279, 180720, -112236, 53367, 78354, 192371, -115308, 126191, 84634, 307130, 70190, 111830, 194203, 196545, 62582, 181720, 565640, 282843, 49491, 136958, 185295, 422213, 275608]
17443B75608B9298c0185A63894a60107A79055O7847A19072j7389J78Q4398P0148
17432B56407j09499J73574j21560K73428A87163B3501b3354C49234j03968o0224
17422A85042J66506i6133B64455p5770E8914J49152k1399J5006J87578M9225A99466
17410A58874h4597A44629L03091G1325R3354K9633K38162B7413K00977K308p0846
17399A59852g1305E8006a1008B81995E4922j1782a7641B10763L61885G2551L38169
17388D10720a00196D62984a09506C41400C6745K12567K8035a63091B00092h9501
17377a64103D6629L17556D0821q686K35196l0602d5767I801L80584q0401A12639
17365B43936C5733E380M61614j58559A18980c64762A40486K62322k7391n7676
$$ y = [275608, 29298, -30185, 163894, -160107, 179055, 246902, 119072, 101683, 101861, 186259, 256407, 146908, 320482, 198922, 472350, 187163, 23501, -23354, 349234, 245266, 185042, 351548, -96133, 264455, 188685, 58914, 208066, 186667, 201673, 389251, 438476, 199466, 158874, -84597, 144629, 447720, 71325, 164679, 194312, 432474, 27413, 228390, 230698, 159852, -71305, 58006, -11008, 281995, 54922, 43140, -17641, 210763, 572648, 72551, 410720, -100196, 462984, -109506, 341400, 36745, 249312, 277347, -163091, 200092, -89501, -164103, 46629, 364185, 40821, 32135, 267331, 236729, -45767, 9801, 390385, 309984, 112639, 243936, 35733, 5380, 466994, 308435, 118980, -364762, 140486, 402808, 375417, 317741]
17355C17741l0478H615J43934K95118j83795l0018j00173R0650C8167L28898A03084
17343B21395k4031F9311J1818l9881J09518J00103A18631E9302K2102K28481E0767
17331A65859J02533e421A04037c36852c5704l9409B97531A09932b09852A28661
17320b0395A48504i0151H4732J79522o6897L9666r9910F6184J02506J32191c0011
17308e5585H1475Q6024F5882J7087B1052c22003D45111j79655j6524j4594d1616
17296F2123f8563G7174J00524K1906Q170K8807B6840J22250K79135a7124A07481
17284A09399J53263n4051E6267a84706B45450g12D58711k27116J2614j16404J6960
17273A44765b14941A16615K04680C6514K86419E3179N0346a0659A29436O8392
$$ y = [317741, 287263, 8615, 152549, 447667, 263872, 233854, 133681, 224331, 38167, 367065, 103084, 221395, 197364, 69311, 81129, 41248, 150766, 250869, 118631, 59302, 81404, 309885, 50767, 165859, 268392, -5421, 104037, -336852, -35704, -75113, 297531, 109932, -209852, 128661, -20395, 148504, -90151, 84732, 264254, 197357, 237023, 137113, 66184, 168690, 300881, -30011, -55585, 81475, 167499, 65882, 82969, 21052, -322003, 445111, 265456, 248932, 234338, -41616, 62123, -68563, 77174, 177698, 199604, 207774, 236581, 26840, 149090, 428225, -17124, 107481, 109399, 262662, 208611, 56267, -184706, 245450, -712, 458711, 231595, 244209, 127805, 144765, -214941, 116615, 321295, 36514, 322933, 53179, 103525, -10659, 129436, 197828]
17263A97828C4863b16451A96508q2561O9672q2418J49241B3330J2444j5672Q0111
17252A00213J74923c14260A01119L26647Q5490j14213a3054A73988J49836C9144
17241D05836j11815p4670N4562D8549k2432K34581m6023e6409M455C11371M3510
17230C54881a2046B14918M99b3731B86873A37661O7940G3193D901L19909a5146
17218D4007J66111K12670j31761M2155A63112J06744q0770J29228q1618H2928
17207C2590N8513l6851a7687B10654l3826B2552J6014J65025K73394B04018J42107
17196C46125A01963J30419L52256G1091J69302m0670J44883r0658p1530A5644
17185c7576E12813B52021E9787N17300j58592j41947A11694e734D75465k23641
$$ y = [197828, 34863, -216451, 196508, 113947, 183619, 101201, 250442, 23330, 35774, 20102, 100213, 275136, -314260, 101119, 427766, 513256, 399043, -13054, 173988, 323824, 39144, 405836, 294021, 219351, 273913, 48549, 26117, 260698, 214675, -56409, -51954, 311371, 354881, -12046, 214918, 215417, -23731, 286873, 137661, 205601, 73193, 4901, 324810, -15146, 44007, 210118, 422788, 291027, 333182, 163112, 269856, 189086, 318314, 236696, 82928, 32590, 91103, 54252, -17687, 210654, 176828, 22552, 38566, 203591, 476985, 204018, 346125, 101963, 232382, 584638, 71091, 240393, 199723, 344606, 253948, 182418, 15644, -37576, 512813, 252021, 59787, 577087, 418495, 276548, 111694, -5734, 475465, 251824]
17175B51824J84113k16418O1380j14643J72183K8171O3680B04578B9650J63669
17165A93319L60676j78746q8694o6556K54701j60861N5518j45565M5345L3176
17155C02313M8190j74195J50960p7328A01494K70195p1619j48491J51369L3270
17145C36218j13787p8868a06908B11530P3079K45516A96026j2962J10850A16191
17134A70749K4392O3868n2178j905J72094K24757A84558M55544A66490K24456
17124C90946K29764O709k1849k02145r8244A17879J95139q2176K07990E1167L05041
17113C56208J60191N3316N7654j08229j14773J97780J297j94798O3677J47837
17103F20160l05360L58670l36234l0994K89741A13424K68282p7152J53471J85206
$$ y = [251824, 435937, 219519, 280899, 166256, 338439, 366610, 430290, 204578, 29650, 193319, 553995, 375249, 286555, 219999, 474700, 313839, 369357, 223792, 269137, 302313, 350503, 176308, 327268, 249940, 101494, 371689, 300070, 151579, 302948, 336218, 222431, 143563, -106908, 211530, 284609, 530125, 196026, 183064, 293914, 116191, 170749, 195141, 259009, 206831, 204926, 377020, 601777, 184558, 640102, 166490, 390946, 620710, 627419, 605570, 403425, 305181, 117879, 313018, 230842, 438832, 51167, 356208, 516399, 569715, 627369, 519140, 404367, 602147, 603444, 408646, 472323, 620160, 314800, 673470, 337236, 306242, 595983, 113424, 381706, 304554, 458025, 643231]
17093F43231j88594j1545N4014M8229B04736R7743N2929J66365r5933n087j29207
17082B91546j13967K64745m0880j17494K57541B13573N4552J35326G0436O22681
17072F93117l07333J68743k07099J39526K91373k78578M4495k37342L53981j70476
17062D90407m883A00141K20392J88007r6552J266R3079P8961k46687M9334K2950
17051D10891K20895J37061l74492K99216j84281J08653B57298J66073J13060K03251
17041G39682C49376R1959N3861k36661L00235B25242K66076J69040k33981J0874
17031D37251J86447k02586K09619R2824B75299J86205M1449p0948r5584J10274
17021D46695J33951o8764J80346k35502M43974k63875M5084j64907A97948L10604
$$ y = [643231, 454637, 443092, 497106, 545335, 204736, 302479, 355408, 521773, 425840, 420753, 291546, 177579, 442324, 401444, 283950, 541491, 213573, 268125, 403451, 70436, 693117, 385784, 554527, 347428, 486954, 778327, 499749, 544244, 306902, 660883, 490407, 485524, 100141, 320533, 508540, 411988, 413254, 506333, 585294, 338607, 387941, 410891, 631786, 768847, 394355, 693571, 509290, 617943, 257298, 423371, 536431, 739682, 349376, 441335, 495196, 258535, 558770, 225242, 491318, 660358, 426377, 437251, 623698, 421112, 630731, 723555, 275299, 461504, 502953, 432005, 336421, 446695, 580646, 511882, 692228, 456726, 900700, 636825, 681909, 517002, 197948, 508552]
17011E08552k1166j23115K06235J77860j4927K0037J58586k34220O2430L48399
17001A088671n35825K05441Q7015q1524p3689j04880N7266L425J21033J48271
16991I15204L44497l18027k46414J31560J01485k14759J94791J3515k47464J09504
16981G83892j22023L8468O438O350m5568P7380K11689k40776P3578m9373J06278
16970H46333p6942K40244r5620j88539O6467L49030l68483K6948L15582R8911
16960A213931k20332l8194l10810N00814l69610K01093k92135n9991M42880J44714
16950A212360O7496r9860n6940k29517J42039R9799k78177K57989r8013j70265
16940H46911K08695l891L53533p7548J5710m03864K33545j7928k40992L02445
$$ y = [508552, 487386, 364271, 570506, 748366, 733439, 753476, 912062, 677842, 740272, 1088671, 552846, 758287, 845302, 763778, 690089, 585209, 642475, 645900, 766933, 915204, 1259701, 941674, 695260, 826820, 928305, 713546, 908337, 921852, 674388, 783892, 661869, 700337, 706775, 713125, 667557, 744937, 956626, 715850, 789428, 740055, 846333, 769391, 1009635, 914015, 725476, 791943, 1140973, 772490, 799438, 1115020, 1213931, 993599, 955405, 644595, 1145409, 775799, 976892, 684757, 624766, 1067646, 1212360, 1279856, 1179996, 1123056, 893539, 1035578, 1135377, 857200, 1115189, 1017176, 846911, 1055606, 1051715, 1405248, 1327700, 1343410, 939546, 1173091, 1155163, 914171, 1216616]
16930A216616J95720k17725J48299k08285J59404k66307K44038j69706J4101N7244
16920A173399j0553J6509J47736K1078j91922J41660k31470K76885P2798j24617
16910A291503j16416N62236n09711J29549q9408P2741N22770k49626r2045r3738
16900A427855J31801J46826j05805j00890J55545r677J66581o9786J27064L93959
16890B263473p45136L16142K52781n83911L11558j29789K91765j71282j21139
16881A684462Q3473L08934J77685k76576Q5664o303k00643J79242J90031j27179
16871B098790j48537M02997j50760N21477n12488L70784l13269l3470K13881L09101
16861B758506J5511l76084L70997j5259L5130j18935J59836p1871k37932N37485
$$ y = [1216616, 1412336, 1194611, 1342910, 1134625, 1294029, 1027722, 1271760, 1102054, 1116155, 1173399, 1162846, 1179355, 1327091, 1348169, 1156247, 1297907, 1066437, 1343322, 1416120, 1291503, 1175087, 1737323, 1227612, 1357161, 1267753, 1340494, 1863264, 1613638, 1521593, 1427855, 1559656, 1706482, 1600677, 1499787, 1655332, 1645655, 1812236, 1742450, 1869514, 2263473, 1518337, 1834479, 2087260, 1503349, 1814907, 1685118, 1976883, 1805601, 1684462, 1767935, 2076869, 2254554, 1977978, 2063642, 2057339, 1856696, 2035938, 2225969, 2098790, 1950253, 2353250, 2202490, 2723967, 2211479, 2582263, 2268994, 2235524, 2449405, 2758506, 2774017, 2397933, 2768930, 2753671, 2788801, 2669866, 2829702, 2757831, 2519899, 3057384]
16851C057384j92426J45473K23932l25898K12334K3235j14267K56909k84691P50229
16841C752214l86997M2420N78495l05463j40487N3659L47975k21477R6418M2990
16831C859747J29840J31016J78749j62761J96459j62085J5281M51065m7620J83076
16821D772767R2616k39041K95480K524o4169J52445M00186k08576K58209K40533
16811E702974R3560K15172J64985K86039m1853j13840O2241L85881L29972j86594
16801F898537L84718l54465N02550J76341M03273q3369M44732K57260j49476M70068
16791H950169R9992K18621K45341L56050L96344j33526R40212J49161l23860Q82928
16781A1781432K16702L58321J83782M19378L80866K68017Q28288N58380M86744
$$ y = [3057384, 2864958, 3010431, 3234363, 2908465, 3120799, 3144034, 3029767, 3286676, 3001985, 3752214, 3365217, 3407637, 3986132, 3680669, 3540182, 3593841, 3941816, 3720339, 3816757, 3859747, 3989587, 4120603, 4299352, 4136591, 4333050, 4170965, 4186246, 4637311, 4589691, 4772767, 4865383, 4626342, 4921822, 4924346, 4860177, 5012622, 5412808, 5204232, 5462441, 5702974, 5796534, 6011706, 6176691, 6462730, 6420877, 6307037, 6369278, 6755159, 7085131, 6898537, 7283255, 6928790, 7431340, 7607681, 8010954, 7927585, 8372317, 8629577, 8480101, 8950169, 9050161, 9268782, 9514123, 9870173, 10266517, 10132991, 11073203, 11222364, 10898504, 11781432, 11998134, 12356455, 12540237, 12959615, 13340481, 13608498, 14436786, 14995166, 15481910]
16772A5481910M83046Q02440M38749M66627N73207M95066Q74643P24959R97143
16763B1337790N94751J125518O93412Q45035R62064J223011J205274J022875J332369
16754C0342099J247238J808460J437558K129167J298834K259035K004540J727138
16746D4254069K650484K794794K731887K887736L227703L250310L890179L894371
16738F9581533M289394M515597N065008N455927N437443O355639P148256O989639
16730A14838436P394925Q262954Q141058Q705973Q974181R292312Q768263Q707216
16722A83085318Q179986P513688O393142N091797L359232J530307L78957j952859
16714B13579568l635218m830667o690654p419537q360241q971842q966691r307311
$$ y = [15481910, 15964956, 16767396, 17206145, 17672772, 18245979, 18741045, 19615688, 20340647, 21337790, 21932541, 23058059, 23751471, 24596506, 25558570, 26781581, 27986855, 29009730, 30342099, 31589337, 33397797, 34835355, 36964522, 38263356, 40522391, 42526931, 44254069, 46904553, 49699347, 52431234, 55318970, 58546673, 61796983, 65687162, 69581533, 73870927, 78386524, 83451532, 88907459, 94344902, 100700541, 107848797, 114838436, 122233361, 130496315, 138637373, 147343346, 156317527, 165609839, 174378102, 183085318, 191265304, 198778992, 205172134, 210263931, 213623163, 215153470, 215532427, 213579568, 209944350, 205113683, 198423029, 191003492, 182643251, 173671409, 164704718, 155397407]
16706A55397407r147345r213007q421591q397305p648490p377422o929614o051486
16698I2211147n974232n748518m857432n005092m057524m233704l616643l422847
16690E5295155k907428l140265k328973k730920k145859k511846j914320k118473
16682C5497071j426469k042423j286239j187126j642064j135123j200404j431397
16674B4145826o11758j415384n79136n79578j138124o69561p85076n91508q56014
16665A6919687m44536o83007m83730n10218o79175k83008m67092n91307m84857
16656A2292757l38697k63004o36829J12245n99115k84011n01512l32033o6262
16647I383539n38183R8855l58808K06550o02446j69304o8304l84779j08272l75765
$$ y = [155397407, 146250062, 137037055, 128615464, 120218159, 112569669, 105192247, 98262633, 92211147, 86236915, 80488397, 75630965, 70625873, 66568349, 62334645, 58718002, 55295155, 52387727, 49247462, 46918489, 44187569, 42041710, 39529864, 37615544, 35497071, 34070602, 32028179, 30741940, 29554814, 27912750, 26777627, 25577223, 24145826, 23534068, 22118684, 21539548, 20959970, 19821846, 19152285, 18367209, 17775701, 16919687, 16475151, 15792144, 15308414, 14798196, 14119021, 13836013, 13368921, 12777614, 12292757, 11954060, 11691056, 11054227, 11166472, 10567357, 10283346, 9781834, 9449801, 9383539, 8845356, 8944211, 8585403, 8791953, 8189507, 8020203, 7951899, 7567120, 7458848, 7083083]
16637G083083J12046k53948L873q36759R3107j26286K31984o81914J30286j13581
16627E641891j64912J02180o8431n17653j75234k76868J64312j69415n614J11565
16617D641821j33458k50019l91138K74877k96003j37327J81158j08471j46058
16608C635382M7631p1445k46018J94531j80980K8384l6655j59428p7178K86964
16598C421188j83500k60890K8595k97445j39743L51042k39237J35521l37436J35717
16588B613812n4111J06395j89620J8017j26471l8765j06913K90169j74615j28421
16578B209477o9163K424r4898N7391j6981r9888J41649l09256J08746J49105M2144
16567B120750m05372o2777J43830j32621M668j62684J76664J09537k26234o1466
$$ y = [7083083, 7195129, 6941181, 6945054, 6108295, 6201402, 6075116, 6307100, 5625186, 5755472, 5641891, 5476979, 5579159, 5510728, 4993075, 4817841, 4540973, 4705285, 4535870, 4530256, 4641821, 4508363, 4258344, 3867206, 4142083, 3846080, 3708753, 3889911, 3781440, 3635382, 3683013, 3611568, 3365550, 3560081, 3379101, 3407485, 3370830, 3211402, 3134224, 3421188, 3237688, 2976798, 3005393, 2707948, 2568205, 2919247, 2680010, 2815531, 2478095, 2613812, 2559701, 2666096, 2476476, 2494493, 2368022, 2329257, 2222344, 2512513, 2337898, 2209477, 2140314, 2142738, 2047840, 2105231, 2088250, 1988362, 2130011, 1820755, 1929501, 2078606, 2120750, 1715378, 1652601, 1796431, 1663810, 1668478, 1505794, 1682458, 1791995, 1565761, 1504295]
16557A504295M1874R3061l20910K28655m28765M59148R5712j48054m7020J00542
16547A578538k33532J39147l19952L42817l40886K04531j26029l23007J57800
16538A079427L01843q3432J02533r2470o6673j13410J27718k42372j43204J43109
16528A013069J05851k26337J72544q1317j60113q8563M47439j805k9081K0917
16518A172604R7006l85504J81081k18657j7797J9237K46841l47758K91120n8359
16508I79814l20311M9497N761L4941J11070J06409j86331m9276j48589J95317
16498G78302j24672j39880K96869l410Q4492l52511M68341l2497j23852l68121
16488D83061K50517j13187J96825q0673J11205k86956J67567j95470q102M03025
$$ y = [1504295, 1546169, 1639230, 1318320, 1546975, 1118210, 1577358, 1673070, 1525016, 1477996, 1578538, 1345006, 1484153, 1164201, 1507018, 1166132, 1370663, 1244634, 921627, 1079427, 1381270, 1297838, 1400371, 1307901, 1241228, 1127818, 1255536, 1013164, 869960, 1013069, 1118920, 892583, 1065127, 983810, 823697, 735134, 1182573, 1180768, 1151687, 1172604, 1269610, 884106, 1065187, 846530, 828733, 847970, 1094811, 747053, 1038173, 979814, 659503, 709000, 714761, 749702, 860772, 967181, 780850, 731574, 582985, 778302, 653630, 513750, 810619, 807209, 891701, 539190, 1007531, 975034, 851182, 483061, 733578, 620391, 817216, 736543, 847748, 560792, 728359, 532889, 524787, 927812]
16478I27812m60898j79560L08859L6638j83651L45591j08187l08880L67159j75258
16468E69625N2946B85619K28606K20126l08763J83719k23653L27416j36744K28995
16458H05321l75461J52680k72326K55390p0768k45156K96231M3513J26216j36443
16448E79197P7349k55255J24052A81443P54563D06086K33717j81875Q0882j93511
16438C45299K03404R2658j77478L05157j76533j02094N6892k06182L3000Q1176
16428D55299J58049j04673o1993o7366K15148j52393A49769J44001B5659N78971
16418F04630r8678j79801N9238L8365q7487J34753J07286q4824k45234J75342
16408D23590J05487B51710H7323L11814N118j7742M4583r6382L14176C05156A18725
$$ y = [927812, 466914, 287354, 596213, 632851, 449200, 794791, 686604, 377724, 744883, 569625, 622571, 285619, 514225, 734351, 425588, 609307, 385654, 713070, 576326, 805321, 429860, 582540, 310214, 565604, 494836, 249680, 545911, 589424, 715640, 579197, 656546, 401291, 525343, 181443, 936006, 406086, 639803, 457928, 538810, 345299, 548703, 641361, 463883, 769040, 592507, 490413, 547305, 341123, 374123, 455299, 613348, 508675, 446682, 379316, 594464, 442071, 149769, 293770, 25659, 604630, 505952, 326151, 385389, 423754, 336267, 471020, 578306, 493482, 248248, 423590, 529077, 251710, 87323, 399137, 404255, 386513, 431096, 334714, 648890, 305156, 118725]
16396E51910A15245Q4417i0398C34425o2456J916Q5663j25935K16601j37616H8803
16384D29940k05693N9885K01672j04348L2000A79532M9401J16009A9008O59069
16374F78077k41036G7095J16549E2606M06628J04813A99552E6711b6951B76125
16363E54063A77391m0193L12915B08092I7430e6723C51804J62753k31272A41554
16352C34470N4648G874M70136a79634B05648K07545H0037L16718j06244A31413
16341A58063p776K57812E6685L56898E8897d4563C11940k3868B3600L78145q0528
16330C21217m6368A33618J98350j14959a04543B05810I0862K0539F505K60041
16320B66546A17566J2357K54K98921A34327K69498a57831I7821J48353m513N9186
$$ y = [551910, 115245, 199662, -90398, 334425, 271969, 273885, 359548, 233613, 450214, 312598, 88803, 429940, 224247, 284132, 485804, 381456, 413456, 179532, 228933, 344942, 19008, 678077, 437041, 77095, 193644, 52606, 459234, 564047, 199552, 56711, -26951, 276125, 554063, 177391, 137198, 450113, 208092, 97430, -56723, 351804, 514557, 283285, 141554, 334470, 389118, 7874, 478010, -179634, 205648, 413193, 80037, 396755, 290511, 131413, 158063, 150287, 408099, 56685, 413583, 58897, -44563, 311940, 288072, 23600, 401745, 321217, 274849, 133618, 331968, 217009, -104543, 205810, 90862, 111401, 6505, 266546, 117566, 129923, 130177, 429098, 134327, 403825, -157831, 97821, 246174, 241661, 300847]
16309C00847K61169f4549E99292a26485A09204k6904L69040j07349A45095a09051
16298C65216E2531N7223n0256L65554k10380n350L35566B02786q1436E7067L31873
16287C88940A53576a564k20897A49166O9477c0723B8658K3926J22900l7635d8487
16275B05534R0625I4096N1112J61647P6529H39K85602e930C09121K00323m0808
16264D68636k22922A15034O3453J05095A33200E8838J16854a37179A04565k4329
16254H0236c1406B16363a57631C66061j68706e2881j7099j30878i1519b5706D66375
16242A2044b69723a21429B6737P2936K02244K10991B25091J1108o9441M3110b530
16230b6293A2492a53219A05182K50723j21569H28L28970q2988H3134k7403J57434
$$ y = [300847, 562016, -64549, 599292, -126485, 109204, 82300, 451340, 343991, 145095, -109051, 365216, 52531, 109754, 59498, 425052, 214672, 209322, 544888, 202786, 121350, 57067, 388940, 153576, -1564, -222461, 149166, 218643, -30723, 28658, 52584, 175484, 137849, -48487, 205534, 296159, 94096, 145208, 306855, 383384, 839, 286441, -5930, 309121, 509444, 468636, 245714, 115034, 178487, 283582, 133200, 58838, 175692, -137179, 104565, 80236, -31406, 216363, -157631, 366061, 197355, -52881, -69980, -200858, -91519, -25706, 466375, 12044, -269723, -121429, 26737, 99673, 301917, 512908, 225091, 236199, 166758, 209868, -2530, -26293, 12492, -153219, 105182, 355905, 234336, 828, 329798, 246810, 83134, 55731, 213165]
16219B13165A226O3187g1427n432E7999J85501J55159d981j83722f7794F5835
16207C42954F8646J37534H1239A8779K52270b27710f2638b0534D38452A32876
16196F6530a31687G5345J75115q2365h4473c7125F0301J01844O5060k1204H5161
16184C98557e5669b589j08238A5226L982L61114H2782J05097g1273j09619F2741
16172a75586B43383a66351r4549F989d7304A96431C8867r10J376j911M8651h9658
16159B47613H6184m803L8680h8637m6724C769K70080l1310R1092A25694J10563
16148B36257b64838A16362i5299K12F9541J71741a65032D118P0479K2219Q5512
16137A82328a52387P5603H7299a65141A30219C6655L5885j1877B4093a92191c3785
$$ y = [213165, 1226, 64413, -71427, -76859, 57999, 243500, 398659, -4981, -188703, -67794, 65835, 342954, 68646, 206180, 81239, 18779, 271049, -227710, -62638, -20534, 438452, 132876, 66530, -131687, 75345, 250460, 168095, -84473, -37125, 60301, 162145, 227205, 206001, 85161, 398557, -55669, -2589, -110827, 15226, 19208, 380322, 82782, 187879, -71273, -180892, 62741, -175586, 243383, -166351, -260900, 6989, -47304, 196431, 38867, 37957, 39333, 37422, 86073, -89658, 247613, 86184, 81381, 120061, -88637, -135361, 3769, 273849, 242539, 333631, 125694, 236257, -264838, 116362, -95299, -95087, 69541, 241282, -165032, 4118, 74597, 96816, 182328, -152387, -76784, 87299, -165141, 130219, 36655, 72540, 60663, 24093, -192191, -33785]
16125B51071c8580A29343k2030e1923D8957J36707d7714q8334N398p9751E8940
16113A90186C5039N3695B6923L4576L9754M09217b5477J1775j5891J2279E3713
16101A61124f6794B09036A3739c10184D24439a86021b6494B55950n8311F4328
16090B37643A870N2422o224r329b98964D5366L29532F588M3308L8999d65882C3563
16077a0554k06043D0251J9096Q2700f301j90126D01445A60003o8068L0386K7021
16066A49342K6542J66319b10041L6176A48431a126l44821j0802J72435A38553
16055d0364G7291B166K20499G3510J7403C2457b00651E7882i9679l0468k01100
16044c31247C7915j6073J06323b681A84290c9044m35723b18123B6413J13742a72444
$$ y = [251071, -38580, 129343, 107313, -51923, 48957, 185664, -47714, -136048, -130650, -210401, 58940, 190186, 35039, 88734, 26923, 61499, 101253, 510470, -25477, -13702, -29593, -17314, 53713, 161124, -66794, 209036, 13739, -310184, 424439, -186021, -26494, 255950, 197639, 64328, 237643, 1870, 54292, 48068, 38739, -298964, 45366, 374898, 6588, 49896, 88895, -465882, 33563, -10554, -216597, 40251, 59347, 142047, -6301, -196427, 401445, 160003, 91935, 122321, 149342, 175884, 342203, -210041, -173865, 148431, -1126, -345947, -356749, -184314, 138553, -40364, 77291, 2166, 222665, 73510, 90913, 32457, -200651, 57882, -99679, -130147, -331247, 37915, 21842, 128165, -2681, 184290, -39044, -474767, -218123, 26413, 140155, -172444]
16032e2275l03358d8548r7160f9984D9207a91410f6056m103k40345R8880a05639
16020a91862C7470i3191B18667b50715g8035J4626A72790e3452p6712Q803r5008
16009b16369J03690F5903i1368k1234B42772a13169o3518A2294b85597M0578L9007
15998b06012G4242a68764E9041a52538j40413i4838a9220m39062C0568a68972
15987b83361G1338J11818a2946A77560A9548K11394i2489C62129j80452q155b7840
15975H9663A2272P3581M7615J04458b61273q6158C34458a11138K2744j07943B45244
15963A9510Q8485i5323I5465A4064J59146b62134F03202d9646k80593B03105a16
15951A827b41668a2925k55535a13677F8648A9291a91879Q3961j82424e6707l61225
$$ y = [-52275, -355633, -48548, -145708, -69984, 49207, -191410, -66056, -70159, -310504, -211624, -105639, -191862, 37470, -93191, 218667, -250715, -78035, -63409, 172790, -53452, -130164, -121361, -216369, -112679, 65903, -91368, -112602, 242772, -113169, -176687, 12294, -285597, -245019, -206012, 74242, -168764, 59041, -152538, -292951, -94838, -19220, -458282, 30568, -168972, -283361, 71338, 183156, -12946, 177560, 19548, 230942, -92489, 362129, 181677, 173522, -27840, 89663, 12272, 85853, 133468, 237926, -261273, -347431, 334458, -111138, -88394, -196337, 245244, 19510, 107995, -95323, 95465, 14064, 173210, -262134, 603202, -49646, -330239, 203105, -116, 1827, -241668, -12925, -268460, -113677, 68648, 19291, -191879, -107918, -290342, -56707, -417932]
15940d17932b5955j73463C17982A49350E503a9171n4548H2599A9499a06688k77395
15929c84083h1581o1989e0501L459j65329B80994d38897a42842H1623M2078e7456
15917D4255J39524b46497d7219E8673a41265k38294h9041A10911B6395J25459
15907A51854a12730C2469d3252j15295c7267k34070A99269g0828a4355j27938
15897a42293E47446b34582c0347A41966B2721K736b84383i6020j00957c9694B72756
15885D06086i4215A03295a44738j56925a15097j06386L7514q0476c5612G4266
15874c28852A14946B2478Q7265g744k83646h1248A40044i4627l9001b117q6024
15863h8141n0911j6123A19350B3702N2634a86174q7573i4601G0864g622l55304
$$ y = [-417932, -25955, -199418, 317982, 149350, 5503, -19171, -73719, 82599, 19499, -106688, -384083, -81581, -143570, -50501, -47042, -212371, 280994, -438897, -142842, 81623, 123701, -57456, 44255, 183779, -246497, -47219, 58673, -141265, -379559, -89041, 110911, 26395, 151854, -112730, 32469, -43252, -158547, -37267, -271337, 199269, -70828, -14355, -142293, 547446, -234582, -30347, 141966, 22721, 25457, -284383, -96020, -196977, -39694, 272756, 406086, -94215, 103295, -144738, -301663, -115097, -221483, -183969, -264445, -35612, 74266, -328852, 114946, 22478, 109743, -7744, -291390, -81248, 140044, -94627, -133628, -2117, -88141, -139052, -155175, 119350, 23702, 76336, -186174, -273747, -94601, 70864, -7622, -362926]
15852c62926a05468L0358B77130E5646K27986b66154C03771b74376J15641A93332
15841d57038a42416j29677q1646a24496B04384a6848A35134c27259P8892B06840
15830A44111k6609a40339N8111A13408i877k42204c2924j55491f9932B8304O4204
15819I2508a67014a4839j69103A2354a5290n975k14638E0132i2008i500j68359
15808a77859A10622i1457k01653k77683h745A11889m238b8294l7597B19059O8511
15797B87570a38777o4282A78781a73301B74871a40301A15382d5997o7396A87143
15786c00724a37037I7714R2480b02192J9568A09359b63844J8001A85858a41880
15775A64228b18771O0554a014A48493L6090q3169m7922K59495D9699B1777h3967
$$ y = [-362926, -105468, -75110, 277130, 55646, 283632, -266154, 303771, -274376, -158735, 193332, -457038, -142416, -272093, -353739, -124496, 204384, -16848, 135134, -327259, -248367, 206840, 144111, 117502, -140339, -82228, 113408, -9877, -252081, -32924, -188415, -69932, 28304, 92508, -167014, -14839, -183942, 12354, -15290, -21265, -235903, 50132, -92008, -9500, -177859, 110622, -91457, -293110, -570793, -8745, 111889, 107651, -28294, -65891, 219059, 287570, -138777, -203059, 178781, -173301, 274871, -140301, 115382, -45997, -113393, 187143, -300724, -137037, 97714, 190194, -202192, -182624, 109359, -263844, -245843, 185858, -141880, 164228, -218771, -158217, -1014, 148493, 184583, 101414, 53492, 312987, 49699, 21777, -83967]
15763a80621q9732a29572B8240b64880a32167C6749J07112a34590M0072j4086
15753a08604j73072B18727A09231J1013b45297h3275l42945a56585g5798K7887
15743d7911I6023a61299A98956A5369b97195J22289D5292I539a57113d2500K1067
15732b1433H3630J18773p6973k6059b38552d1887A89910o3971b5987I2948a17388
15720b37130B6223a31003j57178N0389I4924a34335j19375j17373c7000j29271
15710a66271J4501A72025b43130e0670A67881d33114b4689j03478D03443a63809
15699h5723K2634j26161h5804B39172a63371A58788F5936b29787n4585N4514F4139
15687A22287a22551j11618M2993c6464A22152b32681g8125C18119g6200B28323
$$ y = [-180621, -270353, -129572, 28240, -264880, -132167, 36749, 143861, -134590, -94518, -108604, -281676, 218727, 109231, 120244, -245297, -83275, -426220, -156585, -75798, -47911, 96023, -161299, 198956, 15369, -297195, -174906, 45292, 9539, -157113, -42500, -21433, 83630, 202403, 125430, 99371, -238552, -41887, 189910, 125939, -25987, 92948, -117388, -237130, 26223, -131003, -288181, -237792, 94924, -134335, -253710, -371083, -37000, -166271, -151770, 172025, -243130, -50670, 167881, -433114, -24689, -128167, 403443, -163809, -85723, -63089, -189250, -85804, 239172, -163371, 158788, 65936, -229787, -284372, -229858, 64139, 122287, -122551, -234169, -191176, -36464, 122152, -232681, -78125, 318119, -76200, 228323]
15676b72689D15075b14161A33269k8971b5788E3047a25604A64483b8478j72077
15666b00555j76890a40593A77976a3427j32000j01288I6708K81022A7156d76294
15655d9976E9213b32728l091j8619j67748E9940i412j67436l8440j03433A83881
15643a23040C4887A035J16463a97415d7792l95596a46830j68952e0974j49150
15633b00124A11354l538c5473J1093j71370C11276A19555h269j26672N3307A78340
15621C6560K1921b47398D1712J02357D5137J3247a65754A36288n2531c3568A258
15609A10562a53089B47608G0711J6479M0882a33746m3065m47274B3272e5374A16495
15597a76473a4774k26341A01160d2343j2279C35261a44231A91973j6858a45793
$$ y = [-272689, 415075, -214161, 133269, 104298, -25788, 53047, -125604, 164483, -28478, -200555, -377445, -140593, 177976, -13427, -145427, -246715, 96708, 377730, 17156, -476294, -49976, 59213, -232728, -235819, -254438, -422186, 59940, -9412, -176848, -215288, -318721, 183881, -123040, 34887, 1035, 117498, -197415, -47792, -443388, -146830, -315782, -50974, -200124, 111354, 107816, -35473, -24380, -195750, 311276, 119555, -8269, -134941, -81634, 178340, 36560, 58481, -247398, 41712, 144069, 45137, 58384, -165754, 136288, 83757, -33568, 1258, 110562, -153089, 247608, 70711, 87190, 128072, -133746, -176811, -624085, 23272, -55374, 116495, -176473, -14774, -241115, 101160, -42343, -54622, 335261, -144231, 191973, 175115, -145793]
15586A20609r982a8870o2221G1104J05739A4779J937J9488J08340C9245b00282
15574F7812n666L0591a29860a9637A0316e02889e950m2358j64147H3504F116i2748
15561b4224F746L54249G8111J45886E8207i1339L6678C96571A8530d28886a68618
15549e9604H6823p860a95751O7517F719D83c02838C4355a42142O982f7409n8073
15537a25482B5643a56579b7022n115l554A46513E1218K74968c44900A94830d92851
15525a50808q9192C74778A17706b13124a5360j83958G0676K10510B0345m997h9440
15513B0477a3772j41075j7335N9013g874B2919Q9260K2110n7372Q8563G4527P8426
15501A52953E5748q578b60675O9906L5766E2161b54478A68457M0058a99319E5939
$$ y = [120609, 110627, -18870, -81091, 71104, 176843, 14779, 16716, 36204, 144544, 39245, -200282, 67812, 62146, 92737, -129860, -19637, 10316, -502889, -5950, -48308, -212455, 83504, 6116, -92748, -24224, 6746, 360995, 78111, 223997, 58207, -91339, -54661, 396571, 18530, -428886, -168618, -59604, 86823, 78963, -195751, -128234, 6719, 483, -302838, 34355, -142142, -135160, -67409, -125482, 25643, -156579, -27022, -32137, -35691, 146513, 51218, 326186, -344900, 194830, -492851, -150808, -240000, 374778, 117706, -213124, -15360, -199318, 70676, 281186, 20345, 15348, -89440, 20477, -13772, -154847, -172182, -113169, -7874, 22919, 112179, 134289, 76917, 165480, 74527, 152953, 55748, 47170, -260675, -190769, -155003, 52161, -254478, 168457, 208515, -199319, 55939]
15489A08032j7896a50074d2869G3066L7638C7210a20889e417E06885C8594J76643
15478B15237b37047E2982K80287i3655F419K55011D5713K08669J59134A0373K9263
15467C9636q318g6513F8208b33750I7715a70085B0361J9219K15721b44265H4702
15455a95676g9205j74057M5681h2505C04600G7671c71734a03110A71207L3286
15445B04493c1147A20914f9963B65995C4819h8825A64629J2753b3822j3980A53591
15433F696a22896j40402i0796A19191K0586N3362b02940R5684a4976k2743G0881
15421b62032h457B17209i1036A204J26712R4004A06229b57733E063b050F6233
15409A99717H7127a36985k50261D4859f8345k74796R8053b0682p7821F7679P6408
$$ y = [108032, 90136, -150074, -42869, 73066, 110704, 37210, -120889, -5417, 506885, 38594, 215237, -237047, 52982, 333269, -93655, 6419, 261430, 45713, 254382, 413516, 10373, 39636, 31318, -76513, 68208, -233750, 97715, -170085, 20361, 39580, 255301, -244265, 84702, -195676, -79205, -253262, -207581, -82505, 304600, 77671, -371734, -103110, 171207, 204493, -31147, 120914, -69963, 265995, 34819, -88825, 164629, 177382, -23822, -37802, 153591, 6696, -122896, -263298, -90796, 119191, 139777, 193139, -202940, -107256, -14976, -37719, 70881, -262032, -8457, 217209, -91036, 1204, 127916, 221920, 106229, -257733, 5063, -2050, 66233, 199717, 87127, -136985, -387246, 44859, -68345, -343141, -245088, -20682, -98503, 67679, 144087]
15398A44087F5967m642J91450d7416k9259H6504J55063P800I0027a08303A49941
15386g6635A93401j2525R798c109A15382f4775p9520C483J59473b89673c6655
15374G9804K29045j8267I3893a67025L0261q9493C4869P0498J3775m8680P4775
15363A45237a26905A20511L1614F6909K69911j41563a75601J9152P5605B49949
15352A33786j6202f8642C5590O1847J63424b08849A96445E4446B590b29550B053
15340A16010J77293a62924F0795a81144B0012J89727r6998h165C29928b95923
15329A19408E8235J62826e5897a7821G6367N3047a49741M9016C0656K19853h2189
15317d5182l2016c5132K532C453K94856E7694K85965G3592C1640K38796h9980
$$ y = [144087, 65967, 61325, 252775, -47416, -76675, 86504, 241567, 249367, 90027, -108303, 149941, -76635, 193401, 180876, 190674, -3109, 115382, -64775, -144295, 3483, 162956, -289673, -36655, 79804, 308849, 290582, 93893, -167025, -136764, -226257, 34869, 105367, 119142, 70462, 145237, -126905, 120511, 152125, 66909, 336820, 195257, -175601, -156449, -80844, 249949, 133786, 117584, -68642, 35590, 97437, 260861, -208849, 196445, 54446, 2590, -229550, 2053, 116010, 293303, -162924, 60795, -181144, 20012, 209739, 112741, -8165, 329928, -295923, 119408, 58235, 221061, -55897, -17821, 76367, 129414, -149741, -100725, 30656, 250509, -82189, -45182, -77198, -35132, -32600, 3453, 298309, 57694, 343659, 73592, 31640, 270436, -89980]
15305e330A64897f7556b7846D71073e4183C52751H078L14336a85299b505A26459
15293F4726C0740K17635A042Q7613l0931i4270C23549g780A86042A6095d1168
15281F0612K89568A38429F0543Q5876b08860l8333A15612h6554C8580J92934K3657
15270B55171c28077F5166k8464i4894B23329e524E0688K72992J2786A46209F3773
15258b23129e9189J9171G2686M919i0328c470C82989A54102C6295K14375L08284
15247E58954J43694J341448O74448q66013R54754j378248E86887B48046A07831
15237A27882d5938k469j55892A14802J92595M7048j49260I8933B4977a44379B31197
15225a5889k70826D18388H8749a74837D1492L30187j16622d5553A0958J30517
$$ y = [-5330, 164897, -67556, -27846, 471073, -54183, 352751, 8078, 322414, -185299, -2505, 126459, 64726, 30740, 248375, 1042, 88655, 57724, -94270, 323549, -7780, 186042, 16095, -41168, 60612, 350180, 138429, 60543, 146419, -208860, -247193, 115612, -86554, 38580, 231514, 255171, -328077, 65166, 36702, -94894, 223329, -5524, 50688, 323680, 336466, 146209, 63773, -223129, -59189, -40018, 72686, 77605, -90328, -3470, 382989, 154102, 36295, 250670, 558954, 702648, 2044096, 2718544, 1852531, 2807285, 1429037, 586887, 248046, 107831, 127882, -45938, -48407, -204299, 114802, 307397, 354445, 205185, 98933, 24977, -144379, 231197, -15889, -286715, 418388, 88749, -174837, 41492, 371679, 255057, -45553, 10958, 141475]
15215A41475F1640K12597A16190m432K5306P8444c9019G3932j6353J31430L1969
15204B20978k3887a3106A98302a02099A39701a26075G840i9298G9691J38004h6085
15192G5204k3867a01438n7052A4480K15849n6178q802E0403K72640I2246N6447
15181A48693J05799C0246L57262a05343B29139J15268I8375L3870b74466g1184
15170F4394J51062D0349K3773b3291B15765I8204d001n804C1442g672C01544k8654
15158B72890K4046q6713f9722B62217J32271l6434A26350J13521j06354f5347
15147g7890B92928j07809n2743L6616e8168G8564l1185M4836R2690D0031J56543
15136A96574E564J58019j5732o4927L63317A55202Q114J50028m4610Q781G7760
$$ y = [141475, 61640, 274237, 116190, 111758, 137064, 215508, -39019, 73932, 57579, 189009, 220978, 197091, -13106, 198302, -102099, 139701, -126075, 7840, -99298, 79691, 217695, -86085, 75204, 51337, -101438, -158490, 14480, 230329, 174151, 165349, 50403, 323043, 92246, 148693, 254492, 30246, 387508, -105343, 229139, 344407, 98375, 132245, -274466, -71184, 64394, 215456, 40349, 64122, -23291, 215765, 98204, -4001, -9805, 31442, -7672, 301544, 272890, 296936, 210223, -69722, 262217, 394488, 358054, 126350, 239871, 133517, -65347, -77890, 292928, 185119, 132376, 168992, -58168, 78564, 47379, 92215, 184905, 40031, 196574, 5564, 163583, 147851, 82924, 446241, 155202, 163316, 313344, 268734, 277515, 77760]
15124B19487h4971D60667o7223j95978J8099K6489m0050c2554A29600E157b7554
15112A83319Q2911L6566E6872B8060g224A9782J39036b56845J4283G6850O4602
15101A41452P6927I1657K06825j45263L7430N0105O3765i2592A30392K51642J04503
15090D86537c2275I6112j6590B9103J98481C5875J01316F7432h9137M3482B94385
15078a9286j94332A84912L5157K4563p0079D2012J05891h0740A72063K16855j22538
15067B66380j26757g1401C15895j57688J36624F4326J67229C3365f7265B12739
15056A6462d3564B75826j13745C6657a88622C25252j40677O2649j8287j01604
15046A27333M15650B07431J5444K41202j58226f0317C66164q412j11156d3717
$$ y = [219487, -84971, 460667, 393444, 197466, 215565, 242054, 202004, -32554, 129600, 5157, -27554, 183319, 266230, 302796, 56872, 28060, -7224, 19782, 158818, -256845, -242562, 76850, 141452, 218379, 91657, 298482, 153219, 190649, 240754, 304519, -92592, 130392, 382034, 486537, -32275, 96112, 79522, 29103, 227584, 35875, 137191, 67432, -89137, -45655, 294385, -19286, -213618, 184912, 220069, 244632, 174553, 42012, 147903, -80740, 172063, 388918, 266380, 139623, -71401, 315895, 158207, 294831, 64326, 231555, 33365, -67265, 212739, 16462, -43564, 275826, 162081, 36657, -188622, 325252, 184575, 247224, 228937, 127333, 542983, 207431, 222875, 464077, 305851, -60317, 366164, 357752, 246596, -43717]
15035h2380B44968J60292A32695L44689B08986L78371G0377J92789I2089a17415
15024E24676A90727J86019A21517B7126L01933c5429B73816O8863A67931k7080
15014A40851K1965L1315M3322h6627K8311E3499J24010j8472o8641J27792r9592
15003A18596L246r892k3509K19552P3426a2042A89979K94463a26344A33506N76078
14992G09584B37047H4081N8477P1381J44965J40005E7625J58127r2428l556J92349
14981C12117k7390k8604K6134J41514e3791D29992B11469b0875q9887C05708j12141
14970A93567L06029j58762A63163f038D63567A34708K41473l6783i2171B63481
14959A60436J22470K206J30973K07942k99198l6658k1276p4695K64489n3776j29906
$$ y = [-82380, 244968, 405260, 132695, 477384, 208986, 587357, 70377, 263166, 92089, -117415, 524676, 190727, 376746, 121517, 27126, 329059, -35429, 273816, 342679, 167931, 140851, 162816, 194131, 237453, -86627, -58316, 53499, 177509, 159037, 90396, 218188, 118596, 121842, 111950, 88441, 307993, 381419, -12042, 189979, 484442, -126344, 133506, 709584, 237047, 84081, 142558, 213939, 358904, 498909, 57625, 215752, 123324, 119768, 312117, 284727, 256123, 282257, 423771, -53791, 429992, 211469, -20875, -110762, 305708, 193567, 499596, 340834, 163163, -6038, 463567, 134708, 376181, 339398, -92171, 263481, 160436, 282906, 285112, 416085, 624027, 324829, 288171, 266895, 192200, 456689, 402913, 273007]
14948B73007m5168K60685d7043B82044g0493H003K93500n0506L7835L47897A00028
14936D77240n8417A35820M27883k66023D210L55425m5481J51430k29280K4105
14926B60409K88355A32906K54923K7092R8937B08012K66107Q8783A92472K93291
14916D85763k19656n2527K14814F9634c1854C02527M5066J54496Q4376O9662B04352
14904F16585k33049J16556F438N48091A06625K65996R5305A68851J87617C0741
14893D73788j21981f9844A43125K69806L6064K9831o283j25364j16361J0736o5113
14882A76441L35027G0861M26756j06964j56983J48000K48202k10181A71403L62412
14872E33815o3842P6418j56811j3090L3083J86136B96425L32864C10983J80387
$$ y = [273007, 227839, 488524, -47043, 282044, -70493, 8003, 301503, 250997, 288832, 636729, 100028, 477240, 418823, 135820, 563703, 297680, 4210, 359635, 314154, 465584, 236304, 260409, 548764, 132906, 387829, 414921, 513858, 208012, 474119, 562902, 192472, 485763, 266107, 213580, 428394, 69634, -31854, 302527, 347593, 502089, 586465, 656127, 204352, 616585, 383536, 500092, 6438, 554529, 106625, 372621, 467926, 168851, 356468, 30741, 473788, 351807, -69844, 143125, 412931, 448995, 478826, 472543, 347179, 230818, 241554, 176441, 511468, 70861, 497617, 390653, 233670, 381670, 629872, 419691, 171403, 533815, 469973, 546391, 389580, 376490, 409573, 595709, 296425, 629289, 310983, 491370]
14862D91370l0419A33729J13449M33517k44801J79580B22573K4268J34178A64802
14851E85009r6884j47737j13544k2384J50365J74035k42197M03464j42579B27555
14840A56210N45987k34986J02467Q1282k09765P2416j14578J78407Q4552j07781
14830E54211A89447O45433B77703J74784K06402j14746J17757l11848K45640p2919
14820E22773N3773j14005o8602K52203j20355j07789K42257J22378C89799K83044
14810F72843B54743L05951j60495J48229j01249B04223K51444K08957B60337L81863
14800F42200j60758K13205k52494l6129n9089M28426O3330j18564l00907N29450
14790I48670m05897K00272l05494J13956K05232B53476M68838j44515L8457r2501
$$ y = [491370, 460951, 133729, 247178, 680695, 435894, 615474, 222573, 246841, 381019, 164802, 585009, 488125, 340388, 226844, 204460, 354825, 528860, 286663, 690127, 547548, 227555, 156210, 702197, 467211, 569678, 650960, 441195, 513611, 399033, 577440, 661992, 554211, 189447, 834880, 277703, 452487, 658889, 544143, 661900, 350052, 595692, 522773, 576546, 462541, 393939, 646142, 525787, 417998, 660255, 782633, 389799, 672843, 254743, 560694, 400199, 548428, 447179, 204223, 455667, 664624, 260337, 642200, 481442, 694647, 442153, 406024, 346935, 775361, 838691, 720127, 419220, 948670, 542773, 743045, 437551, 551507, 756739, 253476, 722314, 577799, 616256, 523755]
14780E23755n6111J27430J67005k11097n0862o427M13285k84216L5170L87587
14770A045519l06107K6075k18774P8606K48651C86897L35767B86309L59936J81976
14760H28221k4989j09001o2020j17291L12967C56117L94964j07232j66424K60071
14750G37496J75819l8226N5022l18274J59396j97272O3994j28060B08435N34180
14740G42615k14380O9091K00500k66801L54672j39154K35624m58282K84238k772
14730H05351l9310o2617k2614K22264M3202k68939L97773J9670m03724J11766
14720H02822R5812j79641o8607L65744O7738j40245j08827P1566m9860J18530
14710I75032j57522k84259L76331o7175M250J90552M3654J78518l96025j7393
$$ y = [523755, 467644, 595074, 762079, 550982, 500120, 493693, 906978, 622762, 657932, 1045519, 739412, 765487, 546713, 625319, 873970, 386897, 722664, 286309, 646245, 828221, 803232, 694231, 632211, 514920, 827887, 356117, 751081, 643849, 477425, 737496, 913315, 875089, 930111, 611837, 771233, 573961, 637955, 509895, 208435, 742615, 528235, 597326, 797826, 531025, 885697, 746543, 982167, 523885, 808123, 805351, 766041, 703424, 680810, 903074, 946276, 677337, 1075110, 1094780, 691056, 802822, 898634, 718993, 650386, 1016130, 1083868, 943623, 834796, 906362, 856502, 975032, 817510, 533251, 909582, 842407, 846657, 1037209, 1080863, 1259381, 863356, 845963]
14700H45963m984J08329j47974J99252J71125l85675K14594j62127J9377J89379
14690A047259j90146M44074j30520J6369k27117k23680L41835O8490k19770J47914
14680A074708P1855j89711P4716o0893J82415k61502L77362l19029Q3918j67328
14670H66511O12027m37981j94735J97703O8210K73251k08584N5319L4949J34031
14660A400701j66980L3515j35625L16770l77105J74039j02301K55859o879j53856
14650A238138L3069J94135k57157J58899L20953m72497O6484J11693p5910L08965
14640A626772j02164l87321J14429J86633J23021m0637l1067l26860J03186K50005
14630A515997Q214j67239K80099k71178K18237q4152k35610L12248l82522O9166
$$ y = [845963, 840979, 949308, 801334, 1000586, 1171711, 786036, 1000630, 838503, 857880, 1047259, 857113, 1301187, 1170667, 1187036, 959919, 736239, 1078074, 1146564, 926794, 1074708, 1146563, 956852, 1031568, 970675, 1153090, 891588, 1268950, 949921, 1033839, 866511, 1478538, 1040557, 845822, 1043525, 1111735, 1384986, 1176402, 1231721, 1266670, 1400701, 1233721, 1267236, 1131611, 1448381, 1071276, 1245315, 1143014, 1398873, 1391994, 1238138, 1271207, 1465342, 1208185, 1367084, 1688037, 1215540, 1282024, 1393717, 1317807, 1626772, 1524608, 1137287, 1251716, 1438349, 1561370, 1520733, 1489666, 1162806, 1265992, 1515997, 1524211, 1356972, 1637071, 1365893, 1584130, 1499978, 1264368, 1576616, 1194094, 1263260]
14620A263260O9310K36563k34478K23364M43900k65106k79488L7924m1304N30620
14610A984565j63502K6687k73556Q6362j39748J71107j63994j5461L14572j22310
14600A704722J91127j23994J85365q9799J08999j95250K96071n7579q1263J08497
14590B046896l47870J06976L9708P4152K38036l43516L68071l85691M41228j6494
14580B221496j1303k9423J12949j86209J35260j72137L49196l0318J76606k01530
14570B364587r1379L8029R931J98478j16037K25771Q0052J05066K3628J13030
14560B951156N059k22816L51179L35360K9472K29013j34589O25519M48266O11792
14550E229411R96829K059231L606718P766481J7155171N659239B0147705A0031775
$$ y = [1263260, 1332570, 1569133, 1334655, 1558019, 2001919, 1736813, 1457325, 1495249, 1453945, 1984565, 1821063, 1847750, 1574194, 1660556, 1520808, 1691915, 1527921, 1512460, 1827032, 1704722, 1895849, 1771855, 1957220, 1867421, 1976420, 1781170, 2077241, 2019662, 1938399, 2046896, 1699026, 1806002, 1845710, 1919862, 2157898, 1814382, 2182453, 1796762, 2237990, 2221496, 2210193, 2180770, 2293719, 2107510, 2242770, 2070633, 2419829, 2389511, 2566117, 2364587, 2273208, 2311237, 2321168, 2519646, 2403609, 2629380, 2709432, 2814498, 2838126, 2951156, 2956215, 2733399, 3084578, 3419938, 3449410, 3678423, 3543834, 4169353, 4617619, 5229411, 6226240, 8285471, 11892189, 19658670, 36813841, 42473080, 20147705, 10031775]
14541F906111K100571l851380j364883j129569m39470L29668k78481J6041J6360
14532B304968J43810j89930K52381L46359m05813p6080j23463J08368J16709P5397
14522B552706j15326R601J27032K76187l16785M78823m16877M19675k44702K20383
14512B990717j63498K61440k11087K73225l8701l48866L09296j18153L19068j9766
14502C253675j3434Q8795L9919J69602k21481j81306M06856m442p6101J5761J83013
14491C660857K45599l14668K83189j95261M78062k69906j00660N4953K94310k31351
14481C905124j081J04529L61303J13676r9230k13072L42656l96829L77341K00584
14471D695001l12355M88354P5598k34175L22195j74229J5312J88879Q6519j67919
$$ y = [6906111, 9006682, 5155302, 3790419, 2660850, 2221380, 2551048, 2272567, 2288608, 2304968, 2448778, 2258848, 2511229, 2857588, 2451775, 2375695, 2252232, 2360600, 2477309, 2552706, 2437380, 2446981, 2574013, 2850200, 2533415, 3012238, 2595361, 3015036, 2770334, 2990717, 2827219, 3088659, 2877572, 3150797, 3112096, 2763230, 3072526, 2954373, 3273441, 3253675, 3240241, 3329036, 3368955, 3538557, 3317076, 3135770, 3542626, 3538184, 3462083, 3477844, 3660857, 3906456, 3591788, 3874977, 3679716, 4157778, 3887872, 3787212, 3842165, 4136475, 3905124, 3904043, 4008572, 4369875, 4483551, 4384321, 4171249, 4513905, 4117076, 4494417, 4695001, 4382646, 4871000, 4946598, 4712423, 5034618, 4860389, 4875701, 5064580, 5151099, 4983180]
14461D983180J89122o5042J44365n5521J81117J20939r2047Q8032M04705k26412
14451E672438Q344J10004l08146P66026m38981J35580J51399N6410J39144O7029
14441F359247n3751J51496M824J46321J98586J8789J46772r6560k34262P81070
14431G422532l17104N85473j10002k7299K30864m2549J25946P3057L38961R5912
14421H375791l1949K10224M06688l05149P9508M45912k16178K08429K03916K04917
14411I582109k42621L54905J27176K76023j15570N12026l0204J78806L5537M18740
14401A1096927J48903j39431K44925L09325M59748j30201J45116K80296K66798
14392A2682406K71170j95823K56586N13582J51650R7265M25774M23703j19548
$$ y = [4983180, 5172302, 5107260, 5251625, 5196104, 5377221, 5498160, 5406113, 5494145, 5898850, 5672438, 5680782, 5790786, 5482640, 6248666, 5809685, 5945265, 6096664, 6153074, 6292218, 6359247, 6305496, 6456992, 6461816, 6608137, 6806723, 6825512, 6972284, 6875724, 6641462, 7422532, 7105428, 7690901, 7580899, 7553600, 7784464, 7741915, 7867861, 7940918, 8279879, 8375791, 8343842, 8554066, 8960754, 8655605, 8735113, 9181025, 8964847, 9173276, 9377192, 9582109, 9339488, 9694393, 9821569, 10097592, 9982022, 10494048, 10463844, 10642650, 10678187, 11096927, 11245830, 11106399, 11351324, 11660649, 12120397, 11990196, 12135312, 12415608, 12682406, 12953576, 12757753, 13014339, 13527921, 13679571, 13776836, 14202610, 14626313, 14506765]
14383A4506765J55789Q60091K0251J74977M55459P0861J19423Q89536O1721K28265
14373A7543138L06810L52802J97838Q98852m3340K66594P91702L28076L53566
14364B0996038L91952J44739J036491L70422J24351Q52632K63201N36289O14775
14355B5330890P39441M60679N20533P84037N31815Q58341L32184J202806K14842
14346C0975568J224531N79965R16613Q99342Q89693J132278J001508Q14678R64208
14337C9398384J482819Q21572J583306Q59193J415797J711797Q58225J784568
14329D9915661J577232J470969J826608J831501J720879K228420J978044J878269
14321F4427583K232267K333307K350769K893404K481599L030677K921587L238088
$$ y = [14506765, 14662554, 15522645, 15542896, 15717873, 16173332, 16244193, 16363616, 17253152, 17314873, 17543138, 17849948, 18202750, 18400588, 19299440, 19256100, 19522694, 20314396, 20642472, 20996038, 21387990, 21532729, 22569220, 22939642, 23063993, 23916625, 24179826, 24716115, 25330890, 26070331, 26531010, 27051543, 27835580, 28367395, 29225736, 29557920, 30760726, 30975568, 32200099, 32780064, 33696677, 34596019, 35485712, 36617990, 37619498, 38434176, 39398384, 40881203, 41702775, 43286081, 44145274, 45561071, 47272868, 48131093, 49915661, 51492893, 52963862, 54790470, 56621971, 58342850, 60571270, 62549314, 64427583, 66659850, 68993157, 71343926, 74237330, 76718929, 79749606, 82671193, 85909281]
14313H5909281K988047L730339L397861M114546L953880M270953M824952M649471
14305A17839330M979842N433377N747217N836447O215097O648274P149579P136184
14297A66985347Q223314Q167296Q953039R291719R386861J0399022J1089439J0885502
14289B43381539J2056018J2118887J2859059J3068706J3757181J3776762J4339506
14282C35357658J4088017J4250417J4092139J3680790J2865301J2569458J1859966
14275D28763746R788271Q446060O161552L137680J056290N82786p21724l933710
14267D53280951m741008o267264q639594j0627332j1560106j2825147j3662334
14260C84958166j4481864j4975029j4705119j4973982j4647042j4210855j4092988
$$ y = [85909281, 88897328, 92627667, 96025528, 100140074, 104093954, 108364907, 113189859, 117839330, 122819172, 128252549, 133999766, 139836213, 146051310, 152699584, 159849163, 166985347, 175208661, 183375957, 192328996, 201620715, 211007576, 221406598, 232496037, 243381539, 255437557, 267556444, 280415503, 293484209, 307241390, 321018152, 335357658, 349445675, 363696092, 377788231, 391469021, 404334322, 416903780, 428763746, 438552017, 446998077, 453159629, 456297309, 457353599, 457936385, 457214661, 453280951, 448539943, 442272679, 433633085, 423005753, 411445647, 398620500, 384958166, 370476302, 355501273, 340796154, 325822172, 311175130, 296964275, 282871287]
14253B82871287j3684390j2509026j0091777j2111619j1712921j0394721j0349302
14246B02017531r812096q823607q275276q329548p612760p319870o782486o144006
14238A38917882o119384n310753n499677n212888n046496m346269m376806l520927
14230I9484682l884379m182008l456086l131214l260740k805446l111277k539289
14222G3114243k610333k224802k156859k462579k037478k273071j754294j855229
14214E5739598j470650j535216j505238j852578j525506j449340j138690p84007
14206D4478373j219726j461691j173568r45509j231845p95205o40940j228691
14198C5781198j235990p00602q44588p26836r50493p26833m00768j367852k25768
$$ y = [282871287, 269186897, 256677871, 246586094, 234474475, 222761554, 212366833, 202017531, 192205435, 183381828, 175106552, 166777004, 159164244, 151844374, 145061888, 138917882, 132798498, 127487745, 121988068, 116775180, 111728684, 107382415, 103005609, 99484682, 95600303, 91418295, 87962209, 84830995, 81570255, 78764809, 75653532, 73114243, 70503910, 68279108, 66122249, 63659670, 61622192, 59349121, 57594827, 55739598, 54268948, 52733732, 51228494, 49375916, 47850410, 46401070, 45262380, 44478373, 43258647, 41796956, 40623388, 39677879, 38446034, 37650829, 37009889, 35781198, 34545208, 33844606, 33000018, 32273182, 31322689, 30595856, 30195088, 28827236, 28601468]
14189B8601468q74001m48118q74540m31051q90010l25345o98159p6140p89221
14180B3194883n26832n25011m45805n31030m06761n94249l38919k02986j53808
14171A9469482p92071J45386p63021o195o22697j63281m89723n71209r3973m96531
14161A5616167k26732m59389L7774m48970j80362m698k81199r09m29050m73446
14151A3149186J20360K07749p22985l56709J03912n72360J8528n09213m8271K29818
14141A1620015n58535L2817l30701n0954m36587R8212J71340m38045j01464m33743
14131I572355J43410J08641m08950l24300O4872j16177k18233j21020p6782j37451
14121H486365j15910n7464r4932o5140j85399l01632L06225k77967O7347j71601
$$ y = [28601468, 27727467, 27279349, 26404809, 25973758, 25083748, 24758403, 24060244, 23984104, 23194883, 22668051, 22143040, 21697235, 21166205, 20759444, 20165195, 19826276, 19623290, 19469482, 18677411, 18822797, 18059776, 18053581, 17430884, 17267603, 16777880, 16206671, 16112698, 15616167, 15389435, 14930046, 14967820, 14518850, 14338488, 14333790, 14052591, 14051682, 13622632, 13149186, 13269546, 13477295, 12754310, 12397601, 12501513, 11929153, 11947681, 11438468, 11390197, 11620015, 11061480, 11094297, 10763596, 10712642, 10276055, 10374267, 10545607, 10107562, 10006098, 9572355, 9715765, 9824406, 9415456, 9091156, 9156028, 9039851, 8821618, 8700598, 8623816, 8486365, 8370455, 8312991, 8218059, 8152919, 7967520, 7665888, 7972113, 7694146, 7761493, 7589892]
14111G589892n34419K56331k77566J9934k70921J75820k06139j36972p4949Q5852
14101F626863k02259r1061R461Q3592m82678J3012J85849m5158j6922j73156k95195
14090E612348J78274J57812o94653M59873k0799k68500j2151j09261j66512k13212
14080D923219N9252j64168K68369k19691j57921J51943J24804l02846Q9839j45629
14070D627171l9410K4069j07705k55244K00611r9483j26450m8626K00108l81196
14060C993845J37357R045J04203m26703M07123j42385J3682l32410J67281l29088
14050C601950o9988R5875n8623M2020N9021r8556p9188j71153k915J85073l6324
14039C467192j82954j04185K04922J56089l6820j67594j99812M7891j6256J07207
$$ y = [7589892, 7055473, 7311804, 7034238, 7054172, 6783251, 6959071, 6752932, 6615960, 6541011, 6626863, 6424604, 6333543, 6343004, 6426596, 5943918, 5956930, 6142779, 6097621, 6080699, 5907543, 5612348, 5790622, 5948434, 5253781, 5713654, 5692855, 5424355, 5412204, 5302943, 5136431, 4923219, 4982471, 4818303, 5086672, 4866981, 4709060, 4861003, 4985807, 4682961, 4772800, 4627171, 4587761, 4611830, 4504125, 4248881, 4449492, 4350009, 4223559, 4174933, 4375041, 3993845, 4131202, 4140247, 4244450, 3817747, 4224870, 4082485, 4096167, 3763757, 3931038, 3601950, 3531962, 3627837, 3569214, 3611234, 3670255, 3571699, 3492511, 3321358, 3318443, 3503516, 3467192, 3284238, 3180053, 3384975, 3541064, 3504244, 3336650, 3136838, 3184729, 3168473, 3275680]
14029C275680J97590m7973k42450K32274m20528K44100m15656K67697j99899o7341
14019B823494k5333k48860M11812l49816Q046K47644r2048j05031j1972P3682
14009B731618k72484m8106k0297L72873l34373j32435K35345j9494j16637J45080
13999B541090j36034J27198k67105K81229J94184m21876J83494J19465M61383
13990C083028j76558J475490K580171O508203J7009251J3591655j8352456j1847733
13982A3871051m920244k329496j465652p26400m77907m85987J3438q4612k88940
13973C105251k50947l39208O79084m16565l99133O00863j19298l37629K47676
13964B770094j42754k2005j84227l03324L99483k90528J33571k50173P3631K57260
$$ y = [3275680, 3473270, 3425297, 3182847, 3415121, 2994593, 3238693, 2823037, 3090734, 2890835, 2823494, 2798161, 2549301, 2961113, 2611297, 2619343, 2866987, 2774939, 2669908, 2657936, 2731618, 2459134, 2411028, 2390731, 2763604, 2429231, 2296796, 2532141, 2512647, 2396010, 2541090, 2405056, 2532254, 2265149, 2546378, 2740562, 2318686, 2502180, 2621645, 3083028, 2906470, 4381960, 6962131, 13470334, 30479585, 44071240, 25718784, 13871051, 8950807, 6621311, 5155659, 4429259, 3951352, 3465365, 3478803, 3394191, 3105251, 2854304, 2515096, 3194180, 2777615, 2378482, 2979345, 2860047, 2522418, 2770094, 2627340, 2605335, 2421108, 2117784, 2517267, 2226739, 2360310, 2110137, 2183768, 2441028]
13954B441028l25233m2173o9423n5815L47589m37814J70947J80781l71130J13190
13944A951947k56781L40506l79104K60278j03004N0407K5474j38495n6646P9314
13934A773896J21288j83227J41784l61849O9221L05511m86027Q2815Q1763L53534
13924A898709j43667l41232J83155j53607P9567l5239j33525K33329j71221L38740
13914A755009k68779p3288L42386k35625J55775j97112j586J52977j01835l00857
13904A227065M65885n1649K2902l74215L07461n0672L50879m21699R9124q7680
13894A487401k57224p3260J89881J39789l71472K26625m843k44749L89258k64762
13884A216644j06028j18314J27711K69636O9468j55578j55851j15000R8558M5653
$$ y = [2441028, 2115795, 2073622, 2004199, 1948384, 2295973, 1858159, 2029106, 2209887, 1838757, 1951947, 1695166, 2035672, 1656568, 1916846, 1813842, 1864249, 1889723, 1751228, 1694582, 1773896, 1895184, 1711957, 1853741, 1491892, 1561113, 1866624, 1380597, 1463412, 1545175, 1898709, 1755042, 1413810, 1596965, 1443358, 1522925, 1487686, 1354161, 1587490, 1416269, 1755009, 1486230, 1412942, 1755328, 1519703, 1675478, 1478366, 1476780, 1629757, 1527922, 1227065, 1692950, 1641301, 1664203, 1289988, 1597449, 1546777, 1897656, 1475957, 1575081, 1487401, 1230177, 1156917, 1346798, 1486587, 1115115, 1341740, 1336897, 1092148, 1481406, 1216644, 1110616, 992302, 1120013, 1389649, 1459117, 1303539, 1147688, 1032688, 1131246, 1176899]
13874A176899n631K68609l88004J5535K66634o1878O9943l89303L30946j70679
13864A113071M2575P2497k27818r8425L12158j08387n8666L2960j27497J69962
13854A122430j21466K68817l44229N9806p3141M2508K76011r1065Q0070o4757
13844A154984L8000J3923k130q1259k04194K27760j43413M494j60403L64410l7818
13833A174354J8042j9608m18679k0723L1086j3764N18759j81917k22655k1604
13823H43291J50713D11907K0936P01766j42403L12741n07553N07622m44398J54680
13813A015298K59370m59188R739J50653J2073M5999n5321k0998J56570j06641
13803A007554j71362p3771j47113M76082k27877J73107m28582K61816j17555N6372
$$ y = [1176899, 1171268, 1439877, 1051873, 1067408, 1334042, 1272164, 1342107, 952804, 1283750, 1113071, 1155646, 1228143, 1000325, 901900, 1214058, 1105671, 1047005, 1079965, 952468, 1122430, 1000964, 1269781, 925552, 985358, 912217, 954725, 1230736, 1139671, 1219741, 1154984, 1192984, 1206907, 1204777, 1123518, 919324, 1147084, 1003671, 1008165, 847762, 1212172, 1174354, 1192396, 1172788, 754109, 733386, 764472, 750708, 1269467, 1087550, 864895, 843291, 994004, 411907, 432843, 1134609, 992206, 1304947, 797394, 1305016, 860618, 1015298, 1274668, 815480, 825219, 975872, 987945, 1033944, 978623, 957625, 1114195, 1007554, 836192, 762421, 615308, 1091390, 863513, 1036620, 608038, 869854, 752299, 808671]
13793H08671K88422E43050L44005K32816D62327K09188k71368K74912N7161K30350
13783I62570k55811Q6324L57968l72096j35580J57108j80936K59321j08636k66501
13773E03731L65239l16720L06363B83679O22661K3429l37790m7727L14464j10603
13763G48113k32571J66703L45694D02142K07924R419o2995A65756M11219Q1575
13753F58550n2964j44152M19207k44984n5203K8265j06268J26844O8441p277L3631
13742G24090k42535K41007l07090J49884m3500L14633l11184K51649j51834l06038
13732C19082K42404n2244Q0707j17782R4523L48137D27522N87211D37968K85790
13722G23758m1130P7492J43527j04978j37266r6645j68088J75996O7937j03457
$$ y = [808671, 1097093, 543050, 887055, 1119871, 462327, 671515, 400147, 675059, 732220, 962570, 706759, 793083, 1151051, 778955, 643375, 800483, 619547, 878868, 770232, 503731, 868970, 552250, 858613, 283679, 906340, 929769, 591979, 544252, 858716, 748113, 515542, 682245, 1027939, 402142, 610066, 619485, 556490, 165756, 576975, 658550, 605586, 461434, 880641, 635657, 580454, 608719, 502451, 629295, 697736, 690459, 724090, 481555, 722562, 415472, 565356, 521856, 836489, 525305, 776954, 625120, 319082, 561486, 509242, 589949, 472167, 566690, 914827, 427522, 1014733, 437968, 723758, 682628, 760120, 903647, 798669, 661403, 564758, 396670, 572666, 640603, 537146]
13712E37146j64999O67417j68796l65732N196J87472k9805n2143N3160j90393
13702D78523J62738O6670q1847m6773r1933K656L28852j00416B39122N65279l58325
13691D46076k6401K84121n3678L2263C00658P0010R8373J20172J78841j90942
13681E77112j49021m7016K36046k05727L71952k23181J33227k13472p8736j3845
13671C87339q8187j25602M57540l374p5217j35896J44642j96043p6018L25758
13661F14942j20646R278K87487k90192j70643j11333J01279J05014K09260p3462
13651E60984K7555j20180J95990B03641O24424l59533m8602K32666B29218K69061
13641D98279K25538l19089j5760J24295O8731A63976M19386B12072K49549J20714
$$ y = [537146, 372147, 1039564, 870768, 505036, 510232, 697704, 667899, 615756, 668916, 478523, 641261, 707931, 626084, 579311, 487378, 490034, 818886, 718470, 239122, 804401, 446076, 419675, 703796, 650118, 682381, 300658, 370668, 469041, 589213, 768054, 577112, 428091, 381075, 617121, 411394, 783346, 560165, 693392, 479920, 401184, 387339, 299152, 173550, 631090, 627716, 552499, 416603, 561245, 365202, 289184, 614942, 494296, 503574, 791061, 500869, 330226, 218893, 320172, 425186, 634446, 560984, 588539, 468359, 664349, 203641, 828065, 468532, 419930, 652596, 229218, 498279, 723817, 404728, 388968, 513263, 581994, 163976, 583362, 212072, 461621, 582335]
13631E82335A81375P8325N13493l16549p5087r8855K04298J13440j15345j2340
13621D72755M73721C70397Q3100j1417P5247A66332J18252D6092M01496j26818
13611C20770Q3902K3809o6280n0131n8813K86529j53746l9043N541k2046c3060
13599A52873m6819N21407f315D81474N487j45676j3472M9316K11211B84275m099
13588B80176J58590m2417j45379L9205j09164d8262A69328K16727l3753A55181
13577E16704J15304C04295L00430j82786K28133j01070j21935o0075J74351j54955
13567C86388K42407j06254j65408N9282m4552J53091j74865J57269C3589L44235
13557C77824A00180K32540n5769R9748E2011L20992A63382K69291H7173K49819
$$ y = [582335, 181375, 259700, 773193, 456644, 381557, 282702, 487000, 600440, 485095, 472755, 946476, 370397, 453497, 442080, 517327, 166332, 284584, 46092, 447588, 320770, 404672, 428481, 362201, 312070, 253257, 539786, 386040, 346997, 352538, 330492, -33060, 152873, 106054, 627461, -6315, 481474, 486961, 341285, 327813, 377129, 588340, 284275, 280176, 438766, 396349, 250970, 290175, 181011, -48262, 169328, 386055, 352302, 155181, 516704, 632008, 304295, 604725, 421939, 650072, 549002, 427067, 366992, 541343, 386388, 628795, 522541, 357133, 416415, 371863, 524954, 350089, 507358, 33589, 377824, 100180, 332720, 276951, 376699, 52011, 373003, 163382, 432673, 87173, 336992]
13547C36992j33871p6844K86339K17623k75173k0947q8524G4743L89637A11893
13536E1724J60334K2625A11860J66567M00160k37744G2407k5311K46578O3410
13526C57084L6033j30654F9644L34341j46228p4580R8844R0272C6184R9914Q2234
13515B18332P6841g8443C32540j28773I1039J58217K46757A53735P1884N10643
13505G36262j71297A75645L23297j27122A69302L88028o9862L330j28134A68440
13494D42950A01938J95779j17916K13521A19625M42379j0927J6595k29493Q0770
13484D18949J61444B20989K5541K0543j3640K68359j43777o4163K55032A37100
13473H1339K21656j23421J03350k7827K70369B33330P5133j32641K0180K34229
$$ y = [336992, 203121, 126277, 412616, 630239, 355066, 334119, 245595, 74743, 464380, 111893, 51724, 212058, 234683, 111860, 278427, 678587, 440843, 72407, 47096, 293674, 357084, 393117, 262463, 69644, 403985, 257757, 183177, 282021, 372293, 36184, 136098, 218332, 295173, -78443, 332540, 203767, 91039, 249256, 496013, 153735, 225619, 736262, 564965, 175645, 498942, 371820, 169302, 557330, 487468, 490798, 362664, 168440, 442950, 101938, 297717, 179801, 393322, 119625, 562004, 551077, 567672, 338179, 418949, 580393, 220989, 246530, 267073, 253433, 521792, 378015, 313852, 568884, 137100, 81339, 302995, 179574, 282924, 255097, 525466, 233330, 308463, 175822, 196002, 430231]
13463D30231N3134A58916j1814K29375j00701M6534j00244e2921D15390a0160
13452B53983Q4906I3605N78348k67402A8786L24188H5235J12611f5759l4479D96181
13440B11820P1024p6914O9826o0115J78301j61796J88139E5105K06386R069H9204
13428D53942G9063J3882K06102J02253j70415L8728L78313B46207m3955L03930
13418E06182k52008K36879g1082H0928J35020m0534j4828R5178j22970O1403L0278
13407B24475n611A00766J37246K31000h9646A72371K4928J8118o5272C1331K31826
13396B63157A13983m5271P1303A3276K12378R0900d931C94258C438c559o3772
13385f7331B51667H2849n487b2979B35623M3388I7861G199P1180K65717A64014
$$ y = [430231, 483365, 158916, 147102, 376477, 275776, 322310, 222066, -52921, 415390, -10160, 253983, 338889, 93605, 671953, 404551, 18786, 342974, 85235, 197846, -65759, -100238, 496181, 211820, 282844, 205930, 275756, 215641, 393942, 232146, 420285, 55105, 261491, 270560, 89204, 453942, 79063, 92945, 299047, 401300, 230885, 269613, 647926, 246207, 202252, 506182, 254174, 491053, -71082, 80928, 215948, 175414, 160586, 255764, 132794, 194197, 224475, 218864, 100766, 238012, 469012, -89646, 172371, 197299, 215417, 150145, 31331, 263157, 113983, 68712, 140015, 13276, 225654, 316554, -4931, 394258, 3438, -3559, -67331, 251667, 82849, 77362, -22979, 235623, 279011, 97861, 7199, 78379, 344096, 164014]
13373C48342F8343L09318A07250J56235q3301a49161C4933A0084K56413r5079
13363A71418J16182B5476J67863L40499f7633B64532k987K41718k03425C7177
13352A03716K2476L91357j00488k9192m3137A58679k7485K82221A6708O60677
13342F77385k50096j87685K7437j25129o0540Q4491g7081A62354G5721J72051
13332B47772r9013O8086a7515j1961A8238M8669A3370a354A25320b1338A88262
13320A00134K27661j4411J37596J47780k62504L37826A33140D5406R7141o4690
13310G7857k698J83545h3621j0259A33162n1906K64991a1685k5035A40151K70421
13299D10572h9464j24051I4622c838B59717E4304d0581r8175A9156J14798P2081
$$ y = [348342, 68343, 377661, 107250, 263485, 180184, -149161, 34933, 10084, 266497, 171418, 287600, 25476, 193339, 533838, -67633, 264532, 261545, 503263, 299838, 37177, 103716, 126192, 517549, 417061, 387869, 344732, 158679, 131194, 413415, 16708, 677385, 427289, 239604, 267041, 141912, 81372, 165863, -77081, 162354, 75721, 247772, 148759, 216845, -17515, -29476, 18238, 66907, 13370, -1354, 125320, -21338, 188262, 100134, 327795, 313384, 450980, 598760, 336256, 674082, 133140, 45406, 142547, 77857, 75159, 258704, -83621, -93880, 133162, 81256, 346247, -11685, -36720, 140151, 410572, -89464, -213515, 94622, -3838, 259717, 54304, -40581, -138756, 19156, 133954, 206035]
13288B06035K3480Q9676j58749J42941j714K11175B41428q3403Q5577Q435P3088
13277C25125A29455J46067q1492N0961j16953l3808a94434d8587a5407C77068
13266C39252G6317L42039a50394c5439F9055C510K15373E1572f3505j11355A99422
13254C3869Q001R149J48974k8425c1484l8968q0538B18259K1829c86331C26790
13242I1324O9463k062K40604a8629B69532I1714d5491G7583J53923B4022L66201
13231C90223J13973A07977O4275H1812P7825a07715j08888a1961o690g675l65460
13220c73135N4305I0092a67988H2449a65879B63835J38560A71242E98J66590D9774
13208B75750i4895L9450A65058m9033c8592C4688J14765o9435P2656b6025C11290
$$ y = [206035, 229515, 319191, 160442, 303383, 301669, 512844, 241428, 158025, 243602, 252037, 325125, 129455, 275522, 194030, 244991, 128038, 94230, -194434, -48587, -15407, 377068, 339252, 76317, 418356, -150394, -35439, 69055, 3510, 218883, 51572, -63505, -174860, 199422, 33869, 41870, 51019, 199993, 171568, -31484, -70452, -150990, 218259, 240088, -386331, 326790, 91324, 160787, 158725, 399329, -18629, 269532, 91714, -45491, 77583, 231506, 24022, 390223, 504196, 107977, 172252, 81812, 159637, -107715, -216603, -11961, -18651, -7675, -373135, -318830, 90092, -167988, 82449, -165879, 263835, 402395, 171242, 598, 167188, 49774, 275750, -94895, -55445, 165058, 116025, -38592, 34688, 149453, 80018, 152674, -26025, 311290]
13196A32259L1694L05518A07770m5466g9447B10546a29206A79695J30823A31607
13185F4411e0861H2717J84051d173A35844O7529l6467o272Q2142F1187e2531D59521
13172C0953L15440M7666j1356G2344K7973J33041j8372J0609j05285l0399a36097
13160B14250K63774j08538A19973a35283A56866L15799q6428j13633M6840F6714
13149A10508b74694R6078G6062j870c2410A60131F1756J80847j6593L2928O901
13138B65839c25103B81784k3686H7980J6835Q0788K1408N4569F4487J36839L06618
13127E07944b1291B55748i1301j79745C74976A71718b45208B85262j05327e47341
13116H160f909j11697E01985a0916B43581k2997r8020d39187E6716b3229j74225
$$ y = [132259, 163953, 469471, 107770, 62304, -79447, 210546, -129206, 179695, 310518, 131607, 64411, -50861, 82717, 266768, -4173, 135844, 203373, 166906, 160634, 242776, 61187, -52531, 459521, 30953, 346393, 394059, 382703, 72344, 100317, 233358, 214986, 225595, 120310, 89911, -136097, 214250, 478024, 369486, 119973, -135283, 156866, 472665, 386237, 272604, 319444, 66714, 110508, -274694, -178616, 76062, 74192, -32410, 160131, 61756, 242603, 226010, 258938, 265839, -325103, 281784, 258098, 87980, 104815, 185603, 207011, 261580, 64487, 201326, 507944, -21291, 255748, -91301, -271046, 374976, 171718, -245208, 285262, 179935, -547341, 8160, -6909, -118606, 501985, -10916, 243581, 220584, 122564, -439187, 56716, -23229, -197454]
13105a97454e4271B6752J00275i6293A01112A682O4695i5541C69369B8176R9430
13094A27606J26322c97358D23336A48690a28155k319q427E2409J21678L7268b49295
13082c3728A2633L2232K79878j43957R0951C6946M9671b15336a3836A06863K40720
13071C47583B6207d0889D4006J98247j17678J40741l9030D8502L5813b2392G3410
13059a5798c939A4974J09605p379A5926J16921K12445A71901c2300H6410f9382
13047E1383n402a30056b1308A52698J38834L5851j28006l2608A1512b99031I4508
13035c91483A43892n7810K55651a25443A69376A3415J90359G9196L341K34914
13025C17451p5192h9903F3955a6208C66478A12298h0938k47974A71516K14567
$$ y = [-197454, -54271, 26752, 127027, -96293, 101112, 1682, 66377, -95541, 369369, 28176, 127606, 253928, -397358, 423336, 148690, -128155, -130474, -138901, 52409, 174087, 211355, -249295, -33728, 12633, 44865, 324743, 180786, 271737, 36946, 86617, -215336, -13836, 106863, 347583, 26207, -40889, 44006, 242253, 124575, 265316, 226286, 48502, 84315, -22392, 73410, -15798, -3939, 14974, 124579, 117200, 15926, 132847, 345292, 171901, -32300, 86410, -69382, 51383, 45981, -130056, -21308, 152698, 291532, 327383, 199377, 166769, 11512, -299031, 94508, -391483, 143892, 86082, 341733, -125443, 169376, 13415, 203774, 79196, 82537, 317451, 242259, -89903, 63955, -16208, 366478, 112298, -80938, -328912, 171516, 386083]
13015C86083g4555A73225F8212O7307J76650G14b25233A04260a949j51097J8281
13004a34765b4446k21541c6957a2865A04475c6363A48370d3427j00441H4394N414
12993H9808J47088h5269r4417C30340I689K74420C5598j4469L41471A39265K60596
12982C99861E962b3368q1528I3951K769m2406e3878C11721a16504A41103F4777
12970A24386o1484B3809b59808E7459O4483a55185q4451A80217a30783j5943j25258
12959b71984e5974b5841A0877g2885H3025c21123g0268F5200O1000L5354F9620
12947a29444a7659B34595j1582i2235k6019A54678D4265K16288D0169P9308K73482
12936C92959A68521o9064L53033B2500J407Q1390A3502K63263c65131B29162h2528
$$ y = [386083, -74555, 173225, 68212, 135519, 312169, 714, -225233, 104260, -1949, -153046, -134765, -24446, -245987, -36957, -12865, 104475, -36363, 148370, -43427, -143868, 84394, 89808, 236896, -85269, -179686, 330340, 9689, 284109, 35598, 21129, 362600, 139265, 399861, 5962, -23368, -104896, 93951, 96720, 54314, -53878, 311721, -116504, 141103, 64777, 124386, 62902, 23809, -259808, 57459, 121942, -155185, -239636, 180217, -130783, -146726, -271984, -55974, -25841, 10877, -72885, 83025, -321123, -70268, 65200, 126200, 161554, 69620, -129444, -17659, 234595, 223013, -92235, -118254, 154678, 44265, 260553, 40169, 119477, 392959, 168521, 99457, 452490, 22500, 23907, 105297, 13502, 276765, -365131, 229162, -82528]
12924H3239B546J35835L5642J14075A31715J07821J2633g8003j31634A83583c965
12912B01588B4796a75427E1057J34938C9665a91558i686o515A56782m4013m9171
12901F3598M6741a42122M1158a5858I4583P0390A6164C618J74299L6146J59773
12890C73836i1105B54971p1409a44903N6430B31057r7402L7475K6375a58124g4235
12878B96649b07834H3389d1422B3989K12531j14387g1024A55092b12689h4426
12867A29543b11398j27149A6640f1832j3128l36877g9862H9334a40713D8355c04819
12855a51568B0878J07566J09612J50976a60632A4543J36003l5651j4781J62658
12845B62772H8364C1259N6243Q4803n0751B3677P1375L41251j66752a94600N6463
$$ y = [83239, 2546, 138381, 174023, 288098, 131715, 239536, 252169, -78003, -209637, 183583, -3965, 201588, 24796, -175427, 51057, 185995, 39665, -191558, -9686, -16201, 156782, 112769, 63598, 110339, -142122, -100964, -15858, 94583, 164973, 16164, 3618, 177917, 214063, 373836, -91105, 254971, 183562, -144903, -88473, 231057, 133655, 171130, 197505, -158124, -74235, 296649, -207834, 83389, -41422, 23989, 236520, 122133, -71024, 155092, -212689, -84426, 129543, -211398, -338547, 16640, -61832, -74960, -411837, -79862, 89334, -140713, 48355, -304819, -151568, 20878, 128444, 238056, 389032, -160632, 14543, 150546, 114895, 100114, 262772, 88364, 31259, 87502, 172305, 121554, 23677, 95052, 436303, 269551, -194600, -138137]
12834a38137o4380H4449P5654m3824C7212f427l9519B07674b8372B54491J05825
12823C60316j622A49203R9843H9394B2627L11379e4114A28345P2850G1459a34235
12811A66387n1167N5043g021n5100C01267F5156J06870E3341d28446J50042H0705
12799f9776r5664G3553l4965K24440f6098A68468m6962h9725a4973l16047J18290
12788b12730B70575a89109G7104R9408e188k2882D6257L6880a23270A29629l8497
12777I1132b41677B47603a36914A90608g5474C56069a00920A69353Q4376r0196
12767A63533D8725f287j11915E112b66636d4494A00492f9231J1736A4994J95556
12756B10550J6113a24650A78507G7468a22619A24093d3669j85635B0829N2042
$$ y = [-138137, -202517, 84449, 160103, 116279, 37212, -6427, -45946, 207674, -28372, 254491, 360316, 358694, 149203, 249046, 89394, 22627, 334006, -54114, 128345, 201195, 71459, -134235, 166387, 115220, 170263, -7021, -62121, 301267, 65156, 172026, 53341, -428446, -278404, 80705, -69776, -165440, 73553, 38588, 263028, -66098, 168468, 121506, -89725, -14973, -331020, -212730, 270575, -189109, 77104, 176512, -5188, -28070, 46257, 83137, -123270, 129629, 91132, -241677, 247603, -136914, 190608, -75474, 356069, -100920, 169353, 253729, 163533, 48725, -6287, -118202, 5112, -266636, -44494, 100492, -69231, -57495, 14994, 210550, 226663, -124650, 178507, 77468, -122619, 124093, -43669, -229304, 20829, 72871]
12746G2871P9675B1361O6722c9069A50184J01273b10157H2670N8770B828c0505
12734A01442K1226J42026B9746N5114O9565b80728i3362P649B43651F6753a30225
12722A9825J35528G1580g6465j44555j60270e9519j73039b3826H1720D0616b5664
12710B39857b0020B19413o0440K4736o7490J17113E7167i9670D99717B06056C4494
12698e6714k6111B7443c54579a61902G7391P8589b1633A41613C2858R5421C4987
12686b04728B250a1215j42656e7803l8563H5100b30401D9285h8381d2428G414
12674G7494d2235r5240A13420k9087a90626M3526a7169g603l9105B44565L070
12663B47635E1877a80323B33622j04484f0008C25882f212I0185Q4444C0310b00321
$$ y = [72871, 152546, 21361, 88083, -39069, 150184, 251457, -210157, 82670, 141440, 2828, -30505, 101442, 122668, 264694, 29746, 84860, 154425, -280728, -93362, -85713, 243651, 66753, -130225, 19825, 155353, 71580, -76465, -221020, -381290, -59519, -232558, -23826, 81720, 40616, -25664, 239857, -20020, 219413, 158973, 183709, 116219, 233332, 57167, -99670, 499717, 206056, 34494, -56714, -82825, 27443, -354579, -161902, 77391, 155980, -21633, 141613, 32858, 128279, 34987, -204728, 2250, -11215, -153871, -57803, -96366, 85100, -230401, 49285, -88381, -42428, 7414, 77494, -42235, -137475, 113420, 84333, -190626, -147100, -17169, -7603, -46708, 244565, 247635, 51877, -180323, 233622, 129138, -60008, 325882, -6212, 90185, 174629, 30310, -200321]
12651i571A79986b27651A13729R7851C6403f2492b2277l6762k44249B8304d3170
12639A08114C5309J35346K822c8641j37928B62689J68102j43686j35324A3538
12628C99311m3456k5925e1985B5219L95286b3465q4802B81219A15378m4990d226
12616c5864C26363E1926f236A1354K54116a29197K6266A47252J28421l7699b40144
12604A35672l2263C7737J26875b52516g936p0060L4095k41634G080J54168c17790
12592b9954j03304I3566b86052A21487a8182k33485h9393A0093K02829b21164
12581B68662c74804A68843n5895a14601A66458d1173a5750n1082j75867i5074
12570f307A10123C0933J48523L1143a91314C39730b06577h8048b1921E3993a36123
$$ y = [-9571, 179986, -227651, 113729, 211580, 36403, -62492, -22277, -59039, -303288, 28304, -43170, 108114, 35309, 170655, 173477, -38641, -176569, 262689, 430791, 287105, 151781, 13538, 399311, 355855, 329930, -51985, 25219, 420505, -23465, -108267, 281219, 115378, 70388, -4226, -35864, 326363, 51926, -6236, 11354, 265470, -129197, -102931, 147252, 275673, 237974, -240144, 135672, 103409, 37737, 164612, -252516, -7936, -77996, -43901, -285535, 7080, 161248, -317790, -29954, -133258, 93566, -286052, 121487, -18182, -251667, -89393, 10093, 212922, -221164, 268662, -374804, 168843, 112948, -114601, 166458, -41173, -15750, -66832, -242699, -95074, -6307, 110123, 30933, 179456, 210599, -191314, 339730, -206577, -88048, -21921, 53993, -136123]
12558a61721E3540K73747a48066A54157c90128a75670B34778J6885a5658E27050
12547A4266h2984j36090E5912J89682b8653j84261A59042P5610E0863J36212C9704
12535D4465K52656A09175a5412A36739b41835D83931a33841A01476O7259p1400
12525I7335g2213I8087L4171B3917a18633r7954F404a76902J6812A61374h1041
12513e9515A01036b00816B6622a99401C42664A14153K6271C5287K22855H8996
12502a19902c5998A43142o8383b06787G8576b02746k6550C58918A5907M68456
12492D84363I5015P2501m3664i7937C51256e222I2942C9441J04297c9319A48508
12480B76761a02308N0094j19683G3515l5807b81726J39701B0830J92833r0916
$$ y = [-161721, 53540, 327287, -148066, 154157, -390128, -175670, 234778, 251663, -15658, 527050, 14266, -82984, -219074, 55912, 245594, -28653, -212914, 159042, 234652, 50863, 187075, 39704, 44465, 297121, 109175, -15412, 136739, -241835, 483931, -133841, 101476, 168735, 97335, -72213, 98087, 132258, 23917, -118633, -216587, 6404, -176902, -160090, 161374, -81041, -59515, 101036, -200816, 26622, -199401, 342664, 114153, 140424, 35287, 258142, 88996, -119902, -35998, 143142, 74759, -206787, 78576, -202746, -229296, 358918, 15907, 484363, 95015, 167516, 123852, -97937, 351256, -5222, 92942, 39441, 143738, -39319, 148508, 276761, -102308, -52214, -171897, 73515, 37708, -281726, -142025, 20830, 213663, 122747]
12470A22747K56872b37400d9823D0597c5365j80908A76837f5273A56935a57322
12459b45899a7349B07271a63240G296J08341P1606b71426E9921a97357N738C6756
12447g181k34923A8640b01827R6845K5262G7661A6096J74551F8528b00917e4313
12435b39317E2700A492f0691G1088J63965j10349J62948f4510j0331b4103l07993
12424c32096B4306J75205A2900b33300I1389J12319a2858p5866D5329d2273p7034
12413a19307D8562g0542C3378c41489B54839a23461M0037n3827m6796j52545G7996
12401C90662q7472C2406b5392k7716b5570B52498a20366j31915g5676C8117a34499
12389F1119Q9398J12972A19737f7665b2061A95880R1605b25689B37677a48515
$$ y = [122747, 379619, -237400, -49823, 40597, -35365, -216273, 176837, -65273, 156935, -157322, -245899, -17349, 207271, -163240, 7296, 115637, 187243, -271426, 59921, -197357, -191619, 36756, -7181, -242104, 18640, -201827, -104982, -79720, 77661, 16096, 190647, 68528, -200917, -54313, -239317, 52700, 1492, -60691, 71088, 235053, 124704, 287652, -64510, -74841, -24103, -332096, 24306, 199511, 12900, -233300, 91389, 203708, -12858, -88724, 45329, -42273, -119307, 48562, -70542, 33378, -341489, 254839, -123461, -83424, -137251, -184047, -336592, 77996, 390662, 303190, 32406, -25392, -53108, -25570, 252498, -120366, -252281, -75676, 38117, -134499, 61119, 150517, 263489, 119737, -67665, -22061, 195880, 287485, -225689, 237677, -148515]
12378A4432c3930a1692A00956b0424g995E754e0368h014A24953C1629c86643j41216
12366e27859K18100H6717b13592A263K83739C5804K9658J40673B5750b31349C1778
12354a2065r1049B18771o7195D7746P4082b29598Q1331B65842j30732E8479K0395
12343G8874J11907i9992j10276A6792d6974j4791A33749i381q0757B11802Q7509
12332B99311E9746h6232a7120I5615b73263C41088q17g7770k85616K520b4670
12320F5830b7327A66093A5840R1347l3996a73895N1044G3643b5792I4648b9126
12308f0835n5189q4324n3060m0070l700G8837R174C2422f6431G5297c7844j5457
12296e3301B14227n5004e4753j00251A98401b85593G4759c6829B33668b34694
$$ y = [14432, -33930, -11692, 100956, -20424, -7995, 5754, -50368, -8014, 124953, 31629, -386643, -527859, -309759, 86717, -213592, 1263, 285002, 35804, 65462, 206135, 25750, -231349, 31778, -12065, -103114, 218771, 151576, 47746, 121828, -229598, -148267, 265842, 135110, 58479, 78874, 190781, -99992, -210268, 16792, -46974, -61765, 133749, -9381, -90138, 211802, 299311, 59746, -86232, -17120, 95615, -273263, 341088, 340271, -77770, -363386, -360866, -24670, 65830, -27327, 166093, 15840, 107187, 73191, -173895, -122851, 73643, -25792, 94648, -29126, -60835, -116024, -200348, -253408, -293478, -297178, 78837, 88011, 32422, -66431, 75297, -37844, -53301, 214227, 159223, -54753, -155004, 198401, -285593, 74759, -36829, 233668, -234694]
12285a38456B09964c4539A82153a29230h923C50221D6823N7749a56058r922A1980
12273e01960h6378A21855m7856A9993h4334C69568A51374n4779P6062E3305M3609
12262I6914k163O1677a5781H5133b29831j42528D0352M4677C2452b35543A98419
12250B11675l4754E236b2448B28981R9784j06771r1477b48991B0670b08834B23594
12238a5453G2249a51702n6036j2403B59876b04015j59989C1647g6401k29627A73448
12226C75535a15016B00858G7622L5015l4889K34018j09298C6800K21295D1416
12215d8556A47497b539F7048l0069J9873K05309G9728a10768A29889J46581m7440
12204B29030r6831K4871c8627C79031a04804A34139A4209L36092m1982j53074
$$ y = [-138456, 209964, -34539, 182153, -129230, -8923, 350221, 46823, 104572, -156058, -165980, 11980, -501960, -86378, 121855, 73999, 19993, -84334, 369568, 151374, 96595, 172657, 53305, 96914, 94751, 156428, -15781, 85133, -229831, -372359, 40352, 85029, 32452, -235543, 198419, 211675, 176921, 5236, -22448, 228981, 328765, 221994, 130517, -248991, 20670, -208834, 223594, -15453, 72249, -151702, -207738, -220141, 259876, -204015, -364004, 31647, -76401, -306028, 173448, 375535, -115016, 200858, 77622, 112637, 77748, 311766, 202468, 36800, 258095, 41416, -48556, 147497, -2539, 67048, 36979, 56852, 262161, 79728, -110768, 129889, 276470, 229030, 132199, 157070, -38627, 379031, -104804, 134139, 14209, 350301, 308319, 155245]
12194A55245J54947B5543J94926p7659o3351e6030A14353e0250B5614J04245f6332
12182A15772A4724N2370J08868f6023A82682o8312a47708H5185J00926n9765d5779
12170e0137p4985A79479O7199m3712A8721L15282l9229A4718K00940Q8575j37352
12159A66881J25651J907m7973g8017H0516J11339O2274J30597B1988P2010h6695
12147b58000E3598J11228K08064c18970A31310M9814J98246q0320j4605a4803
12136h8642C1278J48884n7740O7579f7622k36076h8762A14865a77274A12163E1426
12124A07866O180l742L8187g1695p1524A45185o8338b99654A27045a23453B3008
12112A46659a11962j91574G3242g0846D4237j9533i17k4825n0928B8990M0982
$$ y = [155245, 310192, 25543, 220469, 142810, 79459, -56030, 114353, -50250, 25614, 129859, -66332, 115772, 14724, 67094, 175962, -66023, 182682, 114370, -147708, 85185, 186111, 126346, -45779, -50137, -125122, 179479, 246678, 202966, 18721, 334003, 294774, 14718, 215658, 304233, 166881, 292532, 294439, 246466, -78017, 80516, 191855, 254129, 384726, 21988, 93998, -86695, -258000, 53598, 164826, 372890, -318970, 131310, 181124, 379370, 299050, 284445, -14803, -88642, 31278, 180162, 122422, 190001, -67622, -303698, -88762, 114865, -177274, 112163, 51426, 107866, 114046, 110304, 148491, -71695, -143219, 145185, 76847, -299654, 127045, -123453, 23008, 146659, -111962, -303536, 73242, -70846, 44237, 24704, -917, -25742, -76670, 28990, 69972]
12101F9972q400m57a20242B53590a25229G1987R4529F5497j5272j0414J37662
12090A77473P1889k043E0572a1354H7742b4530A62933G0371b98629E9668b25787
12078a54268A21294J49452E7037N9178a63387J0508k5581M1190p7701m8408B48583
12066h2439J9774F4355a89772A47615G2634J92140P80b7567k48919A09348c06595
12054B57318c18103a37602B08940H971O06702J075970D20958A64813g8470b3418
12043A01725h7873A19298C3076i680A72567a79649e1397k13675J4118J07087G0678
12031a84384G7105a41896m0439F0500c68465a48645A39175a10698B0688a71719
12020a50036h334j37413d8862B42374c93880a40546k53629C20133a11727M019
$$ y = [69972, 61572, 61115, -120242, 253590, -125229, 71987, 166516, 65497, 50225, 39811, 177473, 249362, 247319, 50572, -11354, 87742, -24530, 162933, 70371, -298629, 59668, -225787, -154268, 121294, 270746, 57037, 116215, -163387, -152879, -178460, -137270, -214971, -263379, 248583, -82439, -62665, 64355, -189772, 147615, 72634, 264774, 265554, -27567, -276486, 109348, -306595, 257318, -318103, -137602, 208940, 8971, 615673, 1691643, 420958, 164813, -78470, -23418, 101725, -87873, 119298, 33076, -9680, 172567, -179649, -51397, -265072, -250954, -143867, 70678, -184384, 77105, -141896, -182335, 60500, -368465, -148645, 139175, -110698, 20688, -171719, -150036, -8334, -145747, -48862, 242374, -393880, -140546, -394175, 320133, -111727, -107708]
12010a07708C7007L9526a5194A79930b1453G7J50362P6824h4562b5521p8161E6173
11997B99990a53725O8696C0622A0794J72697o9942a97122j31780I0744K27818
11987C18562A0537b976n4614J0662j1869j8966C26678D9178M0939a80067D5676
11975b42943O2331f2781A8599J90938E8848a07901n689F3469K02088a99647m06466
11964f06113B38316d8948F1403J1058b558G1627K41900A2760J27348c71641A10638
11952b09875G1782J2079l0973e8015A3962c27861A6443i4159l06504a05222r575
11941a14797f884B4737M7240g6744A53782l869b41465B28511I9546K6939c61125
11929C72823i7871b374A75126B7153c81556D11036b11802G646c13419C5048M6353
$$ y = [-107708, 37007, 76533, -15194, 179930, -21453, 77, 150439, 227263, -84562, -25521, -103682, 56173, 299990, -153725, -85029, 30622, 10794, 183491, 113549, -197122, -328902, 90744, 318562, 10537, -2976, -57590, -46928, -58797, -77763, 326678, 49178, 90117, -180067, 45676, -242943, -180612, -62781, 18599, 209537, 58848, -107901, -113590, 63469, 265557, -199647, -606113, 238316, -48948, 61403, 72461, -2558, 71627, 313527, 12760, 140108, -371641, 110638, -209875, 71782, 83861, 52888, -58015, 13962, -327861, 16443, -94159, -400663, -105222, -114797, -6884, 24737, 71977, -76744, 153782, 149913, -241465, 228511, 99546, 126485, -361125, 372823, -97871, -2374, 175126, 27153, -381556, 411036, -211802, 7646, -313419, 35048, 81401]
11918H1401Q0845C0263O1208D3310a60283D8235j6075A079a48322O9564B5814
11906B44564b96403a11434d2366l2136j67430N7083C06451A25657L58146a24547
11895B16421F1144a81477F9226a62146B39800b95768i9489H8048b78742G5136
11884a45351I8462C893b38769C9186a30292k6450J5019L3517A22253J08351K4311
11873B54915l7871a81815k6847g9868D8147b6994m26562a42187k49388a79737
11862A440N782L04243E2616A3779Q77a84027C1582K72504b0947j76360h9956o3344
11850a53300O0968H8634J0130B5160K79210I3685a82764D33552a7656B59406D458
11838C95502C3112L22272d6333J9436E6158A9198a12662n2651k14744A92462a70041
$$ y = [81401, 162246, 30263, 91471, 43310, -160283, 48235, 32160, 1079, -148322, -78758, 25814, 244564, -296403, -111434, -42366, -74502, -241932, -184849, 306451, 125657, 483803, -124547, 216421, 61144, -181477, 69226, -162146, 239800, -295768, -99489, 88048, -278742, 75136, -145351, 98462, 3893, -238769, 39186, -130292, -156742, -141723, -108206, 122253, 230604, 254915, 217044, -181815, -208662, -79868, 48147, -26994, -453556, -142187, -391575, -179737, 1440, 7222, 311465, 52616, 13779, 14656, -184027, 31582, 304086, -20947, -197307, -89956, -153300, -92332, 88634, 98764, 25160, 304370, 93685, -182764, 433552, -17656, 259406, 4458, 395502, 33112, 355384, -46333, -26897, 56158, 19198, -112662, -165313, -380057, 192462, -170041]
11826a5491l51974B05748N2426b88341q9461J29828C260b10174F0944J44724O7213
11815B72881d6662C9714J52118b63136j10797J67896R4485B72983a44802P233
11805a37569e1005F9495b56693A16788k5597P9403j3451a95635P0567q0107K7880
11794a77295l3388f4771m6830q8225B89386F687i6430q5505C28187L487A0041
11782A17902q414c39350Q9242I7349R3809F6636A0035L5642d7371m48F6535B2552
11769e8911j64423n4164J08104b1197l4903r8557B44825a59730p5957c3998j73336
11758b07334p8202c2446m845C27521A29488a37715A425a79576B29106p3688n478
11747A49940a21812o8727A12991J53670q1915a7183I6223a51147B2509d93733
$$ y = [-15491, -367465, 205748, 258174, -288341, -377802, -247974, 3260, -210174, 60944, 205668, 272881, -46662, 39714, 191832, -263136, -373933, -206037, -111552, 272983, -144802, -137569, -51005, 69495, -256693, 116788, 91191, 170594, 157143, -195635, -125068, -205175, -177295, -210683, -64771, -111601, -199826, 289386, 6687, -96430, -181935, 328187, 331674, 10041, 117902, 109488, -339350, -250108, 97349, 191158, 66636, 10035, 45677, -47371, -47819, 66535, 22552, -58911, -223334, -277498, -169394, -21197, -56100, -154657, 244825, -159730, -235687, -33998, -207334, -285536, -32446, -37291, 327521, 129488, -137715, 1425, -179576, 229106, 155418, 149940, -121812, -190539, 112991, 266661, 184746, -17183, 96223, -151147, 22509, -493733]
11736a42832k05901k3961J77341B14660a39299k76567A35361L37203B12828a24958
11725b10345A05599a85170k06222G2331b92611F9153J5372O104d34601E3745a06857
11713B37094q1669B8939M7772a5176k11476f2780n854A8719E612J86864a51305
11701c18205a00751B47348a09153k2270M656B18572e6597m0056c5555J3022j66196
11690a88729p1918a27586B9981J1974K57497a04449h062I2187a58151j9956A28700
11678B80756A12424D314J99595L8074F1486K3991c45566A16703N1463O3685j1878
11667B19973h1645K0508i50j74806p4273a23869B5627M4941b1164k07801o884
11656b35849A64909A4424L31089b3026k17981h1817C32761c7433A02725c716A90656
$$ y = [-142832, -348733, -372694, -195353, 214660, -139299, -415866, 135361, 472564, 212828, -124958, -210345, 105599, -185170, -391392, 72331, -292611, 69153, 84525, 90629, -434601, 53745, -106857, 237094, 155425, 28939, 76711, -15176, -226652, -62780, -68634, 18719, 5612, 192476, -151305, -318205, -100751, 247348, -109153, -131423, -126767, 218572, -56597, -96653, -35555, -22533, -188729, -260647, -127586, 29981, 41955, 299452, -104449, -8062, 92187, -158151, -178107, 128700, 280756, 112424, 4314, 203909, 241983, 61486, 85477, -345566, 116703, 168166, 231851, 219973, -81645, -61137, -950, -175756, -250029, -123869, 25627, 70568, -21164, -228965, -235849, 164909, 14424, 345513, -23026, -241007, -81817, 332761, -37433, 102725, -3716, 190656]
11644A74930a49548F1019d0479E1537L0089J35393b03517k4542f2743B5490J88306
11633B13796a45758A05315L3634b51433G3728J87887b63218J23805j13415D8171
11622A90466f794A21422c667C3761c31519A14860a1610j36284F3916R928M6272
11611A20116A9437K4674Q8133d9048j65055D6888M50018B19677D1053c8049B87615
11599e8955k06205h3455B47206d75232B03250E511a95966B24112e5371j6505K2815
11588d9061j30594i45k2568E0959K01896b90913e7742k44877A14486g3800B12382
11576b45037A34974b76869d5899H7537h8897j35678C17260F8538a31443D9555
11565a03274I917L45699B2267J14348C7762Q3767J21259g6625q0882k2258A8023
$$ y = [174930, -149548, 61019, -40479, 51537, 81626, 217019, -203517, -228059, -62743, 25490, 213796, -145758, 105315, 138949, -251433, 73728, 261615, -263218, -139413, -252828, 48171, 190466, -6794, 121422, -3667, 33761, -331519, 114860, -11610, -147894, 63916, 73844, 120116, 19437, 44111, 132244, -49048, -214103, 46888, 496906, 219677, 41053, -38049, 287615, -58955, -265160, -83455, 247206, -475232, 203250, 5511, -195966, 224112, -55371, -71876, -49061, -179655, -945, -23513, 50959, 252855, -290913, -57742, -302619, 114486, -73800, 212382, -245037, 134974, -276869, -45899, 87537, -88897, -224575, 317260, 68538, -131443, 49555, -103274, 9917, 355616, 22267, 136615, 37762, 121529, 242788, -76625, -157507, -179765, 18023]
11553i3318D2650M2186k7048a07773o9811M2290A04183O5828n9260i5036k2042
11542a17078m8729N0766K8965K9234k4878A46621R5759a33573L7473l4246A75592
11530A00373a85226H7781c12321A93440O6393H4439C1862a6635j11028E9651E40
11518A90890J83393b68514b1322H4375a23832j08810J12401D9681J9092O3539
11508A32312J80081f5923c1378B5699e2039A98104c2069A588N81P062e1922k1614
11496g3536J9410H3109f4908B68379H1306J65755A14350J00190c24331J56136
11486a68195C56366h3760c7296o2678n086B34067j7388r4390D601R1268d44934
11474a10855H663b7702l2700B58244a05212A3438K83028D18J21062i3284j41309
$$ y = [-93318, 42650, 84836, 57788, -107773, -177584, -135294, 104183, 170011, 110751, -95036, -117078, -165807, -115041, -86076, -56842, -81720, 146621, 242380, -133573, -96100, -130346, 175592, 100373, -185226, 87781, -312321, 193440, 259833, 84439, 31862, -16635, -127663, 59651, 540, 190890, 374283, -268514, -21322, 84375, -123832, -232642, -120241, 49681, 68773, 132312, 312393, -65923, -31378, 25699, -52039, 198104, -32069, 1588, 2169, 9231, -51922, -73536, -54126, 83109, -64908, 268379, 81306, 247061, 114350, 214540, -324331, -168195, 356366, -83760, -37296, -99974, -105060, 234067, 216679, 122289, 4601, 95869, -444934, -110855, 8663, -27702, -60402, 258244, -105212, 13438, 296466, 418, 121480, -93284, -234593]
11463b34593a17098B60156A00145R8944k5003g9664B28043e9166J211L062A7107
11451b46246A98799Q7140N5810A66054a55876N5805j61092A5412b4010G5685A9099
11439A76280b07701A74111J0961P5249A335N958a68116Q0685L6942j18913A95421
11427D2864e8095j87693a12714b5287B19410R4611D5786H669K50214J8441c9071
11415a40053m3737N7675L281B68822E6583a12126B38354A01879B6027K85035c88074
11403B02570b31993j1649h4573H1227b60613j0017R2426A81714h2329D1051M101
11392D5152J60001e0503C2682M1386K28784a98676B15199D2854J0265a24559j3012
11381a37571B63743a20996M8189k02538d8562n280A6054N8439O5031B3711J02892
$$ y = [-234593, -117098, 260156, 100145, 199089, 174086, -79664, 228043, -59166, -57955, -54893, 17107, -246246, 198799, 285939, 341749, 166054, -155876, -100071, -261163, 15412, -24010, 75685, 19099, 176280, -207701, 174111, 185072, 260321, 1335, 7293, -168116, -87431, -50489, -169402, 195421, 42864, -58095, -245788, -112714, -25287, 219410, 314021, 45786, 8669, 258883, 277324, -39071, -140053, -183790, -126115, -122834, 268822, 56583, -112126, 238354, 101879, 26027, 311062, -388074, 202570, -231993, -243642, -84573, 81227, -260613, -270630, -178204, 181714, -82329, 41051, 45152, 205153, -50503, 32682, 74068, 302852, -198676, 215199, 42854, 53119, -124559, -137571, 263743, -120996, -72807, -275345, -48562, -53842, 16054, 74493, 139524, 23711, 126603]
11370A26603j7599a50171B49038N4483D6009i7945j34601d8272q918j52913a1324
11358F447J54989b40905B73502A29967K6581a21230A52979C9865f0771l18441
11348c79212J07507E4375J03198E2433a47876f5241D2031J01001F2806f7605j5531
11337h3136A76644b20041j3757G9641i0700j36878I3488c54097a33639E853N8099
11326F3952a4341j81585j5487L3466g2188k40219A86983B9190b6916b483E5662
11314D3270r661c8883A37382h3821j69081A69301f8760A41628a90974L8723r4845
11303b47096A5991a89501A37987h3365J8149k434B21066a27277d6694B97712r0726
11292B06986g8022E1970b09919M8762A145a77170a1946k95850H9174k4474N8962
$$ y = [126603, 109004, -150171, 249038, 303521, 46009, -97945, -232546, -48272, -57190, -210103, -11324, 6447, 161436, -240905, 273502, 129967, 156548, -121230, 152979, 39865, -60771, -379212, -271705, 54375, 157573, 52433, -147876, -65241, 42031, 143032, 62806, -67605, -83136, 176644, -220041, -233798, 79641, -90700, -227578, 93488, -354097, -133639, 5853, 63952, -14341, -195926, -211413, -177947, -72188, -312407, 186983, 29190, -26916, -2483, 55662, 43270, 33609, -38883, 137382, -83821, -252902, 169301, -68760, 141628, -190974, -152251, -247096, 15991, -189501, 137987, -83365, -65216, -67650, 221066, -127277, -46694, 297712, 206986, -78022, 51970, -209919, -161157, 1145, -177170, -11946, -307796, 89174, 64700, 123662]
11281A23662k2664a54553j7886A57166M7332d28121A31171O161h3329C56960a93495
11269A33726M963c77093J75997H5789g0544B780d7269j02858l8509g4510G8804
11257C5451a8258B54346E9592a57572A9208c1849j12209D7280i3143D9566L4142
11246H3708d61319c7640A4933Q1487J52696d2010A72404E139b74794d6150A1093
11234B17854c14076c2596C0075b73059A11370Q9013d8194A62010G1747b50732
11223B39532P022R628b40671J09688l05050J82218m2146a36803A11313K41053
11213C52366g2381j5689I6773c79466C02223a49842A78839a99656P2597A77067
11202a02418g788m4909r5704B08631a69618p0573N5004m197Q9184a7133a695q9108
$$ y = [123662, 100998, -154553, -172439, 157166, 204498, -428121, 131171, 137332, -83329, 356960, -193495, 133726, 138689, -377093, -201096, 85789, -70544, 2780, -47269, -150127, -188636, -74510, 78804, 35451, -18258, 254346, 59592, -157572, 19208, -31849, -144058, 47280, -93143, 49566, 83708, -461319, -37640, 14933, 96420, 249116, -42010, 172404, 5139, -274794, -46150, 11093, 217854, -314076, -32596, 30075, -273059, 111370, 200383, -48194, 162010, 71747, -250732, 239532, 246554, 256182, -240671, -130983, -436033, -253815, -295961, -136803, 111313, 352366, -72381, -88070, 96773, -379466, 302223, -149842, 178839, -199656, -127059, 177067, -102418, -7788, -52697, -148401, 208631, -169618, -240191, -185187, -189384, -100200, -17133, -1695, -90803]
11190i0803a6339A57857J0814A4983N9795a20856J6939k66582a23646c0939j05344
11179a36283l80031b23892i6517B39676c63124A05777a2468J632l61008R6231
11169b75613J05687k34848J08187g4818B1065j0059a36824q2077a5711k1291j18354
11158a55356k2479B12962B0872K85507b53379C34464F7017A2020h4160j7360M3123
11147e8397k20871i3920C20335a69969A63840K1252a68554D0250N6775J07229
11137B04254r3175P9034H6123N1620A2563J2467K31003d9821a2640o9926j07022
11126a89588A38901J0a11336I3016C7239e0911j07555C7632b77140J38305j71432
11115c10267A53497J19159A4329b7233A06442d7520A887Q4340i8179b5758m4176
$$ y = [-90803, -16339, 157857, 168671, 14983, 74778, -120856, -103917, -370499, -123646, -30939, -136283, -516314, -223892, -96517, 239676, -363124, 105777, -12468, -10836, -371844, -275613, -169926, -404774, -296587, -74818, 21065, 11006, -136824, -218901, -15711, -37002, -155356, -177835, 212962, 20872, 306379, -253379, 334464, 67017, 12020, -84160, -101520, -58397, -279268, -93920, 320335, -169969, 163840, 185092, -168554, 40250, 97025, 204254, 111079, 190113, 86123, 137743, 12563, 25030, 256033, -49821, -12640, -82566, -189588, 138901, 138911, -111336, 93016, 37239, -50911, -158466, 37632, -277140, -138835, -310267, 153497, 272656, 14329, -27233, 106442, -47520, 1887, 86227, -98179, -25758, -69934]
11104f9934B80359b0484l1499A47192n7218C7047H321K66040G7982K47087a95007
11092A57386e0924a0705C44335O4376A64530e986o2856B34191A6221J02116L6681
11081A55018h7802A23339A5962J54931k4440R7319N8876D8165L90672c6955F4399
11069H5033Q071K33968e5911B71760n0137J35109K12086B63036L24653j68854
11059D18835i64B96928J97421J10186k01690K38271k44603R779l8908P9511R4020
11048E40915K96633l84061j75275L12140j20794P90r9358L16526L1685A40182
11037H18524R9825l32381j69692J51875j69545K97221B67657L47795k42999K10400
11027E82853n0361j01458J64182j57645J76684l07041K36734j86065P8732P8947
$$ y = [-69934, 280359, -20484, -51983, 147192, 89974, 37047, 8321, 274361, 77982, 325069, -195007, 157386, -50924, -10705, 344335, 408711, 164530, -5986, -68842, 234191, 16221, 118337, 155018, -87802, 123339, 15962, 170893, 146453, 243772, 302648, 48165, 438837, -36955, 64399, 85033, 93104, 327072, -55911, 271760, 221623, 356732, 568818, 263036, 587689, 418835, -964, 296928, 494349, 604535, 402845, 641116, 396513, 406292, 367384, 446895, 540915, 837548, 453487, 278212, 590352, 469558, 470348, 370990, 687516, 719201, 140182, 818524, 918349, 585968, 416276, 568151, 398606, 695827, 267657, 615452, 372453, 582853, 532492, 431034, 595216, 437571, 614255, 307214, 543948, 357883, 436615, 515562]
11017E15562L7692n9858j58098R8641L58271k93241j17575K41632M9725B60264
11006B89361M4885r3254J92839m8744J84605P1112L78065j91790j51429L1898
10996G07548j02611K4627J87117l90901K20898n0227J34838Q1056j54870M444
10986F61919J14356R1488q6943p4606L1689J3978J19134L98536m56282O55278
10976A468547k84330J61026N68956R2096O56534j19663k07510k49402j98809L4613
10966A922058l62155l03875k35391j05648J74598n05034M67528l1537J63790m92392
10956F91942K07733l7173j47124l642l2783l02275j28470K41948j86953A10209
10945B26193J28930E4968K50610j11885K08380G4393j6999K53575l8002g5816
$$ y = [515562, 553254, 493396, 335298, 433939, 792210, 498969, 381394, 623026, 672751, 260264, 289361, 334246, 240992, 433831, 385087, 569692, 640804, 1018869, 827079, 675650, 707548, 604937, 629564, 816681, 425780, 646678, 596451, 731289, 812345, 657475, 661919, 776275, 867763, 780820, 706214, 737903, 751881, 871015, 1269551, 813269, 1468547, 1184217, 1345243, 1914199, 2006295, 2662829, 2543166, 2335656, 2086254, 1887445, 1922058, 1559903, 1256028, 1020637, 914989, 1089587, 584553, 1052081, 1020544, 1184334, 691942, 899675, 862502, 715378, 711736, 678953, 376678, 248208, 490156, 303203, 110209, 226193, 355123, 54968, 305578, 193693, 402073, 74393, 57394, 310969, 272967, -75816]
10934C24148a86787C88152a965C81638c20230C73487A12567c2703n9494B41508
10923A23839b2210D4441d916r7323E4938c4195l10678d0375G9267M0993b57856
10911b0854q9755a2844j55027e2986A83539f6002j08702D3027a81657A76989L4113
10900B11102a8308B28637b87529O5160k78805B70331a97236a3372A60421f955
10889A13294a72259k08878B58829C1782b83048I096K95728p2002D2054J45834
10879A87888b47343B34802b96360j6224C33303b6256j60203Q538m2119H0713a10067
10867a0013j04329p9027g6430D3996c3620j56709j8156D0107O8038a82416J6392
10856a66024A6959a66604F7501b80868a6502C9376c2682q9353j83307D6111c64811
$$ y = [324148, -186787, 388152, -1965, 381638, -320230, 373487, 112567, -32703, -92197, 241508, 123839, -22210, 44441, -4916, -102239, 54938, -34195, -344873, -40375, 79267, 120260, -257856, -20854, -110609, -12844, -167871, -52986, 183539, -66002, -174704, 43027, -181657, 176989, 211102, -18308, 228637, -287529, -222369, -501174, 270331, -197236, -13372, 160421, -6955, 113294, -172259, -381137, 258829, 31782, -283048, 9096, 304824, 232822, 42054, 187888, -247343, 234802, -296360, -312584, 333303, -26256, -186459, -177921, -220040, 80713, -110067, -10013, -114342, -193369, -76430, 43996, -33620, -190329, -208485, 40107, 108145, -182416, -166024, 16959, -166604, 67501, -280868, -16502, 39376, -32682, -122035, -305342, 46111, -364811]
10844A98631b66619B84600h6325A42735B8729J56608c43219J42049i9835F4207
10833b13794M8094a6246j73003h9580K4153J1767j3519G2474k2025g2422D4290
10821B6886b99584f2106A31088a57698E8291a78049i436D5784N0020O2661h1107
10809h2725E2086c7258A09690a369m62835d7715C61526b51081R9657N5954D1862
10797i3229B9095b84147b6986A65554h6089Q504D7087A151b6323j20670A33542
10785i8763B71724D3942J2878J804K55388A6253Q1997a46756j00190f2847k37930
10774c00777n9371C3124J90779a32770A88290a37667d1179C54166A52945F2975
10763B24372g1242E0815c23392a51702A43661a68091N1809K2535I5496i6152J6869
$$ y = [198631, -266619, 284600, -86325, 142735, 28729, 185337, -343219, -201170, -99835, 64207, -213794, -165700, -16246, -189249, -89580, -65427, -53660, -67179, 72474, 50449, -72422, 44290, 26886, -299584, -62106, 131088, -157698, 58291, -178049, -9436, 45784, 95804, 158465, -81107, -82725, 52086, -37258, 109690, -1369, -464204, -47715, 361526, -251081, -151424, -95470, 41862, -93229, 29095, -284147, -26986, 165554, -86089, -77585, 47087, 1151, -26323, -146993, 133542, -98763, 271724, 43942, 56820, 58624, 314012, 16253, 98250, -146756, -246946, -62847, -300777, -360148, 33124, 223903, -132770, 188290, -137667, -41179, 354166, 152945, 62975, 224372, -71242, 50815, -323392, -151702, 143661, -168091, -116282, -93747, 95496, -96152, -79283]
10752g9283k19836A82792e497i02k09787l6897B34870b73446g6907L1904E21b6242
10739a73319D96919A5201R6370B485c13695D763g528A70944F6422J8487i7499
10727G7730c13400I0612j3524a1302n4953l2374K3138B38986g5125A5169J99514
10716B14683e4718a8388j81E21677a61245m2336l22505A1600a67843A6095R0601
10705A06696a88105J896I2944P5917b91108g3662b9174D8263a06980m4922A47523
10693A00407J2394d3110j40931B08538E9490R4855m9012a03092D8969K30764a21079
10681b10445b7969m4178A13053l5749a18091l6524j43708h6307j5142l1036A24584
10669b30041i9564C7542b99128J03138A60510k764b5548a1136k85468E5868K61412
$$ y = [-79283, -299119, 182792, -5497, -902, -210689, -247586, 234870, -273446, -76907, -45003, 521, -26242, -173319, 496919, 15201, 111571, 2485, -313695, 4763, -7528, 170944, 66422, 84909, -97499, 77730, -313400, 90612, 77088, -11302, -66255, -98629, -75491, 238986, -75125, 15169, 214683, -54718, -18388, -18569, 521677, -161245, -203581, -526086, 11600, -167843, 16095, 106696, -188105, -186209, 92944, 168861, -291108, -73662, -29174, 48263, -106980, -151902, 147523, 100407, 112801, -43110, -184041, 208538, 59490, 154345, 105333, -103092, 48969, 279733, -121079, -210445, -27969, -72147, 113053, 77304, -118091, -154615, -298323, -86307, -101449, -132485, 124584, -230041, -99564, 37542, -299128, -195990, 160510, 157746, -25548, -11136, -296604, 55868, 317280]
10658C17280b57763M6885J00165K2146K650o6177B86360A4996K1176a68661r4733
10647b63394a25722F3628d7372C02402r0234F0935a69330B3259a7994m5779N545
10636e8228A79027b83434b9543j72861A55399a74509g3505P566q2587g3928A39905
10624C3731b43035k0652j56167a90180A04030a9785H2148L36457j92370b65274
10613d0687l2100o8273L9256l3124o1648d0050k11258d6802k77599a53700E1314
10601e7294k90197P3986B6555i8105J4744C5465b59256A7260c50676J64865B18940
10589a78297C80955A28170a26915c1917j41695c296B37626E3616L1991a46195
10578a5931j00857B65558q8289b30580I4626j5322a02755b1683F3053J14881n5235
$$ y = [317280, -257763, -210878, -110713, -88567, -85917, -152094, 286360, 14996, 36172, -168661, -263394, -125722, 63628, -47372, 302402, 212168, 60935, -169330, 23259, -17994, -63773, -58228, 179027, -283434, -29543, -202404, 155399, -174509, -73505, -65939, -148526, -73928, 139905, 33731, -243035, -263687, -419854, -190180, 104030, -19785, 82148, 418605, 226235, -265274, -40687, -72787, -141060, -101804, -134928, -196576, -40050, -251308, -46802, -324401, -153700, 51314, -57294, -347491, -273505, 26555, -98105, -83361, 35465, -259256, 17260, -350676, -185811, 218940, -178297, 380955, 128170, -126915, -31917, -173612, -3296, 237626, 53616, 85607, -146195, -15931, -116788, 265558, 177269, -230580, 94626, 79304, -102755, -21683, 63053, 177934, 122699]
10567A22699j398a43015j19160B15935B0304b54826f1766A7840b6222A45279Q6450
10556B31729c1138n5960p672j830B22574n3111o5759J32630a29066o5839R5500
10545i9405C374J11273f6606A75736b48717c2909A98314h1420j34955d0998j39153
10534a80151B1808d6606o7003G3465B3698a114A23063c4521n851o5415A71037
10522a49356K2883A78413b0032A00627K68130A15356a18233n4826P2192A6484
10511d12361K04309K5494R551D2029b84931J22623j87463B3953b55602D8596J9726
10500F8322a15065a4814A56692M2978a24774H4653a11778i434k20554c8918I5384
10488A6565d1434c669j20568C7888a82153q0000A8603K3094a84989A72154k3134
$$ y = [122699, 121301, -143015, -262175, 215935, 20304, -254826, -61766, 17840, -26222, 145279, 231729, -31138, -87098, -94770, -96600, 222574, 169463, 103704, 236334, -129066, -194905, -99405, 3374, 114647, -66606, 175736, -248717, -32909, 198314, -81420, -216375, -40998, -180151, 21808, -46606, -113609, 73465, 23698, -1114, 123063, -34521, -40372, -105787, 171037, -149356, -126473, 178413, -20032, 100627, 368757, 115356, -118233, -173059, -100867, 16484, -412361, -208052, -182558, -173007, 42029, -284931, -162308, -349771, 23953, -255602, 48596, 68322, -115065, -14814, 156692, 199670, -124774, 84653, -111778, -9434, -229988, -38918, 95384, 16565, -41434, -3669, -124237, 37888, -182153, -262153, 18603, 41697, -184989, 172154, 149020]
10477A49020d27645A67197a03678A18405a98234C05059A17091n3840a58250G0062
10466G6307j097k6563a42923B45489h0874A39778a6093B6165L7278a31087A2539
10454D2384a90343f5961j45650f7302n1162H0178a47456B5443b14672L4806e521
10442a26582A18952J20735a25263B42426a62054A97694b00925F692g2211j22810
10432a95021L3529J2969e358r5435k58773C0723d30292a10490F2874J17633b69352
10420H0721d0903j05284f8248E1885a13637k25393A39864l0668g6128C39677F6205
10408a68854a7971q9066A06606Q6635q7204b08670C5475b15665A76482f1311p9680
10397a40991A35762J0175b82809E4813K05179c85533e6163j85441A13560J45720
$$ y = [149020, -427645, 167197, -103678, 118405, -198234, 305059, 117091, 63251, -158250, 70062, 76307, 75210, 48647, -142923, 245489, -80874, 139778, -16093, 26165, 63443, -131087, 12539, 42384, -190343, -65961, -211611, -67302, -118464, 80178, -147456, 25443, -214672, -179866, -5521, -126582, 118952, 239687, -125263, 242426, -162054, 197694, -200925, 6692, -72211, -195021, -161492, -148523, -5358, -100793, -359566, 30723, -430292, -110490, 62874, 180507, -269352, 80721, -40903, -146187, -68248, 51885, -113637, -339030, 139864, 109196, -76128, 339677, 66205, -168854, -17971, -107037, 106606, 193241, 106037, -208670, 35475, -215665, 176482, -61311, -140991, 135762, 145937, -282809, 54813, 259992, -385533, -56163, -241604, 113560, 259280]
10387B59280I7046d563A69633O9352A14349d6222l4197A70104b07702R4067B50463
10375B62160A30132J80206R9970A27997J53515K6751j47712C2889J14887J78078
10365C25854J69452B36619J78301c5933B26551J55943H9083L57061A53148K02233
10355C55381j26005J21319A49777J89623l4284Q1756j77022J64138A77903E2448
10344C54116j13082k9499d3847C19314m2424a44516J7425A85223o2429N0651a8702
10332I0531J38737f5384c09A977J07791n0115K62075H4425L9879k2938J21031
10321B22397n0565n8809K04264j33060I258R8929b48686g993D97699a0848n7154
10310f8002A74064f551j47807M0448A61574J21784D2806o30M1696a37144F9030
$$ y = [259280, 97046, -4563, 169633, 238985, 114349, -46222, -80419, 170104, -207702, -113635, 250463, 262160, 130132, 310338, 410308, 127997, 281512, 308263, 160551, 32889, 147776, 325854, 495306, 236619, 414920, -35933, 226551, 382494, 89083, 446144, 153148, 355381, 229376, 350695, 149777, 339400, 305116, 386872, 209850, 373988, 177903, 52448, 354116, 241034, 211535, -43847, 319314, 276890, -144516, -127091, 185223, 122794, 173445, -18702, 90531, 229268, -65384, -309, 1977, 109768, 59653, 321728, 84425, 124304, 101366, 222397, 171832, 113023, 317287, 184227, 9258, 108187, -248686, -7993, 497699, -10848, -68002, 174064, -6551, -154358, -113910, 161574, 283358, 42806, 42176, 83872, -137144, 69030]
10298F8780a26506a4751C0130J80971d74523A88507N87b4037G5674a08953k06728
10287c15681a34422m7525c032j25384M7402k99143a3324j3756j22587A66122b12354
10275G7440d8035r7675j63652d4744A29976b5736C0191P7284k6370J02748a13241
10263a38334q7494g9716A82627g9041D7926L30387A748d7109F8012a03030D32239
10251A75123b3742F1548j5273g6656A66298R863G1213a65149d2754F4572b202
10239e4200b837p0381A45901d8637J2387j28404M8388D41698b56015J11729n4438
10228a98724L6468M204A10746A1670J25417M7205c1324B45074b11766j36406a01309
10216b05099Q5102R991A46842J6338m582b7346I6022H451a15325j36416A06209
$$ y = [68780, -126506, -14751, 30130, 211101, -474523, 188507, 189094, -24037, 75674, -108953, -315681, -134422, -181947, -3032, -128416, -81014, -380157, -13324, -27080, -149667, 166122, -212354, 77440, -48035, -145710, -309362, -44744, 129976, -25736, 30191, 107475, 81105, 183853, -113241, -138334, -225828, -79716, 182627, -79041, 47926, 378313, 1748, -47109, 68012, -103030, 432239, 175123, -23742, 61548, 46275, -76656, 166298, 176161, 71213, -165149, -42754, 64572, -2202, -54200, -2837, -73218, 145901, -48637, -36250, -164654, -116266, 441698, -256015, -144286, -198724, -162256, -158052, 110746, 11670, 137087, 184292, -31324, 245074, -211766, -348172, -101309, -205099, -119997, -110006, 146842, 163180, 158598, -27346, 96022, 8451, -115325, -251741, 106209]
10204b55846C25959a39936A24256a56411n1072i8098l6850A9970J04453a96318
10193B12352b00809h6423m12432B24669a60323k41297G8781d63855a73042B86929
10182h5143l7617B58727i7323B5246a8868B70976a27640j12519a3810k65896a18249
10170F7228e2409o6007A87654L8334e2759k72959e007l6689n25094g4489j82265
10159b56754B68492q4415d4894D25J46527j7039a18931a5797j27080j65993E31747
10147H4124R4174N9099B4088J72515Q9595a0322k00103j13125C4866a07912r7827
10136b05739A06418a30750N2666K7791k87813h1953j46319j2418o715G1507P1590
10125A43097b43343n443g7473C01008d14910E62887e7340b3192i705k56202a31740
$$ y = [-255846, 325959, -139936, 124256, -156411, -207483, -98098, -134948, 19970, 124423, -196318, 212352, -200809, -86423, -498855, 224669, -160323, -401620, 78781, -463855, -173042, 286929, -85143, -122760, 258727, -97323, 25246, -18868, 270976, -127640, -240159, -13810, -279706, -118249, 67228, -52409, -118416, 187654, 225988, -52759, -325718, -5007, -41696, -566790, -74489, -256754, 268492, 184077, -44894, 425, 146952, 129913, -118931, -15797, -142877, -308870, 531747, 84124, 178298, 237397, 24088, 196603, 286198, -10322, -210425, -323550, 34866, -107912, -205739, 106418, -130750, -78084, -50293, -338106, -81953, -228272, -240690, -247405, 71507, 143097, -243343, -248786, -77473, 301008, -414910, 562887, -57340, -23192, -9705, -265907, -131740]
10113a52635L6901d5625A54259i4475j98265H5303c77357h9247r2438A86679N3280
10102B39959d17081i7089B15828a90401h4805C33863b49312A26628a59783C4283
10091B17366h8067j7134k06575a05119k8241b2588E7906K3157A2447a4333G5782
10079F7227a24657l43770a04913j31488k80859J8027A57854b31082J07775j50995
10069b74302b5121j78725F3944a87328J4319a598j52700d9233F9000d1458I3774
10057a77717B3790K2957O8468n3201J22145a8711p5705b8989B06218m9663b84259
10045a20826L3292c8001E1767d59582i8483l5291e4314A58644a76397b2584l4389
10034e6973B00460b94173B12147a29558d5081m728k52476A36975m4762a99408
$$ y = [-152635, -115734, -45625, 154259, -94475, -292740, 85303, -377357, -89247, -181685, 186679, 239959, -417081, -97089, 215828, -190401, -84805, 333863, -249312, 126628, -159783, 34283, 217366, -88067, -105201, -311776, -105119, -133360, -22588, 57906, 81063, 12447, -14333, 75782, 67227, -124657, -468427, -104913, -236401, -517260, -499233, 157854, -231082, -123307, -274302, -25121, -203846, 63944, -187328, -173009, -1598, -154298, -49233, 69000, -41458, 93774, -177717, 23790, 46747, 115215, 62014, 184159, -18711, -94416, -28989, 206218, 156555, -284259, -120826, -87534, -38001, 51767, -459582, -98483, -133774, -54314, 158644, -176397, -22584, -56973, 200460, -294173, 212147, -129558, -45081, -49809, -302285, 136975, 92213, -199408]
10023G7656J13687a42086j2053M4784r108e079k51933a17454j7932j5944g0468
10011d36851e3569I0403J90108a08856k7058m8229A05611J33060C0873J6053J19151
10000A66077d3743A51840B3309b86374B18032f0940A86752c36876a42827l6929
9990a79756A68834d4195A73800c51410A52139J03408c22890a55725G9191a98102
9979b89758c2946p9302j04257B0692J65929i8348A23237L9025a07724r4255f2712
9967b03027j46700a59658g7656C21372a31495l56101d5185j1662l08930A40374
9956A45289a78982k3114B75148j09530c18135G0848P8500a2053p678H3162J54184
9945B37346a77491c7447j63826j72481a74599m302j60767L0405B86520a39274
$$ y = [77656, 191343, -142086, -154139, -109355, -118463, -5079, -257012, -117454, -135386, -151330, -70468, -436851, -53569, 90403, 280511, -108856, -135914, -184143, 105611, 238671, 30873, 46926, 166077, -43743, 151840, 23309, -286374, 218032, -60940, 186752, -336876, -142827, -179756, 168834, -44195, 173800, -351410, 152139, 255547, -322890, -155725, 79191, -198102, -289758, -32946, -112248, -216505, 20692, 186621, -98348, 123237, 162262, -107724, -201979, -62712, -203027, -349727, -159658, -77656, 321372, -131495, -487596, -45185, -56847, -365777, 140374, 145289, -178982, -202096, 275148, 165618, -318135, 70848, 149348, -12053, -19731, 83162, 237346, -177491, -37447, -201273, -373754, -174599, -178901, -339668, -309263, 286520, -139274]
9934b58317A36800I446J18596h3552L3238k51987P9291a5119j93790j36403N9537
9923b85775A61400a97779j7050i3861m4486j80635b1693A11260K17547a13122
9912D4389a8403r8601I196a9948D10309j62503c85628A84365A761c7463j702j19115
9900a58280A62413c9432p1309C6280f2965h646G6953k6032c2099m1256B00627
9888a73608A24455d3266A84829D1055a02786m6165B00724H178b18187Q9421A3755
9876e6700b7855i816D6043M1079N8921b71164Q2297o0202e917j16434c4542l50647
9864c85189B3130b69483P1484J7878b0923j98854P9691B32411a22780j93112D0482
9852G0685a88446k91810A90567b4672F4455A9316i840j25669m4293g5122A47036
$$ y = [-258317, 136800, 9446, 128042, -83552, -50314, -302301, -223010, -15119, -208909, -345312, -285775, 161400, -197779, -214829, -93861, -138347, -318982, -21693, 111260, 328807, -113122, 44389, -18403, -117004, 9196, -19948, 410309, 247806, -385628, 184365, 1761, -37463, -39165, -158280, 162413, -39432, -110741, 36280, -62965, -8646, 76953, 50921, -32099, -73355, 200627, -173608, 124455, -43266, 184829, 41055, -102786, -148951, 200724, 8178, -218187, -128766, 13755, -56700, -27855, -9816, 46043, 87122, 146043, -271164, -188867, -249069, -5917, -122351, -34542, -385189, 23130, -269483, -197999, -180121, -20923, -219777, -140086, 232411, -122780, -315892, 40482, 70685, -188446, -480256, 190567, -24672, 64455, 19316, -9840, -135509, -179802, -75122, 147036]
9840b87728A29284J66831p9295a4557F1843g8957m3712B87599D3595K15252A07828
9828A32398h1158m52471a18803L9331j84437A22545d98560b35400M3924A56530
9817c09671F2443a90545A9808P0290m383i059q4181j15795a8082j06325H6915
9805A44354a87154D6454a4480m97821i7716N657k65694D065J31707d5810l1062
9794g6872o3911A12297c21187G6832a5687A50617b82364a18724n9204j47270a635
9782b5443E9567a06172C5592b65104E6506h7338a6209F5665L27397a22210j50144
9771b72354c573l49013R6975b418m02697C3307J6161b50373r1670M7899J6216
9760b77928B43545b30927a0780j79061A8969O567b01228A53340c4407B88286e927
$$ y = [-287728, 129284, 296115, 216820, -14557, 61843, -78957, -122669, 287599, 43595, 258847, 107828, 132398, -81158, -533629, -118803, -79472, -263909, 122545, -498560, -235400, -191476, 156530, -309671, 62443, -190545, 19808, 90098, 85715, -9059, -93240, -209035, -18082, -124407, 86915, 144354, -187154, 46454, -14480, -512301, -97716, -92059, -357753, 4065, 135772, -45810, -76872, -140783, 112297, -321187, 76832, -15687, 150617, -282364, -118724, -177928, -325198, -1635, -25443, 59567, -106172, 35592, -265104, 56506, -87338, -16209, 65665, 393062, -122210, -272354, -3573, -352586, -255611, -2418, -405115, 33307, 49468, -250373, -342043, -294144, -277928, 243545, -230927, -10780, -189841, 18969, 25536, -201228, 153340, -34407, 288286, -5927]
9748b5254J0080B457c80131A78102e6158C47065a89412A3669h3253l1202M4479
9737f9976p916A51312a52413m2680h5686d259j4541B86231j1043b16223P6687
9726a39536L4661B25377I1247B1785p448c6720r0872l2107d2023k06231J16142
9715a32112m2352C8221K74999a24474I0976K2216D7426a35745A39957b78431A47478
9703D13164G0135A9117c81624A23753b05062p615k1006H5793d77592B2821a79787
9691A05433L19487A25342b50373J04554j7809A91693c34893A63598c58549j38377
9681d96926b1235l90937g078k09175J1717F0286c1191j87491e8528k09901a3847
9669C7454L79570A86875h5418n4322d1911H5883b99216l0694B45725A0462c63858
$$ y = [-25254, -15174, 2457, -380131, 178102, -56158, 347065, -189412, 13669, -83253, -114455, -69976, -77892, 151312, -152413, -195093, -85686, -4259, -18800, 286231, 275188, -216223, -139536, -104875, 225377, 91247, 21785, 14337, -36720, -127592, -159699, -42023, -248254, -132112, -174464, 38221, 313220, -124474, 90976, 113192, 47426, -135745, 139957, -278431, 147478, 413164, 70135, 19117, -381624, 123753, -205062, -212677, -233683, 85793, -477592, 22821, -179787, 105433, 424920, 125342, -250373, -145819, -163628, 191693, -334893, 163598, -358549, -496926, -21235, -412172, -7078, -216253, -204536, 60286, -31191, -218682, -58528, -268429, -13847, 37454, 417024, 186875, -85418, -139740, -41911, 85883, -299216, -329910, 245725, 10462, -363858]
9657a48547j3875A56233A8614a09675K2247C8307O6126c3548F2848M2527J39872
9646B45247e3815B115b70442A34464a61648g3652k79062j01853B60801G851J58035
9635A65886a9433k27599O3014A28902a51156r5611F0079g3733b8581G0467a30447
9623a45883A0788L71082e3979B63005A2543J5749J27915j5842d17184a34469A4434
9611b7015C28913i2310g515C628c90929g8033n6338B28346a29458f3344p4535
9600a37879L5588A66840m9412a51292g1187A95997j6269a43633E1980h7757A58912
9588d18551A01943d29991e8091q6545f1783B13912H4349b58237K3033g2410q0937
9577a53347I7735A5021a67694M2895B2876b02086C09981a45772k65275J41075
$$ y = [-148547, -162422, 156233, 18614, -109675, -87428, 38307, 104433, -33548, 62848, 105375, 245247, -53815, 2115, -270442, 134464, -161648, -73652, -352714, -454567, 260801, 7851, 165886, -19433, -247032, -184018, 128902, -151156, -246767, 60079, -73733, -28581, 70467, -130447, -145883, 10788, 381870, -53979, 263005, 12543, 28292, 156207, 140365, -417184, -134469, 14434, -27015, 328913, -92310, -7515, 3628, -390929, -78033, -134371, 228346, -129458, -63344, -137879, -102291, 166840, 117428, -151292, -71187, 195997, 179728, -143633, 51980, -87757, 158912, -418551, 101943, -429991, -58091, -144636, -61783, 213912, 84349, -258237, -235204, -72410, -153347, 97735, 15021, -167694, -124799, 22876, -202086, 309981, -145772, -411047, -269972]
9567b69972a08640m5035k7087N9006n0060J1480f1056C5469a12855A79086q0237
9556I8849a22877D4593b70103a23649a5285B44847k5469d6817A0734b88812A07453
9544b5618k4747j094j07925k8392q107b5465A82220b73535R6055G0448C927b4690
9531a18398H5680M3779M5631c11924M4881M6196I820J43250J74689a92673A1123
9519b80699H2874b65380K4091L5446G329f6276k21239a40832A15219a10478F9346
9507b64828C2318J85175g2035C01436a89659k96347b9918m1182L2404D152K81458
9496B85610a506A12943k6973a5613D1598J4319Q4477m9279h8020H3494b3704I5408
9483F1654a44809q3352J02578q9606a6179j431I3010P3648a96649Q2820A77219
$$ y = [-269972, -108640, -153675, -180762, -121756, -171816, -160336, -61056, 35469, -112855, 179086, 98849, -122877, 44593, -270103, -123649, -15285, 244847, 219378, -46817, 10734, -288812, 107453, -25618, -50365, -51459, -159384, -187776, -195883, -25465, 182220, -273535, -177480, 70448, 3927, -24690, -118398, 85680, 129459, 175090, -311924, -267043, -220847, 9820, 153070, 327759, -192673, 11123, -280699, 82874, -265380, -241289, -205843, 7329, -66276, -287515, -140832, 115219, -110478, 69346, -264828, 32318, 217493, -72035, 301436, -189659, -486006, -29918, -71100, -38696, 4152, 285610, -1506, 112943, 85970, -15613, 41598, 55917, 140394, 91115, -88020, 83494, -23704, 95408, 61654, -144809, -228161, -125583, -215189, -16179, -17610, 93010, 166658, -196649, -113829, 177219]
9471B62310C1073J2263a49205A16732C4647f2529K5062j9474G6591g309r5801
9460a03110A69341d8577F8676a09865j3490k15094H0415c9453B7863b31654P2732
9449a58922c7870k6525l4696A14888g9000k19136d8914l27887B39764d7100k09949
9438b57049m4642a13163j16807a1563I9251c24419a13368r4903N2367K698j2000
9427a65206B84972a02957k66263a65117B67889g8526A45872a18064A97556o3672
9417A33884Q0976a87382f4713B71166a91876p0372A78476a83853A18832g0527
9406E5006O3704E640g9209I7095a58519d9244j88673O7008p1186J060l6848A16780
9393B46392d5899F163a33459n6486M4955B19742a53429G5727b44503a21556B12007
$$ y = [262310, 31073, 43336, -149205, 116732, 34647, -62529, -37467, -56941, 76591, -7309, -103110, 169341, -48577, 68676, -109865, -123355, -338449, 80415, -39453, 27863, -231654, -158922, -37870, -64395, -99091, 114888, -79000, -298136, -48914, -376801, 239764, -47100, -257049, -301691, -113163, -229970, -11563, 99251, -324419, -113368, -208271, -155904, -153206, -165206, 284972, -102957, -369220, -165117, 267889, -78526, 145872, -118064, 197556, 133884, 214860, -187382, -64713, 271166, -191876, -262248, 178476, -183853, 118832, -70527, 55006, 118710, 5640, -79209, 97095, -158519, -49244, -237917, -170909, -242095, -241035, -277883, 116780, 246392, -45899, 6163, -133459, -189945, -144990, 219742, -153429, 75727, -244503, -121556, 212007]
9381a87654C321a1300k96298a21266A83629D2925K9167b72186J14579H2927h0595
9369f2329A94679c48650A52793b34278j2928f3808B4191F623b79649B0008b25724
9357e2747B27281c3264D043c08325g3291C37979a2776C9849Q7466m9843N7448
9346A34920f2607q4364A91471H4092c28928J16426C09113n9475a56801f2240o502
9335f8742a8592B24914a87136g4522j07900A56725b02325I9445J30910a17576
9324b40541F1925B0061K75212a83776i951A06605N7637J05471e4672j55348B13523
9312c29652a13724J2045k58926E3416O3347a8673j73747B58682a23355B38871
9301b74048J32843k5510P7400k3890D9337a82739g0345K6662B19687b90459A32608
$$ y = [-187654, 3321, -11300, -307598, -121266, 183629, 42925, 72092, -272186, -157607, 82927, -80595, -62329, 194679, -348650, 152793, -234278, -247206, -63808, 24191, 6623, -279649, 20008, -225724, -52747, 227281, -33264, 4043, -308325, -73291, 337979, -12776, 39849, 127315, 77472, 134920, -62607, -146971, 191471, 84092, -328928, -212502, 309113, 249638, -156801, -62240, -68742, -18592, 224914, -187136, -74522, -182422, 156725, -202325, 99445, 230355, -117576, -240541, 61925, 20061, 295273, -183776, -9951, 106605, 164242, 269713, -54672, -210020, 213523, -329652, -113724, -101679, -360605, 53416, 116763, -18673, -192420, 258682, -123355, 238871, -274048, -141205, -166715, -89315, -113205, 49337, -182739, -70345, -43683, 219687, -290459, 132608]
9289H7600c6124k47527O8160D8554K9210C1522f587q9667G1353a71869A32598
9277b78961I9209D207c15176A33758N1276e8206m6599F0892f298k89578A21776
9265A97340b61841A50717a36454B90553i1839r2058O0887j08086B65751h5412
9254b43526d3254l09096J0045h3786D4873J81519b41523i1694l31548a44556l94637
9243e39193b66468J09651j91233E9589a97288A99763D5599J19413b21996i8861
9232g2039j73126i9428j88384a9493j83344M8390A02315J78727A0129a82245j96816
9221c79061C07516a75994G807J01020c2491k28204k4214J39825k1436c7341j15002
9210a52343j77681J11907a02235C44681b69008I8723O68C1241j0102a72450g3087
$$ y = [87600, -36124, -283651, -215491, 48554, 77764, 31522, -6587, -96254, 71353, -171869, 132598, -278961, 99209, 4207, -315176, 133758, 185034, -58206, -104805, 60892, -6298, -295876, 121776, 197340, -261841, 150717, -136454, 290553, -91839, -183897, -123010, -231096, 265751, -85412, -243526, -43254, -352350, -342305, -83786, 44873, 226392, -241523, -91694, -423242, -144556, -539193, -266468, -156817, -348050, 59589, -197288, 199763, 45599, 165012, -221996, -98861, -72039, -245165, -99428, -287812, -19493, -202837, -154447, 102315, 281042, 10129, -182245, -379061, 307516, -175994, 7807, 108827, -32491, -260695, -284909, -145084, -166520, -37341, -152343, -330024, -218117, -102235, 344681, -269008, 98723, 99391, 31241, 21139, -172450, -73087]
9198a62289n0958A54778K15659B8207i0617l6959M2123B10489m9350F8477i4497
9186A1484a20825M0239C43008a08450b0285j14745o0018H118a45707c0573j23860
9175a54433k68773R5691f0997A51596a51529A54718a71238m4075k05924m1874
9165d63111a79477j5158G6536e061k05874M4416f2178l2017A73416i1634B92210
9153a653A3933J83603J55077f8462q4086l6462A4784J83076a11187D1343O9011
9142A10354c14768h561m5311n0782I4843a52293j50637d8192j18761A95881c6153
9130e39231A02291J06717C39J08592h1754B7706a40638B9949L8G800M6283J86094
9118B40177H1170a59682e2332l9500j44955L981K9895B74145e9402q1378f3008
$$ y = [-162289, -213247, 154778, 370437, 28207, -90617, -127576, -85453, 210489, 161139, 68477, -94497, 11484, -120825, -80586, 343008, -108450, -20285, -135030, -195048, 8118, -145707, -30573, -154433, -423206, -327515, -60997, 151596, -151529, 154718, -171238, -215313, -421237, -463111, -179477, -194635, 76536, -5061, -210935, -166519, -62178, -94195, 173416, -91634, 292210, -1653, 13933, 197536, 352613, -68462, -152548, -189010, 14784, 197860, -111187, 41343, 110354, -314768, -8561, -53872, -104654, 94843, -152293, -302930, -48192, -166953, 195881, -36153, -539231, 102291, 209008, 339, 108931, -81754, 27706, -140638, 29949, 29987, 7800, 54083, 240177, 81170, -159682, -52332, -91832, -236787, -232806, -202911, 274145, -59402, -140780, -63008]
9106B2681R8935K74768c3155D5738a78604l3436h6674b5490k14163A70748n4015
9095A16733a80555a1165j23709m9659A14649b54069a20517D0040c2274k20940
9085b53214J19010n238D11938b35574g2045G7669A5813m488a65016B86055i9327
9073d0046B51971h4979h796j33500C9123K39813H0360J72615a43217F255i2193
9061A07270g3256j60302A53598b10782A05722K9906n3774b31582B06088E3980
9050a12794k7944j15153j35160f524j53794C3001a1193m7470j72584G2148b2307
9038F1237d1203E238O0122J2550a14226k4605L9340j09872e9929D31426H8010
9026c44122a25447A00808C323b20656G3f0466j28771c5577k7339A09356m8893
$$ y = [22681, 121616, 396384, -33155, 45738, -178604, -212040, -86674, -25490, -239653, 170748, 116733, -180555, -11165, -134874, -184533, 114649, -254069, -120517, 40040, -32274, -253214, -134204, -139442, 411938, -235574, -72045, 77669, 15813, 11325, -165016, 286055, -99327, -40046, 251971, -84979, -8796, -142296, 39123, 278936, 80360, 252975, -143217, 6255, -92193, 107270, -73256, -233558, 153598, -210782, 105722, 135628, 81854, -231582, 206088, 53980, -112794, -140738, -255891, -391051, -6524, -160318, 33001, -11193, -58663, -231247, 72148, -22307, 61237, -41203, 5238, 65360, 77910, -114226, -138831, -99491, -209363, -59929, 431426, 88010, -344122, -125447, 100808, 3323, -220656, 73, -60466, -189237, -35577, -62916, 109356, 60463]
9015F0463J3957k8562g1664G8325c18880b0301A07754c04262a43478j57334J16393
9004a84419c3705j9275j78449G8451a33806j88133B03443b71894A40806g329B31135
8992d700r3676l844A45396L167b90881A19030c63576a31168A73011a67620j20239
8981b87859c1749k26008p7104Q0575i0822d0941B7533J15832c44408A65953O024
8970A71977b4388A0831g5568A4579Q39a61374n262B2024a66439O0585A01663i0781
8957A12223c22238a54798A06759i7206I4242J85193B4578P1212q991K16523b76121
8945h5259C7785b18326J03018a4040I9745e2779r4451k70141A12016c599C47074
8933C20950j31218b4939C19787j32764a70147D7479K25775K651L51294N30178
$$ y = [60463, 74420, 45858, -71664, 78325, -318880, -20301, 107754, -304262, -143478, -300812, -184419, -33705, -52980, -231429, 78451, -133806, -321939, 203443, -271894, 140806, -7329, 231135, -4700, -98376, -102220, 145396, 148563, -290881, 119030, -363576, -131168, 173011, -167620, -287859, -31749, -257757, -334861, -254286, -90822, -40941, 27533, 143365, -344408, 165953, 171977, -24388, 10831, -75568, 14579, 15418, -161374, -166636, 22024, -166439, -105854, 101663, -90781, 112223, -322238, -154798, 106759, -97206, 94242, 279435, 24578, 95790, 86799, 303322, -276121, -85259, 37785, -218326, -115308, -14040, 99745, -52779, -147230, -417371, 112016, -3599, 347074, 320950, 189732, -24939, 319787, 187023, -170147, 47479, 273254, 275905, 627199, 1157377]
8923A157377J617910O718212N344278D068854A320835F49638j15409K53517C78621
8913B61521A04494d6281r0876A81321O92395l30753B03573i5670D1614K16612
8903B58226a9932j03845a1177n56776b19342J05369A07827C384c6728C621b24105
8891H8340a2226r2535j08660B88J00153b21607R8406a7304A35811O6152b29180
8879f9894j50975n9608N8629g3476k47061A6527d4684k16936j48344H7485m437
8868H3048a39173j6046L3939B03419J18338a59209A3806a67831F6608P7071d3437
$$ y = [1157377, 2775287, 9493499, 14837777, 4068854, 1320835, 649638, 534229, 787746, 378621, 261521, 104494, -46281, -137157, 181321, 873716, 542963, 203573, -95670, 41614, 258226, -19932, -123777, -11177, -567953, -219342, -113973, 107827, 3384, -36728, 3621, -224105, 88340, -12226, -104761, -213421, 288, 100441, -221607, -123201, -17304, 135811, 201963, -229180, -69894, -220869, -280477, -221848, -73476, -320537, 16527, -44684, -261620, -409964, 87485, 83048, -139173, -155219, -121280, 203419, 321757, -159209, 13806, -167831, 66608, 143679, -43437]
$$ [...]
##END NTUPLES=NMR SPECTRUM
##END=
