##TITLE=AC1502_INDRS13309_8125441_JUPnpALMwU
##JCAMPDX= 6.0         $$ Bruker NMR JCAMP-DX V2.0
##DATA TYPE= NMR SPECTRUM
##DATA CLASS= NTUPLES
##ORIGIN= BRUKER
##OWNER= Administrator
$$ 1.72 TOPSPIN		Version 2.1
$$ 2013-08-16 17:38:33.325 -0700  Administrator@X
$$ Compression mode = diff/dup
##.OBSERVE FREQUENCY= 400.02188249412
##.OBSERVE NUCLEUS= ^1H
##.ACQUISITION MODE= SIMULTANEOUS (DQD)
##.ACQUISITION SCHEME= undefined
##.AVERAGES= 64
##.DIGITISER RES= 22
##SPECTROMETER/DATA SYSTEM= spect
##.PULSE SEQUENCE= noesygpps1d.comp
##.SOLVENT NAME= COFFEE_meoh
##.SHIFT REFERENCE= INTERNAL, COFFEE_meoh, 1, 14.96093
##AUDIT TRAIL= $$ (NUMBER, WHEN, WHO, WHERE, PROCESS, VERSION, WHAT)
$$ ##TITLE= Audit trail, TOPSPIN		Version 2.1
$$ ##JCAMPDX= 5.01
$$ ##ORIGIN= Bruker BioSpin GmbH
$$ ##OWNER= Administrator
$$ $$ E:\/data/COFFEE/nmr/AC1502_INDRS13309_8125441_JUPnpALMwU/22/pdata/1/auditp.txt
$$ ##AUDIT TRAIL=  $$ (NUMBER, WHEN, WHO, WHERE, PROCESS, VERSION, WHAT)
(   1,<2013-08-16 17:38:28.528 -0700>,<Administrator>,<X>,<go>,<TOPSPIN 2.1>,
      <created by zg
	started at 2013-08-16 17:26:58.662 -0700,
	POWCHK enabled, PULCHK disabled,
       configuration hash MD5:
       C8 4E 4E 5D D3 5C D8 9E 9F 52 82 E0 59 8A DE 15
       data hash MD5: 64K
       AA D4 21 9E B9 5D FD 29 40 37 6A 9B 83 3F B0 A7>)
(   2,<2013-08-16 17:38:31.434 -0700>,<Administrator>,<X>,<proc1d>,<TOPSPIN 2.1>,
      <Start of raw data processing
       efp LB = 0.3 FT_mod = 6 PKNL = 1 PHC0 = 0 PHC1 = 0 SI = 128K 
       data hash MD5: 128K
       03 B9 BA 90 30 51 97 66 52 96 90 2E FB C5 8C 80>)
(   3,<2013-08-16 17:38:32.372 -0700>,<Administrator>,<X>,<proc1d>,<TOPSPIN 2.1>,
      <pk PHC0 = -80.56274 PHC1 = 0 
       data hash MD5: 128K
       C4 8F F0 FC 62 E5 8B 99 12 DD 2C 7F 47 19 0A 27>)
(   4,<2013-08-16 17:38:32.778 -0700>,<Administrator>,<X>,<proc1d>,<TOPSPIN 2.1>,
      <abs ABSG = 1 
       data hash MD5: 128K
       5F 7C E9 2B 6B 48 83 80 3A A9 37 80 17 0D 11 13>)
(   5,<2013-08-16 17:38:32.887 -0700>,<Administrator>,<X>,<proc1d>,<TOPSPIN 2.1>,
      <abs ABSG = 2 
       data hash MD5: 128K
       ED A4 3F 2A CC A8 25 A5 A6 83 C4 CB 0F 3C AD 0E>)
(   6,<2013-08-16 17:38:32.965 -0700>,<Administrator>,<X>,<proc1d>,<TOPSPIN 2.1>,
      <abs ABSG = 3 
       data hash MD5: 128K
       12 8C 00 B7 5E 09 AB EF A5 47 48 6A 9C 67 C0 70>)
(   7,<2013-08-16 17:38:33.059 -0700>,<Administrator>,<X>,<proc1d>,<TOPSPIN 2.1>,
      <abs ABSG = 4 
       data hash MD5: 128K
       B2 04 39 4F F5 D5 4F 1A 3D CE 56 7C 39 6B A4 05>)
(   8,<2013-08-16 17:38:33.137 -0700>,<Administrator>,<X>,<proc1d>,<TOPSPIN 2.1>,
      <abs ABSG = 5 
       data hash MD5: 128K
       D3 05 E6 11 4F 26 A9 FE 87 6E A0 F9 9A 0D CF 64>)
$$ ##END=
$$ 
$$ $$ hash MD5
$$ $$ A0 B4 E4 A1 0D 05 70 82 AA 42 73 60 69 67 3F A4
##$RELAX= 
##$RELAX= 
##$RELAX= 
##$RELAX= 
##$RELAX= 
##$RELAX= 
##$RELAX= 
##$RELAX= 
$$ Bruker specific parameters
$$ --------------------------
##$DU= <E:\>
##$EXPNO= 22
$$ [...]
##$TP07= 0
##$TPNAME0= <>
##$TPNAME1= <>
##$TPNAME2= <>
##$TPNAME3= <>
##$TPNAME4= <>
##$TPNAME5= <>
##$TPNAME6= <>
##$TPNAME7= <>
##$TPOAL= (0..7)
0.5 0.5 0.5 0.5 0.5 0.5 0.5 0.5
##$TPOFFS= (0..7)
0 0 0 0 0 0 0 0
##$TUNHIN= 0
##$TUNHOUT= 0
##$TUNXOUT= 0
##$USERA1= <user>
##$USERA2= <user>
##$USERA3= <user>
##$USERA4= <user>
##$USERA5= <user>
##$V9= 5
##$VALIST= <valist>
##$VCLIST= <CCCCCCCCCCCCCCC>
##$VD= 0
##$VDLIST= <DDDDDDDDDDDDDDD>
##$VPLIST= <PPPPPPPPPPPPPPP>
##$VTLIST= <TTTTTTTTTTTTTTT>
##$WBST= 2048
##$WBSW= 25
##$XGAIN= (0..3)
0 0 0 0
##$XL= 0
##$YL= 0
##$YMAX_a= 5867109
##$YMIN_a= -11187537
##$ZGOPTNS= <>
##$ZL1= 120
##$ZL2= 120
##$ZL3= 120
##$ZL4= 120
##$ABSF1= 14.96093
##$ABSF2= -5.597252
##$ABSG= 5
##$ABSL= 3
##$ALPHA= 0
##$AQORDER= 0
##$ASSFAC= 0
##$ASSFACI= 0
##$ASSFACX= 0
##$ASSWID= 0
##$AUNMP= <proc_prof1d_extract.lims>
##$AXLEFT= 0
##$AXNAME= <>
##$AXNUC= <1H>
##$AXRIGHT= 0
##$AXTYPE= 0
##$AXUNIT= <>
##$AZFE= 0.1
##$AZFW= 0.1
##$BCFW= 0
##$BC_mod= 0
##$BYTORDP= 0
##$COROFFS= 0
##$CY= 15
##$DATMOD= 1
##$DC= 0
##$DFILT= <>
##$DTYPP= 0
##$F1P= 0
##$F2P= 0
##$FCOR= 0.5
##$FTSIZE= 131072
##$FT_mod= 6
##$GAMMA= 0
##$GB= 0
##$INTBC= 1
##$INTSCL= 1
##$ISEN= 128
##$LB= 0.3
##$LEV0= 0
##$LPBIN= 0
##$MAXI= 10000
##$MC2= 0
##$MEAN= 0
##$ME_mod= 0
##$MI= 0
##$NCOEF= 0
##$NC_proc= -2
##$NLEV= 6
##$NOISF1= 0
##$NOISF2= 0
##$NSP= 0
##$NTH_PI= 0
##$NZP= 0
##$OFFSET= 14.96093
##$PC= 1
##$PHC0= -80.56274
##$PHC1= 0
##$PH_mod= 1
##$PKNL= yes
##$PPARMOD= 0
##$PPDIAG= 0
##$PPIPTYP= 0
##$PPMPNUM= 2147483647
##$PPRESOL= 1
##$PSCAL= 4
##$PSIGN= 0
##$PYNMP= <proc.py>
##$REVERSE= no
##$SF= 400.020009665164
##$SI= 131072
##$SIGF1= 0
##$SIGF2= 0
##$SINO= 400
##$SIOLD= 131072
##$SPECTYP= <>
##$SREGLST= <1H.CDCl3>
##$SSB= 0
##$STSI= 131072
##$STSR= 0
##$SW_p= 8223.68421052631
##$SYMM= 0
##$S_DEV= 0
##$TDeff= 65536
##$TDoff= 0
##$TI= <>
##$TILT= no
##$TM1= 0
##$TM2= 0
##$TOPLEV= 0
##$USERP1= <user>
##$USERP2= <user>
##$USERP3= <user>
##$USERP4= <user>
##$USERP5= <user>
##$WDW= 1
##$XDIM= 131072
##$YMAX_p= 404002064
##$YMIN_p= -11529
##$CURPLOT= <Network HP LaserJet P1505>
##$CURPRIN= <$Network HP LaserJet P1505>
##$DFORMAT= <normdp>
##$LAYOUT= <+/1D_H.xwp>
##$LFORMAT= <normlp>
##$PFORMAT= <normpl>
##$SURQMSG= 1
$$ End of Bruker specific parameters
$$ ---------------------------------
##NTUPLES= NMR SPECTRUM
##VAR_NAME=  FREQUENCY,     SPECTRUM/REAL,   SPECTRUM/IMAG
##SYMBOL=    X,             R,               I
##VAR_TYPE=  INDEPENDENT,   DEPENDENT,       DEPENDENT
##VAR_FORM=  AFFN,          ASDF,            ASDF
##VAR_DIM=   131072,        131072,          131072
##UNITS=     HZ,            ARBITRARY UNITS, ARBITRARY UNITS
##FACTOR=    0.0627417313425164, 1,          1
##FIRST=     8223.62146879497, 1044,         -53427
##LAST=      0,             3154,            -53576
##MIN=       0,             -11529,          0
##MAX=       8223.62146879497, 404002064,    0
$$ Real data points
##PAGE= N=1
##DATA TABLE= (X++(R..R)), XYDATA
$$ [...]
$$ plain form
61637 552636 555609 558752 562579 566889 570760 573316 574351 574196 573258 571746 569643 566869 563540 559971 556304
61622 556304 552321 547894 543471 539727 536833 534417 532215 530323 528786 527376 525904 524431 523080 521819
61608 521819 520442 518496 515288 510383 504093 497101 489667 481679 473536 466280 460500 455599 450543 445041
61594 445041 439598 434660 430180 425961 422078 418852 416444 414487 412228 409315 406388 404444 403490 402305
61580 402305 399896 396727 394044 392259 390651 388572 386331 384634 383637 382937 382287 381925 382176 382983 383943 384599
61564 384599 384609 383853 382677 381860 381890 382192 381537 379492 377100 375761 375703 376022 375965 375546 374907 373841 372267 370760
61546 370760 370120 370510 371312 371828 371965 372209 372973 374087 375080 375879 376863 378089 378961 379108 379203 380237 382187 384155
61528 384155 385794 387809 390812 394323 397272 398915 398978 397406 394536 391207 388181 385533 382837 379790 376456
$$ packed form
61637E52636K973L143L827M310L871K556J035j55r38j512k103k774l329l569l667
61622E56304l983m427m423l744k894k416k202j892j537j410j472j473j351j261
61608E21819j377j946l208m905o290o992p434p988q143p256n780m901n056n502
61594D45041n443m938m480m219l883l226k408j957k259k913k927j944r54j185
61580D02305k409l169k683j785j608k079k241j697r97p00o50l62K51Q07R60O56
61564C84599J0p56j176q17L0L02o55k045k392j339n8L19n7m19o39j066j574j507
61546C70760o40L90Q02N16J37K44P64J114R93P99R84J226Q72J47R5J034J950J968
61528C84155J639K015L003L511K949J643O3j572k870l329l026k648k696l047l334
$$ plain form
61513 376456 373102 369947 366949 363798 360375 357186 354904 353430 351994 350330 349099 348723 348435 347101 344644
61498 344644 341991 339818 337941 335888 333535 331153 329172 327884 327108 326280 325134 324106 323666 323498 322875
61483 322875 321783 321097 321493 322631 323654 324217 324746 325793 327309 328642 329270 329466 330024 331260 332600 333362
61467 333362 333643 333977 334369 334180 333070 331620 330795 330996 331726 332098 331605 330514 329544 329121 329037 328928 328871 329201
61449 329201 329901 330574 330992 331318 331768 332432 333539 335417 337875 339932 340653 340267 340096 341228 343507 345963
61433 345963 348050 350132 352784 356009 359444 363097 367352 372151 376569 379523 380749 380811 380373 379782 379314
61418 379314 379331 380027 381279 382932 385031 387568 390173 392383 394157 395847 397598 399032 399696 399587 398971 397841
61402 397841 395949 393377 390672 388160 385435 381856 377394 372664 368198 364078 360351 357426 355807 355532
$$ packed form
61513C76456l354l155k998l151l423l189k282j474j436j664j231l76k88j334k457
61498C44644k653k173j877k053k353k382j981j288p76q28j146j028m40j68o23
61483C22875j092o86L96J138J023N63N29J047J516J333O28J96N58J236J340P62
61467C33362K81L34L92j89j110j450q25K01P30L72m93j091r70m23q4j09n7L30
61449C29201P00O73M18L26M50O64J107J878K458K057P21l86j71J132K279K456
61433C45963K087K082K652L225L435L653M255M799M418K954J226O2m38n91m68
61418C79314J7O96J252J653K099K537K605K210J774J690J751J434O64j09o16j130
61402C97841j892k572k705k512k725l579m462m730m466m120l727k925j619k75
$$ plain form
61388 355532 356066 356714 357065 357041 356682 356026 355287 354968 355478 356573 357541 358042 358456 359152 359874 360301 360830 362093
61370 362093 363814 364901 364799 364156 363938 364442 365441 366789 368462 370392 372627 375413 378721 381957 384445
61355 384445 386064 387169 388125 389200 390699 392823 395524 398797 402965 408389 415025 422554 430839 439975
61341 439975 449933 460512 471617 483268 495236 506790 516916 524792 530187 533601 535942 537834 539169
61328 539169 539366 538046 535403 532007 528324 524356 519733 514302 508691 503987 500597 497649 493839 488944
61314 488944 484165 480889 479335 478606 477884 477295 477500 478714 480422 482033 483536 485410 488074 491616 495912
61299 495912 500820 506392 513025 521208 530829 540891 550166 557962 563921 567345 567330 563661 557195 549266
61285 549266 541051 533430 526888 521255 515928 510539 505204 500139 495489 491622 489090 488036 488036 488775 490504
$$ packed form
61388C55532N34O48L51k4l59o56p39l19N10J095R68N01M14O96P22M27N29J263
61370C62093J721J087j02o43k18N04R99J348J673J930K235K786L308L236K488
61355C84445J619J105R56J075J499K124K701L273M168N424O636P529Q285R136
61341D39975R958J0579J1105J1651J1968J1554J0126P876N395L414K341J892J335
61328E39169J97j320k643l396l683l968m623n431n611m704l390k948l810m895
61314D88944m779l276j554p29p22n89K05J214J708J611J503J874K664L542M296
61299D95912M908N572O633Q183R621J0062R275P796N959L424j5l669o466p929
61285E49266q215p621o542n633n327n389n335n065m650l867k532j054%P39J729
$$ plain form
61270 490504 493552 497755 502629 507874 513512 519859 527534 536972 547599 557903 566758 574378 581619 588773
61256 588773 595644 602493 610150 619184 629563 641296 654843 670508 687560 704181 718318 728672
61244 728672 735042 737914 737786 734896 729447 721810 712466 701884 690529 678838 667213 656235 646743
61231 646743 639312 633635 628888 624778 621765 620066 618962 617459 615251 612728 610478 609168 609506 611733
61217 611733 615303 619473 623983 628739 633081 635999 637053 636674 635552 634174 632964 632381 632643 633575 634852
61202 634852 636248 637557 638436 638452 637319 635226 633042 631965 632746 635206 638692 642995 648662 656460 666700
61187 666700 679203 693856 711069 731426 754721 779434 803391 824890 843137 857941 869598
61176 869598 879083 887671 896029 903967 911210 917993 924581 930684 935730 939449 941744 942267 940595 936777
$$ packed form
61270D90504L048M203M874N245N638O347P675R438J0627J0304Q855P620P241P154
61256E88773O871O849P657R034J0379J1733J3547J5665J7052J6621J4137J0354
61244G28672O370K872j28k890n449p637r344j0582j1355j1691j1625j0978r492
61231F46743p431n677m747m110l013j699j104j503k208k523k250j310L38K227
61217F11733L570M170M510M756M342K918J054l79j122j378j210n83K62R32J277
61202F34852J396J309Q79J6j133k093k184j077P81K460L486M303N667P798J0240
61187F66700J2503J4653J7213K0357K3295K4713K3957K1499J8247J4804J1657
61176H69598R485Q588Q358P938P243O783O588O103N046L719K295N23j672l818
$$ plain form
61162 936777 931315 924577 916541 907089 896293 884304 871112 856591 840842 824487 808537 793756
61150 793756 780149 767145 754289 741705 730071 720363 713495 709827 708990 710354 713602 718669 725268
61137 725268 732628 739395 743619 743465 738671 730972 722395 713447 703797 694233 686527 681280 677262 673434
61123 673434 670474 669658 671200 674519 679350 685747 693503 702500 713324 726793 742985 761211 780801
61110 780801 801545 823547 847005 871941 898007 924709 951811 979123 1005976 1031559 1055825
61099 1055825 1079340 1102090 1123230 1142237 1159470 1175236 1189088 1200385 1208688 1213180 1212624 1206556
61087 1206556 1195809 1181418 1163793 1143476 1121693 1099313 1076012 1051277 1025680 1000431 976329
61076 976329 953767 933124 914364 896860 880312 865203 851728 839048 826511 815022 806238 800800
$$ packed form
61162I36777n462o738q036r452j0796j1989j3192j4521j5749j6355j5950j4781
61150G93756j3607j3004j2856j2584j1634r708o868l668q37J364L248N067O599
61137G25268P360O767M224j54m794p699q577q948r650r564p706n247m018l828
61123F73434k960q16J542L319M831O397P756Q997J0824J3469J6192J8226J9590
61110G80801K0744K2002K3458K4936K6066K6702K7102K7312K6853K5583K4266
61099A055825K3515K2750K1140J9007J7233J5766J3852J1297Q303M492n56o068
61087A206556j0747j4391j7625k0317k1783k2380k3301k4735k5597k5249k4102
61076I76329k2562k0643j8760j7504j6548j5109j3475j2680j2537j1489q784n438
$$ plain form
61064 800800 798062 797131 797484 798967 801841 806417 812218 818047 823287 828500 834282 840350 846270 852198 858386
61049 858386 864815 871945 880884 892190 905432 920382 937497 956695 977034 998331 1021705 1047632
61037 1047632 1075017 1103184 1133293 1166548 1202479 1240251 1280107 1322113 1365069 1408230 1452612
61026 1452612 1499035 1546509 1594318 1644025 1697433 1754192 1813557 1876909 1946124 2020658 2098366
61015 2098366 2177741 2257447 2335778 2413454 2495307 2586543 2689164 2804711 2937731 3092395
61005 3092395 3267597 3459553 3667739 3894889 4144612 4425092 4753270 5149318 5628763
60996 5628763 6206211 6903867 7748684 8765855 9988544 11473576 13295099 15528472 18262957
60987 18262957 21614748 25640097 30136560 34519469 37992204 39964302 40383595 39704238
$$ packed form
61064H00800k738r31L53J483K874M576N801N829N240N213N782O068N920N928O188
61049H58386O429P130Q939J1306J3242J4950J7115J9198K0339K1297K3374K5927
61037A047632K7385K8167L0109L3255L5931L7772L9856M2006M2956M3161M4382
61026A452612M6423M7474M7809M9707N3408N6759N9365O3352O9215P4534P7708
61015B098366P9375P9706P8331P7676Q1853R1236J02621J15547J33020J54664
61005C092395J75202J91956K08186K27150K49723K80480L28178L96048M79445
60996E628763N77448O97656Q44817J017171J222689J485032J821523K233373K734485
60987A8262957L351791M025349M496463M382909L472735J972098M19293o79357
$$ plain form
60979 39704238 38573941 37561335 37088337 37424916 38566726 40080732 41178380 41087078 39457794
60970 39457794 36485290 32696488 28642183 24720301 21157515 18051370 15410094 13191312
60962 13191312 11339620 9804383 8537372 7491488 6627704 5917039 5333416 4849889 4443181
60953 4443181 4096657 3797151 3533217 3297794 3088224 2901732 2733830 2581866 2446426
60944 2446426 2327857 2224410 2134559 2057559 1990248 1926346 1860722 1792184 1721217 1647807 1572880
60933 1572880 1499222 1429083 1362558 1299479 1240935 1187659 1138670 1092755 1049773 1009636 971692
60922 971692 936049 903845 875268 848867 823625 800121 778850 759087 740346 723278 708120
60911 708120 693767 679448 665930 654136 643855 634647 626725 620102 614214 609157 605923 604586 603690
$$ packed form
60979C9704238j130297j012606m72998L36579J141810J514006J097648r1302j629284
60970C9457794k972504l788802m054305l921882l562786l106145k641276k218782
60962A3191312j851692j535237j267011j045884q63784p10665n83623m83527m06708
60953D443181l46524k99506k63934k35423k09570j86492j67902j51964j35440
60944B446426j18569j03447q9851p7000o7311o3902o5624o8538p0967p3410p4927
60933A572880p3658p0139o6525o3079n8544n3276m8989m5915m2982m0137l7944
60922I71692l5643l2204k8577k6401k5242k3504k1271j9763j8741j7068j5158
60911G08120j4353j4319j3518j1794j0281r208p922o623n888n057l234j337q96
$$ plain form
60898 603690 602264 600960 600244 598991 596143 592499 589515 587220 584525 580824 576320 571459 566902 563316
60884 563316 560483 557337 553416 549357 545501 541157 535966 530836 526697 523351 520355 517988 516430 514947
60870 514947 512841 510375 507926 505106 501623 498116 495232 492598 489623 486530 483752 481004 477847 474513
60856 474513 471343 468034 464277 460529 457384 454714 452127 449681 447501 445328 443112 441469 440896 441101 441666
60841 441666 442656 444054 445377 446521 448086 450119 451297 450287 447285 443513 439925 437218 436298 437595 440322
60826 440322 443347 446455 450032 453962 457632 460701 463207 465316 467483 470327 473744 476696 478480 479547
60812 479547 480461 480884 480494 480084 480631 481709 481932 480667 478355 475441 471946 467932 463472 458254 452014 445284
60796 445284 438995 433414 428110 422761 417392 411982 406508 401245 396431 391821 387170 382942 379849 377813
$$ packed form
60898F03690j426j304p16j253k848l644k984k295k695l701m504m861m557l586
60884E63316k833l146l921m059l856m344n191n130m139l346k996k367j558j483
60870E14947k106k466k449k820l483l507k884k634k975l093k778k748l157l334
60856D74513l170l309l757l748l145k670k587k446k180k173k216j643n73K05N65
60841D41666R90J398J323J144J565K033J178j010l002l772l588k707r20J297K727
60826D40322L025L108L577L930L670L069K506K109K167K844L417K952J784J067
60812D79547R14M23l90m10N47J078K23j265k312k914l495m014m460n218o240o730
60796D45284o289n581n304n349n369n410n474n263m814m610m651m228l093k036
$$ plain form
60782 377813 376062 374188 372475 371127 369789 367979 365656 363240 361343 360437 360566 361283 361924 361871 360768 358903
60766 358903 357402 357453 359228 362049 365667 370519 376501 382476 387665 392751 398756 405391 411427 416441 421363
60751 421363 427366 434779 442982 450907 457766 463670 469377 475262 480878 485730 489931 493690 496682 498402
60737 498402 498693 497507 494694 490604 486383 482964 480054 476681 472435 467668 462823 458085 453438 448545
60723 448545 442885 436463 430083 424421 419162 413519 407300 401023 395212 389962 384968 379756 374223 369064
60709 369064 365170 362436 359914 357349 355659 355432 355941 356284 356584 357240 357880 358125 358672 360551 363804 367921
60693 367921 372991 379279 386098 392363 398070 404034 410310 416040 420845 425248 429535 433225 435933 437942
60679 437942 439602 440761 440965 439814 437175 433541 429977 427078 424177 420325 415880 412199 409825 407936
$$ packed form
60782C77813j751j874j713j348j338j810k323k416j897r06J29P17O41n3j103j865
60766C58903j501N1J775K821L618M852N982N975N189N086O005O635O036N014M922
60751D21363O003P413Q203P925O859N904N707N885N616M852M201L759K992J720
60737D98402K91j186k813m090m221l419k910l373m246m767m845m738m647m893
60723D48545n660o422o380n662n259n643o219o277n811n250m994n212n533n159
60709C69064l894k734k522k565j690k27N09L43L00O56O40K45N47J879L253M117
60693C67921N070O288O819O265N707N964O276N730M805M403M287L690K708K009
60679D37942J660J159K04j151k639l634l564k899k901l852m445l681k374j889
$$ plain form
60665 407936 405750 403523 401863 400840 400240 400088 400387 400713 400520 399750 398921 398684 399341 400694 402382 404451
60649 404451 407341 411166 415367 419467 423821 429095 435239 441516 447453 453190 458859 464148 468590 472051
60635 472051 474904 477860 481568 486229 491784 498425 506506 515873 525939 536739 549272 564297 581409
60622 581409 599845 619573 640940 663797 687764 713011 740012 768819 799118 830513 862135
60611 862135 892597 921114 948034 973317 995122 1011079 1020537 1024283 1022469 1014329 999995 981107
60599 981107 959254 934902 908188 879718 850183 820112 790359 762011 735377 709847 685134
60588 685134 661948 641091 622548 605859 590774 577150 564751 553556 543839 535647 528583 522314
60576 522314 516902 512459 508921 506284 504613 503738 503437 504002 506077 509774 514561 520293 527761 537862 550613
$$ packed form
60665D07936k186k227j660j023o00j52K99L26j93p70q29k37O57J353J688K069
60649D04451K890L825M201M100M354N274O144O277N937N737N669N289M442L461
60635D72051K853K956L708M661N555O641Q081R367J0066J0800J2533J5025J7112
60622E81409J8436J9728K1367K2857K3967K5247K7001K8807L0299L1395L1622
60611H62135L0462K8517K6920K5283K1805J5957R458L746j814q140j4334j8888
60599I81107k1853k4352k6714k8470k9535l0071k9753k8348k6634k5530k4713
60588F85134k3186k0857j8543j6689j5085j3624j2399j1195r717q192p064o269
60576E22314n412m443l538k637j671q75l01N65K075L697M787N732P468J0101J2751
$$ plain form
60561 550613 565378 581826 600297 621255 644333 667789 688942 705364 715712 719516 716773 708187
60549 708187 695386 680279 664395 649194 636416 627217 621239 617411 615610 616866 622160 631887 646309
60536 646309 665522 688882 715254 743728 773210 801424 825400 843125 853837 856876 851657 839158
60524 839158 822198 803615 785038 767772 753558 743500 737071 733106 731120 730810 730888 729576 726292
60511 726292 722196 719091 718135 719388 722164 725795 730239 735815 742468 749810 757996 768002 780805 796829
60497 796829 816480 840715 870761 907769 952975 1007552 1071881 1145408 1227520 1317900 1415448
60486 1415448 1517160 1618362 1713439 1796024 1859443 1898227 1909372 1891995 1846459 1774821 1681989
60475 1681989 1575433 1463174 1351874 1246229 1149116 1061863 984677 917253 859063 809206
$$ packed form
60561E50613J4765J6448J8471K0958K3078K3456K1153J6422J0348L804k743q586
60549G08187j2801j5107j5884j5201j2778r199n978l828j801J256N294R727J4422
60536F46309J9213K3360K6372K8474K9482K8214K3976J7725J0712L039n219j2499
60524H39158j6960j8583j8577j7266j4214j0058o429l965j986l10P8j312l284
60511G26292m096l105r56J253K776L631M444N576O653P342Q186J0006J2803J6024
60497G96829J9651K4235L0046L7008M5206N4577O4329P3527Q2112R0380R7548
60486A415448J01712J01202R5077Q2585O3419L8784J1145j7377m5536p1638r2832
60475A681989j06556j12259j11300j05645r7113q7253p7186o7424n8190m9857
$$ plain form
60465 809206 766300 728833 695725 666516 640909 618215 597495 578277 560774 545184 531209
60454 531209 518730 508401 500765 494925 489072 482499 476234 471352 467393 462977 457509 451729 446866 443578
60440 443578 441528 439778 437782 436099 435765 436929 438574 439750 440605 441933 444080 446575 448497 448990 447724
60425 447724 445101 441808 438117 433926 429371 424922 420821 417010 413667 411203 409539 408055 406553 405657
60411 405657 405864 406740 407446 407707 407880 408462 409777 411788 413889 415241 415535 415112 414285 413116 412030 411894 413052
60394 413052 414823 416387 417666 418888 419870 420305 420395 420567 420798 420734 420360 420136 420586 421932 423928 425887 427224
60377 427224 428123 429301 430978 432598 433774 434852 436142 437244 437719 437939 438646 439983 441511 442935 444300
60362 444300 445677 447123 448788 450662 452451 454012 455611 457350 458698 459099 458823 458666 458965 459347 459318 458638
$$ packed form
60465H09206m2906l7467l3108k9209k5607k2694k0720j9218j7503j5590j3975
60454E31209j2479j0329p636n840n853o573o265m882l959m416n468n780m863l288
60440D43578k050j750j996j683l34J164J645J176Q55J328K147K495J922M93j266
60425D47724k623l293l691m191m555m449m101l811l343k464j664j484j502q96
60411D05657K07Q76P06K61J73N82J315K011K101J352K94m23q27j169j086j36J158
60394D13052J771J564J279J222R82M35R0J72K31o4l74k24M50J346J996J959J337
60377D27224Q99J178J677J620J176J078J290J102M75K20P07J337J528J424J365
60362D44300J377J446J665J874J789J561J599J739J348M01k76j57K99L82k9o80
$$ plain form
60346 458638 457288 455518 453926 453102 453198 454054 455585 457746 460256 462726 465101 467744 471015 474820 478483
60331 478483 481110 482292 482548 482796 483379 483838 483694 483038 482263 481570 480913 480115 478953 477486 476309 476097 476821
60314 476821 477894 479120 480880 483343 486220 489550 493995 499947 506911 514210 521818 530202 539902 551666
60300 551666 566434 584803 606908 632854 662263 692952 721136 743846 760497 771275 774800 768693
60288 768693 752312 728013 699796 671417 645465 623112 604244 588194 574504 563029 553723 546796
60276 546796 542672 541187 541122 540997 540104 538338 535465 531248 525985 520261 514380 508544 503225 498702 494564
60261 494564 490411 486764 484426 483168 481937 480377 479210 478950 478992 478331 476714 474750 473202 472294 471551 470316
60245 470316 468570 467012 466110 465473 464533 463443 462742 462446 462136 461754 461621 461743 461777 461673 461853 462740 464519 467142
$$ packed form
60346D58638j350j770j592q24R6Q56J531K161K510K470K375K643L271L805L663
60331D78483K627J182K56K48N83M59j44o56p75o93o57p98j162j467j177k12P24
60314D76821J073J226J760K463K877L330M445N952O964P299P608Q384R700J1764
60300E51666J4768J8369K2105K5946K9409L0689K8184K2710J6651J0778L525o107
60288G68693j6381k4299k8217k8379k5952k2353j8868j6050j3690j1475r306o927
60276E46796m124j485o5j25q93j766k873m217n263n724n881n836n319m523m138
60261D94564m153l647k338j258j231j560j167k60M2o61j617j964j548r08p43j235
60245D70316j746j558r02o37r40j090p01k96l10l82j33J22L4j04J80Q87J779K623
$$ plain form
60227 467142 470054 472218 473138 473807 475848 479693 484209 488136 491211 493792 496093 498118 499890 501465 502989
60212 502989 504831 507361 510568 514192 518170 522607 527337 531894 535882 539085 541441 543359 545837 549613
60198 549613 554186 558230 561040 563099 565197 567512 569674 571274 572163 572532 572771 572985 572756 571733 570302
60183 570302 569228 568739 568429 567953 567263 566131 564071 560908 557031 552926 548765 544599 540645 537259 534752
60168 534752 533206 532307 531505 530612 530015 530055 530462 530815 531293 532476 534501 536866 538956 540408 541160 541584 542310
60151 542310 543503 544498 544638 544122 543503 542773 541718 540898 541318 543148 545585 548034 550692 553907 557764 562485
60135 562485 568542 576042 584464 593160 601739 609931 617548 624564 630824 635759 638890 640400 640535 638699
60121 638699 634110 627379 620520 615139 611411 608937 607703 607757 608767 610399 612622 615320 618168 621261 625292
$$ packed form
60227D67142K912K164R20O69K041L845M516L927L075K581K301K025J772J575J524
60212E02989J842K530L207L624L978M437M730M557L988L203K356J918K478L776
60198E49613M573M044K810K059K098K315K162J600Q89L69K39K14k29j023j431
60183E70302j074m89l10m76o90j132k060l163l877m105m161m166l954l386k507
60168E34752j546q99q02q93n97M0M07L53M78J183K025K365K090J452P52M24P26
60151E42310J193R95J40n16o19p30j055q20M20J830K437K449K658L215L857M721
60135E62485O057P500Q422Q696Q579Q192P617P016O260M935L131J510J35j836
60121F38699m589o731o859n381l728k474j234N4J010J632K223K698K848L093M031
$$ plain form
60106 625292 630661 636863 643027 648687 653784 658353 662459 665990 668341 668760 667139 663984 659531 653598
60092 653598 646519 639450 633367 628366 624295 621345 619563 618431 617519 617076 617508 618806 620988 624570 629820
60077 629820 635886 641332 645435 648388 650473 651513 651082 648803 644533 638608 631764 624540 616906 608768
60063 608768 600595 593204 587047 582028 577803 573928 569849 565166 559948 554575 549332 544274 539466 535164
60049 535164 531768 529562 528374 527565 526549 525308 524171 523317 522914 523592 526053 530046 534352 538070 541364
60034 541364 544725 548084 551133 554031 557222 560803 564462 567830 570574 572450 573579 574385 574946 574652 572749
60019 572749 568915 563181 555845 547832 540465 534276 528441 521998 515198 508921 503219 497377 491297 485817
60005 485817 481543 478241 475627 473878 472921 471932 470222 468232 466979 466720 466771 466573 466329 466452 466875 467240 467533
$$ packed form
60106F25292N369O202O164N660N097M569M106L531K351M19j621l155m453n933
60092F53598p079p069o083n001m071k950j782j132r12m43M32J298K182L582N250
60077F29820O066N446M103K953K085J040m31k279m270n925o844p224p634q138
60063F08768q173p391o157n019m225l875m079m683n218n373n243n058m808m302
60049E35164l396k206j188q09j016j241j137q54m03O78K461L993M306L718L294
60034E41364L361L359L049K898L191L581L659L368K744J876J129Q06N61k94j903
60019E72749l834n734p336q013p367o189n835o443o800o277n702n842o080n480
60005D85817m274l302k614j749r57r89j710j990j253k59N1j98k44J23M23L65K93
$$ plain form
59988 467533 468220 469795 472393 475782 479535 483206 486518 489532 492632 496274 500616 505282 509506 512764
59974 512764 515360 518100 521133 523400 523735 522379 520819 520079 519745 518844 517040 514611 511885 509255 507358
59959 507358 506643 506958 507948 509553 511697 513857 515503 516685 517585 517812 516846 514956 512971 511248 509558 507885
59943 507885 506509 505351 504020 502584 501539 500877 500005 498802 497920 497672 497272 495763 493257 490809 489342
59928 489342 489003 489291 489586 489745 490290 491752 493911 496063 497966 499978 502324 504916 507899 511626 515821
59913 515821 519458 521790 523002 523709 524465 525878 528341 531207 532998 533007 532079 531339 530830 530060 529228 528948 529062
59896 529062 528659 527321 525664 524461 523740 523005 522106 521634 522396 524558 527529 530812 534684 539633 545405 551227
59880 551227 556904 562948 569595 576477 583499 591269 600290 610309 620756 631083 640274 646787 649669
$$ packed form
59988D67533O87J575K598L389L753L671L312L014L100L642M342M666M224L258
59974E12764K596K740L033K267L35j356j560p40l34r01j804k429k726k630j897
59959E07358p15L15R90J605K144K160J646J182R00K27r66j890j985j723j690j673
59943E07885j376j158j331j436j045o62q72j203q82k48m00j509k506k448j467
59928D89342l39K88K95J59N45J462K159K152J903K012K346K592K983L727M195
59913E15821L637K332J212P07P56J413K463K866J791Rr28p40n09p70q32k80J14
59896E29062m03j338j657j203p21p35q99m72P62K162K971L283L872M949N772N822
59880E51227N677O044O647O882P022P770R021J0019J0447J0327R191O513K882
$$ plain form
59867 649669 649279 646483 641725 635400 628477 621882 615600 609089 602340 595934 590265 585273 580775 576589
59853 576589 572508 568541 565058 562338 560230 558536 557407 557044 557406 558594 561100 565289 571016 578223 587502
59838 587502 599625 614776 632438 651343 669053 682466 689796 691878 691016 689158 687907 689380 695258
59825 695258 704692 714164 719780 719225 711827 698076 679595 658689 637162 615846 595438 577095 561710
59812 561710 549042 538119 528329 519755 512642 506942 502360 498561 495304 492485 490136 488268 486683 484970
59798 484970 482762 480063 477237 474589 472031 469343 466633 464220 462095 459864 457311 454729 452548 450949
59784 450949 449896 449207 448521 447561 446541 445884 445512 444960 444293 444262 445240 446614 447610 448155 448527 448723 448700 448726 448925
59765 448925 448903 448406 447912 448027 448669 449369 449980 450495 450630 450307 450213 451146 452981 454979 456916 459211 462098 465365
$$ packed form
59867F49669l90k796m758o325o923o595o282o511o749o406n669m992m498m186
59853E76589m081l967l483k720k108j694j129l63L62J188K506M189N727P207R279
59838E87502J2123J5151J7662J8905J7710J3413P330K082q62j858j251J473N878
59825F95258R434R472N616n55p398j3751j8481k0906k1527k1316k0408j8343j5385
59812E61710j2668j0923r790q574p113n700m582l799l257k819k349j868j585j713
59798D84970k208k699k826k648k558k688k710k413k125k231k553k582k181j599
59784D50949j053o89o86r60j020o57l72n52o67l1R78J374R96N45L72J96k3K6J99
59765D48925k2m97m94J15O42P00O11N15J35l23r4R33J835J998J937K295K887L267
$$ plain form
59747 465365 468873 472705 476861 481294 486095 491120 495651 499070 501724 504429 507263 509515 510840 511710
59733 511710 512643 513615 514384 514843 514870 514296 513204 511933 510677 509309 507565 505173 501994 498402 495266 493112
59717 493112 491467 489524 487233 485175 483536 481910 480082 478301 476732 475247 473927 473234 473464 474423 475762
59702 475762 477244 478679 480050 481796 484519 488230 492213 495761 498786 501640 504725 508386 512856 518080
59688 518080 523599 528682 532619 535123 536594 537740 538777 539302 539126 538826 539104 539953 540917 541775 542479 542762
59672 542762 542418 541734 541042 540042 538130 535258 531917 528485 525199 522474 520566 519043 517324 515625 514664
59657 514664 514500 514416 513968 513465 513351 513877 515415 518355 522438 526780 530777 534491 538080 541437 544507 547304
59641 547304 549339 549629 547637 543877 539359 534752 530250 525840 521455 517084 512890 509144 506040 503723
$$ packed form
59747D65365L508L832M156M433M801N025M531L419K654K705K834K252J325Q70
59733E11710R33R72P69M59K7n74j092j271j256j368j744k392l179l592l136k154
59717D93112j645j943k291k058j639j626j828j781j569j485j320o93K30R59J339
59702D75762J482J435J371J746K723L711L983L548L025K854L085L661M470N224
59688E18080N519N083L937K504J471J146J037N25j76l00K78Q49R64Q58P04K83
59672E42762l44o84o92j000j912k872l341l432l286k725j908j523j719j699r61
59657E14664j64q4m48n03j14N26J538K940M083M342L997L714L589L357L070K797
59641E47304K035K90j992l760m518m607m502m410m385m371m194l746l104k317
$$ plain form
59627 503723 502273 501410 500558 499601 499224 499925 500998 501215 500386 499520 499507 500373 501776 503356 504425 504123 502226
59610 502226 499318 495993 492422 488801 485627 483336 482116 482180 483639 486021 488442 490381 491752 492289 491561
59595 491561 489705 487448 485172 482670 479985 477721 476162 474809 473255 471900 471304 471320 471353 471111 470620 469841
59579 469841 468720 467393 465987 464390 462444 460118 457280 453627 449185 444657 440976 438556 437104 436020
59565 436020 434871 433653 432711 432385 432693 433423 434356 435309 436181 437147 438486 439957 440796 440786 440858 442009 444002
59548 444002 445856 447290 448821 450604 452156 453213 454064 455029 456398 458781 462626 467417 472403 478238 486917
59533 486917 499993 517834 540444 567071 594137 615182 624718 622160 611473 597636 584183 573120
59521 573120 565420 561143 559852 561258 565193 571071 577860 584696 591245 597447 603102 607692 610548 611239
$$ packed form
59627E03723j450q63q52r57l77P01J073K17q29q66j3Q66J403J580J069l02j897
59610E02226k908l325l571l621l174k291j220O4J459K382K421J939J371N37p28
59595D91561j856k257k276k502k685k264j559j353j554j355n96J6L3k42m91p79
59579D69841j121j327j406j597j946k326k838l653m442m528l681k420j452j084
59565D36020j149j218r42l26L08P30R33R53Q72R66J339J471Q39j0P2J151J993
59548D44002J854J434J531J783J552J057Q51R65J369K383L845M791M986N835Q679
59533D86917J3076J7841K2610K6627K7066K1045R536k558j0687j3837j3453j1063
59521E73120p700m277j291J406L935N878O789O836O549O202N655M590K856O91
$$ plain form
59507 611239 609801 606494 601529 595247 588339 581328 573963 565653 556471 547132 538077 529295 521010 513675
59493 513675 507150 500745 494460 489321 486053 484127 482589 481222 480323 479898 479663 479487 479371 479364 479858 481572
59477 481572 484816 489145 494049 499626 506204 513674 521523 529249 536440 542652 547426 550280 550810 549196
59463 549196 546547 544116 542241 540594 539304 538941 539449 540163 541146 543481 547926 554241 562238 572374 584693
59448 584693 598229 612320 627610 644885 663640 682695 701510 719758 735974 747721 753067 751378
59436 751378 743066 729444 712665 694934 677520 660780 644896 630136 616566 603967 592076 580806
59424 580806 570436 561678 555237 551185 549088 548716 550215 553735 559556 568358 580414 594657 609731
59411 609731 625958 644987 667580 693563 724042 760757 801305 836890 857502 859230 845575 823092
$$ packed form
59507F11239j438l307m965o282o908p011p365q310r182r339r055q782q285p335
59493E13675o525o405o285n139l268j926j538j367q99m25k35j76j16pM94J714
59477D81572L244M329M904N577O578P470P849P726P191O212M774K854N30j614
59463E49196k649k431j875j647j290l63N08P14R83K335M445O315P997J0136J2319
59448E84693J3536J4091J5290J7275J8755J9055J8815J8248J6216J1747N346j689
59436G51378q312j3622j6779j7731j7414j6740j5884j4760j3570j2599j1891j1270
59424E80806j0370q758o441m052k097l72J499L520N821Q802J2056J4243J5074
59411F09731J6227J9029K2593K5983L0479L6715M0548L5585K0612J728j3655k2483
$$ plain form
59399 823092 797710 773957 754540 740059 730873 729248 737322 752136 764637 765315 750609 723787
59387 723787 691010 657507 626306 598668 574956 555261 539455 526993 517108 509207 502800 497178
59375 497178 491715 486409 481676 477731 474647 472777 472383 472883 473211 473038 472985 473538 474371 474971 475381 475956 476780
59358 476780 477632 478439 479543 481491 484477 488021 491501 495067 499656 505925 513647 522401 532264 543363
59344 543363 555344 567882 581293 596047 612152 629605 648847 669928 691678 712622 732368
59333 732368 751120 768149 781900 791598 797690 800608 800124 796159 789329 780258 769028 755702 740921
59320 740921 725638 710593 696175 682399 668954 655644 642917 631678 622505 615287 609484 604472
59308 604472 599806 595544 592182 589951 588420 587128 586238 586134 586775 588066 590490 594631 600251 606530 613094
$$ packed form
59399H23092k5382k3753j9417j4481r186j625Q074J4814J2501O78j4706k6822
59387G23787l2777l3503l1201k7638k3712j9695j5806j2462r885p901o407n622
59375D97178n463n306m733l945l084j870l94N00L28j73n3N53Q33O00M10N75Q24
59358D76780Q52Q07J104J948K986L544L480L566M589O269P722Q754R863J1099
59344E43363J1981J2538J3411J4754J6105J7453J9242K1081K1750K0944J9746
59333G32368J8752J7029J3751R698O092K918m84l965o830r071j1230j3326j4781
59320G40921j5283j5045j4418j3776j3445j3310j2727j1239r173p218n803n012
59308F04472m666m262l362k231j531j292q90j04O41J291K424M141N620O279O564
$$ plain form
59293 613094 620219 628280 637673 649063 662955 679127 697334 718598 745028 777855 815387 852308
59281 852308 880790 893616 888128 867652 838785 807437 777570 752128 733014 719997 711257 705607
59269 705607 703323 704723 709148 715797 724548 735386 747750 760873 774173 786992 798572 808502 816520
59256 816520 821742 822910 819712 813141 804277 793510 781287 768667 756457 744447 732225 720393
59244 720393 710333 702884 697604 693248 688810 684299 680648 678734 678504 679233 680347 681579 682642 683487 684833
59229 684833 687640 691924 696725 701253 705344 708689 710445 709991 707430 703085 697059 689573 681109 671831
59215 671831 661320 649274 636114 622648 609480 596944 585264 574559 564910 556496 549364 543134
59203 543134 537332 531976 527389 523516 519964 516665 513905 511711 509822 508269 507338 506944 506710 506734 507561 509240
$$ packed form
59293F13094P125Q061R393J1390J3892J6172J8207K1264K6430L2827L7532L6921
59281H52308K8482J2826n488k0476k8867l1348k9867k5442j9114j3017q740n650
59269G05607k284J400M425O649Q751J0838J2364J3123J3300J2819J1580R930Q018
59256H16520N222J168l198o571q864j0767j2223j2620j2210j2010j2222j1832
59244G20393j0060p449n280m356m438m511l651j914k30P29J114J232J063Q45J346
59229F84833K807M284M801M528M091L345J756m54k561m345o026p486q464r278
59215F71831j0511j2046j3160j3466j3168j2536j1680j0705r649q414p132o230
59203E43134n802n356m587l873l552l299k760k194j889j553r31l94k34K4Q27J679
$$ plain form
59187 509240 511142 512943 515117 518158 521864 525674 529262 532587 535813 539322 543361 547610 551575 555392
59173 555392 559622 564235 568534 572239 575948 580329 585494 591429 598385 606451 615261 624425 633938 643932
59159 643932 654375 665065 675606 685423 694268 702598 710934 718933 725621 730397 733142 733592 731497 727322
59145 727322 721948 715696 708512 700998 694193 688231 682304 676186 670727 666490 662913 659286 655698 652613
59131 652613 650263 648790 648204 647908 647152 646292 646688 648965 652247 655559 659063 663408 668763 675095 682671
59116 682671 691624 701594 712214 723394 734876 746248 757688 769765 782176 793655 803595 812749
59104 812749 821746 829994 836770 842452 847735 852492 856366 859790 863391 866826 869128 869928 869627 868658 867185
59089 867185 865317 863221 861314 860424 861143 862752 863570 862653 860363 856969 851795 844274 834794 823778 811004
$$ packed form
59187E09240J902J801K174L041L706L810L588L325L226L509M039M249L965L817
59173E55392M230M613M299L705L709M381N165N935O956Q066Q810R164R513R994
59159F43932J0443J0690J0541R817Q845Q330Q336P999O688M776K745M50k095m175
59145G27322n374o252p184p514o805n962n927o118n459m237l577l627l588l085
59131F52613k350j473n86k96p56q60L96K277L282L312L504M345N355O332P576
59116F82671Q953R970J0620J1180J1482J1372J1440J2077J2411J1479R940R154
59104H12749Q997Q248O776N682N283M757L874L424L601L435K302Q00l01r69j473
59089H67185j868k096j907q90P19J609Q18r17k290l394n174p521r480j1016j2774
$$ plain form
59074 811004 796665 782093 768377 755044 741147 726923 713431 701203 690263 680756 672502 664516
59062 664516 656037 647575 640016 633326 627131 621830 617911 614708 611164 607458 604554 602426 600013 596821
59048 596821 593360 590027 586669 583243 579877 576322 572381 568883 567144 567352 568423 569477 570526 571636
59034 571636 572522 573264 574510 576598 579197 582088 585558 589717 594065 598186 602405 607507 614140 622597 632717
59019 632717 643838 655255 666903 679330 692866 707071 720935 733365 743604 751518 757386 761143
59007 761143 762099 759836 755195 749858 745066 741165 738182 736254 735530 736163 738432 742515 748117 754624 761522
58992 761522 768447 775001 780854 785831 789670 791963 792625 792079 790664 788201 784431 779367 772779 763869 752196
58977 752196 738687 725159 713023 702819 694617 688261 683465 680182 678743 679234 681114 683900 687841
$$ packed form
59074H11004j4339j4572j3716j3333j3897j4224j3492j2228j0940r507q254p986
59062F64516q479q462p559o690o195n301l919l203l544l706k904k128k413l192
59048E96821l461l333l358l426l366l555l941l498j739K08J071J054J049J110
59034E71636Q86P42J246K088K599K891L470M159M348M121M219N102O633Q457J0120
59019F32717J1121J1417J1648J2427J3536J4205J3864J2430J0239P914N868L757
59007G61143R56k263m641n337m792l901k983j928p24O33K269M083N602O507O898
58992G61522O925O554N853M977L839K293O62n46j415k463l770n064o588q910j1673
58977G52196j3509j3528j2136j0204q202o356m796l283j439M91J880K786L941
$$ plain form
58964 687841 693432 700658 709190 718894 729593 740760 751980 763244 774247 783916 791319 796481 799596
58951 799596 799997 796774 789964 780301 768259 754271 739475 725127 711470 698132 685475 674538
58939 674538 665814 659005 653978 650984 649809 649500 649063 647901 645629 642131 637853 633508 629520 625998 622875
58924 622875 619620 615422 610316 605566 602097 599150 595437 591099 587351 584636 582356 580223 578592 577544
58910 577544 576833 576783 578097 580687 583707 586826 590568 595397 601404 608877 618216 629342 642125 657169
58896 657169 675000 694528 713560 730855 746571 760803 773168 784056 794862 806572 819399
58885 819399 834137 852381 874674 899613 925517 951861 978265 1003134 1024380 1040979 1053118
58874 1053118 1061309 1065938 1067121 1064437 1057187 1045253 1029301 1010058 988223 965272 943331 923641
$$ packed form
58964F87841N591P226Q532R704J0699J1167J1220J1264J1003R669P403N162L115
58951G99596M01l223o810r663j2042j3988j4796j4348j3657j3338j2657j0937
58939F74538q724o809n027k994j175l09m37j162k272l498m278m345l988l522l123
58924F22875l255m198n106m750l469k947l713m338l748k715k280k133j631j048
58910E77544p11n0J314K590L020L119L742M829O007P473R339J1126J2783J5044
58896F57169J7831J9528J9032J7295J5716J4232J2365J0888J0806J1710J2827
58885H19399J4738J8244K2293K4939K5904K6344K6404K4869K1246J6599J2139
58874A053118Q191M629J183k684p250j1934j5952j9243k1835k2951k1941j9690
$$ plain form
58862 923641 905816 889050 873258 858564 844499 830457 816336 802142 787501 772182 756552
58851 756552 740945 725044 708502 691835 676219 662625 651383 642190 634265 626915 620157 614374
58839 614374 609301 604052 598317 592758 587910 583450 578899 574307 569779 565106 560367 556175 552751 549448
58825 549448 545762 542149 539150 536378 533210 529961 527488 525932 524660 523318 522267 522005 522746 524503 527162
58810 527162 530378 533689 536731 539351 541708 544261 547257 550202 552323 553660 555062 556831 558063 557744
58796 557744 555973 553641 551390 549394 547725 546423 545432 544814 544736 545049 545359 545829 547414 550811 555633 561027
58780 561027 566676 572779 579479 586860 595082 603937 612570 620187 626785 632633 637217 639298 638065 633902
58766 633902 628050 621769 615761 610123 604798 599998 595964 592435 588820 584992 581457 578602 576353 574793
$$ packed form
58862I23641j7825j6766j5792j4694j4065j4042j4121j4194j4641j5319j5630
58851G56552j5607j5901j6542j6667j5616j3594j1242r193p925p350o758n783
58839F14374n073n249n735n559m848m460m551m592m528m673m739m192l424l303
58825E49448l686l613k999k772l168l249k473j556j272j342j051k62P41J757K659
58810E27162L216L311L042K620K357K553K996K945K121J337J402J769J232l19
58796E57744j771k332k251j996j669j302r91o18p8L13L10M70J585L397M822N394
58780E61027N649O103O700P381Q222Q855Q633P617O598N848M584K081j233m163
58766F33902n852o281o008n638n325m800m034l529l615l828l535k855k249j560
$$ plain form
58752 574793 574537 576044 578965 582589 586553 590740 594893 598764 602409 606018 609709 613756 618650 624586
58738 624586 631307 638819 647785 658593 670322 681337 690897 699690 708749 718307 727830 736834 745414
58725 745414 754068 763135 772388 781129 788645 794708 799829 805038 811135 818044 825188 832607 841224 851652
58711 851652 863216 874697 885571 895840 905065 912555 918333 922894 925919 926125 922535 915092 903938
58698 903938 889072 870954 850548 828313 804025 778050 752011 727591 705258 684695 665905
58687 665905 649262 634870 622448 611699 602468 594700 588321 582851 577222 570556 563155 556135 550043
58674 550043 544549 539528 535507 532738 530770 529394 529215 530725 533504 536931 541193 547045 554988 565015
58660 565015 576651 588894 600537 610797 619175 624718 626386 624485 620938 617645 615169 613221 611485
$$ packed form
58752E74793k56J507K921L624L964M187M153L871L645L609L691M047M894N936
58738F24586O721P512Q966J0808J1729J1015R560Q793R059R558R523R004Q580
58725G45414Q654R067R253Q741P516O063N121N209O097O909P144P419Q617J0428
58711H51652J1564J1481J0874J0269R225P490N778M561L025K06l590p443j1154
58698I03938j4866j8118k0406k2235k4288k5975k6039k4420k2333k0563j8790
58687F65905j6643j4392j2422j0749r231p768o379n470n629o666p401p020o092
58674E50043n494n021m021k769j968j376j79J510K779L427M262N852P943J0027
58660E65015J1636J2243J1643J0260Q378N543J668j901l547l293k476j948j736
$$ plain form
58647 611485 609545 606933 603897 601341 599444 597177 593735 589596 585483 581249 576676 572559 569837 568208
58633 568208 566587 564629 562937 562073 562185 563316 565343 567770 570140 572365 574273 575300 575192 574502 573810
58618 573810 572965 571711 570557 570321 571295 573526 577416 583297 590762 599134 608247 618078 627969 636801 643711
58603 643711 648207 650157 650224 649727 649391 648670 646924 644615 642558 640627 638156 635166 632249 629572 626972
58588 626972 624812 623830 624271 625870 628519 632249 636891 642510 649832 659373 670399 681600 692540 703558
58574 703558 714443 724260 732498 739545 745908 751808 757657 764207 771968 780997 791481 804064 819421
58561 819421 837739 858651 881451 905459 930389 956147 982041 1006554 1028220 1046429 1061007
58550 1061007 1071429 1076970 1077385 1073065 1064774 1053563 1040549 1026426 1011471 996225 981573 967779
$$ packed form
58647F11485j940k612l036k556j897k267l442m139m113m234m573m117k722j629
58633E68208j621j958j692q64J12J131K027K427K370K225J908J027j08o90o92
58618E73810q45j254j154k36R74K231L890N881P465Q372R113R831R891Q832O910
58603F43711M496J950O7m97l36p21j746k309k057j931k471k990k917k677k600
58588F26972k160r82M41J599K649L730M642N619P322R541J1026J1201J0940J1018
58574G03558J0885R817Q238P047O363N900N849O550P761R029J0484J2583J5357
58561H19421J8318K0912K2800K4008K4930K5758K5894K4513K1666J8209J4578
58550A061007J0422N541M15m320q291j1211j3014j4123j4955j5246j4652j3794
$$ plain form
58538 967779 954107 939878 925263 910449 894757 877409 858708 839715 821158 803388 786972
58527 786972 772528 760172 749703 741038 734040 728339 723827 720846 719393 718765 718519 719106 720809 722782
58513 722782 723984 724456 724800 725013 724797 724489 724678 725303 726086 727419 729830 732922 735800 738263 740725 743279
58497 743279 745742 748218 750716 752580 753233 753131 753115 753203 752939 752441 752013 751173 749249 746724 744854 744133 744230
58480 744230 745251 747900 752450 758562 766107 775196 785428 796094 807108 818776 830616 841210 849314
58467 849314 854485 856728 856248 853483 848847 842629 835550 828817 823002 817445 811605 806326 802857 801296
58453 801296 801105 802516 806164 811835 818818 827017 836320 845294 851956 855694 857133 856413 853064 847470 840957
58438 840957 834292 827374 820522 814854 811224 809755 810370 812807 816207 819759 823633 828344 833506 838395
$$ packed form
58538I67779j3672j4229j4615j4814j5692j7348j8701j8993j8557j7770j6416
58527G86972j4444j2356j0469q665o998n701m512k981j453o28k46N87J703J973
58513G22782J202M72L44K13k16l08J89O25P83J333K411L092K878K463K462K554
58497G43279K463K476K498J864O53j02j6Q8k64m98m28q40j924k525j870p21R7
58480G44230J021K649M550O112P545R089J0232J0666J1014J1668J1840J0594Q104
58467H49314N171K243m80k765m636o218p079o733n815n557n840n279l469j561
58453H01296j91J411L648N671O983Q199R303Q974O662L738J439p20l349n594o513
58438H40957o665o918o852n668l630j469O15K437L400L552L874M711N162M889
$$ plain form
58424 838395 843430 849769 857629 866240 875251 884920 895103 905344 915653 925868 934553 940111 942896
58411 942896 944687 946261 946966 946459 945074 942508 937963 931803 925448 919470 913439 907696 903447 900808 898541
58396 898541 896162 894597 894360 894793 895648 897723 901323 905636 910120 914899 919293 921767 922161 922288 923351
58381 923351 924294 923788 922526 922396 924353 928043 932617 937121 940920 944412 948595 953540 958276 962458 967020
58366 967020 972718 979240 986329 994651 1004896 1016871 1029894 1043306 1056500 1069438 1083176 1098692
58354 1098692 1115241 1131186 1146289 1161503 1176414 1188887 1197626 1203316 1206906 1208673 1209562 1211452 1215207
58341 1215207 1220157 1226168 1234331 1244734 1255526 1265360 1275204 1286655 1299983 1314814 1331125 1348463
58329 1348463 1365643 1382240 1399018 1416101 1432403 1447712 1463438 1480090 1495846 1508996 1520148
$$ packed form
58424H38395N035O339P860Q611R011R669J0183J0241J0309J0215Q685N558K785
58411I42896J791J574P05n07j385k566m545o160o355n978o031n743m249k639k267
58396H98541k379j565k37M33Q55K075L600M313M484M779M394K474L94J27J063
58381I23351R43n06j262j30J957L690M574M504L799L492M183M945M736M182M562
58366I67020N698O522P089Q322J0245J1975J3023J3412J3194J2938J3738J5516
58354A098692J6549J5945J5103J5214J4911J2473Q739N690L590J767Q89J890L755
58341A215207M950O011Q163J0403J0792R834R844J1451J3328J4831J6311J7338
58329A348463J7180J6597J6778J7083J6302J5309J5726J6652J5756J3150J1152
$$ plain form
58318 1520148 1530600 1540230 1548560 1556450 1565044 1574297 1584008 1595073 1608127 1622055 1635352 1648049
58306 1648049 1661049 1674696 1689250 1705636 1724324 1744397 1764878 1785908 1807630 1829221 1850227
58295 1850227 1871543 1893856 1916467 1938890 1962158 1987067 2012526 2037248 2061935 2088210 2116421
58284 2116421 2145912 2176463 2208151 2240728 2274362 2309936 2347700 2386834 2427271 2470350 2516676
58273 2516676 2565093 2614977 2667654 2724096 2783088 2843258 2905084 2969224 3034742 3100806 3168329
58262 3168329 3238012 3308649 3379327 3451545 3527103 3605700 3686648 3770991 3859609 3951076 4043757
58251 4043757 4138223 4235287 4333675 4432250 4532657 4637120 4745529 4857425 4974684 5099234
58241 5099234 5230222 5366739 5511291 5666990 5833342 6008612 6194504 6394375 6608479
$$ packed form
58318A520148J0452R630Q330P890Q594R253R711J1065J3054J3928J3297J2697
58306A648049J3000J3647J4554J6386J8688K0073K0481K1030K1722K1591K1006
58295A850227K1316K2313K2611K2423K3268K4909K5459K4722K4687K6275K8211
58284B116421K9491L0551L1688L2577L3634L5574L7764L9134M0437M3079M6326
58273B516676M8417M9884N2677N6442N8992O0170O1826O4140O5518O6064O7523
58262C168329O9683P0637P0678P2218P5558P8597Q0948Q4343Q8618R1467R2681
58251D043757R4466R7064R8388R8575J00407J04463J08409J11896J17259J24550
58241E099234J30988J36517J44552J55699J66352J75270J85892J99871K14104
$$ plain form
58232 6608479 6835252 7075832 7332915 7606479 7895239 8201233 8528438 8877981 9249404
58223 9249404 9645516 10071048 10527731 11016125 11541372 12111469 12730679 13400621 14127289
58214 14127289 14920771 15788818 16737791 17779903 18932486 20210507 21628088 23208028
58206 23208028 24982025 26982137 29242684 31812512 34756390 38145692 42062894 46620254
58198 46620254 51963450 58258070 65692999 74504945 84986153 97473207 112364278 130158697
58190 130158697 151439722 176788514 206702215 241430339 280424049 321379470 359638987
58183 359638987 389000728 404002064 402278103 385321479 357310756 323167532 287145536
58176 287145536 252302647 220496664 192604997 168881749 149293103 133655923 121675481
$$ packed form
58232F608479K26773K40580K57083K73564K88760L05994L27205L49543L71423
58223I249404L96112M25532M56683M88394N25247N70097O19210O69942P26668
58214A4127289P93482Q68047R48973J042112J152583J278021J417581J579940
58206B3208028J773997K000112K260547K569828K943878L389302L917202M557360
58198D6620254N343196O294620P434929Q811946J0481208J2487054J4891071J7794419
58190A30158697K1281025K5348792K9913701L4728124L8993710M0955421L8259517
58183C59638987K9361741J5001336j723961j6956624k8010723l4143224l6021996
58176B87145536l4842889l1805983k7891667k3723248j9588646j5637180j1980442
$$ plain form
58169 121675481 113088358 107777794 105503851 105335498 105466276 103876863 99380760 92117543
58161 92117543 83147051 73671665 64554990 56271789 49021728 42818398 37565548 33137941
58153 33137941 29420050 26297455 23655511 21401729 19473172 17818133 16386894 15142668
58145 15142668 14063557 13126312 12299380 11556086 10883269 10271746 9707402 9176589 8672926
58136 8672926 8194501 7740370 7312948 6917661 6556571 6226473 5924894 5652808 5409779
58127 5409779 5191822 4995929 4821203 4662942 4510704 4355582 4196009 4034579 3873423
58118 3873423 3715102 3563772 3421964 3288740 3163086 3046249 2938743 2838140 2742222 2651642
58108 2651642 2567345 2488031 2412399 2341486 2276448 2216136 2159072 2105834 2057235 2011744 1966873
$$ packed form
58169A21675481q587123n310564k273943j68353J30778j589413m496103p263217
58161I2117543q970492r475386r116675q283201p250061o203330n252850m427607
58153C3137941l717891l122595k641944k253782j928557j655039j431239j244226
58145A5142668j079111r37245q26932p43294o72817o11523n64344n30813n03663
58136H672926m78425m54131m27422l95287l61090l30098l01579k72086k43029
58127E409779k17957j95893j74726j58261j52238j55122j59573j61430j61156
58118C873423j58321j51330j41808j33224j25654j16837j07506j00603r5918r0580
58108B651642q4297p9314p5632p0913o5038o0312n7064n3238m8599m5491m4871
$$ plain form
58097 1966873 1921784 1876806 1831863 1787235 1744541 1705073 1667955 1631441 1595207 1560178 1527017
58086 1527017 1495926 1467089 1440256 1414629 1389816 1366045 1342989 1319606 1295752 1272616 1250919
58075 1250919 1229938 1208865 1187739 1166397 1144083 1120902 1098215 1076755 1055752 1034684 1014305
58064 1014305 995068 976167 957313 939916 925251 912750 901298 890845 881364 871521 860022 847364
58052 847364 834831 822481 809546 796110 783033 770700 759028 748251 738585 729513 720390 711416
58040 711416 703230 695956 689382 683546 678319 672903 666577 659574 652560 645655 638485 630725 622065 612218
58026 612218 601529 591030 581365 572251 563395 555165 547793 540783 533776 527248 521593 516297 510800 505498
58012 505498 501054 497329 493846 490691 488127 485819 483355 481086 479609 478723 477717 476357 474907 473514
$$ packed form
58097A966873m5089m4978m4943m4628m2694l9468l7118l6514l6234l5029l3161
58086A527017l1091k8837k6833k5627k4813k3771k3056k3383k3854k3136k1697
58075A250919k0981k1073k1126k1342k2314k3181k2687k1460k1003k1068k0379
58064A014305j9237j8901j8854j7397j4665j2501j1452j0453r481r843j1499j2658
58052H47364j2533j2350j2935j3436j3077j2333j1672j0777r666r072r123q974
58040G11416q186p274o574n836n227n416o326p003p014o905p170p760q660r847
58026F12218j0689j0499r665r114q856q230p372p010p007o528n655n296n497n302
58012E05498m444l725l483l155k564k308k464k269j477q86j006j360j450j393
$$ plain form
57998 473514 472248 471419 471164 470990 470359 469517 469234 470041 472216 476100 481738 488381 494847 500284 504339 507005
57982 507005 508637 509692 510044 508981 506303 502919 499851 497077 493809 489514 484282 478661 473535 469601
57968 469601 466483 462879 458024 452438 446813 440952 434567 428395 423583 420343 418044 416226 414654 412688
57954 412688 409572 405389 401018 397153 393921 391298 389225 387389 385516 383941 383383 384064 385459 386971 388509
57939 388509 390330 392540 394850 396827 398464 400446 403500 407547 411923 416459 421683 427712 433580 438133
57925 438133 441162 443349 445557 448467 452336 456628 460350 463116 465431 467604 468946 468474 465846 461241
57911 461241 454960 447616 440003 432189 423354 413170 402661 393040 384336 375860 367280 358361 348471 337569
57897 337569 327130 318736 312097 305779 299644 295054 292563 290944 289039 287341 286942 287812 288939 289629 289947
$$ packed form
57998D73514j266q29k55j74o31q42k83Q07K175L884N638O643O466N437M055K666
57982E07005J632J055L52j063k678l384l068k774l268m295n232n621n126l934
57968D69601l118l604m855n586n625n861o385o172m812l240k299j818j572j966
57954D12688l116m183m371l865l232k623k073j836j873j575n58O81J395J512J538
57939C88509J821K210K310J977J637J982L054M047M376M536N224O029N868M553
57925D38133L029K187K208K910L869M292L722K766K315K173J342m72k628m605
57911D61241o281p344p613p814q835j0184j0509r621q704q476q580q919r890j0902
57897C37569j0439q394o639o318o135m590k491j619j905j698l99Q70J127O90L18
$$ plain form
57882 289947 290243 290910 292446 295278 299471 304825 311049 317665 323923 329135 333100 336097 338510 340512 342037
57867 342037 342955 343246 342952 342047 340482 338328 335643 332236 327876 322835 317969 314152 311877 311265 311943 312911
57851 312911 313215 313034 313515 315318 318033 321303 325588 331203 337440 343535 349767 356585 363208 368318 371845
57836 371845 374906 378047 380668 382159 382489 381449 378361 373033 366323 359378 352853 347049 342117 337854
57822 337854 333885 330309 327652 325931 324447 322817 321681 321931 323661 326232 329046 331896 334798 337783
57808 337783 340665 342926 344042 344028 343365 342284 340453 337469 333283 328025 321705 314271 305787 296536 287119
57793 287119 278284 270306 262715 255105 248011 242324 238021 234236 230626 227734 225782 224053 221982 220050
57779 220050 218929 218356 217622 216794 216665 217769 220113 223711 228585 234245 239788 244782 249668 255149 261446
$$ packed form
57882B89947K96O67J536K832M193N354O224O616O258N212L965K997K413K002J525
57867C42037R18K91k94r05j565k154k685l407m360n041m866l817k275o12O78R68
57851C12911L04j81M81J803K715L270M285N615O237O095O232O818O623N110L527
57836C71845L061L141K621J491L30j040l088n328o710o945o525n804m932m263
57822C37854l969l576k657j721j484j630j136K50J730K571K814K850K902K985
57808C37783K882K261J116j4o63j081j831k984m186n258o320p434q484r251r417
57793B87119q835p978p591p610p094n687m303l785l610k892j952j729k071j932
57779B20050j121n73p34q28j29J104K344L598M874N660N543M994M886N481O297
$$ plain form
57764 261446 268275 275270 282220 288964 295197 300500 304596 307516 309285 309493 307504 303205 297250 290418
57750 290418 283082 275570 268666 263236 259375 256294 253129 249715 246555 244156 242412 240620 238226 235509
57736 235509 233280 231832 230537 228683 226333 224103 222442 221562 221766 223205 225287 226896 227495 227707 228562
57721 228562 230334 232306 233605 234118 234547 235637 237428 239328 240783 241632 241818 241141 239579 237587 235718
57706 235718 234083 232527 231248 230775 231233 231984 232206 231679 230861 230343 230347 230722 231295 232223 233950 236693 240007
57689 240007 242990 244941 245774 245852 245595 245210 244615 243572 242046 240486 239681 240341 242908 247637 254606 263689
57673 263689 274853 288663 306390 329532 359337 396757 442725 498576 566287 647507 740481
57662 740481 836527 919979 973663 986726 959057 899714 821767 737478 655694 581342 516367
$$ packed form
57764B61446O829O995O950O744O233N303M096K920J769K08j989m299n955o832
57750B90418p336p512o904n430l861l081l165l414l160k399j744j792k394k717
57736B35509k229j448j295j854k350k230j661q80K04J439K082J609N99K12Q55
57721B28562J772J972J299N13M29J090J791J900J455Q49J86o77j562j992j869
57706B35718j635j556j279m73M58P51K22n27q18n18ML75N73R28J727K743L314
57689B40007K983J951Q33P8k57l85n95j043j526j560q05O60K567M729O969R083
57673B63689J1164J3810J7727K3142K9805L7420M5968N5851O7711Q1220R2974
57662G40481R6046Q3452N3684J3063k7669n9343p7947q4289q1784p4352o4975
$$ plain form
57651 516367 461205 415617 378631 348533 323628 303014 286384 273220 262596 253734 246423 240781
57639 240781 236817 234240 232503 231031 229619 228586 228287 228497 228655 228716 229247 230476 231730 232310 232546 233376
57623 233376 234947 236252 236293 235099 233303 231166 228468 225170 221708 218554 215784 213212 210735 208428 206469
57608 206469 205091 204467 204432 204363 203593 202080 200571 199905 200157 200592 200485 199843 199277 199246 199595 199675 198747 196354 192677
57589 192677 188647 185412 183414 182065 180499 178459 176229 173920 171328 168533 166141 164656 163941 163541 163255
57574 163255 163019 162513 161310 159367 156966 154256 151310 148555 146623 145575 144759 143702 142716 142236 141953 141167
57558 141167 139850 138818 138749 139467 140370 141227 142224 143370 144239 144502 144533 145249 147154 149742 151980 153260 153603
57541 153603 153102 151702 149690 147867 146900 146790 147273 148331 149893 151422 152435 153206 154304 155532 156001 155334
$$ packed form
57651E16367n5162m5588l6986l0098k4905k0614j6630j3164j0624q862p311n642
57639B40781l964k577j737j472j412j033k99K10J58O1N31J229J254N80K36Q30
57623B33376J571J305M1j194j796k137k698l298l462l154k770k572k477k307j959
57608B06469j378o24l5o9p70j513j509o66K52M35j07o42n66l1L49Q0r28k393l677
57589A92677m030l235j998j349j566k040k230k309k592k795k392j485p15m00k86
57574A63255k36n06j203j943k401k710k946k755j932j048q16j057r86m80k83p86
57558A41167j317j032o9P18R03Q57R97J146Q69K63L1P16J905K588K238J280L43
57541A53603n01j400k012j823r67j10M83J058J562J529J013P71J098J228M69o67
$$ plain form
57525 155334 154098 152926 151909 151163 151210 152196 153209 153105 151860 150552 150058 150309 150816 151489 152713 154845
57509 154845 157770 160816 163120 164182 164074 163116 161558 159658 157816 156265 154755 152844 150452 147921 145607
57494 145607 143743 142535 142003 141703 141029 139859 138584 137408 136094 134619 133609 133674 134530 135261 135387 135238
57478 135238 135193 135068 134550 133976 134207 135569 137195 137691 136480 134330 132459 131320 130483 129561 128810 128627 128784
57461 128784 128538 127452 125900 124813 125105 127107 130165 132849 134043 133948 133683 133797 133640 132452 130632 129431
57445 129431 129621 130878 132340 133368 133823 134024 134409 134971 135161 134698 134238 134652 135736 136345 135889 134983 134347
57428 134347 133853 133146 132566 132735 133579 134478 135199 136081 137373 138932 140510 141823 142387 141850 140586 139476 138980
57411 138980 138768 138342 137627 136819 136088 135596 135507 135785 136256 136945 138003 139167 139716 139287 138460 138147 138608 139386
$$ packed form
57525A55334j236j172j017p46M7R86J013j04j245j308m94K51N07O73J224K132
57509A54845K925L046K304J062j08r58j558j900j842j551j510j911k392k531k314
57494A45607j864j208n32l00o74j170j275j176j314j475j010O5Q56P31J26j49
57478A35238m5j25n18n74K31J362J626M96j211k150j871j139q37r22p51j83J57
57461A28784k46j086j552j087K92K002L058K684J194r5k65J14j57j188j820j201
57445A29431J90J257J462J028M55K01L85N62J90m63m60M14J084O09m56r06o36
57428A34347m94p07n80J69Q44Q99P21Q82J292J559J578J313N64n37j264j110m96
57411A38980k12m26p15q08p31m92q9K78M71O89J058J164N49m29q27l13M61P78
$$ plain form
57393 139386 140116 140994 142388 144295 146299 147945 149043 149774 150630 152167 154627 157729 160932 163936 166769
57378 166769 169287 170804 170628 168993 167119 166150 166174 166407 166023 164620 162201 159113 155939 153137 150802 148953
57362 148953 147872 147831 148593 149554 150408 151364 152632 153996 155028 155551 155808 156277 157409 159467 162473 166165
57346 166165 169867 172596 173736 173755 173945 175197 177218 179069 180141 180413 180138 179631 179132 178613 177991 177683 178486
57329 178486 180563 183057 185109 186669 187838 188166 187497 186848 187346 188635 189518 189930 190976 193006 195011 196197
57313 196197 196898 197513 197785 197789 198496 200461 202725 203905 203815 203305 203080 203448 204646 206559 208477 209897 211240
57296 211240 213118 215304 217170 218835 220980 223681 226263 228335 230196 232170 234158 236051 238064 240423
57282 240423 243057 245755 248429 251154 254088 257344 260809 264257 267730 271543 275701 279667 283049 286180
$$ packed form
57393A39386P30Q78J394J907K004J646J098P31Q56J537K460L102L203L004K833
57378A66769K518J517j76j635j874r69K4K33l84j403k419l088l174k802k335j849
57362A48953j081m1P62R61Q54R56J268J364J032N23K57M69J132K058L006L692
57346A66165L702K729J140J9J90J252K021J851J072K72k75n07m99n19o22l08Q03
57329A78486K077K494K052J560J169L28o69o49M98J289Q83M12J046K030K005J186
57313A96197P01O15K72MP07J965K264J180r0n10k25L68J198J913J918J420J343
57296B11240J878K186J866J665K145K701K582K072J861J974J988J893K013K359
57282B40423K634K698K674K725K934L256L465L448L473L813M158L966L382L131
$$ plain form
57268 286180 289561 292982 295797 297974 300355 303793 308456 313993 320065 326530 333302 340136 346557 352188
57254 352188 357282 362688 369043 376167 383501 391007 399272 408795 419395 430326 440828 450636 460035
57241 460035 469389 478706 487924 497468 507969 519383 530985 542495 554594 567927 582226 596881
57229 596881 611799 627043 642105 656378 670135 684301 699295 714775 730407 746241 762282
57218 762282 778300 794153 809864 825265 839997 853924 867287 880483 893995 908346 923678
57207 923678 939464 955099 970642 986481 1002371 1017472 1031536 1045462 1060363 1076351 1092479
57196 1092479 1107725 1121887 1135610 1149649 1164159 1178843 1193709 1209270 1225778 1242753 1259754
57185 1259754 1277276 1296222 1316600 1337361 1357662 1377864 1399160 1422493 1447872 1474514 1501631
$$ packed form
57268B86180L381L421K815K177K381L438M663N537O072O465O772O834O421N631
57254C52188N094N406O355P124P334P506Q265R523J0600J0931J0502R808R399
57241D60035R354R317R218R544J0501J1414J1602J1510J2099J3333J4299J4655
57229E96881J4918J5244J5062J4273J3757J4166J4994J5480J5632J5834J6041
57218G62282J6018J5853J5711J5401J4732J3927J3363J3196J3512J4351J5332
57207I23678J5786J5635J5543J5839J5890J5101J4064J3926J4901J5988J6128
57196A092479J5246J4162J3723J4039J4510J4684J4866J5561J6508J6975J7001
57185A259754J7522J8946K0378K0761K0301K0202K1296K3333K5379K6642K7117
$$ plain form
57174 1501631 1529185 1557754 1587577 1618131 1648942 1680291 1712554 1745147 1776827 1806912 1835605
57163 1835605 1863191 1889578 1914696 1938747 1961916 1984210 2005603 2025996 2045062 2062580 2078916
57152 2078916 2094843 2111026 2127995 2146282 2165954 2186173 2205962 2225382 2245306 2266106 2287280
57141 2287280 2308400 2329577 2350784 2371568 2391888 2412661 2434985 2459201 2484962 2511820 2539391
57130 2539391 2567358 2595765 2625148 2656136 2689068 2724072 2761263 2800690 2842362 2886392 2932916
57119 2932916 2981849 3033045 3086707 3143323 3203273 3266951 3335332 3410031 3492735 3585048 3688840
57108 3688840 3806202 3938762 4087461 4253300 4438177 4645160 4878571 5144062 5448351
57099 5448351 5798854 6203988 6673769 7219599 7853363 8587061 9433112 10404010 11511206
$$ packed form
57174A501631K7554K8569K9823L0554L0811L1349L2263L2593L1680L0085K8693
57163A835605K7586K6387K5118K4051K3169K2294K1393K0393J9066J7518J6336
57152B078916J5927J6183J6969J8287J9672K0219J9789J9420J9924K0800K1174
57141B287280K1120K1177K1207K0784K0320K0773K2324K4216K5761K6858K7571
57130B539391K7967K8407K9383L0988L2932L5004L7191L9427M1672M4030M6524
57119B932916M8933N1196N3662N6616N9950O3678O8381P4699Q2704R2313J03792
57108C688840J17362J32560J48699J65839J84877K06983K33411K65491L04289
57099E448351L50503M05134M69781N45830O33764P33698Q46051R70898J107196
$$ plain form
57090 11511206 12764457 14171753 15738133 17462793 19336224 21338636 23438788 25592198
57082 25592198 27739502 29806117 31703713 33334985 34603996 35431479 35769517 35609057
57074 35609057 34978035 33932564 32545071 30892986 29050739 27085975 25058535 23020303
57066 23020303 21015403 19080687 17245830 15532645 13954615 12517611 11221407 10061137
57058 10061137 9028656 8113938 7306055 6593618 5965508 5412017 4925125 4497350 4120728
57049 4120728 3787405 3490990 3226819 2991145 2780489 2591574 2421363 2267231 2127451
57040 2127451 2001309 1888274 1787069 1695866 1613226 1538430 1470930 1409809 1353857 1302051 1254041
57029 1254041 1210209 1171018 1136299 1105543 1078913 1057312 1041197 1030107 1023920 1023938 1032126 1050054
$$ packed form
57090A1511206J253251J407296J566380J724660J873431K002412K100152K153410
57082B5592198K147304K066615J897596J631272J269011Q27483L38038j60460
57074C5609057o31022j045471j387493j652085j842247j964764k027440k038232
57066B3020303k004900j934716j834857j713185j578030j437004j296204j160270
57058A0061137j032481r14718q07883p12437o28110n53491m86892m27775l76622
57049D120728l33323k96415k64171k35674k10656j88915j70211j54132j39780
57040B127451j26142j13035j01205r1203q2640p4796o7500o1121n5952n1806m8010
57029A254041m3832l9191l4719l0756k6630k1601j6115j1090o187J8Q188J7928
$$ plain form
57017 1050054 1079492 1123347 1184952 1267433 1375487 1516112 1692090 1890326 2077400 2211085
57007 2211085 2260864 2221120 2108671 1950585 1773081 1596202 1432666 1288536 1164985 1060560
56997 1060560 972870 899366 837687 785889 742492 706422 676954 653460 634959 620030 607481
56986 607481 596954 588577 582153 577088 572887 569071 564500 557469 546850 532759 515882 496754 476157
56973 476157 455678 437019 420843 406781 394411 383682 374560 366944 361065 357346 355746 355721 357120
56960 357120 360679 367401 377685 391127 406703 422714 436782 446349 449484 445448 434864 419524
56948 419524 401867 384259 368319 354497 342182 330540 319635 310587 304423 301071 299818 300408 303156
56935 303156 308248 315685 325929 339899 358046 379690 403018 425158 442335 451048 449829 439762
$$ packed form
57017A050054K9438M3855O1605Q2481J08054J40625J75978J98236J87074J33685
57007B211085M9779l9744j12449j58086j77504j76879j63536j44130j23551j04425
56997A060560q7690p3504o1679n1798m3397l6070k9468k3494j8501j4929j2549
56986F07481j0527q377o424n065m201l816m571p031j0619j4091j6877j9128k0597
56973D76157k0479j8659j6176j4062j2370j0729r122p616n879l719j600k5J399
56960C57120L559O722J0284J3442J5576J6011J4068R567L135m036j0584j5340
56948D19524j7657j7608j5940j3822j2315j1642j0905r048o164l352j253N90K748
56935C03156N092P437J0244J3970J8147K1644K3328K2140J7177Q713j219j0067
$$ plain form
56923 439762 423238 402670 380321 358341 338106 319773 302873 287238 273110 260757 250356
56912 250356 242032 235609 230417 225636 220807 215978 211489 207666 204505 201652 198903 196687 195670 195910
56898 195910 196776 197763 198953 200658 203123 206602 211109 215996 220505 225117 231708 241852 255387 271002
56884 271002 287526 303875 318161 327865 331220 328222 320382 309856 298612 287930 278405 270415 264461
56871 264461 261008 260237 262104 266395 272636 280375 289964 302798 320418 343435 371549 404394 441785
56858 441785 482746 524190 560737 586420 597418 593669 578063 554413 526308 497164 470060 446927
56846 446927 428318 414159 404358 398765 397306 400550 409616 425228 447418 476376 512962 557986
56834 557986 611564 673269 741532 811537 874164 918628 937274 928510 896189 847148 788801 727428
$$ packed form
56923D39762j6524k0568k2349k1980k0235j8333j6900j5635j4128j2353j0401
56912B50356q324o423n192m781m829m829m489l823l161k853k749k216j017K40
56898A95910Q66R87J190J705K465L479M507M887M509M612O591J0144J3535J5615
56884B71002J6524J6349J4286R704L355k998p840j0526j1244j0682r525p990n954
56871B64461l453p71J867M291O241P739R589J2834J7620K3017K8114L2845L7391
56858D41785M0961M1444L6547K5683J0998l749j5606k3650k8105k9144k7104k3133
56846D46927j8609j4159r801n593j459L244R066J5612K2190K8958L6586M5024
56834E57986N3578O1705O8263P0005O2627M4464J8646q764l2321m9041n8347o1373
$$ plain form
56822 727428 667408 611614 562155 520456 486895 461045 442390 430629 425403 426288 433256 446917
56810 446917 468103 497282 534302 578386 627847 679211 726444 761694 778104 772873 748041 708684
56798 708684 660659 609380 559195 512817 471402 435421 405218 380757 361533 347155 337626 332798
56786 332798 332079 335089 342142 353758 370120 391211 416637 444510 470818 490639 500188 497841 484046
56773 484046 460922 431591 399121 365921 334009 305121 280073 258452 239491 222951 208868
56762 208868 196999 186942 178351 170602 162903 155265 148682 143712 139542 135274 131428 129104 128145 127285
56748 127285 125881 124343 122902 121183 119198 117753 117437 117854 118232 118252 118021 117671 117237 116650 115787 114779 114156
56731 114156 114246 114499 113945 112342 110488 109352 109244 109799 110393 110623 110677 111119 112097 112999 113257 113130 113203 113469 113514
$$ packed form
56822G27428o0020n5794m9459m1699l3561k5850j8655j1761n226Q85O968J3661
56810D46917K1186K9179L7020M4084M9461N1364M7233L5250J6410n231k4832l9357
56798G08684m8025n1279n0185m6378m1415l5981l0203k4461j9224j4378r529m828
56786C32798p19L010P053J1616J6362K1091K5426K7873K6308J9821R549k347j3795
56773D84046k3124k9331l2470l3200l1912k8888k5048k1621j8961j6540j4083
56762B08868j1869j0057q591p749p699p638o583m970m170m268l846k324r59q60
56748A27285j404j538j441j719j985j445l16M17L78K0k31l50m34n87q63j008o23
56731A14156R0K53n54j603j854j136j08N55N94K30N4M42R78R02K58j27P3K66M5
$$ plain form
56712 113514 113262 112893 112283 111370 110871 111696 113565 115017 115018 113867 112427 111239 110658 111010 112075 112977 113173
56695 113173 113209 114021 115697 117424 118532 119133 119700 120380 120913 121083 121018 120988 121090 121275 121616 122297 123332 124469
56677 124469 125363 125651 124980 123382 121593 120521 120295 120304 120173 120164 120454 120731 120795 120956 121440 121986 122418 123005 123875
56658 123875 124611 124904 125015 125161 125089 124758 124746 125389 126233 127007 128302 130448 132439 133089 132703 132517 132898 133243
56640 133243 133340 133629 134218 134701 134925 135051 134937 134337 133644 133546 134074 134843 136063 138280 141169 143621 145123 146132
56622 146132 147058 147830 148628 150051 152214 154408 155992 157014 157755 158240 158383 158161 157578 156815 156284 156050 155449
56605 155449 153967 152212 151242 151087 150813 149990 149252 149322 150222 151505 152590 152911 152362 151551 151075 150743 150134 149478
56587 149478 149172 148857 148018 147120 147039 147587 147848 147798 148273 149352 150123 150235 150431 151315 152751 154678 157308 160290
$$ packed form
56712A13514k52l69o10r13m99Q25J869J452Jj151j440j188n81L52J065R02J96
56695A13173L6Q12J676J727J108O01N67O80N33J70o5l0J02J85L41O81J035J137
56677A24469Q94K88o71j598j789j072k26Rj31rK90K77O4J61M84N46M32N87Q70
56658A23875P36K93J11J46p2l31j2O43Q44P74J295K146J991O50l86j86L81L45
56640A33243R7K89N89M83K24J26j14o00o93r8N28P69J220K217K889K452J502J009
56622A46132R26P72P98J423K163K194J584J022P41M85J43k22n83p63n31k34o01
56605A55449j482j755r70j55k74q23p38P0R00J283J085L21n49q11m76l32o09o56
56587A49478l06l15q39q98q1N48K61n0M75J079P71J12J96Q84J436J927K630K982
$$ plain form
56569 160290 162887 165229 168133 171393 173652 174540 175661 178672 183450 188821 194150 199520 205303 212245
56555 212245 221122 231540 241659 249710 255219 258511 259955 260200 260166 260130 259499 257983 256165 254405 252171
56540 252171 249138 246046 243619 241328 238142 233953 229518 225449 221913 218829 215790 212287 208606 205889
56526 205889 204693 204056 202718 200757 199221 198498 197888 196647 194733 192507 190238 187961 185521 182721 179578
56511 179578 176416 173682 171759 170800 170515 170297 169915 169834 170443 171333 171924 172415 173274 174159 174326 173873 173562 173581
56493 173581 173623 173971 175146 176464 176419 174753 172805 171541 170647 169903 169837 170363 170331 169335 168704 169668 171633 173201
56475 173201 174008 174603 175375 176416 177735 178902 179255 178993 179185 180178 181037 181193 181422 182483 183961 185309 186841
56458 186841 188710 190118 190677 191477 193562 196296 198483 200242 202462 205153 207619 209642 211291 212181 212127
$$ packed form
56569A60290K597K342K904L260K259Q88J121L011M778N371N329N370N783O942
56555B12245Q877J0418J0119Q051N509L292J444K45l4l6o31j516j818j760k234
56540B52171l033l092k427k291l186m189m435m069l536l084l039l503l681k717
56526B05889j196o37j338j961j536p23o10j241j914k226k269k277k440k800l143
56511A79578l162k734j923r59k85k18l82q1O09Q90N91M91Q59Q85J67m53l11J9
56493A73581M2L48J175J318m5j666j948j264q94p44o6N26l2r96o31R64J965J568
56475A73201Q07N95P72J041J319J167L53k62J92R93Q59J56K29J061J478J348J532
56458A86841J869J408N59Q00K085K734K187J759K220K691K466K023J649Q90n4
$$ plain form
56443 212127 211957 212512 213382 213738 213761 214009 213945 212486 209704 206756 204392 202619 201516 201273 201590 201975 202364
56426 202364 202629 201988 199950 197443 195910 195636 195899 196335 197057 197830 198288 198728 199612 200564 200913 200960 201583 202753
56408 202753 203531 203482 203072 202751 202561 202616 203082 203719 204168 204582 205259 205877 205850 205244 204676 204575 205119 206489 208431
56389 208431 210037 210734 211018 211530 212065 212376 213113 214788 216509 217109 217008 217510 218696 219572 220050 221154 223192
56372 223192 225308 227022 228778 230708 232208 233178 234403 236218 237904 238923 239765 241005 242406 243567 244643
56357 244643 245759 246305 245506 243483 241230 239729 239336 239840 240823 241969 243057 243814 244109 244324 245035 246105
56341 246105 246659 246323 245838 245948 246394 246716 247338 248958 251401 254078 257150 261180 265892 270300 273896 276788
56325 276788 278906 280107 281038 282844 285798 288913 291009 291656 291188 290406 290132 290475 290718 290392 290054 290390 291057
$$ packed form
56443B12127j70N55Q70L56K3K48o4j459k782k948k364j773j103k43L17L85L89
56426B02364K65o41k038k507j533k74K63M36P22P73M58M40Q84R52L49M7O23J170
56408B02753P78m9m10l21j90N5M66O37M49M14O77O18k7o06n68j01N44J370J942
56389B08431J606O97K84N12N35L11P37J675J721O00j01N02J186Q76M78J104K038
56372B23192K116J714J756J930J500R70J225J815J686J019Q42J240J401J161J076
56357B44643J116N46p99k023k253j501l93N04R83J146J088P57K95K15P11J070
56341B46105N54l36m85J10M46L22O22J620K443K677L072M030M712M408L596K892
56325B76788K118J201R31J806K954L115K096O47m68p82k74L43K43l26l38L36O67
$$ plain form
56308 291057 291228 290840 290416 290075 289689 289640 290294 290992 290699 289655 289326 290569 292727 294697 296151 297514 299277
56291 299277 301449 303346 304128 303857 303640 304306 305499 306603 307873 309836 312200 314333 316332 318657 321117
56276 321117 323206 325108 327411 330105 332694 334986 337004 338584 339882 341704 344442 347309 349632 352216
56262 352216 356206 361194 365820 369855 374333 379866 386083 392496 398872 405000 411240 418873 428723 439775
56248 439775 450378 460424 471152 483288 496814 512095 529555 548354 566969 585199 604241
56237 604241 624760 646174 667807 689371 710165 729046 745401 759214 770141 777471 780928 780733
56225 780733 777159 770809 762796 753594 742345 728472 713243 698461 684381 670498 657516 646527
56213 646527 636771 626325 614882 603878 593972 584416 574993 566556 559309 552308 545039 537978 531397
$$ packed form
56308B91057J71l88m24l41l86m9O54O98k93j044l29J243K158J970J454J363J763
56291B99277K172J897P82k71k17O66J193J104J270J963K364K133J999K325K460
56276C21117K089J902K303K694K589K292K018J580J298J822K738K867K323K584
56262C52216L990M988M626M035M478N533O217O413O376O128O240P633R850J1052
56248D39775J0603J0046J0728J2136J3526J5281J7460J8799J8615J8230J9042
56237F04241K0519K1414K1633K1564K0794J8881J6355J3813J0927P330L457j95
56225G80733l574o350q013r202j1249j3873j5229j4782j4080j3883j2982j0989
56213F46527r756j0446j1443j1004r906r556r423q437p247p001p269p061o581
$$ plain form
56200 531397 525087 519375 514882 511219 507469 503923 501690 500632 499476 498008 497319 497767 498580 499658 501824
56185 501824 504964 507813 510061 512827 516522 519994 522360 524047 525508 526497 527119 528105 529552 530901 532459
56170 532459 535307 539277 542766 545078 547346 550524 554037 557079 559823 562751 566084 570341 576100 582890
56156 582890 589618 596343 604187 613402 623139 633310 644851 657829 671016 683811 696952 710965
56144 710965 725604 741234 759054 779511 802112 827137 855750 888046 922849 960002 1001184
56133 1001184 1048090 1101671 1163766 1237638 1326073 1430140 1549762 1683259 1825453 1967784
56123 1967784 2101279 2218937 2316364 2392934 2453083 2504367 2552968 2601389 2649169 2693025 2726531
56112 2726531 2743126 2741193 2725027 2700757 2673160 2645640 2619449 2591161 2553038 2497385 2419983
$$ packed form
56200E31397o310n712m493l663l750l546k233j058j156j468o89M48Q13J078K166
56185E01824L140K849K248K766L695L472K366J687J461R89O22R86J447J349J558
56170E32459K848L970L489K312K268L178L513L042K744K928L333M257N759O790
56156E82890O728O725P844R215R737J0171J1541J2978J3187J2795J3141J4013
56144G10965J4639J5630J7820K0457K2601K5025K8613L2296L4803L7153M1182
56133A001184M6906N3581O2095P3872Q8435J04067J19622J33497J42194J42331
56123A967784J33495J17658R7427P6570O0149N1284M8601M8421M7780M3856L3506
56112B726531J6595j933j6166k4270k7597k7520k6191k8288l8123n5653p7402
$$ plain form
56101 2419983 2320322 2201717 2071903 1940691 1815481 1699993 1596658 1507352 1431727 1367829
56091 1367829 1314973 1273440 1241281 1214699 1192122 1174773 1162698 1153649 1146617 1142933 1142775 1143974
56079 1143974 1145482 1148635 1153703 1158640 1162646 1167656 1174830 1182850 1191169 1201545 1214688 1228732 1242749
56066 1242749 1258438 1276588 1295192 1312871 1330820 1349585 1367375 1383578 1400508 1419591 1439180
56055 1439180 1458134 1478089 1500053 1522326 1543971 1566749 1591229 1614657 1635194 1654763 1675275
56044 1675275 1695571 1714621 1734022 1754708 1774986 1794634 1817129 1844822 1875560 1907025 1940576
56033 1940576 1977772 2017074 2057394 2101023 2149578 2200718 2252273 2305755 2362342 2419458 2475116
56022 2475116 2531640 2591132 2651239 2709539 2768204 2830097 2894115 2958706 3026120 3098646 3174389
$$ packed form
56101B419983r9661j18605j29814j31212j25210j15488j03335q9306p5625o3898
56091A367829n2856m1533l2159k6582k2577j7349j2075r049p032l684j58J199
56079A143974J508L153N068M937M006N010P174Q020Q319J0376J3143J4044J4017
56066A242749J5689J8150J8604J7679J7949J8765J7790J6203J6930J9083J9589
56055A439180J8954J9955K1964K2273K1645K2778K4480K3428K0537J9569K0512
56044A675275K0296J9050J9401K0686K0278J9648K2495K7693L0738L1465L3551
56033A940576L7196L9302M0320M3629M8555N1140N1555N3482N6587N7116N5658
56022B475116N6524N9492O0107N8300N8665O1893O4018O4591O7414P2526P5743
$$ plain form
56011 3174389 3251264 3331563 3418099 3509563 3604147 3703886 3810818 3922707 4037178 4156285
56001 4156285 4282591 4414884 4552131 4697195 4852105 5014505 5183413 5363204 5556931
55992 5556931 5761431 5974495 6200863 6445079 6704603 6976589 7265310 7576031 7907811
55983 7907811 8259660 8637336 9046357 9484963 9952202 10456360 11007030 11605890 12254136
55974 12254136 12961645 13739598 14592046 15524819 16554778 17700288 18972030 20384718 21968717
55965 21968717 23759098 25785169 28084902 30719030 33758803 37276161 41364887 46159358
55957 46159358 51818421 58512418 66450145 75903055 87189471 100673279 116813085 136176198
55949 136176198 159357380 186887464 219116309 255754911 294928813 332420187 362240403
$$ packed form
56011C174389P6875Q0299Q6536R1464R4584R9739J06932J11889J14471J19107
56001D156285J26306J32293J37247J45064J54910J62400J68908J79791J93727
55992E556931K04500K13064K26368K44216K59524K71986K88721L10721L31780
55983G907811L51849L77676M09021M38606M67239N04158N50670N98860O48246
55974A2254136P07509P77953Q52448R32773J029959J145510J271742J412688J583999
55965B1968717J790381K026071K299733K634128L039773L517358M088726M794471
55957D6159358N659063O693997P937727R452910J1286416J3483808J6139806J9363113
55949A36176198K3181182K7530084L2228845L6638602L9173902L7491374K9820216
$$ plain form
55942 362240403 378781915 379243733 364598289 338624575 306044366 271051260 236688999
55935 236688999 204817393 176333863 151487423 130167058 112076605 96822086 83986326
55928 83986326 73191537 64111305 56453474 49963334 44438655 39720168 35669449 32168246
55920 32168246 29128543 26483294 24169117 22128986 20323874 18726452 17306710 16034746
55912 16034746 14891922 13866832 12943946 12106580 11346575 10660310 10038454 9468991 8946677
55903 8946677 8470173 8033070 7626561 7248000 6898431 6574351 6269801 5983957 5718980
55894 5718980 5472680 5240560 5022902 4822800 4639096 4467791 4308547 4163553 4031859
55885 4031859 3910962 3802319 3709509 3632487 3569044 3520448 3490415 3480045 3488641 3517772 3569173
$$ packed form
55942C62240403J6541512M61818j4645444k5973714l2580209l4993106l4362261
55935B36688999l1871606k8483530k4846440k1320365j8090453j5254519j2835760
55928H3986326j0794789r080232p657831o490140n524679m718487m050719l501203
55920C2168246l039703k645249k314177k040131j805112j597422j419742j271964
55912A6034746j142824j025090r22886q37366p60005o86265o21856n69463n22314
55903H946677m76504m37103m06509l78561l49569l24080l04550k85844k64977
55894E718980k46300k32120k17658k00102j83704j71305j59244j44994j31694
55885D031859j20897j08643r2810p7022o3443m8596l0033j0370Q596K9131N1401
$$ plain form
55874 3569173 3639256 3719256 3798859 3866087 3906969 3911272 3877585 3808776 3704710 3564362 3393222
55863 3393222 3203254 3006362 2811868 2628293 2461863 2313288 2180120 2061906 1959629
55854 1959629 1871560 1793968 1725242 1665449 1612627 1563413 1516751 1473475 1432927 1393365 1354879
55843 1354879 1318566 1283644 1248721 1214967 1184613 1157194 1130656 1105275 1082966 1063428 1044494
55832 1044494 1025782 1008589 992627 976139 958979 942501 926710 910523 894490 880260 867537
55821 867537 854342 840072 825693 811292 796082 780602 766353 753492 741174 729669 719791 710857
55809 710857 701635 692780 685875 680697 675891 671677 669275 668200 666824 665224 664919 666180 668001 670283
55795 670283 673520 676790 678644 679662 681685 684893 688045 691040 694516 697282 697007 693475 688554 683076
$$ packed form
55874C569173P0083Q0000P9603O7228M0882M303l3687o8809j04066j40348j71140
55863C393222j89968j96892j94494j83575j66430j48575j33168j18214j02277
55854A959629q8069p7592o8726n9793n2822m9214m6662m3276m0548l9562l8486
55843A354879l6313l4922l4923l3754l0354k7419k6538k5381k2309j9538j8934
55832A044494j8712j7193j5962j6488j7160j6478j5791j6187j6033j4230j2723
55821H67537j3195j4270j4379j4401j5210j5480j4249j2861j2318j1505r878q934
55809G10857r222q855o905n178m806m214k402j075j376j600l05J261J821K282
55795F70283L237L270J854J018K023L208L152K995L476K766k75l532m921n478
$$ plain form
55781 683076 676355 668707 661549 654539 645157 631716 614798 595529 574657 553690 534751 518664
55769 518664 504769 492810 483341 476270 470866 467251 465999 466155 465483 462902 459082 454714 449897 445152
55755 445152 441189 437573 433264 428360 423693 418970 413207 406761 400904 395466 388981 381223 373600 366859
55741 366859 360338 353721 347672 342445 337561 333106 329756 327350 325029 322797 321331 320319 318716 316593
55727 316593 314918 313486 310954 306971 302465 297741 292238 286282 281145 277083 273131 269093 265857 263504
55713 263504 261057 258467 256948 256856 257109 257199 257965 259806 261901 263861 266435 269845 272932 274585 274631 272836
55697 272836 268665 262662 256558 251319 246364 241195 236317 232084 228156 224671 222377 220939 218704 214969
55683 214969 211140 208807 207994 208064 208962 210620 212343 213754 215325 217038 217556 215702 212042 208181 205100
$$ packed form
55781F83076o721p648p158p010r382j3441j6918j9269k0872k0967j8939j6087
55769E18664j3895j1959r469p071n404l615j252J56o72k581l820m368m817m745
55755D45152l963l616m309m904m667m723n763o446n857n438o485p758p623o741
55741C66859o521o617o049n227m884m455l350k406k321k232j466j012j603k123
55727C16593j675j432k532l983m506m724n503n956n137m062l952m038l236k353
55713B63504k447k590j519r2K53R0P66J841K095J960K574L410L087J653M6j795
55697B72836m171o003o104n239m955n169m878m233l928l485k294j438k235l735
55683B14969l829k333q13P0Q98J658J723J411J571J713N18j854l660l861l081
$$ plain form
55668 205100 202773 200777 198688 196384 194266 192672 191163 189200 187421 187031 187890 188580 188606 189136 191127 194028
55652 194028 196862 199369 201560 203345 205240 208279 212548 216875 220496 223950 227706 231128 233543 235289
55638 235289 236820 237678 237178 235407 232792 229355 225037 220127 214824 208995 202836 197137 192459 188644 185366
55623 185366 182501 179754 176782 173912 171872 170567 169129 167423 166409 166584 167140 167156 166596 165618 163909 161389
55607 161389 158725 156589 155106 154374 154560 155012 154341 152043 149190 146958 145350 143934 142858 142285 141647 140316
55591 140316 138512 136930 135932 135622 136115 137227 138382 139247 140008 140805 141450 141872 142143 141936 140797 139171 138268
55574 138268 138722 140224 142564 145906 149855 153524 157020 161654 168060 175231 181968 188106 193566 197418
55560 197418 198893 198455 197005 194742 191578 187786 183451 178076 171578 164940 159072 153785 148664 144135
$$ packed form
55668B05100k327j996k089k304k118j594j509j963j779l90Q59O90K6N30J991K901
55652A94028K834K507K191J785J895L039M269M327L621L454L756L422K415J746
55638B35289J531Q58n00j771k615l437m318m910n303n829o159n699m678l815l278
55623A85366k865k747k972k870k040j305j438j706j014J75N56J6n60r78j709k520
55607A61389k664k136j483p32J86M52o71k298k853k232j608j416j076n73o38j331
55591A40316j804j582r98l10M93J112J155Q65P61P97O45M22K71k07j139j626r03
55574A38268M54J502K340L342L949L669L496M634O406P171O737O138N460L852
55560A97418J475m38j450k263l164l792m335n375o498o638n868n287n121m529
$$ plain form
55546 144135 140724 137995 135240 132635 130756 129368 127659 125362 122895 120615 118599 116934 115697 114941
55532 114941 115013 116359 118606 120414 120740 119789 118412 117178 116398 116253 116354 115935 114939 114155 113799 112944 111053
55515 111053 109105 108308 108412 108289 107527 106523 105581 104806 104522 104896 105515 106027 106748 108010 109344 110020 109932 109384
55497 109384 108491 107412 106606 106165 105479 104207 103027 102724 103129 103612 103992 104292 104323 104284 104955 106393 107234 106371
55479 106371 104619 103519 103110 102249 100666 99267 98539 98036 97561 97635 98546 99900 101345 102924 104539 105755
55463 105755 106291 106130 105146 103319 101329 100261 100520 101520 102456 102957 103028 102861 102690 102474 101865 100841 100078
55446 100078 100181 100819 101191 101135 101165 101587 102185 102655 102777 102231 100838 99007 97581 97221 98109 99969 102074 103558
55428 103558 104105 104067 103774 103235 102731 102921 103817 104422 104097 103577 103842 104688 105366 105972 106993 108005 108193 107967
$$ packed form
55546A44135l411k729k755k605j879j388j709k297k467k280k016j665j237p56
55532A14941P2J346K247J808L26r51j377j234p80j45J01m19r96p84l56q55j891
55515A11053j948p97J04j23p62j004r42p75k84L74O19N12P21J262J334O76q8n48
55497A09384q93j079q06m41o86j272j180l03M05M83L80L00L1l9O71J438Q41q63
55479A06371j752j100m09q61j583j399p28n03m75P4R11J354J445J579J615J216
55463A05755N36j61r84j827j990j068K59J000R36N01P1j67j71k16o09j024p63
55446A00078J03O38L72n6L0M22N98M70J22n46j393j831j426l60Q88J860K105J484
55428A03558N47l8k93n39n04J90Q96O05l25n20K65Q46O78O06J021J012J88k26
$$ plain form
55410 107967 108663 110560 112399 113128 113048 112858 112535 111644 110076 108051 105888 104105 103241 103264 103477 103214 102408
55393 102408 101410 100593 100076 99595 98734 97632 97186 98033 99572 100596 100815 101087 102144 103685 104831 105018 104332
55376 104332 103332 102624 102360 102201 101911 101687 101590 101150 100037 98805 98256 98355 98416 98124 97721 97384 97148 97213 97594
55357 97594 97655 96807 95573 95062 95393 95565 95028 94450 94567 95080 95189 94712 94192 94194 94826 95777 96654 97375 98204 99229
55337 99229 99994 100022 99481 98923 98500 97921 97010 95799 94286 92660 91636 91842 92924 93900 94416 95027 96174
55320 96174 97491 98283 98192 97337 96172 95247 94694 94039 92964 91999 91920 92658 93502 94247 95291 96647 97709 98112
55302 98112 98054 97607 96517 94940 93658 93193 93280 93496 93794 94207 94616 95142 96173 97646 98818 99166 99066 99214
55284 99214 99753 100339 100749 101026 101177 101047 100423 99229 97793 96869 97097 98397 100095 101559 102410 102385 101586 100764
$$ packed form
55410A07967O96J897J839P29q0j90l23q91j568k025k163j783q64K3K13k63q06
55393A02408r98q17n17m81q61j102m46Q47J539J024K19K72J057J541J146J87o86
55376A04332j000p08k64j59k90k24r7m40j113j232n49R9O1k92m03l37k36O5L81
55357I7594O1q48j234n11L31J72n37n78J17N13J09m77n20KO32R51Q77P21Q29J025
55337I9229P65K8n41n58m23n79r11j211j513j626j024K06J082R76N16O11J147
55320I6174J317P92r1q55j165r25n53o55j075r65p9P38Q44P45J044J356J062M03
55302I8112n8m47j090j577j282m65Q7K16K98M13M09N26J031J473J172L48j00J48
55284I9214N39N86M10K77J51j30o24j194j436r24K28J300J698J464Q51k5p99q22
$$ plain form
55266 100764 100706 101261 101554 101178 100579 100151 99718 99144 98826 99177 100091 101239 102482 103769 104980 106083 107033
55249 107033 107415 106731 105292 104251 104392 105284 105948 105927 105356 104416 103242 102148 101490 101323 101456 101787 102429 103541
55231 103541 105090 106699 107799 108141 108022 107758 107074 105466 103078 100764 99250 98677 98920 99761 100665 100990
55215 100990 100724 100605 101240 102407 103357 103519 102811 101634 100673 100454 100991 102042 103497 105139 106309 106475 106086
55198 106086 106143 106876 107505 107431 106960 106633 106477 106236 105824 105271 104611 103939 103224 102079 100343 98824 98714 100154
55180 100154 102137 103925 105650 107310 108272 108303 108206 108720 109504 109891 110002 110338 110757 110655 109907 108999 108457 108569
55162 108569 109422 110790 112241 113646 115226 116820 117687 117399 116414 115264 113816 111879 110038 109184 109528 110579
55146 110579 111765 112566 112538 111766 110933 110394 109703 108591 107805 108125 109031 109255 108379 107048 105833 104780 103930
$$ packed form
55266A00764n8N55K93l76n99m28m33n74l18L51R14J148J243J287J211J103R50
55249A07033L82o84j439j041J41Q92O64k1n71r40j174j094o58j67J33L31O42J112
55231A03541J549J609J100L42j19k64o84j608k388k314j514n73K43Q41R04L25
55215A00990k66j19O35J167R50J62p08j177r61k19N37J051J455J642J170J66l89
55198A06086N7P33O29p4m71l27j56k41m12n53o60o72p15j145j736j519j10J440
55180A00154J983J788J725J660R62L1r7N14P84L87J11L36M19j02p48r08n42J12
55162A08569Q53J368J451J405J580J594Q67k88r85j150j448j937j841q54L44J051
55146A10579J186Q01k8p72q33n39o91j112p86L20R06K24q76j331j215j053q50
$$ plain form
55129 103930 103378 102843 101994 101213 101277 102193 103098 103345 103052 102551 102014 101770 102204 103074 103507 103027 102142 101665 101826
55110 101826 102319 102846 103345 103904 104638 105533 106401 107145 107937 108892 109730 110133 110316 110845 111943 113384 114921 116338
55092 116338 117166 116939 115840 114644 113945 113795 114039 114533 114966 115010 114745 114549 114521 114497 114686 115728 117795 120093
55074 120093 121512 121564 120528 119004 117466 115992 114276 112174 110232 109328 109708 110654 111157 110608 108956 106771
55058 106771 105216 105308 106828 108416 109021 108902 108961 109567 110421 111196 111812 112237 112437 112520 112691 113132 113938 114973
55040 114973 115752 115833 115451 115315 115610 115695 115152 114612 114955 116059 116979 117147 116771 116140 115247 114213 113449 113145 113018
55021 113018 112822 112723 112927 113209 113118 112436 111247 109784 108415 107560 107335 107361 107201 106863 106665 106716 106917 107380 108425
55002 108425 109984 111318 111671 111061 110227 109884 110264 111270 112704 114222 115330 115730 115626 115537 115753 116098 116265
$$ packed form
55129A03930n52n35q49p81O4R16R05K47k93n01n37k44M34Q70M33m80q85m77J61
55110A01826M93N27M99N59P34Q95Q68P44P92R55Q38M03J83N29J098J441J537J417
55092A16338Q28k27j099j196o99j50K44M94M33M4k65j96k8k4J89J042K067K298
55074A20093J419N2j036j524j538j474j716k102j942r04L80R46N03n49j652k185
55058A06771j555R2J520J588O05j19N9O06Q54P75O16M25K00Q3J71M41Q06J035
55040A14973P79Q1l82j36K95Q5n43n40L43J104R20J68l76o31q93j034p64l04j27
55021A13018j96r9K04K82r1o82j189j463j369q55k25K6j60l38j98N1K01M63J045
55002A08425J559J334L53o10q34l43L80J006J434J518J108M00j04q9K16L45J67
$$ plain form
54985 116265 116335 116810 118058 119771 121181 121912 122421 123356 124619 125427 125339 124793 124480 124518 124556 124387 124037 123496 122863
54966 122863 122731 123787 125862 127778 128476 128022 127235 126627 126109 125593 125346 125639 126373 127221 127992 128677 129325 130036
54948 130036 130930 131929 132674 132954 133141 133870 135166 136161 135968 134640 133063 132014 131649 131767 132149 132533 132691
54931 132691 132783 133333 134550 135904 136687 136820 136732 136599 136234 135795 136059 137648 140283 143206 146175 149686 154243
54914 154243 159805 166062 172968 180676 189073 197567 205374 211814 216268 218065 216687 212207 205436 197584
54900 197584 189724 182500 176167 170730 166024 161759 157632 153512 149580 146243 143848 142436 141789 141673 141974
54885 141974 142548 143059 143155 142845 142570 142762 143355 143889 144123 144462 145711 148471 152778 158152 163880 169470 175073
54868 175073 181388 188842 196849 204137 209810 213787 216130 216404 214042 209082 202220 194286 186007 178072
$$ packed form
54985A16265P0M75J248J713J410P31N09R35J263Q08q8n46l13L8L8j69l50n41o33
54966A22863j32J056K075J916O98m54p87o08n18n16k47K93P34Q48P71O85O48P11
54948A30036Q94R99P45K80J87P29J296R95j93j328j577j049l65J18L82L84J58
54931A32691R2N50J217J354P83J33q8j33l65m39K64J589K635K923K969L511M557
54914A54243N562O257O906P708Q397Q494P807O440M454J797j378m480o771p852
54900A97584p860p224o333n437m706m265m127m120l932l337k395j412o47j16L01
54885A41974N74N11R6l10k75J92N93N34K34L39J249K760M307N374N728N590N603
54868A75073O315P454Q007P288N673L977K343K74k362m960o862p934q279p935
$$ plain form
54854 178072 171016 164961 159721 155138 151111 147449 144050 141177 139125 137584 135679 132816 129269 125878
54840 125878 123427 122290 122286 122717 122851 122587 122429 122681 122948 122671 121948 121554 122208 123963 126187 128020 128936 129025
54822 129025 128711 128236 127557 126714 125997 125645 125567 125480 125164 124553 123752 123061 122761 122850 123156 123694 124602 125751 126848
54803 126848 128010 129692 131792 133300 133325 132167 130959 130471 130650 131105 131540 131830 132068 132539 133273 133739 133385
54786 133385 132482 131956 132286 132913 132902 131916 130376 128890 127779 127081 126817 127105 127987 129206 130357 131351 132569
54769 132569 134390 136697 139068 141334 143716 146529 149988 154334 159782 166251 173305 180514 187805 195389
54755 195389 203384 211472 218834 224417 227399 227495 224884 219947 213176 205270 197141 189643 183259 178000 173587
54740 173587 169764 166466 163796 161918 160963 160838 161072 160997 160255 158958 157302 155375 153567 152682 153038 153765
$$ packed form
54854A78072p056o055n240m583m027l662l399k873k052j541j905k863l547l391
54840A25878k451j137mM31J34k64j58K52K67k77p23l94O54J755K224J833R16Q9
54822A29025l14m75o79q43p17l52p8q7l16o11q01o91l00Q9L06N38R08J149J097
54803A26848J162J682K100J508K5j158j208m88J79M55M35K90K38M71P34M66l54
54786A33385r03n26L30O27j1r86j540j486j111o98k64K88Q82J219J151R94J218
54769A32569J821K307K371K266K382K813L459M346N448O469P054P209P291P584
54755A95389P995Q088P362N583K982R6k611m937o771p906q129p498o384n259m413
54740A73587l823l298k670j878r55j25K34p5p42j297j656j927j808q85L56P27
$$ plain form
54724 153765 153756 153204 153399 154978 157287 159710 162615 166455 170814 175169 179941 185833 192550 199036 204722
54709 204722 209613 213295 214826 213760 210520 205661 199459 192447 185618 179677 174456 169348 164046 158723
54695 158723 153849 150027 147661 146576 146125 145743 145237 144645 144131 143945 144089 144064 143372 142200 141117 140177 138975
54678 138975 137632 136936 137190 137663 137659 137488 137760 138221 138100 137383 136922 137158 137420 136787 135219 133494 132294 131706
54660 131706 131499 131490 131496 131186 130310 129083 128097 127717 127668 127417 126854 126399 126464 126963 127362 127113 126151 125092 124832 125782
54640 125782 127514 129278 130683 131725 132364 132450 131982 131201 130463 130189 130653 131536 132014 131761 131589 132407 133750
54623 133750 134160 133090 131567 130746 130605 130491 130195 129809 129066 127634 125883 124684 124492 125057 125919 126722 127168
54606 127168 127220 127381 128298 129905 131348 131893 131667 131318 131199 131158 131007 130888 131052 131441 131735 131849 132138 132908 133899
$$ packed form
54724A53765rn52J95J579K309K423K905L840M359M355M772N892O717O486N686
54709B04722M891L682J531j066l240m859o202p012o829n941n221n108n302n323
54695A58723m874l822k366j085m51l82n06n92n14j86J44k5o92j172j083r40j202
54678A38975j343o96K54M73mj71K72M61j21p17m61K36K62o33j568j725j200n88
54660A31706k07rOl10q76j227r86l80m9k51n63m55O5M99L99k49r62j059k60R50
54640A25782J732J764J405J042O39Q6m68p81p38k74M64Q83M78k53j72Q18J343
54623A33750M10j070j523q21j41j14k96l86p43j432j751j199j92N65Q62Q03M46
54606A27168N2J61R17J607J443N45k26l49j19m1j51j19J64L89K94J14K89P70R91
$$ plain form
54587 133899 134596 134959 135434 136182 136739 136666 136190 135860 135831 135839 135786 135941 136517 137248 137506 136829 135375 133881 133060 133021
54567 133021 133364 133784 134313 134969 135517 135803 136023 136462 137171 138090 139270 140724 142218 143473 144400 145006 145221
54550 145221 145039 144640 144212 143842 143720 144095 144755 144915 144080 142772 141915 141698 141611 141514 141999 143566 145905 148265
54532 148265 150141 151407 152172 152825 153928 155620 157260 157970 157582 156807 156463 156779 157498 158381 159310 160028 160112
54515 160112 159444 158533 158098 158251 158292 157400 155496 153396 152187 152320 153141 153406 152587 151570 151662 152823 153496 152434
54497 152434 150189 148262 147283 146765 146434 146802 148180 149827 150612 150175 149021 147766 146739 146231 146607 147928
54481 147928 149632 150839 151115 150893 151072 152133 153701 155008 155657 155863 156144 156972 158562 160687 162777 164497
54465 164497 166214 168504 171256 173671 175224 176169 176923 177483 177757 177990 178360 178461 177782 176499 175251 174239
$$ packed form
54587A33899O97L63M75P48N57p3m76l30k9Qn3J55N76P31K58o77j454j494q21l9
54567A33021L43M20N29O56N48K86K20M39P09R19J180J454J494J255R27O06K15
54550A45221j82l99m28l70j22L75O60J60q35j308q57k17q7r7M85J567K339K360
54532A48265J876J266P65O53J103J692J640P10l88p75l44L16P19Q83R29P18Q4
54515A60112o68r11m35J53M1q92j904k100j209J33Q21K65q19j017R2J161O73j062
54497A52434k245j927r79n18l31L68J378J647P85m37j154j255j027n08L76J321
54481A47928J704J207K76k22J79J061J568J307O49K06K81Q28J590K125K090J720
54465A64497J717K290K752K415J553R45P54N60K74K33L70J01o79j283j248j012
$$ plain form
54449 174239 173176 172122 171664 172018 172535 172518 172119 171972 172214 172370 172044 171333 170588 170116 170089 170361 170396 169684 168328
54430 168328 166976 166147 165868 165922 166146 166418 166660 166971 167528 168260 168887 169311 169698 170107 170396 170634 171201 172218
54412 172218 173198 173608 173523 173347 173144 172641 171715 170504 169154 167898 167218 167450 168227 168813 169068 169636 170997 172709
54394 172709 173853 174009 173606 173447 174007 175079 176024 176427 176468 176590 177028 177864 179255 181093 182568 182657 181147
54377 181147 178760 176224 173714 171277 169127 167234 165246 163273 162249 162896 164666 166316 167330 168159 169162
54362 169162 169980 170165 169856 169478 169053 168215 166884 165609 165053 165226 165460 165282 165072 165556 166729 167670 167546 166438
54344 166438 165042 163934 163340 163271 163482 163509 163061 162283 161426 160465 159328 158220 157374 156623 155648 154520 153628 153106
54326 153106 152761 152585 152970 154260 156249 158146 158928 157972 155700 153477 152460 152542 152811 152964 153654 155287 157102
$$ packed form
54449A74239j063j054m58L54N17j7l99j47K42J56l26p11p45m72k7K72L5p12j356
54430A68328j352q29k79N4K24K72K42L11N57P32O27M24L87M09K89K38N67J017
54412A72218R80M10q5j76k03n03r26j211j350j256o80K32P77N86K55N68J361J712
54394A72709J144J56m03j59N60J072R45M03M1J22M38Q36J391J838J475Q9j510
54377A81147k387k536k510k437k150j893j988j973j024O47J770J650J014Q29J003
54362A69162Q18J85l09l78m25q38j331j275n56J73K34j78k10M84J173R41j24j108
54344A66438j396j108n94o9K11K7m48p78q57r61j137j108q46p51r75j128q92n22
54326A53106l45j76L85J290J989J897P82r56k272k223j017Q2K69J53O90J633J815
$$ plain form
54309 157102 157926 157512 156573 155715 154918 154141 153859 154565 155953 157003 156953 155949 154734 153931 153767 154208 155072 156000
54291 156000 156618 156790 156607 156202 155762 155633 156078 156877 157478 157624 157535 157441 157284 157059 157061 157521 158255 158949 159502 159858
54271 159858 159802 159273 158645 158333 158333 158452 158771 159451 160297 160937 161311 161518 161398 160768 160041 159986 160817 161941 162701 162906
54251 162906 162595 161827 160879 160199 159900 159669 159334 159115 159052 158644 157499 156042 155153 155199 155793 156381 156674 156511 155701
54232 155701 154294 152831 152081 152382 153273 153887 153723 153007 152329 152057 152138 152256 152036 151346 150659 150889 152439 154496
54214 154496 155672 155419 154427 153611 153199 152955 152808 152825 152872 152767 152669 152865 153170 152872 151513 149550 148065 147796
54196 147796 148551 149576 150359 150944 151527 152038 152258 152131 151780 151390 151246 151690 152754 153967 154787 155131 155173 154823
54178 154823 153858 152487 151281 150472 149745 148837 147950 147389 147190 147252 147531 147897 148073 147925 147578 147169 146766 146597
$$ packed form
54309A57102Q24m14r39q58p97p77k82P06J388J050n0j004j215q03j64M41Q64R28
54291A56000O18J72j83m05m40j29M45P99O01J46q9r4j57k25KM60P34O94N53L56
54271A59858n6n29o28l12%J19L19O80Q46O40L74K07j20o30p27n5Q31J124P60K05
54251A62906l11p68r48o80k99k31l35k19o3m08j145j457q89M6N94N88K93j63q10
54232A55701j407j463p50L01Q91O14j64p16o78k72Q1J18k20o90o87K30J550K057
54214A54496J176k53r92q16m12k44j47J7M7j05r8J96L05k98j359j963j485k69
54196A47796P55J025P83N85N83N11K20j27l51l90j44M44J064J213Q20L44M2l50
54178A54823r65j371j206q09p27r08q87n61j99O2K79L66J76j48l47m09m03j69
$$ plain form
54160 146597 146971 147818 148619 148931 148659 147814 146549 145559 145750 147098 148419 148768 148568 148782 149540 150324 151089 152234
54142 152234 153591 154404 154432 154198 153963 153343 152334 151933 152982 154917 156378 156841 156917 157182 157480 157554 157653 158024
54124 158024 158246 157683 156498 155665 155875 156834 157835 158581 159096 159167 158482 157263 156225 155824 156016 156814 158475
54107 158475 160796 162830 163847 164201 164635 164996 164448 162941 161632 161539 162238 162361 161070 158791 156709 155861
54091 155861 156505 158034 159508 160428 160987 161521 161985 162170 162264 162838 164199 165926 167120 167061 165717 163763 162187
54074 162187 161719 162471 164008 165702 167080 167996 168607 169203 169997 171033 172223 173425 174472 175191 175458 175269
54058 175269 174798 174398 174382 174665 174706 174078 173094 172561 172778 173110 172866 172422 172957 174995 177625 179453 180086 180359
54040 180359 181254 182993 185253 187828 190715 193713 196382 198510 200468 202931 206314 210572 215490 220991
$$ packed form
54160A46597L74Q47Q01L12k72q45j265r90J91J348J321L49k00K14P58P84P65J145
54142A52234J357Q13K8k34k35o20j009m01J049J935J461M63P6K65K98P4R9L71
54124A58024K22n63j185q33K10R59J001P46N15P1o85j219j038m01J92P98J661
54107A58475K321K034J017L54M34L61n48j507j309r3O99J23j291k279k082q48
54091A55861O44J529J474R20N59N34M64J85R4N74J361J727J194n9j344j954j576
54074A62187m68P52J537J694J378R16O11N96P94J036J190J202J047P19K67j89
54058A75269m71m00j6K83M1o28r84n33K17L32k44m44N35K038K630J828O33K73
54040A80359Q95J739K260K575K887K998K669K128J958K463L383M258M918N501
$$ plain form
54026 220991 227108 233684 240247 246247 251376 255549 258698 260862 262588 264873 268233 271922 274537 275519
54012 275519 275686 276107 276866 277253 276811 275664 273923 271396 268053 264378 260971 257993 255190 252269 249036
53997 249036 245321 241084 236620 232473 229086 226596 224893 223747 222852 221891 220703 219363 218031 216671 214966
53982 214966 212655 209992 207739 206522 206214 206114 205634 204601 202930 200519 197707 195450 194510 194559 194530 193886
53966 193886 193084 192772 192990 193415 193951 194642 195291 195599 195589 195552 195666 196040 197027 198969 201552 203844 205216 205952
53948 205952 206791 208121 209799 211517 213103 214607 216262 218247 220379 222207 223564 224876 226842 229989
53934 229989 234521 240200 246184 251484 255940 260423 265615 270904 274974 277248 278142 278184 277698 277385 278266 280635
53918 280635 283658 286507 289469 293511 299122 306054 313928 322545 331811 341911 353590 367735 384529
$$ packed form
54026B20991O117O576O563O000N129M173L149K164J726K285L360L689K615R82
54012B75519J67M21P59L87m42j147j741k527l343l675l407k978k803k921l233
53997B49036l715m237m464m147l387k490j703j146q95r61j188j340j332j360j705
53982B14966k311k663k253j217l08j00m80j033j671k411k812k257r40M9k9o44
53966A93886q02l12K18M25N36O91O49L08j0l7J14L74R87J942K583K292J372P36
53948B05952Q39J330J678J718J586J504J655J985K132J828J357J312J966L147
53934B29989M532N679N984N300M456M483N192N289M070K274Q94M2m86l13Q81K369
53918B80635L023K849K962M042N611O932P874Q617R266J0100J1679J4145J6794
$$ plain form
53905 384529 403224 422797 442396 460906 476404 486626 490254 487748 480848 471314 460170 448046
53893 448046 435864 424820 415674 408290 401945 395953 389967 383937 377926 371893 365592 358813 351716 344699
53879 344699 337956 331455 325400 320228 315876 311457 306171 300324 294951 290530 286635 282903 279711 277529
53865 277529 276009 274198 271509 268103 264377 260436 256215 251843 247720 244331 242038 240830 240135 239122
53851 239122 237428 235480 233848 232427 230699 228750 227361 226910 226706 225888 224493 223087 221727 220100 218473
53836 218473 217594 217515 217353 216584 215833 215872 216386 216357 215356 213813 212278 210980 210083 209785 210031 210432 210561 210205
53818 210205 209423 208565 208159 208577 209789 211458 213085 214038 213896 213068 212688 213505 215130 216787 218444 220673
53802 220673 223595 226648 229324 231567 233455 235092 236917 239523 242972 246770 250724 255310 260896 266993
$$ packed form
53905C84529J8695J9573J9599J8510J5498J0222L628k506o900r534j1144j2124
53893D48046j2182j1044r146p384o345n992n986o030o011o033o301o779p097p017
53879C44699o743o501o055n172m352m419n286n847n373m421l895l732l192k182
53865B77529j520j811k689l406l726l941m221m372m123l389k293j208o95j013
53851B39122j694j948j632j421j728j949j389m51k04q18j395j406j360j627j627
53836B18473q79p9j62p69p51L9N14k9j001j543j535j298q97k98K46M01J29l56
53818B10205p82q58m06M18J212J669J627R53j42q28l80Q17J625J657J657K229
53802B20673K922L053K676K243J888J637J825K606L449L798L954M586N586O097
$$ plain form
53788 266993 272652 277330 281091 284199 286845 289120 290965 292286 293296 294557 296359 298162 298948 298203 296420
53773 296420 294590 293277 292194 290561 287815 284031 279804 275826 272513 269770 266984 263520 259410 255438
53759 255438 252256 249601 246689 243256 239864 237165 235223 233583 231707 229281 226402 223543 221162 219316
53745 219316 217859 216872 216553 216729 216853 216539 215810 214905 214201 214173 214898 215678 215842 215893 217055 219498 221899 223205
53727 223205 223993 225463 227864 230740 234126 238471 243754 249760 256966 265952 275753 283922 288695 290269
53713 290269 289538 286550 281095 274115 267360 261725 256826 252341 248869 247043 246422 245943 245218 244772 245089 246047
53697 246047 247406 249265 251608 253780 254974 255157 255102 255487 256337 257316 258141 258655 258887 259174 259800 260370 260031
53680 260031 258565 256847 255855 255640 255687 255902 256580 257555 258059 257559 256354 255296 255161 256238 258107 259829 260748
$$ packed form
53788B66993N659M678L761L108K646K275J845J321J010J261J802J803P86p45j783
53773B96420j830j313j083j633k746l784m227l978l313k743k786l464m110l972
53759B55438l182k655k912l433l392k699j942j640j876k426k879k859k381j846
53745B19316j457r87l19J76J24l14p29r05p04k8P25P80J64N1J162K443K401J306
53727B23205P88J470K401K876L386M345N283O006P206Q986R801Q169M773J574
53713B90269p31k988n455o980o755n635m899m485l472j826o21m79p25m46L17R58
53697B46047J359J859K343K172J194J83n5L85Q50R79Q25N14K32K87O26N70l39
53680B60031j466j718r92k15M7K15O78R75N04n00j205j058j35J077J869J722R19
$$ plain form
53663 260748 261122 261633 262328 262489 261581 259755 257326 254307 250892 247896 246185 245769 245888 245963 246022 246241 246437
53646 246437 246330 246017 245854 245852 245546 244661 243686 243443 244111 245068 245755 246251 246829 247385 247757 248230 249156 250224 250721
53627 250721 250499 250183 250366 251145 252466 254344 256552 258609 260404 262377 264828 267438 269834 272202 274988
53612 274988 278267 281861 285807 290236 294906 299260 302933 305961 308605 311209 314086 317191 320002 322033
53598 322033 323410 324707 326322 328268 330448 332801 335193 337471 339646 341824 343945 345716 346688 346280 344064
53583 344064 340345 336230 332651 329457 325896 321785 317641 313766 309942 306183 303075 300964 299388 297765
53569 297765 296225 295198 294502 293465 291885 290312 289289 288767 288453 288314 288486 288874 289251 289717 290774 292772
53553 292772 295413 297936 299769 300836 301356 301629 302164 303672 306570 310538 314796 318740 322148 324953 327230
$$ packed form
53663B60748L74N11O95J61r08j826k429l019l415k996j711m16J19P5N9K19J96
53646B46437j07l13j63kl06q85r75k43O68R57O87M96N78N56L72M73R26J068M97
53627B50721k22l16J83P79J321J878K208K057J795J973K451K610K396K368K786
53612B74988L279L594L946M429M670M354L673L028K644K604K877L105K811K031
53598C22033J377J297J615J946K180K353K392K278K175K178K121J771R72m08k216
53583C44064l719m115l579l194l561m111m144l875l824l759l108k111j576j623
53569B97765j540j027o96j037j580j573j023n22l14j39J72L88L77M66J057J998
53553B92772K641K523J833J067N20K73N35J508K898L968M258L944L408K805K277
$$ plain form
53538 327230 329406 332090 335566 339755 344666 350483 357094 364020 371025 378450 386719 395831 405620 416083
53524 416083 427065 438002 448575 459428 471603 485230 499310 512959 526406 540569 556005
53513 556005 572591 590058 608521 628416 650042 673178 697107 721024 744367 766830 788294
53502 788294 808861 828763 848098 866803 885086 903593 922744 942072 960643 978150 995168
53491 995168 1012353 1029836 1047558 1065685 1084332 1103137 1121451 1138877 1155432 1171263 1186394
53480 1186394 1200680 1213927 1226108 1237495 1248386 1258632 1267572 1274566 1279473 1282542 1283948 1283415 1280171
53467 1280171 1273351 1262745 1249185 1233890 1217409 1199574 1180451 1160751 1141013 1120924 1099973
53456 1099973 1078390 1056864 1035544 1013922 991669 969082 946695 924970 904417 885480 868052
$$ packed form
53538C27230K176K684L476M189M911N817O611O926P005P425Q269R112R789J0463
53524D16083J0982J0937J0573J0853J2175J3627J4080J3649J3447J4163J5436
53513E56005J6586J7467J8463J9895K1626K3136K3929K3917K3343K2463K1464
53502G88294K0567J9902J9335J8705J8283J8507J9151J9328J8571J7507J7018
53491I95168J7185J7483J7722J8127J8647J8805J8314J7426J6555J5831J5131
53480A186394J4286J3247J2181J1387J0891J0246Q940O994M907L069J406n33l244
53467A280171o820j0606j3560j5295j6481j7835j9123j9700j9738k0089k0951
53456A099973k1583k1526k1320k1622k2253k2587k2387k1725k0553j8937j7428
$$ plain form
53445 868052 851474 835249 819491 804460 790000 775832 762235 750071 740080 732293 726168 721155
53433 721155 717169 714592 713901 715300 718692 723862 730548 738408 747198 757070 768446 781480 795866 811289
53419 811289 827868 845860 865092 885035 905464 926817 949768 974570 1000916 1028383 1056925
53408 1056925 1087005 1119218 1153718 1189967 1227185 1265110 1304240 1345306 1388648 1434229 1482014
53397 1482014 1531935 1583483 1635706 1687841 1739763 1791602 1843170 1894081 1944299 1994147 2043782
53386 2043782 2092979 2141437 2188816 2234339 2276789 2315230 2349474 2379548 2405070 2425596 2441398
53375 2441398 2453265 2461534 2465852 2466050 2462765 2456767 2447890 2434981 2416820 2392827 2362903 2327025 2285257
53362 2285257 2238099 2186563 2131768 2074519 2015362 1954984 1894270 1833872 1774010 1714976 1657687
$$ packed form
53445H68052j6578j6225j5758j5031j4460j4168j3597j2164r991p787o125n013
53433G21155l986k577o91J399L392N170O686P860Q790R872J1376J3034J4386J5423
53419H11289J6579J7992J9232J9943K0429K1353K2951K4802K6346K7467K8542
53408A056925L0080L2213L4500L6249L7218L7925L9130M1066M3342M5581M7785
53397A482014M9921N1548N2223N2135N1922N1839N1568N0911N0218M9848M9635
53386B043782M9197M8458M7379M5523M2450L8441L4244L0074K5522K0526J5802
53375B441398J1867Q269M318J98l285n998q877j2909j8161k3993k9924l5878m1768
53362B285257m7158n1536n4795n7249n9157o0378o0714o0398n9862n9034n7289
$$ plain form
53351 1657687 1603269 1551983 1502886 1454792 1407372 1361122 1316445 1273127 1230721 1189150 1148780
53340 1148780 1110024 1073029 1037678 1003809 971439 940796 912163 885657 861260 839036 819149
53329 819149 801568 785953 772077 760216 750765 743466 737489 732392 728518 726099 724510 723045 722090
53316 722090 722735 725218 728621 732306 736856 743165 751201 760241 769919 780482 792337 805864 821390
53303 821390 838784 857257 876097 895477 916084 938183 961610 986427 1012849 1040513 1068546
53292 1068546 1096513 1124756 1153655 1183055 1212527 1241621 1269628 1295572 1318707 1338700 1355358
53281 1355358 1368688 1379311 1388162 1395476 1400500 1402415 1401021 1396310 1388117 1376712 1363242 1348965 1334312
53268 1334312 1319011 1302706 1284992 1265345 1243681 1220748 1197318 1173169 1147417 1119718 1090587
$$ packed form
53351A657687n4418n1286m9097m8094m7420m6250m4677m3318m2406m1571m0370
53340A148780l8756l6995l5351l3869l2370l0643k8633k6506k4397k2224j9887
53329H19149j7581j5615j3876j1861r451p299n977n097l874k419j589j465r55
53316G22090O45K483L403L685M550O309Q036R040R678J0563J1855J3527J5526
53303H21390J7394J8473J8840J9380K0607K2099K3427K4817K6422K7664K8033
53292A068546K7967K8243K8899K9400K9472K9094K8007K5944K3135J9993J6658
53281A355358J3330J0623Q851P314N024J915j394m711q193j1405j3470j4277j4653
53268A334312j5301j6305j7714j9647k1664k2933k3430k4149k5752k7699k9131
$$ plain form
53257 1090587 1060572 1029719 997898 965231 932075 898898 866218 834419 803664 774149 746288
53246 746288 720342 696013 672605 649484 626214 602615 579096 556617 535856 516564 498092
53235 498092 480249 463186 446856 431292 417154 405162 395044 385809 377012 369002 361932 355454
53223 355454 349511 344542 340503 336560 332152 327620 323281 318618 313092 307142 301624 296642 291662 286519
53209 286519 281590 277099 272937 269150 266026 263592 261441 259146 256607 254062 251956 250625 249819 248769
53195 248769 247034 245035 243385 241998 240450 238989 238458 239132 240270 240984 240977 240274 238810 236711 234630 233340
53179 233340 233108 233685 234711 235852 236727 237019 236690 235946 235001 234010 233185 232785 232915 233358 233743 233977 234493 235879
53161 235879 238176 240675 242599 243811 244680 245483 246292 247295 248648 249938 250370 249800 249144 249287 249920 250009 249257
$$ packed form
53257A090587l0015l0853l1821l2667l3156l3177l2680l1799l0755k9515k7861
53246G46288k5946k4329k3408k3121k3270k3599k3519k2479k0761j9292j8472
53235D98092j7843j7063j6330j5564j4138j1992j0118r235q797q010p070o478
53223C55454n943m969m039l943m408m532m339m663n526n950n518m982m980n143
53209B86519m929m491m162l787l124k434k151k295k539k545k106j331q06j050
53195B48769j735j999j650j387j548j461n31O74J138P14pp03j464k099k081j290
53179B33340k32N77J026J141Q75K92l29p44r45r91q25m00J30M43L85K34N16J386
53161B35879K297K499J924J212Q69Q03Q09J003J353J290M32n70o56J43O33Q9p52
$$ plain form
53144 249257 248398 247958 247417 246066 244239 242989 242615 242257 241158 239766 239045 239100 239136 238628 237818 236922 235620
53127 235620 233731 231824 230640 230256 230308 230681 231320 231657 230988 229446 227872 226728 225817 225178 225379 226482 227462
53110 227462 227285 226121 224843 223709 222259 220366 218645 217688 217398 217255 216860 216050 214741 212917 210698 208354
53094 208354 206264 204714 203654 202748 201842 201203 201137 201551 202099 202585 202894 202784 202173 201537 201553 202296 203182 203741
53076 203741 204030 204253 204411 204474 204508 204387 203714 202309 200579 199165 198366 198021 197776 197356 196749 196205 195874 195403
53058 195403 194236 192354 190390 188852 187608 186321 185033 184072 183706 184173 185666 187912 190079 191554 192554
53043 192554 193556 194449 194830 194919 195452 196559 197409 197118 195636 193582 191632 190232 189504 189160 188789 188364 188255
53026 188255 188636 189259 189926 190753 191725 192401 192470 192329 192623 193363 193923 193889 193543 193383 193443 193226 192268 190719 189383
$$ packed form
53144B49257q59m40n41j351j827j250l74l58j099j392p21N5L6n08q10q96j302
53127B35620j889j907j184l84N2L73O39L37o69j542j574j144r11o39K01J103R80
53110B27462j77j164j278j134j450j893j721r57k90j43l95q10j309j824k219k344
53094B08354k090j550j060r06r06o39o6M14N48M86L09j10o11o36J6P43Q86N59
53076B03741K89K23J58O3L4j21o73j405j730j414p99l45k45m20o07n44l31m71
53058A95403j167j882j964j538j244j287j288r61l66M67J493K246K167J475J000
53043A92554J002Q93L81Q9N33J107Q50k91j482k054j950j400p28l44l71m25j09
53026A88255L81O23O67Q27R72O76O9j41K94P40N60l4l46j60O0k17r58j549j336
$$ plain form
53007 189383 189044 189681 190478 190751 190698 191020 191975 193171 194209 195114 195910 196175 195357 193453 191081 188876 187002
52990 187002 185345 183942 183024 182634 182469 182239 182062 182287 182910 183383 183122 182168 181212 180970 181578 182555 183315 183690
52972 183690 183999 184620 185586 186641 187554 188237 188623 188717 188831 189504 191007 193059 195236 197449 199778 201976 203496
52955 203496 204067 203979 203691 203382 203020 202644 202302 201805 200790 199143 197182 195359 193881 192696 191745 191015 190382
52938 190382 189607 188593 187567 186884 186667 186669 186439 185598 184097 182386 181247 181212 182015 182736 182599 181603 180393 179616
52920 179616 179457 179724 180162 180640 181063 181274 181182 180932 180802 180890 181094 181482 182412 184002 185648 186497 186399 186048 186041 186152
52900 186152 185767 184774 183639 182747 182045 181438 181166 181474 182006 181905 180756 179243 178523 179002 180021 180868 181596
52883 181596 182540 183422 183524 182618 181210 179871 178849 178327 178449 178920 179117 178865 178584 178409 177760 176287 174729
$$ packed form
53007A89383l39O37P97K73n3L22R55J196J038R05P96K65q18j904k372k205j874
52990A87002j657j403r18l90j65k30j77K25O23M73k61r54r56k42O08R77P60L75
52972A83690L09O21R66J055R13O83L86R4J14O73J503K052K177K213K329K198J520
52955B03496N71q8k88l09l62l76l42m97j015j647j961j823j478j185r51p30o33
52938A90382p75j014j026o83k17Kk30q41j501j711j139l5Q03P21j37r96j210p77
52920A79616j59K67M38M78M23K11r2k50j30Q8K04L88R30J590J646Q49r8l51pJ11
52900A86152l85r93j135q92p02o07k72L08N32j01j149j513p20M79J019Q47P28
52883A81596R44Q82J02r06j408j339j022n22J22M71J97k52k81j75o49j473j558
$$ plain form
52866 174729 174203 174901 176076 177061 177693 177940 177882 178077 179209 181214 183330 185201 187335 190147 193156 195651
52850 195651 197746 200064 202513 204068 204034 203088 202637 203253 204093 203924 202438 200342 198368 196582 194678 192533
52834 192533 190260 188002 185979 184537 183781 183327 182702 181973 181611 181810 182264 182671 183100 183834 185080 186868 188848
52817 188848 190159 189977 188438 186720 185904 185980 186185 186050 185755 185648 185859 186414 187353 188641 190206 192237 195210
52800 195210 199365 204099 208048 209910 209286 206808 203555 200340 197383 194439 191190 187620 184143 181278
52786 181278 179096 177082 174694 172049 169907 168978 169279 170198 171094 171796 172514 173325 173877 173793 173243 172807 172732 172663
52768 172663 172218 171519 170921 170626 170855 172000 174091 176338 177808 178432 178781 178932 178301 176740 175107 174381 174644
52751 174644 175291 175826 176100 176037 175605 174992 174538 174551 175291 176904 179132 181220 182352 182187 181033 179672 178990
$$ packed form
52866A74729n26O98J175R85O32K47n8J95J132K005K116J871K134K812L009K495
52850A95651K095K318K449J555l4r46m51O16Q40j69j486k096j974j786j904k145
52834A92533k273k258k023j442p56m54o25p29l62J99M54M07M29P34J246J788J980
52817A88848J311j82j539j718q16P6K05j35k95j07K11N55R39J288J565K031K973
52800A95210M155M734L949J862o24k478l253l215k957k944l249l570l477k865
52786A81278k182k014k388k645k142r29L01R19Q96P02P18Q11N52q4n50m36p5o9
52768A72663m45o99n98k95K29J145K091K247J470O24L49J51o31j561j633p26K63
52751A74644O47N35K74o3m32o13m54J3P40J613K228K088J132j65j154j361o82
$$ plain form
52734 178990 179309 179954 179877 178989 178525 179749 182568 185729 188077 189248 189496 189429 189864 191370 193780 196405 198738
52717 198738 200652 201961 202227 201162 199005 196358 193783 191647 190159 189360 189050 188802 188155 186937 185447
52702 185447 184181 183343 182718 182066 181386 180752 180159 179700 179591 179822 180052 180077 180123 180368 180500 180150 179479 178889 178372
52683 178372 177675 176944 176618 176769 177161 177925 179469 181618 183555 184907 186208 187911 189481 190040 189441 188209
52667 188209 186754 185324 184501 184984 186762 188998 190882 192247 193242 193797 193689 192947 191973 191327 191432 192361 193794
52650 193794 195225 196267 196816 197083 197661 199363 202628 206946 211051 213753 214551 213517 210992 207494 203667
52635 203667 200067 197028 194756 193290 192289 191161 189710 188500 188247 188968 190022 190930 191830 193122 195008
52620 195008 197413 199917 201657 201755 200250 198338 197270 197135 197035 196285 194980 193459 191815 190162 188914
$$ packed form
52734A78990L19O45p7q88m64J224K819L161K348J171K48o7M35J506K410K625K333
52717A98738J914J309K66j065k157k647k575k136j488p99l10k48o47j218j490
52702A85447j266q38o25o52o80o34n93m59j09K31K30K5M6K45J32l50o71n90n17
52683A78372o97p31l26J51L92P64J544K149J937J352J301J703J570N59n99j232
52667A88209j455j430q23M83J778K236J884J365R95N55j08p42r74o46J05R29J433
52650A93794J431J042N49K67N78J702L265M318M105K702P98j034k525l498l827
52635B03667l600l039k272j466j001j128j451j210k53P21J054R08R00J292J886
52620A95008K405K504J740R8j505j912j068j35j00p50j305j521j644j653j248
$$ plain form
52605 188914 188429 188579 189002 189560 190261 190897 191222 191407 191869 192559 192867 192502 192107 192534 193701 194654 194817 194679
52587 194679 194993 195690 196022 195604 194865 194468 194652 195287 196168 197071 197780 198275 198733 199159 199269 198976 198727 199037 199813
52568 199813 200518 200841 200856 200630 200175 199789 199958 200749 201683 202341 202763 203087 203126 202567 201350 199743 198296 197743
52550 197743 198482 199892 200632 200030 198850 198287 198512 198733 198419 197923 197901 198652 200032 201583 202628 202680 201937 201099
52532 201099 200623 200421 200326 200391 200568 200500 199993 199456 199477 200090 200778 201187 201476 201924 202477 202938 203400 204232 205584 207121
52512 207121 208358 209136 209717 210571 212208 214956 218577 222192 224996 227102 229300 231931 234377 235888 236374
52497 236374 236047 234709 232019 228298 224493 221342 219005 217437 216564 215970 214988 213426 211945 211416 212029 213201
52481 213201 214191 214673 214852 215120 215589 215973 216080 216307 217333 219331 221717 223728 225004 225656 226095 226862 228216
$$ packed form
52605A88914m85J50M23N58P01O36L25J85M62O90L08l65l95M27J167R53J63j38
52587A94679L14O97L32m18p39l97J84O35Q81R03P09M95M58M26J10k93k49L10P76
52568A99813P05L23J5k26m55l86J69P91R34O58M22L24L9n59j217j607j447n53
52550A97743P39J410P40o02j180n63K25K21l14m96k2P51J380J551J045N2p43q38
52532B01099m76k02r5O5J77o8n07n37K1O13O88M09K89M48N53M61M62Q32J352J537
52512B07121J237P78N81Q54J637K748L621L615K804K106K198K631K446J511M86
52497B36374l27j338k690l721l805l151k337j568q73n94r82j562j481n29O13J172
52481B13201R90M82J79K68M69L84J07K27J026J998K386K011J276O52M39P67J354
$$ plain form
52464 228216 229815 231111 232118 233349 234969 236572 238037 239932 242551 245098 246467 246494 245732 244254 241582
52449 241582 237832 234087 231237 229065 226867 224537 222519 221019 219782 218620 217706 217193 216775 215794 213845
52434 213845 211299 209177 208327 208695 209485 209990 210046 209728 209064 208216 207542 207136 206613 205709 204840 204645 205160 205894
52416 205894 206567 207240 207837 208199 208665 209894 211923 214055 215936 218022 220487 222437 223078 223183 224472 227699
52400 227699 232294 237783 244489 252513 260929 268483 274465 278425 279706 277933 273649 267955 261766 255791
52386 255791 250659 246445 242468 238370 235133 234105 235065 236264 236641 237025 238622 241092 243041 243928 244541
52371 244541 245628 246926 247927 248845 250313 252437 254772 257127 259775 262680 264963 265545 264172 261564 258676
52356 258676 256094 253991 252288 250777 249336 248113 247296 246753 246194 245708 245745 246488 247592 248715 249866 250972
$$ packed form
52464B28216J599J296J007J231J620J603J465J895K619K547J369K7p62j478k672
52449B41582l750l745k850k172k198k330k018j500j237j162r14n13m18r81j949
52434B13845k546k122q50L68P90N05N6l18o64q48o74m06n23r04q69j95N15P34
52416B05894O73O73N97L62M66J229K029K132J881K086K465J950O41J05J289L227
52400B27699M595N489O706Q024Q416P554N982L960J281j773m284n694o189n975
52386B55791n132m214l977m098l237j028R60J199L77L84J597K470J949Q87O13
52371B44541J087J298J001R18J468K124K335K355K648K905K283N82j373k608k888
52356B58676k582k103j703j511j441j223q17n43n59m86L7P43J104J123J151J106
$$ plain form
52340 250972 251571 251345 250706 250438 250937 252121 253856 256036 258408 260790 263414 266677 270612 274945 279585
52325 279585 284662 290181 296012 302165 308660 315250 321709 328332 335542 342946 349383 354097 357361 359775
52311 359775 361499 362452 362796 362742 362286 361569 361284 362227 364477 367428 370570 373917 377608 381415 384901 387933
52295 387933 390827 393892 396984 399679 401829 403669 405275 406298 406486 406168 405807 405307 404242 402623 400960
52280 400960 399612 398675 398447 399370 401365 403827 406446 409432 412685 415452 417304 418937 421385 424794 428427
52265 428427 431630 434274 436492 438538 440810 443586 446757 450124 453813 458093 462913 467953 472975 477749
52251 477749 481785 484651 486646 488790 492024 496529 501731 506718 510694 513316 514751 515403 515649 515864 516391
52236 516391 517237 518008 518446 518918 520155 522560 525976 529955 534030 537862 541373 544697 547910 551081 554670
$$ packed form
52340B50972N99k26o39k68M99J184J735K180K372K382K624L263L935M333M640
52325B79585N077N519N831O153O495O590O459O623P210P404O437M714L264K414
52311C59775J724R53L44n4m56p17k85R43K250K951L142L347L691L807L486L032
52295C87933K894L065L092K695K150J840J606J023J88l18l61n00j065j619j663
52280D00960j348r37k28R23J995K462K619K986L253K767J852J633K448L409L633
52265D28427L203K644K218K046K272K776L171L367L689M280M820N040N022M774
52251D77749M036K866J995K144L234M505N202M987L976K622J435O52K46K15N27
52236E16391Q46P71M38M72J237K405L416L979M075L832L511L324L213L171L589
$$ plain form
52221 554670 559395 565294 571249 575992 579440 582574 586170 590145 594083 597815 601427 605086 608934 612876
52207 612876 616547 619813 623190 627312 632114 637025 641852 646867 652035 656866 661177 665320 669331 672507
52193 672507 674289 675167 676232 678117 680776 683988 687610 691455 695333 699189 702943 706253 708721 710279
52179 710279 711172 711654 711876 711944 711788 710961 708860 705222 700347 694826 689136 683478 677893 672485 667503 663258
52163 663258 660029 658021 657196 657045 656828 656395 656595 658423 661800 665647 669166 672420 675509 677864 678780 678231
52147 678231 676657 674318 671393 668435 666093 664465 663239 662469 662722 664358 667070 670163 672864 674338 673948
52132 673948 671838 668977 666342 664194 662289 660511 659062 658251 658369 659715 662531 667006 673467 682384 693873
52117 693873 707210 721115 734669 747840 761028 774180 786470 796816 804555 809590 812088 812338
$$ packed form
52221E54670M725N899N955M743L448L134L596L975L938L732L612L659L848L942
52207F12876L671L266L377M122M802M911M827N015N168M831M311M143M011L176
52193F72507J782Q78J065J885K659L212L622L845L878L856L754L310K468J558
52179G10279Q93M82K22O8j56q27k101l638m875n521n690n658n585n408m982m245
52163F63258l229k008q25j51k17m33K00J828L377L847L519L254L089K355R16n49
52147F78231j574k339k925k958k342j628j226p70K53J636K712L093K701J474l90
52132F73948k110k861k635k148j905j778j449q11J18J346K816M475O461Q917J1489
52117F93873J3337J3905J3554J3171J3188J3152J2290J0346P739N035K498K50
$$ plain form
52105 812338 810889 808421 805147 800590 794372 787221 780744 776088 773181 771448 770846 771840 774690 779225 785225
52090 785225 792512 800615 808712 816065 822304 827233 830590 832060 831341 828187 822628 815304 807439 800417
52076 800417 795357 792787 792282 792514 792231 791396 790960 791358 791770 791171 789621 788051 787193 787308 788595 791065 793989
52059 793989 796168 796981 796743 796011 794928 793371 791225 788341 784642 780519 776737 773727 771236 768846 766530
52044 766530 764526 762933 761672 760514 758933 756244 752232 747458 742707 738362 734495 731313 729187 728373
52030 728373 728957 730887 733802 737018 740016 742906 746244 750471 755671 761678 768256 775273 782800 790724
52016 790724 798209 804016 807773 810574 813894 818173 822872 827637 832766 838557 844713 850443 854749 856610
52002 856610 855344 850964 844048 835256 825089 813826 801263 786744 769906 751420 732521 713860
$$ packed form
52105H12338j449k468l274m557o218p151o477m656k907j733o02R94K850M535O000
52090G85225P287Q103Q097P353O239M929L357J470p19l154n559p324p865p022
52076H00417n060k570n05K32k83q35m36L98M12n99j550j570q58J15J287K470K924
52059G93989K179Q13k38p32j083j557k146k884l699m123l782l010k491k390k316
52044G66530k004j593j261j158j581k689m012m774m751m345l867l182k126q14
52030G28373N84J930K915L216K998K890L338M227N200O007O578P017P527P924
52016G90724P485N807L757K801L320M279M699M765N129N791O156N730M306J861
52002H56610j266m380o916q792j0167j1263j2563j4519j6838j8486j8899j8661
$$ plain form
51990 713860 695224 676311 657296 638639 620972 605270 592537 582923 575536 569313 563790 558830
51978 558830 554066 549004 543433 537430 531075 524320 517033 509038 500283 491025 481694 472595 463978 456356
51964 456356 450395 446456 444599 445020 447973 453180 459849 467530 476473 486859 498112 509353 520125
51951 520125 530259 539293 546389 550585 551019 547419 540855 533496 526961 521214 515667 510938 508595 509296
51937 509296 512309 517140 524685 536048 550783 567050 583263 598965 614221 628828 642296 654050
51925 654050 663296 668918 669847 665575 656260 642534 625354 605845 584992 563490 542053 521713 503416
51912 503416 487361 473159 460784 450862 443685 438386 433593 428635 423665 418904 414533 411228 410002
51899 410002 411230 414382 418946 424994 432618 441454 451239 462294 474770 487566 498507 505521 507419
$$ packed form
51990G13860j8636j8913j9015j8657j7667j5702j2733r614p387o223n523m960
51978E58830m764n062n571o003o355o755p287p995q755r258r331r099q617p622
51964D56356n961l939j857M21K953N207O669P681Q943J0386J1253J1241J0772
51951E20125J0134R034P096M196M34l600o564p359o535n747n547m729k343P01
51937E09296L013M831P545J1363J4735J6267J6213J5702J5256J4607J3468J1754
51925F54050R246N622R29m272r315j3726j7180j9509k0853k1502k1437k0340j8297
51912E03416j6055j4202j2375r922p177n299m793m958m970m761m371l305j226
51899D10002J228L152M564O048P624Q836R785J1055J2476J2796J0941P014J898
$$ plain form
51886 507419 503929 495609 483735 469856 455413 441862 430729 422969 418284 415509 413736 412915 413598
51873 413598 416500 422156 430490 440707 451916 463797 476334 489080 501138 511799 520748 527706
51861 527706 532364 534624 534361 530967 523750 513027 500315 487235 474659 463029 452915 444935 439552
51848 439552 437159 437778 440320 442818 444058 444598 445588 446990 447743 447484 447128 447617 448899 450502 452523 455547
51832 455547 459995 466052 473966 483763 494532 504376 511348 514481 513984 510673 505350 498560 490629 481751
51818 481751 472087 461979 452102 443257 435865 429766 424598 420240 416775 414216 412590 412236 413675 417097
51804 417097 422234 428788 436540 444769 451820 455789 455762 452247 446448 439407 431874 424569 418154 412876 408477
51789 408477 404560 401022 398023 395541 393079 389966 386030 381909 378672 377113 377354 378907 380977 382834
$$ packed form
51886E07419l490q320j1874j3879j4443j3551j1133p760m685k775j773q21O83
51873D13598K902N656Q334J0217J1209J1881J2537J2746J2058J0661Q949O958
51861E27706M658K260k63l394p217j0723j2712j3080j2576j1630j0114p980n383
51848D39552k393O19K542K498J240N40R90J402P53k59l56M89J282J603K021L024
51832D55547M448O057P914R797J0769R844O972L133m97l311n323o790p931q878
51818D81751r664j0108r877q845p392o099n168m358l465k559j626l54J439L422
51804D17097N137O554P752Q229P051L969k7l515n799p041p533p305o415n278m399
51789D08477l917l538k999k482k462l113l936m121l237j559K41J553K070J857
$$ plain form
51775 382834 384083 384648 384502 383523 381715 379418 377106 375111 373761 373624 375251 378596 383039 388088 393830
51760 393830 400603 408535 417566 427638 438526 449549 459594 467425 471997 472779 470011 464536 457217
51747 457217 448657 439468 430449 422224 414938 408556 403208 398950 395488 392588 390580 390047 391211 394078
51733 394078 399048 406842 417783 431710 448488 467894 488629 508064 523511 533767 539394 541951
51721 541951 543358 545693 550869 559779 571347 582373 588858 588292 581054 569698 557187 545968 537943
51708 537943 533926 532673 531274 527148 519512 508953 496463 483367 471433 462209 456397 454224 455743
51695 455743 460037 464616 466734 465421 461656 456777 451584 447008 444607 445737 450509 457735 465438 471305
51681 471305 473291 470567 463943 455271 446392 438571 432409 427936 424894 423175 423042 424929 429119 435605
$$ packed form
51775C82834J249N65j46r79j808k297k312j995j350j37J627L345M443N049N742
51760C93830O773P932R031J0072J0888J1023J0045P831M572P82k768n475p319
51747D57217q560r189r019q225p286o382n348m258l462k900k008n33J164K867
51733C94078M970P794J0941J3927J6778J9406K0735J9435J5447J0256N627K557
51721E41951J407K335N176Q910J1568J1026O485n66p238j1356j2511j1219q025
51708E37943m017j253j399m126p636j0559j2490j3096j1934r224n812k173J519
51695D55743M294M579K118j313l765m879n193m576k401J130M772P226P703N867
51681D71305J986k724o624q672q879p821o162m473l042j719j33J887M190O486
$$ plain form
51667 435605 444091 454097 465136 476810 488841 501397 515641 533478 555935 581513 606493 626925
51655 626925 640105 644421 638903 623785 601338 575438 549928 527283 508507 493876 483560 477597
51643 477597 475571 476645 479998 484896 489990 492867 491014 483557 471799 457967 443672 429513 415601
51630 415601 402098 389518 378686 370166 363583 357851 352309 347296 343418 340635 338484 336853 336053 336220
51616 336220 337056 338081 338840 338970 338444 337671 337026 336371 335380 334286 333845 334493 335884 337274 338011 337619 335934
51599 335934 333441 331179 329990 329909 330420 331106 331928 333113 335086 338372 343320 349889 357822 366926 377005
51584 377005 387542 397648 406296 412580 415969 416697 415938 415265 415700 417336 419941 423752 429555 438158 450045
51569 450045 465461 484390 506123 529038 551409 572889 595134 620497 649717 680849 710536
$$ packed form
51667D35605Q486J0006J1039J1674J2031J2556J4244J7837K2457K5578K4980K0432
51655F26925J3180M316n518j5118k2447k5900k5510k2645j8776j4631j0316n963
51643D77597k026J074L353M898N094K877j853p457j1758j3832j4295j4159j3912
51630D15601j3503j2580j0832q520o583n732n542n013l878k783k151j631q00J67
51616C36220Q36J025P59J30n26p73o45o55r91j094m41O48J391J390P37l92j685
51599C35934k493k262j189q1N11O86Q22J185J973L286M948O569P933R104J0079
51584C77005J0537J0106Q648O284L389P28p59o73M35J636K605L811N803Q603J1887
51569D50045J5416J8929K1733K2915K2371K1480K2245K5363K9220L1132K9687
$$ plain form
51558 710536 736409 758513 779036 801138 827863 861277 901981 949218 1001249 1055240 1106768
51547 1106768 1150222 1180649 1195575 1195052 1180385 1153335 1116330 1072407 1024292 973688 921662 869353
51535 869353 817985 768498 721653 678391 639688 606005 577167 552779 532539 516142 503110
51524 503110 492691 483854 475552 467303 459522 453013 448113 444439 441386 438590 435926 433331 430733 428028
51510 428028 425155 422329 420009 418359 416816 414571 411447 407885 404063 399580 394190 388403 382983 378161
51496 378161 373645 369153 364667 360400 356803 354329 352906 351886 350869 350280 350691 351827 352891 353799 355398
51481 355398 358244 361657 364252 365069 364039 361785 359263 357258 355806 354271 352196 349848 347715 345822
51467 345822 343947 342239 341102 340483 339780 338460 336443 333865 330923 328014 325622 323909 322751 322239 322636
$$ packed form
51558G10536K5873K2104K0523K2102K6725L3414M0704M7237N2031N3991N1528
51547A106768M3454L0427J4926n23j4667k7050l7005m3923m8115n0604n2026n2309
51535H69353n1368m9487m6845m3262l8703l3683k8838k4388k0240j6397j3032
51524E03110j0419q837q302q249p781o509m900l674l053k796k664k595k598k705
51510D28028k873k826k320j650j543k245l124l562l822m483n390n787n420m822
51496C78161m516m492m486m267l597k474j423j020j017n89M11J136J064R08J599
51481C55398K846L413K595Q17j030k254k522k005j452j535k075k348k133j893
51467C45822j875j708j137o19p03j320k017k578k942k909k392j713j158n12L97
$$ plain form
51452 322636 323628 324185 323680 322824 322976 324653 327247 330109 333367 337659 343557 351400 361224 372618 385085
51437 385085 398888 415174 434722 456440 477319 493980 504338 508280 507418 504551 502842 504537 509621
51424 509621 515528 518454 515491 505965 491269 473873 456439 441152 429144 420307 413813 408852 405007
51411 405007 402306 401228 402338 405406 409050 411727 413067 413895 415056 416754 418910 421394 423706 425115
51397 425115 425479 425497 425836 426530 427503 429114 431673 434932 438678 443506 450307 459097 468919 478859 488820 499425
51381 499425 511628 526336 543998 564615 588491 616809 651099 692206 740103 794430 854601
51370 854601 919437 987162 1055572 1121551 1180524 1227434 1258983 1274702 1275695 1262761 1236116 1196524
51358 1196524 1146079 1087744 1024396 958400 891868 826984 765820 709835 659774 616051 578872
$$ packed form
51452C22636R92N57n05q56J52J677K594K862L258M292N898P843R824J1394J2467
51437C85085J3803J6286J9548K1718K0879J6661J0358L942q62k867j709J695N084
51424E09621N907K926k963r526j4696j7396j7434j5287j2008q837o494m961l845
51411D05007k701j078J110L068L644K677J340Q28J161J698K156K484K312J409
51397D25115L64J8L39O94R73J611K559L259L746M828O801Q790R822R940R961J0605
51381D99425J2203J4708J7662K0617K3876K8318L4290M1107M7897N4327O0171
51370H54601O4836O7725O8410O5979N8973M6910L1549J5719R93j2934k6645l9592
51358A196524n0445n8335o3348o5996o6532o4884o1164n5985n0061m3723l7179
$$ plain form
51347 578872 547804 521601 498957 479356 462953 449711 438913 429322 419676 409375 399021 389884
51335 389884 382388 375504 368151 360680 354186 348753 343502 338290 334161 331806 330490 328968 326747 324089
51321 324089 321459 319476 318727 319082 319618 319653 319445 319510 319794 319971 320088 320409 321008 321971 323627 326051 328731 331188
51303 331188 333594 336293 339055 341380 343296 345271 347485 349681 351630 353283 354539 355223 355215 354342 352351
51288 352351 349298 345764 342409 339470 336958 334965 333429 331951 330290 328788 327848 327351 327091 327407 328706
51273 328706 330504 331615 331315 329842 327931 326376 325862 326517 327618 328270 328385 328481 328713 328836 329114 330389 332982
51256 332982 336113 338780 340709 342175 343374 344321 345054 345664 346374 347718 350249 353837 357578 360556 362384
51241 362384 362888 361765 358920 354865 350446 346245 342378 338623 334669 330480 326545 323465 321199 319109
$$ packed form
51347E78872l1068k6203k2644j9601j6403j3242j0798r591r646j0301j0354r137
51335C89884p496o884p353p471o494n433n251n212m129k355j316j522k221k658
51321C24089k630j983p49L55N36L5k08O5K84J77J17L21N99R63J656K424K680K457
51303C31188K406K699K762K325J916J975K214K196J949J653J256O84qq73j991
51288C52351l053l534l355k939k512j993j536j478j661j502r40m97k60L16J299
51273C28706J798J111l00j473j911j555n14O55J101O52J15R6K32J23K78J275K593
51256C32982L131K667J929J466J199R47P33O10P10J344K531L588L741K978J828
51241C62384N04j123k845m055m419m201l867l755l954m189l935l080k266k090
$$ plain form
51227 319109 316914 315139 314344 314295 314293 314016 313613 313231 312870 312599 312551 312782 313419 314771 316917 319303 321192 322466
51209 322466 323609 324888 326011 326763 327577 329142 331603 334479 337321 340198 343430 347033 350585 353595 355864
51194 355864 357489 358686 359738 360970 362572 364456 366423 368427 370564 372862 375253 377670 379871 381290
51180 381290 381419 380442 379117 377873 376409 374370 372027 369855 367765 365250 362232 359236 356701 354498 352296
51165 352296 350006 347683 345309 342909 340782 339354 338855 339186 340030 340982 341734 342298 342995 344096 345591 347354
51149 347354 349380 351593 353548 354651 354767 354412 354185 354107 353593 352023 349318 346044 342960 340364 337884 335011
51133 335011 331846 329112 327406 326673 326499 326662 327200 328126 329350 330727 331949 332566 332476 332366 333297 335742 339250
51116 339250 343033 346647 350102 353654 357648 362277 367316 372197 376446 379911 382564 384307 385062 384935 384226
$$ packed form
51227C19109k195j775p95m9kk77m03l82l61k71m8K31O37J352K146K386J889J274
51209C22466J143J279J123P52Q14J565K461K876K842K877L232L603L552L010K269
51194C55864J625J197J052J232J602J884J967K004K137K298K391K417K201J419
51180C81290J29r77j325j244j464k039k343k172k090k515l018k996k535k203k202
51165C52296k290k323k374k400k127j428m99L31Q44R52P52N64O97J101J495J763
51149C47354K026K213J955J103J16l55k27p8n14j570k705l274l084k596k480k873
51133C35011l165k734j706p33j74J63N38R26J224J377J222O17r0j10R31K445L508
51116C39250L783L614L455L552L994M629N039M881M249L465K653J743P55j27p09
$$ plain form
51101 384226 383460 383292 384027 385233 386245 387169 388907 391970 395706 399119 402022 404855 407574 409340 409404 407905
51085 407905 405677 403477 401475 399305 396539 393208 389816 386856 384390 382171 379921 377428 374714 372394
51071 372394 371530 372650 374989 377127 378362 379210 380558 382667 385031 386968 388367 390021 393167 398429 405335
51056 405335 413213 422343 433638 446953 460185 470463 476180 477782 476974 475654 475537 477985 483343 490333
51042 490333 496729 501284 504887 509459 515769 522821 529271 534784 539871 545283 552061 561450 573730 587164
51028 587164 598688 605682 606914 602326 592793 580042 565934 551451 536657 521645 507067 493759
51016 493759 482348 473315 466893 462675 459709 457245 455227 454077 454265 456034 459170 462996 466875 470695
51002 470695 474554 478160 481052 483428 486130 489677 493740 497613 500725 502659 503255 502963 502597 502487 502263
$$ packed form
51101C84226p66j68P35J206J012R24J738L063L736L413K903K833K719J766O4j499
51085D07905k228k200k002k170k766l331l392k960k466k219k250k493k714k320
51071C72394q64J120K339K138J235Q48J348K109K364J937J399J654L146N262O906
51056D05335P878R130J1295J3315J3232J0278N717J602q08j320j17K448N358O990
51042D90333O396M555L603M572O310P052O450N513N087N412O778R389J2280J3434
51028E87164J1524O994J232m588r533j2751j4108j4483j4794j5012j4578j3308
51016D93759j1411r033o422m218k966k464k018j150J88J769L136L826L879L820
51002D70695L859L606K892K376K702L547M063L873L112J934N96k92l66j10k24
$$ plain form
50987 502263 501675 501188 501535 503045 505569 508714 512058 515629 520372 527664 538097 551185 566328 583313
50973 583313 601517 619309 634927 647542 656965 662859 664971 663883 660813 656711 651992 646950 641863
50960 641863 636739 631453 626058 620583 614716 608263 601900 596884 593928 592816 593173 595116 598955 604726
50946 604726 612356 621968 633683 647303 662605 679895 699971 723431 750289 780506 814614 853124
50934 853124 894834 935827 970738 995498 1009235 1014028 1013241 1009859 1005561 1000692 994982 988222 980177
50921 980177 970160 957331 941582 923648 904180 883205 860780 837664 814927 793173 772576
50910 772576 753332 735624 719343 704254 690295 677340 664927 652681 640903 630234 620819 612197
50898 612197 604022 596465 589854 584228 579322 574736 570129 565448 560986 557059 553663 550611 547877 545569
$$ packed form
50987E02263n88m87L47J510K524L145L344L571M743P292J0433J3088J5143J6985
50973E83313J8204J7792J5618J2615R423N894K112j088l070m102m719n042n087
50960F41863n124n286n395n475n867o453o363n016k956j112L57J943L839N771
50946F04726P630R612J1715J3620J5302J7290K0076K3460K6858L0217L4108L8510
50934H53124M1710M0993L4911K4760J3737M793p87l382m298m869n710o760q045
50921I80177j0017j2829j5749j7934j9468k0975k2425k3116k2737k1754k0597
50910G72576j9244j7708j6281j5089j3959j2955j2413j2246j1778j0669r415q622
50898F12197q175p557o611n626m906m586m607m681m462l927l396l052k734k308
$$ plain form
50884 545569 543658 541929 540143 538132 535898 533807 532441 531960 531770 531101 529758 528118 526609 525539 525157
50869 525157 525464 526069 526592 527049 527572 528037 528420 529220 530956 533463 536312 539746 544396 550123 555938 561294
50853 561294 566688 572711 579177 585672 592323 599470 607016 614654 622447 630637 639138 647821 657153 667929
50839 667929 680284 693523 707081 721272 736837 754020 772367 791304 810661 830665 851678
50828 851678 874053 898085 923927 951516 980736 1011725 1044984 1081097 1120408 1162960 1208632
50817 1208632 1257139 1307903 1359972 1412072 1462713 1510344 1553504 1590784 1620682 1641770 1653287
50806 1653287 1655491 1649210 1635092 1613490 1584981 1550744 1512387 1471629 1430163 1389506 1350791 1314715
50794 1314715 1281683 1251875 1225208 1201470 1180622 1162886 1148510 1137531 1129798 1125149 1123546 1125098
$$ packed form
50884E45569j911j729j786k011k234k091j366m81j90o69j343j640j509j070l82
50869E25157L07O05N23M57N23M65L83Q00J736K507K849L434M650N727N815N356
50853E61294N394O023O466O495O651P147P546P638P793Q190Q501Q683R332J0776
50839F67929J2355J3239J3558J4191J5565J7183J8347J8937J9357K0004K1013
50828H51678K2375K4032K5842K7589K9220L0989L3259L6113L9311M2552M5672
50817A208632M8507N0764N2069N2100N0641M7631M3160L7280K9898K1088J1517
50806A653287K204o281j4118k1602k8509l4237l8357m0758m1466m0657l8715l6076
50794A314715l3032k9808k6667k3738k0848j7736j4376j0979p733m649j603J552
$$ plain form
50782 1125098 1129902 1137668 1147462 1157897 1167638 1175674 1181277 1184015 1183992 1181968 1179012 1175825 1172243 1167330
50768 1167330 1160040 1149957 1137418 1122888 1106293 1087079 1064921 1040231 1013898 986624 958642
50757 958642 930143 901815 874699 849453 825977 803964 783536 765009 748287 732999 719230
50746 719230 707579 698362 691259 685874 682093 679681 678160 677580 678872 682869 689290 697216 706242 716513
50732 716513 727906 739909 752303 765322 779021 792946 806545 819591 832214 844781 857655
50721 857655 870748 883510 895675 907747 920330 933322 946325 959468 973008 986374 998547
50710 998547 1009367 1019544 1029385 1038564 1047414 1057390 1069654 1083975 1099611 1116571 1135386 1156257
50698 1156257 1179133 1204194 1231546 1260650 1290553 1320305 1348673 1373913 1394606 1410650 1422902
$$ packed form
50782A125098M804P766R794J0435R741Q036N603K738k3k024k956l187l582m913
50768A167330p290j0083j2539j4530j6595j9214k2158k4690k6333k7274k7982
50757I58642k8499k8328k7116k5246k3476k2013k0428j8527j6722j5288j3769
50746G19230j1651r217p103n385l781k412j521n80J292L997O421P926R026J0271
50732G16513J1393J2003J2394J3019J3699J3925J3599J3046J2623J2567J2874
50721H57655J3093J2762J2165J2072J2583J2992J3003J3143J3540J3366J2173
50710I98547J0820J0177R841R179Q850R976J2264J4321J5636J6960J8815K0871
50698A156257K2876K5061K7352K9104K9903K9752K8368K5240K0693J6044J2252
$$ plain form
50687 1422902 1432074 1438513 1442850 1446205 1449659 1453925 1459473 1466510 1474779 1483601 1492047 1498955 1503249 1504835
50673 1504835 1505075 1505914 1508702 1514265 1523834 1539056 1560893 1588952 1621917 1658105 1695550 1732218 1766639
50660 1766639 1798229 1826918 1852836 1876483 1898790 1920606 1942176 1963287 1983763 2003640 2022923
50649 2022923 2041377 2058625 2074449 2089029 2102903 2116752 2131407 2147994 2167746 2191448 2219313
50638 2219313 2251556 2288670 2330723 2376638 2424705 2473616 2522483 2570021 2614434 2654180 2688315
50627 2688315 2716141 2737333 2752615 2763613 2771770 2778180 2784489 2792181 2799163 2797574 2777189 2732521
50615 2732521 2666832 2589606 2511040 2438753 2377647 2330497 2297967 2278857 2271039 2272190 2279726 2290503
50603 2290503 2300980 2307613 2307166 2297001 2275598 2242827 2199530 2146774 2085704 2018081 1946523 1873690
$$ packed form
50687A422902R172O439M337L355L454M266N548P037Q269Q822Q446O908M294J586
50673A504835K40Q39K788N563R569J5222K1837K8059L2965L6188L7445L6668L4421
50660A766639L1590K8689K5918K3647K2307K1816K1570K1111K0476J9877J9283
50649B022923J8454J7248J5824J4580J3874J3849J4655J6587J9752K3702K7865
50638B219313L2243L7114M2053M5915M8067M8911M8867M7538M4413L9746L4135
50627B688315K7826K1192J5282J0998Q157O410O309P692O982j589k0385m4668
50615B732521o5689p7226p8566p2287o1106m7150l2530j9110p818J151P536J0777
50603B290503J0477O633m47j0165k1403l2771m3297n2756o1070o7623p1558p2833
$$ plain form
50591 1873690 1801214 1729661 1659594 1592289 1529197 1471030 1417749 1369267 1325689 1286922 1252650
50580 1252650 1222890 1198149 1178699 1164082 1153649 1147228 1144808 1145840 1149466 1155423 1164240 1176526
50568 1176526 1192454 1211849 1234138 1258089 1282149 1305285 1327000 1346347 1361668 1371887 1377677
50557 1377677 1380798 1382705 1384403 1387305 1393304 1403900 1419856 1441800 1470455 1506000 1547668 1594276
50545 1594276 1644736 1697820 1751824 1805036 1856472 1905956 1953620 1999677 2044822 2090619 2139259
50534 2139259 2192666 2251737 2316467 2386791 2463035 2545593 2634633 2730536 2834178 2946200 3066182
50523 3066182 3193114 3326545 3466514 3612326 3762180 3914104 4066316 4216178 4359504
50514 4359504 4491558 4608394 4706814 4783609 4835605 4860304 4856075 4822163 4759197 4669572 4556816
$$ packed form
50591A873690p2476p1553p0067o7305o3092n8167n3281m8482m3578l8767l4272
50580A252650k9760k4741j9450j4617j0433o421k420J032L626N957Q817J2286
50568A176526J5928J9395K2289K3951K4060K3136K1715J9347J5321J0219N790
50557A377677L121J907J698K902N999J0596J5956K1944K8655L5545M1668M6608
50545A594276N0460N3084N4004N3212N1436M9484M7664M6057M5145M5797M8640
50534B139259N3407N9071O4730P0324P6244Q2558Q9040R5903J03642J12022J19982
50523C066182J26932J33431J39969J45812J49854J51924J52212J49862J43326
50514D359504J32054J16836R8420P6795N1996K4699m229l3912o2966q9625j12756
$$ plain form
50503 4556816 4424801 4278048 4122382 3964401 3810226 3665227 3534614 3423221 3334416 3269889
50493 3269889 3230591 3217052 3228320 3261127 3310431 3370187 3433219 3491166 3535591 3559446 3557585
50482 3557585 3526832 3466707 3380113 3272441 3149517 3016366 2877448 2736969 2598314 2463543
50472 2463543 2333882 2210628 2095217 1988537 1890596 1801019 1719648 1646446 1580915 1521843
50462 1521843 1467753 1417558 1370694 1326792 1285549 1247023 1211785 1180447 1153090 1129285 1108560
50451 1108560 1090529 1074632 1060170 1046720 1034333 1023223 1013513 1005369 998990 994195 990317 986895
50439 986895 984291 983266 984043 986249 989660 994545 1001180 1009471 1019241 1030508 1043359 1057900 1074465
50426 1074465 1093510 1115073 1138706 1164142 1191609 1221200 1252460 1285079 1319569 1356684 1396482
$$ packed form
50503D556816j32015j46753j55666j57981j54175j44999j30613j11393q8805o4527
50493C269889l9298j3539J1268L2807M9304N9756O3032N7947M4425K3855j861
50482C557585l0753o0125q6594j07672j22924j33151j38918j40479j38655j34771
50472B463543j29661j23254j15411j06680r7941q9577q1371p3202o5531n9072
50462A521843n4090n0195m6864m3902m1243l8526l5238l1338k7357k3805k0725
50451A108560j8031j5897j4462j3450j2387j1110r710q144o379m795l878l422
50439I86895k604j025P77K206L411M885O635Q291R770J1267J2851J4541J6565
50426A074465J9045K1563K3633K5436K7467K9591L1260L2619L4490L7115L9798
$$ plain form
50415 1396482 1438637 1483436 1531727 1584005 1640367 1701376 1767991 1840333 1917247 1997511 2080832
50404 2080832 2167084 2255057 2342625 2427886 2509698 2587440 2660790 2729414 2792136 2846302 2888459
50393 2888459 2915743 2926397 2919239 2893431 2849155 2788189 2713583 2628926 2537954 2444477 2352189
50382 2352189 2264438 2184137 2113748 2055125 2009333 1976630 1956701 1948961 1952601 1966150 1986878 2010753
50370 2010753 2033270 2050390 2058854 2055973 2039733 2009345 1965662 1910911 1847955 1779575 1708035 1635031
50358 1635031 1561945 1490198 1421308 1356561 1296582 1241212 1189883 1142191 1098130 1057808 1021020
50347 1021020 987270 956175 927654 901693 878069 856484 836934 819833 805679 794505 785681
50336 785681 778394 772414 768122 765636 764114 762285 759535 756041 752003 747255 741746 735803 729695 723362
$$ packed form
50415A396482M2155M4799M8291N2278N6362O1009O6615P2342P6914Q0264Q3321
50404B080832Q6252Q7973Q7568Q5261Q1812P7742P3350O8624O2722N4166M2157
50393B888459K7284J0654p158k5808m4276o0966p4606q4657r0972r3477r2288
50382B352189q7751q0301p0389n8623m5792l2703j9929p740L640J3549K0728K3875
50370B010753K2517J7120Q464k881j6240l0388m3683n4751o2956o8380p1540p3004
50358A635031p3086p1747o8890o4747n9979n5370n1329m7692m4061m0322l6788
50347A021020l3750l1095k8521k5961k3624k1585j9550j7101j4154j1174q824
50336G85681p287n980m292k486j522j829k750l494m038m748n509n943o108o333
$$ plain form
50322 723362 716867 710694 705301 700679 696696 693520 691375 690161 689745 690326 692078 694600 697303 700326 704613
50307 704613 710968 719282 728750 738632 748813 759748 771780 784359 796113 805921 813785 820480 826645
50294 826645 832536 838408 844617 851335 858462 865760 872779 878762 882913 884809 884498 882482 879800 877728
50280 877728 876986 877573 879713 884482 893169 906888 927711 958816 1000849 1047326 1085561 1104155 1100060
50267 1100060 1078668 1048499 1016605 987428 963237 944427 930010 918579 909012 900633 893307 887455
50255 887455 883695 882499 884375 889864 898650 908750 917204 921672 921097 915235 904526 890555 875693
50242 875693 861691 848995 837703 828573 822467 819197 817607 816749 816533 817237 818823 820814 822560 823538
50228 823538 823580 822881 821670 819879 817220 813463 808480 802193 794744 786641 778420 770132 761436 752222 742897
$$ packed form
50322G23362o495o173n393m622l983l176k145j214m16N81J752K522K703L023M287
50307G04613O355Q314R468R882J0181J0935J2032J2579J1754R808P864O695O165
50294H26645N891N872O209O718P127P298P019N983M151J896l11k016k682k072
50280H77728p42N87K140M769Q687J3719K0823L1105M2033M6477L8235J8594m095
50267A100060k1392l0169l1894k9177k4191j8810j4417j1431r567q379p326n852
50255H87455l760j196J876N489Q786J0100Q454M468n75n862j0709j3971j4862
50242H75693j4002j2696j1292r130o106l270j590q58k16P04J586J991J746R78
50228H23538M2o99j211j791k659l757m983o287p449q103q221q288q696r214r325
$$ plain form
50213 742897 733978 725669 717869 710381 702956 695431 688022 681301 675672 670993 666835 662959 659375 656107
50199 656107 653117 650394 647955 645825 644151 643174 642927 643081 643268 643450 643801 644386 645203 646395 648155 650521
50183 650521 653522 657393 662318 668092 674354 681055 688388 696421 705270 715588 728303 743786 761778
50170 761778 782218 805564 831986 860674 890219 919328 946954 972186 994455 1013664 1029945
50159 1029945 1043687 1055990 1068578 1082677 1098151 1113976 1129153 1142661 1152995 1158587 1158789 1154009
50147 1154009 1144885 1131755 1114894 1094809 1072220 1048049 1023387 999170 975760 953054 930967
50136 930967 909720 889890 872515 858923 850032 845842 845701 848630 852876 855655 854392 848457 839153
50123 839153 827983 815607 802582 790112 779353 770449 762830 756138 750285 744852 739164 733045 727055
$$ packed form
50213G42897q919q309p800p488p425p525p409o721n629m679m158l876l584l268
50199F56107k990k723k439k130j674r77k47J54J87J82L51N85Q17J192J760K366
50183F50521L001L871M925N774O262O701P333Q033Q849J0318J2715J5483J7992
50170G61778K0440K3346K6422K8688K9545K9109K7626K5232K2269J9209J6281
50159A029945J3742J2303J2588J4099J5474J5825J5177J3508J0334N592K02m780
50147A154009r124j3130j6861k0085k2589k4171k4662k4217k3410k2706k2087
50136I30967k1247j9830j7375j3592q891m190j41K929M246K779j263n935r304
50123H39153j1170j2376j3025j2470j0759q904p619o692n853n433n688o119n990
$$ plain form
50110 727055 721808 717384 713556 710288 707791 706201 705567 706076 707953 710879 713797 715688 716543 717262 718551
50095 718551 720321 722200 724080 725839 727021 727355 727245 727263 727406 727486 727983 729710 732656 735928 739001 742318
50079 742318 746454 751386 756955 763400 770822 778572 785718 791869 797164 801729 805753 809978 815527 823121
50065 823121 832622 843375 854772 866644 879361 893564 909621 927408 946793 968279 992986 1022007
50053 1022007 1055843 1094178 1135993 1179954 1224902 1269836 1313311 1353262 1388050 1417819 1444459
50042 1444459 1470083 1495782 1521828 1548456 1575798 1603092 1628451 1649557 1664296 1670768 1667328 1653347
50030 1653347 1629966 1599692 1565130 1528196 1490178 1451811 1413100 1373743 1334210 1296028 1260612
50019 1260612 1228182 1198234 1170606 1145460 1122509 1101046 1080702 1061607 1043915 1027800 1013649
$$ packed form
50110G27055n247m424l828l268k497j590o34N09J877K926K918J891Q55P19J289
50095G18551J770J879J880J759J182L34j10J8J43Q0M97J727K946L272L073L317
50079G42318M136M932N569O445P422P750P146O151N295M565M024M225N549P594
50065H23121R501J0753J1397J1872J2717J4203J6057J7787J9385K1486K4707K9021
50053A022007L3836L8335M1815M3961M4948M4934M3475L9951L4788K9769K6640
50042A444459K5624K5699K6046K6628K7342K7294K5359K1106J4739O472l440j3981
50030A653347k3381l0274l4562l6934l8018l8367l8711l9357l9533l8182l5416
50019A260612l2430k9948k7628k5146k2951k1463k0344j9095j7692j6115j4151
$$ plain form
50008 1013649 1001233 988623 973005 953233 930920 908496 886809 865168 843136 821363 800897
49997 800897 782443 766354 752832 742047 734343 730306 730287 733865 740000 747646 756005 764356 771986 778270
49983 778270 782689 784934 785236 784395 783097 781292 778412 773961 767509 758408 746280 731911 717130 703417
49969 703417 690896 678951 667572 657717 650366 645496 642124 639225 636460 634050 632159 630650 629460
49956 629460 628915 629467 631208 633878 637325 641794 647654 655015 663846 674500 687852 704579 724293 745728
49942 745728 767902 790801 814710 839255 863592 887317 910550 933207 954908 975894 997455
49931 997455 1020936 1046381 1072235 1095991 1115026 1127466 1132948 1132595 1128039 1120647 1111761 1103172 1096735
49918 1096735 1093578 1093920 1097308 1102506 1107380 1109491 1106969 1098572 1083273 1060562 1031297 997661 961936
$$ packed form
50008A013649j2416j2610j5618j9772k2313k2424k1687k1641k2032k1773k0466
49997H00897j8454j6089j3522j0785p704m037j9L578O135P646Q359Q351P630O284
49983G78270M419K245L02q41j298j805k880m451o452r101j2128j4369j4781j3713
49969G03417j2521j1945j1379r855p351m870l372k899k765k410j891j509j190
49956F29460n45N52J741K670L447M469N860P361Q831J0654J3352J6727J9714K1435
49942G45728K2174K2899K3909K4545K4337K3725K3233K2657K1701K0986K1561
49931I97455K3481K5445K5854K3756J9035J2440N482l53m556p392q886q589o437
49918A096735l157L42L388N198M874K111k522q397j5299k2711k9265l3636l5725
$$ plain form
49905 961936 925713 890453 858150 830715 808760 791529 778033 767824 760700 756328 754668 756392
49893 756392 762200 771708 783426 795892 808231 819464 827998 832572 833444 832030 829434 825821 821034
49880 821034 814991 807305 797166 784043 768131 749871 729496 707414 684701 662745 642475 624142
49868 624142 607629 592746 579430 567885 558513 551580 547030 544509 543264 542221 540781 539661 540322
49855 540322 543319 547787 552790 558412 565097 572722 581154 591162 603747 618741 635001 651892 669618
49842 669618 687888 705026 718902 728395 733816 736337 737309 737739 737928 737431 735309 730500 722298 710962
49828 710962 697777 684137 670566 656950 643596 631544 621747 614318 608727 604427 601172 599004 598092
49815 598092 598447 599837 602180 605982 612043 620695 631602 644250 658238 673018 687767 701703 714281
$$ packed form
49905I61936l6223l5260l2303k7435k1955j7231j3496j0209p124m372j660J724
49893G56392N808R508J1718J2466J2339J1233Q534M574Q72j414k596l613m787
49880H21034o043p686j0139j3123j5912j8260k0375k2082k2713k1956k0270j8333
49868F24142j6513j4883j3316j1545r372o933m550k521j245j043j440j120O61
49855E40322K997M468N003N622O685P625Q432J0008J2585J4994J6260J6891J7726
49842F69618J8270J7138J3876R493N421K521R72M30J89m97k122m809q202j1336
49828G10962j3185j3640j3571j3616j3354j2052r797p429n591m300l255k168r12
49815E98092L55J390K343L802O061Q652J0907J2648J3988J4780J4749J3936J2578
$$ plain form
49802 714281 724965 733172 738728 742189 744476 746217 747463 747789 746496 742903 736736 728298 718140 706517
$$ packed form
49802G14281J0684Q207N556L461K287J741J246L26j293l593o167q438j0158j1623
$$ [...]
##END NTUPLES=NMR SPECTRUM
##END=
