##TITLE=AC1503_INDRS13310_8125488_1tnHXh314G
##JCAMPDX= 6.0         $$ Bruker NMR JCAMP-DX V2.0
##DATA TYPE= NMR SPECTRUM
##DATA CLASS= NTUPLES
##ORIGIN= BRUKER
##OWNER= Administrator
$$ 1.72 TOPSPIN		Version 2.1
$$ 2013-08-15 20:52:18.063 -0700  Administrator@X
$$ Compression mode = diff/dup
##.OBSERVE FREQUENCY= 400.02188249412
##.OBSERVE NUCLEUS= ^1H
##.ACQUISITION MODE= SIMULTANEOUS (DQD)
##.ACQUISITION SCHEME= undefined
##.AVERAGES= 8
##.DIGITISER RES= 22
##SPECTROMETER/DATA SYSTEM= spect
##.PULSE SEQUENCE= zg30
##.SOLVENT NAME= COFFEE_meoh
##.SHIFT REFERENCE= INTERNAL, COFFEE_meoh, 1, 14.98509
##AUDIT TRAIL= $$ (NUMBER, WHEN, WHO, WHERE, PROCESS, VERSION, WHAT)
$$ ##TITLE= Audit trail, TOPSPIN		Version 2.1
$$ ##JCAMPDX= 5.01
$$ ##ORIGIN= Bruker BioSpin GmbH
$$ ##OWNER= Administrator
$$ $$ E:\/data/COFFEE/nmr/AC1503_INDRS13310_8125488_1tnHXh314G/10/pdata/1/auditp.txt
$$ ##AUDIT TRAIL=  $$ (NUMBER, WHEN, WHO, WHERE, PROCESS, VERSION, WHAT)
(   1,<2013-08-15 20:52:11.110 -0700>,<Administrator>,<X>,<go>,<TOPSPIN 2.1>,
      <created by zg
	started at 2013-08-15 20:51:04.938 -0700,
	POWCHK enabled, PULCHK disabled,
       configuration hash MD5:
       C8 4E 4E 5D D3 5C D8 9E 9F 52 82 E0 59 8A DE 15
       data hash MD5: 64K
       F8 31 25 2E 4B 60 B2 DE C4 49 BD DB 8C F7 FB 4C>)
(   2,<2013-08-15 20:52:14.204 -0700>,<Administrator>,<X>,<proc1d>,<TOPSPIN 2.1>,
      <Start of raw data processing
       efp LB = 0 FT_mod = 6 PKNL = 1 PHC0 = 0 PHC1 = 0 SI = 32K 
       data hash MD5: 32K
       B4 6D 3F 93 76 C8 A4 25 CB BB DD 00 6E 66 C9 CC>)
(   3,<2013-08-15 20:52:14.594 -0700>,<Administrator>,<X>,<proc1d>,<TOPSPIN 2.1>,
      <pk PHC0 = 98.60779 PHC1 = 0 
       data hash MD5: 32K
       89 1C 25 DD 76 2E 38 8B 68 CF 86 32 85 23 91 AD>)
(   4,<2013-08-15 20:52:14.735 -0700>,<Administrator>,<X>,<proc1d>,<TOPSPIN 2.1>,
      <abs ABSG = 1 
       data hash MD5: 32K
       7C CC D5 F9 7D 0D FB 33 56 7C 84 3A 3C 82 84 86>)
(   5,<2013-08-15 20:52:14.829 -0700>,<Administrator>,<X>,<proc1d>,<TOPSPIN 2.1>,
      <abs ABSG = 2 
       data hash MD5: 32K
       0B 45 C4 67 BB FF 9D 93 19 13 7C 9F 1B 04 95 FE>)
(   6,<2013-08-15 20:52:14.922 -0700>,<Administrator>,<X>,<proc1d>,<TOPSPIN 2.1>,
      <abs ABSG = 3 
       data hash MD5: 32K
       32 C7 C1 12 37 40 68 89 A1 3A 02 C8 E2 DB 3A 9C>)
(   7,<2013-08-15 20:52:14.969 -0700>,<Administrator>,<X>,<proc1d>,<TOPSPIN 2.1>,
      <abs ABSG = 4 
       data hash MD5: 32K
       5A 45 84 02 70 91 E5 A6 F8 5E A6 68 ED DC 6C 36>)
(   8,<2013-08-15 20:52:15.032 -0700>,<Administrator>,<X>,<proc1d>,<TOPSPIN 2.1>,
      <abs ABSG = 5 
       data hash MD5: 32K
       53 F8 04 32 0F BD F2 EC 33 1B 8E EE 8F 4E F1 63>)
$$ ##END=
$$ 
$$ $$ hash MD5
$$ $$ A1 9E 90 24 56 A1 B5 A0 D8 ED F0 05 C8 08 75 7D
##$RELAX= 
##$RELAX= 
##$RELAX= 
##$RELAX= 
##$RELAX= 
##$RELAX= 
##$RELAX= 
$$ Bruker specific parameters
$$ --------------------------
##$DU= <E:\>
##$EXPNO= 10
##$NAME= <AC1503_INDRS13310_8125488_1tnHXh314G>
$$ [...]
150 150 150 150 150 150 150 150
##$TP07= 0
##$TPNAME0= <>
##$TPNAME1= <>
##$TPNAME2= <>
##$TPNAME3= <>
##$TPNAME4= <>
##$TPNAME5= <>
##$TPNAME6= <>
##$TPNAME7= <>
##$TPOAL= (0..7)
0.5 0.5 0.5 0.5 0.5 0.5 0.5 0.5
##$TPOFFS= (0..7)
0 0 0 0 0 0 0 0
##$TUNHIN= 0
##$TUNHOUT= 0
##$TUNXOUT= 0
##$USERA1= <user>
##$USERA2= <user>
##$USERA3= <user>
##$USERA4= <user>
##$USERA5= <user>
##$V9= 5
##$VALIST= <valist>
##$VCLIST= <CCCCCCCCCCCCCCC>
##$VD= 0
##$VDLIST= <DDDDDDDDDDDDDDD>
##$VPLIST= <PPPPPPPPPPPPPPP>
##$VTLIST= <TTTTTTTTTTTTTTT>
##$WBST= 1024
##$WBSW= 4
##$XGAIN= (0..3)
0 0 0 0
##$XL= 0
##$YL= 0
##$YMAX_a= 648306
##$YMIN_a= -552504
##$ZGOPTNS= <>
##$ZL1= 120
##$ZL2= 120
##$ZL3= 120
##$ZL4= 120
##$ABSF1= 14.98509
##$ABSF2= -5.573092
##$ABSG= 5
##$ABSL= 3
##$ALPHA= 0
##$AQORDER= 0
##$ASSFAC= 0
##$ASSFACI= 0
##$ASSFACX= 0
##$ASSWID= 0
##$AUNMP= <proc_prof1d_extract_pilot.lims>
##$AXLEFT= 0
##$AXNAME= <>
##$AXNUC= <1H>
##$AXRIGHT= 0
##$AXTYPE= 0
##$AXUNIT= <>
##$AZFE= 0.1
##$AZFW= 0.1
##$BCFW= 0
##$BC_mod= 0
##$BYTORDP= 0
##$COROFFS= 0
##$CY= 15
##$DATMOD= 1
##$DC= 0
##$DFILT= <>
##$DTYPP= 0
##$F1P= 0
##$F2P= 0
##$FCOR= 0.5
##$FTSIZE= 32768
##$FT_mod= 6
##$GAMMA= 0
##$GB= 0
##$INTBC= 1
##$INTSCL= 1
##$ISEN= 128
##$LB= 0
##$LEV0= 0
##$LPBIN= 0
##$MAXI= 10000
##$MC2= 0
##$MEAN= 0
##$ME_mod= 0
##$MI= 0
##$NCOEF= 0
##$NC_proc= -8
##$NLEV= 6
##$NOISF1= 0
##$NOISF2= 0
##$NSP= 0
##$NTH_PI= 0
##$NZP= 0
##$OFFSET= 14.98509
##$PC= 1
##$PHC0= 98.60779
##$PHC1= 0
##$PH_mod= 1
##$PKNL= yes
##$PPARMOD= 0
##$PPDIAG= 0
##$PPIPTYP= 0
##$PPMPNUM= 2147483647
##$PPRESOL= 1
##$PSCAL= 4
##$PSIGN= 0
##$PYNMP= <proc.py>
##$REVERSE= no
##$SF= 400.02
##$SI= 32768
##$SIGF1= 0
##$SIGF2= 0
##$SINO= 400
##$SIOLD= 32768
##$SPECTYP= <>
##$SREGLST= <1H.CDCl3>
##$SSB= 0
##$STSI= 32768
##$STSR= 0
##$SW_p= 8223.68421052631
##$SYMM= 0
##$S_DEV= 0
##$TDeff= 65536
##$TDoff= 0
##$TI= <>
##$TILT= no
##$TM1= 0
##$TM2= 0
##$TOPLEV= 0
##$USERP1= <user>
##$USERP2= <user>
##$USERP3= <user>
##$USERP4= <user>
##$USERP5= <user>
##$WDW= 1
##$XDIM= 32768
##$YMAX_p= 454609621
##$YMIN_p= -781210
##$CURPLOT= <Network HP LaserJet P1505>
##$CURPRIN= <$Network HP LaserJet P1505>
##$DFORMAT= <normdp>
##$LAYOUT= <+/1D_H.xwp>
##$LFORMAT= <normlp>
##$PFORMAT= <normpl>
##$SURQMSG= 1
$$ End of Bruker specific parameters
$$ ---------------------------------
##NTUPLES= NMR SPECTRUM
##VAR_NAME=  FREQUENCY,     SPECTRUM/REAL,   SPECTRUM/IMAG
##SYMBOL=    X,             R,               I
##VAR_TYPE=  INDEPENDENT,   DEPENDENT,       DEPENDENT
##VAR_FORM=  AFFN,          ASDF,            ASDF
##VAR_DIM=   32768,         32768,           32768
##UNITS=     HZ,            ARBITRARY UNITS, ARBITRARY UNITS
##FACTOR=    0.250966925370066, 1,           1
##FIRST=     8223.43324360094, -245238,      -36595
##LAST=      0,             10800,           -301203
##MIN=       0,             -781210,         0
##MAX=       8223.43324360094, 454609621,    0
$$ Real data points
##PAGE= N=1
##DATA TABLE= (X++(R..R)), XYDATA
$$ [...]
19569C64027d09621a33501p3673a02156j7017D2625M9081b30377Q3584k96946
19559d43739h4166j27514e9909k2779A49234k1102a22689r56M069k11451J38005
19548a93022q7496B7429a59399A5961b54417g8355F9571J55616C3209a99320h57
19536D158a52674A10393D0211a93767B4802Q3362J06702e9774i643A85307k2069
19525A63238n4406e5160b1324b130B98309b2765k80171J06263l8971E0797c15871
19513a2824j19749p1530D2285b99135f5195j89962L7391h438k80647f1678C33888
19501A10866A1359c2745j50169p4827B44263a33415p035a4216m9241J1900l20588
19490c72145a59217j27938B92897A3943N2400i0092k5654j74358H9445h6182B77504
$$ y = [364027, -409621, -133501, -207174, -102156, -119173, 42625, 91706, -230377, -146793, -443739, -84166, -211680, -59909, -82688, 149234, 128132, -122689, -123645, -119576, -331027, -193022, -280518, 27429, -159399, 15961, -254417, -78355, 69571, 225187, 33209, -199320, -857, 4158, -152674, 110393, 40211, -193767, 24802, 108164, 214866, -59774, -9643, 185307, 163238, 108832, -55160, -21324, -2130, 298309, -22765, -302936, -196673, -235644, 50797, -315871, -12824, -132573, -204103, 42285, -299135, -65195, -255157, -217766, -8438, -289085, -61678, 333888, 110866, 11359, -32745, -182914, -257741, 244263, -133415, -140450, -14216, -63457, -51557, -372145, -159217, -287155, 292897, 13943, 66343, -90092, -115746, -290104, 89445, -86182, 277504]
19478D1388J82648b04127J6157h6895b4458k66976C44667A8259p963a55615D8899
19466a03201j75658I4962a70378l7245i0138D3775c56101a15811B68505A20533
19455a44614o5649P9278k49796A23320B5181a12624B34304B3283K1124K93534
19445C37941a59971f9935j46067j53502B68791G2249g7142k12623E0337a93165
19434a13580n0128j10669C5116G017a18370n7864B81213j15406a41940j25406
19424b67346O5986D0953A4942J77952m7089m550C3195K8263Q7024a68623P807
19413a60816C03133j50108a72605e1740J043C85451g6569l78485a68300g5369
19402a57220j25425i1529A6450N3731M2190g2575j27278A59416a87875D6500f6819
$$ y = [41388, 224036, -204127, -187970, -86895, -24458, -291434, 344667, 18259, 10296, -155615, 48899, -103201, -278859, 94962, -170378, -207623, -90138, 43775, -356101, -115811, 268505, 120533, -144614, -210263, -130985, -380781, 123320, 25181, -112624, 234304, 23283, 44407, 337941, -159971, -69935, -216002, -369504, 268791, 72249, -77142, -289765, 50337, -193165, -113580, -163708, -274377, 35116, 7017, -118370, -176234, 281213, 165807, -141940, -267346, -201360, 40953, 14942, 192894, 145805, 141255, 33195, 61458, 148482, -168623, -160816, 303133, 153025, -172605, -51740, -50697, 385451, -76569, -455054, -168300, -75369, -157220, -282645, -91529, 16450, 70181, 112371, -72575, -199853, 159416, -187875, 46500, -66819]
19390B09703b37328a6429j03955j09549g3964D9781a91285J1095c1474B14374
19379a79754C3094f9196K7238p4680A80344c9155j79987A5952h8425A72854q4589
19368H8265i6627C02885j50860a31737k1943G6608b09814K6191C6781L01470b34633
19356i3967M1541q290m23000A2965a21732C1967K01230a34233H4930g2420J3522
19345e8898J8290N298j40939f9327k59249B39089A10817a89932j227A7378P9915
19334I7293a16060j88227B1711c7358F9601a59294G9658j6387L6678J42587c18403
19322C52225c3064j52937A01901f6114A38490a26389j45133J6351g111k17712
19312b24823c2887j30067j27807g4674j28499A05136a04095L840b1641l0261l75691
$$ y = [209703, -237328, -16429, -120384, -229933, -73964, 49781, -191285, -180190, -31474, 214374, -179754, 33094, -69196, -41958, -116638, 180344, -39155, -219142, 15952, -88425, 172854, 88265, -96627, 302885, 152025, -131737, -153680, 76608, -209814, -183623, 36781, 338251, -234633, -93967, -52426, -60716, -483716, 12965, -121732, 31967, 233197, -134233, 84930, -72420, -58898, -40608, -35310, -176249, -69327, -328576, 239089, 110817, -189932, -191159, 17378, 97293, -116060, -304287, 21711, -37358, 69601, -159294, 79658, 63271, 99949, 242536, -318403, 352225, -33064, -186001, 101901, -66114, 138490, -126389, -271522, -255171, -7111, -224823, -32887, -162954, -290761, -74674, -203173, 105136, -104095, -100255, -21641, -51902, -427593]
19301d27593d7235q4296l5544B1875a26286a9131k38047D7647d6040j06443j98840
19290c51323B89334H3885J23469h2902j18858A3743f0638a0156j03622A81550
19279B32323p7980a14165G5762b510G3465B4960e1046p3161j07836A19154P0571
19268A89725a70202a4277A05385p27L2267b8147B80982b6553C4722a73355c807
19256b95412g8847c178k80648B1318J2442b85677i2991j59853R6552B83562e7031
19244a3826A42114b26512a8159j4584E3285J23576i2141B39523b68422j2451e1701
19232i329k6534k34572A22197f1692k46255a6629A21467a06709j07150J01619
19222a12240N5115A9162i3455C42963b78772h5260A59381a07996c4768l7239F4667
$$ y = [-427593, -47235, -131531, -167075, 21875, -126286, -19131, -257178, 47647, -46040, -152483, -351323, 289334, 83885, 207354, -82902, -201760, 13743, -60638, -10156, -113778, 181550, 232323, 154343, -114165, 75762, -2510, 73465, 24960, -51046, -124207, -232043, 119154, 189725, -170202, -14277, 105385, 104658, 136925, -28147, 280982, -26553, 34722, -173355, -3807, -295412, -78847, -3178, -283826, 21318, 33760, -285677, -92991, -252844, -156292, 283562, -57031, -13826, 142114, -226512, -18159, -32743, 53285, 176861, -92141, 239523, -268422, -280873, -51701, -9329, -35863, -270435, 122197, -61692, -307947, -16629, 121467, -106709, -213859, -112240, -57125, 19162, -93455, 342963, -278772, -85260, 159381, -107996, -34768, -72007, 64667]
19210a10377L683j31444c3236A66985k4392n5600i0600A83757h2521B63910I8015
19198A27766a92044K2298G4673a51627O7318G5303a51993A6342J9932c23494F3457
19186I3618d5579A0258J55440g8729b0939l99340a38972r3d3773j53001o0959
19175b57733f1495l0427o3732D897J7586a92696J9745C7631a57903A64040E8223
19163A67913a32095K3671B059b30174Q2700f1297r7306g4768k95206E4230g2535
19151A2362J34935k3708a88170H0731b2824m6879A6046L43810b802A14592c76598
19139b2075j4295A72719d500j45892K1494o2443i0264C30395b40110A5671b23802
19127a66279a6620G9281F342N1331f5043B15310p3528a69177B5349b42597g3705
$$ y = [-110377, -106694, -238138, -33236, 166985, 142593, 86993, -90600, 183757, -82521, 263910, 98015, 127766, -192044, -169746, 74673, -151627, -84309, 75303, -151993, 16342, 36274, -323494, 63457, 93618, -45579, 10258, 165698, -78729, -20939, -420279, -138972, -139065, -43773, -196774, -257733, -61495, -91922, -155654, 4897, 22483, -192696, -172951, 37631, -157903, 164040, 58223, 167913, -132095, -108424, 2059, -230174, -147474, -61297, -158603, -74768, -369974, 54230, -72535, 12362, 147297, 123589, -188170, 80731, -22824, -69703, 16046, 359856, -2802, 114592, -376598, -22075, -36370, 172719, -4500, -150392, -128898, -191341, -90264, 330395, -240110, 15671, -223802, -166279, -16620, 79281, 6342, 57673, -65043, 215310, 141782, -169177, 25349, -242597, -73705]
19115A79529L01920E9915a60063A47227f116A59416g1308J5191r4881q1716A62394
19103h3034j40806A7272d47283b5451j82047P5003B58352b63179b759r9924i025
19091i3338l3350A14159n4499K2185a42382B4572O0408A1510d8879D650a59480
19079I094d1294k68177i8245p4233m3602A59201o9954a13315D08209b9624J539
19068b8085m74886J55887J34719D1155c8013j09796A92634a20481d121m6601l4815
19057h5537J4902B7222L7690b3461H8760a92350B89959d7425A88731q2564a30316
19045g9992C67621b93021A2218f1715k15911C0994c02770D4553P0508b43664H0019
19033b58671b5649A86342a73014j61608r2021a14061A20842D3187a01168j0768
$$ y = [179529, 481449, 59915, -160063, 147227, -6116, 159416, -71308, -56117, -150998, -232714, 162394, -83034, -223840, 17272, -447283, -25451, -207498, -132495, 258352, -263179, -2759, -102683, -9025, -93338, -126688, 114159, 59660, 81845, -142382, 24572, 84980, 11510, -48879, 4650, -159480, 9094, -41294, -309471, -98245, -172478, -216080, 159201, 89247, -113315, 408209, -29624, -28085, -502971, -347084, -212365, 41155, -38013, -147809, 192634, -120481, -4121, -50722, -85537, -70635, 27222, 64912, -23461, 88760, -192350, 289959, -47425, 188731, 106167, -130316, -79992, 367621, -293021, 12218, -61715, -277626, 30994, -302770, 44553, 115061, -243664, 80019, -258671, -25649, 186342, -173014, -334622, -426643, -114061, 120842, 43187, -101168, -111936]
19023a11936J5090A6943K4960a39073A12765K41068b81220K623a02295A4978K89050
19012C04028b79910F3884B1495J06293a43660p473A62468j5481a53409e6789H1762
19000d8234A10996H341a75519G4153Q7257f5045o3993j93603E528i2588j81231
18989b73819M5013H6841a915A33790b358q2414G6840a13933N1124p3239l43N26
18977a35865A28316l0581b5544A31345a98108C29578G1224a62495B4255K35131
18967B59386E2027J01499c6158k89380L7258A53029f45636a18991C0695J40080
18957A70775a5532k33172n797B49341b44980I2642a62138A20270h7818n6558F0586
18945A07739a52354J8001a8095A33655F5770d6423m5335D2780a74637l48451A62898
$$ y = [-111936, -96846, 16943, 41903, -139073, 112765, 353833, -281220, -278597, -102295, 14978, 304028, -279910, 63884, 21495, 127788, -143660, -151133, 162468, 146987, -153409, -56789, 81762, -48234, 110996, 8341, -175519, 74153, 161410, -65045, -129038, -322641, 5528, -92588, -273819, -228806, 86841, -1915, 133790, -2358, -84772, 76840, -113933, -62809, -136048, -136391, -135865, 128316, 97735, -25544, 131345, -198108, 329578, 71224, -162495, 24255, 259386, 52027, 153526, -36158, -325538, -288280, 153029, -645636, -118991, 30695, 170775, -15532, -248704, -254501, 249341, -244980, 92642, -162138, 120270, -87818, -144376, 60586, 107739, -152354, -134353, -18095, 133655, 65770, -46423, -91758, 42780, -174637, -523088, 162898]
18933A81661L5492l5673d0791B07601b47628A3082b69154a10218q5142j1718A42422
18921f5064k0891e48F4239a51738a3530n5121B5280a62351b3856j86170j1919
18910b21945a3930E4762b53982i7706j34790g4763I1807Q8637b19727R2827A18499
18898b26698A5932f5497j51991d2651G2403a2256j20043G7195a72008g3911K5315
18887d8596J8758c485m7944k50155N7910a17779j10214g7101K8218E0025J1126
18876F1151a98685G7241A8779b11421f8710H9197D921L04953b49553d9926j77378
18865b27304Q0312E9524b29896O5104c1363k1042j94296I7987a96012A65287e5288
18853c39880l7451a15539C28093d1342B07745b37381B02977a28682G750i8583
$$ y = [181661, 217153, 181480, -40791, 207601, -247628, 13082, -269154, -110218, -195360, -207078, 142422, -65064, -85955, -548, 64239, -151738, -13530, -68651, 25280, -162351, -23856, -210026, -221945, -13930, 54762, -253982, -97706, -232496, -74763, 91807, 180444, -219727, -126900, 118499, -226698, 15932, -65497, -217488, -42651, 72403, -12256, -132299, 77195, -172008, -73911, -48596, -29838, -3485, -51429, -301584, -243674, -117779, -227993, -77101, -48883, 50025, 61151, -198685, 77241, 18779, -211421, -68710, 89197, 4921, 309874, -249553, -49926, -227304, -146992, 59524, -229896, -164792, -31363, -52405, -246701, 97987, -196012, 165287, -55288, -339880, -377331, -115539, 328093, -41342, 207745, -237381, 202977, -128682, 7750, -98583]
18842b936D22736H9671H553J62769a81847L3680j94853B63115i8097F3657k8676
18831C4981J06589c00939O5726m5956a35371j56741A0232K71582j16454a97140
18820h9249b83j91518H2725e2863r969r5841a9112A59266f9747A04652a69540
18808G8522g7800o2891n5250M9745g2988A56711E0230a21604I5032e2789B8680
18796H6454b52745D5556J87769H2085g6668A16694h9509D21717d16577B98349
18785i4600I0827h7365C09720b69090B54617b32582A28370l4148G421J20128c23664
18773i1033k27932Q1383r487B23057f5080A77442b47014Q9752A28713a57850H7294
18761b18562B8104a39603B71662c65038a19689o292l8895e2320A04907k3689c8036
$$ y = [-2936, 422736, 89671, 8553, 171322, -181847, -148167, -343020, 263115, -98097, 63657, 34981, 141570, -300939, -235213, -281169, -135371, -292112, 10232, 281814, 165360, -197140, -89249, -283, -191801, 82725, -52863, -62832, -158673, -19112, 159266, -69747, 104652, -169540, 78522, -77800, -140691, -195941, -146196, -72988, 156711, 50230, -121604, 95032, -52789, 28680, 86454, -252745, 45556, 233325, 82085, -76668, 116694, -89509, 421717, -416577, 298349, -94600, 90827, -87365, 309720, -269090, 254617, -232582, 128370, 94222, 7421, 127549, -323664, -91033, -318965, -237582, -247069, 223057, -65080, 177442, -247014, -157262, 128713, -157850, 87294, -218562, 28104, -139603, 271662, -365038, -119689, -125981, -164876, -52320, 104907, 81218, -38036]
18749b59483J13778L9451A26c29319e6383K4924j25754A1429J00621c08647N7534
18738b51113J00283j43791f6184q0813A40820h1582m8633A79117B4946a0420G1066
18726b16716K2820c3383A84326c62387Q2355g0693o3110p4593n47I2145b86678
18714A99143b1950l70735e9283G8263b59894a29406j84295A43276c642q3983I9716
18702A7110a47118e2116B74254b8168j19466D8616K24481i1512a3008A77746H5335
18690B3814a57018B17746G4881c9551m0890j63219k46889C6343a37790A92035
18679B98978f1544E6401c71913g1663k67447N4459o5828J68976k4757A3331J33740
18668A47071a11481J0799A85159b77024D1656b18825b5441j08923O5192I564J48808
$$ y = [-259483, -145705, -106254, 126, -329319, -56383, -31459, -157213, 11429, 112050, -308647, -251113, -150830, -294621, -66184, -146997, 140820, -81582, -130215, 179117, 24946, -10420, 71066, -216716, -193896, -33383, 184326, -362387, -280032, -70693, -133803, -208396, -208943, 92145, -286678, 199143, -21950, -392685, -59283, 78263, -259894, -129406, -313701, 143276, -3642, -87625, 99716, 17110, -147118, -52116, 274254, -28168, -147634, 48616, 273097, -91512, -13008, 177746, 85335, 23814, -157018, 217746, 74881, -39551, -80441, -243660, -490549, 36343, -137790, 192035, 298978, -61544, 56401, -371913, -71663, -339110, -284651, -350479, -181503, -206260, 13331, 147071, -111481, -100682, 185159, -277024, 41656, -218825, -25441, -134364, -69172, 9564, 158372]
18657A58372h4690j87067B51924c05294A79428M7262r3134b40093F3532a8222
18646f1880A57172b4427j77990b3288j73167G0432a99813B9462c21554j12018
18636d33572C9867d45235I7891a3300j4721p0911E2575j6966b33901a8605p574
18625b6179A52429a95173b9486B17957d16696J58918h482j23703g108m2873E8749
18613D3631b08709A11402b01886o5788h5106a7749R10j21742J1318I0242m4795
18602D5447a04745M8282A32245b07433O7968o5655k5339a03409I3211h1182q3507
18591a64689D6737b59308i897A5270c88545J81995j22576f4512C119K0823a01590
18579a56554N7897j9570j67894b7645B9823b25931B59617k701e74915p6449c3404
$$ y = [158372, -84690, -271757, 251924, -305294, 179428, 226690, 133556, -240093, 63532, -18222, -61880, 157172, -24427, -202417, -23288, -196455, 70432, -199813, 29462, -321554, -433572, 39867, -445235, 97891, -13300, -28021, -98932, 52575, 35609, -233901, -18605, -26179, 152429, -195173, -29486, 217957, -416696, -257778, -8482, -132185, -7108, -49981, 58749, 43631, -208709, 111402, -201886, -267674, -85106, -17749, -16839, -138581, -127263, 90242, 45447, -104745, -56463, 132245, -207433, -139465, -205120, -230459, -103409, 93211, -81182, -164689, 46737, -259308, -9897, 15270, -388545, -206550, -329126, -64512, 3119, 23942, -101590, -156554, -98657, -118227, -286121, -27645, 29823, -225931, 259617, 256916, -574915, -651364, -33404]
18567C44481e9824k14222i8129j02441I9974b82068E7651b5202A7804a37096l0694
18556a67790P6662M1388G9994c12343E7311A8714J18055m6192h5234o7034L5268
18545a17000A55275a88032h8156o8269B71017C6453f1348K726o9215k2342K9548
18534a20631H7393C2389O8520i1190B4714B414J37474b90384j17379A5363J9979
18523C5342M1329B9150b7191j46044d0930l56281d9064n3911r224c0132k08996
18512b39128j17423b5463k15448h6641A06242d51029a07964b9970A28739m9532
18502G9207a47199d118C36913B7783a22730A40452l2456M18080e60892i8582m2319
18491a40901f6151k13872a35099L6883j60291P9671Q0687k67676A41995f5136
$$ y = [344481, -59824, -274046, -98129, -200570, 99974, -282068, 57651, -25202, 17804, -137096, -167790, -91128, -49740, 79994, -312343, 57311, 18714, 136769, 90577, -85234, -152268, -117000, 155275, -188032, -88156, -156425, 271017, 36453, -61348, -58622, -127837, -150179, -120631, 87393, 32389, 100909, -91190, 24714, 2414, 139888, -290384, -407763, 15363, 35342, 76671, 29150, -27191, -173235, -40930, -397211, -49064, -102975, -112199, -30132, -239128, -356551, -25463, -240911, -86641, 106242, -451029, -107964, -29970, 128739, 79207, -147199, -4118, 336913, 27783, -122730, 140452, 107996, 526076, -560892, -98582, -140901, -66151, -280023, -135099, -98216, -258507, -178836, -98149, -365825, 141995, -65136]
18480A50633a0602j84870j40341g9817h598k6707j4129j64116n4946D3934d0333
18468b15836A24005a86366d5237G9710L7859b11465r4400D6354b27628q2617G0106
18456B71531O1852b8712m1294L0634k30059J06676N478E7418a60562A08740c5872
18444i6851c4000H2016g1505F9420c2887p7336F2674h8073j7957K1887A38225
18432a93385B637J85425j204C0082K30461e9240A00508J29136K3680R3926b16891
18420e7296p1262b9335q3529B11133d19534f3206E7406L4534m3063J05722J39600
18409B94199A317a36004F0339b5701B57292j25749f4048C7217M1291i2738d991
18397B02607a48091C0441c12174E7934M0031c26511J02252H1432b70911Q2498
$$ y = [150633, -10602, -195472, -335813, -79817, -8598, -35305, -49434, -213550, -268496, 43934, -40333, -215836, 124005, -186366, -45237, 79710, 117569, -211465, -305865, 46354, -227628, -310245, 70106, 271531, 333383, -28712, -70006, -39372, -269431, -162755, -157277, 57418, -160562, 108740, -35872, -96851, -34000, 82016, -71505, 69420, -32887, -110223, 62674, -88073, -106030, -84143, 138225, -193385, 2637, 188062, 186858, 30082, 260543, -59240, 100508, 229644, 253324, 347250, -216891, -57296, -128558, -29335, -112864, 211133, -419534, -63206, 57406, 91940, 48877, 154599, 294199, 1317, -136004, 60339, -25701, 257292, 131543, -64048, 37217, 78508, -92738, -4991, 202607, -148091, 30441, -312174, 57934, 97965, -326511, -224259, 81432, -270911, -188413]
18387a88413f3650B93029j0031a74770F4557M91580e6955j02723k37254n5858
18377d52790a32398p9565n1227a17475G0952a17510r004A28659n8369K0260C9543
18365a25607m7637b276F7736N0144i9827R180j50062d3483j15774A7416R7066
18354A14482a31684C0074a75069l8984I0582L052a17343j9040B06121e7033q3088
18343a40121o1561a9520B35426C6101b07823J02774L7296F1158f1674A17404i8192
18331A39260A1139c9483j0187a2687D5746e4166l3230o9644L0595B5885b4081
18319a45790K3566b5335O698l34263C8454K17975d6710m7859D4954g1667B3942
18307e3454K4776j32122A03874n1149a56052O8904b1670o8956k19428d2765J9200
$$ y = [-188413, -63650, 293029, 282998, -174770, 64557, 556137, -56955, -159678, -396932, -452790, -132398, -211963, -263190, -117475, 70952, -117510, -126514, 128659, 70290, 90550, 39543, -125607, -173244, -2276, 67736, 117880, -99827, -90647, -240709, -43483, -159257, 17416, 114482, -131684, 30074, -175069, -214053, 90582, 93634, -117343, -136383, 206121, -57033, -140121, -201682, -19520, 235426, 36101, -207823, -105049, -67753, 61158, -61674, 117404, -98192, 139260, 11139, -39483, -49670, -12687, 45746, -54166, -87396, -157040, -126445, 25885, -24081, -145790, -122224, -25335, -18637, -352900, 38454, 256429, -46710, -94569, 44954, -71667, 23942, -53454, -28678, -160800, 103874, 52725, -156052, -87148, -21670, -90626, -310054, -42765, -23565]
18296b3565A49061c56298a133q7207k6116A67240a95029E0700A8015N0327a35393
18284A7073a72672l9533K0288D2347a72975f2645p7584A6276a1081m3511k3430
18273g8022B86523E4328g6489n7221c1236j87991g5434l72491E0997a0564M18
18262a0146l29503A33755f6431D1881a10926L9483A6676N76078e8690C703b0301
18250c3872B90644a43974o2815A82069a06279j67646L1511a6285c074n2569D3766
18238e5728B27867G8736l8492c0244j22674o3986A5881J4613g9590L9529B3830
18226A79665d067B6011a7567j43322c43k13055G6415J95429b12092j25405d8804
18214b75766k18574L774b31896L8928A59706a52685e109j03173b5310G8303A3181
$$ y = [-23565, 149061, -356298, -1133, -88340, -114456, 167240, -195029, 50700, 18015, 68342, -135393, 17073, -172672, -212205, -191917, 42347, -172975, -62645, -140229, 16276, -11081, -54592, -78022, 286523, 54328, -76489, -133710, -31236, -219227, -75434, -447925, 50997, -10564, -10146, -339649, 133755, -66431, 41881, -110926, -71443, 16676, 592754, -58690, 3703, -20301, -33872, 290644, -143974, -206789, 182069, -106279, -273925, -242414, -16285, -3074, -55643, 43766, -55728, 227867, 78736, 40244, -30244, -152918, -216904, 15881, 30494, -79590, -40061, 23830, 179665, -4067, 26011, -17567, -160889, -343, -213398, 76415, 271844, -212092, -337497, -48804, -275766, -494340, -490566, -231896, -192968, 159706, -152685, -5109, -108282, -25310, 78303, 13181]
18202c29542b8217D2456J70658d8960B05440b37574J03591p2134N7474j62790
18192c11433d9798j28363g2948j87611J14530r2248a277m1799o9872B91058f3260
18180d1458C8350M43302e6770G9646b7853m5192c5090A92322M6271D9195h4944
18168b77770A21859E0086L8025a33663B72842R9001G6676h911A13067l9037l0113
18157D3917d77154b27935F8634Q5950c46106A31954b57389a04328B09290G3299
18146A1229J65062F5021f7262L0189k65208l5477I0418c21443C1952b34669f4673
18134b83527L4246C75621a17735A375b42893B06549B4545b07883d2489B86348
18123a8230r7B46976I588b91606h716E1193d93785B26613P6477a30954A24643
$$ y = [-329542, -28217, 42456, 213114, -48960, 205440, -237574, -133983, -206117, -148643, -311433, -49798, -178161, -72948, -260559, -146029, -238277, -1277, -43076, -112948, 291058, -63260, -41458, 38350, 481652, -56770, 79646, -27853, -73045, -35090, 192322, 238593, 49195, -84944, -277770, 121859, 50086, 88111, -133663, 272842, 371843, 76676, -8911, 113067, 74030, 43917, -477154, -227935, 68634, 154584, -346106, 131954, -257389, -104328, 209290, 73299, 11229, 176291, 65021, -67262, -37073, -302281, -337758, 90418, -321443, 31952, -234669, -64673, -283527, -249281, 375621, -117735, 1375, -242893, 206549, 24545, -207883, -42489, 286348, -18230, -18327, 246976, 9588, -291606, -8716, 51193, -493785, 226613, 303090, -130954, 124643]
18111b78465J5557F7353c37989B36491q927a60205j47311P0649H9610a31673C22597
18099f6618l3187A6673b42757e5839a2026A45524Q1949o7637R367a01645B18661
18087a02387C2810J47245a57446A88585d5850k75970a49369l768j51109b628A18923
18075a32305e5889B43881g1797a6714j46086G8067N3986e7108E7224J3339a1496
18063f6151j87142A27130a69116I866L4797J29079b83886e5922f321l67616a80185
18051A49017a16955B58082n3642a83593H1226Q8269a76264d9032j04342B74631
18040b123k83342E446a88819F6184b07633g030F0964a5933B1911h5250A03869
18028B841i788j3961A31355a57853A63874g1510r3019I8627a42013B70833F1859
$$ y = [-278465, -262908, 67353, -337989, 236491, 227564, -160205, -307516, -236867, 89610, -131673, 322597, -66618, -99805, 16673, -242757, -55839, -12026, 145524, 227473, 159836, 169203, -101645, 218661, -102387, 32810, 180055, -157446, 188585, -45850, -321820, -149369, -153137, -304246, -2628, 118923, -132305, -55889, 243881, -71797, -16714, -162800, 78067, 132053, -57108, 57224, 70563, -11496, -66151, -253293, 127130, -169116, 9866, 44663, 173742, -283886, -55922, -6321, -373937, -180185, 149017, -116955, 258082, 204440, -183593, 81226, 169495, -176264, -49032, -153374, 274631, -2123, -285465, 5446, -188819, 66184, -207633, -7030, 60964, -15933, 21911, -85250, 103869, 2841, -9788, -23749, 131355, -157853, 163874, -71510, -164529, 98627, -142013, 270833, 61859]
18016c9986A36513e5218A26474F1391J02225R2128k6688A8231M6664P2608a11573
18004h7847A66267a22637c1979m91326h8793q4574M4098B0567b295A83665l7144
17993A46521A7790L8754b25646a4006B8782f4880j43947g5567A59601e0490A40606
17981d4099j29186l07559a38882B23860r797C2094j395a77359B15534b63563J8641
17970b44922B37692o8182C3573d07079B11825n1583h270A76437D9097N5001B91
17958c02065I5454i1445A21328D0236d7355D6470Q2529d1022j92947A11861b8283
17946a0971l95077a55617B48413B5963R024c3920n9813n9674N5625b2470G5589
17934H3450c6174B8872a55429q8242N2586f9134j86941h8321m8844k71769B49708
$$ y = [-39986, 136513, -55218, 126474, 61391, 163616, 255744, 229056, 18231, 64895, 137503, -111573, -87847, 166267, -122637, -31979, -523305, -88793, -173367, -129269, 20567, -2295, 183665, 146521, 17790, 56544, -225646, -14006, 28782, -64880, -208827, -75567, 159601, -50490, 140606, -44099, -173285, -480844, -138882, 223860, 214063, 32094, 30699, -177359, 215534, -263563, -244922, 237692, 169510, 33573, -407079, 211825, 160242, -8270, 176437, 49097, 104098, 291, -302065, 95454, -91445, 121328, 40236, -47355, 46470, 128999, -41022, -233969, 111861, -28283, -10971, -406048, -155617, 248413, 25963, 34987, -33920, -93733, -153407, -97782, -22470, 75589, 83450, -36174, 28872, -155429, -243671, -191085, -69134, -256075, -88321, -137165, -408934, 249708]
17922d4509r4356m5277B39967k1115a45599C8979Q3978C7930b85044g9524p3951
17911a53475k12090a21628I3717h3629A06384J33626A11353k1601a01646j04143
17901b05789b2481A68000a97925e6873k71952D4701a67466H3414d6072A1819e5233
17889H4447C2635K20913e7408B9672L35961a3724A57298b81872e3102n6273D8523
17877C4983M9859N2880g3614a6094G8876K15644d2877D122K54933A07388f7713
17865a58093A45764E738a00274A50151o4181l2920K0530L3917L7884a1584A82104
17853e7950A76889b96872g4296j02865p1503R5432J1228b4516k6338k35459F7194
17841A76629a72014d2938j20632A01508Q7982G0084b3652k45061B32150a93169
$$ y = [-44509, -138865, -184142, 239967, 218852, -145599, 38979, 122957, 37930, -285044, -79524, -153475, -365565, -121628, 93717, -83629, 106384, 240010, 111353, 89752, -101646, -205789, -22481, 168000, -197925, -56873, -328825, 44701, -167466, 83414, -46072, 11819, -55233, 84447, 32635, 253548, -57408, 29672, 365633, -13724, 157298, -281872, -53102, -109375, 48523, 34983, 84842, 137722, -73614, -16094, 78876, 294520, -42877, 4122, 259055, 107388, -67713, -158093, 145764, 5738, -100274, 150151, 85970, 53050, 73580, 107497, 145381, -11584, 182104, -57950, 176889, -296872, -74296, -177161, -248664, -153232, -142004, -24516, -50854, -286313, 67194, 176629, -172014, -42938, -163570, 101508, 189490, 70084, -23652, -268713, 232150, -193169]
17830d689D1652J27575E3343P5376i5620k8487H3977N354a6676E2168b63667e8929
17817A30059N0405h5023J6855j45297G1832J028J20754c52731C2066i3258A16537
17805B8736d61446e5121E2645b16324R3725A29514i11I6415a64836D2535a91601
17793c09044c1616I514b55301A04663L8612a81622K7360O1220m5004N7196L6669
17782d4181j75750A8270J18346C9457h8436d0934k9362J0325B13045a31780A36886
17770A84144G3248b00291B90425a63733C15641A9219M0706Q6611a57108B6064
17759A40271j6516o1315N9934c11406A9216b4467A95364b2310k44538D5721q708
17748C7013b1725j8101Q606F208M0206b85574g7020p6975j18994J21857J6626
$$ y = [-4689, 41652, 169227, 53343, 128719, -95620, -124107, 83977, 89331, -16676, 52168, -263667, -58929, 130059, 180464, -85023, -68168, -213465, 71832, 72860, 193614, -352731, 32066, -93258, 116537, 28736, -461446, -55121, 52645, -216324, -122599, 129514, -911, 96415, -164836, 42535, -191601, -309044, -31616, 9514, -255301, 104663, 143275, -181622, -154262, -93042, -138046, -80850, -44181, -219931, 18270, 136616, 39457, -88436, -40934, -70296, -59971, 213045, -131780, 136886, 184144, 73248, -200291, 290425, -163733, 315641, 19219, 59925, 146536, -157108, 26064, 140271, 123755, 62440, 122374, -311406, 19216, -24467, 195364, -22310, -266848, 45721, 37013, -21725, -39826, -31220, 6208, 46414, -285574, -77020, -153995, -272989, -151132, -134506]
17737a34506B98665a25708K9178Q474C4836f3876J5697A05400J3036D953c32767
17725I0122J1502d6025B13460j06052b35349a09216d1181k74431J57629M1136
17715a16847e421G9194R8824o6978n2441N9729a1507l880A86756E3931a40140
17703E7456c02111g6105B42610H4020J73396a8660j07712f1615a6042A7404f2183
17691b18989a01075b3443B13138C8676b68665K8604B37489a22093e7037r8060
17681a55097a3353k15521d6359A90770k9853J05071a50938d9372k03118C42932
17670E4650b3732B394J96155j2530H8665a84769B16022a65310j49804h231k05798
17659b14029P0975m745E5659a45420j26858H2141M7279h1918G3081e2429A70997
$$ y = [-134506, 298665, -125708, -96530, -88056, 34836, -63876, -48179, 105400, 118436, 4953, -332767, 90122, 101624, -46025, 213460, 107408, -235349, -109216, -41181, -315612, -157983, -116847, -5421, 79194, 178018, 111040, 58599, 118328, -11507, -15387, 186756, 53931, -140140, 57456, -302111, -76105, 242610, 84020, 257416, -18660, -126372, -61615, -16042, 17404, -62183, -218989, -101075, -23443, 213138, 38676, -268665, -240061, 237489, -122093, -57037, -155097, -13353, -228874, -46359, 190770, 160917, 265988, -150938, -49372, -252490, 342932, 54650, -23732, 2394, 198549, 186019, 88665, -184769, 216022, -165310, -315114, -8231, -214029, -143054, -147799, 55659, -145420, -272278, 82141, 129420, -81918, 73081, -52429, 170997]
17647a85861b7652A95252q9881a07654I1807a05102B91156A9186J79355G6829
17636B91329c4220l4941I1609E215K15192N2393h4287k70979B58503d9283B73876
17624A9557i094j2915j12971g485B3934M6540e3974j21317Q2079q7629b1345B20922
17611F4560f7294B12178E8307a71439B8048b86261B3349f1324A67753l3622a47012
17599A19484b45944H2337e8724q5024A31794J26128K7344A02836i9000C5188a60060
17587b48989c4590L862A7944J45603d7932C3416a02951E66076i5105I6881C2135
17575g4102A25841g0570I7248J45229o6731B2137K32408f9559C7945O6299E499
17563E6009j8803N13023A57861F0537B1959b95975A88355k0250C6479g0012A29650
$$ y = [-185861, -27652, 195252, 105371, -107654, 91807, -105102, 291156, 19186, 198541, 76829, 291329, -34220, -69161, 91609, 5215, 220407, 272800, -84287, -355266, 258503, -49283, 273876, 19557, -9094, -22009, -134980, -7485, 23934, 70474, -53974, -175291, -93212, -180841, -21345, 220922, 64560, -67294, 212178, 58307, -171439, 28048, -286261, 23349, -61324, 167753, 134131, -147012, 119484, -245944, 82337, -58724, -143748, 131794, 257922, 285266, 102836, -99000, 35188, -160060, -248989, -34590, -30728, 17944, 163547, -47932, 33416, -102951, 566076, -95105, 96881, 32135, -74102, 125841, -70570, 97248, 242477, 175746, 22137, 254545, -69559, 37945, 104244, 5499, 56009, 37206, 550229, 157861, 60537, 21959, -295975, 188355, 168105, 36479, -70012, 129650]
17551b6750k60773F5171a73892q0696I4526J30458J4098i520D5519g0569k8363
17540i8932B16792b0319m7262H9663L4881K12103A01541L7952a26880A04260N5380
17529A59640a26284d1295A33892a23757k51601d6592A21702M23813a44609A05005
17518D8073e8144A26683O5418O8791d5672B59276Q422a4874n6537B50179b31544
17506I6311C0775e2338J8938E2202J61066e5759H7198K25999n3661G9382J16438
17495A95820a01022A33598L19227k16995r6021J23429A23179O1358G0053R6588
17485A66641a27975k6443f5135g708B05859a20146d44j4050C31515p8539a01403
17473B07677c7773B227J99571L0758k315r9117j9957K37213G8907b55931G0327
$$ y = [-26750, -287523, 65171, -173892, -254588, 94526, 224984, 239082, -9520, 45519, -70569, -98932, 216792, -20319, -67581, 89663, 124544, 336647, 101541, 139493, -126880, 104260, 159640, -126284, -41295, 133892, -123757, -375358, -46592, 121702, 545515, -144609, 105005, 48073, -58144, 126683, 192101, 260892, -45672, 259276, 267698, -14874, -71411, 250179, -231544, 96311, 30775, -52338, -33400, 52202, 213268, -55759, 87198, 313197, 259536, 79382, 195820, -101022, 133598, 452825, 235830, 139809, 263238, 123179, 184537, 70053, 166641, -127975, -154418, -65135, -7708, 205859, -120146, -444, -14494, 331515, 252976, -101403, 207677, -37773, 2227, 201798, 232556, 230241, 131124, 111167, 348380, 78907, -255931, 70327]
17461E5399R0544o4099K12306b40A26779L49207b03514C2553b27991A19965J46292
17450B66257j08176P7753Q1501J02760k7126A91751a4385C58449O640A73078k5390
17439A47688C9885J52938J4815D2950J07504Q8211m1992C9470M5648J42510m4083
17428A83545k6108b67025h160A88650q9334J19364r2647J13123a28083N6672A70057
17416B79070o8839c7339H8455K91110A22336K9781J6400b00825C184K56760h3197
17404B00608p9759e2535B92868n0361o165J14992p5438g4040B8064q757O9707
17393H9014J73723n9541A4076M1563J71089j1771J9264p9575m3274b11035a7015
17381D7859f5798B06655e5026E4438a40702I9540P2422P6710F1250P4642K3021
$$ y = [55399, 145943, 81844, 294150, -240, 126779, 475986, -203514, 32553, -227991, 119965, 266257, 158081, 235834, 317335, 420095, 392969, 191751, -14385, 358449, 365089, 173078, 147688, 39885, 192823, 207638, 42950, 150454, 238665, 196673, 39470, 85118, 227628, 183545, 157437, -267025, -8160, 188650, 99316, 218680, 126033, 239156, -128083, -71411, 170057, 279070, 210231, -37339, 88455, 379565, 122336, 152117, 168517, -200825, 3184, 259944, -83197, 200608, 120849, -52535, 292868, 242507, 236342, 351334, 275896, -74040, 28064, 19307, 89014, 262737, 203196, 14076, 55639, 226728, 214957, 234221, 154646, 111372, -211035, -17015, 47859, -65798, 206655, -55026, 54438, -140702, 99540, 171962, 248672, 61250, 135892, 158913]
17370A58913a79544B39648o5298l4016l5904B2383J76367d3850j3904A56759n8316
17359I8443C6847M53255k03000f6051I3268N996a44911d1992H4750c8590l728
17348d2318A9594K2472g2301A76564Q0773a12153C73298a38931A36105j9547a3696
17336D87581F5305K73423b6168A64946J7437k6191i1656A74755C9198K56012d0550
17324B21760p8642F2240K15769k329A23475N5995d3642J2349A28389J93400n1357
17313B70432A28209f4592A20155K19868L0145q9099o3106p0931J32782I2958a91280
17301d7582J9566a3852A67755J33350A47732L32119C3787R4351K15589A13335
17290A10021J90333F4788J95464j8220F0840J73226d5071B25685I4210f359B5013
$$ y = [158913, -179544, 239648, 174350, 140334, 104430, 22383, 198750, -43850, -57754, 156759, 98443, 36847, 490102, 287102, -66051, 93268, 99264, -144911, -41992, 84750, -38590, -42318, 19594, 42066, -72301, 176564, 257337, -112153, 373298, -138931, 136105, 116558, -13696, 487581, 65305, 338728, -26168, 164946, 182383, 156192, -91656, 174755, 39198, 295210, -40550, 221760, 143118, 62240, 278009, 275680, 123475, 179470, -43642, -31293, 128389, 321789, 270432, 128209, -64592, 120155, 340023, 370168, 281069, 217963, 147032, 279814, 92958, -191280, -47582, -28016, -13852, 167755, 301105, 147732, 479851, 33787, 128138, 343727, 113335, 110021, 300354, 64788, 260252, 242032, 60840, 234066, -45071, 225685, 94210, -6359, 25013]
17278B9547n390L0125R4122h0750l00190G1460a41479B00495J45984H7174J35503
17267B22677n6706J36137A13973J91681P1032A56722h8837r7391D21135c0366
17256C35174A30579E9948K49048b1179D98360j95683A39515L59130A26125B5929
17245c4176k74363e0826C00150A14107D0552K41741A40599L7044N7874d6174B37930
17233A16261J43456J0604I713J25945e2013B9902K10886M5506h0515n857B40234
17221B55794o5058J52346a31667A94486K41716a78860C37775A61644n0673J45552
17211B56523L642j4335i9226K8644A32949J64575j3215o4729j6242J32498B6370
17199B85553G3769M6536k776l2018K85686m0465J02615o6648j82163a73086C08393
$$ y = [29547, 24157, 54282, 148404, -80750, -380940, 71460, -141479, 200495, 346479, 87174, 222677, 165971, 302108, 113973, 305654, 376686, 156722, -88837, -186228, 421135, -30366, 335174, 130579, 59948, 308996, -21179, 498360, 302677, 139515, 498645, 126125, 25929, -34176, -308539, -50826, 300150, 114107, 40552, 282293, 140599, 177643, 235517, -46174, 237930, 116261, 259717, 270321, 9713, 135658, -52013, 29902, 240788, 286294, -80515, -86372, 240234, 255794, 190736, 343082, -131667, 194486, 436202, -178860, 337775, 161644, 110971, 256523, 260165, 245830, -99226, -70582, 132949, 297524, 284309, 219580, 203338, 335836, 26370, 285553, 73769, 120305, 117529, 85511, 371197, 330732, 433347, 366699, 184536, -173086, 308393]
17187A2381L51405l3373j00473P4888p3809P980r0652Q9m4759K00785m8569J05801
17175C61694J39568k02208n1967o4999H6758J29050b49310A0249L60869A404d0292
17163B54966k2413L067k1189J25446D8234K7935K21625J91302A54717h2838E2364
17151C13839A34425C0824d9066H1136l9062M75421F2581K21599k0833j02547D8775
17139A4697b463E16681A54362A7558M39649A95957J66163I3661J41278J62180
17129C97119L2396r0586A58944L47868G4145N18035j54280A71508K06377A64902
17118E1174O4128J6257J52187N6662q4143K48954B06634I0312M50309A83220P5450
17107B58670J54754n2214A13659L50088B06458M55016B11215r5625K99358A03289
$$ y = [12381, 363786, 330413, 229940, 304828, 231019, 238999, 148347, 148436, 103677, 304462, 255893, 361694, 501262, 299054, 247087, 182088, 86758, 215808, -249310, 10249, 371118, 1404, -40292, 254966, 232553, 235620, 214431, 339877, 48234, 76169, 297794, 489096, 154717, -82838, 52364, 313839, 134425, 30824, -49066, 81136, 42074, 517495, 62581, 284180, 263347, 160800, 48775, 14697, -2463, 516681, 154362, 17558, 457207, 195957, 362120, 93661, 234939, 397119, 429515, 338929, 158944, 506812, 74145, 592180, 437900, 171508, 377885, 164902, 51174, 115302, 131559, 283746, 340408, 256265, 505219, 206634, 90312, 540621, 183220, 258670, 413424, 361210, 113659, 463747, 206458, 661474, 211215, 115590, 414948, 103289]
17096A32831J09963E1909M55037r0124j24673j5299K64769o9595A73266J48913
17086C22179H0655L12235j8209A08244J35299K07712O3688B39773J88088A98711
17075B22437N35207j73151A79608J07202K49498A32773B1543L85360K56938j9938
17065F43903k95609O603J309L97917k22007N13K06781k15938l0452j4916Q3761
17054E61865A20682N15937B72872J39662J12671A62208L2947M52900j47769A46602
17043G48524k29336j78807L90581B42844L09920k1164r4271Q1225M4869k29427
17033C33996L55098C11073K42362L6377j716B34205K52640J84865C32774K81656
17023F14430B89259L82498p5404n6055L6051J7585R9698B69191J10810K5723n9945
$$ y = [132831, 242794, 51909, 506946, 416822, 292149, 276850, 541619, 472024, 173266, 322179, 80655, 392890, 374681, 108244, 243543, 451255, 514943, 239773, 427861, 198711, 222437, 757644, 584493, 179608, 286810, 536308, 132773, 21543, 406903, 663841, 643903, 348294, 354897, 356206, 754123, 532116, 532629, 739410, 523472, 493020, 478104, 561865, 120682, 636619, 272872, 412534, 525205, 162208, 195155, 648055, 500286, 146602, 748524, 519188, 340381, 730962, 242844, 552764, 531600, 437329, 518554, 563423, 333996, 689094, 311073, 553435, 589812, 588096, 234205, 486845, 671710, 332774, 614430, 289259, 671757, 596353, 540298, 576349, 593934, 693632, 269191, 380001, 405724, 345779]
17012C45779J10518K49322P0548C33539K52384N989j11365J43295K13269C44646
17001F09972J27617l4513k80813M07755k13739K22311n9948J40388k48241l558
16991F67231j24748J9306J36273j07639L01031k47800o2253K33349j02234q8394
16981F24122J92132l2695N6820L7279l56416K62254m6101j33652K62105m9875
16971H15973J54155k85355K81011k797o7890k07809O9250k994N5205O9141j33896
16960G43994K95084j37230J3124K551K0223j8707L4369k56446K59075J12683m56430
16949F12290O73186j86981r8365l9258n7484K76318k77271L96231m82631L88496
16939A204531n9995l49217J21340K12164R6472k3365K80132k94102O2850j80352
$$ y = [345779, 456297, 705619, 776167, 333539, 585923, 591912, 480547, 623842, 837111, 344646, 609972, 737589, 703076, 422263, 830018, 616279, 838590, 778642, 919030, 670789, 667231, 542483, 561789, 698062, 590423, 891454, 643654, 581401, 814750, 712516, 624122, 816254, 783559, 840379, 877658, 521242, 783496, 737395, 603743, 865848, 815973, 970128, 684773, 965784, 962987, 895097, 687288, 756538, 753544, 808749, 877890, 743994, 1039078, 901848, 914972, 917523, 937746, 919039, 953408, 696962, 956037, 1068720, 612290, 1285476, 1098495, 1000130, 960872, 903388, 1179706, 902435, 1298666, 816035, 1204531, 1144536, 795319, 916659, 1128823, 1225295, 1201930, 1482062, 1187960, 1250810, 1070458]
16929A070458j25074L48158j40441L50668p4880j38539n13699M22593J0604j42689
16919A067159K24507K29168k61745J02993J05640k12239p1483K31280k83227L19513
16909A451566P1994L4588l3660j0859j03529J52487K53704k48586R6015k13192
16899A450528J32545O5696J61952K97304m32134j19528r319q5198J62641O2951
16889A687438M6545N7543K52563j73020n5419L15679k40515J059l01987L37676
16879A927562n3542J02807j42082L44480M8116j52374p0399L35693M9136j06671
16869B282726N7821K49334k41000q7843M16723m02100K88853j0408J40764j93115
16859B501755J30013K62053m28029L36809k19644l5345K80817j13141O26069k12533
$$ y = [1070458, 945384, 1293542, 1153101, 1503769, 1428889, 1290350, 776651, 1199244, 1209848, 1067159, 1291666, 1520834, 1259089, 1362082, 1467722, 1255483, 1184000, 1415280, 1132053, 1451566, 1523560, 1558148, 1524488, 1513629, 1410100, 1562587, 1816291, 1567705, 1663720, 1450528, 1583073, 1648769, 1810721, 2108025, 1675891, 1556363, 1547044, 1461846, 1624487, 1687438, 1733983, 1791526, 2044089, 1871069, 1815650, 2131329, 1890814, 1891873, 1589886, 1927562, 1874020, 1976827, 1834745, 2179225, 2227341, 2074967, 2004568, 2340261, 2389397, 2282726, 2340547, 2589881, 2348881, 2261038, 2677761, 2275661, 2564514, 2554106, 2694870, 2501755, 2631768, 2893821, 2465792, 2802601, 2582957, 2547612, 2828429, 2715288, 3341357, 3128824]
16849C128824j99999L26191k38054K67350p4697n9975M40494m28377J23554K15164
16839C500475q7298K33233L51891k23648l3397P113J71171P3358K69695j99288
16829D063305L59771o6642n1751r880k12691M29562J33329L92571j89074l3907
16819D814593j52645N30697J48156K50332j97903K1765n4510P65168k15554K06865
16809F116964l1680J16456J47787k20703P56960k37216K17653K60547j32548L37735
16799G331955L84873J20394N1315J53693M14772J5800l0912K25571N34559K98941
16789I500961J87815k4638P33912Q2711K1558P47588L04947P9709K23608N89311
16779A2447482L13859M76046M88524L62725N82881K95648M24817M38021R18915
$$ y = [3128824, 2928825, 3255016, 3016962, 3284312, 3209615, 3149640, 3590134, 3161757, 3285311, 3500475, 3413177, 3646410, 3998301, 3774653, 3741256, 3748369, 3919540, 3992898, 4262593, 4063305, 4423076, 4356434, 4304683, 4294803, 4082112, 4511674, 4645003, 5037574, 4848500, 4814593, 4661948, 5192645, 5340801, 5591133, 5393230, 5414995, 5360485, 6125653, 5910099, 6116964, 6085284, 6201740, 6349527, 6128824, 6885784, 6648568, 6866221, 7126768, 6994220, 7331955, 7716828, 7837222, 7888537, 8042230, 8457002, 8472802, 8441890, 8667461, 9202020, 9500961, 9688776, 9664138, 10398050, 10480761, 10502319, 11249907, 11554854, 11634563, 11858171, 12447482, 12761341, 13237387, 13725911, 14088636, 14671517, 14967165, 15391982, 15830003, 16748918]
16770A6748918L41298M09617P88786O76769N60649P38616R74513O79346P73684
16761B2692196R44844Q62260J163688R71540J296741J126794J226535J266721
16753C1551319J711722J529883J611719J839198J530483K277654J812938K533446
16745D6398362K399327K538575K711448K995343K985007L589467L813887L581738
16737G1013154M604415M288489N104348N161892N485961N720245O223985O957571
16729A14560060O735510P171554P847013P535698P729819P750144P569861P159305
16721A74058964O920051N500486N441409L217313L159243J114487k38127j480019
16713A97693807k864415m526403n319067o299610p195186p693885p813710q074686
$$ y = [16748918, 17090216, 17499833, 18288619, 18965388, 19526037, 20264653, 21239166, 21918512, 22692196, 23637040, 24499300, 25662988, 26634528, 27931269, 29058063, 30284598, 31551319, 33263041, 34792924, 36404643, 38243841, 39774324, 42051978, 43864916, 46398362, 48797689, 51336264, 54047712, 57043055, 60028062, 63617529, 67431416, 71013154, 75617569, 79906058, 85010406, 90172298, 95658259, 101378504, 107602489, 114560060, 121295570, 128467124, 136314137, 143849835, 151579654, 159329798, 166899659, 174058964, 180979015, 186479501, 191920910, 195138223, 198297466, 199411953, 199173826, 197693807, 194829392, 190302989, 184983922, 178684312, 171489126, 163795241, 155981531, 147906845]
16705A47906845q127732p949838p782104p456921p091670o576858o260242n978231
16697I0683249n801912n284713m386829m524262m181084l745390l673764l297948
16689E5787347l353675k349615k636413k571068k475582k168054k014001j618253
16681C6600686j728345j692126j542347r58883j748592j604426q47848j086366
16673B5391753o57840j739820p76773p59568q90796n38244j146897n78962o55718
16664A7647135n77574n58388n55294l58644p12215o93235r943o97097m77577k93758
16654A2713410p11082j91411k27993m32621l78318m40636l42308j06550l14249
16645I568242J10783n63988k72706j48573k37123J32003n52728j48805m65064
$$ y = [147906845, 139779113, 131829275, 124047171, 116590250, 109498580, 102921722, 96661480, 90683249, 84881337, 79596624, 75209795, 70685533, 66504449, 62759059, 59085295, 55787347, 52433672, 50084057, 47447644, 44876576, 42400994, 40232940, 38218939, 36600686, 34872341, 33180215, 31637868, 30678985, 28930393, 27325967, 26478119, 25391753, 24733913, 22994093, 22217320, 21457752, 20566956, 20028712, 18881815, 18302853, 17647135, 17069561, 16511173, 15955879, 15597235, 14885020, 14191785, 14181842, 13484745, 13007168, 12713410, 12002328, 11810917, 11582924, 11150303, 10771985, 10331349, 9989041, 9882491, 9568242, 9679025, 9115037, 8842331, 8693758, 8456635, 8588638, 8035910, 7887105, 7422041]
16636G422041O0261l48391K16442o46903q0679l97935K52131l96086M8865o6731
16626F063015o00213J31653j04879j82554L72725o49236K70553J62266o01915
16617D861415l60813J01153J3479k5355j66436p5500j96105j24100m68686Q05674
16607D364726k38818l44824L6483p4630J2756M9406n99600M09096k09750k06561
16597C198284k44059L87127J6538j45529k54184K40687m01828n0557K59335k79114
16587B726700k0275k40383L57671k35520O7656p0112P3512n46753L71446r2748
16577B391194J41191l12696q7404r7552N76043n80000M22511m22093K49801j32193
16567B148802j4646n6287j31247k01107K47447l34570L59164k70525M87190l21556
$$ y = [7422041, 7482302, 7133911, 7350353, 6703450, 6622771, 6224836, 6476967, 6080881, 6129746, 6063015, 5462802, 5594455, 5489576, 5307022, 5679747, 5030511, 5301064, 5463330, 4861415, 4500602, 4601755, 4615234, 4589879, 4423443, 4347943, 4151838, 4027738, 3559052, 4364726, 4125908, 3781084, 3817567, 3742937, 3755693, 3805099, 3205499, 3614595, 3404845, 3198284, 2954225, 3341352, 3357890, 3212361, 2958177, 3198864, 2797036, 2746479, 3005814, 2726700, 2706425, 2466042, 2823713, 2588193, 2655849, 2585737, 2659249, 2112496, 2483942, 2391194, 2532385, 2219689, 2132285, 2034733, 2610776, 2030776, 2453287, 2031194, 2280995, 2148802, 2134156, 2077869, 1946622, 1745515, 1992962, 1658392, 2017556, 1747031, 2234221, 1912665]
16557A912665k54826q4703K50323l12578K69372r6634Q9172k63806o9897k8896
16547A410192L22930k47317n8686K26674k55977P8671k55069P7778J06995O8010
16537A474201k35618K92690k29009Q6225j15393M2453J65277j14294K0352l02957
16527A083927J21152K01756j32498K10546k45987o6831N9169p0663J19220j38353
16517A141438J60744l66412J36493l72898L03119m8009N8533j42244n9541L95537
16507A206760q3680j19924n4996N4898l34274M24847l54961K89039J87116j62729
16497A052096R6127k91187n0568k80869K41850K00334L4510l73074M76685m12779
16487F93125j84306O14978m32480l3018j25673K39301j78488L07084M2597k69135
$$ y = [1912665, 1657839, 1573136, 1823459, 1510881, 1780253, 1683619, 1772791, 1508985, 1439088, 1410192, 1733122, 1485805, 1427119, 1653793, 1397816, 1476487, 1221418, 1299196, 1406191, 1474201, 1238583, 1531273, 1302264, 1388489, 1273096, 1315549, 1480826, 1366532, 1386884, 1083927, 1205079, 1406835, 1274337, 1484883, 1238896, 1172065, 1231234, 1160571, 1279791, 1141438, 1302182, 935770, 1072263, 699365, 1002484, 954475, 1013008, 870764, 811223, 1206760, 1123080, 1003156, 948160, 1003058, 668784, 1093631, 738670, 1027709, 1214825, 1052096, 1148223, 857036, 806468, 525599, 767449, 967783, 1002293, 629219, 1105904, 693125, 508819, 1123797, 691317, 658299, 532626, 771927, 593439, 900523, 943120, 673985]
16477F73985j33463K67531N4871l21153J84217r2191L5187N6203R6406J47329
16467I68922D65983J81143p9427k0131J27721k76516K75105j26360P6277K34583
16457H58378B14797M25780j18378K44157l09186J22053k807B15783J74550L99632
16447G89965k31660j16295J96024J4625r0907R007O6758q3733B23861L81415k05114
16436D00162J29235J90022o568k00294j08985p4203L08359B84342M44074k23681
16426E04735j23658A85039L23245J97597j16962k59586J39639J71697j96455j3577
16416D30637J80919k71347J64648J3681J61693B35877J19409K53666r0185k02482
16406C16285l9219J35946l7529j057L06862l877B54925R5123J86127j69305o5336
$$ y = [673985, 540522, 808053, 862924, 541771, 725988, 633797, 668984, 725187, 821593, 968922, 465983, 647126, 567699, 547568, 675289, 398773, 673878, 547518, 623795, 858378, 214797, 640577, 522199, 766356, 457170, 579223, 576416, 215783, 390333, 789965, 558305, 442010, 638034, 652659, 561752, 570759, 637517, 553784, 223861, 605276, 400162, 529397, 719419, 712851, 512557, 403572, 329369, 637728, 284342, 728416, 504735, 381077, 185039, 508284, 705881, 588919, 329333, 468972, 640669, 444214, 430637, 611556, 340209, 504857, 518538, 680231, 235877, 355286, 608952, 518767, 316285, 277066, 413012, 375483, 374426, 681288, 677411, 254925, 350048, 536175, 366870, 301534]
16395C01534M9809L11146k79196l6857R6017k5113J09576B15181J9040J13327
16385C47548J87796A4920J08603g6446E26277A49895N0785b698F48253p0184A35968
16373C6811L99462k13842l2427N38477k94274j67661K65614J0534A63864j9252
16363A44612M72341B72696N7283M2907O063J00788k17768Q1815K16724B48410
16352c0098C98060A07916K02371K29018B39025K69765j37494O4363A83413J19713
16342C03126r2569J26871L0295R969J9021j13851O7293N0787A57694K11121k1636
16331C47179j40269K99300J07579j74805j97885N4730L03942b07276D18179i3704
16320E6338L66352j91345P1222p2703M1117p4644n0336O5847J04959A52698K69111
$$ y = [301534, 351343, 662489, 383293, 346436, 442453, 417340, 526916, 215181, 234221, 347548, 535344, 14920, 123523, -76446, 526277, 149895, 200680, -2698, 648253, 578069, 135968, 36811, 436273, 222431, 190004, 728481, 434207, 266546, 532160, 542694, 163864, 144612, 616953, 272696, 329979, 372886, 378949, 479737, 261969, 343784, 560508, 248410, -30098, 398060, 107916, 310287, 539305, 239025, 508790, 371296, 435659, 183413, 303126, 210557, 337428, 367723, 377692, 396713, 282862, 350155, 400942, 157694, 368815, 347179, 206910, 506210, 613789, 438984, 241099, 295829, 599771, -207276, 418179, -93704, 56338, 422690, 231345, 302567, 229864, 270981, 196337, 146001, 211848, 316807, 152698, 421809]
16309D21809F5628J1113M80786B16924F9830P3233J3336L63850A50563j4642P8476
16298B14397J81755A03069d9469B71590L2869K34686p7587A83402b02346E05935
16287E64534k52616K0476K7957F1773O9130J79177p6002r4058J92577j3181J62706
16276D82122j08900b1067A46046L0635J48881i4311f295A88968K18513c6399A32443
16264c99857B90660o7688j500E9455B6700p945J12943K26402B9352N2802K21391
16253C03545m7977D0738b47297J00734B99885D7142K19074O17250D5715L82598
16243D28313a23730A15077D0666K30328j08649a62977G1634k1376J85960o6777
16233A69441l5962a02960B3040R1118a95206i1131r291r217k51462B68607a98653
$$ y = [421809, 65628, 76741, 557527, 216924, 69830, 143063, 156399, 520249, 150563, 135921, 214397, 396152, 103069, -49469, 271590, 304459, 539145, 461558, 183402, -202346, 505935, 564534, 311918, 332394, 360351, 61773, 130903, 310080, 234078, 140020, 332597, 319416, 482122, 373222, -21067, 146046, 176681, 325562, -94311, -6295, 188968, 407481, -36399, 132443, -399857, 290660, 222972, 221472, 59455, 26700, 18755, 131698, 358100, 29352, 82154, 303545, 255568, 40738, -247297, -146563, 299885, 47142, 266216, 883466, 45715, 428313, -123730, 115077, 40666, 270994, 162345, -162977, 71634, 50258, 236218, 169441, 133479, -102960, 23040, 114158, -195206, -91131, -100422, -109639, -361101, 268607, -198653]
16221b192C07207J15232A3005D43L00742c2217A72421C7065J7206M9030B9263
16209B97176a76503d4864I3230m4119L44495a8400A07881k4616l22J81775a49214
16197A56704b10700h8415B56380m4009B0067d4340C37681c4325N678C24447A60222
16185a440I1496R9811O4162k4972k6788o8115b7909B66089L1119A46254j4157
16174A32097c06892A98182q2223a29469a4030K765A39782J5345i296B93008Q0482
16163C73490a45245A8752M5100P2049J40968j18179R4102d8340r57q0551C432
16151A88261J13101a0123n6795l0614B8665J58908a37128l7310D1185J7762d454
16139E0529J3411J88177G8955a55086d6333E42219a8976o9828E6889a81486A39249
$$ y = [-2192, 307207, 422439, 13005, 443, 301185, -32217, 172421, 37065, 54271, 103301, 29263, 297176, -176503, -44864, 93230, 49111, 393606, -18400, 107881, 83265, 82943, 264718, -149214, 156704, -210700, -88415, 256380, 212371, 20067, -44340, 337681, -34325, -28647, 324447, 160222, -1440, 91496, 191307, 255469, 230497, 203709, 135594, -27909, 266089, 297208, 146254, 132097, -306892, 198182, 115959, -129469, -14030, -11265, 139782, 155127, -9296, 293008, 373490, -145245, 18752, 63852, 135901, 276869, 158690, 252792, -48340, -49297, -129848, 3432, 188261, 301362, -10123, -66918, -97532, 28665, 187573, -137128, -174438, 41185, 58947, -4454, 50529, 63940, 252117, 78955, -155086, -46333, 542219, -18976, -88804, 56889, -181486, 139249]
16127E92116a04494B19738d3704B55541b5905A07517b55789R5509C6582K12584
16117B49166o5132e4270q2284A61392a63602d254o6216B46597a5010k6154m2452
16106h3616L4586m7887e438A77337K4837c8937A15240q751P429C9208J94707a97101
16093h9214A76503F8094M8814R0933B6699L7255b7795L805l15406A14787b00865
16081A42697b1610j22689j05868M6349R59b1179F4860b3317r0737m5345o383H7295
16068B37525e6416A34645F3599N0430b5656B5255P7088h863m8699j44412F3952
16056B64763b5762q8171A17085m638B8273J61379M9161a66706M3918B27722H1712
16044c1897k755F5634e5944H7365M6741a6071P882A01995b07180i9379B0293L5068
$$ y = [592116, -104494, 219738, -43704, 255541, -25905, 107517, -255789, -160280, 36582, 249166, 184034, -54270, -136554, 161392, -163602, -4254, -70470, 246597, -15010, -41164, -83616, -49030, -96917, -5438, 177337, 202174, -38937, 115240, 106489, 113918, 39208, 233915, -197101, -89214, 176503, 68094, 116908, 207841, 26699, 63954, -27795, -23990, -339396, 114787, -200865, 142697, -21610, -144299, -250167, -203818, -202859, -21179, 64860, -23317, -114054, -159399, -165782, 87295, 237525, -56416, 134645, 63599, 114029, -25656, 25255, 102343, -8863, -57562, -201974, 63952, 264763, -25762, -113933, 117085, 112447, 28273, 189652, 238813, -166706, -122788, 227722, 81712, -31897, -34652, 65634, -55944, 87365, 134106, -16071, -8189, 101995, -207180, -99379, 20293, 55361]
16032E5361B3987J86759D4522a77434m1875a00208d1851G5241e1879C2611a6235
16020A07806a18172N0034k16003a11094B09021b93625a34815K78A22827j8430
16010A04397a77561B27036c95413a36596l48627b14983G417L85370o8229C9706
15999i7890o5989f9604H7709a52266e369j67902A16385J14715a4610A47348a10638
15987b16851C45401c60594a22318D7379b22048B3570Q5257N12694k63324I9224
15976B94014C4135e772n0944C07493f6243K5286j81264R9024C3566L3025a02942
15964A737J44813g1243j2160A20147a49984m8633L8534O3900o6371M8314o040
15953a20280m2741L2107j17560M9362h9589I8133b04159A70529b92672c2041n8641
$$ y = [55361, 23987, 210746, 44522, -177434, -219309, -100208, -41851, 75241, -51879, 32611, -16235, 107806, -118172, -68138, -284141, -111094, 209021, -293625, -134815, -134537, 122827, 104397, -177561, 227036, -395413, -136596, -485223, -214983, 7417, 392787, 324558, 39706, -97890, -163879, -69604, 87709, -152266, -5369, -173271, 116385, 231100, -14610, 147348, -110638, -216851, 345401, -360594, -122318, 47379, -222048, 23570, 108827, 621521, 358197, 99224, 294014, 34135, -5772, -56716, 307493, -66243, -40957, -222221, -123197, 33566, 66591, -102942, 1737, 146550, -71243, -83403, 120147, -149984, -198617, -160083, -96183, -162554, -114240, -120280, -163021, -130914, -248474, -199112, -89589, 98133, -204159, 170529, -292672, -32041, -90682]
15942i0682L8806a2038j0716j62709d661k59367B8439N3779K09695I924i7600
15930c20978e0610A5456a91649l1275R6442j57381R0352a9834o6545F0782f4260
15918b16540h5684c901E1403c7953k16749A5907a2933C39426e5672k5704j7246
15907i8622F8015f5889A61781d2797A28410g9772r3622K7103K9681A13946b37373
15895A18960a27860A47904b06492p5784Q8592f1161n6394k45301C01279A22644
15884b26193n051B00207a99654o7293B8098i8042k47270J18149i9432D7a4000
15872a12599k52066k30492a09065d8746j11475M7718B2473R2936A7570b71958
15861B9337J44415a98345B32200E1326L19152A0747m427b21831Q871B882P4735
$$ y = [-90682, -51876, -12038, -22754, -185463, -4661, -264028, 28439, 82218, 291913, 9924, -97600, -320978, -50610, 15456, -191649, -222924, -126482, -283863, -193511, -19834, -86379, 60782, -64260, -216540, -85684, -3901, 51403, -37953, -254702, 15907, -12933, 339426, -55672, -81376, -98622, 68015, -65889, 161781, -42797, 128410, -79772, -173394, -146291, -116610, 113946, -237373, 118960, -127860, 147904, -206492, -282276, -193684, -61161, -117555, -362856, 301279, 122644, -226193, -231244, 200207, -199654, -266947, 28098, -98042, -345312, -227163, -99432, 47, -14000, -112599, -364665, -595157, -109065, -48746, -160221, -112503, 22473, 115409, 17570, -271958, 29337, 173752, -198345, 232200, 51326, 370478, 10747, 6320, -221831, -212960, 2882, 77617]
15850G7617d00452E2868P8495f0647E0919J90230r894H3166M7818L049k9704g924
15837A22070O2538a7461D5792K00081D2301Q7091b57969L2349f4894b1318k38274
15826b59592A81498d3900A00633L6107h1928C7952f64C41946d41004b4810k56840
15815b81650D5022f8706l1851A32266o2679a13838o7389F5310f4391F2870J5087
15804G7957d0897E5118e3843o1413A92024D5559a16093j19457m0553B93387B8624
15792b70223B98843E33a5559m7458r4874b9510F4795M7342c3867H1660b51823
15780A91181c608j24820b8278E13367j51490b0614D41437b08276E108K41402A22146
15768a36215d2973j77002K5363e3268k25262A09958c15897O7128J20981c6765
$$ y = [77617, -400452, 52868, 131363, -60647, 50919, 241149, 231255, 83166, 130984, 134033, 104329, -7924, 122070, 184608, -17461, 45792, 245873, 42301, 129392, -257969, -225620, -64894, -21318, -259592, 181498, -43900, 100633, 136740, -81928, 37952, -664, 341946, -441004, -24810, -281650, 45022, -68706, -100557, 132266, 69587, -113838, -181227, 65310, -64391, 62870, 77957, -40897, 55118, -53843, -115256, 192024, 45559, -116093, -235550, -276103, 293387, 28624, -270223, 298843, 533, -15559, -63017, -157891, -29510, 64795, 112137, -33867, 81660, -251823, 191181, -3608, -128428, -28278, 513367, 361877, -20614, 441437, -208276, 5108, 246510, 122146, -136215, -42973, -219975, -194612, -53268, -278530, 109958, -315897, -248769, -127788, -36765]
15757A34744K6094F458c45327a44454J7663k4060j31576B62452b5495F6009P0382
15746A36391j8404b4498l06915c2855j85615g6530l08426J54385C29572e57907
15735d27089A87904p6136c4105H88M1028a19629k06246I0919j8097J21647i6914
15723c9035A66160a40160j98407J16753a01986j28360p2760B6951b6454J873G7279
15711F7418h5799l9170B9872a27553p7681h4870A373a27575A93882H0429a56783
15699e10140a01691j22920A11147l8631L1391C6181a00245l6161E8042d097G1885
15687I8852b21726J7157B06959M8600o6743b716A70720g0094E3868c09269P5104
15676b34165N2719j28733A16964C7744a70086J1989A79583a55046k82374J80887
$$ y = [134744, 160838, 6458, -345327, -144454, -126791, -150851, -282427, 262452, -25495, 66009, 136391, 117987, -24498, -331413, -32855, -218470, -76530, -384956, -230571, 329572, -557907, -427089, 187904, 111768, -34105, 888, 41916, -119629, -325875, 90919, 72822, 194469, -96914, -39035, 166160, -140160, -338567, -221814, -101986, -230346, -303106, 26951, -26454, -24581, 77279, 67418, -85799, -124969, 29872, -127553, -205234, -84870, 1373, -127575, 193882, 80429, -156783, -510140, -101691, -224611, 111147, 72516, 103907, 36181, -100245, -136406, 58042, -4097, 71885, 98852, -221726, -204569, 206959, 255559, 188816, -2716, 170720, -70094, 53868, -309269, -234165, -181446, -310179, 116964, 37744, -170086, -158097, 179583, -155046, -437420, -256533]
15666b56533M7228C1667J15162a64989A18187c31114B39860P662A02343b7205
15655b3778p7402B4274c24416J3448Q8315n6555J06286B84589G9968K13922a52615
15643b04154A69534b79860D0364b52790C8851i92p4726I4751a32571C89105j46569
15632B42536I4897K14643A47550N2004a54074a4487A33222R9146a56507j44950
15622c01457h9069j307c5870C3393J22698a04679D1459f776A25127b84506g5250
15610a73249d22A3278a51414m3760j59278a08092L4321F7491a26955B58970h3254
15598a01651C56428A14748c53408A24860e8747j66528Q6554I2236k441e3172j02098
15587a55270B74292b60133B07003c7515A68435a27965k584A48975a50074A90969
$$ y = [-256533, -209305, 31667, 146829, -164989, 118187, -331114, 239860, 247522, 102343, -27205, -23778, -101180, 24274, -324416, -310968, -222653, -279208, -172922, 284589, 79968, 293890, -152615, -204154, 169534, -279860, 40364, -252790, 38851, -992, -75718, 94751, -132571, 389105, 242536, 94897, 309540, 147550, 199554, -154074, -14487, 133222, 232368, -156507, -301457, -89069, -90376, -35870, 33393, 156091, -104679, 41459, -6776, 125127, -284506, -75250, -173249, -422, 13278, -151414, -195174, -354452, -108092, -73771, 67491, -126955, 258970, -83254, -101651, 356428, 114748, -353408, 124860, -58747, -225275, -138721, 92236, 89795, -53172, -155270, 274292, -260133, 207003, -37515, 168435, -127965, -130549, 148975, -150074, 190969]
15576g6739A99942q5621a75790j70201H8572b06479j7360c2018j9299r9835j15874
15565b67026G9066B1339a66713F8018J28261f3258j37523D6803J50619I2575c3633
15553C10931I7938c2133n153A50549b01275A24754c67412B80642a94416b1300
15542B1016N5914a15221A88941r2254L09243a13149I7306b88029Q4804A03255
15531G0431O7312a59907c9427k2684A28179A5305D045i6569n2031B45556J90525
15520D36081C3846J19562o3961c28105e5848C4153J25239c38298C65664A23766
15509A2140M1803K55078A8993J09045c4952j65281R1995j72976h5165m1931P527
15498a19569k300b4783j29249J663A15749i5209j67520c8560j1382A08683i9017
$$ y = [-76739, 199942, 114321, -175790, -345991, 88572, -206479, -223839, -32018, -51317, -151152, -267026, 79066, 21339, -166713, 68018, 196279, -63258, -200781, 46803, 197422, 92575, -33633, 310931, 97938, -32133, -37286, 150549, -201275, 124754, -367412, 280642, -194416, -21300, 21016, 76930, -115221, 188941, 96687, 405930, -113149, 97306, -288029, -203225, 103255, 70431, 137743, -159907, -39427, -62111, 128179, 15305, 4045, -96569, -148600, 245556, 436081, 33846, 153408, 89447, -328105, -55848, 34153, 159392, -338298, 365664, 123766, 12140, 53943, 309021, 18993, 128038, -34952, -200233, -108238, -281214, -85165, -127096, -119569, -121869, -24783, -154032, -152369, 115749, -95209, -262729, -38560, -49942, 108683, -99017]
15486F6308k5205O0627e0572A47365a31597J9893A45425j4286B088g702F2893
15474B3479a87015A21114c79947a34199M6225N183C33966B5528a34920B20134
15463A88443H4803h4755A86041g9630F5724j2051b56379A90760a40174A11705
15452B1271a92328p2496A1032M56389h5378B01705h4133p6740b7065A65528a2449
15440I4407H546a31029B14224H6653a86005A46830A736K49784g9796C24818a16779
15428a33653M2065A09873E2632P6288D1798c01413R3751a1793j42678I6602K33661
15417C30263e312B11146h5036j17521L9297D05787d49441A9698L12687c14507
15406E6442N66e2581r15j80736b9190I3050l6358J20265Q9720e59l01989A13196
$$ y = [66308, 41103, 101730, -50572, 147365, -131597, -111704, 145425, 131139, 2088, -7702, 62893, 23479, -187015, 121114, -379947, -134199, -87974, -82791, 333966, 25528, -134920, 220134, 188443, 84803, -84755, 186041, -79630, 65724, 53673, -256379, 190760, -140174, 111705, 21271, -192328, -264824, 11032, 467421, -85378, 201705, -84133, -160873, -27065, 165528, -12449, 94407, 8546, -131029, 214224, 86653, -186005, 146830, 1736, 251520, -79796, 324818, -116779, -133653, -91588, 109873, 52632, 128920, 41798, -301413, -207662, -11793, -154471, 96602, 330263, -5312, 211146, -85036, -202557, -163260, 405787, -449441, 19698, 332385, -314507, 56442, 57008, -52581, -53496, -234232, -29190, 93050, 56692, 176957, 266677, -559, -302548, 113196]
15393d002A23187B0329a11695A43960i7485n1794I7368g3450j64556I7697N8394
15382A56091J25123C2717e4083B21860F8880k622d5022a8183A64123A40K07352
15371B07492o809a82199O8089a218k97508C0567g577k00763B15543b20536O6997
15360a53539j2139F983K84374e2183F124d9282h509k37402a0344l55956D9303
15348B51064b60476a17220a519j93659A32105a69323E26033d66610D427e45A44151
15336C81964j83730A8484K33086A10791A1282P9661a19498C01347F2521b26274
15325A5952b97295J8362J25201j40845C9425R7215L1199p2604d8652Q821H4882
15313h089A24383b23825H3879Q3097A4962a94334j1163Q9449B3018f3369O71B33452
$$ y = [-4002, 123187, 20329, -111695, 143960, -97485, -149279, 97368, -73450, -238006, 97697, 156091, 281214, 32717, -54083, 221860, 68880, 66258, -45022, -18183, 164123, 140, 207492, 200683, -182199, -114110, -1218, -298726, 30567, -7577, -208340, 215543, -220536, -153539, -165678, 6983, 291357, -52183, 6124, -49282, -8509, -245911, -10344, -366300, 49303, 251064, -260476, -117220, -1519, -195178, 132105, -169323, 526033, -466610, 4427, -545, 144151, 381964, 198234, 18484, 251570, 110791, 11282, 90943, -119498, 301347, 62521, -226274, 15952, -297295, -278933, -153732, -294577, 39425, 136640, 167839, 95235, -48652, -39831, 84882, -8089, 124383, -223825, 83879, 166976, 14962, -194334, -205497, -116048, 23018, -63369, -62698, 233452]
15300B56414F6733N5967J02801F1558b000m8549B00844q7685Q7052c0616q2444
15289a13060j42119a03650K083B07035K3293A06516C3005a63141j473O6580k6674
15278a24708o7430l4818B67546a23163o787q0755A02117L6268o3887f9097j48131
15267b17228R8151A6647P3587a8613j10299j1314A38212i8133j26501g2051C02355
15255c8181I1894c5641A98570J7133f4980C33966m2830J64901M79837R39213R45754
15244B820841q67160K36981n05459D38080j88852g2709B376K93518E3349a04518
15233h5290I9867J723f9885m2052j60561F9872h1476J0149C95775d65357a8861
15221A54435k0980K31295b1682k22565b4126h17A45642g0991A10335J87124L56286
$$ y = [256414, 66733, 122700, 225501, 61558, -2000, -50549, 200844, 113159, 200211, -30616, -113060, -255179, -103650, -101567, 207035, 230328, 106516, 33005, -163141, -164614, -98034, -124708, -192138, -226956, 267546, -123163, -129950, -210705, 102117, 138385, 74498, -69097, -217228, -119077, 16647, 90234, -18613, -128912, -140226, 138212, -98133, -224634, -72051, 302355, -38181, 91894, -35641, 198570, 215703, -64980, 333966, 291136, 456037, 935874, 1875087, 2820841, 1953681, 2190662, 1685203, 438080, 249228, -72709, 2376, 295894, 53349, -104518, -85290, 99867, 101590, -69885, -111937, -272498, 69872, -81476, -71327, 395775, -465357, -18861, 154435, 133455, 364750, -21682, -244247, -24126, -817, 145642, -70991, 110335, 297459, 653745]
15210F53745A40805B2942K47390r828G1666h3333B29426a4720A39150Q1448c7986
15198g4784B93083a41008A01717d7021j5471A77234A0601J03381L8362a72767
15187B10745b50614A23381I169L19029F8699d3805n6263M1794j19246A07294k9538
15176G7756K0158O0771J81691A01048G339J03111D3232a78401A54548k2059K9921
15165A62410n6091A3033K1998g5413q9626A57521f3595H1598f0466A25764a69012
15153A79830E6993J30206H406c5403A98366o9401K13396g2126A60975E3231M8296
15142A01527B7408L02621A64837J32620A02437K05878g782A10298N8085N6875
15132B25258J41953A00055B1324K36025E4334N8799K13251H8826a41096H5925
$$ y = [653745, 140805, 22942, 270332, 260504, 71666, -83333, 229426, -14720, 139150, 220598, -37986, -74784, 293083, -141008, 101717, -47021, -62492, 177234, 10601, 113982, 152344, -172767, 210745, -250614, 123381, 9169, 328198, 68699, -43805, -100068, -58274, -177520, 107294, 77756, 97914, 158685, 340376, 101048, 7339, 110450, 43232, -178401, 154548, 132489, 162410, 106319, 13033, 35031, -75413, -165039, 157521, -63595, 81598, -60466, 125764, -169012, 179830, 56993, 187199, 8406, -35403, 198366, 128965, 342361, -72126, 160975, 53231, 101527, 27408, 330029, 164837, 297457, 102437, 308315, -7782, 110298, 168383, 225258, 367211, 100055, 21324, 257349, 54334, 113133, 326384, 88826, -141096, 85925]
15121C5506K07131J9686H40J55327d7785a9745B97294m5186f3463q3685G8343
15109a96838d95m0884l8388C69356c3050H4160K38008q1543j08146J64956J18914
15098D16349j94203r1588b60331A05409J09710E7241M4195M4640B7464O3119b02671
15086C01300G2834a47319B31668I2934J81505D254K1057J51550D091f4081B97714
15074A48391k3321L9276E7836J42516F6917K43709A23899b00314E4849N8984n1450
15063F2383L3287K71684a05053B73944J8250k1965m058K00397A0639K1351Q4781
15052A16771j9163K92873a53179d5951A34859K949d2666A74387m4090b40575G9508
15040E04256A51178L6118k596M0768f4309E631J19490g3674B21547K70159j18699
$$ y = [35506, 242637, 262323, 840, 156167, -47785, -19745, 297294, 252108, -63463, -147148, 78343, -196838, -495, -41379, -79767, 369356, -33050, 84160, 322168, 240625, 132479, 297435, 416349, 222146, 130558, -260331, 105409, 215119, 57241, 101436, 146076, 27464, 90583, -202671, 301300, 72834, -147319, 231668, 92934, 274439, 4254, 25311, 176861, 4091, -64081, 297714, 148391, 125070, 164346, 57836, 200352, 66917, 310626, 123899, -200314, 54849, 113833, 62383, 95670, 367354, -105053, 273944, 292194, 270229, 266171, 466568, 10639, 31990, 116771, 97608, 390481, -153179, -45951, 134859, 137808, -42666, 174387, 130297, -240575, 79508, 504256, 151178, 187296, 184700, 225468, -64309, 5631, 125121, -73674, 221547, 491706, 373007]
15029C73007A4893K76444J7565r7438E8062L05461A54639N2442E7414K01098f8742
15017G1123J75132G3485L85285j82081f4151C92388B5581L56917c7325A86931
15006D38840I0810L10916A26959K17970a06758C05039j1352A14022J671j8580
14996I7113K08677b77333B64245c2993B29705o02A13035L4095K91360c622E08403
14984g0812A21428K16828g7960A12508J76541l6799n3446I3861J89046e5468D9933
14972D46984j61560a62507A33835l6607K02287Q8349j86846K39744O5817g502
14961A76673L19549A70078L9553k7795C7665f2538B03231J19287I1036J26861
14951B17897K23417B20405K26159A63717Q764D7395J61429J09598i3852D00318
$$ y = [373007, 14893, 291337, 308902, 211464, 58062, 363523, 154639, 207081, 57414, 258512, -68742, 71123, 246255, 73485, 458770, 276689, -64151, 392388, 25581, 382498, -37325, 186931, 438840, 90810, 401726, 126959, 344929, -106758, 305039, 293687, 114022, 115693, 97113, 305790, -277333, 264245, -32993, 229705, 229103, 113035, 147130, 438490, -3622, 508403, -70812, 121428, 338256, -77960, 112508, 289049, 252250, 198804, 93861, 282907, -55468, 49933, 446984, 285424, -162507, 133835, 97228, 299515, 387864, 201018, 440762, 506579, -7502, 176673, 496222, 170078, 209631, 181836, 37665, -62538, 203231, 322518, 91036, 217897, 441314, 220405, 446564, 163717, 172481, 47395, 208824, 318422, -93852, 400318]
14940C75500O8259b15219C58379c8440C50303j39410G5580N1889K31656I2997
14929A24571k6084J31209P8898R24F328K75555A35109b9593C34016A16467l8879
14918G7588L43219E6491L85103j02785R2382J57497A59902J95163j3917A34822
14907B45040L39812k12800K76904j34436o7142A74429m6606K28192j0715l1495
14897C13805M9053J41875B35615m0663N4166O1583P384l0361J77126j52979j25479
14886A86392K06882A81158L7265I4982K73059K53706B73687J40191R8449B54034
14875a4247D48259k20661K09796K1323B00645K86253k08713R8427k5530N8665
14865D09747n563j08489J07341K5308j52071M4734K03139k58311J07881K00031
$$ y = [375500, 443759, -215219, 358379, -38440, 350303, 210893, 75580, 127469, 359125, 92997, 124571, 98487, 229696, 308594, 309518, 6328, 281883, 135109, -29593, 334016, 116467, 77588, 420807, 56491, 441594, 338809, 431191, 588688, 159902, 355065, 341148, 134822, 245040, 584852, 372052, 648956, 514520, 447378, 174429, 127823, 356015, 345300, 313805, 362858, 504733, 235615, 194952, 249118, 310701, 318085, 287724, 464850, 311871, 186392, 393274, 181158, 218423, 94982, 368041, 621747, 273687, 413878, 512327, 254034, -14247, 448259, 227598, 437394, 458717, 200645, 486898, 278185, 376612, 351082, 409747, 404184, 295695, 403036, 428344, 276273, 321007, 524146, 265835, 373716, 573747]
14855E73747k32804k9148l799j09382J25910R2801J93583j96636o5183L96506
14845G45595k67941n5335J1092K60781j85421J01686k22120K72329k67962J95837
14835E88541o5232j17834K2996j6458P6403m2497n7308j11456P1083D0837M04378
14824D45215J10468A24062L84778k07164J90784j46899q9137j0207j02614Q7537
14814B31140N79163k66161F6177L28399K51730k48067k4196J01266l3677L90469
14804H32101C10779K05678j93454K61985k2234k50432J99606l2798R5969M857
14794E79956B72772L97748k44857L13256j40359j35942j69853J02077J66049j33727
14784D27164P9667K59153B84831K78345A44830J80826K97705k69370L12849j59304
$$ y = [573747, 340943, 311795, 307996, 198614, 324524, 417325, 610908, 414272, 349089, 745595, 477654, 422319, 433411, 694192, 508771, 610457, 388337, 660666, 392704, 588541, 523309, 405475, 428471, 412013, 488416, 445919, 388611, 277155, 348238, 40837, 445215, 555683, 124062, 508840, 301676, 492460, 345561, 256424, 246217, 143603, 231140, 810303, 544142, 66177, 394576, 646306, 398239, 374043, 475309, 441632, 832101, 310779, 516457, 323003, 584988, 562754, 312322, 511928, 479130, 575099, 579956, 272772, 670520, 425663, 738919, 598560, 462618, 292765, 394842, 560891, 427164, 506831, 765984, 284831, 563176, 144830, 325656, 623361, 353991, 666840, 507536]
14774E07536K21631B51952L16709O9378j28672K3247J79162l11025J514J3011
14764D15276M84459k35669M8445j78427L12230j98493J473C09174L7469K62235
14754F08878K11976k55044j8462J2726l6474J29698M5001k44491N7709L53859
14744H65376l67244n7485M36214k75227P2080p1552L02066j00973C73669J51298
14734E24967K64846j03525M156L26690E00141L33415j34747J94068k15603K5136
14724G02410J2539n4669o4251J83956K35930k61831J32577j21593j02067J99703
14714H62704j30558P0790j22426J48528j04998j9731K18875j34577K25169j48122
14704H65654J87572k86500j73677K9107J10242K04266j31276J78475j09719R4299
$$ y = [507536, 729167, 251952, 568661, 638039, 509367, 532614, 711776, 400751, 402265, 415276, 899735, 664066, 712511, 534084, 846314, 647821, 649294, 309174, 346643, 608878, 820854, 565810, 547348, 560074, 523600, 653298, 698299, 453808, 511517, 865376, 498132, 440647, 876861, 601634, 673714, 602162, 904228, 803255, 373669, 524967, 789813, 686288, 690444, 1017134, 500141, 833556, 698809, 892877, 677274, 702410, 714949, 660280, 596029, 779985, 1015915, 754084, 886661, 765068, 663001, 862704, 732146, 802936, 680510, 829038, 724040, 704309, 923184, 788607, 1013776, 865654, 1053226, 766726, 593049, 622156, 732398, 936664, 805388, 983863, 874144, 968443]
14694I68443l93437J86929j33856N72094l11143p9405N02333m35791k73028K75437
14684H78576M30710n78129L09397k45792L33444m26019L00489k94779K94483k2110
14674I80270L09010k86207J30202l63114K89448j26104l1052J46306k02745J46350
14664I92364q0991K14151j82250j864q695j05245L29103n6925j91167N19120o06922
14653H20679K77967K30607k08514j05992j75211J2542J66595o3922O5123J26548
14643A146422m1235J11506J38135r476P8559q1661r7685j25104J1866r3082J87992
14632A226237K07965j62936j43110J8015J03770o1492J75319L559l6310L24632
14622A655649m42331J5373r614J58269l6894L56015m88207M00278J08278k26541
$$ y = [968443, 575006, 761935, 628079, 1200173, 889030, 809625, 1311958, 876167, 603139, 878576, 1309286, 731157, 1040554, 794762, 1128206, 702187, 1002676, 707897, 1002380, 980270, 1289280, 1003073, 1133275, 770161, 1059609, 933505, 902453, 1048759, 846014, 992364, 911373, 1125524, 943274, 941410, 932715, 827470, 1156573, 1099648, 908481, 1427601, 820679, 1098646, 1329253, 1120739, 1014747, 839536, 852078, 1018673, 954751, 1019874, 1146422, 1105187, 1216693, 1354828, 1345352, 1423911, 1342250, 1244565, 1119461, 1131327, 1038245, 1226237, 1434202, 1271266, 1128156, 1146171, 1249941, 1188449, 1363768, 1367327, 1331017, 1655649, 1213318, 1228691, 1219077, 1377346, 1340452, 1696467, 1208260, 1608538, 1716816, 1490275]
14612A490275L26540n19814q0218J80669J10460K71156m44953L02222l3942J48195
14602A750590k10926R9459r0037M9945j5637n5400K75224j19829k01571R6858
14592A578676m4024j72083J33736L14390K19793m25408K56468p3570k28290N80229
14582B139917l96161J97312K0943N4358K69811l39641R1956r1992J07287Q0237
14572B134027K48109n80381M39054J5711L7876K62187k19325K87533K02148m26745
14562B400194M30320k60025K27040j24204K21081m445N71703j520O00355j56469
14552C904030R55168J96086Q31939K101779M471001Q133566J5780896O100907
14544D2475372B0437257I042648l088748J684263k540072k235419o88214l21250
$$ y = [1490275, 1816815, 1297001, 1216783, 1397452, 1507912, 1779068, 1334115, 1636337, 1602395, 1750590, 1539664, 1639123, 1549086, 1599031, 1583394, 1527994, 1803218, 1683389, 1481818, 1578676, 1534652, 1362569, 1496305, 1810695, 2030488, 1605080, 1861548, 1787978, 1559688, 2139917, 1743756, 1941068, 1962011, 2016369, 2286180, 1946539, 2038495, 1946503, 2053790, 2134027, 2382136, 1801755, 2240809, 2256520, 2294396, 2556583, 2337258, 2624791, 2826939, 2400194, 2830514, 2570489, 2797529, 2673325, 2894406, 2889961, 3461664, 3460144, 4060499, 3904030, 4859198, 5055284, 5887223, 7989002, 12460003, 20593569, 36374465, 42475372, 20437257, 9042648, 5953900, 7638163, 5098091, 2862672, 2174458, 1853208]
14536A853208J16682P6169k02502J00906K37138k23407K33272L6289j5285j86499
14526B025971N8746K53254j43859k47244L38150P475p2667K63529K6465j15726
14516B394094K81084j21516N4230l24389N09170j85166K852m2675M78578j76636
14506B869626K98123n15689L69960j92444q701K32461j4256R6065j10650J50251
14496C174746j26028K70064J77808j98353L80745k62999n39126O29752L13426
14487C820035j73440M2497k80830O39359l24715P3015O3479J99089l28800j13572
14477C616117K51372l8127J70302j36216J49572J04832M35055j69522j76377K37687
14467D444695J47221j39929q8579M42917k86369L2760J72175K10860j4742o0006
$$ y = [1853208, 1969890, 2046059, 1843557, 1944463, 2181601, 1958194, 2191466, 2227755, 2212470, 2025971, 2084717, 2337971, 2194112, 1946868, 2285018, 2292493, 2219826, 2483355, 2509820, 2394094, 2675178, 2553662, 2607892, 2283503, 2792673, 2607507, 2610359, 2567684, 3046262, 2869626, 3167749, 2652060, 3022020, 2829576, 2820875, 3053336, 3039080, 3135145, 3024495, 3174746, 3048718, 3318782, 3496590, 3298237, 3678982, 3415983, 2876857, 3506609, 3820035, 3646595, 3689092, 3408262, 4047621, 3722906, 3795921, 3859400, 4058489, 3729689, 3616117, 3867489, 3829362, 3999664, 3863448, 4013020, 4117852, 4552907, 4383385, 4207008, 4444695, 4591916, 4451987, 4363408, 4806325, 4519956, 4552716, 4724891, 4935751, 4921009, 4861003]
14457D861003K6646J4205L79311M7853k52421L8433L21696k73735k2662M35611
14447E575940j14976N19823j92126k23583L30580K79497j2255k08795L18383p6385
14437F196103J26685J59294K76631j76751N5817j36131J30046N11083o1502N8390
14427G139665j9090L75798q2457J69966J63661j65240L79482k2110J06427K36324
14417H282426L25661j55508L16643l89137N14198p0116J63215J09375L04897J8575
14407I420229K48496N388M01914l00832M93526K40091n3390o2817K37165J04952
14397A0734722P81134k84007J73976L62422j88381M58081J12523L44059n1959
14388A2442570M70493M97888K33908n0689K89899M31385p9605P47595l4714L32994
$$ y = [4861003, 4887649, 4901854, 5281165, 5329018, 5076597, 5115030, 5436726, 5162991, 5140329, 5575940, 5460964, 5980787, 5788661, 5565078, 5895658, 6175155, 6162900, 5954105, 6272488, 6196103, 6322788, 6482082, 6758713, 6581962, 6637779, 6501648, 6631694, 7142777, 7081275, 7139665, 7120575, 7496373, 7413916, 7583882, 7747543, 7582303, 7961785, 7939675, 8046102, 8282426, 8608087, 8452579, 8769222, 8380085, 8894283, 8824167, 8987382, 9096757, 9401654, 9420229, 9668725, 9674113, 10076027, 9775195, 10268721, 10508812, 10455422, 10392605, 10629770, 10734722, 11515856, 11231849, 11405825, 11768247, 11579866, 12037947, 12150470, 12494529, 12442570, 12913063, 13410951, 13644859, 13594170, 13884069, 14315454, 14235849, 14983444, 14948730, 15281724]
14378A5281724M63702K39972L98688O4147L19174L10990M44577O00687K95155
14369A8418816P1524K03940L60209O44862M33104L09990M85679M80136M30878
14360B1839138N73187N27096K72599P96334N57689M42019N46867P52927N80271
14351B6888127N87605P50281N27710N39097Q24520R67717Q53759R49549L68543
14342C3256908R36537J042767R37271J182255P43699J065628J158892J311925
14334D1635882J123373J078252J488043J702082R46431J539313J889381J202161
14326E2604918K165005J647495K187685J524084K337330K095023K207518K515272
14318F9284330K409322K850985K777368K896538L257891L205892L563544L732742
$$ y = [15281724, 15745426, 15985398, 16384086, 16448233, 16767407, 17078397, 17522974, 18123661, 18418816, 18490340, 18694280, 19054489, 19699351, 20132455, 20442445, 20928124, 21408260, 21839138, 22412325, 22939421, 23212020, 24008354, 24566043, 25008062, 25554929, 26307856, 26888127, 27475732, 28226013, 28753723, 29292820, 30117340, 31085057, 31938816, 32888365, 33256908, 34193445, 35236212, 36173483, 37355738, 38099437, 39165065, 40323957, 41635882, 42759255, 43837507, 45325550, 47027632, 47974063, 49513376, 51402757, 52604918, 54769923, 56417418, 58605103, 60129187, 62466517, 64561540, 66769058, 69284330, 71693652, 74544637, 77322005, 80218543, 83476434, 86682326, 90245870, 93978612]
14310I3978612L558203L874067M630256M237793M800205N103902N417919N306763
14302A30907720O221802O396479O720648P010885O908448Q423379Q099573Q757867
14294A89446801R301547R916045J0233654J0657121J1163944J1999515J2085502
14287B64804129J2897821J3409885J3769802J3404408J4395251J4028343J4447868
14280C61157507J3944998J3881819J3101046J2612565J1730080J0086928Q380429
14273D44895372N329393K373675Q53045J158136j59825j085179l168383m864847
14265D45331387q731424j1210732j2596081j3726338j4559543j4917000j5744384
14258C53845885j5211021j5153297j5099070j4626182j4314500j3709031j2574440
$$ y = [93978612, 97536815, 101410882, 106041138, 110278931, 115079136, 120183038, 125600957, 130907720, 137129522, 143526001, 150246649, 157257534, 164165982, 172589361, 180688934, 189446801, 198748348, 208664393, 218898047, 229555168, 240719112, 252718627, 264804129, 277701950, 291111835, 304881637, 318286045, 332681296, 346709639, 361157507, 375102505, 388984324, 402085370, 414697935, 426428015, 436514943, 444895372, 450224765, 452598440, 453451485, 454609621, 454449796, 453364617, 450196234, 445331387, 436599963, 425389231, 412793150, 399066812, 384507269, 369590269, 353845885, 338634864, 323481567, 308382497, 293756315, 279441815, 265732784, 253158344]
14251B53158344j0673772j2303446j1669920j0466163j0353420r888342q605074
14244A79198207q430903q086194p393652p283898o534898o451201n955126n190734
14236A23871601n617872m929414m798964m488350l930091l772541l593205l986864
14228H8754300l707523l045294k911858l132855k453977k904763k600652k310998
14220F5686380j758136k118587k430052k022022j717290j769506j442915j220450
14212E1207422j896061j653697j139359j406578j514865q07622j010728j479193
14204D0299319j095211j266500j096033n27161p46174j194647r08588r47863r34882
14195C1582260m91610q52745p79423p23839j045308o18468n73072n90448n51292
$$ y = [253158344, 242484572, 230181126, 218511206, 208045043, 197691623, 187803281, 179198207, 170767304, 162681110, 155287458, 148003560, 141468662, 135017461, 129062335, 123871601, 118253729, 113324315, 108525351, 104037001, 100106910, 96334369, 92741164, 88754300, 85046777, 82001483, 79089625, 75956770, 73502793, 70598030, 67997378, 65686380, 63928244, 61809657, 59379605, 57357583, 55640293, 53870787, 52427872, 51207422, 49311361, 47657664, 46518305, 45111727, 43596862, 42789240, 41778512, 40299319, 39204108, 37937608, 36841575, 36314414, 35568240, 34373593, 33465005, 32517142, 31582260, 31090650, 30237905, 29458482, 28734643, 27689335, 27070867, 26497795, 25907347, 25356055]
14186B5356055n47652j43348q80189o51316n36440j88887q27441l35570k18680
14177B1026532n63063o92840l56848m41987J09857m60764m15392m65139o03347
14168A7137009k24502k11283k59134j51180n36078n82337J81119l49756j54025
14159A4849833j75888n66619J41454j80195l02814n45282K89272o72670O1938
14150A2899029n45866j25999k77459N2480l14420l05130j63743p5014q1741m89670
14140A0572467K213k14966j44909j15375P2773k51870r9114j13523l26202K05043
14130I586537n18072k16260Q4607k29033P6339Q7414l31863k22261N204j92024
14120H130588k27247K82302k07538N5910l51120L38736k09226l16426j72166J05711
$$ y = [25356055, 24808403, 24665055, 23784866, 23133550, 22597110, 22408223, 21580782, 21245212, 21026532, 20463469, 19770629, 19413781, 18971794, 19081651, 18620887, 18205495, 17740356, 17137009, 16912507, 16701224, 16442090, 16290910, 15754832, 15172495, 15353614, 15003858, 14849833, 14673945, 14107326, 14248780, 14068585, 13765771, 13220489, 13509761, 12837091, 12899029, 12353163, 12227164, 11949705, 12002185, 11687765, 11382635, 11218892, 11143878, 11062137, 10572467, 10574680, 10359714, 10214805, 10099430, 10172203, 9920333, 9821219, 9707696, 9381494, 9586537, 9068465, 8852205, 8936812, 8707779, 8784118, 8871532, 8539669, 8317408, 8322612, 8130588, 7903341, 8185643, 7978105, 8034015, 7682895, 8021631, 7812405, 7495979, 7323813, 7429524]
14110G429524l03448k16101K38842k18137j61363j60667J58157l08312q060n6425
14100F394010j28409n2105n82039L38422J59108k83634J20538l82751J71727m6790
14090E708077o53q2676k32857N1317j21853m1619m9944j15423j41229N0740J84263
14079E208143J72919l63355L2196p6787l07132M2081J39787j38945j05976n8613
14069D544318k37201O70559o94914J3131K08347k19667L6274K25162l50667k6339
14059D169003j71564n4048j05559J66543l10543L88101k81502j14094Q6931N8008
14049C831276l93341P730J30909p7177k27359J0290K74399O0947k29098O2271
14039C450847o5087R4142k84115O0936k30422L48991l89280R881O99428l49101
$$ y = [7429524, 7126076, 6909975, 7148817, 6930680, 6769317, 6608650, 6766807, 6458495, 6450435, 6394010, 6265601, 6213496, 5631457, 5969879, 6128987, 5845353, 5965891, 5583140, 5754867, 5708077, 5707424, 5624748, 5391891, 5443208, 5321355, 5279736, 5229792, 5114369, 4973140, 5023880, 5208143, 5381062, 5017707, 5049903, 4973116, 4665984, 4708065, 4847852, 4708907, 4602931, 4544318, 4307117, 4977676, 4282762, 4295893, 4504240, 4284573, 4320847, 4546009, 4195342, 4169003, 3997439, 3943391, 3837832, 4004375, 3693832, 4081933, 3800431, 3686337, 3773268, 3831276, 3437935, 3445665, 3576574, 3499397, 3272038, 3282328, 3556727, 3617674, 3388576, 3450847, 3385760, 3479902, 3195787, 3256723, 3026301, 3375292, 2986012, 2995893, 3695321, 3346220]
14029C346220n22316M32319L5884k4875Q6832k01910m29131K21666j14715k03694
14019B626280J80259j58871k5238L27897o8672k52523K26839q8503n35320J80710
14009B412858L7638j95856J50019J42026l83303L32283N4063m93937L48545R0686
13999B495022n21824K42117J03619j10427M98569k14421k4317j30670L62420N77968
13989C278056J258587K931774P053491J5750341J4513928j8440654j2766693n405305
13981H173525k124304j181900o29912o70467k94014J98630k34455j92840k64888
13972B779375J72440j87275q2166L71683o17839j99077J12507k85663o0381N27076
13962B530680k60526j66917K50770k49970k18947N05824k68830J92304q3856j4836
$$ y = [3346220, 2823904, 3256223, 3292107, 3267232, 3354064, 3152154, 2723023, 2944689, 2829974, 2626280, 2806539, 2647668, 2622430, 2950327, 2881655, 2629132, 2855971, 2767468, 2232148, 2412858, 2450496, 2254640, 2404659, 2546685, 2163382, 2495665, 2549728, 2055791, 2404336, 2495022, 1973198, 2215315, 2318934, 2208507, 2707076, 2492655, 2468338, 2337668, 2700088, 3278056, 4536643, 7468417, 14521908, 30272249, 44786177, 26345523, 13578830, 8173525, 6049221, 4867321, 4237409, 3566942, 3272928, 3471558, 3237103, 3044263, 2779375, 2951815, 2764540, 2682374, 3054057, 2436218, 2237141, 2349648, 2063985, 2003604, 2530680, 2270154, 2103237, 2354007, 2104037, 1885090, 2390914, 2122084, 2314388, 2230532, 2215696]
13952B215696j84350m9476K91334j43817J14537J36311m34204L1973j96720J8024
13942A799308N33547m20325K24068n57559L04816N1863k89963J50238Q1995K12116
13932B090104l42781J62287O4125l88496N57024l89684p2820m1625r7210J91759
13922A732683k5537j93490M74663k15871k97175K77412j08624j21784r3795j26390
13912A302092P14045m74446m221j07938J72391l2413j46268j03230M11023j00411
13902A630624j78883j16763k326J6558k5683M1009k16822M11590m66468K94530
13892A387366Q0018j81997J32012O8497p0916j84859L24153m9972k15827J37908
13882A426383J63780j8658k60165J28492j93676j20707J43941R7265q7520N5870
$$ y = [2215696, 2031346, 1981870, 2273204, 2129387, 2243924, 2380235, 1946031, 1978004, 1781284, 1799308, 2332855, 1912530, 2136598, 1579039, 1883855, 1935718, 1645755, 1795993, 1877988, 2090104, 1747323, 1909610, 1973735, 1585239, 2142263, 1752579, 1679759, 1638134, 1540924, 1732683, 1707146, 1513656, 1988319, 1772448, 1475273, 1752685, 1644061, 1522277, 1428482, 1302092, 2016137, 1541691, 1537470, 1429532, 1601923, 1569510, 1423242, 1320012, 1731035, 1630624, 1451741, 1334978, 1332652, 1349210, 1323527, 1364536, 1147714, 1559304, 1092836, 1387366, 1467384, 1285387, 1417399, 1485896, 1414980, 1230121, 1554274, 1504302, 1288475, 1426383, 1590163, 1571505, 1311340, 1439832, 1246156, 1125449, 1269390, 1366655, 1279135, 1335005]
13872A335005j13578P9512k30837K97404L39562l27492k21833K7941j87057M18535
13862A417162l39670J93291k49594J86506l42836M08805J7376l60661M56354j37485
13852A249248q6156J58660k81203k4906J27083l36572O9488L45137k75020N1880
13842I97639j3822k5471j16443j1824K74720o4365o7295R6546k3907m4669L7570
13831A038679P9812l06024J53677K12164J413O2408m43803J75460k41313J51239
13821H83712j80838N93906p1680k12165l43813P3005M57536m78095N7469L26414
13811A105451j82343L8967m2302j23666K16432L1347k70769N0743Q8086K9666
13801I41612L4099l43997L17321m4879l34440J60770K06758J6714k83005Q3404
$$ y = [1335005, 1221427, 1300939, 1070102, 1367506, 1707068, 1379576, 1157743, 1185684, 998627, 1417162, 1077492, 1270783, 1021189, 1207695, 864859, 1273664, 1291040, 930379, 1386733, 1249248, 1163092, 1321752, 1040549, 1015643, 1142726, 806154, 875642, 1220779, 945759, 997639, 983817, 958346, 841903, 830079, 1104799, 1040434, 973139, 1069685, 1045778, 1001109, 1038679, 1118491, 812467, 966144, 1178308, 1179721, 1242129, 798326, 973786, 732473, 883712, 702874, 1296780, 1225100, 1012935, 669122, 742127, 1199663, 721568, 779037, 1105451, 923108, 962075, 919773, 796107, 1012539, 1043886, 773117, 823860, 911946, 941612, 975711, 631714, 949035, 904156, 569716, 730486, 937244, 953958, 670953, 754357]
13791G54357N4546J52940K75649n06035K28785j25999J141j61579J06615J1665
13781G92085K10189j91408J73149j12494m0281j4344L86656m6170E13555K86719
13771H00274j40582J26114P2153k25061L9827N20340n45102m0659M77626k65704
13761H19226M5323j90638j55354r4641J79635M1740j36447M2925J67077n7147
13751F61699M2818J33286l94413L26110R4427j00029J84614m35000J35830j84006
13741D65336R2001J12121r5205K84048q2197j14279k9568j01672j63714K43987
13731F10858k08059N40961D57463K42924j24843q7166J22023J20232r9543J7110
13721F48200p1340j94305M97540j68701n4652L5864k46685J00700J89222m9443
$$ y = [754357, 808903, 961843, 1237492, 731457, 960242, 834243, 835384, 673805, 780420, 792085, 1002274, 810866, 984015, 871521, 831240, 816896, 1203552, 1157382, 513555, 800274, 659692, 785806, 857959, 632898, 672725, 1193065, 647963, 607304, 1084930, 819226, 864549, 673911, 518557, 423916, 603551, 645291, 508844, 551769, 718846, 661699, 704517, 837803, 443390, 769500, 863927, 763898, 948512, 513512, 649342, 465336, 557337, 669458, 574253, 858301, 776104, 661825, 632257, 530585, 366871, 610858, 402799, 943760, 457463, 700387, 575544, 488378, 610401, 730633, 631090, 648200, 576860, 382555, 880095, 711394, 656742, 692606, 445921, 546621, 735843, 686400]
13711F86400j59632j53353N58982l55588j61050J71907J01602J61516k54290J97276
13701G93770A82259M18305j91903N9204J10948K87575l00243J21906l15158K29353
13691F02246B67850N4905L84963j09885k06407J24560L5843J66551B16444M18855
13681F35299o7781L33092B29007O33479j96219N4068B86468J13395K88672n4929
13671F33606k71440N71820r0755m18353J06636j17871K33471G6992N54512L8500
13661F70004K07051k93229j27386B16769K96483j61517J49393j09512j37320K27876
13651D82172K3003Q9444j70683J02628k5709M8635j60508j48118Q9146K84482
13641F14492j34178B20784M84276k39108J39116k87722j11024N43766k01427k60942
$$ y = [686400, 526768, 373415, 932397, 576809, 415759, 587666, 689268, 850784, 596494, 793770, 182259, 600564, 408661, 467865, 578813, 866388, 566145, 688051, 372893, 602246, 267850, 322755, 707718, 597833, 391426, 515986, 551829, 718380, 216444, 635299, 567518, 900610, 229007, 862486, 666267, 720335, 286468, 399863, 688535, 633606, 362166, 933986, 843231, 424878, 531514, 413643, 647114, 76992, 631504, 670004, 877055, 583826, 456440, 216769, 513252, 351735, 501128, 391616, 254296, 482172, 505175, 594619, 423936, 526564, 500855, 549490, 388982, 240864, 330010, 614492, 480314, 220784, 705060, 465952, 605068, 317346, 206322, 750088, 548661, 287719]
13631B87719o5047L69715q8360j67190L92905l62379J74495o0514K63991l08590
13621D36745O4415j54233M9597R7982j64526O6115M1502b2904E3700M03334k10370
13610B46664J26690Q973O5839J7203j22071j08353K45146j6503J89680k18746
13600D34522J00910k61838M55778B24982R1810r0918N5213N549N74k4139R696
13589B72767K83347j24098k3270j00097J47811j58880J65419J17237K0524k14576
13579C86184O1602J16202j50282K13917j73361j09788m539K56207o9729B15219
13568F83767k74490j31706M9395N7018l7504J43353j17516D5884J87259Q6653
13558C19796O4602n6934o0445K6492F384J63597L45918j61128j8725M45428B40200
$$ y = [287719, 222672, 592387, 504027, 336837, 729742, 367363, 541858, 481344, 745335, 436745, 501160, 346927, 396524, 494506, 329980, 396095, 437597, -22904, 53700, 457034, 246664, 373354, 382327, 448166, 465369, 343298, 234945, 480091, 463588, 653268, 434522, 535432, 273594, 729372, 224982, 316792, 225874, 281087, 286636, 287210, 263071, 272767, 556114, 432016, 408746, 308649, 456460, 297580, 462999, 580236, 600760, 386184, 447786, 563988, 413706, 627623, 454262, 344474, 339935, 596142, 526413, 215219, 683767, 409277, 277571, 326966, 383984, 346480, 489833, 372317, 45884, 233143, 319796, 384398, 327464, 267019, 293511, 6384, 169981, 515899, 354771, 336046, 781474, 240200]
13546C71563M0414g220B9255K9096K77985k0116l7183K16491k6003O5230I0304
13534D32560q6241E676L94905n566j09287K30177k09375A07114K73196j52955
13524B27355N7675K349K08504J6140O1169D9773L22426A77265o8723L86462p9328
13513D15676O2996r1460A11913K79670A49454J24236J68008O4012j19063E3825
13502B06575J9097A6589K81721J8798P0938A34175J04556K59039r4832A75716
13491B69633f5695B56982r0106J70700j55339R2828j37321o1716Q8438b4596A90391
13479D97629k10518B1170L11076J56072k22850J80540J14929j85648Q6491j20236
13469C41544I9260L44794B10246j03576e859E64401k18578J65198k34672j26040
$$ y = [371563, 411977, -7220, 29255, 58351, 336336, 316220, 279037, 495528, 469525, 534755, 90304, 432560, 346319, 5676, 400581, 395015, 285728, 515905, 306530, 107114, 380310, 227355, 285030, 287379, 495883, 512023, 573192, 49773, 372199, 177265, 108542, 495004, 415676, 478672, 387212, 111913, 391583, 149454, 273690, 441698, 505710, 386647, 53825, 206575, 225672, 16589, 298310, 317108, 388046, 134175, 238731, 497770, 402938, 175716, 269633, -65695, 256982, 166876, 337576, 182237, 275065, 137744, 76028, 164466, -24596, 190391, 497629, 287111, 21170, 332246, 488318, 265468, 446008, 560937, 375289, 461780, 341544, 99260, 444054, 210246, 106670, -5859, 564401, 345823, 511021, 276349, 150309]
13459A50309J66209O8061A04446a3988A30759L78546C1329L38772A28525R874
13449A38399N9786J83273j88171n7629k7824L67098j49044n1219A19497J50419
13439B69916N1799J17474A34433k9206K12955j20475K11047j18122J13988j00129
13429C04491I8547L4012E7266P5535L03837C7915J97057J11427j00466Q0606j20491
13418B06048A02959N0916K51507q4120A57436J40500H3109J82359P6412j14619
13408B27261F909J86905j0742K23334A20378J44531a84909A9622Q6556J02480
13398B08658K65546I6669K65954H7856K67412N9998r9564J20278q004F7691b6322
13386B45392q1019R9343N7435n2226N425j01803D007L41216q6965j04371R4677
$$ y = [150309, 316518, 384579, 104446, -13988, 130759, 509305, 31329, 370101, 128525, 138399, 198185, 381458, 193287, 135658, 107834, 474932, 325888, 274669, 119497, 269916, 321715, 439189, 134433, 105227, 318182, 197707, 408754, 290632, 404620, 304491, 98547, 132559, 57266, 132801, 436638, 37915, 234972, 346399, 245933, 326539, 206048, 102959, 153875, 405382, 321262, 157436, 297936, 83109, 265468, 341880, 227261, 6909, 193814, 183072, 406406, 120378, 264909, -184909, 19622, 106178, 208658, 474204, 96669, 362623, 87856, 355268, 415266, 315702, 435980, 427976, 67691, -26322, 245392, 164373, 263716, 321151, 268925, 274350, 172547, 4007, 345223, 258258, 153887, 248564]
13375B48564m3606q6525a20491B7255L52020A29835k1862b9423C54763M6871A98039
13363B37769j06466J35126b055A04525K43454m7749J99818A98952m562J73622
13353C68012A6660K47412H1595q360J43766L2611N8952A39339K24998j63014L92348
13342E93671B95961L12070A27116J74743K3181l3790n8063j4704D9697J77949
13332B27646o5583J85342j66438H52L12192j23328I0949K08657j44150A751g4525
13320B32880R9194K6973N4107j50105q3966p1571J82925P6798A68357J77148N370
13309C50875A25213a34902d8707E8010J2016d2655A11171J04050K1218j6148R2676
13298C12967c9626p1091B62085K8342L0610j25855I3798K36566r0557D3089L65040
$$ y = [248564, 204958, 118433, -120491, 27255, 379275, 129835, 107973, -29423, 354763, 401634, 198039, 237769, 131303, 266429, -2055, 104525, 347979, 300230, 500048, 198952, 194390, 368012, 16660, 264072, 81595, 73235, 217001, 249612, 308564, 139339, 364337, 201323, 593671, 295961, 608031, 127116, 301859, 325040, 291250, 233187, 218483, 49697, 227646, 162063, 347405, 180967, 852, 313044, 189716, 90949, 299606, 155456, 1751, -74525, 232880, 332074, 359047, 413154, 263049, 179083, 107512, 290437, 367235, 168357, 345505, 350875, 125213, -134902, -48707, 58010, 70026, -42655, 111171, 215221, 236439, 220291, 312967, -39626, -110717, 262085, 290427, 321037, 195182, 93798, 330364, 239807, 43089, 408129]
13287D08129N7647J28064A2902K63258a62991c5968G6960a33508H0278O2336M684
13276A47298c3253B61773F4091J79474J62492A69468B0364J55811k5274K20386
13266C71287a36499I3985J24636M1370E5507K50011q8102B9028Q1508J1979j9134
13255A03381K46934d0873B98786A42516L2418K57782A59315k1833E099L93722
13245C98821F4395k0500J80599K90549j12351j39944L0619l5126d2483B68798
13234a36702f2904A90583K12559j25302P4704b9454m7387j42113A6867J38419
13224A55286j1828J14461F5940b25048C18414k8659j32597N6363a7118G1532a08424
13212d8053F9286c4141B36265A00293i9179B68082E0026R2598J7346d4675A22190
$$ y = [408129, 465776, 593840, 12902, 276160, -162991, -35968, 76960, -133508, 80278, 142614, 147298, -33253, 261773, 64091, 243565, 406057, 169468, 20364, 176175, 150901, 371287, -136499, 93985, 218621, 259991, 55507, 305518, 217416, 29028, 110536, 122515, 103381, 350315, -40873, 298786, 142516, 174934, 432716, 159315, 137482, 5099, 398821, 64395, 43895, 224494, 515043, 402692, 262748, 293367, 258241, -42483, 268798, -136702, -62904, 190583, 403142, 277840, 352544, -29454, -76841, -218954, 16867, 155286, 143458, 257919, 65940, -225048, 318414, 289755, 157158, 213521, -17118, 71532, -108424, -48053, 69286, -34141, 236265, 100293, -99179, 268082, 50026, 142624, 159970, -44675, 122190]
13200C2695M8274a00339n8122D5969O7147K32621A07743R9118b5682B05352J10308
13189C15660B0875M03966K49301I3722Q0186K6776a20227C58749g8718C56386
13178B56959J55540j43936g8792A55886K17827B0577J13992a0361j31045B62978
13167B52331a37555C91319j91412b773B77349l195i5351A62242o6390P3873a51941
13155C78145j25319k8034b85672C10762l0539H9329A7222d3208l5357B8158K78303
13144C06461j17443J38102I7660l8281M9884L00706A30611K50642A83923P0190
13134B54113d4178B29268l3168H5833g2475B01236J05642J75897B04206P7413
13124B81619A20902a13137D5188a0612n7541L2172A90797n002j4464p7335K82860
$$ y = [32695, 80969, -100339, -158461, 45969, 113116, 345737, 107743, 206861, -25682, 205352, 315660, 20875, 424841, 674142, 93722, 173908, 200684, -120227, 358749, -78718, 356386, 256959, 412499, 268563, -78792, 155886, 373713, 20577, 134569, -10361, -141406, 262978, 252331, -137555, 391319, 199907, -2773, 277349, 274154, -95351, 162242, 95852, 169725, -151941, 378145, 252826, 224792, -285672, 310762, 280223, 89329, 17222, -43208, -78565, 28158, 306461, 189018, 327120, 97660, 59379, 109263, 409969, 130611, 381253, 183923, 254113, -44178, 229268, 196100, 85833, -72475, 201236, 306878, 482775, 204206, 281619, 120902, -113137, 45188, -10612, -68153, -35981, 190797, 185795, 171331, 93996, 376856]
13113C76856b883C6665M2060j6441Q5492C5885a78624A25464b36867A23098d0277
13101A73680a23745B4327K71480a72711A03572a03177b0821C71319j20060N5578
13091C06837o2456e8276j7036k9411D38094a65668A11613J69102j28628K87923
13081D40010A30022J04303J67250a04355A02936R3119c19757H4105a52359B03361
13070A53029b2644E964O3245B2907g8164N511j76288b7174P483A51584P4625L0754
13058B56963o8379k4671N0592G990g648A14474g6785B39672H3238C746d5003B87622
13045A7597J83988i9251a0932I3794a14837M5223A5539K72986P6540E3951J37966
13034A91917k1801E8672Q8036L31619f9045I5468P3138c9394A16027J99286J89262
$$ y = [376856, -2883, 36665, 78725, 62284, 147776, 35885, -178624, 125464, -236867, 123098, -40277, 173680, -123745, 24327, 295807, -172711, 103572, -103177, -20821, 371319, 251259, 306837, 244381, -58276, -75312, -104723, 438094, -165668, 111613, 280715, 152087, 440010, 130022, 234325, 401575, -104355, 102936, 196055, -319757, 84105, -152359, 203361, 153029, -22644, 5964, 69209, 22907, -78164, -72653, -248941, -27174, -19691, 151584, 226209, 256963, 188584, 163913, 214505, 7990, -7648, 114474, -76785, 239672, 83238, 3746, -45003, 287622, 17597, 201585, -99251, -10932, 93794, -114837, -69614, 15539, 288525, 365065, 53951, 191917, 170116, 58672, 146708, 478327, -69045, 95468, 168606, -39394, 116027, 315313, 504575]
13023E04575b34095B36739P9054d3278n0662G2648b40372B65064F2979K26769
13013B89748J26852b10114A29500g2848A70981g1764B13986A7286K81375j23447
13003A75214Q4705I7405a32137L513A68720g4111A23148d9973m9670A33298P941
12992A41239K50785b0059A21718n0903K701f0345D26093D1311a04680M0278n5475
12981a19877B8899J87807F1365R1312f6085j18210B15618j01064K21175A54019
12970a78753A21107j6235J09217a6231A07956K5697b2723A94322g5295J9000B0921
12958B97122H2804c4884j4138C70777B8332J04390M4962q3082r626K8291C7516
12946B56945I3051g9684C741J4007h719j42462A05156d6449j44045A09897a42777
$$ y = [504575, -234095, 236739, 315793, -43278, -93940, 72648, -240372, 265064, 62979, 289748, 416600, -210114, 129500, -72848, 170981, -71764, 213986, 17286, 298661, 175214, 259919, 97405, -132137, -128624, 168720, -74111, 123148, -49973, -99643, 133298, 141239, 392024, -20059, 121718, 70815, 73516, -60345, 426093, 41311, -104680, -64402, -119877, 28899, 216706, 61365, 152677, -66085, -184295, 215618, 114554, 335729, 154019, -178753, 121107, 104872, 214089, -16231, 107956, 133653, -22723, 194322, -75295, -56295, 20921, 297122, 82804, -34884, -49022, 370777, 28332, 132722, 177684, 94602, 84976, 113267, 37516, 256945, 93051, -79684, 3741, 17748, -8719, -151181, 105156, -46449, -190494, 109897, -142777]
12934G8663K76117a37717B99825K21932a37013J8288m5704A26736b56450A25549
12923a57699m7792B48566A1571K02502F7940b5100P232A88211G9784f1933a0188
12911E0455J08920k7433a24113F4615L22225e8793B70347a46187B27618k5423
12901B02195H5185N0023n5464b04952e7424A47595c4807j3208A76399K2494e4709
12889B36797A01327b54722I3460F559O5023J74830b94439B97094j04235a45478
12878G5354J24830D4795J80367f4653D12619M565a43824K9393A13786l5821a22594
12866c6379B93569m841j24363b0617G4800a33815c6442E669a69956I3637d3588
12854B97641k3317r5162A5870J4039J44236J25952i1265A42459J8081J53165j4744
$$ y = [78663, 354780, -137717, 299825, 521757, -137013, -118725, -164429, 126736, -256450, 125549, -157699, -205491, 248566, 11571, 214073, 67940, -25100, -17868, 188211, 79784, -61933, -10188, 50455, 159375, 131942, -124113, 64615, 386840, -58793, 270347, -146187, 227618, 202195, 85185, 135208, 79744, -204952, -57424, 147595, -34807, -48015, 176399, 198893, -54709, 236797, 101327, -254722, 93460, 6559, 71582, 246412, -294439, 297094, 192859, -145478, 75354, 200184, 44795, 225162, -64653, 412619, 417184, -143824, -114431, 113786, 77965, -122594, -36379, 293569, 288728, 164365, -20617, 74800, -133815, -36442, 5669, -169956, 93637, -43588, 297641, 274324, 179162, 15870, 29909, 174145, 300097, -91265, 142459, 160540, 313705, 298961]
12843B98961H3408A8636P7036B615c1918A44833M9921B0938K32466K7348a49766
12831B77118b86816g7817D29593A29700i0486D6009a50588A70096a86216j11927
12821b98143B1345h843B5594P1906a16048r2934B6408e0207E9894a12298k71764
12810c84062B29290a31424A70274J36133j22127d2505A31040b54624A68733f6770
12799b87964H4407N39495H0338a62771J4878G1523Q3818J22196j29110a46141
12788A30865a43714i527A18969O7580R0534e5651B54378J58639A95949c62617
12777g175j10916A3965a99949r4270e2636k18123J13876A4357a91181C20398B3978
12765D17020H6978A3139Q2710K64198B1605a74669g6094J210A15766b68724A57767
$$ y = [298961, 83408, 18636, 95672, 2615, -31918, 144833, 194754, 20938, 253404, 280752, -149766, 277118, -286816, -77817, 429593, 129700, -90486, 46009, -150588, 170096, -186216, -298143, 21345, -8843, 25594, 97500, -116048, -208982, 26408, -50207, 59894, -112298, -384062, 229290, -131424, 170274, 306407, 184280, -42505, 131040, -254624, 168733, -66770, -287964, 84407, 623902, 80338, -162771, -147893, 71523, 155341, 277537, 148427, -146141, 130865, -143714, -9527, 118969, 186549, 277083, -55651, 254378, 413017, 195949, -362617, -7175, -118091, 13965, -199949, -294219, -52636, -270759, -156883, 14357, -191181, 320398, 23978, 417020, 86978, 13139, 95849, 360047, 21605, -174669, -76094, -74884, 115766, -268724, 157767]
12753G4505K52151h2752A03650M61a6773A06816a1868k02449j11609G8230a35145
12741A88937h5458c6171j86192F1158b6352o4235f730B03892g8561j41011a08179
12729H3920N5117c34713B5105a9123B14191A7192h5894F0677J34669r1933N7186
12718A60599H678R8451n2683M2954d5590l49090D07206A01880N5648d05553J87629
12707b17924D4914J29001A1020J41433K33926l8917I5259O7675J24472l3294d3681
12695a10312B17607f6289F6725j9446j8440K0863p38O5106b12738A02970a15455
12683B33110K64441d3627I792M0965M2640h2948n1890m7102g7914I1682D2947
12671D996f2381k10526B88269A26185R7364a47300l3283D12686G1650K33431E4820
$$ y = [74505, 326656, -82752, 103650, 104111, -16773, 106816, -11868, -214317, -325926, 78230, -135145, 188937, -85458, -36171, -222363, 61158, -26352, -90587, -6730, 203892, -78561, -219572, -108179, 83920, 139037, -334713, 25105, -19123, 214191, 17192, -85894, 60677, 195346, 103413, 160599, 8678, 107129, 54446, 97400, -45590, -394680, 407206, 101880, 157528, -405553, -217924, 44914, 173915, 11020, 152453, 386379, 347462, 95259, 162934, 287406, 254112, -43681, -110312, 217607, -66289, 66725, 47279, 28839, 49702, 48964, 114070, -212738, 102970, -115455, 233110, 497551, -43627, 9792, 50757, 93397, -82948, -134838, -181940, -77914, 91682, 42947, 4996, -62381, -272907, 288269, 126185, 223549, -147300, -180583, 412686, 71650, 305081, 54820]
12659E8082K59530m9502r4030m0168J9853d0304l3492A40267J20956a98238A50791
12647I7561J60541I1926A355J02294l6625h5047C0367J24089F8919K10324p8689
12636B00554O5460E5657a47807A31068k1541J37725q9638M0832K92888e9427B73699
12624A82396q5142N6837J38268a39606C12096A55911b6349F6208N717J27643a10247
12612A45656i6142a1636p8415B57920r9586a26045A15247n5813J52211N7938e447
12600A89864i2409j04568B74758n4155D8556A2099L5177f4511B10615a85446G8744
12588A74932A9253J22309h0783o0281C23847A17838a78902d6558A70701F4324
12577a36363I2731h2942j48468A59968h5081j03468F1800b13585B04543i8502
$$ y = [58082, 317612, 268110, 174080, 133912, 153765, -40304, -73796, 140267, 261223, -198238, 150791, 97561, 258102, 91926, 1355, 103649, 67024, -85047, 30367, 154456, 68919, 279243, 200554, 266014, 55657, -147807, 131068, 109527, 247252, 157614, 198446, 491334, -59427, 273699, 182396, 97254, 154091, 292359, -139606, 312096, 155911, -26349, 66208, 71925, 199568, -110247, 145656, -96142, -11636, -90051, 257920, 158334, -126045, 115247, 59434, 211645, 269583, -5447, 189864, -92409, -196977, 274758, 220603, 48556, 12099, 47276, -64511, 210615, -185446, 78744, 174932, 19253, 141562, -80783, -141064, 323847, 117838, -178902, -46558, 170701, 64324, -136363, 92731, -82942, -231410, 159968, -85081, -188549, 61800, -213585, 204543, -98502]
12566a68181j41655A48293e6899m8163G970R5542K7188L7550l3618k7577a27230
12554I4578K7401n6395b0620C23248H1237a2331C25346A15655a86607A04676Q1411
12543A86087H5980B1381b10929e196F5063a68381B97686g8752A95058d7240B69089
12531b71044A50762a05692m2773g2311b0573F6271a22672E4153P52J34711J9715
12520B09331b69190I287f1431k0889D57781p7114e6388b3795q2883F6729l083
12509F3646L27960j67077a50734B33710j13882b05856A6312e8418j19823G5635
12498a00719A11280D2176a30268A13540e5705A13869f3183B80894o0277K953a1506
12486c4796n8860B51695A2607b4215H5725j1275a10611A59279Q3896f2745I3782
$$ y = [-168181, -309836, 148293, -56899, -105062, 7970, 103512, 130700, 168250, 134632, 107055, -127230, 94578, 121979, 65584, -20620, 323248, 81237, -12331, 325346, 115655, -186607, 104676, 186087, 85980, 21381, -210929, -5196, 65063, -168381, 297686, -78752, 195058, -47240, 269089, -271044, 150762, -105692, -148465, -72311, -20573, 66271, -122672, 54153, 54905, 189616, 209331, -269190, 9287, -61431, -82320, 457781, 380667, -56388, -23795, -106678, 66729, 63646, 391606, 224529, -150734, 233710, 119828, -205856, 16312, -58418, -178241, 75635, -100719, 111280, 42176, -130268, 113540, -55705, 113869, -63183, 280894, 220617, 223570, -11506, -34796, -93656, 251695, 12607, -24215, 85725, 74450, -110611, 159279, 243175, -62745, 93782]
12474B7202K6518A7973M61668d1651F72377a29678G1977K44519c46866J11565
12464b35301c5256C61620d8707F0040K05154A2423J45718i0896j60708I2873K13576
12453C06449j3691b52226e8470l0435k09944I9121a73545B39211b02244C5093
12442H6685J7403a51791A67704b7647I2317f5739H6620m2114K24537o339a70906
12430b84476d5605A12574E0271d7378H3746C0175a59686H4084C0443N0338J13868
12419A94649B7826c1913D8851b92165B05087a43136q9292E2806c157j67703a7916
12407A15527k8248i6836m6611d9558n563A54590l8865f8819l8813n1847A71500
12395H9434b1782C63223f6060j5039B33475A5877d3540k217k81031J26051c4741
$$ y = [27202, 53720, 17973, 479641, -41651, 672377, -129678, 71977, 316496, -346866, -235301, -35256, 361620, -48707, 60040, 265194, 12423, 158141, -90896, -251604, 92873, 306449, 292758, -252226, -58470, -88905, -298849, 99121, -173545, 239211, -202244, 35093, 86685, 104088, -151791, 167704, -27647, 92317, -65739, 86620, 44506, 269043, 262704, -170906, -284476, -45605, 112574, 50271, -47378, 83746, 30175, -159686, 84084, 30443, 80781, 194649, 27826, -31913, 48851, -292165, 205087, -143136, -232428, 52806, -3157, -170860, -17916, 115527, 87279, -96836, -143447, -49558, -55121, 154590, 115725, -68819, -107632, -159479, 171500, 89434, -21782, 363223, -66060, -81099, 233475, 15877, -43540, -45757, -326788, -200737, -34741]
12383I3791L4682P1879L2391D5980L02923a59251g9024j95021M2723M7586A00908
12371A66779i2569e50I1881J6437A6716a30036I4841l5125a80360A50388m1666
12360A08722J35382a60925b8601A5541R8475R1451L8558H2412J62711l9080A2549
12348a29584B30825H2696C6703a14621A05385M1682g2596K0030G4286N1075a54684
12336A01297C3421J64728h4728l0753B51045e8495b4180A0433K23697D379P5793
12325H0172J10588A3644q15d8129q6008A93110i0552C10238a42337a6497B9807
12313A76475q736a35046j61725J10037j6995A69656d7280Q948p4605n9244A01397
12301D8269h3837A38802b61351a20388e7503B53531F8414A583M45221E2461P9812
$$ y = [93791, 128473, 200352, 232743, 45980, 348903, -159251, -79024, -274045, -231322, -183736, 100908, 166779, -92569, -550, 91881, 108318, 16716, -130036, 94841, 59716, -180360, 150388, 108722, 244104, -160925, -28601, 15541, 114016, 205467, 244025, 82412, 245123, 206043, 12549, -129584, 230825, 82696, 36703, -114621, 105385, 147067, -72596, -52566, 74286, 125361, -154684, 101297, 33421, 198149, -84728, -115481, 251045, -58495, -24180, 10433, 234130, 4379, 80172, 190760, 13644, 12829, -48129, -134137, 193110, -90552, 310238, -142337, -16497, 29807, 176475, 167739, -135046, -296771, -186734, -203729, 169656, -47280, -38332, -112937, -172181, 101397, 48269, -83837, 138802, -261351, -120388, -57503, 253531, 68414, 1583, 446804, 52461, 132273]
12290A32273k1440J85241B6468a26412B01002C8363a97979g1423k38323a07443
12279A35515Q012j9132B2583e1611A72677A7912M0589J58558c009j1356p1032
12268h5397D5054a2195F0483K53222F1386A8001K97239g4138j54430F891b51983
12256e1072j43912B91301D2442K1353c35811B60803K22506A55081d9577b842C99802
12244A33891o4164J51162a57437D0489J579K3827R9798o9685a733B30614q4275
12233A46339J74228j17827F6755a90396P0574A18507j5644D1984J2387h8084H997
12221f180q5341A91591e3324E8016J48114n0006E6425K98637E3538L8675f909
12209I9286J36991J0227A6940b7016o8488B40462d317B14256A8040K40381G2096
$$ y = [132273, 110833, 296074, 26468, -126412, 201002, 38363, -197979, -71423, -309746, -107443, 135515, 143527, 124395, 22583, -51611, 172677, 17912, 58501, 217059, -3009, -14365, -85397, 45054, -12195, 60483, 313705, 61386, 18001, 315240, -74138, -228568, 6891, -251983, -51072, -194984, 291301, 42442, 63795, -335811, 260803, 483309, 155081, -49577, -2842, 399802, 133891, 69727, 220889, -157437, 40489, 42068, 65895, 165693, 96008, -1733, 230614, 146339, 320567, 202740, 66755, -190396, -119822, 118507, 102863, 41984, 54371, -88084, 8997, -6180, -91521, 191591, -53324, 58016, 206130, 156124, 56425, 355062, 53538, 92213, -6909, 99286, 236277, 246504, 16940, -27016, -95504, 240462, -4317, 214256, 18040, 258421, 72096]
12197e5383E19796B26710m9852J89777P381A64420a8404j14379C6629K3354Q1789
12186A41772e7661J0210j43730A791K90424c52291B45792A6800J10463K27621
12176C54884b23450l5121C29796K54151A7640L63345A29052b7308a030k54948
12166b55978g4146I1013O5307B9867K43324A03168m4241d6555b0269A18816b52816
12154a24602A13531Q3699C7765J2801N99944h4893F6867Q8781p3189k8868K6740
12143H0331O8203Q7388J99249G5147O4221d01243C75743A69586c04226O5060j02321
12132c41487f9210l7954M7787j46481B5330b4829q6794k2768b4995F7836Q8628
12121A56464a32962A79414M7588a89142C9559a75738B94031p3570b71892f8434
$$ y = [-55383, 519796, 226710, 176858, 366635, 374016, 164420, -18404, -132783, 36629, 59983, 141772, -57661, -47451, -191181, 1791, 292215, -352291, 245792, 16800, 127263, 354884, -223450, -258571, 329796, 583947, 17640, 380985, 129052, -27308, -1030, -255978, -74146, 91013, 156320, 29867, 273191, 103168, 58927, -46555, -20269, 118816, -252816, -124602, 113531, 197230, 37765, 50566, 650510, -84893, 66867, 155648, 82459, 53591, 80331, 148534, 235922, 435171, 75147, 139368, -401243, 375743, 169586, -304226, -239166, -341487, -69210, -107164, -59377, -205858, 25330, -24829, -111623, -134391, -24995, 67836, 156464, -132962, 179414, 227002, -189142, 39559, -175738, 294031, 220461, -271892, -68434]
12110A7601J16700L3391a31357A26211b00766O3394D77688k25974A10195J09523
12100B19718k3773c31215B01216m2197k6853b22475b1428B90146a88388a5345
12089B21443H7165K54477H8845E622J53921J88739E7005b7262F9142c25714B58125
12077A56591k1294A0587a89171k9662C55011a4735j41856e4954n5763c0842J0982
12066a9860j00916G3873D89M47913K53570O78108D66455A14795b5745m1502E1301
12054b9786A03367a92012M1879K8834E2036J07361b20847A38292m8707J33765
12044B23350B1619a14223M1023m4463B3659c76520J75091F2592Q41L42202A30862
12032a70175B2789R4464b3037n2463G7831R8529p3020a19967l5295k03916C04674
$$ y = [17601, 134301, 167692, -131357, 126211, -200766, -137372, 477688, 251714, 110195, 219718, 195945, -331215, 201216, 159019, 132166, -222475, -21428, 290146, -188388, -15345, 221443, 87165, 341642, 88845, 5622, 159543, 348282, 57005, -27262, 69142, -325714, 258125, 156591, 135297, 10587, -189171, -218833, 355011, -14735, -156591, -54954, -110717, -30842, -19860, -120776, 73873, 489, 448402, 701972, 1380080, 466455, 114795, -25745, -67247, 51301, -29786, 103367, -192012, -150133, -121299, 52036, 159397, -220847, 138292, 89585, 223350, 21619, -114223, -73200, -117663, 23659, -376520, -201429, 62592, 63433, 405635, 130862, -170175, 22789, 117253, -23037, -75500, 77831, 176360, 103340, -119967, -155262, -359178, 304674]
12020F2604J30594d45311c6990k43024a15650n9399m1709J08101c0232A480a82772
12008A25191J16685a23310G8055d52812a38714O5002n0709A31884M37719E4194
11997a48986O4398B79362q1288B7579K0654c63105C07533c2336j08454C2860a28365
11985a99046A04697k7844b80130D90503C6515a13168B7396J902M8086e9432b4165
11973A01546a36059A06575a69878Q1590D6344g0907j26279I161a44397m3106Q2726
11962a04777M3151C6958N437J0402d7421B3633c7564C1546d8353M442D285a23648
11949B66361g148j20921A042M850a93956d7504H634K13839b79271I8814b92819
11937a34007B86546E015J63034n1478f2077b2149B09919I374M930J58216a5851
$$ y = [62604, 193198, -445311, -36990, -280014, -115650, -175049, -216758, -108657, -30232, 1480, -182772, 125191, 241876, -123310, 78055, -452812, -138714, -73712, -124421, 131884, 569603, 54194, -148986, -84588, 279362, 198074, 27579, 48233, -363105, 307533, -32336, -140790, 32860, -128365, -199046, 104697, 76853, -280130, 490503, 36515, -113168, 27396, 29298, 77384, -59432, -24165, 101546, -136059, 106575, -169878, -88288, 46344, -70907, -197186, 9161, -144397, -187503, -104777, -61626, 36958, 42395, 52797, -47421, 23633, -37564, 31546, -48353, -43911, 4285, -123648, 266361, -7148, -128069, 1042, 5892, -193956, -47504, 8634, 222473, -279271, 98814, -292819, -134007, 286546, 5015, 168049, 116571, -62077, -22149, 209919, 9374, 14304, 172520, -15851]
11925i3434j34009J2350Q4291B47559G9586M3228A872P0932a62894A05703c534
11913b73430D2818a45400M2286k77911F9220i2656C1171N493a58781B30414h4608
11901A09978e4465j56364C06644c65639a46902c1216r0558M6721j21532f0047
11890b5698A75023q2373r639a25334M1912b9108k27830e4701h159j75593A2849
11878A2424i4429A29733E2d365p362A85987b32304B7931e1759j01925e1983A64541
11865D9013N4095a47590A41608c0287k04553A5880c19642J10488J3602Q644C36093
11853f5669B50979d1286A41957b74814B09466f7180j62316A05027c25198F4966
11842H2228f4258K5355k03226n1432L7445Q8246M9592C15249a33544q7242j32734
$$ y = [-93434, -227443, -215093, -130802, 247559, 79586, 122814, 1872, 72804, -162894, 105703, -3534, -273430, 42818, -145400, -103114, -381025, 69220, -92656, 31171, 36664, -158781, 230414, -84608, 109978, -54465, -210829, 306644, -365639, -146902, -31216, -121774, -75053, -196585, -60047, -25698, 175023, 92650, 83011, -125334, -83422, -29108, -256938, -54701, -8159, -183752, 12849, 12424, -94429, 129733, 52, -4365, -11727, 185987, -232304, 27931, -51759, -153684, -51983, 164541, 49013, 103108, -147590, 141608, -30287, -234840, 15880, -319642, -209154, -195552, -186908, 336093, -65669, 250979, -41286, 141957, -274814, 209466, -67180, -229496, 105027, -325198, 64966, 82228, -64258, -38903, -242129, -293561, -256116, -167870, -118278, 315249, -133544, -220786, -353520]
11831c53520B67597b86101g1753H0889a56948A32509B9474b17894j21525e2542
11820D2895a45175e5004j63773i060C8680h670q9353A98444a17319l8719d8229
11808b1167j4178j5636k8821A29893h6970A48805N4352l6901G7912J08138a06020
11796A87126A7532N2053B3512a44813L6381C22899A40118b59271A04615h459q3760
11785i2219n1358k7237B0048a14692A62843B8278a0536A99392b7299j58363J8470
11774a67192B78774g3120I6058N6073j6471i877o3195F564i145B42259C2823J12360
11762A45183o3189a41105b3287A86539j1921c4908A13551C3665f2497C30510A42165
11750f870j14826I0263J83818i6488m62R514k7833A1439O5749d00745A15077B0105
$$ y = [-353520, 267597, -286101, -71753, 80889, -156948, 132509, 29474, -217894, -339419, -52542, 42895, -145175, -55004, -218777, -9060, 38680, -8670, -98023, 198444, -117319, -156038, -48229, -21167, -35345, -50981, -79802, 129893, -86970, 148805, 203157, 166256, 77912, 186050, -106020, 187126, 17532, 69585, 23512, -144813, -108432, 322899, 140118, -259271, 104615, -8459, -92219, -143577, -170814, 20048, -114692, 162843, 28278, -10536, 199392, -27299, -185662, -167192, 278774, -73120, 96058, 152131, 135660, -9877, -73072, 6564, -9145, 242259, 32823, 145183, 81994, -141105, -23287, 186539, 174618, -34908, 113551, 33665, -62497, 330510, 142165, -6870, -121696, 90263, 274081, -96488, -96950, -87436, -115269, 11439, 77188, -400745, 115077, 20105]
11737A14596K3416Q503b14262B86612F6514a74326b3975k9676j13326K8728c1211
11725A46104d87564d5450A76269j8489a98892j32040G7141a17199K8626B2066
11714B28019A07392b03136N4338k691m7653i8252A20976h2238o8758A21604a05344
11702A73843c2229q903I5017M658a9620B05970a64869A78277K2135a01400A8840
11690a804B2167c97048k2143a842B14966A1870M1777a04235n4824C82171d7263
11678E1037a69695F7884a37919o1014E69i3510B7546J68138a25899I3922L3539
11667A27461d5056p4585E4174J4640k4821b67496i7862A39750b99747a909A04716
11655B36494r6686D7246K60258o1919p8943M834G8903a05361C4239f7291m9727
$$ y = [114596, 138012, 146515, -214262, 286612, 66514, -174326, -23975, -53651, -166977, -138249, -31211, 146104, -487564, -45450, 176269, 157780, -198892, -330932, 77141, -117199, -88573, 22066, 228019, 107392, -203136, -148798, -151489, -199142, -98252, 120976, -82238, -150996, 121604, -105344, 173843, -32229, -41132, 95017, 99675, -19620, 205970, -164869, 178277, 200412, -101400, 18840, -1804, 22167, -397048, -419191, -1842, 214966, 11870, 53647, -104235, -159059, 382171, -47263, 51037, -169695, 67884, -137919, -198933, 569, -93510, 27546, 195684, -125899, 93922, 127461, -45056, -119641, 54174, 68814, 43993, -267496, -97862, 139750, -299747, -1909, 104716, 236494, 139808, 47246, 307504, 245585, 166642, 171476, 78903, -105361, 34239, -67291, -117018]
11644a17018k70123R900C0416b30864B42074d0851A53607l6446a26991k69702
11634c96693a73834h3494q3404A79154J65707b3918q4471B00516n4311A3261Q6300
11623I9561c0650B72964a98888N2624L4767e751j89196A90366G1536J83281A17841
11611b53284J02309A1081C19f9928o2087d8806A88568d9427m983b0077l4706q1070
11599a35853A73862p7663a24329b5640j98837B14496k6666J43906b07042J0533
11589a96509B17785o4360b36197d3780r8218j52294Q3964M8964F1307g3073J7305
11578e5768o5112k27182a707p89A76375a40400A70431g1227B2599J20063i7419
11566A3986O8866b3274C03740b17417A55972C473J88973J2066E6601h7147d1555
$$ y = [-117018, -387141, -377241, 30416, -230864, 242074, -40851, 153607, 117161, -126991, -396693, -173834, -83494, -166898, 179154, 344861, -23918, -108389, 200516, 146205, 13261, 99561, -30650, 272964, -198888, -146264, -111497, -5751, -194947, 190366, 71536, 254817, 117841, -253284, -150975, 11081, 319, -69928, -132015, -48806, 188568, -49427, -54410, -20077, -54783, -135853, 173862, 96199, -124329, -25640, -224477, 214496, 187830, 331736, -207042, -196509, 217785, 153425, -236197, -43780, -141998, -294292, -210328, -161364, 61307, -73073, -55768, -120880, -348062, -1707, -2496, 176375, -140400, 170431, -71227, 22599, 142662, -97419, 13986, 82852, -23274, 303740, -217417, 155972, 3473, 192446, 204512, 56601, -87147, -41555]
11554f7034B22861H5021K912a93569C36592G9763g8774j43119E9509J27214B0379
11542b83062A52369L79834k51114b38273d8447D7426K31607b19576N6505j48251
11532c11322J50078b9410F3750a65585A18267c52363d9749B44420a21216C47555
11521G3880J0585J52322F466b05751R8000L4983C21055b4859E11208A50148c10812
11509h610j04765d4532k1488B8266M1913b1059B40264b46959H7738J2206K80884
11498C80828E6248K38758K6315e0101A47189n1838J94471j40987K0942a04675
11487A8087J52273a30988L8787B98018f2235B95643C0780b0024B43322r8132a57891
11475e302A54102e8937l2904F0388i7677F0209c1668E3654f7514A85054K11336
$$ y = [-67034, 222861, 85021, 87933, -193569, 336592, 79763, -78774, -221893, 59509, 186723, 20379, -283062, 152369, 532203, 281089, -238273, -48447, 47426, 279033, -219576, -163071, -311322, -161244, -29410, 63750, -165585, 118267, -352363, -49749, 244420, -121216, 347555, 73880, 84465, 236787, 6466, -205751, -107751, -72768, 321055, -24859, 511208, 150148, -310812, -8610, -113375, -44532, -66020, 28266, 70179, -21059, 240264, -246959, 87738, 99944, 380828, 56248, 295006, 321321, -50101, 147189, 95351, 289822, 148835, 169777, -104675, 18087, 170360, -130988, -92201, 298018, -62235, 295643, 30780, -20024, 243322, 145190, -157891, -5302, 154102, -58937, -91841, 60388, -97677, 60209, -31668, 53654, -67514, 185054, 396390]
11464C96390D0984J72874M4356j19358h0176f913l15515A32165O6713o0025D9467
11452B66824A2614Q0432l4761J92011a83445H1240a1360B03992E2277Q8547N5579
11441A96403m424c0334j33067m2163A07853N6338c4355C17677B8655M12780l0996
11430D10439a79864A50840d0283C5602a33832b6518n2751j48966I4097e2772F3227
11418e8848F2697a3612E0295a83085E3640e4372n8618M6993K8674p7658A39851
11406a21606p0490B25341J4200G3364E077a42146A57853b09975J0393f3282C03156
11394A39070F5869b35456E7474j0725K34314B1552K36834J44978F6701J39897
11384B06598e811o0395C07529a34413j56702a14604B34762d7666r0063f724j03830
$$ y = [396390, 40984, 213858, 258214, 138856, -80176, -6913, -322428, 132165, 198878, 138853, 49467, 266824, 12614, 93046, 58285, 250296, -183445, 81240, -11360, 203992, 52277, 140824, 196403, 191979, -30334, -163401, -205564, 107853, 164191, -34355, 317677, 28655, 441435, 410439, -179864, 150840, -40283, 35602, -133832, -26518, -79269, -228235, 94097, -52772, 63227, -58848, 62697, -13612, 50295, -183085, 53640, -54372, -112990, -65997, -37323, -114981, 139851, -121606, -192096, 225341, 239541, 73364, 5077, -142146, 157853, -209975, -199582, -63282, 303156, 139070, 65869, -235456, 57474, 46749, 281063, 21552, 258386, 403364, 66701, 206598, -5811, -66206, 307529, -134413, -291115, -114604, 234762, -47666, -137729, -6724, -110554]
11373a10554o386A83260a94038O4306j07327J05249n0966D0793J66380b44456
11362i6424A37071a49789A14816c69983f9590b9304A02435b6705E782M8153B5378
11350F3296A3730b24301j65539A41357E7748a0423A23331E5126b31345c463j65040
11339a68503A8113b25554I77K39142I8022R5263a49671L9798B10645p5616Q8280
11328B23309E8524d62655B4033J5186b61114A30674a74761L0392k2682A86609
11317b52311B00174G0863O524a75727q32D2612a51312k2168G6142J40971E0201
11305A57883h9614r464p8683O7175F8712i8439c3366A51880i1619p3133K1372
11294a43380k39455A10856M3098c98548N8350a5449l0380p1548k76986b311k60109
$$ y = [-110554, -116940, 183260, -194038, -129732, -237059, -131810, -182776, 40793, 207173, -244456, -96424, 137071, -149789, 114816, -369983, -69590, -29304, 102435, -26705, 5782, 53935, 25378, 63296, 13730, -224301, -389840, 141357, 57748, -10423, 123331, 55126, -231345, -3463, -168503, 18113, -225554, 977, 240119, 98022, 193285, -149671, -109873, 210645, 135029, 223309, 58524, -462655, 24033, 39219, -261114, 130674, -174761, -144369, -167051, 186609, -252311, 200174, 70863, 77387, -175727, -176559, 42612, -151312, -173480, 76142, 217113, 50201, 157883, -89614, -99078, -177761, -110586, 68712, -98439, -33366, 151880, -91619, -164752, -143380, -382835, 110856, 153954, -398548, -340198, -15449, -45829, -117377, -394363, -2311, -262420]
11283b62420a22032A8083g2047m9356j54468E358C65c3420B07092C2113C572a97471
11270A42222b27027D24966a00980n3088A68291F4468p517K71655G538O4041K41932
11259C13511a83802j0583d6993A44911a21269d9931j02130a6762B10258b27546
11248e597A95669n0780b88775E9288h1319j10513B40266i2271I2360a2544A41533
11236b19995L3799g3581l14514J54897A72455l7478D9473K7009R6809a55641A79446
11224d9841r0786A10044b83447P7438e497A0093e1261J6172A33926J39719H2548
11212A25259b5383j80337P9899f354A47252b6035k83867B8012J15507n7266b23271
11200I7163M5832m3971h1016A52564c44734a30701G5660h2846A99836b32189C6849
$$ y = [-262420, -122032, 18083, -72047, -121403, -275871, 5358, 365, -33420, 207092, 32113, 3572, -197471, 142222, -227027, 424966, -100980, -154068, 168291, 64468, 56951, 328606, 7538, 71579, 313511, -183802, -194385, -46993, 144911, -121269, -49931, -152061, -16762, 210258, -227546, -5597, 195669, 144889, -288775, 59288, -81319, -191832, 240266, -92271, 92360, -12544, 141533, -219995, -186196, -73581, -388095, -233198, 172455, 134977, 49473, 76482, 173291, -155641, 179446, -49841, -140627, 110044, -283447, -206009, -5497, 10093, -51261, -35089, 133926, 273645, 82548, 125259, -25383, -205720, -125821, -6354, 147252, -26035, -309902, 28012, 143519, 86253, -223271, 97163, 142995, 99024, -81016, 152564, -344734, -130701, 75660, -82846, 199836, -232189, 36849]
11188C6314j7114P8613a8002B22387A03162J5544J5899a15577j00607c412I1164
11176b7776j39906m858K2095C5701J8451a43508A15958i1818j55515A34316b85718
11164e2060A13995N3656a22812E1431a38438M8447F8287a83594L1100d4770A72984
11152a65558c4680l5638D0693g3099K2278c050C13694a72248N0457c806j3691
11141a7497k547C20800c00189J01136j12203a33261C0941J21127B524K14402P1121
11130B88047A39551a52430A29736K7745J82786B9766L81037d6496B50008o2750
11120A87258o5584k8579r037j6857g2310R264C062J4026J01805l4208J48778n1755
11108A81708K67870j18028B9688h0618D52956k15845M8623b01295A15326n0661
$$ y = [36314, 19200, 97813, -18002, 222387, 103162, 118706, 134605, -115577, -216184, -3412, 91164, -27776, -167682, -172540, -150445, 35701, 54152, -143508, 115958, -91818, -247333, 134316, -285718, -52060, 113995, 167651, -122812, 51431, -138438, -89991, 68287, -183594, -152494, -44770, 172984, -165558, -34680, -70318, 40693, -73099, -50821, -3050, 313694, -172248, -121791, -3806, -17497, -20044, 320800, -300189, -199053, -311256, -133261, 30941, 152068, 2524, 216926, 288047, 139551, -152430, 129736, 157481, 340267, 29766, 410803, -46496, 250008, 187258, 121674, 93095, 84058, 67201, -72310, -63046, 3062, 17088, 118893, 84685, 233463, 181708, 449578, 331550, 29688, -80618, 452956, 237111, 285734, -201295, 115326, 64665]
11098F4665J85163a64780C91389A2630K56644a01232d9956C6043J14632F6783
11087A64174i0147I8414J27390a1374A54252B3051L95176D3955J01843O1407m5953
11076A61252o0720a44487B69960J03855j13100G7073Q5167M5841O3272B8815M09972
11065D38787j92594J16067k3241J7563K03224k2376j32664J2574A75832L6897
11055B12729L22032K2258L2196K06381J26389l78144J09369n943j71011J36540
11045F12796Q3486r6911j80932M0189J05297k4413k21453L33944p6621M1426K9929
11034F46737j08186J22704l6809k98248L87361k72624R4241K40790j37452A33252
11023G45565j69210r9827j17200M10549l63759J51953B46227J84520J49263k71935
$$ y = [64665, 249828, -164780, 391389, 12630, 269274, -101232, -49956, 36043, 150675, 66783, 164174, -90147, 98414, 225804, -11374, 154252, 23051, 418227, 43955, 145798, 207205, 161252, 100532, -144487, 269960, 373815, 260715, 77073, 162240, 208081, 271353, 28815, 438787, 246193, 362260, 339019, 356582, 559806, 537430, 404766, 417340, 175832, 212729, 534761, 557019, 589215, 795596, 921985, 543841, 653210, 647267, 476256, 612796, 696282, 599371, 418439, 458628, 563925, 539512, 318059, 652003, 575382, 616808, 646737, 538551, 661255, 624446, 326198, 713559, 440935, 535176, 775966, 638514, 133252, 745565, 576355, 476528, 359328, 769877, 406118, 558071, 246227, 430747, 580010, 308075]
11013C08075M52069p74j19373M9389l39035n7837K06054J08885k22689K44252
11003F29016k61790J69687j04254J87884k18348R1449k14907J93825J46653j37181
10993D82034o2423L16318B75135K97445M629J13786k14527L75320K36819m82177
10983F06430J89408J90963J13246k73418L06190L3617J09588M48811L20679L12252
10973B357766n6321J86440p3241J53743o01141L3672Q1789n17189j56881m13236
10963I95401k09339Q6948p5817k54177L45632j15654L770k6515j86432Q3180n1572
10952E95425J8699P0519A29796M09427k57288A32805b0628j02993B23091d8019
10941A96097L0400b30180A35772J51111J7587K16241c38905A53082c91394A71070
$$ y = [308075, 760144, 759370, 639997, 689386, 350351, 292514, 498568, 607453, 384764, 629016, 367226, 536913, 432659, 620543, 402195, 493644, 278737, 472562, 619215, 482034, 419611, 735929, 275135, 572580, 577209, 690995, 476468, 851788, 1088607, 606430, 795838, 986801, 1100047, 826629, 1132819, 1166436, 1276024, 1724835, 2045514, 2357766, 2301445, 2487885, 2414644, 2568387, 1967246, 2000918, 2082707, 1565518, 1408637, 995401, 786062, 873010, 797193, 543016, 888648, 772994, 776764, 750249, 563817, 646997, 595425, 614124, 684643, 129796, 539223, 281935, 132805, -20628, -123621, 223091, -48019, 196097, 226497, -230180, 135772, 286883, 304470, 520711, -338905, 153082, -391394, 171070]
10930B43666g5604C53837J31844B0083J43151K9477i752k1471B1016a56094O4504
10919i1590n1865F4446Q5612c14627B75325B1268f8527A76534E427i5215L6516
10908e8699A43075d57789B15848a78001h4714A69494d3710A73522e1607p9587
10898a31194E1558p116R6819b27683A23114K88542C3321f3435n6042k35971A50007
10886B5561d6471C5480B718M2371N2298b63381I5137a09153F7129J78263a78k31175
10874b31353l15430A04561c1907B9762J09209K09733b523l1735C8130J0612h3288
10862A32926F4175K18669a12866m9982I9239A3706b82264a07505n4260I0736D2409
10850C6787f64495a03479b0563m0287K2061F0488J2858a49355E0647i1153q4916
$$ y = [243666, -75604, 353837, 485681, 20083, 163234, 192711, -9752, -31223, 21016, -156094, -91590, -143455, 64446, 150058, -314627, 275325, 21268, -68527, 176534, 5427, -95215, -58699, 143075, -457789, 215848, -178001, -84714, 169494, -43710, 173522, -51607, -131194, 51558, 44442, 141261, -227683, 123114, 411656, 33321, -63435, -119477, -355448, 150007, 25561, -46471, 35480, 2718, 45089, 97387, -263381, 95137, -109153, 67129, 245392, -178, -231353, -546783, 104561, -31907, 29762, 138971, 348704, -2523, -34258, 38130, 48742, -83288, 132926, 64175, 282844, -112866, -162848, 99239, 13706, -282264, -107505, -161765, 90736, 42409, 36787, -664495, -103479, -20563, -60850, -38789, 60488, 73346, -149355, 50647, -91153, -176069]
10839a76069a5570D662a08452C07803a75928E6111a31903C2099a44533A51121
10828b7701j87588i3942o2884H1420a15945A0391d9448k73503F0424a61751j06462
10817b68213a00025K3492a7452k24087F8576d07213R6830A57673J85777c26792
10806b98420A72036b90805a27202K6218j64542g870k05985a03370G1138R915c90918
10794b03278A79609a86727P2338j77905C13804C5083J4913j6874a04592a936A43548
10782b2448j26072B6775b70073g1337Q097M376k03869f7329A55638J56577l4671
10771B77544a60032b1397j6504A00864J06648a35965a8734j21548A47205c7175
10760a58053L0279r442K7652c1163B27647r8644B3715L29020b20280a5877D0147
$$ y = [-176069, -15570, 4662, -108452, 307803, -175928, 56111, -131903, 32099, -144533, 151121, -27701, -215289, -93942, -156826, 81420, -115945, 10391, -49448, -322951, 60424, -161751, -268213, -100025, -76533, -17452, -241539, 68576, -407213, -310383, 157673, 343450, -326792, -298420, 172036, -290805, -127202, -100984, -265526, -7870, -213855, -103370, 71138, 81053, -390918, -203278, 179609, -186727, -114389, -292294, 313804, 35083, 49996, 33122, -104592, -1936, 143548, -22448, -148520, 26775, -270073, -71337, -63240, -58864, -262733, -67329, 155638, 312215, 277544, -160032, -21397, -37901, 100864, 207512, -135965, -18734, -140282, 147205, -37175, -158053, -127774, -137216, -109564, -31163, 227647, 129003, 23715, 352735, -220280, -15877, 40147]
10748g6208L6313G5967N8420c8195A10782L8758a67335A49869d01316J8865a37636
10736B61802A7053O762G310b05117C87839A19136i5135q209e1069A09247a45718
10724A40287b92202J04155A54116a26875j27320A86008a08011C6604Q9696J13437
10714B39737H8835J95204F2388a10182L5574r5430C97482A71124a12894J7637
10704i5257c5120k43131k51216B91667a22071C8933K4373a99039j71007J39641
10694b30405B06206d033B36524A12130h1435c6864j45175C5828a50218N5930m6852
10683a41140j07902D71377a00073j47924B7755a77652I944a28856j160B15718
10672f5784B54730c76415A53290a8670A96146b0291D6357a93103a8533j56675
$$ y = [-76208, -39895, 75967, 134387, -38195, 110782, 149540, -167335, 149869, -401316, -382451, -137636, 261802, 17053, 23815, 7310, -205117, 387839, 119136, -95135, -103344, -51069, 109247, -145718, 140287, -292202, -188047, 154116, -126875, -254195, 186008, -108011, 36604, 126300, 239737, 88835, 284039, 62388, -110182, -74608, -170038, 397482, 171124, -112894, -95257, -35120, -278251, -529467, 291667, -122071, 38933, 63306, -199039, -370046, -230405, 206206, -4033, 236524, 112130, -81435, -36864, -182039, 35828, -150218, -94288, -141140, -249042, 471377, -100073, -247997, 27755, -177652, 9944, -128856, -130016, 215718, -65784, 254730, -376415, 153290, -18670, 196146, -20291, 46357, -193103, -18533, -175208]
10662a75208o9319J03526a1823C74590i2102A42683o1281a2948D520g4647j23163
10651a97810B09243c2424A62571G9394J01647J27622c18677A67070J94628a70535
10640A81059k1457E1166a2838D7636a807l92687j69994A00599m0354R9189a64490
10628H068f745r067l9863r1860d9521C79600a03183l29851K08804B78144D2434
10616c31477C0225b0270j07692D6834d2932k34747P9771q162c9273Q720l65688
10605c96241G6821K14390G0880a30224Q919l0326N6397j88788A77131B6258c55133
10593a58051A98152a33351B4860j0169b4703H6849N206e9675k85544A39655a2998
10581a78651P1570M4410B04674i6216j5427j20011D255a6970p4324k021k0585
$$ y = [-175208, -244527, -141001, -11823, 374590, -92102, 142683, 81402, -12948, 4520, -74647, -197810, 209243, -32424, 162571, 79394, 181041, 308663, -318677, 167070, 361698, -170535, 181059, 159602, 51166, -12838, 47636, -1807, -394494, -564488, 100599, 60245, 159434, -164490, 8068, -6745, -15812, -55675, -147535, -49521, 379600, -103183, -433034, -224230, 278144, 42434, -331477, 30225, -20270, -127962, 46834, -42932, -277679, -197908, -206070, -39273, -30553, -396241, 76821, 291211, 70880, -130224, -121305, -151631, -95234, -284022, 177131, 26258, -355133, -158051, 198152, -133351, 24860, 14691, -24703, 86849, 92055, -59675, -345219, 139655, -12998, -178651, -107081, -62671, 204674, -96216, -111643, -231654, 4255, -16970, -91294, -93315, -113900]
10570a13900e5622q7587c3426B40664A5817c6024k39546A26956a73780g8827C3050
10558c19785B4718c58438a76400f261G189N1000K87583o5255c54421a27808c5591
10546D0170J06383C7627K97290n4028d97338A79342j3857a1533j32739f5287n6570
10535a21857A61016k9809d03580a65796e8454m316I436a29550k01493a56315a6283
10523B05261a92482A9553h9110H0895a29957C666f7637B75570a51173g4056k7877
10512a01933j07106P2283o0145h8514m5649E6926J08050e7707k33068g4787R737
10501f5050j3800A524R0705g7897D3258N9486d48158I9058C0252P4276O2073K9489
10489A96090a43519j32171B06129f6936A21840K6377E0743C285d65407a79004
$$ y = [-113900, -55622, -143209, -33426, 240664, 15817, -36024, -275570, 126956, -173780, -78827, 33050, -319785, 24718, -358438, -176400, -6261, 7189, 58189, 345772, 280517, -354421, -127808, -35591, 40170, 146553, 37627, 334917, 280889, -497338, 179342, 165485, -11533, -144272, -65287, -121857, 161016, 131207, -403580, -165796, -58454, -62770, 9436, -129550, -331043, -156315, -16283, 205261, -192482, 19553, -89110, 80895, -129957, 3666, -67637, 275570, -151173, -74056, -101933, -209039, -136756, -196901, -88514, -134163, 56926, 164976, -57707, -290775, -74787, -65050, -78850, 1524, 92229, -77897, 43258, 102744, -448158, 99058, 30252, 104528, 166601, 196090, -143519, -275690, 206129, -66936, 121840, 148217, 50743, 3285, -465407, -179004]
10478a56489I9436d3702B40976j06997d68785B7506J20438F5116a32960m45321
10468e78281I533K43447h3105j5093F5442c9730o9054r3545A28177b63105c7013
10456a16660J3924K4027L2752k3890r8745N1623K3787a5026k50915B13500E6524
10444b3678q0442A07321J80680r6373b98912f3541E764c34303B720N1695a83130
10432d1875B41416A11998M1613a73001n6397i0789A85355C8604b7118d592A3830
10420c4057C06933b47489H5475j6895P7327a9818A2131J7077J3775A838d65809
10408F6989j5776K40835G2875R7010d7071j3663l6572b119j58045A52179c861
10396h5866r287D1236L07708a52046F056a55168b3918r350E9374L3076J0750J94316
$$ y = [-156489, 99436, -43702, 240976, 133979, -468785, 27506, 147944, 65116, -132960, -578281, 9533, 252980, -83105, -98198, 65442, -39730, -108784, -202329, 128177, -263105, -37013, -116660, -102736, -78709, -45957, -69847, -168592, -116969, -93182, -15026, -265941, 213500, 56524, -23678, -104120, 107321, 288001, 191628, -298912, -63541, 5764, -334303, 2720, 54415, -183130, -41875, 241416, 111998, 153611, -173001, -229398, -90789, 185355, 38604, -27118, -4592, 13830, -34057, 306933, -247489, 85475, 68580, 145907, -19818, 12131, 29208, 42983, 1838, -465809, 66989, 51213, 292048, 72875, 169885, -47071, -60734, -97306, -2119, -160164, 152179, -3861, -85866, -95153, 41236, 348944, -152046, 6056, -155168, -23918, -33268, 59374, 92450, 103200, 297516]
10384B97516J11123I4235J52984K17137R7510A5642R7654C7076M77210a17901
10373C18709O2074m0164a1392D4019K59670J0929J70389j52957R609A63576J10055
10362B73631H5829b9538B69576a56125B5441N32J64967J51864D7626J85617J53952
10351C87195O2310J89930j98155L8453A20616K85626j71144J65102A39786a09099
10340F400e8245D4100K87363N6430f5867A50929p2741k0472a88293B56967F4a7819
10327C72603F1979g1769A56438K20632n1942c10102D28066a1282A34963m06J18840
10316B53397r4057b60664N1503M0639j51786f3848B04410b32591A62857p0664
10306I2193a82061N0556D8840i7064j22652m7060f6998C47981a8519j10154K4891
$$ y = [297516, 408639, 94235, 247219, 464356, 561866, 15642, 113296, 37076, 514286, -117901, 318709, 380783, 340619, -11392, 44019, 303689, 314618, 485007, 332050, 341659, 163576, 273631, 85829, -29538, 269576, -156125, 25441, 25973, 190940, 342804, 47626, 233243, 387195, 449505, 639435, 441280, 479733, 120616, 406242, 235098, 400200, 139786, -109099, 6400, -58245, 44100, 331463, 387893, -65867, 150929, 78188, 57716, -188293, 256967, 64, -17819, 372603, 61979, -71769, 156438, 377070, 325128, -310102, 428066, -11282, 134963, 134557, 253397, 159340, -260664, -209161, -168522, -320308, -63848, 204410, -232591, 162857, 92193, -182061, -131505, 48840, -97064, -219716, -266776, -66998, 347981, -18519, -128673, -103782]
10295a03782j89121B43744e4518F5286b71996j5989C8074a65177D33517c69653
10284a36142A27604b24847g7927M161B13429a85423B53361E8712A8336b16321
10273h6347c9585j64099H5918R9927c09824J17678A4581b2295l34050A68652q0864
10262H7788a729C7416K25276a15937A27631F2137o911f0349D3743R9524F9323
10250B5163O0451e5360j92361C29802c56306h7105j1326k65433J57689H6170a81153
10238b05169D2723b83453F8117R6267a80693Q2310j01272q5342E8040B1913b25032
10226b6535j76813f8705C2352R0544d52711b10508d8314A5487b39718j7259B49393
10214a78655B62181B2985J29055d0052j10802k4752m9207d4162F141i438C22229
$$ y = [-103782, -292903, 243744, -54518, 65286, -271996, -287985, 38074, -165177, 433517, -369653, -136142, 127604, -224847, -77927, -73766, 213429, -185423, 253361, 58712, 18336, -216321, -86347, -39585, -203684, 85918, 185845, -309824, -192146, 14581, -22295, -356345, 168652, 87788, -1729, 37416, 262692, -115937, 127631, 62137, 55226, -60349, 43743, 143267, 69323, 25163, 85614, -55360, -247721, 329802, -356306, -87105, -98431, -363864, -206175, 86170, -181153, -205169, 42723, -283453, 68117, 164384, -180693, -98383, -199655, -284997, 58040, 21913, -225032, -26535, -203348, -68705, 32352, 122896, -452711, -210508, -48314, 15487, -239718, -256977, 249393, -178655, 262181, 22985, 152040, -40052, -150854, -175606, -224813, -44162, 6141, -9438, 322229]
10202A36983l8786c1501B34501a88281j65118H9376k4824J09235b08406f8660
10191a22954D4906d4492C7731b01713a0727k64636J27291f2217k24037J1307L9883
10180b35064L463G5513a13627C07838a23862A68215l7178b20176A33423a53930
10169a35881j84254A73939a2022A02279b9305j34281A8852K99172b86162P7870
10159b08292D3595K52701a02030j02659D970Q6808k1585b86424J35592A18153
10148d3237A47200k4511a27409j00550i9890q8785F6871b57718A6315R2418b57450
10136d29237E5312B4974J07937a18713F815M8502a23553L1793A59302E3753L7202
10125I0955r071b6990k3199a1344q1657A45850a10263l16783J44422a35824B6688
$$ y = [136983, 98197, -31501, 234501, -188281, -353399, 89376, 64552, 173787, -208406, -68660, -122954, 44906, -44492, 37731, -201713, -10727, -275363, -148072, -62217, -286254, -274947, -235064, -231601, 75513, -113627, 307838, -123862, 168215, 131037, -220176, 133423, -153930, -135881, -320135, 173939, -12022, 102279, -29305, -163586, 18852, 318024, -286162, -208292, 43595, 296296, -102030, -204689, 4970, 91778, 70193, -286424, -150832, 118153, -43237, 147200, 122689, -127409, -227959, -99890, -188675, 66871, -257718, 16315, 108733, -257450, -429237, 55312, 24974, 132911, -118713, 6815, 55317, -123553, -91760, 159302, 53753, 90955, 81884, -26990, -50189, -11344, -93001, 145850, -110263, -427046, -282624, -135824, 26688]
10113a97746L1631F3365b60168A22907a44523j4814B40292c17568i9562A37024
10102B89748H1343b86579e4168B4021a85750A28816J7194g2236k03794L0296j2065
10091b57799C27175d8194C58697r4109o5016D6322g8984j00053L8132j47289h1325
10079c5912k70801h0633m488k49876g7926F7175a28036d68m5813A0231L51668
10068C61899J23096b11042o2742i8049H8534l7388J298d9882A32119f5750A26198
10056d3607j49276e7995H3962A2594O2291J38467e4167j16183M4292J4655H0942
10044A49905C4168b55729I682d7897n6674d5731B7395H212K8766O5147O4811b21852
10031b40318K7045m3257Q0150n421k6281j49653J03550E2472A5365b97290p5189
$$ y = [-197746, -166115, 63365, -260168, 122907, -144523, -159337, 240292, -317568, -99562, 137024, 289748, 81343, -286579, -54168, 24021, -185750, 128816, 146010, -72236, -276030, -245734, -257799, 327175, -48194, 358697, 264588, 199572, 46322, -78984, -179037, -140905, -288194, -81325, -35912, -306713, -80633, -85121, -334997, -77926, 67175, -128036, -468, -46281, 10231, 361899, 484995, -211042, -273784, -98049, 88534, 51146, 52444, -49882, 132119, -65750, 126198, -43607, -192883, -57995, 83962, 12594, 74885, 213352, -54167, -170350, -126058, -111403, 80942, 149905, 34168, -255729, 9682, -47897, -104571, -45731, 27395, 8212, 36978, 102125, 166936, -221852, -240318, -213273, -256530, -176380, -181801, -208082, -357735, -254185, 52472, 15365, -297290, -372479]
10020c72479e6396j19014M1787d3188G6476a48110J6917N0322k79514J71240c1606
10008b0820n5587a9284A63274J39941a74490g6255j52701d5834A08624B3769k443
9997B1326K12707B4043P700e37116i1875H1524J10149b71380h3506B17626a26858
9985a23853J5163c7503E5802a76654j02663L6213D8632j5072d8373j70482B05078
9973H5651a11413A44990a54691a4339k4577j82350k60978B31625b00321A48706
9962d49147P5782R5367a37442B86326C934b20470a08543J9057O950m3940l0687
9951a57163j2845n5678A09368c02639g1361C8890g8961J0758p6187P1170b3480
9939b2838l0409q8809j38362A97158d9069q9265k11215f3950J360F8390J52900
$$ y = [-372479, -56396, -175410, -133623, -43188, 76476, -148110, -131193, -80871, -360385, -189145, -31606, -20820, -76407, -19284, 163274, 303215, -174490, -76255, -228956, -45834, 108624, 23769, 21326, 234033, 24043, 31743, -537116, -91875, 81524, 191673, -271380, -83506, 217626, -126858, -123853, -108690, -37503, 55802, -176654, -279317, -243104, 48632, 33560, -48373, -218855, 205078, 85651, -111413, 144990, -154691, -14339, -38916, -221266, -482244, 231625, -200321, 148706, -449147, -373365, -277998, -137442, 286326, 3934, -220470, -108543, -89486, -82536, -126476, -157163, -170008, -225686, 109368, -302639, -71361, 38890, -78961, -68203, -144390, -73220, -23480, -22838, -53247, -142056, -280418, 197158, -49069, -138334, -349549, -63950, -62590, 68390, 221290]
9928B21290F3659b5984l533B37243a24495A962O8803A2572b4879B3368a18273
9916A8761b2145E1151b13604A84954a34732F8572c15633a03193k26999h4136C81266
9904b04592J3401B57583C9727J74503J78443a02884j11187A29138a83420A04208
9893B04700h9291l5952e5206k76615f3424p0680e6322A03622j6897b5537A3488
9881c89747i4091j81885R9281o0223B30085b70660h9495i189l8266F6927M7369
9870A14296i5544k43479e3365r9749A95984a37542j30949A03269a68732B11967
9859F3389q024J53850b38164H3370J25901p8278L23341G1128g1763b7014A36017
9847a66819l3568f9589m1931G4204N004a33349k45504g0445q8384j47445D30603
$$ y = [221290, 63659, -25984, -29517, 237243, -124495, 1962, 70765, 12572, -24879, 23368, -118273, 18761, -22145, 51151, -213604, 184954, -134732, 68572, -315633, -103193, -330192, -84136, 381266, -204592, -191191, 257583, 39727, 214230, 392673, -102884, -214071, 129138, -183420, 104208, 204700, -89291, -125243, -55206, -331821, -63424, -134104, -56322, 103622, 86725, -25537, 13488, -389747, -94091, -275976, -176695, -236918, 230085, -270660, -89495, -9189, -47455, 66927, 114296, -95544, -339023, -53365, -153114, 195984, -137542, -268491, 103269, -168732, 211967, 63389, 55365, 209215, -238164, 83370, 209271, 130993, 454334, 71128, -71763, -27014, 136017, -166819, -200387, -69589, -111520, 74204, 79208, -133349, -378853, -70445, -158829, -306274, 430603]
9835a11662O323b2487j5437J8070E213e0925k30469k1202J46456A54403A6487
9823B02547a03521a5582D0202g2085K5963k00987e9433k6396o8779f322D8485
9811B10857D8276b18595p8961f2161m17075a3055m7179k15444N8950A83580a63904
9799E444a12167G2850b03493I1777i8229j00308I9598b05602K8060A39448c75687
9787B26940D6691a52264A43271c8036H9045b79452a37691A59996l543a0308k78276
9776b88584j17621a25516a4634A94442h876j25019A33833c15400a669k7632r566
9765c8867q8649A18924a63472K6819L6582B19496b61713A21476a84136H8539A3601
9753a9247B3070h3067A30487a95486l06295J62078g8182N688a5388C9527a74676
$$ y = [-111662, -105339, -22487, -37924, -19854, 5213, -50925, -281394, -302596, -156140, 154403, 16487, 202547, -103521, -15582, 40202, -72085, -46122, -247109, -59433, -85829, -154608, -6322, 48485, 210857, 48276, -218595, -297556, -62161, -479236, -13055, -60234, -275678, -216728, 183580, -163904, 5444, -112167, 72850, -203493, 91777, -98229, -198537, 99598, -205602, -177542, 139448, -375687, 226940, 46691, -152264, 143271, -38036, 89045, -279452, -137691, 159996, 156453, -10308, -288584, -406205, -125516, -14634, 194442, -8876, -133895, 133833, -315400, -1669, -29301, -38867, -127516, 118924, -163472, -136653, -100071, 219496, -261713, 121476, -184136, 88539, 13601, -19247, 23070, -83067, 130487, -195486, -501781, -339703, -78182, -72494, -15388, 39527, -174676]
9741b26872f1846j26833l6367g4941A54910h9789M2039B57155c93584f728A04088
9729d19043a8971C38266A44031b26268a01057q2785p4096A01875d58407d2167
9718c07580a16648L4760F549c6274m4118k9320H8236a07435C6247a54197B13695
9706C12735G3710a0193j76099G8040a65535j9958a8358A82685d35995J47645k251
9695b90601A93003a46126K3171j94100C05266b27322E6357K1274d3454j9612l60330
9684d23396i1270A15675c17259q247q431J61633H8903b158q5209A46392c23850
9672F0745a42056F7705O5988B8107f6695q585p0454I9903O3711L5939D5493L81924
9660D27417a23941j99946B13666g4799j37680a01140A80697a63725B53594J25993
$$ y = [-226872, -61846, -188679, -225046, -74941, 154910, -89789, -47750, 257155, -393584, -6728, 104088, -419043, -18971, 338266, 144031, -226268, -101057, -183842, -257938, 101875, -458407, -42167, -307580, -116648, -81888, 6549, -36274, -80392, -109712, 88236, -107435, 36247, -154197, 213695, 312735, 73710, -10193, -186292, 78040, -165535, -185493, -18358, 182685, -435995, -288350, -290601, 193003, -146126, -122955, -317055, 305266, -227322, 56357, 77631, -43454, -63066, -423396, -91270, 115675, -317259, -325506, -333937, -172304, 88903, -2158, -87367, 146392, -323850, 60745, -142056, 67705, 133693, 28107, -66695, -75280, -145734, 99903, 163614, 199553, 45493, 427417, -123941, -323887, 213666, -74799, -212479, -101140, 180697, -163725, 253594, 379587]
9650C79587c42535B1595A0457J47872a2518n4567A22894g4368F3611b00405j46960
9639c47365B28397f9044l48145B32694b44112J12485I0127b72644b9360r0724
9629a20084e8937a3383m4014B64925d4489o0242B105i2325K3659q4046b1006B30479
9616b31853a5126B84424k813C5576g744o8906D0531c96179J62819I8654D5456
9604a7254k5512B1428Q0125d065n0416l3051B0769J50173E4721g8879j36595F6765
9591b12869A9603a45993p1590A28881b13242g5654A95682r2609l9937a38986K0704
9580a18282j11416j92290J05617a45163D10913f6349m9708L5615C13932b0964
9569i3071B04534c05592A37388F4968e3299l674N93j79628F8701a80000d3965
$$ y = [379587, -342535, 21595, 10457, 158329, -12518, -67085, 122894, -74368, 63611, -200405, -347365, 228397, -69044, -417189, 232694, -244112, -131627, 90127, -272644, -29360, -120084, -58937, -13383, -57397, 264925, -44489, -104731, 2105, -92325, -68666, -152712, -21006, 230479, -231853, -15126, 284424, 281611, 35576, -7744, -76650, 40531, -396179, -233360, 98654, 45456, -17254, -42766, 21428, 101553, -4065, -54481, -87532, 20769, 170942, 54721, -78879, -215474, 66765, -212869, 19603, -145993, -217583, 128881, -213242, -75654, 195682, 103073, 63136, -138986, -118282, -229698, -421988, -316371, -145163, 410913, -66349, -116057, -80442, 313932, -20964, -93071, 204534, -305592, 137388, 64968, -53299, -56973, -56380, -236008, 68701, -180000, -43965]
9557i8648I7852a29934q0246A2627a75021a7603j13247D1508P6749h027k01562
9546b09589g6445I2587N5925i748n2130A28235a13480A07833g9039k29661A0682
9534c16492B26466o685a96020G3692g1815B18282e7604k25311P8996n0849c8910
9522A91709a07187B83764H8511a4066A42029a78628q5938F4254A3205J20350o5180
9511F8375a12649n5440A8003f9083k8978j14663E0170j7788J31265c34125h621
9499b47789M9970L631A1572g2011p1446F937c95002J96073C08059j45398c41969
9487h6234C8922b55772a03167E8141b398E835M067J2274a67303a117j52591M8870
9475a04838l48292a7165k42576A18311a26604m3362C6316b44449f9583B93013
$$ y = [-98648, 97852, -129934, -210180, 12627, -175021, -17603, -130850, 41508, 118257, -8027, -209589, -76445, 92587, 148512, -9748, -61878, 128235, -113480, 107833, -79039, -308700, 10682, -316492, 226466, 219781, -196020, 73692, -71815, 218282, -57604, -282915, -203919, -254768, -38910, 191709, -107187, 283764, 88511, -14066, 142029, -178628, -264566, 64254, 13205, 133555, 68375, -112649, -168089, 18003, -69083, -98061, -212724, 50170, 32382, 163647, -334125, -8621, -247789, -197819, -194188, 11572, -72011, -143457, 6937, -395002, -198929, 308059, 162661, -341969, -86234, 38922, -255772, -103167, 58141, -2398, 5835, 9902, 22176, -167303, -1117, -153708, -104838, -453130, -17165, -259741, 118311, -126604, -169966, 36316, -244449, -69583, 293013]
9464A17336g51B03651G025a06597n5865f6887k80494J32111K6350p0120e9305
9452b17580R2328A60852a1625j31320j45293d7647j18178a3879A73111c29504
9441A68588J10264b31072A45568E0159g5381A24747a13011B31902F8767K52103
9431C20870a98144g1364B4718J30698p3056J4010a44178A56818a7320o0866A02196
9419i4077k67136K167A79194b26056A20499J5041a53574N3960D4510a24644K3297
9408a01347n3840F2857a3204l8627j76188G3359L00938a30411B7942R7182a02548
9396A85833e9450j30356i4678j3372G7904c53516B064J52010k4839N20b20984
9384E0166B4020i1217n8968r9218i5552p5889C4670L4171f1057k61796e6598k258
$$ y = [117336, -751, 203651, 7025, -106597, -162462, -66887, -347381, -215270, -188920, -259040, -59305, -217580, -125252, 160852, -11625, -142945, -288238, -47647, -165825, -13879, 173111, -329504, 168588, 278852, -231072, 145568, 50159, -75381, 124747, -113011, 231902, 68767, 320870, -198144, -71364, 24718, 155416, 82360, 96370, -144178, 156818, -17320, -78186, 102196, -94077, -361213, -359046, 179194, -226056, 120499, 135540, -153574, -99614, 44510, -124644, -101347, -155187, 62857, -13204, -51831, -228019, 73359, 374297, -130411, 27942, 125124, -102548, 185833, -59450, -189806, -94678, -108050, 77904, -353516, 2064, 154074, 129235, 129755, -220984, 50166, 24020, -91217, -150185, -249403, -95552, -171441, 34670, 68841, -61057, -322853, -56598, -58856]
9372e8856l28695J67111R1920a2963j0492I1372m1284O4788c1974l01321a00167
9360b41933k1016a21165A23751J42775b38153f0307n3516D069Q7064g8167A81697
9348b7975k24426b6584a0265B22958c33056a8360A8420O503J17427o0339b48481
9336A21354B7794e3570A11213b53665A72064b42756H3464M23737h6887K2582E8002
9324I7083J06171d0038l7952k33592b5184k0887D8059K6160c910p5643j8507p5758
9312a73818K1518C534L87409A44642g7312j19863b7787j05877A91647b55625k0565
9301b76190A2689J01982c7966q3573C01185C467b31453A26713a10384K69j17519
9290b27634o1804B61683E4125i7010k6446c3323E5150b88531A33165a91120N4249
$$ y = [-58856, -387551, -220440, -128520, -12963, -23455, 91372, 50088, 114876, -31974, -333295, -100167, -241933, -262949, -121165, 123751, 266526, -238153, -60307, -113823, 4069, 91133, -78167, 181697, -27975, -252401, -26584, -10265, 222958, -333056, -18360, 18420, 24923, 142350, 82011, -248481, 121354, 27794, -53570, 111213, -253665, 172064, -242756, 83464, 507201, -86887, -64305, 58002, 97083, 203254, -40038, -77990, -311582, -25184, -46071, 48059, 74219, -3910, -79553, -98060, -173818, -152300, 3534, 390943, 144642, -77312, -197175, -27787, -133664, 191647, -255625, -276190, 12689, 114671, -37966, -121539, 301185, 3467, -231453, 126713, -110384, -110115, -227634, -289438, 261683, 54125, -97010, -123456, -33323, 55150, -288531, 133165, -191120, -136871]
9279a36871B75830c71843D60776h23j47074n0909F2182B1154J78826i6807A2772
9267g1663A65142m4751O7221a10983H6067b0489j69855f3451A46547a46186c8793
9255B7842J8460b63262R362i7587l61939H159J68136F8652b08192j14452J03863
9244b18781o7949J30505g7961a1646k38509a1216j5337G8875J71109f6002m6666
9233a12668l67802B84117c0845p4549m3517f1351n0817j14205A02882P8191a96340
9221h9627r0864A5405a95390B1163h8979B5781b92647B23440o0142C0463b26358
9209a80179f3035j73730G738K09909a91481A0170b90792B51925j06541m0617b11778
9197b34869B78247A38425n5181Q9142B350J4713f8568j12394h6937n7553J6615
$$ y = [-136871, 275830, -371843, 460776, -823, -147897, -198806, 62182, 21154, 199980, -96807, 12772, -71663, 165142, 120391, 187612, -110983, 86067, -20489, -190344, -63451, 146547, -146186, -38793, 27842, 46302, -263262, -253900, -97587, -459526, 8159, 176295, 68652, -208192, -322644, -218781, -286730, -156225, -77961, -11646, -250155, -11216, -26553, 78875, 249984, -66002, -112668, -480470, 284117, -30845, -105394, -148911, -61351, -112168, -226373, 102882, 181073, -196340, -89627, -180491, 15405, -195390, 21163, -88979, 25781, -292647, 223440, 163298, 30463, -226358, -180179, -63035, -236765, 7738, 217647, -191481, 10170, -290792, 251925, 145384, 104767, -211778, -234869, 278247, 138425, 83244, 172386, 2350, 17063, -68568, -180962, -86937, -144490, -127875]
9186a27875m4392f8109B6170h085l9335H7834J4194C1783J45995c00494A0293
9174b79232H2402a12926B91759a79833A14051d9602D4219J66792g2866q6279C8637
9162A00321J40481a45990j40976B7607K0061K555A5385b40491J06214d2692A21719
9150E5909a2424A73657C9054L2594i1114l22114a19330R798A76302l3578c11833
9138D0221e6296p3121H748a63241N7137k83637P0583A02901j6935a35656B9086
9126A36944a62361A96920b17614A73908B7393a13055H9357a4953n8061j23825
9116a96839Q0005k17822A56379i7704C61376k5994A19333Q9150q5417b19831D5042
9104F3307a55672P4625n0771N4239j19840F0415J89114q4801c9894l7389C0147
$$ y = [-127875, -172267, -68109, 26170, -8085, -47420, 87834, 102028, 31783, 177778, -300494, 10293, -279232, 82402, -112926, 291759, -179833, 114051, -49602, 44219, 211011, -72866, -159145, 38637, 100321, 240802, -145990, -286966, 27607, 47668, 50223, 15385, -240491, -134277, -42692, 121719, 55909, -12424, 173657, 39054, 71648, -91114, -413228, -119330, -109532, 176302, 142724, -311833, 40221, -56296, -129417, 8748, -163241, -106104, -389741, -319158, 102901, 85966, -135656, 29086, 136944, -162361, 196920, -217614, 173908, 27393, -113055, 89357, -14953, -73014, -196839, -116834, -334656, 156379, -97704, 361376, 335382, 119333, 208483, 123066, -219831, 45042, 63307, -155672, -81047, -131818, -77579, -197419, 60415, 249529, 164728, -39894, -77283, 30147]
9092f2910o664b3572k4939j84589h6050n0654j80874a1482j22055A35538b1318
9080B4343h5803C7344K05108a25394B01475d3365A62072a97664C19874a87971
9069b00941Q6724n42291A04898h4580c8939k42544l5073E8759e35557C6247b05587
9057B30377a31430C72485b34708A95388I5096c03520A47065n7835c8683o0285
9047i8968j9414j48157g0610b931q6890a0935n4049A23631l2295c76928B2092
9035B53681a89541M3269A44726d30581G4024b09643i2610K077j80686k7589B18007
9023a33564e2251A42303L9518a62772B1555b20633A47621g0655A18927L51116
9013D70043c9248k05891O9508A27598K95485A8133b05418A17305A382b41847a05499
$$ y = [-62910, -69574, -23572, -48511, -233100, -86050, -136704, -317578, -11482, -133537, 135538, -21318, 24343, -85803, 37344, 242452, -125394, 201475, -43365, 162072, -197664, 319874, -187971, -200941, -114217, -656508, 104898, -84580, -38939, -281483, -316556, 58759, -535557, 36247, -205587, 230377, -131430, 372485, -234708, 195388, 95096, -303520, 147065, 89230, -38683, -98968, -118382, -266539, -70610, -2931, -89821, -10935, -64984, 123631, 91336, -376928, 22092, 253681, -189541, -146272, 144726, -430581, 74024, -209643, -92610, -90533, -271219, -298808, 218007, -133564, -52251, 142303, 181821, -162772, 21555, -220633, 147621, -70655, 118927, 470043, -39248, -245139, -175631, 127598, 423083, 18133, -205418, 117305, 1382, -241847, -105499]
9001f92118f1123j17075A9644b31908G6036f463K495l31976J25619h5441c7214
8989B50513e7691j44269d8365B46887F945L1632O9431D1605b38170N8504b4989
8977h3889G3381a36766l6271L9980j49637i2844A08415B3890a2823j26890A14028
8965a19020A70066m9332a79208H6578h4848C97632A54487i5722A35575a61155
8954d7010q2578q6206D435J19886d2548l2293D7601b4901k1010A00313a0365j12161
8942a22526a9711C8311i8100M2405j87230A06879M5441L26371P087b07384B58044
8930A68970K05726h7185H6236B003M30478M77518R70602J733506P258768J0620212
8920B1493087E638185A704040G20127J13434A65411n656R7376m3590a58345A36752
$$ y = [-692118, -61123, -178198, 19644, -231908, 76036, -6463, -3968, -335944, -210325, -85441, -37214, 250513, -57691, -201960, -48365, 246887, 6945, 38577, 108008, 41605, -238170, -179666, -24989, -83889, 73381, -136766, -173037, -133057, -282694, -92844, 108415, 23890, -12823, -139713, 114028, -119020, 170066, 120734, -179208, 86578, -84848, 397632, 154487, -95722, 135575, -161155, -47010, -129588, -215794, 4435, 124321, -42548, -74841, 47601, -24901, -45911, 100313, -10365, -122526, -19711, 38311, -98100, -55695, -242925, 106879, 152320, 478691, 485778, -207384, 258044, 168970, 374696, -87185, 86236, 2003, 432481, 909999, 1880601, 3614107, 10872875, 21493087, 5638185, 1704040, 720127, 833561, 165411, 159755, 257131, 213541, -158345, 136752]
8909a80343C00283K21659B17110B6449L750J29916e5608a2687k07335A00869a17263
8897a67323d7261l69345C51096b12510B7322J75311p4840I77M8511J27578a94521
8885a73626g4060j8816A57707F4982J12819a80593B53620E8109P454J98768h8114
8873A63428f9155a0592p8945k31019D51111g125H1964a82413B57897q3318G4617
8861F8391a25211a5297o476F8421a40590B49566a01018m9911P4895l86121A38589
$$ y = [-180343, 300283, 521942, 217110, 26449, 30199, 160115, -55608, -12687, -220022, 100869, -117263, -167323, -47261, -416606, 351096, -212510, 27322, 202633, 127793, 977, 49488, 177066, -194521, -173626, -74060, -92876, 157707, 64982, 177801, -180593, 253620, 58109, 65563, 264331, -88114, 163428, -69155, -10592, -89537, -320556, 451111, -7125, 81964, -182413, 257897, 174579, 74617, 68391, -125211, -15297, -21773, 68421, -140590, 249566, -101018, -150929, -76034, -462155, 138589]
$$ [...]
##END NTUPLES=NMR SPECTRUM
##END=
