##TITLE=AC1503_INDRS13310_8125488_1tnHXh314G
##JCAMPDX= 6.0         $$ Bruker NMR JCAMP-DX V2.0
##DATA TYPE= NMR SPECTRUM
##DATA CLASS= NTUPLES
##ORIGIN= BRUKER
##OWNER= Administrator
$$ 1.72 TOPSPIN		Version 2.1
$$ 2013-08-15 21:05:17.408 -0700  Administrator@X
$$ Compression mode = diff/dup
##.OBSERVE FREQUENCY= 400.02188249412
##.OBSERVE NUCLEUS= ^1H
##.ACQUISITION MODE= SIMULTANEOUS (DQD)
##.ACQUISITION SCHEME= undefined
##.AVERAGES= 64
##.DIGITISER RES= 22
##SPECTROMETER/DATA SYSTEM= spect
##.PULSE SEQUENCE= noesygpps1d.comp
##.SOLVENT NAME= COFFEE_meoh
##.SHIFT REFERENCE= INTERNAL, COFFEE_meoh, 1, 14.961
##AUDIT TRAIL= $$ (NUMBER, WHEN, WHO, WHERE, PROCESS, VERSION, WHAT)
$$ ##TITLE= Audit trail, TOPSPIN		Version 2.1
$$ ##JCAMPDX= 5.01
$$ ##ORIGIN= Bruker BioSpin GmbH
$$ ##OWNER= Administrator
$$ $$ E:\/data/COFFEE/nmr/AC1503_INDRS13310_8125488_1tnHXh314G/12/pdata/1/auditp.txt
$$ ##AUDIT TRAIL=  $$ (NUMBER, WHEN, WHO, WHERE, PROCESS, VERSION, WHAT)
(   1,<2013-08-15 21:05:12.283 -0700>,<Administrator>,<X>,<go>,<TOPSPIN 2.1>,
      <created by zg
	started at 2013-08-15 20:53:42.282 -0700,
	POWCHK enabled, PULCHK disabled,
       configuration hash MD5:
       C8 4E 4E 5D D3 5C D8 9E 9F 52 82 E0 59 8A DE 15
       data hash MD5: 64K
       79 78 4C 43 CB AD 4F EF AF 40 AE F7 7B 62 70 B3>)
(   2,<2013-08-15 21:05:15.252 -0700>,<Administrator>,<X>,<proc1d>,<TOPSPIN 2.1>,
      <Start of raw data processing
       efp LB = 0.3 FT_mod = 6 PKNL = 1 PHC0 = 0 PHC1 = 0 SI = 128K 
       data hash MD5: 128K
       65 CF 48 D2 40 E8 6E 1B B2 19 9C 63 DF 05 DF 52>)
(   3,<2013-08-15 21:05:16.268 -0700>,<Administrator>,<X>,<proc1d>,<TOPSPIN 2.1>,
      <pk PHC0 = -79.5575 PHC1 = 0 
       data hash MD5: 128K
       B7 0E 04 33 4F E8 55 F8 03 05 27 73 62 D3 1F D6>)
(   4,<2013-08-15 21:05:16.674 -0700>,<Administrator>,<X>,<proc1d>,<TOPSPIN 2.1>,
      <abs ABSG = 1 
       data hash MD5: 128K
       C4 F1 4B B8 98 BA 59 11 AA E8 F3 2F 60 12 CA D7>)
(   5,<2013-08-15 21:05:16.815 -0700>,<Administrator>,<X>,<proc1d>,<TOPSPIN 2.1>,
      <abs ABSG = 2 
       data hash MD5: 128K
       7E BE 53 89 D1 45 95 58 B7 17 9C 4E 59 D0 E6 B2>)
(   6,<2013-08-15 21:05:16.908 -0700>,<Administrator>,<X>,<proc1d>,<TOPSPIN 2.1>,
      <abs ABSG = 3 
       data hash MD5: 128K
       BB D6 65 A2 70 1B D5 93 91 74 E8 C1 87 9B 66 5E>)
(   7,<2013-08-15 21:05:17.033 -0700>,<Administrator>,<X>,<proc1d>,<TOPSPIN 2.1>,
      <abs ABSG = 4 
       data hash MD5: 128K
       E9 93 77 E0 DA B0 63 A7 91 4B 2D CD A3 B9 F9 F9>)
(   8,<2013-08-15 21:05:17.127 -0700>,<Administrator>,<X>,<proc1d>,<TOPSPIN 2.1>,
      <abs ABSG = 5 
       data hash MD5: 128K
       21 B5 09 7A 10 21 33 3E A8 10 FC 44 BD 34 17 19>)
$$ ##END=
$$ 
$$ $$ hash MD5
$$ $$ BA 99 DC 89 DA 25 46 B3 1A 39 FC 11 C0 CF F6 D6
##$RELAX= 
##$RELAX= 
##$RELAX= 
##$RELAX= 
##$RELAX= 
##$RELAX= 
##$RELAX= 
##$RELAX= 
$$ Bruker specific parameters
$$ --------------------------
##$DU= <E:\>
##$EXPNO= 12
$$ [...]
150 150 150 150 150 150 150 150
##$TP07= 0
##$TPNAME0= <>
##$TPNAME1= <>
##$TPNAME2= <>
##$TPNAME3= <>
##$TPNAME4= <>
##$TPNAME5= <>
##$TPNAME6= <>
##$TPNAME7= <>
##$TPOAL= (0..7)
0.5 0.5 0.5 0.5 0.5 0.5 0.5 0.5
##$TPOFFS= (0..7)
0 0 0 0 0 0 0 0
##$TUNHIN= 0
##$TUNHOUT= 0
##$TUNXOUT= 0
##$USERA1= <user>
##$USERA2= <user>
##$USERA3= <user>
##$USERA4= <user>
##$USERA5= <user>
##$V9= 5
##$VALIST= <valist>
##$VCLIST= <CCCCCCCCCCCCCCC>
##$VD= 0
##$VDLIST= <DDDDDDDDDDDDDDD>
##$VPLIST= <PPPPPPPPPPPPPPP>
##$VTLIST= <TTTTTTTTTTTTTTT>
##$WBST= 1024
##$WBSW= 4
##$XGAIN= (0..3)
0 0 0 0
##$XL= 0
##$YL= 0
##$YMAX_a= 6118621
##$YMIN_a= -11830392
##$ZGOPTNS= <>
##$ZL1= 120
##$ZL2= 120
##$ZL3= 120
##$ZL4= 120
##$ABSF1= 14.961
##$ABSF2= -5.597181
##$ABSG= 5
##$ABSL= 3
##$ALPHA= 0
##$AQORDER= 0
##$ASSFAC= 0
##$ASSFACI= 0
##$ASSFACX= 0
##$ASSWID= 0
##$AUNMP= <proc_prof1d_extract.lims>
##$AXLEFT= 0
##$AXNAME= <>
##$AXNUC= <1H>
##$AXRIGHT= 0
##$AXTYPE= 0
##$AXUNIT= <>
##$AZFE= 0.1
##$AZFW= 0.1
##$BCFW= 0
##$BC_mod= 0
##$BYTORDP= 0
##$COROFFS= 0
##$CY= 15
##$DATMOD= 1
##$DC= 0
##$DFILT= <>
##$DTYPP= 0
##$F1P= 0
##$F2P= 0
##$FCOR= 0.5
##$FTSIZE= 131072
##$FT_mod= 6
##$GAMMA= 0
##$GB= 0
##$INTBC= 1
##$INTSCL= 1
##$ISEN= 128
##$LB= 0.3
##$LEV0= 0
##$LPBIN= 0
##$MAXI= 10000
##$MC2= 0
##$MEAN= 0
##$ME_mod= 0
##$MI= 0
##$NCOEF= 0
##$NC_proc= -2
##$NLEV= 6
##$NOISF1= 0
##$NOISF2= 0
##$NSP= 0
##$NTH_PI= 0
##$NZP= 0
##$OFFSET= 14.961
##$PC= 1
##$PHC0= -79.5575
##$PHC1= 0
##$PH_mod= 1
##$PKNL= yes
##$PPARMOD= 0
##$PPDIAG= 0
##$PPIPTYP= 0
##$PPMPNUM= 2147483647
##$PPRESOL= 1
##$PSCAL= 4
##$PSIGN= 0
##$PYNMP= <proc.py>
##$REVERSE= no
##$SF= 400.020009635263
##$SI= 131072
##$SIGF1= 0
##$SIGF2= 0
##$SINO= 400
##$SIOLD= 131072
##$SPECTYP= <>
##$SREGLST= <1H.CDCl3>
##$SSB= 0
##$STSI= 131072
##$STSR= 0
##$SW_p= 8223.68421052631
##$SYMM= 0
##$S_DEV= 0
##$TDeff= 65536
##$TDoff= 0
##$TI= <>
##$TILT= no
##$TM1= 0
##$TM2= 0
##$TOPLEV= 0
##$USERP1= <user>
##$USERP2= <user>
##$USERP3= <user>
##$USERP4= <user>
##$USERP5= <user>
##$WDW= 1
##$XDIM= 131072
##$YMAX_p= 429514223
##$YMIN_p= -11319
##$CURPLOT= <Network HP LaserJet P1505>
##$CURPRIN= <$Network HP LaserJet P1505>
##$DFORMAT= <normdp>
##$LAYOUT= <+/1D_H.xwp>
##$LFORMAT= <normlp>
##$PFORMAT= <normpl>
##$SURQMSG= 1
$$ End of Bruker specific parameters
$$ ---------------------------------
##NTUPLES= NMR SPECTRUM
##VAR_NAME=  FREQUENCY,     SPECTRUM/REAL,   SPECTRUM/IMAG
##SYMBOL=    X,             R,               I
##VAR_TYPE=  INDEPENDENT,   DEPENDENT,       DEPENDENT
##VAR_FORM=  AFFN,          ASDF,            ASDF
##VAR_DIM=   131072,        131072,          131072
##UNITS=     HZ,            ARBITRARY UNITS, ARBITRARY UNITS
##FACTOR=    0.0627417313425164, 1,          1
##FIRST=     8223.62146879497, -1876,        -55815
##LAST=      0,             -145,            -56387
##MIN=       0,             -11319,          0
##MAX=       8223.62146879497, 429514223,    0
$$ Real data points
##PAGE= N=1
##DATA TABLE= (X++(R..R)), XYDATA
$$ [...]
63912C769496k18223k27792k31999k31703k27658k20946k12340k01696j88732
$$ 3769496 3551273 3323481 3091482 2859779 2632121 2411175 2198835 1997139 1808407
63903A808407j74018j58459j42322j25650j09335r4725q2167p0930o0607n1705
$$ 1808407 1634389 1475930 1333608 1207958 1098623 1003898 921731 850801 790194 738489
63893G38489m4647l9057l4357l0379k7043k4032k1183j8796j7154j6049j5012
$$ 738489 693842 654785 620428 590049 563006 538974 517791 498995 481841 465792 450780
63882D50780j3800j2450j1167j0192r586r048q219p156o209n501m811l920k730
$$ 450780 436980 424530 413363 403171 393585 384537 376318 369162 362953 357452 352641 348721 345991
63869C45991j264P7N96K40K22J796M534O760P706Q252R278J0439J1156J1864J3341
$$ 345991 344727 344804 345400 345640 345862 347658 352192 358952 366658 374910 384188 394627 405783 417647 430988
63854D30988J5403J7068J7779J7777J7566J7547J7909J8377J8225J7089J5493
$$ 430988 446391 463459 481238 499015 516581 534128 552037 570414 588639 605728 621221
63843F21221J4160J3011J1395R045O275L321R8l366o753r765j2280j4210j5549
$$ 621221 635381 648392 659787 668832 675107 678428 678526 675160 668407 658642 646362 632152 616603
63830F16603j6589j7699j8852j9658j9944k0040k0318k0691k0689j9936j8447
$$ 616603 600014 582315 563463 543805 523861 503821 483503 462812 442123 422187 403740
63819D03740j6561j4698j3177j2170j1687j1461j1032j0101q886p873p229o646
$$ 403740 387179 372481 359304 347134 335447 323986 312954 302853 293967 286094 278865 272219
63807B72219n801m705l567k514j640j116j073j410j826k043j960j726j592j620
$$ 272219 266418 261713 258146 255632 253992 252876 251803 250393 248567 246524 244564 242838 241246 239626
63793B39626j641j549j464j470j483j616k229l202l531k464p58N5l79r41p95m00
$$ 239626 237985 236436 234972 233502 232019 230403 228174 224972 221441 218977 218219 218274 217895 216954 216159 215759
63777B15759m73q36r49q12p28o82n66n41o40n02n4J05m39j108j107n65k17k48
$$ 215759 215286 214450 213501 212689 211961 211279 210713 210172 209532 209030 208976 209081 208642 207534 206427 205862 205645 205397
63759B05397k83k22l30o68j042j433j787j624n93P46J408J266J073J232J389J255
$$ 205397 205114 204892 204562 203894 202852 201419 199632 198008 197415 198161 199569 200835 201908 203140 204529 205784
63743B05784J104J167J202J001P77P85R75J239J581J863J854J663J773K348K960
$$ 205784 206888 208055 209257 210258 211035 211820 212795 214034 215615 217478 219332 220995 222768 225116 228076
63728B28076L181L078K927K792K716K936L625M535N228N531N633N858O340O770
$$ 228076 231257 234335 237262 240054 242770 245706 249331 253866 259094 264625 270258 276116 282456 289226
63714B89226O523N322L708K491J720P20p97k227k970l266l726m369m659m264l329
$$ 289226 295749 301071 304779 307270 308990 309710 308913 306686 303716 300450 296724 292355 287696 283432 280103
63699B80103k160j090n62q56j556j695p11R22K125K248J593R58Q47J171J612K052
$$ 280103 277943 276853 276291 275435 273879 272184 271473 272395 274520 276768 278361 279319 280166 281337 282949 285001
63683B85001K479K675K290J336L65p8k3P0JJ12P64J769K590L043L471M135M736
$$ 285001 287480 290155 292445 293781 294146 294068 294045 294115 294116 294228 294992 296761 299351 302394 305865 310000 314736
63666C14736M857M624M557M799M958M700M037L001J560N0r36j391k115l628n320
$$ 314736 319593 324217 328774 333573 338531 343231 347268 350269 351829 351879 350943 349552 347437 343809 338489
63651C38489o274o475o475o275n447m212l452l400l242k328j103l75k23j33K34
$$ 338489 332215 325740 319265 312990 307543 303331 299879 296479 293237 290909 289806 289431 289208 289075 289309
63636B89309Q77J757K743L467L756L984M647N594O155N979N464N206N320N488
$$ 289309 290186 291943 294686 298153 301909 305893 310540 316134 322289 328268 333732 338938 344258 349746
63622C49746N592O050P388R433J1256J2109J2349J3033J4692J6886J9004K1002
$$ 349746 355338 361388 368776 378209 389465 401574 413923 426956 441648 458534 477538 498540
63610D98540K3072K5148K7184K9508L2319L5040L6839L7729L8502L9327L9045
$$ 498540 521612 546760 573944 603452 635771 670811 707650 745379 783881 823208 862253
63599H62253L6250L0677K3158J4665O016j730p532j1250j3671j5301j5705j4629
$$ 862253 898503 929180 952338 967003 973019 971289 963757 952507 938836 923535 907830 893201
63587H93201j3243j3399j5624j8660k1110k2841k4397k5721k6154k5340k3564
$$ 893201 879958 866559 850935 832275 811165 788324 763927 738206 712052 686712 663148
63576F63148k1283j8825j6450j4229j1874r095o155l716k079q40O35K582M686
$$ 663148 641865 623040 606590 592361 580487 571392 565237 561521 559442 558602 559237 561819 566505
63563E66505O304O884O495N922N988O770P680Q239Q570R078J0034J1487J3419
$$ 566505 572809 579693 586188 592110 598098 604868 612548 620787 629357 638435 648469 659956 673375
63550F73375J5762J8376K1051K3694K6531L0007L4211L8527M2329M5854M9483
$$ 673375 689137 707513 728564 752258 778789 808796 843007 881534 923863 969717 1019200
63539A019200N1852M9699M0665K5937R471n023j5637k1763k3658k2733k0861j8907
$$ 1019200 1071052 1120751 1161416 1187353 1196824 1191801 1176164 1154401 1130743 1108010 1087149 1068242
63527A068242j6657j4371j3354j4539j7446k1099k5117k9266l2721l4662l5147
$$ 1068242 1051585 1037214 1023860 1009321 991875 970776 945659 916393 883672 849010 813863
63516H13863l4732l3618l1814k9700k7748k5931k3975k1903j9818j7491j4809
$$ 813863 779131 745513 713699 683999 656251 630320 606345 584442 564624 547133 532324
63505E32324j2305j0646r740q945p973p040o365n994n938n961n496m354l245k954
$$ 532324 520019 509373 499633 490688 482715 475675 469310 463316 457378 451417 445921 441567 438322 435368
63491D35368l243l299l047l138l680l937l460k654j973j301m52L75J021J721K601
$$ 435368 432125 428826 425779 422641 418961 415024 411564 408910 406937 405636 405184 405559 406580 408301 410902
63476D10902L352L734L980M300M486M341M120L973L399J835l75k228l220l762
$$ 410902 414254 417988 421968 426268 430754 435095 439215 443188 446587 448422 448047 445819 442599 438837
63462D38837m444n381o327p018p188o613n399m159l551l616l667k982j620l88
$$ 438837 434393 429012 422685 415667 408479 401866 396467 392308 388757 385141 381474 378492 376872 376484
63448C76484J20K61Q75K159L460M290M987O050P242P929Q124Q611R984J2075J4422
$$ 376484 376604 376865 377740 379899 383359 387649 392636 398686 405928 413857 421981 430592 440576 452651 467073
63433D67073J6913J9813K3453K8015L3197L7803M0048L8695L3962K7207J9965
$$ 467073 483986 503799 527252 555267 588464 626267 666315 705010 738972 766179 786144
63422G86144J3446Q613O131O138Q297J2163J7295K3168K9265L5264M0845M5321
$$ 786144 799590 808203 814334 820472 828769 840932 858227 881395 910660 945924 986769 1032090
63410A032090M7768M7542M4378L8061K8627J7065N351m681j2261j7385k0116k0748
$$ 1032090 1079858 1127400 1171778 1209839 1238466 1255531 1260882 1256201 1243940 1226555 1206439 1185691
63398A185691k0302k0057k0587k1813k3868k7161l1358l5025l6882l6987l6281
$$ 1185691 1165389 1145332 1124745 1102932 1079064 1051903 1020545 985520 948638 911651 875370
63387H75370l5272l3702l1323k8395k5332k2360j9625j7260j5152j2867j0103
$$ 875370 840098 806396 775073 746678 721346 698986 679361 662101 646949 634082 623979
63376F23979p113m476k507j004M66K164M027N780P248Q593J0226J2306J4497J6312
$$ 623979 616866 612390 609883 608879 609345 611509 615536 621316 628564 637157 647383 659689 674186 690498
63362F90498J7732J9158K0776K2324K3660K5193K7387L0099L2857L5615L8663
$$ 690498 708230 727388 748164 770488 794148 819341 846728 876827 909684 945299 983962
63351I83962M1747M3885M4255M2664L9000L2831K4137J3956L775n445j3112j8384
$$ 983962 1025709 1069594 1113849 1156513 1195513 1228344 1252481 1266437 1270212 1264767 1251655 1233271
63339A233271k0633k0473j9592j9371k0146k1760k4096k6827k9347l1404l3351
$$ 1233271 1212638 1192165 1172573 1153202 1133056 1111296 1087200 1060373 1031026 999622 966271
63328I66271l5421l7141l7825l7283l5669l2875k8717k3639j8746j4927j1979
$$ 966271 930850 893709 855884 818601 782932 750057 721340 697701 678955 664028 652049
63317F52049q802m496M99M327M924J510m937j2357j8586k2067k2457k0813j8753
$$ 652049 643247 638751 639250 643577 648501 650011 645074 632717 614131 592064 569607 548794 530041
63304E30041j7098j5471j3352j1019r209q205p721p466p402p506p618p604p418
$$ 530041 512943 497472 484120 473101 463892 455687 447966 440500 433098 425592 417974 410370 402952
63291D02952p065o637o329o248o229n944n240m274l363k755k500k490k664l027
$$ 402952 395887 389250 382921 376673 370444 364500 359260 354986 351623 348868 346368 343878 341214 338187
63277C38187l464l660l411k826k038r06N15J499J185l30j982k873k958k586k011
$$ 338187 334723 331063 327652 324826 322788 321882 322397 323896 325081 324751 322769 319896 316938 314352 312341
63262C12341j538j518j854k058k005k106k324j879m62Q37O83p31j846j611m87
$$ 312341 310803 309285 307431 305373 303368 301262 298938 297059 296597 297434 298117 297386 295540 293929 293442
63247B93442L80M72K18L30R57J474J238M80L7J19Po74j159o41L84P87L98K8R2
$$ 293442 293822 294294 294512 294842 295799 297273 298511 298991 299028 299147 299154 298480 297321 296680 297064 297851 298249 298277 298369
63228B98369J47j11k97oO06J132J369J282R28N14J85k05p18q88j80J117K109K394
$$ 298369 298516 298405 298108 298102 298708 299840 301209 302491 303419 303933 304118 303913 303195 302307 302127 303244 305353 307747
63210C07747K385K460K442K109J705J617J948K536L084L220K797K157J683J245
$$ 307747 310132 312592 315034 317143 318848 320465 322413 324949 328033 331253 334050 336207 337890 339135
63196C39135O23K90R19K124K678K329K355L723N585O444O188O042O788P952Q758
$$ 339135 339758 340048 340967 343091 345769 348098 350453 354176 359761 366205 372393 378435 385223 393175 401933
63181D01933R091R371R893J0584J1130J1317J1296J1398J1502J0899R141O856
$$ 401933 411024 420395 430288 440872 452002 463319 474615 486013 497515 508414 517555 524411
63169E24411N286N032N540N814N342M295L156K229J446M92q91k771n120p741j0144
$$ 524411 529697 534729 540269 546083 551425 555720 558876 561105 562551 563043 562152 559381 554261 546520 536376
63154E36376j1768j2549j2985j3408j3479j2714j1333j0144r613r387q771p468
$$ 536376 524608 512059 499074 485666 472187 459473 448140 437996 428383 418996 410225 402757
63142D02757n791m309l374k856k377j763j155o41j5Q13J422J347Q54Q33J712K908
$$ 402757 396966 392657 389283 386427 384050 382287 381132 380491 380476 381289 382711 384058 384912 385745 387457 390365
63126C90365L648M019M701N760O353O008N590O308P956Q956Q383P109O501O608
$$ 390365 394013 398032 402733 408493 414846 420854 426444 432752 440708 449664 458047 465156 471657 478265
63112D78265O470N847N544O053O746O794O134N192M254L587L625M389N108N030
$$ 478265 484735 490582 496126 502179 508925 515719 521853 527045 531299 534886 538511 542900 548008 553038
63098E53038M419M148M466M746M578M448N095O505P866Q397P997P160O385N712
$$ 553038 557457 561605 566071 570817 575395 579843 584938 591443 599309 607706 615703 622863 629248 634960
63084F34960M779L268J225j052l319n448p249q448q920q953r103r648j0252j0374
$$ 634960 639739 643007 644232 643180 639861 634413 627164 618716 609796 600843 591740 582092 571840 561466
63070E61466r980r565r303q700p406n968n121m639l673k210j251j316j643j310
$$ 561466 551486 541921 532618 523918 516512 510544 505423 500784 497111 494901 493650 492334 490691 489381
63056D89381l83N75J556K834M114M775M769M594M562M692N185O250P404P813P451
$$ 489381 488998 489573 491129 493963 498077 502852 507621 512215 516777 521469 526654 532904 540308 548121 555572
63041E55572P280P957Q952R356R056Q647Q477Q309P831P102O380N801N248M488
$$ 555572 562852 570809 579761 589117 598173 606820 615297 623606 631437 638539 644919 650720 655968 660456
63027F60456L382K022O52n92j809l124m365n103n073m612m476n119o152o736o440
$$ 660456 663838 665860 666512 665920 664111 660987 656622 651519 646446 641834 637358 632239 626087 619351 612911
63012F12911n510m343l083j858q99j59Q64K476M231N529O555P973R804J1229J1735
$$ 612911 607401 603058 599975 598117 597218 597059 597923 600399 604630 610159 616714 624687 634491 645720 657455
62997F57455J1880J2577J3967J5328J5865J5337J4123J2912J2202J1916J1633
$$ 657455 669335 681912 695879 711207 727072 742409 756532 769444 781646 793562 805195
62986H05195J1212J0963J1033J0990J0298Q942P244N258K771j28k969n485p936
$$ 805195 816407 827370 838403 849393 859691 868633 875877 881135 883906 883778 880809 875324 867388
62973H67388j0678j3593j6237j8299j9745k0584k0814k0549k0040j9368j8350
$$ 867388 856710 843117 826880 808581 788836 768252 747438 726889 706849 687481 669131
62962F69131j6835j5070j3536j2468j1682j0923j0248r919r958j0042r861r469
$$ 669131 652296 637226 623690 611222 599540 588617 578369 568450 558492 548450 538589 529120
62950E29120r130q930q697q424q500r341j0742j1867j1968j1026r632q405p703
$$ 529120 519990 511060 502363 493939 485439 476098 465356 453489 441521 430495 420863 412458 404755
62937D04755p588p782p682o887n676m723m212l688k886k219k095k194j968j632
$$ 404755 397167 389385 381703 374816 369140 364417 360205 356517 353631 351412 349317 347123 345155 343523
62923C43523j886k676k930j947m73J30m82j409j792j702j618j553j186n14P7L75
$$ 343523 341637 338961 336031 334084 333611 333741 333259 331850 330058 328356 326738 325185 323999 323485 323562 323937
62907C23937N10N43L61J35M61J578K783L160K744K522L199M499N763O731P479
$$ 323937 324447 324990 325351 325486 325947 327525 330308 333468 336212 338734 341933 346432 352195 358926 366405
62892C66405Q023Q370Q676Q973Q972Q470P713O983O040M564K927J855J308L84
$$ 366405 374428 382798 391474 400447 409419 417889 425602 432585 438625 443189 446116 447971 449279 449663
62878D49663j380l196m032m002m211n306o745p587p579p226p073p192p324p279
$$ 449663 448283 445087 441055 437053 432842 427536 420791 413204 405625 398399 391326 384134 376810 369531
62864C69531p086o816o433n792m795l489k109j031o26r45j587j971j848j475j186
$$ 369531 362445 355629 349196 343404 338609 335120 333011 331980 331354 330409 328822 326851 325003 323528 322342
62849C22342r71n92m2L45L09l2l84o10o98n36l0N85Q84Q15P93J026J052L60p25
$$ 322342 321371 320779 320737 321082 321391 321359 320975 320365 319667 319131 319101 319686 320570 321385 322178 323204 324256 324616 323891
62830C23891j240p28K45Q54R16P85P20P31Q65J189J465J197K07j018j722j639
$$ 323891 322651 321923 322168 323022 323938 324723 325443 326174 327039 328228 329693 330890 331097 330079 328357 326718
62814C26718j189r39r34p81l19Q1M4k67n09q12j540k448k698j948q89l06j21K02
$$ 326718 325529 324590 323656 322875 322556 322637 322681 322414 321905 321093 319553 317105 314407 312459 311570 311264 311143 311345
62796C11345P05J043J224J509J705J256J46r55j585j923k156k027j405p36m39
$$ 311345 312050 313093 314317 315826 317531 318787 318933 317978 316393 314470 312314 310287 308882 308146 307707
62781C07707k12N11J655K548K797K651K540K698L240M148N109N623N429M665L633
$$ 307707 307495 308006 309661 312209 315006 317657 320197 322895 326135 330283 335392 341015 346444 351109 354742
62766C54742K679K220K417K751K362J086k42p74n91l14j92j34l88j405k976m151
$$ 354742 357421 359641 362058 364809 367171 368257 368015 367241 366650 366336 366144 366010 365622 364217 361241 357090
62750C57090m374m144m217m615m915n124n549o004n762m594l255k700l062l680
$$ 357090 352716 348572 344355 339740 334825 329701 324152 318148 312386 307792 304537 301837 298775 295095
62736B95095l874l459k630j652p20k1J83k94j203j738j188K41J521J896J637J503
$$ 295095 291221 287762 285132 283480 282760 282739 282922 282628 281425 279687 278499 278740 280261 282157 283794 285297
62720B85297J750J980J909J816K119K778L320L450L390L605M280N195O092O933
$$ 285297 287047 289027 290936 292752 294871 297649 300969 304419 307809 311414 315694 320889 326981 333914
62706C33914P751Q451Q956R444J0202J1335J2770J4470J6298J7826J8713J9280
$$ 333914 341665 350116 359072 368516 378718 390053 402823 417293 433591 451417 470130 489410
62694D89410K0239K1768K3315K4531K5763K7283K8456K8358K6940K4977K2896
$$ 489410 509649 531417 554732 579263 605026 632309 660765 689123 716063 741040 763936
62683G63936K0314J6805J2580Q085L291k176q292j4327j9320k2843k5206k7002
$$ 763936 784250 801055 813635 821720 825011 822835 814543 800216 780896 758053 732847 705845
62671G05845k8474k9371k9387k8554k7188k5615k4076k2725k1467k0000j8186
$$ 705845 677371 648000 618613 590059 562871 537256 513180 490455 468988 448988 430802
62660D30802j6366j4998j4027j2874j1130r052p290o233n729n274m453l252k078
$$ 430802 414436 399438 385411 372537 361407 352355 345065 338832 333103 327829 323376 320124 318046
62647C18046j438j494j937k325k484k550k600k397j714p61n8K37N09J036J497
$$ 318046 316608 315114 313177 310852 308368 305818 303218 300821 299107 298346 298288 298525 299034 300070 301567
62632C01567J492J275J406J793J745J015J49m14r48j718k304k186j631j388j682
$$ 301567 303059 304334 305740 307533 309278 310293 310442 310028 309080 307362 305058 302872 301241 299853 298171
62617B98171k072k182k034j723j207n01K68J030J717K052J742R12Q5l30l60l54
$$ 298171 296099 293917 291883 290160 288953 288452 288720 289750 291467 293519 295261 296173 296258 295928 295568 295214
62601B95214o00j050j269q52J6O88Q47Q64J129J451J492J403J530J765J814J823
$$ 295214 294614 293564 292295 291443 291459 292147 292994 293858 294987 296438 297930 299333 300863 302628 304442 306265
62585C06265K097K409K299J944J945K212J934Q52k50o52o31q18j198j385j456
$$ 306265 308362 310771 313070 315014 316959 319171 321105 321957 321707 321055 320424 319606 318408 317023 315567
62570C15567j825k446k744k433j933j812k084k263k038j632j460j521j404q68
$$ 315567 313742 311296 308552 306119 304186 302374 300290 298027 295989 294357 292897 291376 289972 289104
62556B89104j58L51N85N67J52o67j372j378q23m60p04j167j221o51K81J115J455
$$ 289104 288946 289297 289882 290449 290601 289934 288562 287184 286361 285901 285197 284030 282809 282158 282439 283554 285009
62539B85009J264R86J143J761K377K564K265J736J433J696K228K182J222K12K34
$$ 285009 286273 287259 288402 290163 292540 295104 297369 299105 300538 302234 304462 306644 307866 308078 308312
62524C08312J145J923K211K657L634M683N445O251P339Q299Q803R313J0436J2127
$$ 308312 309457 311380 313591 316248 319882 324565 330010 336261 343600 351899 360702 370015 380451 392578
62510C92578J3975J5802J7475J8583J8881J8738J8678J8770J8725J8279J7163
$$ 392578 406553 422355 439830 458413 477294 496032 514710 533480 552205 570484 587647
62499E87647J5153J2503R853P441M966K495Q00K22j0n90q92J73K581N384Q157
$$ 587647 602800 615303 625156 632597 637563 640058 640858 641080 641070 640480 639588 639761 642342 647726 655883
62484F55883J1225J4625J7870K0760K3533K6186K8413L0319L2342L4207L4708
$$ 655883 667108 681733 699603 720363 743896 770082 798495 828814 861156 895363 930071
62473I30071L2825K8565K2578J5618Q616K492k723q187j5100k3354l1509l7966
$$ 930071 962896 991461 1014039 1029657 1038273 1040765 1038042 1029855 1014755 991401 959892 921926
62461I21926m1966m3813m4422m4621m4594m3923m2151l9204l5408l1264k7234
$$ 921926 879960 836147 791725 747104 702510 658587 616436 577232 541824 510560 483326
62450D83326k3532k0085j6809j3824j1298r302p928p270o991o300m866l424k873
$$ 483326 459794 439709 422900 409076 397778 388476 380548 373278 366287 359987 355121 351697 348824
62437C48824l001k870k260j863j899j612n34N60O66j4m81m19n06j212j983j939
$$ 348824 345823 342953 340693 338830 336931 335319 334785 335345 336011 335997 335516 335097 334591 333379 331396 329457
62421C29457r98l8P6o14j295j345r84p83p56m04L75R06N32m98j296j281o66m7
$$ 329457 328459 328421 328497 327883 326588 325243 324259 323476 322720 322316 322691 323597 324129 323631 322335 321054 320388 320341
62403C20341K62N08J149K192K971K815J906J100Q79R22R06J172K151L424M021
$$ 320341 320603 321111 322260 324452 327423 330238 332144 333244 334123 335045 335951 337123 339274 342698 346719
62388C46719L623L022L230M409N788O509O395N979N854O098O405O728P458Q803
$$ 346719 350342 353364 356594 361003 366791 373300 379695 385674 391528 397626 404031 410759 418217 427020
62374D27020J0298J1275J1653J1983J2739J3923J5287J6614J7767J8722J9756
$$ 427020 437318 448593 460246 472229 484968 498891 514178 530792 548559 567281 587037
62363E87037K1341K3702K6654K9928L3471L7381M1792M6916N2859N9170O4828
$$ 587037 608378 632080 658734 688662 722133 759514 801306 848222 901081 960251 1025079
62352A025079O9082P2063P4209P5190P3864O9279O1308N0372L7174K2994R538
$$ 1025079 1094161 1166224 1240433 1315623 1389487 1458766 1520074 1570446 1607620 1630614 1640152
62341A640152k113j2225k1635l0444l8046m4211m9431n4053n7702n9770o0031
$$ 1640152 1638039 1625814 1604179 1573735 1535689 1491478 1442047 1387994 1330292 1270522 1210491
62330A210491n8535n5421n1259m7133m3785m0840l7432l3561l0237k8189k6957
$$ 1210491 1151956 1096535 1045276 998143 954358 913518 876086 842525 812288 784099 757142
62319G57142k5620k4064k2967k2593k2171k0836j8855j7353j6891j6808j6241
$$ 757142 731522 707458 684491 661898 639727 618891 600036 582683 565792 548984 532743
62308E32743j5186j4135j3067j1551r689q161p225o367n207m113l519l178k528
$$ 532743 517557 503422 490355 478804 469115 460954 453729 447362 442155 438042 434523 431345 428817
62295D28817j464l03O94J333J427J195J371K387L656M246M103M042M533N158N300
$$ 428817 427353 427050 427744 429077 430504 431699 433070 435457 439113 443359 447462 451504 456037 461195 466495
62280D66495M928M532M541N006N641O091O290O510P017P836Q877J0003J0880J1220
$$ 466495 471423 475955 480496 485502 491143 497234 503524 510034 517051 524887 533764 543767 554647 565867
62266E65867J1438J2559J5003J8002K0702K3387K6879L1174L5598M0011M4910
$$ 565867 577305 589864 604867 622869 643571 666958 693837 725011 760609 800620 845530
62255H45530N0324N5626O0506O5238O9773P3371P5306P5136P2126O5347N4818
$$ 845530 895854 951480 1011986 1077224 1146997 1220368 1295674 1370810 1442936 1508283 1563101
62244A563101M1817K7724J3330m66j2390k2005l0368l8643m6611n3362n8740o3145
$$ 1563101 1604918 1632642 1645972 1645506 1633116 1611111 1580743 1542100 1495489 1442127 1383387 1320242
62232A320242o6289o7261o5850o2896n9270n5174n0521m5423m0196l5293l1228
$$ 1320242 1253953 1186692 1120842 1057946 998676 943502 892981 847558 807362 772069 740841
62221G40841k8128k5472k2731k0115j8165j6767j5252j3465j2006j1177j0400
$$ 740841 712713 687241 664510 644395 626230 609463 594211 580746 568740 557563 547163
62210E47163r071p502o570o668p333p797p664p077o390n655m546k907j244l15
$$ 547163 538092 530590 524020 517352 510019 502222 494558 487481 481091 475436 470890 467983 466739 466424
62196D66424k20k46K83J289K270L065M011N420P088Q387Q898Q919R227J0239J1614
$$ 466424 466204 465958 466241 467530 469800 472865 476876 482296 489384 497771 506669 515588 524815 535054 546668
62181E46668J2786J3643J4364J4827J4697J4024J3263J2622J1865J0987J0575
$$ 546668 559454 573097 587461 602288 616985 631009 644272 656894 668759 679746 690321
62170F90321J1264J3118J5873J9462K3924K8985L4174L9330M4652N0188N5398
$$ 690321 701585 714703 730576 750038 773962 802947 837121 876451 921103 971291 1026689
62159A026689N9319O1091O0362N7216N1748M3886L3841K2692J2034K830n127j2436
$$ 1026689 1086008 1147099 1207461 1264677 1316425 1360311 1394152 1416844 1428878 1431708 1426581 1414145
62147A414145j9130k4921k9979l4797l9298m2763m4808m5920m6594m6467m4804
$$ 1414145 1395015 1370094 1340115 1305318 1266020 1223257 1178449 1132529 1085935 1039468 994664
62136I94664m1640l7873l4307l1099k8263k6080k4662k3421k1499j8744j5931
$$ 994664 953024 915151 880844 849745 821482 795402 770740 747319 725820 707076 691145
62125F91145j3955j2988j2512j1932j0973r592p815n802l874k249p36J127L511
$$ 691145 677190 664202 651690 639758 628785 619193 611378 605576 601702 599453 598717 599844 603355
62112F03355O040Q285J0392J2911J6056J9341K1961K3130K2003J7902J1232L971
$$ 603355 609395 617680 628072 640983 657039 676380 698341 721471 743474 761376 772608 776579
62100G76579j386l608l157j035K102N412P190N699Q81n265j0239j2820j3325j2553
$$ 776579 775193 771585 768428 767393 769495 774907 782097 787796 788677 783412 773173 760353 747028 734475
62086G34475j0935q575n624k290J281M907Q203J0846J2951J4961J7012J8783K0103
$$ 734475 723540 714965 709341 707051 708332 713239 721442 732288 745239 760200 777212 795995 816098
62073H16098K1413K3230K5365K7142K8367K9585L1252L3084L4536L5635L6926
$$ 816098 837511 860741 886106 913248 941615 971200 1002452 1035536 1070072 1105707 1142633
62062A142633L8707M0693M2486M4005M5227M5618M4086L9643L2136K2377J1732
$$ 1142633 1181340 1222033 1264519 1308524 1353751 1399369 1443455 1483098 1515234 1537611 1549343
62051A549343J650o747j3131j8210k3178k8629l4134l9066m3436m7470n0670n2021
$$ 1549343 1550993 1544246 1531115 1512905 1489727 1461098 1426964 1387898 1344462 1296992 1246322 1194301
62039A194301n1276m9367m7229m4750m1298l6970l2708k9285k6635k4220k1689
$$ 1194301 1143025 1093658 1046429 1001679 960381 923411 890703 861418 834783 810563 788874
62028G88874j9029j6355j3775j1382r294p627o482n862n668n742n900o023o180
$$ 788874 769845 753490 739715 728333 719039 711412 704930 699068 693400 687658 681758 675735 669555
62015F69555o633p528q549r082q810p975p025o162n372m712m296m006l453k312
$$ 669555 662922 655394 646845 637763 628953 620978 613953 607791 602419 597707 593411 589405 585952 583640
62001E83640p01Q75K022K826L630M459M924M823M449M064L375K060O03j15k3n7
$$ 583640 582939 583814 585836 588662 592292 596751 601675 606498 610947 615011 618386 620446 621049 620934 620911 620854
61985F20854r26k359l869n567p626r438j0116r681r082q952q897q189o782n380
$$ 620854 619928 617569 613700 608133 600507 591069 580953 571272 562190 553238 544341 536152 529370 523990
61971E23990m631m480m328l785l116k845l032l312l577m072m656m558l383j888
$$ 523990 519359 514879 510551 506766 503650 500805 497773 494461 490884 486812 482156 477598 474215 472327
61957D72327j120j064p97R8J006J276J081J008J215J466J703K237L317M802O359
$$ 472327 471207 470143 469346 469444 470450 471726 472807 473815 475030 476496 478199 480436 483753 488555 494914
61942D94914P861R465J1249J3008J4507J5901J7548J9486K1389K3085K4612K5673
$$ 494914 502775 512240 523489 536497 551004 566905 584453 603939 625328 648413 673025 698698
61930F98698K5606K4241K2288K0494J8816J6967J5201J3863J2440R917O030J486
$$ 698698 724304 748545 770833 791327 810143 827110 842311 856174 868614 878531 884561 886047
61918H86047l000p194j0796j3207j4112j3826j2785j1079q628n480j802K158O121
$$ 886047 883047 875853 865057 851850 837738 823912 811127 800048 791420 785940 784138 786296 792417
61905G92417J0002J3974J7874K0831K2103K2021K1363J9920J6768J1952O809K264
$$ 792417 802419 816393 834267 855098 877201 899222 920585 940505 957273 969225 976034 978298
61893I78298k129o863j1319j4645j7009j9036k0607k1164k0768j9943j8745j6941
$$ 978298 976169 969306 957987 943342 926333 907297 886690 865526 844758 824815 806070 789129
61881G89129j4857j3259j2477j2374j3025j4603j6602j7999j8362j8120j7635
$$ 789129 774272 761013 748536 736162 723137 708534 691932 673933 655571 637451 619816
61870F19816j6677j4976j2777j0567q648p114n844m406k362J95K656M549N944
$$ 619816 603139 588163 575386 564819 556171 549057 543213 538807 536445 536640 539296 543845 549789
61857E49789P244Q918J1238J3953J6431J8543K1132K4886K9145L2624L5251L8026
$$ 549789 557033 565951 577189 591142 607573 626116 647248 672134 701279 733903 769154 807180
61845H07180M1006M2772M2487M1238M0356L9267L6313L1186K5243J9450J3239
$$ 807180 848186 890958 933445 974683 1015039 1054306 1090619 1121805 1147048 1166498 1179737
61834A179737N742k666j0550j6635k0474k2223k2156k0398j7047j2522p516k452
$$ 1179737 1185479 1182813 1172263 1155628 1135154 1112931 1090775 1070377 1053330 1040808 1033292 1030840
61822A030840K804Q336J3524J7354J9228J9036J6673J2082N763j450r166j7394
$$ 1030840 1033644 1041980 1055504 1072858 1092086 1111122 1127795 1139877 1145640 1144190 1135024 1117630
61810A117630k5595l2485l7180m0008m1772m2576m1997m0049l7398l4597l1661
$$ 1117630 1092035 1059550 1022370 982362 940590 898014 856017 815968 778570 743973 712312
61799G12312k8512k5417k2732k0353j7783j4782j1898j0052r497r426q811p523
$$ 712312 683800 658383 635651 615298 597515 582733 570835 560783 551286 541860 533049 525526
61787E25526o195n172m169l083k474k745l362l476k992k452k048j526r74j004
$$ 525526 519331 514159 509990 506907 504433 501688 498326 494850 491858 489406 487358 485832 484858 483854
61773D83854j855k874l226k772j980j291q54o12l03L55J258J909K138K566L901
$$ 483854 481999 479125 475899 473127 471147 469856 469002 468390 468087 468442 469700 471609 473747 476313 480214
61758D80214N914P603Q430Q902R690J0601J0833J0025Q630P231N866M267K493
$$ 480214 486128 493731 502161 511063 520753 531354 542187 552212 560842 568073 573939 578206 580699
61745E80699J033K46p7m83j312k426l370l758l574l232l263l822m515m844m748
$$ 580699 581732 581978 581901 581418 580106 577680 574310 570552 566978 563746 560483 556661 552146 547302 542554
61730E42554m553m413m042l126j811n60L47J064J802K422K473J661K44j066j603
$$ 542554 538001 533588 529546 526420 524609 524049 524396 525460 527262 529684 532157 533818 534062 532996 531393
61715E31393j208l03L95L36m96j601k440k938l372l774l774l253k780k947l406
$$ 531393 530185 529882 530277 530613 530117 528516 526076 523138 519766 515992 512218 508965 506185 503238 499832
61700D99832l215k144j080q63j256j432j062m68NK19R3j91nJ000K074K021Q31
$$ 499832 496617 494473 493393 492530 491274 489842 488780 488312 488317 488536 488629 488438 488433 489433 491507 493528 494359
61683D94359q4K87J236J430P44J64J57J94j55m66k62J39J34k16l17j8J10m78j585
$$ 494359 494275 494562 495798 497228 497972 498136 498293 498487 498332 497866 497604 497743 497877 497661 497344 497326 497436 496958 495373
61664D95373k458k544j983j398j280j560j834j865j657j154k33Q57J499J456J325
$$ 495373 492915 490371 488388 486990 485710 484150 482316 480451 478794 477640 477407 478264 479763 481219 482544
61649D82544J817K876L875M503M878M959M514L777L491M038M912N410N378M978
$$ 482544 484361 487237 491112 495615 500493 505452 509966 513743 517234 521272 526184 531594 536972 541950
61635E41950M143K694Q52p90j816k284k618l273m306n152n084m118l162l011l498
$$ 541950 546093 548787 549639 548849 547033 544749 542131 538858 534552 529400 524316 520198 517036 514025 510527
61620E10527l923m054m178m380m351l953l546l536l826l880l335k514k234k985
$$ 510527 506604 502550 498372 493992 489641 485688 482142 478606 474780 470900 467565 465051 462817 459832
61606D59832m320n355n811o068o207n742m630l804l984m599m620m021l543l350
$$ 459832 455512 450157 444346 438278 432071 426329 421699 417895 413911 409312 404692 400671 397128 393778
61592C93778k984k471k341k571k506k048j919k422k872k641j961j275o28j51k73
$$ 393778 390794 388323 385982 383411 380905 378857 376938 374516 371644 369003 367042 365767 365139 364988 364715
61577C64715q97j129n63q4o15j650j982j436r25j005j323j432j382j408j586j871
$$ 364715 363818 362689 362126 362042 361427 359777 357795 356359 355434 354429 353106 351674 350292 348884 347298 345427
61561C45427k061j843j276r69j338j913k036j873j980k107j405J03J230J140L45
$$ 345427 343366 341523 340247 339278 337940 336027 333991 332118 330138 328031 326626 326729 327959 329099 329444
61546C29444j94k91l23l69j89J92M74N65N87M15k68j303j807j002P69K247K578
$$ 329444 329250 328959 328636 328267 328078 328270 328744 329309 329896 330311 330043 328740 326933 325931 326700 328947 331525
61529C31525K163J931K068J952J276N37K29R2m17j293k033k297k105j681j369
$$ 331525 333688 335619 337687 339639 340915 341452 341681 341773 341356 340063 338030 335733 333628 331947 330578
61514C30578j522k002k171j695j037p44o45l38p5l59r26r67k52P06J513K147K286
$$ 330578 329056 327054 324883 323188 322151 321407 320762 320424 320349 319990 319064 318097 317845 318551 320064 322211 324497
61497C24497J427j05j044n52Q46J987K213J577M77n30j038j185j380j483q86L68
$$ 324497 325924 325819 324775 324223 325069 327056 329269 330846 331323 330793 329755 328570 327190 325707 324821 325189
61481C25189J222Q72k07j007j230j197j032o12q3K69N04Q38J126J122J013J092
$$ 325189 326411 327283 327076 326069 324839 323642 322610 321998 321915 322184 322688 323526 324652 325774 326787 327879
61465C27879J037K53j028j795j592j123j144j372j102m68l45r92j535j109n0N78
$$ 327879 328916 329169 328141 326346 324754 323631 322487 321115 320013 319545 319200 318208 316673 315564 315514 316092
61449C16092M09J05L27Q98J294J441J542J473J015N71R03J974K687K166Q91J53
$$ 316092 316501 316606 316933 317831 319125 320566 322108 323581 324596 325167 326070 328044 330731 332897 333788 333941
61433C33941O34J979L476M662N271N094M229L229K723K780K812K249J271O48P52
$$ 333941 334575 336554 340030 344692 349963 355057 359286 362515 365238 368018 370830 373079 374350 374998 375750
61418C75750J144J342J627K489L509L592K453J136O86Q96Q59K23o44j424k070
$$ 375750 376894 378236 379863 382352 385861 389453 391906 393042 393728 394624 395483 395706 395062 393638 391568
61403C91568k437k327j911j621j582j601j712k234l098l628l301k439j790j586
$$ 391568 389131 386804 384893 383272 381690 380089 378377 376143 373045 369417 366116 363677 361887 360301
61389C60301j366o98K33Q39Q11L82Lj20k1K87Q56J549K005J972J634J439J675
$$ 360301 358935 358237 358470 359309 360120 360502 360505 360385 360364 360651 361507 363056 365061 367033 368667 370106 371781
61372C71781K219K693K799K631K600K940L293L068K184J218P10O25P50J190K075
$$ 371781 374000 376693 379492 382123 384723 387663 390956 394024 396208 397426 398136 398761 399511 400701 402776
61357D02776K990L226K652J998K110L146M504N468N795N908O516P911R658J1087
$$ 402776 405766 408992 411644 413642 415752 418898 423402 428870 434665 440573 447089 455000 464658 475745
61343D75745J2040J2839J3569J3813J3253J2107J0693Q837O257L368J138M0m30
$$ 475745 487785 500624 514193 528006 541259 553366 564059 572896 579153 582521 583659 583699 583269
61330E83269j007j904l010m353n807o702o478n670n558o597p841q137p409o308
$$ 583269 582262 580358 577348 572995 567188 560486 554008 548338 542780 536183 528342 520205 512796 506488
61316E06488n162l924k796k149j863j417p36l38m89o82k74P37J874K868L803M787
$$ 506488 501326 497402 494606 492457 490594 489177 488441 488103 487614 486932 486658 487395 489269 492137 495940 500727
61300E00727N771O743P817R091J0437J1415J1374R798O712K752j227m643p295
$$ 500727 506498 513241 521058 530149 540586 552001 563375 573173 579885 582637 581410 576767 569472
61287E69472r116r937r607q301o599n065l790k476j013K73J015J260J373J734
$$ 569472 560356 550419 540812 532511 525912 520847 517057 514581 513568 513841 514856 516116 517489 519223
61273E19223K552L849N335O598P487Q217Q975R750J0619J1722J2714J2748J1567
$$ 519223 521775 525624 530959 537557 545044 553261 562236 571986 582605 594327 607041 619789 631356
61260F31356J0192R886J0640J1326J1251J0941J1377J2988J5440J7871J9288J9097
$$ 631356 641548 651434 662074 673400 684651 695592 706969 719957 735397 753268 772556 791653
61248G91653J7376J4428J0292N101l53n049q673j1546j3784j5175j5809j6090
$$ 791653 809029 823457 833749 838850 838497 833448 824775 813229 799445 784270 768461 752371
61236G52371j6095j5632j4944j4482j3880j2083q890n648l885l787m354m530l871
$$ 752371 736276 720644 705700 691218 677338 665255 656365 650717 646832 643045 638691 634161 630290
61223F30290k658j700j556j693j011N49J698J466M06m52j063j985l137l827l777
$$ 630290 627632 625932 624376 622683 621672 622221 623919 625385 625791 625339 624276 622291 619154 615327 611550
61208F11550l297k619j730p44J48R78J767K077J400n8j428j964j434J02K443N136
$$ 611550 608253 605634 603904 603160 603308 604286 606053 608130 609530 609472 608044 606080 604646 604748 607191 612327
61192F12327P665R816J1683J3415J5262J7626K0729K4186K7119K8620K8007K5001
$$ 612327 619992 629808 641491 654906 670168 687794 708523 732709 759828 788448 816455 841456
61180H41456K0120J4727J0216P166N400M664M719M930M427K943J159j64j194k813
$$ 841456 861576 876303 886519 893685 899085 903749 908468 913398 917825 920768 921927 921763 920569 917756
61166I17756n296p697q872q964r281j0590j2189j2994j2973j2837j2797j2525
$$ 917756 912460 904763 895891 886927 877646 867056 854867 841873 828900 816063 803266 790741
61154G90741j2122j2085j2291j1905j0537q679o821m944l144j888j205m14R39
$$ 790741 778619 766534 754243 742338 731801 723122 716301 711357 708213 706325 705120 704706 705645
61141G05645K478L756M732N075L800M13m140q323j1340j3101j3485j2476j0663
$$ 705645 708123 711879 716611 721686 725486 725899 721759 713436 702096 688995 675510 663034 652371
61128F52371q853p302n813m305k855j483l06M76J074K165M055O251Q233J0078
$$ 652371 643518 636216 630403 626098 623243 621760 621454 621930 623004 625169 629224 635475 643708 653786
61114F53786J1910J3440J4600J5995J7965J9823K0728K0887K1057K1333K1228
$$ 653786 665696 679136 693736 709731 727696 747519 768247 789134 810191 831524 852752
61103H52752K0617J9843J9031J8055J6966J5941J4945J3898J2897J1794R909O689
$$ 852752 873369 893212 912243 930298 947264 963205 978150 992048 1004945 1016739 1026648 1033337
61091A033337K337k562p572j2188j5737j8004j9456k0364k0364j9411j8298j7564
$$ 1033337 1035674 1033112 1025540 1013352 997615 979611 960155 939791 919427 900016 881718 864154
61079H64154j6735j5444j4404j4256j4250j3331j1867j0975j0660r955q612p299
$$ 864154 847419 831975 817571 803315 789065 775734 763867 752892 742232 732277 723665 716366
61067G16366o228m856l070j531p26m39l11j15M06J343K381L295M332N531O236
$$ 716366 710138 705282 702212 700681 699955 699516 699205 699090 699496 700839 703220 706515 710847 716378 722614
61052G22614O166O316P706R746J1060J1568J2419J4008J5480J6362J7400J9348
$$ 722614 728780 735096 742802 752548 763608 775176 787595 801603 817083 833445 850845 870193
61040H70193K1855K4019K5506K6723K8191K9917L1352L2143L2808L4158L6006
$$ 870193 892048 916067 941573 968296 996487 1026404 1057756 1089899 1122707 1156865 1192871
61029A192871L7386L8146L9204M0868M2321M3370M5213M8572N2574N6483O0975
$$ 1192871 1230257 1268403 1307607 1348475 1390796 1434166 1479379 1527951 1580525 1637008 1697983
61018A697983O6458P1756P5721P8608Q0526Q0697P9994Q1965Q9155J00395J13997
$$ 1697983 1764441 1836197 1911918 1990526 2071052 2151749 2231743 2313708 2402863 2503258 2617255
61007B617255J30969J52101J74382J94331K13074K34593K61335K95976L44974
$$ 2617255 2748224 2900325 3074707 3269038 3482112 3716705 3978040 4274016 4618990
60998D618990M14614N04926O13000P40526Q92122J069691J277569J530937J848326
$$ 4618990 5033604 5538530 6151530 6892056 7784178 8853869 10131438 11662375 13510701
60989A3510701K238745K709574L272920L892364M390234M452003L818616K536003
$$ 13510701 15749446 18459020 21731940 25624304 30014538 34466541 38285157 40821160
60981D0821160J001764k74939r79219j083451p15148l3947P33742J232436J092900
$$ 40821160 41822924 41547985 40568766 39485315 38770167 38736220 39469962 40702398 41795298
60972D1795298J91231j212668k627942l642242m111872m121638l835980l399345
$$ 41795298 41986529 40773861 38145919 34503677 30391805 26270167 22434187 19034842
60964A9034842k916048k453824k043414j688378j385137j132023r24212p52490
$$ 19034842 16118794 13664970 11621556 9933178 8548041 7416018 6491806 5739316
60956E739316o10719m98107m12518l47325k96471k57473k27851k03268j81107
$$ 5739316 5128597 4630490 4217972 3870647 3574176 3316703 3088852 2885584 2704477
60947B704477j61972j46015j31107j15871j01287q8065p5581o4710n8467n8235
$$ 2704477 2542505 2396490 2265383 2149512 2048225 1960160 1884579 1819869 1761402 1703167
60937A703167o1761o6043o9726p1724p0482o6295o1896n9030n6366n2192m7151
$$ 1703167 1641406 1575363 1505637 1433913 1363431 1297136 1235240 1176210 1119844 1067652 1020501
60926A020501m2751l8970l5015l1058k7730k4901k2206j9838j7967j6265j4562
$$ 1020501 977750 938780 903765 872707 844977 820076 797870 778032 760065 743800 729238
60915G29238j3056j1618r930q411p711p309o178m681l972l596j943P68K374K204
$$ 729238 716182 704564 694634 686223 678512 671203 665025 660344 656372 652776 650833 651601 653975 656179
60901F56179K040K916L405K278N30p19k170m583o928p969q206q665r215r433r801
$$ 656179 658219 661135 664540 666818 667348 666629 664459 659876 652948 644979 636773 628108 618893 609460 599659
60886E99659j0559j0796j0024r363r714j0129r439q305q070q700r282r529r324
$$ 599659 589100 578304 568280 558917 549203 539074 529635 521330 513260 504560 495278 485749 476425
60873D76425p944n281k890k234k736k977k835k920k810j642J75J533K447L757
$$ 476425 468481 463200 460310 458076 455340 452363 449528 446608 443798 442156 442331 443864 446311 450068
60859D50068N423O588P029P284P567P729P949Q407Q610Q010O879N712M431L038
$$ 450068 455491 462079 469108 476392 483959 491688 499637 508044 516654 524664 531543 537255 541686 544724
60845E44724K313K666L119K680J980K120K623K095L91j449l057m912o862q089
$$ 544724 547037 549703 552822 555502 557482 559602 562225 564320 564711 563262 560205 555293 548431 540342
60831E40342q547r002r654j0009j0021j0084r961r058p833p418p799p710o612
$$ 540342 531795 522793 513139 503130 493109 483025 473064 464006 456173 448755 440956 433246 426634
60818D26634n454n060n033m785m506m501m480m157l858l914l972l409k113n44
$$ 426634 421180 416120 411087 406302 401796 397295 392815 388658 384800 380886 376914 373505 371392 370848
60804C70848O39R87O17K75N64J233J638J762K124K831L457L862M373N024N369
$$ 370848 371487 372474 373091 373366 373930 375163 376801 378563 380687 383518 386975 390837 395210 400234 405603
60789D05603N205M957N136N828O813P783Q467Q930R574J0437J0800J0168R237
$$ 405603 410808 415765 420901 426729 433542 441325 449792 458722 468296 478733 489533 499701 508938
60776E08938R064R533R672R363R530J0440J1053J0601R826R970J1185J2673J3924
$$ 508938 518002 527535 537207 546570 556100 566540 577593 588194 598020 607990 619175 631848 645772
60763F45772J5114J6534J8226K0098K2081K4030K5704K6783K7121K7080K7401
$$ 645772 660886 677420 695646 715744 737825 761855 787559 814342 841463 868543 895944
60752H95944K8340K9033K8214K5496K1423J6357J0031K359n930j3820k0716k6409
$$ 895944 924284 953317 981531 1007027 1028450 1044807 1054838 1057197 1051267 1037447 1016731 990322
60740I90322l0827l4058l6335l7676l7943l7342l6444l5447l3814l1057k7530
$$ 990322 959495 925437 889102 851426 813483 776141 739697 704250 670436 639379 611849
60729F11849k4119k1350j9117j7137j5228j3299j1342r469p782o226m680l131
$$ 611849 587730 566380 547263 530126 514898 501599 490257 480788 473006 466780 462100 458969
60717D58969j651l22O70J000N53k31o70n76n51j239k485l497l844l954m434n264
$$ 458969 457318 456996 457666 458666 459219 458988 458318 457742 457191 455952 453467 449970 446126 442172 437738 432474
60701D32474n956o361o786p403p971q232q194p883p179o085m880l882l313l296
$$ 432474 426518 420157 413371 405968 397997 389765 381571 373688 366509 360424 355544 351662 348349 345053
60687C45053l626l538k365n78M52O0r13j340j167j009r21l46Q99K325L308L535
$$ 345053 341427 337889 335524 334946 335398 335458 334545 333205 332038 331029 330108 329762 330661 332986 336294 339829
60671C39829L017K216J928K455L015K596J358N39Q32J446J146k16j581j944j393
$$ 339829 342846 345062 346990 349445 352460 355056 356414 356953 357785 359231 360377 360161 358580 356636 355243
60656C55243q30q73j164q38M45K117L294L627L528L824N066O966Q465Q695P861
$$ 355243 354413 353540 352376 351538 351983 354100 357394 361021 364549 368373 373439 380405 388870 397565 405426
60641D05426O833O069N403M772M343L818K543O47p81j190j439k450l767m337m148
$$ 405426 412259 418328 423731 428503 432846 436664 439207 439854 439073 437883 436444 433994 430227 425890 421742
60626D21742m071m462m877n020n021m841m260l490k993k656j948r81o28j284k195
$$ 421742 417671 413209 408332 403312 398291 393450 389190 385700 382707 380051 378103 377122 376494 375210 373015
60611C73015k395j842j222j052j255j360r26O2J033J292P90J98J45N88R62Q10
$$ 373015 370620 368778 367556 366504 365249 363889 362963 363025 364058 365350 366140 366338 366483 367071 368033 368843
60595C68843N3j038j992k280j635l61P14Q45J12n98n74k6M20O85J149J795K175
$$ 368843 368896 367858 365866 363586 361951 361590 362304 363149 363261 362663 362089 362063 362483 363168 364317 366112 368287
60578C68287K267K597L273L711L613L530M070N155O440P740Q724Q966Q898R827
$$ 368287 370554 373151 376424 380135 383748 387278 391348 396503 402943 410683 419407 428373 437271 447098
60564D47098J2328J5326J7526J9072K0942K3350K5612K6988K6628K3360J6872
$$ 447098 459426 474752 492278 511350 532292 555642 581254 608242 634870 658230 675102
60553F75102Q805J511m165q898j2951j5506j5928j4502j1751p964l653M85M303
$$ 675102 683907 685418 681253 672355 659404 643898 627970 613468 601717 593753 590100 590585 594888
60540E94888Q265J2627J7199K1919K6898L1888L6308L9843M2199M2380L9124L2234
$$ 594888 603153 615780 632979 654898 681796 713684 749992 789835 832034 874414 913538 945772
60528I45772K2812J2183J325q632j6404k1379k3806k4140k2806k0623j8513j6675
$$ 945772 968584 980767 982092 973460 957056 935677 911871 887731 864925 844302 825789 809114
60516H09114j4730j2765j1375j0654j0057r329q590p405n011j738R39K402L782
$$ 809114 794384 781619 770244 759590 749533 740204 731614 724209 719198 717460 718399 720801 724583
60503G24583O208R247J2042J5061J9632K6119L3664M1454M9410N7723O6480P5725
$$ 724583 730791 740038 752080 767141 786773 812892 846556 888010 937420 995143 1061623 1137348
60491A137348Q5253R4265J01582J06287J07942J06316J01208R2441P9735O2697
$$ 1137348 1222601 1316866 1418448 1524735 1632677 1738993 1840201 1932642 2012377 2075074
60481B075074M1184J5818j1950m0147o6704q9745j07712j19455j24530j23608
$$ 2075074 2116258 2132076 2120126 2079979 2013275 1923530 1815818 1696363 1571833 1448225
60471A448225j18314j10322j00653q9960p9065o8773n9459n1266m4452l8987l4223
$$ 1448225 1329911 1219589 1118936 1028976 949911 881138 821679 770413 725961 686974 652751
60460F52751k9587k5396k2258j9965j7734j5328j3070j0937q682o743n967o263
$$ 652751 623164 597768 575510 555545 537811 522483 509413 498476 489794 483051 477084 470821
60448D70821o536o147n497m967m350l643l334l424l070j832m15L74O51Q56R02
$$ 470821 464285 458138 452641 447674 443324 439681 436347 432923 429853 428021 427606 427980 428631 429487 430389
60433D30389N70J83J63L84N25O02N85k3j524l249m091l785l189l250l949m343
$$ 430389 430959 431142 431305 431689 432214 432816 433401 433378 431854 428605 424514 420729 417540 414290 410341 405998
60417D05998l672k352j546j601j503m94N45L75m96m70N28Q50j55r78k95J024J418
$$ 405998 402326 399974 398428 396827 395324 394830 395375 395750 395254 394784 395312 396162 396007 395029 394734 395758 397176
60400C97176R41P59J164J460J374J406J836K291K250J549N26RO42J958K695K411
$$ 397176 398117 398876 400040 401500 402874 404280 406116 408407 410657 412206 412732 412741 413383 415341 418036 420447
60384D20447K031K372K967L049K785K725K759K565K422K665K829K358J644J385
$$ 420447 422478 424850 427817 430866 433651 436376 439135 441700 444122 446787 449616 451974 453618 455003
60370D55003J453J375J511K574M205N235N310N192N390N434M765L568K469J923
$$ 455003 456456 457831 459342 461916 466121 471356 476666 481858 487248 492682 497447 501015 503484 505407
60356E05407J963K094J479k66k469l956m190l498k479j628j261j284j119k66J169
$$ 505407 507370 509464 510943 510677 508208 504252 500062 496564 494085 492457 491196 489912 488793 488527 489696
60341D89696K763M228N323N794N829N958O079N256L176J059K92P60J469K126K932
$$ 489696 492459 496687 502010 507804 513633 519591 525670 530926 534102 535161 535453 536213 537682 539808 542740
60326E42740L330K469P17n71r57j315k204l012l093k720k420k223k044k090k350
$$ 542740 546070 548539 549256 548685 547728 546413 544209 541197 538104 535384 532964 530741 528697 526607 524257
60311E24257k220j176N36K250L630M809O048P528R319J1467J4184J7878K2721
$$ 524257 522037 520861 521397 523647 527277 532086 538134 545662 554981 566448 580632 598510 621231
60298F21231K8237L3412L6962L7477L3943K6716J7538P927k059j2721k2910l0353
$$ 621231 649468 682880 719842 757319 791262 817978 835516 843443 841384 828663 805753 775400
60286G75400l3735l3577l1153k7485k3464j9840j6720j3764j1117r430q785q335
$$ 775400 741665 708088 676935 649450 625986 606146 589426 575662 564545 555115 546330 537995
60274E37995p418o311n543n070m546l931l336k679j904j270j075j304j696j940
$$ 537995 530577 524266 518723 513653 509107 505176 501840 499161 497257 495987 494912 493608 491912 489972
60260D89972j656n82R59K080K091J133j02j144k050l005l781l782k832j703j465
$$ 489972 488316 487734 488693 490773 492864 493997 493895 492751 490701 487696 483915 480133 477301 475598 474133
60245D74133k180k816k645k147k086k263j892q10M09J230J447J010K48r1L13P98
$$ 474133 471953 469137 466492 464345 462259 459996 458104 457294 457703 458933 460380 461390 461638 461547 461860 462658
60229D62658P92Q98J900L188L438K667K213K639L067K858K554K631K593K061J636
$$ 462658 463450 464348 466248 469436 472874 475541 477754 480393 483460 486318 488872 491503 494096 496157 497793
60214D97793J934K537K801K866L146L403L217K857K834L088L219L223L249L080
$$ 497793 499727 502264 505065 507931 511077 514480 517697 520554 523388 526476 529695 532918 536167 539247
60200E39247K508J925J805J884J565R33O96J141J770J977J596Q22pn10n51m33
$$ 539247 541755 543680 545485 547369 548934 549867 550563 551704 553474 555451 557047 557869 557862 557352 556801 556368
60184E56368n65r94j502j967k283k232j804j578k200l447m245l822k564j519j261
$$ 556368 555803 554809 553307 551340 549057 546825 545021 543443 541243 537796 533551 529729 527165 525646 524385
60169E24385j396j165l63M16M48l29j292j822j825j630j542j563j379o52N50J669
$$ 524385 522989 521824 521461 521877 522325 521996 520704 518882 517057 515427 513885 512322 510943 510291 510841 512510
60153E12510K218K296K349K532K732L107M016N341O402O864P235Q058Q982R076
$$ 512510 514728 517024 519373 521905 524637 527744 531760 537101 543503 550367 557602 565660 574642 583718
60139E83718P934O081M273K827J733J155J404K350L166L055K216J656J822J951
$$ 583718 591652 597733 602006 604833 606566 607721 609125 611475 614641 617696 619912 621568 623390 625341
60125F25341J120m84j916k789l444l999m000l206j901l13J624L593M748M708M223
$$ 625341 626461 625977 624061 621272 617828 613829 609829 606623 604722 604409 606033 609626 614374 619082 623305
60110F23305M298N041N855O384O744O990O918O404N516M312K781J015p84k492
$$ 623305 627603 632644 638499 644883 651627 658617 665535 671939 677455 681767 684548 685563 684779 682287
60096F82287m069n404o256o468o165n713n419n244m868m109l093j990q03L36J015
$$ 682287 678218 672814 666558 660090 653925 648212 642793 637549 632681 628572 625479 623489 622686 623022 624037
60081F24037J049R37J280J874J933J196K47l97r19j724k755l637m224m697n275
$$ 624037 625086 626023 627303 629177 631110 632306 632553 632156 631237 629513 626758 623121 618897 614200 608925
60066F08925n977o568o733o447o091o014o151o314o569o869o683n673m558m495
$$ 608925 602948 596380 589647 583200 577109 571095 564944 558630 552061 545192 538509 532836 528278 523783
60052E23783n545o581o775o329n618m532l138k143j979k015j332J44J803L192
$$ 523783 518238 511657 504882 498553 492935 488403 485265 483122 481143 479128 477796 477940 479743 482935
60038D82935M149M472M135L669L674M060M209L884L479L354L273K628J193m95
$$ 482935 487084 491556 495691 499360 503034 507094 511303 515187 518666 522020 525293 527921 529114 528619
60024E28619j539j680j678k409l719m669m920n122n800o528o665o292n902n602
$$ 528619 527080 525400 523722 521313 517594 512925 508005 502883 497083 490555 483890 477598 471696 466094
60010D66094n116m300l177j818n80p9m28q09l74O89J505J755J893K286K721K940
$$ 466094 460978 456678 453501 451683 451103 451024 450596 449787 449413 450102 451607 453362 455255 457541 460262 463202
59994D63202L064L256L307K862J945J064P65J151J872K606L378M323N308O066
$$ 463202 466266 469522 472829 475691 477636 478700 479465 480616 482488 485094 488472 492795 498103 504169
59980E04169O567O954P150O949O464O003N439M276K504Q84M1k70o79j369k015
$$ 504169 510736 517690 524840 531789 538253 544256 549695 553971 556475 557359 557400 557130 556451 555082 553067
59965E53067k279k050j500j106j296j837j995j511r51q13p87m01J08J32l68q25
$$ 553067 550788 548738 547238 546132 544836 542999 541004 539493 538542 537729 536942 536541 536649 536781 536413 535588
59949E35588q17m25N8L70L51J24Q7M84J042J329J252R60N58J49o2m0l9j51j6O60
$$ 535588 534771 534346 534404 534774 535125 535249 535336 535820 536862 538191 539443 540403 540961 541110 541048 541008 540969 540818 540802 541462
59929E41462J533J999J993J949K118K347K457K531K709K979L190L208K997K663
$$ 541462 542995 544994 546987 548936 551054 553401 555858 558389 561098 564077 567267 570475 573472 576135
59915E76135K329K024J760J625J572J308P14K36L93R47J135P30K39P3J40L77Q78
$$ 576135 578464 580488 582248 583873 585445 586753 587467 587703 588096 589043 590178 590908 591147 591220 591360 591737 592615
59898E92615J380J426J323J959L233L674K261j99k265l557m394m527l459j564
$$ 592615 593995 595421 596744 598703 601936 605610 607871 607672 605407 601850 597456 592929 589470 587906
59884E87906K40J749L353M885N626N463N051M816M594M414M686N448O082O077
$$ 587906 588146 589895 593248 598133 603759 609222 614273 619089 623683 628097 632783 638231 644313 650390
59870F50390N483M466L022J300l26j757l261m824n897o115n941o185o991p596
$$ 650390 655873 660339 663361 664661 664335 662578 659317 654493 648596 642481 636540 630355 623364 615768
59856F15768p136n617l998l195l122k977k348j581r77k69P62J789K583L625N428
$$ 615768 608632 603015 599017 595822 592700 589723 587375 585794 584817 584548 585310 587099 589682 593307 598735
59841E98735P646R610J1472J3979J7216K0263K2013K1720J8877J3548P071J710
$$ 598735 606381 615991 627463 641442 658658 678921 700934 722654 741531 755079 762150 763860
59829G63860q96p48J093L545N677O349M452k60o725j3193j8363k1800k3377k2862
$$ 763860 762964 762216 763309 766854 772531 778880 783332 783072 776347 763154 744791 722991 699614 676752
59815F76752k0515j7605j5455j3972j2052r487p460o758o630o097n437n448n970
$$ 676752 656237 638632 623177 609205 597153 587666 580206 573448 566818 560721 555284 549836 543866
59802E43866o143n596m548l212j969j560k118k567j975j028j049j972k639k743
$$ 543866 537723 532127 527579 524367 522398 520838 518720 516153 514178 513150 512101 510129 507490 504747
59788E04747l064l831m331m250m146m206l822k802j962j993k584l100l377l399
$$ 504747 501683 497852 493521 489271 485125 480919 477097 474295 472333 470340 467756 464656 461279 457880
59774D57880k985k244j755j818k018j822j163k77N71J089J214J374K046K972L420
$$ 457880 454895 452651 450896 449078 447060 445238 444075 443798 444369 445458 446672 448046 450092 453064 456484
59759D56484L144K491J730J008P88J456K561L365M016N152O476O960O554O332
$$ 456484 459628 462119 463849 464857 465645 467101 469662 473027 477043 482195 488671 495631 502185 508517
59745E08517O626O401N024L329K255J528N53m09q99j254k023k953l395l196k574
$$ 508517 515143 521544 526568 529897 532152 533680 534233 533824 532925 531671 529648 526695 523300 520104 517530
59730E17530j653q03p92j819k949l144k520j914j693j653j628j561j261p18l84
$$ 517530 515877 515074 514282 512463 509514 506370 503850 501936 500243 498590 496962 495401 494140 493422 493038
59715D93038o28j172j425j090k05R11J602J405Q94J260K635L729L732L571M521
$$ 493038 492410 491238 489813 488723 488518 489429 491031 492436 493330 494590 497225 500954 504686 508257 512778
59700E12778O309P608P827P502P336P749Q978J0730J2050J2270J1705J0793R142
$$ 512778 519087 526695 534522 542024 549360 557109 566087 576817 588867 601137 612842 623635 632777
59687F32777O308K979K94j618l263m335l871j947OP45K69q15k033k968l325l408
$$ 632777 639085 642064 642358 640740 637477 633142 629271 627324 627330 628075 628344 627529 625496 622528 619203 615795
59671F15795l938n058o016o054n147l799k599k030k221k692k749k175j259k00
$$ 615795 611857 606799 600783 594729 589582 585783 583184 581154 578933 576241 573492 571317 570058 569858
59657E69858R96K119K731K748K642K985L981N371O513O769O179N481N122M549
$$ 569858 570854 572973 575704 578452 581094 584079 588060 593431 599944 606713 612892 618373 623495 628044
59643F28044L001O28j792l918n866p467q336q599q715q635q002p081o523o164
$$ 628044 631045 631673 629881 625963 620097 612630 604294 595695 586980 578345 570343 563262 556739 550575
59629E50575n141l403j993j474j152m35O8m09j428k003k031k176k718l388m124
$$ 550575 545434 542031 540038 538564 537412 536977 537045 536636 535208 533205 531174 528998 526280 522892 518768
59614E18768n002n575n207m198l724m352n195m987l510j601j20O02N97J13l69
$$ 518768 513766 508191 502984 498786 495062 490710 485515 480528 477018 475417 475297 475899 476496 476609 476240
59599D76240m30j91j96o60j091r66m58k08m08n85k93L84J088J596J777J523R48
$$ 476240 475810 475619 475423 474763 473672 472706 472248 472040 471632 471047 470754 471138 472226 473822 475599 477122 478070
59582D78070M07N7k84o93r09q79j070j823k753l319l661m227m800m654l675k544
$$ 478070 478477 478534 478250 477557 476648 475769 474699 472876 470123 466804 463143 458916 454116 449462 445787 443243
59566D43243j758j172o98p43j470k181k011r95KK96k6m14m50j09L65P99J224J675
$$ 443243 441485 440313 439615 438872 437402 435221 433210 432215 432217 432513 432487 432073 431623 431514 431879 432678 433902 435577
59548D35577J993K072K171K624L297L719L786L871M222M760N655P417J0021J2592
$$ 435577 437570 439642 441813 444437 447734 451453 455239 459110 463332 468092 473747 481164 491185 503777
59534E03777J4671J7233K1267K5280K5447J9155Q070l050j0428j3544j3794j2180
$$ 503777 518448 535681 556948 582228 607675 626830 634900 631850 621422 607878 594084 581904
59522E81904r081n392k467p36O68K475M164M785M271L271K067M87j362k987m199
$$ 581904 572823 567431 564964 564228 564896 567371 571535 576320 580591 583862 585929 586416 585054 582067 577868
59507E77868n214o020o315o183o231o709p143p073o728o546o432o006n246m464
$$ 577868 572654 566634 560319 554136 547905 541196 534053 526980 520252 513706 507274 501268 496022 491558
59493D91558l797l102k237j175L2J104J565J242O60O19J402K548L394L672L694
$$ 491558 487761 484659 482422 481247 481279 482383 483948 485190 485850 486469 487871 490419 493813 497485 501179
59478E01179M088N163O435P001O622O163O604P822Q735Q410O690L946Q15j882
$$ 501179 505267 510430 516865 523866 530488 536651 543255 551077 559812 568222 574912 578858 579673 577791
59464E77791l546m332m823n114m684l282j410L59K037L833N517O734P671Q868
$$ 577791 574245 569913 565090 559976 555292 552010 550600 550959 552996 556829 562346 569080 576751 585619
59450E85619J0422J1880J2937J3787J4708J5658J6378J6577J5815J3559R602M356
$$ 585619 596041 607921 620858 634645 649353 665011 681389 697966 713781 727340 736942 741298
59438G41298j392o906j1573j4884j6635j7067j6619j5531j3937j2282j1257j1103
$$ 741298 739906 733000 721427 706543 689908 672841 656222 640691 626754 614472 603215 592112
59426E92112j1176j0506q821o725m835l091j196O76K163L604N908R279J2777J5561
$$ 592112 580936 570430 561609 554884 550049 546958 545762 546438 548601 552205 558113 567392 580169 595730
59412E95730J7967K0805K4242K8104L2530L6722L7368L0368J5323k705j7012k4318
$$ 595730 613697 634502 658744 686848 719378 756100 793468 823836 839159 836454 819442 795124
59400G95124k5569k3024j8060j1306l156N928J4280J8065J3352K89j5682k7941
$$ 795124 769555 746531 728471 717165 714009 719937 734217 752282 765634 765923 750241 722300
59388G22300l3733l4663l3215l0260k5861k0873j6664j3728j1415r045o763n034
$$ 722300 688567 653904 620689 590429 564568 543695 527031 513303 501888 492843 486080 481046
59376D81046l793k576j313m72k16P1R99K210K753K341J680J539J862K065J828
$$ 481046 477253 474677 473364 472892 472676 472747 473746 475956 478709 481050 482730 484269 486131 488196 490024
59361D90024J409J253J475J719J595J296J544K709M245N389O166P180Q555R740
$$ 490024 491433 492686 494161 495880 497475 498771 500315 503024 507269 512658 518824 526004 534559 544299
59347E44299J0421J1127J2552J4721J6981J8649J9523K0013K0826K2214K3502
$$ 544299 554720 565847 578399 593120 610101 628750 648273 668286 689112 711326 734828
59336G34828K3632K2189J9670J6804J3969J1209Q387N293K036p89k718m152n909
$$ 734828 758460 780649 800319 817123 831092 842301 850688 855981 858017 857228 854510 850358 844449
59323H44449q042r724j0353j0174r733r248q679p874o647n223m487n054o171o498
$$ 844449 836407 826683 816330 806156 796423 787175 778496 770622 763975 758752 754265 749211 743040 736542
59309G36542n959n735o287o710o421o152o482o671n954n036m966n271m528k429
$$ 736542 730583 724848 718561 711851 705430 699278 692796 686125 680171 675135 670169 664898 660370 657941
59295F57941r1J537K585L681N364P952J1298J4747J7980K1692K6691L2343L6309
$$ 657941 657850 659387 661972 665653 671017 678969 690267 705014 722994 744686 771377 803720 840029
59282H40029L5629K8141J3951l399j8121k6058k7505k5585k2473j8420j3654r161
$$ 840029 875658 903799 917750 914351 896230 870172 842667 817082 794609 776189 762535 753374
59270G53374n246j033L882Q434J1458J3004J3662J3440J2085R929P587N204K555
$$ 753374 748128 747095 750977 759411 770869 783873 797535 810975 823060 832989 840576 845780 848335
59257H48335m41l781p532j1504j4971j7206j8085j8005j7436j6758j6204j5675
$$ 848335 847894 844113 836581 825077 810106 792900 774815 756810 739374 722616 706412 690737
59245F90737j4828j3557j2152j0858r539p977o238m590l176j956q18K25R48J120
$$ 690737 675909 662352 650200 639342 629803 621826 615588 610998 607822 605866 605048 605273 606221 607341
59231F07341R84J245K233L341L696L176K298J314R8j234k263k934l715m937o443
$$ 607341 608325 609570 611803 615144 618840 622016 624314 625628 625726 624492 622229 619295 615580 610643 604200
59216F04200p832q664q546p626o852o957p321o694n074l834l744l873l057j554
$$ 604200 596368 587704 579158 571532 564680 557723 550402 543708 538634 534800 531056 527183 524126 522572
59202E22572n04k68j75L75J204J702J549J111J212K320L874M850M974M900N131
$$ 522572 522068 521800 521625 522000 523204 524906 526455 527566 528778 531098 534972 539822 544796 549696 554827
59187E54827N455N673O118O978P693P715P345P287P654Q011Q065P814P220O364
$$ 554827 560282 565955 572073 579051 586744 594459 601804 609091 616745 624756 632821 640635 647855 654219
59173F54219N690N519N449M838L853L453M151N325O034O223O732Q113R792J0591
$$ 654219 659909 665428 670877 675715 679568 683021 687172 692497 698531 704754 711486 719599 729391 739982
59159G39982J0037Q864Q066P741P141N681L486R92j469l665n490p196r123j1102
$$ 739982 750019 758883 766949 774690 781831 787512 790998 791990 790521 786856 781366 774170 765047 753945
59145G53945j2488j2916j2684j2180j1442j0482r559q730p579n872m154l197k978
$$ 753945 741457 728541 715857 703677 692235 681753 672194 663464 655885 650013 645859 642662 639684
59132F39684k694j745k89J136K175K799L175L595M386N698P361Q945J0077J0765
$$ 639684 636990 635245 634956 636092 638267 641066 644241 647836 652222 657920 665281 674226 684303 695068
59118F95068J1412J2425J3776J5119J6217J7152J8025J8659J8613J7509J5441
$$ 695068 706480 718905 732681 747800 764017 781169 799194 817853 836466 853975 869416
59107H69416J3040J1010R454P942O201M443K852J269l16j526k346l572n751q087
$$ 869416 882456 893466 902920 910862 917063 921506 924358 925627 925311 923785 921439 917867 912116 904029
59093I04029r228q964q311q059q081q089q045p737o827n632n080n606o714p897
$$ 904029 894801 885837 877526 869467 861386 853297 845252 837515 830688 825056 819976 814370 807656 799759
59079G99759r231j0783j2136j3010j3662j4250j4353j3547j2092j0648r659r208
$$ 799759 790528 779745 767609 754599 740937 726687 712334 698787 686695 676047 666388 657180
59067F57180r016q437o990n125l871l597l683l623l598l756l694l139k454k017
$$ 657180 648164 639727 632737 627612 623741 620144 616461 612838 609240 605484 601790 598651 596197 594180
59053E94180j724j502j613k028k209j979j907k285k468j838p57M4M18N79N76O19
$$ 594180 592456 590954 589341 587313 585104 583125 581218 578933 576465 574627 573870 573914 574332 574911 575487 576106
59037E76106J205K305L084L116L111L656M135L811L192L188L647L961M467N846
$$ 576106 577311 579616 582700 585816 588927 592583 596718 600529 603721 606909 610556 614517 618984 624830
59023F24830P595Q637R245J0699J3049J4759J4887J4169J3460J2451J0684Q611
$$ 624830 632425 641062 650307 661006 674055 688814 703701 717870 731330 743781 754465 763076
59011G63076O765M691J653k015n082o671o833o106n010l832k539r76P50K312L636
$$ 763076 769841 774532 776185 774170 769088 762417 755584 749478 744468 740636 738097 737121 737871 740183 743819
58996G43819M910N969O171N249L865K841K068P39j371l373m289m345m760o213
$$ 743819 748729 754698 760869 766118 769983 772824 774892 775631 774260 770887 766598 762253 757493 751280
58982G51280p962q898r094r579j0603j1083j0151q437p012n844m210k220p23K48
$$ 751280 743318 734420 725326 715747 705144 694061 683910 675473 668461 662617 658407 656187 655464 655712
58968F55712J711M192O846Q599R324R531R498R284R101R068Q874Q155O970N564
$$ 655712 657423 661615 668461 677060 686384 695915 705413 714697 723798 732866 741740 749895 756865 762429
58954G62429L860J560j354m546p585j0105j1800j2606j2751j2459j1699j0513
$$ 762429 766289 767849 766495 761949 754364 744259 732459 719853 707102 694643 682944 672431
58942F72431r337q631q166p103m998k382j61J285K059K044Q75j177k967l557l213
$$ 672431 663094 654463 646297 639194 634196 631814 631653 632938 634997 637041 637916 636739 633772 630215 627002
58927F27002k937l216l789m387n015n556n797n863o018n918m865k955j241l81
$$ 627002 624065 620849 617060 612673 607658 602102 596305 590442 584424 578506 573641 570686 569445 569064
58913E69064J17R20J867K499K928L443L835L844L871M543N828P249Q616J0003
$$ 569064 569181 570101 571968 574467 577395 580838 584673 588517 592388 596931 602759 610008 618624 628627
58899F28627J1259J2227J3116J4064J4614J4301J3429J2539J1560J0272R304R603
$$ 628627 639886 652113 665229 679293 693907 708208 721637 734176 745736 756008 765312 774915
58887G74915J1067J2736J4289J6368J9128K1523K2364K1497J9502J6904J3966
$$ 774915 785982 798718 813007 829375 848503 870026 892390 913887 933389 950293 964259
58876I64259J0844P556M112P54k260n105q095j0995j3093j4030j4024j3310j1958
$$ 964259 975103 982659 986771 987525 985265 980160 972065 961070 947977 933947 919923 906613 894655
58863H94655j0375r265q925r042r348r907j0692j1490j2413j3810j5486j6708
$$ 894655 884280 875015 866090 857048 847700 837793 827101 815611 803198 789388 773902 757194
58851G57194j7254j7749j8438j8401j6668j3698j0996r427q582p718o728o031
$$ 757194 739940 722191 703753 685352 668684 654986 643990 634563 625981 618263 611535 605504
58839F05504n907o168o311n982n348m997n304n902n962n061l711k834k807l131
$$ 605504 599597 593429 587118 581136 575788 570791 565487 559585 553623 548562 544851 542017 539210 536079
58825E36079l136k799k561k541k362j835j287j047r92q47n27J8Q86J800K193K007
$$ 536079 532943 530144 527583 525042 522680 520845 519558 518511 517519 516672 516145 516163 517049 518849 521042 523049
58809E23049J981K548L021K593J653J334J893K454K299J659J146R58Q83O57K82
$$ 523049 525030 527578 530599 533192 534845 536179 538072 540526 542825 544484 545630 546588 547471 548128 548410
58794E48410J78Q43K057K802K418J463R37J073J556K397L656M779N179N298O045
$$ 548410 548588 549431 551488 554290 556708 558171 559108 560181 561737 564134 567790 572569 577748 583046 589091
58779E89091P333Q300Q872R861J1396J2421J2121J0773Q849O239K877o71l747
$$ 589091 596424 604724 613596 623457 634853 647274 659395 670168 679017 685256 688133 687462 683715
58766F83715o134p715q323q229q092q075p672o670n597m917m519m213l983l558
$$ 683715 677581 669866 661543 653314 645222 637147 629475 622805 617208 612291 607772 603559 599576 596018
58752E96018k530j225m84k65N12K207L619L616K727K243K563L313M396N889P372
$$ 596018 593488 592263 591779 591514 592026 594233 597852 601468 604195 606438 609001 612314 616710 622599 629971
58737F29971Q409R304J0493J1505J1507J0738J0414J1155J2312J2963J2919J2475
$$ 629971 638380 647684 658177 669682 681189 691927 702341 713496 725808 738771 751690 764165
58725G64165J1787J0750R334P769O531O014O111O262O166O268P218Q945J0570
$$ 764165 775952 786702 796036 803805 810336 816350 822461 828723 834889 841157 848375 857320 867890
58712H67890J1287J1107J0626J0188R413P703N105K331k67l238p192j1742j5917
$$ 867890 879177 890284 900910 911098 920511 928214 933319 935650 935383 932145 924953 913211 897294
58699H97294j9324k2195k4451k5633k5751k5411k4921k4028k2681k1286k0007
$$ 897294 877970 855775 831324 805691 779940 754529 729608 705580 682899 661613 641606
58688F41606j8545j6830j5207j3632j1634r357p772p318p115o095m351k732j725
$$ 641606 623061 606231 591024 577392 565758 556401 548629 541311 534196 528101 523750 521018 519293
58675E19293j254j098r59m87L20J102J733K501L497M495N585P215R298J1052J2034
$$ 519293 518039 516941 515982 515495 515815 516917 518650 521151 524648 529143 534728 541943 551241 562293 574327
58660E74327J2473J2322J0961Q300N170K108j184m545o716o930o153n674n441
$$ 574327 586800 599122 610083 618383 623553 625661 624477 619932 613216 606286 600133 594459 589018
58647E89018m835m241m449n168n453n206n031m964m585m086m054m371m340l763
$$ 589018 584183 579942 575493 570325 564872 559666 554635 549671 545086 541000 536946 532575 528235 524472
58633E24472k894j674lJ461J930J652J460J378P66k93j001j148j263j466j278
$$ 524472 521578 519904 519901 521362 523292 524944 526404 527782 528548 528255 527254 526106 524843 523377 522099
58618E22099o49k9O19J768L185M027M284M948O418P826Q324P980O957N033K569
$$ 522099 521450 521421 522040 523808 526993 531020 535304 540252 546670 554496 562820 570800 577757 582790 585359
58603E85359R14Q56J462J307K92o43j068j407j896k136j779j091o06n31n87k65
$$ 585359 586273 587129 588591 589898 590190 589547 588479 587072 585176 583040 581261 580170 579564 579033 578446 578181
58587E78181P68K402M176N692O862P873Q968J0211J1269J1591J1050J0271R968
$$ 578181 578949 581351 585527 591219 598081 605954 614922 625133 636402 647993 659043 669314 679282
58574F79282J0067R857Q939P682O742O539P162Q411R915J1504J3471J6202J9535
$$ 679282 689349 699206 708145 715827 722569 729108 736270 744681 754596 766100 779571 795773 815308
58561H15308K2755K5161K6423K6603K6144K5633K5157K3987K1348J7347J2817
$$ 815308 838063 863224 889647 916250 942394 968027 993184 1017171 1038519 1055866 1068683
58550A068683Q349L905o93n363r764j3417j5919j7415j8573j9793k0687k0825
$$ 1068683 1077032 1080937 1080244 1074881 1065117 1051700 1035781 1018366 999793 980000 959313 938488
58538I38488k0583k0644k0982k1074k0879k0750k0592j9898j8630j7151j5347
$$ 938488 917905 897261 876279 855205 834326 813576 792984 773086 754456 737305 721958
58527G21958j2739r672p425o700o691o105m577k678j099k40j74n33o49j94N23
$$ 721958 709219 699547 692122 685422 678731 672626 668049 665371 664272 664032 663858 663325 662676 662482 663005
58512F63005J003J110J008Q89R56J386K099K691K707J944O38n19p51PQ14O69k97
$$ 663005 664008 665118 666126 667015 667971 669357 671456 674147 676854 678798 679436 678917 678166 678173 678987 679656 679359
58495F79359j025r03l96k36m25l38N26J987L317L839L596L299L524M212N126O386
$$ 679359 678334 677431 677035 676799 676374 676036 676562 678549 681866 685705 689301 692600 696124 700336 705462 711848
58479G11848Q154J0090J1701J2928J3936J4545J4509J4039J3436J2381J0267P051
$$ 711848 720002 730092 741793 754721 768657 783202 797711 811750 825186 837567 847834 854885
58467H54885L217q65m832p834r151r173q925q693p992o843n976n588m919l369
$$ 854885 858102 857237 852405 844571 835420 826247 817322 808629 800637 793794 787818 782230 777311 773942
58453G73942j182J216L701N902P101P185O897O656N864L872J027j790m137n972
$$ 773942 772760 773976 777677 783579 790680 797865 804762 811418 817282 821154 822181 820391 816254 810282
58439H10282p196p712p555o579m591k107l38K42O39J984L897N027M909M366M193
$$ 810282 803086 795374 787819 781240 776649 774542 774204 774446 775085 777069 780966 785993 790902 795268 799461
58424G99461M342M630N410P056R083J0366J0231R032P605O416N359M203K914J554
$$ 799461 803803 808433 813843 820899 829982 840348 850579 859611 867216 873632 878991 883194 886108 887662
58410H87662K10q89j548k025k886m217n395n926o052o111n832m844l464k256j176
$$ 887662 887872 886983 885435 883410 880524 876307 870912 864986 858934 852823 846991 842147 838683 836427 835251
58395H35251J03J301J874K040K530L337L651L195K614K327J887R30J3o8O76J573
$$ 835251 835354 836655 838529 840569 843099 846436 850087 853282 855896 858223 860110 861040 861053 860985 861661 863234
58379H63234K228K913M109N933P936R492J0375J0747J0554R443P624O187N957
$$ 863234 865462 868375 872484 878417 886353 895845 906220 916967 927521 936964 944588 950775 956732
58366I56732O467O804O996P689Q828R724J0238J0921J2016J3265J4542J5731J6101
$$ 956732 963199 970003 976999 984688 993516 1003240 1013478 1024399 1036415 1049680 1064222 1079953 1096054
58353A096054J4900J2618J0652R606Q877P958P041O306N656N324N796O912P973
$$ 1096054 1110954 1123572 1134224 1143830 1152707 1160665 1167706 1174012 1179668 1184992 1190788 1197700 1205673
58340A205673Q794R745J0787J1499J1987J2636J3095J2781J2296J2830J4133J4791
$$ 1205673 1214467 1224212 1234999 1246498 1258485 1271121 1284216 1296997 1309293 1322123 1336256 1351047
58328A351047J4595J4903J6209J7173J6735J5507J4339J3099J1742J0950J0742
$$ 1351047 1365642 1380545 1396754 1413927 1430662 1446169 1460508 1473607 1485349 1496299 1507041
58317A507041R986Q319P138P510Q551R063R462J0642J2188J3199J3963J5281J6843
$$ 1507041 1517027 1525346 1532484 1539994 1548545 1557608 1567070 1577712 1589900 1603099 1617062 1632343 1649186
58304A649186J7709J7851J7988J8426J9067J9999K1159K1956K2095K2130K2467
$$ 1649186 1666895 1684746 1702734 1721160 1740227 1760226 1781385 1803341 1825436 1847566 1870033
58293A870033K2635K2379K2475K3597K5209K6560K7921K9860L2132L4235L6283
$$ 1870033 1892668 1915047 1937522 1961119 1986328 2012888 2040809 2070669 2102801 2137036 2173319
58282B173319L8515M0692M2752M5070M7425M8860M9180M9283M9293M8044M5391
$$ 2173319 2211834 2252526 2295278 2340348 2387773 2436633 2485813 2535096 2584389 2632433 2677824
58271B677824M3321M3430M4924M6585M8974N3013N7856O2063O5650O9263P2688
$$ 2677824 2721145 2764575 2809499 2856084 2905058 2958071 3015927 3077990 3143640 3212903 3285591
58260C285591P5828P9801Q5107R0085R3054R4655R6186R7149R6616R5596R5691
$$ 3285591 3361419 3441220 3526327 3616412 3709466 3804121 3900307 3997456 4094072 4189668 4285359
58249D285359R6760R8142J00795J05785J12084J18316J25288J34131J43572J51901
$$ 4285359 4382119 4480261 4581056 4686841 4798925 4917241 5042529 5176660 5320232 5472133
58239E472133J60113J69965J80534J90080J99777K11930K25781K38985K51998
$$ 5472133 5632246 5802211 5982745 6172825 6372602 6584532 6810313 7049298 7301296
58230G301296K67109K84252L01911L20947L43222L67633L92184M18750M50641
$$ 7301296 7568405 7852657 8154568 8475515 8818737 9186370 9578554 9997304 10447945
58221A0447945M86717N23505N62162O07190O59024P14531P74525Q43779R23474
$$ 10447945 10934662 11458167 12020329 12627519 13286543 14001074 14775599 15619378 16542852
58212A6542852J011096J108180J220714J351459J500104J671683J876476K121206
$$ 16542852 17553948 18662128 19882842 21234301 22734405 24406088 26282564 28403770
58204B8403770K410071K755396L177186L692228M316087N075834O005464P127001
$$ 28403770 30813841 33569237 36746423 40438651 44754738 49830572 55836036 62963037
58196F2963037Q453010J0010255J1843506J3998365J6526308J9502372K2995117
$$ 62963037 71416047 81426302 93269808 107268173 123794481 143296853 166291970
58189A66291970K7005290L1442403L6051556M0099111M1984377L9449028L0795495
$$ 166291970 193297260 224739663 260791219 300890330 342874707 382323735 413119230
58182D13119230J6394993r37888j7276088k9564153l6684783l9140236l8143156
$$ 413119230 429514223 428576335 411300247 381736094 345051311 305911075 267767919
58175B67767919l4970072l0693434k6055945k1455718j7084041j3049377r355784
$$ 267767919 232797847 202104413 176048468 154592750 137508709 124459332 115103548
58168A15103548n932306k906093q35052m33143j894871m531865p169398q907106
$$ 115103548 109171242 106265149 105430097 104996954 103102083 98570218 91400820 82493714
58160H2493714r514074r244806q461398p441525o374433n380034m507188l757780
$$ 82493714 72979640 63734834 55273436 47831911 41457478 36077444 31570256 27812476
58152B7812476l126693k610963k195850j857349j578623j351178j164037j005026
$$ 27812476 24685783 22074820 19878970 18021621 16442998 15091820 13927783 12922757
58144A2922757q70908p64954o84773o21095n67826n25265m93098m66989m42855
$$ 12922757 12051849 11286895 10602122 9981027 9413201 8887936 8394838 7927849 7484994
58135G484994m19063l93763l64830l33192l02328k73787k46392k19875j95849
$$ 7484994 7065931 6672168 6307338 5974146 5671818 5398031 5151639 4931764 4735915
58126D735915j75096j57350j44178j38617j40739j46181j50068j50407j47190
$$ 4735915 4560819 4403469 4259291 4120674 3979935 3833754 3683686 3533279 3386089
58117C386089j40787j32342j23735j15758j07589r8833r0646q4154p9117p4884
$$ 3386089 3245302 3112960 2989225 2873467 2765878 2667045 2576399 2492245 2413128 2338244
58107B338244p1367o8372o5170o1618n8646n6938n5995n5149n4524n4296n3865
$$ 2338244 2266877 2198505 2133335 2071717 2013071 1956133 1900138 1844989 1790465 1736169 1682304
58096A682304n2573n0613m8462m5946m2539l8157l3188k8109k3475j9866j7360
$$ 1682304 1629731 1579118 1530656 1484710 1442171 1404014 1370826 1342717 1319242 1299376 1282016
58085A282016j5446j3760j2590j2341j2937j4007j5373j7024j8888k0801k2464
$$ 1282016 1266570 1252810 1240220 1227879 1214942 1200935 1185562 1168538 1149650 1128849 1106385
58074A106385k3429k3499k3143k2993k2902k2088k0417j8849j8261j8329j8025
$$ 1106385 1082956 1059457 1036314 1013321 990419 968331 947914 929065 910804 892475 874450
58063H74450j6879j5315j3947j2895j1828j0506r271q865r604j0926j1946j2333
$$ 874450 857571 842256 828309 815414 803586 793080 783809 774944 765340 754414 742468 730135
58051G30135j2239j1769j0989j0302j0044r888r248q224p443p009o467n782n437
$$ 730135 717896 706127 695138 684836 674792 664904 655656 647432 639989 632980 626513 620731 615294
58038F15294n473n377n193n687o972p948p771p067o945p586q532r677j1009j1868
$$ 615294 609821 604444 599251 593564 586592 578644 570873 563806 556861 549275 540743 531066 520057 508189
58024E08189j1547j0413r505r071q387p020n519m634m513m837n276n503n155m163
$$ 508189 496642 486229 476724 467653 459266 452246 446727 442093 437580 432743 427467 421964 416809 412646
58010D12646l009k443k816l657l971l271k247k067k862l458k876j555o31m63n59
$$ 412646 409637 407194 404378 400721 396750 393479 391232 389165 386303 382845 379969 378414 377783 377320 376761
57995C76761n23l36K44J642L721N634O677O896O748O484N986M949L190J035p07
$$ 376761 376238 375902 376146 377788 381509 387143 393820 400716 407464 413948 419934 424883 428073 429108 428401
57980D28401j526j880k637l896m833m770l900k868k129j792j695j442p67k4J40
$$ 428401 426875 424995 422358 418462 413629 408859 404959 402091 399962 398170 396475 395033 394266 394242 394382
57965C94382k90n21P8J250K299K788K590J725N67k27m50o91j523k586l011k575
$$ 394382 394092 393571 393649 394899 397198 399986 402576 404301 404868 404641 404191 403500 401977 399391 396380 393805
57949C93805j949j853k346k910k945k213j121m58n86r77q21L1J055J809K331K844
$$ 393805 391856 390003 387657 384747 381802 379589 378468 378010 377424 376447 375626 375657 376712 378521 380852 383696
57933C83696L527M530N824P004P582P523P207O936O804O935P339P601P200O212
$$ 383696 387223 391753 397577 404581 412163 419686 426893 433829 440633 447568 454907 462508 469708 475920
57919D75920N190M221K770N96j739l599m932n976o744p277p865q582r028q871
$$ 475920 481110 485331 488101 488697 486958 483359 478427 472451 465707 458430 450565 441983 432955 424084
57905D24084q336p677o801n866n703o777q203q663q025p229o802o502o264o289
$$ 424084 415748 408071 401270 395404 389701 382924 374721 366058 358033 350804 344002 337500 331236 324947
57891C24947o129m953l082k057k545l250k762j535r28j009n93Q03K300L053L235
$$ 324947 318818 313865 310783 308726 306181 302931 300169 298634 297706 296697 296104 296907 299207 302260 305495
57876C05495L382L538L428K924J981N88r83k231k985l598m364n073n362n235m976
$$ 305495 308877 312415 315843 318767 320748 321336 320353 318122 315137 311539 307175 302102 296740 291505 286529
57861B86529m699m256l519k583j725j173q33l26O40J963L376M812O279P544Q344
$$ 286529 281830 277574 274055 271472 269747 268574 267741 267415 268055 270018 273394 278206 284485 292029 300373
57846C00373Q859R513J0263J0572J0147R272Q255P031N605M403L773L417K700
$$ 300373 309232 318745 329008 339580 349727 358999 367254 374285 379890 384293 388066 391483 394183
57833C94183J383l14k109l789n141o100o866p508p642o847n342l840k821k265
$$ 394183 395566 395252 393143 389354 384213 378113 371247 363739 356097 349250 343908 340068 337247 334982
57819C34982j998j826j454o95J48N83O62R36J525J770J152J47l44j95j51q23j992
$$ 334982 332984 331158 329704 329009 329157 329740 330402 331338 332863 334633 335785 335932 335588 335393 335242 334419 332427
57802C32427l029l689m307n313o644p701p871p087n823m547l399k414j820j768
$$ 332427 329398 325709 321402 316089 309445 301744 293873 286786 280963 276416 273017 270603 268783 267015
57788B67015j933j690p60M48J250J329J002Q82J266J857K172K232K608L625M757
$$ 267015 265082 263392 262632 263080 264330 265659 266661 267543 268809 270666 272838 275070 277678 281303 286060
57773B86060N138M627M005M121N105O475P680Q325Q148P151N737M452L459K393
$$ 286060 291198 295825 299830 303951 309056 315531 323211 331536 339684 346835 352572 357024 360483 362876
57759C62876Q06j306l461n185o468p644q943j0177j0977j1110j0635r777q746
$$ 362876 363682 362376 358915 353730 347262 339618 330675 320498 309521 298411 287776 277999 269253
57746B69253p602o306m920l737l047k759k570k459k719l331l691l297k392j533
$$ 269253 261651 255345 250425 246688 243641 240882 238312 235853 233134 229803 226112 222815 220423 218890
57732B18890p91R6R43J158O15l7j74J27M08M65M59O38J186K075K926L219K821
$$ 218890 218099 218195 219138 220296 220911 220874 220700 220827 221235 221700 222159 222797 223983 226058 228984 232203 235024
57715B35024K166J724J505J221P35K19j7K52R40J616J834J547J072P18P31J464
$$ 235024 237190 238914 240419 241640 242375 242594 242577 242829 243769 245385 247219 248766 249838 250556 251287 252751
57699B52751L101N188O933Q064Q995J0016J0842J1148J0944J0149Q286N065R38
$$ 252751 255852 261040 267973 276037 285032 295048 305890 317038 327982 338131 346417 351482 352420
57686C52420l254o859r428j0606j0495r684q545o815m259j244J794M986Q669J2731
$$ 352420 349166 342307 332879 322273 311778 302094 293549 286734 282475 281231 283025 288011 296680 309411
57672C09411J6991K1760K7422L3806M0614M8285N7674O8725P9621Q6574Q4197
$$ 309411 326402 348162 375584 409390 450004 498289 555963 624688 704309 790883 875080
57661H75080O7615L6497k575l9102o5050p8512q2050p9057p2077o2976n3169m3637
$$ 875080 942695 979192 976617 937515 872465 793953 711903 632846 560769 497793 444624 400987
57649D00987l5128k8147k2607j7957j3926j0741q463o676n103l939l255k607j653
$$ 400987 365859 337712 315105 297148 283222 272481 264018 257342 252239 248300 245045 242438 240785
57636B40785o85j32M9O6j35n25n72J58J182J452N97o56j343j305j158j400j757
$$ 240785 240100 239968 240017 240083 239948 239423 238851 239009 240191 241643 242240 241584 240241 238936 237778 236378 234621
57619B34621j618j029q14j405k053j787q54l67n58m38N66J575J488N01k95m07
$$ 234621 233003 231974 231160 229755 227702 225915 225061 224694 224136 223698 224264 225839 227327 227828 227533 227126
57603B27126k79l82o88r55j014p60k45K43M35L79K73J42r9m35q02j195j579j862
$$ 227126 226847 226465 225777 224822 223808 223048 222803 223046 223481 223860 224133 224275 224176 223741 222939 221744 220165 218303
57585B18303k070k321k477k137j223k44J94o1q23j831k666k780k036r48j85k7
$$ 218303 216233 213912 211435 209298 208075 207831 208025 207964 207141 205310 202644 199864 197828 196880 196695 196668
57569A96668m36j316k300k745k355j587j032o76j90K83K32l77q52n60L32J057
$$ 196668 196232 194916 192616 189871 187516 185929 184897 184221 184031 184314 184546 184169 183317 182757 183089 184146
57553A84146J053M56j13k35JM27J145K131K745K289J077K66M40R78J047O43K39
$$ 184146 185199 185655 185542 185307 185308 185735 186880 189011 191756 194045 195122 195388 195828 196806 197853 198496 198735
57536A98735N4J62Q08J981L027L252K723K007J418R61P61R38J259J315J041O91
$$ 198735 198789 198951 199759 201740 204767 208019 210742 212749 214167 215128 215889 216827 218086 219401 220442 221133
57520B21133M54L83N26Q84J377K005K702K932K015K18j070p66O59J912K416K506
$$ 221133 221587 221970 222496 223380 224757 226762 229464 232396 234411 234629 233559 232793 233452 235364 237780 240286
57504B40286K490K201J459M04o22j232j263j062j204j595j449n06L93N03K86N55
$$ 240286 242776 244977 246436 246840 246218 244986 243723 242661 241457 239862 238413 237907 238300 238803 239089 239644
57488B39644J107J216R78J032J285J015K18l26l27k55j76N54K041L263L298K422
$$ 239644 240751 241967 242945 243977 245262 246277 246495 246169 245842 245587 245411 245965 248006 251269 254567 256989
57472B56989J502R10N24K53Q3p5j53J29Q59J723K432L002L420L422K854K033J482
$$ 256989 258491 259401 259925 260178 260261 260186 260033 260162 261021 262744 265176 268178 271598 275020 277874 279907 281389
57455B81389J515K101K884L320L102K544K218K232K225K077K109K473K799K717
$$ 281389 282904 285005 287889 291209 294311 296855 299073 301305 303530 305607 307716 310189 312988 315705
57441C15705K422K444K978L632L776L219K550K570L261L706L286K491K043J786
$$ 315705 318127 320571 323549 327181 330957 334176 336726 339296 342557 346263 349549 352040 354083 355869
57427C55869J273R42J633L030L766L313K610K532K720K538K147J952J708J072
$$ 355869 357142 358084 359717 362747 366513 369826 372436 374968 377688 380226 382373 384325 386033 387105
57413C87105N62R77K170L148L391L323L507L935M281M406M361M139L693L133K743
$$ 387105 387667 388644 390814 393962 397353 400676 404183 408118 412399 416805 421166 425305 428998 432131 434874
57398D34874K702K803K695K494K885M243N818O434N906N171M881M616L882L188
$$ 434874 437576 440379 443074 445568 448453 452696 458514 464948 470854 476025 480906 485522 489404 492592
57384D92592L478M800O234P005P124O892O396N716N231N327N891O316O152N597
$$ 492592 496070 500870 507104 514109 521233 528125 534521 540237 545468 550795 556686 563002 569154 574751
57370E74751N234N326N595N698N698N888O302O672O749O502O101N893O172O699
$$ 574751 579985 585311 590906 596604 602302 608190 614492 621164 627913 634415 640516 646409 652581 659280
57356F59280O722N875M884M842N910P197P929Q132Q093P836P414P254P701Q502
$$ 659280 666002 671877 676761 681603 687513 694710 702639 710771 718864 726700 734114 741368 749069 757571
57342G57571R107R335R438R568R511R002Q173P518P459P994Q812R627J0219J0340
$$ 757571 766678 776013 785451 795019 804530 813532 821705 829223 836682 844676 853488 863115 873334 883674
57328H83674R920R390R318R623R583Q918Q338Q633R657J0650J1174J1197J0746
$$ 883674 893594 902984 912302 921925 931508 940426 948764 957397 967054 977704 988878 1000075 1010821
57315A010821J0080R870J0507J1435J1838J1774J1961J2657J3501J4199J4662
$$ 1010821 1020901 1030771 1041278 1052713 1064551 1076325 1088286 1100943 1114444 1128643 1143305
57304A143305J4654J4152J3881J4631J6063J7074J7262J7151J7098J7012J7113
$$ 1143305 1157959 1172111 1185992 1200623 1216686 1233760 1251022 1268173 1285271 1302283 1319396
57293A319396J7810J8668J8682J7844J7280J7506J7725J7392J7242J7988J9108
$$ 1319396 1337206 1355874 1374556 1392400 1409680 1427186 1444911 1462303 1479545 1497533 1516641
57282A516641J9809K0357K1403K2710K3569K3955K4352K4692K4460K3675K3005
$$ 1516641 1536450 1556807 1578210 1600920 1624489 1648444 1672796 1697488 1721948 1745623 1768628
57271A768628K2948K3434K4065K4322K3831K2868K2288K2543K3146K3566K4130
$$ 1768628 1791576 1815010 1839075 1863397 1887228 1910096 1932384 1954927 1978073 2001639 2025769
57260B025769K5357K6866K7740K7818K7854K8447K9415L0256L0708L0809L0795
$$ 2025769 2051126 2077992 2105732 2133550 2161404 2189851 2219266 2249522 2280230 2311039 2341834
57249B341834L0984L1483L2103L2668L3247L3825L4085L3825L3310L2957L2911
$$ 2341834 2372818 2404301 2436404 2469072 2502319 2536144 2570229 2604054 2637364 2670321 2703232
57238B703232L3273L4256L5747L7123L8004L8862M0257M1758M2280M1439L9990
$$ 2703232 2736505 2770761 2806508 2843631 2881635 2920497 2960754 3002512 3044792 3086231 3126221
57227C126221L8907L8450L8200L7651L6714L5818L5494L5742L5950L5585L4707
$$ 3126221 3165128 3203578 3241778 3279429 3316143 3351961 3387455 3423197 3459147 3494732 3529439
57216C529439L3658L2552L1383L0290K9466K8990K9008K9709L0840L1758L2270
$$ 3529439 3563097 3595649 3627032 3657322 3686788 3715778 3744786 3774495 3805335 3837093 3869363
57205C869363L3005L4386L5734L5984L5134L4173L3780L3751L3721L3786L4144
$$ 3869363 3902368 3936754 3972488 4008472 4043606 4077779 4111559 4145310 4179031 4212817 4246961
57194D246961L4624L4859L4689L4197L3537L2842L2226L1752L1444L1273L1140
$$ 4246961 4281585 4316444 4351133 4385330 4418867 4451709 4483935 4515687 4547131 4578404 4609544
57183D609544L0941L0699L0547L0546L0662L0865L1063L1063L0820L0644L0738
$$ 4609544 4640485 4671184 4701731 4732277 4762939 4793804 4824867 4855930 4886750 4917394 4948132
57172D948132L0691K9929K8675K7692K7063K6037K4411K3123K2868K2852K1765
$$ 4948132 4978823 5008752 5037427 5065119 5092182 5118219 5142630 5165753 5188621 5211473 5233238
57161E233238J9492J6984J4711J2221R194O086L446J201r98l104m714n623o063
$$ 5233238 5252730 5269714 5284425 5296646 5305840 5311926 5315372 5316573 5315575 5312471 5307757 5302134 5296071
57148E296071o388o818p449q303r030q730o593k947Q47L922O917J0859J5448J9232
$$ 5296071 5289683 5282865 5275416 5267113 5258083 5249353 5242760 5239813 5240660 5244582 5251499 5262358 5277806 5297038
57134E297038K1286K1830K1265J9477J6348J2181P387K319k417o168q792j0389
$$ 5297038 5318324 5340154 5361419 5380896 5397244 5409425 5416812 5419131 5416714 5410546 5401754 5391365
57122E391365j0530q582m859l90M545J0604J7804K4890L0854L6114M1702M8187
$$ 5391365 5380835 5372253 5367394 5367004 5371549 5382153 5399957 5424847 5455701 5491815 5533517 5581704
57110E581704N5967O5771P8246R3641J12295J34740J61155J91791K28319K73693
$$ 5581704 5637671 5703442 5781688 5875329 5987624 6122364 6283519 6475310 6703629 6977322
57100F977322L30233L98895M80638N77184O89700Q17932R60992J117792J286355
$$ 6977322 7307555 7706450 8187088 8764272 9453972 10271904 11232896 12350688 13637043
57091A3637043J464368J650931J845928K046783K247481K440774K618492K768602
$$ 13637043 15101411 16752342 18598270 20645053 22892534 25333308 27951800 30720402
57083C0720402K874430K916341K867988K689101K333245J779256J061845K67072
$$ 30720402 33594832 36511173 39379161 42068262 44401507 46180763 47242608 47509680
57075D7509680n07159j189831j747333k172933k475410k672361k783012k821790
$$ 47509680 47002521 45812690 44065357 41892424 39417014 36744653 33961641 31139851
57067C1139851k798139k720626k598723k441743k258942k060763j857860j658442
$$ 31139851 28341712 25621086 23022363 20580620 18321678 16260915 14403055 12744613
57059A2744613j467616j288905j125079r77713q47197p33213o34605n49325m75526
$$ 12744613 11276997 9988092 8863013 7885300 7038103 6304890 5670285 5120960 4645434
57050D645434m12402l59196l14100k75176k41794k14033j91075j71397j54239
$$ 4645434 4233032 3873836 3559736 3284560 3042766 2828733 2637658 2466261 2312022
57041B312022j39655j27209j15808j04993r5282q6991p9565p2402o5694n9915
$$ 2312022 2172367 2045158 1929350 1824357 1729075 1642084 1562519 1490117 1424423 1364508
57031A364508n4963n0192m5207m0266l5865l1977k7860k2783j6802j0530m160
$$ 1364508 1309545 1259353 1214146 1173880 1138015 1106038 1078178 1055395 1038593 1028063 1023903
57020A023903K892J1453K2145L5375N1116O8876Q8857J12844J41431J68346J78849
$$ 1023903 1026795 1038248 1060393 1095768 1146884 1215760 1304617 1417461 1558892 1727238 1906087
57009A906087J57439R9960J8827o3817j28642j67053j80605j75930j60490j40673
$$ 1906087 2063526 2163486 2182313 2118496 1989854 1822801 1642196 1466266 1305776 1165103
56999A165103j20879j02984q6932p2427n9954n0062m2228l5204k8367k2157j7217
$$ 1165103 1044224 941240 854308 781881 721927 671865 629637 594433 566066 543909 526692
56988E26692j3646j1088r037o981m750k792j722j641k430m490q369j3457j7884
$$ 526692 513046 501958 492921 485940 481190 478398 476676 475035 472605 468115 459746 446289 428405
56975D28405k0084j9991j8492j6379j4171j2297j0803r228p191m914k820r39J022
$$ 428405 408321 388330 369838 353459 339288 326991 316188 306960 299769 294855 292035 291096 292118
56962B92118L251N746Q443J1201J3882J6403J8485J9287J7713J3302O623j136
$$ 292118 295369 301115 309558 320759 334641 351044 369529 388816 406529 419831 426454 425318
56950D25318q547j4220j7363j8341j8115j7082j4987j1972q853o147l563q81J420
$$ 425318 416771 402551 385188 366847 348732 331650 316663 304691 295838 289691 286128 285247 286667
56937B86667L010M566P094J0720J4741J8632K2362K5687K7493K6055K0156J0249
$$ 286667 289677 294243 301337 312057 326798 345430 367792 393479 420972 447027 467183 477432
56925D77432j390j2001j9957k4981k7205k6775k4503k1927k0107j8723j6864j4326
$$ 477432 476042 464041 444084 419103 391898 365123 340620 318693 298586 279863 262999 248673
56913B48673j1725r587p908o529n547n128n104m900m057k794j756j153n44K95
$$ 248673 236948 227361 219453 212924 207377 202249 197145 192245 188188 185394 183638 182485 181941 182236
56899A82236Q74Q67Q86J599K591L137L710N504Q436J1006J2402J3541J5525J8072
$$ 182236 183110 183977 184863 186462 189053 192190 195900 201404 209840 220846 233248 246789 262314 280386
56885B80386K0110K1008K0462J7855J2655N311k648r275j3082j3879j2908j1551
$$ 280386 300496 321504 341966 359821 372476 377787 375139 365864 352782 338903 325995 314444
56873C14444r906p191l484M7K810N473Q673J2185J5837K0114K5111L0042L4596
$$ 314444 304538 297347 293863 293910 296720 302193 310866 323051 338888 359002 384113 414155 448751
56860D48751L9671M5519M9948M9586M2565K9331J1721p338k3924l4671l8855l8276
$$ 448751 488422 533941 583889 633475 676040 705371 717092 709754 685830 651159 612304 574028
56848E74028l5147l0687k5374j9437j2813n402K282R238J4993K0228K6345L4420
$$ 574028 538881 508194 482820 463383 450570 445168 447450 456688 471681 491909 518254 552674
56836E52674M4435N5245O5492P4376Q0848Q1944P3227N2241K1639j1743m0870
$$ 552674 597109 652354 717846 792222 873070 955014 1028241 1080482 1102121 1090378 1049508
56825A049508o1605p3001p6212p3366o6649n7780m8151l9017l0907k3132j4643
$$ 1049508 987903 914902 838690 765324 698675 640895 592744 553727 522820 499688 485045
56814D85045n461L355J1152J8535K6433L4859M3048N0383N6290N8952N4956M1457
$$ 485045 479584 482939 494091 512626 539059 573918 616966 667349 723639 782591 837547 879004
56802H79004J9261o669l0288m7932n8792o3229o1942n6494m9186m1763l4773k8221
$$ 879004 898265 891596 861308 813376 754584 691355 629413 572919 523733 481970 447197 418976
56790D18976k2056j5988r742l743J324N770J0652J6072K0851K4333K7087K9003
$$ 418976 396920 380932 371190 367447 368771 374541 385193 401265 422116 446449 473536 502539
56778E02539K7956K1698J0492l040j6122k6942l4367l7926l8197l6366l3354k9746
$$ 502539 530495 552193 562685 559645 543523 516581 482214 444288 406091 369725 336371 306625
56766C06625k6180k3116k0407j7586j4500j1412q803p201o696o452n436l868l049
$$ 306625 280445 257329 236922 219336 204836 193424 184621 177420 170724 164272 158836 154968 151919
56753A51919l443l925l476k515j836j340p64o34j329k024j743q19k29j51l14j021
$$ 151919 148476 144551 141075 138560 136724 135384 134620 133986 132657 130633 128890 128071 127842 127691 127377 126356
56737A26356k479l694l467k143j043n58j37K45Q3l62k57L01M37J19K34Q87J117
$$ 126356 123877 120183 116716 114573 113530 112972 112835 113080 113163 112801 112544 112845 113282 113401 113635 114522 115639
56720A15639O10L12P95J248Q02j48o57m60J27Q26J307J111K62m49l14M67J172
$$ 115639 116249 116561 117356 118604 119406 119258 118601 118141 118268 119094 120401 121512 121774 121325 121011 121478 122650
56703A22650J393J193P88L98K22K72L58L39K04j1j77m7M12P08L13n97j312j507
$$ 122650 124043 125236 126024 126422 126644 126916 127274 127613 127817 127806 127629 127582 127994 128702 129015 128418 127106 125599
56685A25599j566j881k175j775m61J074J763J294N80O93J466J745J083L45L24
$$ 125599 124033 122152 119977 118202 117741 118815 120578 121872 122452 123145 124611 126356 127439 127784 128108
56670A28108O48N87J28l96r69j378q31R02K561K745J777J079J046Q21R8j98O16
$$ 128108 128756 129343 129471 129075 128106 126728 125897 126799 129360 132105 133882 134961 136007 136828 136926 136728 137344
56653A37344J893K460J902P54j41k49K57O54N04J75K27N88Q53J039J426J888K069
$$ 137344 139237 141697 143599 144353 144212 143963 144220 144874 145378 145553 145780 146368 147221 148260 149686 151574 153643
56636A53643J974J799J442Q63N71J005J668J649Q44q3p31j211j497j316o79P3
$$ 153643 155617 157416 158858 159721 160292 161297 162965 164614 165458 165375 164644 163433 161936 160620 159941 160014
56620A60014P53J346J707J649J178L29p90j604j417o48o59j748k335j224L97N63
$$ 160014 160767 162113 163820 165469 166647 166976 166186 164582 163165 162517 161858 160110 157775 156551 156948 157511
56604A57511o87j679j598j054n61j58k14r78j509o72Q41J197J39o86l33K70K23
$$ 157511 156824 155145 153547 152493 151932 151774 151560 150582 149073 148401 149242 150439 150578 149892 149559 149829 150052
56587A50052K9M53J263J881K153K002J301N77P07J529J875J386J058J484J815
$$ 150052 150081 150534 151797 153678 155831 157833 159134 159711 160418 161947 163822 165208 166266 167750 169565
56572A69565J267M58L75R07J287J354J449J661J897K335L180M280N324O180O851
$$ 169565 170832 171290 171665 172572 173859 175213 176662 178323 180220 182555 185735 190015 195339 201519 208370
56557B08370P521Q579J0072J1035J0198P497M258J809N51K97O42Q65M29k62m25
$$ 208370 215891 224470 234542 245577 255775 263272 267530 269339 269890 270187 270829 271694 272123 271861 271436
56542B71436k50o82j783k432j975j117p68j053j804k996m193m575m073l605l702
$$ 271436 271186 270504 268721 266289 264314 263197 262429 261376 259572 256576 252383 247808 243735 240130 236428
56527B36428l802l414k999l058l224k955k454k180k014j639j255j299j817k497
$$ 236428 232626 229212 226213 223155 219931 216976 214522 212342 210328 208689 207434 206135 204318 201821
56513B01821k992l002k427j680j365j513j628j520j467j475j209p46o25r15j040
$$ 201821 198829 195827 193400 191720 190355 188842 187214 185694 184227 182752 181543 180797 180172 179257 178217
56498A78217p16l15q0J95M84L33l45r54r90m92L45J272J713J233L77R2L33K34
$$ 178217 177501 177186 177106 177301 177785 178118 177773 176819 175829 175337 175682 176954 178667 179900 180277 180369 180702 180936
56480A80936l32n05L2M90L01j01j94k2M47J480K705L109K426J570J217R88M59
$$ 180936 180604 180099 180131 180621 180922 180821 180627 180605 181052 182532 185237 188346 190772 192342 193559 194547 195006
56463A95006k8r7Q6M31J157J957J958J035K35L45R22J285J480J762J961J952J963
$$ 195006 194978 194881 194967 195398 196555 198512 200470 201505 201740 202085 203007 204292 205772 207534 209495 211447 213410
56446B13410K004J791J556J934K786L159K762K351K309K049J355R72J251J444
$$ 213410 215414 217205 218761 220695 223481 226640 229402 231753 234062 236111 237466 238438 239689 241133
56432B41133J050O64P47O78j35j220j945k389k589j983n49M91J46r69j566j330
$$ 241133 242183 242847 243594 244272 244137 242917 240972 238583 235994 234011 233462 233953 234099 233130 231564 230234
56416B30234q76p19r40j278j111n6J183J411O39M7K3l36j366k035j640q50k83
$$ 230234 229358 228639 227699 226421 225310 225254 226437 227848 228487 228534 228557 228221 226855 224820 223180 222330 222047
56399B22047M75J533J887J065J93K93P37N74J05o0k91r27j148k69P65O30l99r91
$$ 222047 222522 224055 225942 227007 227200 227493 228230 228804 228909 228849 228558 227631 226483 226214 226979 227609 227210 226219
56381B26219o36J87R99J483J353J006J508K979M002L536K439K007K114J944J578
$$ 226219 225583 225770 226769 228252 229605 230611 232119 235098 239100 242636 245075 247082 249196 251140 252718
56366B52718J517J503J082N44K80n2o63r38o31n56j034q87O46K258K399J615J337
$$ 252718 254235 255738 256820 257364 257644 257592 256929 255991 255360 254804 253770 252883 253529 255787 258186 259801 261138
56349B61138J415P52m12q90o74p85j300j265m87J97M31P64J487K134K209J672
$$ 261138 262553 263305 262893 262003 261329 260544 259244 257979 257492 257689 258120 258884 260371 262505 264714 266386
56333B66386Q94O00J345K520K759J891J401K145K986K736K119K325K979L124L076
$$ 266386 267280 267880 269225 271745 274504 276395 277796 279941 282927 285663 287782 290107 293086 296210 299286
56318B99286L590M153L855L050K486J706J00j342j310l98j21l53K27J637K597
$$ 299286 302876 307029 310884 313934 316420 318126 318226 316884 315574 315176 315055 314702 314929 316566 319163
56303C19163K687K583K426J832J343K021L665N009N453N140L749R79k093l874
$$ 319163 321850 324433 326859 328691 330034 332055 335720 340729 346182 351322 355071 356050 353957 350083
56289C50083m249m187l774k402n64M51N17N63P03K83l67j15J012J759J587J117
$$ 350083 345834 341647 337873 335471 334907 335358 335875 336438 337141 337424 337057 336942 337954 339713 341300 342417
56273C42417P33L11K25R80J908J899J313J428K160K173J254O53R05J168J017J150
$$ 342417 343150 343461 343686 344666 346574 348473 349786 351214 353374 355547 356801 357454 358359 359527 360544 361694
56257C61694J899K619L025L639M559N085N004N037N662O557P376Q094Q571Q810
$$ 361694 363593 366212 369237 372876 377435 382520 387524 392561 398223 404780 412156 420250 428821 437631
56243D37631R362J0459J1163J0614R654R664J0363J0389R665R283R292Q571O936
$$ 437631 446993 457452 468615 479229 488883 498547 508910 519299 528964 538247 547539 556110 563046
56230E63046N455M552L548K256J292O62k80j310j541j275j886l523m709m651m225
$$ 563046 568501 573053 576601 578857 580149 580811 580531 579221 577680 576405 574519 570996 566287 561636 557411
56215E57411m226m222l784l397l439l457l051k557k335k271k144j794r97P3N39
$$ 557411 553185 548963 545179 541782 538343 534886 531835 529278 526943 524672 522528 520734 519737 519810 520349
56200E20349m2p60o62l46q60j627j190M03J691K029J985J780J120M79P84J859
$$ 520349 520307 519547 518885 518539 517679 516052 514862 515265 516956 518985 520970 522750 523870 524349 525133 526992
56184E26992K652K943L274L498L067K427K473K904K815K480K737L122K618J807
$$ 526992 529644 532587 535861 539359 542426 544853 547326 550230 553045 555525 558262 561384 564002 565809
56170E65809K099L197L599L306L611M411M294L392L480M931O038N917N763O551
$$ 565809 567908 571105 574704 578010 581621 586032 590326 593718 597198 602129 608167 614084 619847 626398
56156F26398P608Q202Q694R417J0060J0563J1312J2230J3078J4460J6870J9212
$$ 626398 634006 642208 650902 660319 670379 680942 692254 704484 717562 732022 748892 768104
56144G68104K0120K0397K2027K5240K8771L2553L7642M3769M9746N6149O4931
$$ 768104 788224 808621 830648 855888 884659 917212 954854 998623 1048369 1104518 1169449
56133A169449P6361Q9026J02760J18616J35784J51328J62965J69321J67612J54914
$$ 1169449 1245810 1334836 1437596 1556212 1691996 1843324 2006289 2175610 2343222 2498136
56123B498136J32735J07272Q4393O6768N5742N1880N2234N0488M1946K6717P615
$$ 2498136 2630871 2738143 2822536 2889304 2945046 2996926 3049160 3099648 3141594 3168311 3175926
56112C175926j2134k8543l7787l9711l8525l9201m4957n8039p9237j05248j29456
$$ 3175926 3163792 3135249 3097462 3057751 3019226 2980025 2935068 2877029 2797792 2692544 2563088
56101B563088j46879j56399j57947j50922j36593j18922j01231q4269o8416n4960
$$ 2563088 2416209 2259810 2101863 1950941 1814348 1695426 1594195 1509926 1441510 1386550
56091A386550m4087l4374k5458j8640j3945r513m843j596j24J623M414O151N496
$$ 1386550 1342463 1308089 1282631 1263991 1250046 1240533 1235690 1234094 1233970 1235593 1240007 1246158 1251654
56078A251654M063L466L071K255K129L387M963O233P995J0136J1108J0870J1464
$$ 1251654 1255717 1259183 1262254 1264509 1266638 1270025 1274988 1281221 1289216 1299352 1310460 1321330 1332794
56065A332794J3553J5277J5719J6365J8022J9389J9886K0764K2238K2768K2231
$$ 1332794 1346347 1361624 1377343 1393708 1411730 1431119 1451005 1471769 1494007 1516775 1539006
56054A539006K2433K3417K2919K0716J9609K0800K2120K2322K3102K5230K6818
$$ 1539006 1561439 1584856 1607775 1628491 1648100 1668900 1691020 1713342 1736444 1761674 1788492
56043A788492K7239K8714L2088L5053L6412L8037M0688M2064M1081L9929L9828
$$ 1788492 1815731 1844445 1876533 1911586 1947998 1986035 2026723 2068787 2109868 2149797 2189625
56032B189625L8988L6852L5998L7575L9301M0090M2131M6094M9139N0114N1921
$$ 2189625 2228613 2265465 2301463 2339038 2378339 2418429 2460560 2506654 2555793 2605907 2657828
56021B657828N6063N9743O1171O2837O6609P0419P2731P5496P9876Q3884Q6968
$$ 2657828 2713891 2773634 2834805 2897642 2964251 3034670 3107401 3182897 3262773 3346657 3433625
56010C433625R1681R8214J02916J04976J08639J15783J22598J26860J31940J39982
$$ 3433625 3525306 3623520 3726436 3831412 3940051 4055834 4178432 4305292 4437232 4577214
56000D577214J47775J53378J60114J69847J79148J86360J95439K08327K20866
$$ 4577214 4724989 4878367 5038481 5208328 5387476 5573836 5769275 5977602 6198468
55991F198468K30904K42921K59692K77181K92830L10787L33464L56483L77734
$$ 6198468 6429372 6672293 6931985 7209166 7501996 7812783 8146247 8502730 8880464
55982H880464M02749M34992M69894N04819N45291N94677O47784P01884P63530
$$ 8880464 9283213 9718205 10188099 10692918 11238209 11832886 12480670 13182554 13946084
55973A3946084Q37013R17394J002978J102722J222857J359143J511658J693595
$$ 13946084 14783097 15700491 16703469 17806191 19029048 20388191 21899849 23593444
55965B3593444J915861K178306K486999K864150L330028L893838M574682N409946
$$ 23593444 25509305 27687611 30174610 33038760 36368788 40262626 44837308 50247254
55957E0247254O428038P636052R050778J0717248J2683241J4990252J7705339
$$ 50247254 56675292 64311344 73362122 84079370 96762611 111752863 129458202
55950A29458202K0912143K4637374K8813240L3248623L7375429L9810923L8385318
$$ 129458202 150370345 175007719 203820959 237069582 274445011 314255934 352641252
55943C52641252L1206885J8218998J810652j4281424k6902357l4681225l7896248
$$ 352641252 383848137 402067135 403877787 389596363 362694006 328012781 290116533
55936B90116533l7646973l5172436l1537832k7514375k3560525j9908091j6673480
$$ 290116533 252469560 217297124 185759292 158244917 134684392 114776301 98102821
55929I8102821j3901412j1570481r627224q025470o722700n662503m789304m070451
$$ 98102821 84201409 72630928 63003704 54978234 48255534 42593031 37803727 33733276
55921C3733276l485192l004398k598979k256546j972444j733457j524874j344151
$$ 33733276 30248084 27243686 24644707 22388161 20415717 18682260 17157386 15813235
55913A5813235j193162j064758r49398q47372p62438o90231o23803n64174n15191
$$ 15813235 14620073 13555315 12605917 11758545 10996107 10305876 9682073 9117899 8602708
55904H602708m73921m35485m01500l74850l51717l27118l03072k83338k65374
$$ 8602708 8128787 7693302 7291802 6916952 6565235 6238117 5935045 5651707 5386333
55895E386333k45252k25464k10219j97488j82947j67583j54559j42536j28653
$$ 5386333 5141081 4915617 4705398 4507910 4324963 4157380 4002821 3860285 3731632
55886C731632j14398j02329r0482p5782n9616m4639k9516j1936O534K3434L9603
$$ 3731632 3617234 3514905 3424423 3348641 3289025 3244386 3214870 3202934 3209468 3232902 3272505
55875C272505N5413O6176O6207N4711L4047N893k6751n8028q4696j09810j36283
$$ 3272505 3327918 3394094 3460301 3515012 3549059 3554952 3528201 3470173 3385477 3275667 3139384
55864C139384j60132j74716j78613j74848j65486j51791j36930j23730j11535
$$ 3139384 2979252 2804536 2625923 2451075 2285589 2133798 1996868 1873138 1761603
55855A761603r8980q7450p8327o9650n9366m9306m2181l7269l2693k9212k8010
$$ 1761603 1662623 1575173 1496846 1427196 1367830 1318524 1276343 1239074 1206381 1177169 1149159
55844A149159k7405k5556k3786k3565k2999k0236j7548j7779j9225j8433j5914
$$ 1149159 1121754 1096198 1072412 1048847 1025848 1005612 988064 970285 951060 932627 916713
55833I16713j4677j4938j4690j4028j4526j5461j4733j2821j2164j3144j3967
$$ 916713 902036 887098 872408 858380 843854 828393 813660 800839 788675 775531 761564
55822G61564j3887j3652j3389j2715j2180j2345j2330j1330j0285j0013r321p098
$$ 761564 747677 734025 720636 707921 695741 683396 671066 659736 649451 639438 630117 623019
55810F23019m595l295k336m13J613K522L258N113P096P715P649Q160Q645Q225
$$ 623019 618424 615129 612793 612380 613993 616515 619773 624886 631982 639697 647346 655506 664151 672376
55796F72376P891Q456Q393O365M024L369L358K045J60o97j549m288p930j0028
$$ 672376 680267 688723 697116 703481 707505 710874 714232 716277 716437 715740 714191 709903 701973 691945
55782F91945j0641j1560j2848j3483j4362j7213k1202k3741k4062k3105k0771
$$ 691945 681304 669744 656896 643413 629051 611838 590636 566895 542833 519728 498957
55771D98957j6373j1112p010l805K61N019Q353R073P317K886l959j0678j4322
$$ 498957 482584 471472 464462 460657 460918 465937 474290 483363 490680 493566 489607 478929 464607
55758D64607j4917j4577j3955j2281j0185r424r931r926q877p797o882n473m237
$$ 464607 449690 435113 421158 408877 398692 389268 379337 369411 360534 352737 345855 340382 336145
55745C36145m702o516p563o982n929n340m958m588m276l381j390N49R05J34j26
$$ 336145 331443 324927 317364 310382 304453 299113 294155 289567 285291 281910 280520 281069 281974 282108 281982
55730B81982J81k30j482k535l403m981o803p349o585o065o334o353n567m598l749
$$ 281982 282163 281933 280451 277916 274513 269532 262729 255380 248795 242730 236396 230043 224476 219878 216129
55715B16129k637j392m92M94K216L910M238L594L645M737N664N774N375M242J735
$$ 216129 213492 212100 211608 212102 214318 218228 222466 226060 229705 234442 240106 245880 251255 255497 257232
55700B57232j595m383o376q202r514r385q300p749p832p313n929m615l560k128
$$ 257232 255637 251254 244878 236676 227162 217777 209477 201728 193896 186583 180654 176039 172479 170351
55686A70351p42o00j383j425l63M54M85P32J610K131J783J266Q77j8j332j979
$$ 170351 169609 169009 167626 166201 165838 166292 166777 167509 169119 171250 173033 174299 175176 175158 173826 171847
55670A71847j794k012l153m100l926l110k312j421m49P0J23M63J264J788J781
$$ 171847 170053 168041 164888 160788 156862 153752 151440 150019 149570 149640 149763 150226 151490 153278 155059
55655A55059J979K794L713M323M825N305N568N786O197O240N300M129L991M485
$$ 155059 157038 159832 163545 167868 172693 177998 183566 189352 195549 201789 207089 211218 215209 219694
55641B19694L902J818m02j799k868m113n303o461p941r225r236q185p388p084
$$ 219694 223596 225414 225012 223213 220345 216232 210929 204468 196527 187302 178066 169881 162493 155409
55627A55409o121m255k782k380k199j705j604k086k087j191n39p61p07N83K103
$$ 155409 149288 145033 142251 139871 137672 135967 134363 132277 130190 128999 128460 127699 126992 127575 129678
55612A29678K416J672P92j57j453k551k739k298j949j770j597j717k250k494j830
$$ 129678 132094 133766 134558 134401 132948 130397 127658 125360 123411 121641 120044 118327 116077 113583 111753
55597A11753p54j51j30k40l47n07m61k5M12L36j68n98n50J79J534K984L788L802
$$ 111753 110999 110848 110718 110478 110131 109624 109163 109138 109550 109886 109718 109120 108570 108749 110283 113267 117055 120857
55579A20857L583L606L930M585N661O879P890R031J0997J3672J6079J7652J8673
$$ 120857 124440 128046 131976 136561 142222 149101 156991 166022 177019 190691 206770 224422 243095
55566B43095J9344J9349J8469J6698J3626Q740K674k928p182j0643j3876j6403
$$ 243095 262439 281788 300257 316955 330581 339321 341995 339067 331885 321242 307366 290963
55554B90963j7656j8000j8084j7790j6599j4568j2437j0922j0134r494q281o558
$$ 290963 273307 255307 237223 219433 202834 188266 175829 164907 154773 145279 136998 130440
55542A30440n257m829m396l049j475j043j647j829j011j58r3n04r02j344j855
$$ 130440 125183 120354 115958 112909 111434 110391 108744 106915 105904 105746 105653 105149 104247 102903 101048
55527A01048k152k261k419k284j360k11Ro99j214j165j276j688j566p50j90k13
$$ 101048 98896 96635 94216 91932 90572 90361 90370 89671 88457 87292 86016 84328 82762 82012 81822 81609
55511H1609L8Q42J173N02j90m4M17N81Q31J360J257J3j252j277m79j44n87j213
$$ 81609 81647 82489 83662 84164 83974 83930 84347 84928 85759 87119 88376 88389 87137 85860 85381 85237 84650 83437
55493H3437j608j647j164m00r1m28o82m59l55p10p89q6O69P40N85P94Q51J58o04
$$ 83437 81829 80182 79018 78618 78527 78099 77417 76958 76603 75893 75104 75018 75687 76427 77012 77806 78657 78815 78211
55474G8211m22M46J032J173J292J215M73o14j206j064n70l9K20k82j474k269j779
$$ 78211 77789 78235 79267 80440 81732 82947 83420 82806 81600 80536 79966 79927 80147 79865 78391 76122 74343
55457G4343n31L17M59L28J26j42j67K08M39J06k72n2M03L60m6j52M7J11J03L51
$$ 74343 73812 74129 74588 74916 75042 74900 74733 74941 75380 75486 75214 75162 75565 75925 75879 75727 75774 75885 75988 76339
55437G6339O19M26j0j29Mq3l41l25J8M85J139J895K000R02o75j447j105k63O67
$$ 76339 76958 77384 77374 77245 77249 77166 76825 76500 76518 77003 78142 80037 82037 82939 82264 80817 79712 79449 80116
55418H0116J595K087J747J121J147J809K272K293K390K689K555J594J00j469k724
$$ 80116 81711 83798 85545 86666 87813 89622 91894 94187 96577 99266 101821 103415 103515 102046 99322
55403I9322l126k476j624j690k516k820k069j133q33q51o30m01o04q66m18P15
$$ 99322 96196 93720 92096 90406 87890 85070 83001 81868 81035 80184 79554 79153 78549 77683 77265 77980
55387G7980J613J582R09L86L12K92o6n11n53k23n2k26l88m22p32j385j642r69
$$ 77980 79593 81175 82084 82470 82782 83074 83008 82497 81944 81721 81669 81443 81055 80633 79901 78516 76874 75905
55369G5905K3L48m7m51n46o36r63j399j740j715r92K23R54N32k48K0J445K578
$$ 75905 75928 76276 76229 75778 75232 74596 73633 72234 70494 68779 67787 68010 68964 69496 69248 69268 70713 73291
55351G3291K195O27q21j221o18K22M91J01k09K04R93J268P77J28r2O3J46j69q28
$$ 73291 75486 76113 75292 74071 73453 73675 74166 74267 74058 74262 75255 76523 77300 77428 77336 77399 77545 77376 76548
55332G6548j317j042j00N86L81j69j14N35Q91M70l69j103j419j033J2Q98P11k63
$$ 76548 75231 74189 74089 74675 75056 74887 74773 75308 76199 76669 76300 75197 73778 72745 72757 73655 74366 74103
55314G4103p64k17O19R35Q89Q91P04pp86q81m13k57q01j403j269l77O19J155J180
$$ 74103 73339 73122 73741 74676 75565 76456 77160 77153 76367 75486 75073 74816 74015 72612 71343 70966 71585 72740 73920
55295G3920R81Q60R41J109J047N19k82p44m37K93O08J09p26j085o01M43J457J916
$$ 73920 74901 75761 76702 77811 78858 79377 79095 78351 77914 78207 78815 78924 78198 77113 76512 76955 78412 80328
55277H0328J690J162Q21O73K76n44j296j385p64J49R42J365J260P04L5m18n69
$$ 80328 82018 83180 84001 84674 84950 84406 83110 81725 80961 81110 82052 83417 84677 85381 85416 84998 84429
55260H4429m62k00m9k95p66q51k40N99R33N65m6k93N5O12P07J99j93J64Q00P82
$$ 84429 83967 83767 83718 83423 82657 81806 81566 82165 83098 83663 83617 83324 83379 83991 84698 84897 84704 84868 85668 86450
55240H6450J91JL81L74l46o91N6P76N2j674k732k493j734j030j76P33R51K34n12
$$ 86450 86641 86642 87023 87397 87051 86360 86416 87192 87244 85570 82838 80345 78611 77581 77405 78138 79089 79323 78811
55221G8811k63R57K249K751K203R97j62q36j125j231j059n70j91l62q35r78o65
$$ 78811 78548 79505 81754 84505 86708 87705 87543 86707 85582 84351 83292 82722 82531 82169 81334 80356 79691
55204G9691l43k73k59j04R8J90J76J82L55O26N88l9o95l53R62J820J165j63n73
$$ 79691 79348 79075 78816 78712 78810 79000 79176 79358 79713 80339 80927 80888 80193 79840 80802 82622 83787 83624 83051
55185H3051J26P04L86l68q28p84k93N14J147J025K95k11KN64Q16N15j25o57o70
$$ 83051 83177 83881 84267 83899 83071 82287 81994 82508 83655 84680 84975 84764 84766 85330 86146 86661 86536 85879 85209
55166H5209j19O08J157J531J700J357N32j23k09k26o17q05j21Q26R02K27r3J60
$$ 85209 85090 85698 86855 88386 90086 91443 91975 91852 91643 91417 90800 89995 89874 90700 91602 91829 91736 91896
55148I1896Q9n65q62k61N01O38L72J85q5o98j323j558j554j562j401q37j09M19
$$ 91896 91985 91420 90558 90297 90798 91436 91808 91993 91908 91210 89887 88329 86775 85213 83812 82975 82866 83285
55130H3285O63O60M27J82J84J76l30j059j059j38O51M94l7O8P39J151R95O80N08
$$ 83285 83948 84608 85035 85217 85401 85577 85247 84188 83129 82991 83642 84136 84099 84167 84906 86057 87052 87732 88240
55111H8240M16L79M94O79P43O75N48L10l5k68k20k6J86N32J072J526J633J474
$$ 88240 88656 89035 89529 90208 90951 91626 92174 92484 92449 92181 91961 91935 92121 92653 93725 95251 96884 98358
55093I8358J200P33N7m84n57k90jK91P11J091J113P87M82M66N47K50o84j863k433
$$ 98358 99558 100291 100348 99864 99307 99017 99016 99307 100018 101109 102222 103009 103491 103957 104504 104754 104070 102207 99774
55074I9774j967j056n90n94l59K48M40k33j048j161q20q36j247j341q18j82O9
$$ 99774 97807 96751 96161 95567 95208 95456 95896 95663 94615 93454 92634 91798 90551 89210 88392 88210 88279
55057H8279J4m2j3J03L92Q65J271J278P99R5m49o45o72p92r72r31o06l08l16n44
$$ 88279 88293 88251 88238 88341 88733 89598 90869 92147 92946 93041 92592 91947 91275 90483 89511 88580 87974 87666 87350 86806
55037H6806p58q16n98K7R25J631J823J674J502J245O44k11q42r02m95K1L48L63
$$ 86806 86048 85232 84634 84661 85586 87217 89040 90714 92216 93461 94105 93894 93052 92150 91655 91676 92024 92387
55019I2387J79J41N82J398J917J423J4j219j165L1J012P05m57j167p99J03P89
$$ 92387 92566 92707 93289 94687 96604 98027 98041 96822 95657 95688 96700 97405 96948 95781 94982 95085 95874
55002I5874J146J407J547J326P09rm92n94l86J0N87J305J846J792J249Q78R66
$$ 95874 97020 98427 99974 101300 102009 102000 101508 100914 100528 100538 101125 102430 104276 106068 107317 108195 109161
54985A09161Q70p8j427k085j749j063m23M36J492J940J196k35j304j431o72N95
$$ 109161 110031 109953 108526 106441 104692 103629 103206 103642 105134 107074 108270 108035 106731 105300 104628 105223
54969A05223J725K070J618J068Q79O82o3j190k072k333j923q66M83J292J013K04
$$ 105223 106948 109018 110636 111704 112583 113265 113202 112012 109940 107607 105684 104818 105301 106593 107606 107810
54953A07810mP62J739J979J308L04l80n07l01j01j7P3K20K43j0m78r24j023m67
$$ 107810 107806 108568 110307 112286 113594 113898 113518 113011 112710 112609 112592 112665 112885 113128 113118 112640 111716 110693 110226
54934A10226O52J608J637Q58J86J44L24J99o6k4L45Q29J477K414L374L958M252
$$ 110226 110878 112486 114123 114981 115167 115311 115635 115834 115768 115744 116089 116918 118395 120809 124183 128141 132393
54917A32393M699N519O529P448Q006P913P042N600L877J968j01k208m227n994
$$ 132393 137092 142611 149140 156588 164594 172507 179549 185149 189026 190994 190893 188685 184458 178464
54903A78464p067o988o101n515n737n882m936l281k210k094k073j484p41n06p68
$$ 178464 171397 164409 158308 152793 147056 141174 136238 132957 130747 128653 126580 125096 124355 123849 123081
54888A23081j086j236j244j178j115j043o77K21J329K076K578L595N308O722O850
$$ 123081 121995 120759 119515 118337 117222 116179 115502 115723 117052 119128 121706 125301 130609 137331 144181
54873A44181O036N485N791O529P080P169O605N163L029Q60q42k139l274m237m967
$$ 144181 150217 155702 161493 168022 175102 182271 188876 194039 197068 197928 197086 194947 191673 187436 182469
54858A82469n589o136o231n575m552l901l792l715l348l014l080l339l400l313
$$ 182469 176880 170744 164513 158938 154386 150485 146693 142978 139630 136616 133536 130197 126797 123484
54844A23484l347l354k857j781o98k19m27r62j410j492j171o55k80k08k77j23
$$ 123484 120137 116783 113926 112145 111447 111228 110801 109839 108429 106937 105766 105111 104831 104623 104346 104223
54828A04223M62J233J586J176M40J45M18O09L12p8j64k90q68j452j296n56l9L7
$$ 104223 104685 105918 107504 108680 109120 109265 109683 110292 110604 110526 110362 110072 109204 107752 106456 105900 105861 105898
54810A05898J44L52K32j5N37K033L163K719J129j94n30j46M95J059J171O97J21
$$ 105898 106042 106394 106626 106611 107148 109181 112344 115063 116192 115998 115468 115322 115817 116876 118047 118744 118865
54793A18865j7O5l11j199j846j662r00k39n3k59n34n47j39M84Q63P32L66M02J178
$$ 118865 118848 118913 118602 117403 115557 113895 112995 112756 112703 112444 111910 111363 111224 111708 112571 113303 113669 114071 115249
54774A15249K247K745K401J966K313L303L997L933L636L803M500N409O413P596
$$ 115249 117496 120241 122642 124608 126921 130224 134221 138154 141790 145593 150093 155502 161915 169511
54760A69511Q957J0290J1125J0782Q956O229L523R26k141n525q014q883q877q924
$$ 169511 178468 188758 199883 210665 219621 225850 229373 230299 228158 222633 214619 205736 196859 187935
54746A87935q682p362n432m230m162m347m120l746l480k870j576j96L62l7p59
$$ 187935 179253 171891 166459 162229 158067 153720 149600 145854 142374 139504 137928 137732 138094 138057 137298
54731A37298j219j295j016l71M88J178J405J306J344J758K340K813L334M302N734
$$ 137298 136079 134784 133768 133397 133885 135063 136468 137774 139118 140876 143216 146029 149363 153665 159399
54716A59399P121P947P987P141N375L054Q90p55k173l746n359o622p349p546p256
$$ 159399 166520 174467 182454 189595 194970 198024 198914 198159 195986 192240 186881 180259 172910 165364 158108
54701A58108o699o174n590m457k712j093k75q2l8k34r56j809k043j655j423j757
$$ 158108 151409 145235 139645 135188 132476 131383 131108 131026 130988 130754 129798 127989 125946 124291 122868 121111
54685A21111k126j828q39K79J014J196R36M06k28p59q89n28q3j19o04r14p33m66
$$ 121111 118985 117157 116318 116597 117611 118807 119743 120149 119921 119162 118273 117745 117662 117543 116939 116025 115292 114826
54667A14826n80j009j467j790j670p27P06J612J548J198J021L46j259k567k042
$$ 114826 114246 113237 111770 109980 108310 107583 108289 109901 111449 112647 113668 114014 112755 110188 108146
54652A08146j38J208J135N63L56L09J61K73P51J024Q10N65N84N25K84L52Q67J150
$$ 108146 108008 109216 110351 110914 111270 111579 111740 112013 112764 113788 114598 115163 115747 116272 116556 116908 117775 118925
54634A18925Q17M21M58N31K15j00j0kn72j113o85L95Q02k2j210j645j106k19K22
$$ 118925 119742 120163 120621 121152 121367 121267 121257 121255 120683 119570 118885 119280 120082 120060 118850 117205 116099 115880 116102
54615A16102j71j065j611j298n23n1j17l64n03m95k95J69P44J181J453J623J523
$$ 116102 115931 114866 113255 111957 111434 111383 111266 110902 110399 109904 109609 109778 110522 111703 113156 114779 116302
54598A16302R52R2n67p05k89N31J361J554Q24k39p06l34L04O07M42k9m99m74L21
$$ 116302 117254 117346 116779 116074 115785 116316 117677 119231 120055 119816 119110 118776 119080 119687 120129 120100 119601 119127 119448
54579A19448J387J746J047o1p20o44PR47J663J541O21j80j33L16K20m64q54n25
$$ 119448 120835 122581 123628 123567 122847 122203 122210 123157 124820 126361 126982 126802 126669 126985 127205 126741 125887 125362
54561A25362n1L7R2O39J347J436Q45L21L94Q28J145J166R21M51l0k12j19j11k31
$$ 125362 125311 125348 125440 126079 127426 128862 129707 130028 130422 131250 132395 133561 134482 134933 134903 134691 134572 134461 134230
54542A34230M2J029K130K448J940J463J663K284K696K698K505K227J720R17Q7
$$ 134230 134272 135301 137431 139879 141819 143282 144945 147229 149925 152623 155128 157355 159075 159992 160079
54527A60079l83l58k2M07Q13J036P83k2r23j272r13l31o5k37n96q07o79m52o94
$$ 160079 159696 159338 159316 159723 160536 161572 162355 162333 161410 160138 159225 158894 158829 158592 157996 157189 156510 156058 155364
54508A55364j583k342k018p74K71N64N63N24q7j322k005j260K5M40J32L07J087
$$ 155364 153781 151439 149421 148647 148918 149482 150045 150569 150482 149160 147155 145895 145920 146360 146492 146799 147886
54491A47886J405R34O42J057J385R41K88K23N70P49Q36J207J699J804J440Q89
$$ 147886 149291 150225 150867 151924 153309 154250 154538 154761 155331 156080 156916 158123 159822 161626 163066 163955
54475A63955L44o0o4L33P38R74J433K276K910K799K373K374K635K341J313K61
$$ 163955 164299 164239 164175 164508 165246 166220 167653 169929 172839 175638 178011 180385 183020 185361 186674 186935
54459A86935k66l51k05J60N13M33pj76J71M10n0q21j057o58l18m55o85o18n12
$$ 186935 186669 186318 186113 186273 186786 187219 187212 187036 187207 187617 187567 186746 185689 185031 184713 184258 183573 182955 182443
54440A82443p49j006o58R6K74m97j304j195n45m64j167j740j544r80o38m46p0
$$ 182443 181694 180688 180030 180126 180400 179903 178599 177404 176859 176395 175228 173488 171944 170964 170326 169880 169810
54423A69810L96O22N36K41k82r58j387j227o01J62R21J541J635R93O1m46l24L
$$ 169810 170206 170828 171364 171605 171323 170365 168978 167751 167150 167312 168233 169774 171409 172402 172463 172017 171693 171696
54405A71696J18q5n61j150j439r61K89J703K504K306J348L33q0J49M90N79O40
$$ 171696 171814 171729 171168 170018 168579 167618 167907 169610 172114 174420 175768 176101 176021 176170 176660 177239 177879
54388A77879R59J263J046L94n0M5L32L38k5o13j324j930k067j672j242j244j426
$$ 177879 178838 180101 181147 181541 181491 181536 181868 182206 182181 181568 180244 178314 176247 174575 173333 172089 170663
54371A70663j086r3Q15R51N99O09J214J718J505Q71N10M92L23j27l64q2K82J81
$$ 170663 169577 169484 170299 171250 171849 172458 173672 175390 176895 177766 178276 178768 179091 178964 178600 178518 178800 178981
54353A78981k97o27n73l00%J68j21j119k467l272k988k051j434j588k032k033
$$ 178981 178684 178057 177484 177184 177184 177352 177231 176112 173645 170373 167385 165334 163900 162312 160280 158247
54337A58247j511j086j202j569j630j318r61o06K8Q53J242Q75K61J02M06O57N89
$$ 158247 156736 155650 154448 152879 151249 149931 148970 148364 148392 149245 150487 151362 151623 151725 152131 152788 153377
54320A53377L74J68k4j62j59j08j88l48m15l93m24m70l86k67l37m44j55M83P39
$$ 153377 153751 153919 153895 153733 153574 153466 153278 152930 152515 152122 151698 151228 150842 150575 150238 149794 149639 150122 150861
54301A50861Q1j034j607j172j36P92J174R46L35k21l78k42k71p18j335j700j595
$$ 150861 150942 149908 148301 147129 146993 147785 148959 149905 150240 150019 149641 149399 149128 148410 147075 145375 143780
54284A43780r63J95J573K435K191J075p1o88q82r04p14l00M4Nk76m06k07J34L27
$$ 143780 142817 143012 144585 147020 149211 150286 150215 149527 148645 147741 147027 146727 146771 146776 146500 146094 145887 146021 146348
54265A46348K17o1j09L39R51J134Q96Q54J199J247N02m10n65j3M87O56P66Q55
$$ 146348 146565 146504 146395 146734 147685 148819 149715 150569 151768 153015 153517 153107 152542 152529 153016 153672 154438 155293
54247A55293P71Q04J240J420L74j488k483j830o26j73l76m96m85o91r20q02n57
$$ 155293 156064 156868 158108 159528 159902 158414 155931 154101 153475 153302 152926 152430 151945 151254 150334 149532 148975
54230A48975o17q12p73p02r76j270j003m34m26j158j841j804j150k73O19J327
$$ 148975 148358 147546 146773 146071 145095 143825 142822 142388 141962 140804 138963 137159 136009 135736 136355 137682
54214A37682J554J253P08J69l30p68j066j184j059n51K12O89N05J5j87j46l42
$$ 137682 139236 140489 141197 141366 141036 140268 139202 138018 136959 136408 136620 137309 137814 137829 137642 137496 137154
54197A37154p75q81m25J83N20N80M70K64K13N71J007Q60J24l79j42L37M00J92
$$ 137154 136379 135498 135073 135256 135776 136356 136826 137090 137303 137874 138881 139741 139865 139486 139344 139681 140081 140273
54179A40273K01K35l20j353j826j002N60J561J334M58n1J20M39M31L37N49P14
$$ 140273 140474 140709 140389 139036 137210 136208 136768 138329 139663 140121 140070 140190 140629 141060 141397 141946 142660
54162A42660k7j768l357l536k267o36M19Q46J029J047O62j60j026j485j471j239
$$ 142660 142633 140865 137508 133972 131705 131069 131488 132334 133363 134410 135072 134912 133886 132401 130930 129691
54146A29691j017p97n60l78k61q1J88L29K37K34O42J150J026J03q11p63K35J282
$$ 129691 128674 127877 127317 126939 126678 126597 126785 127114 127351 127585 128227 129377 130403 130506 129695 128932 129167 130449
54128A30449J649J481J313J253R09J08p25j040p93l69l1K46M98O34O29N46L79
$$ 130449 132098 133579 134892 136145 137054 137162 136437 135397 134604 134235 134204 134450 134948 135582 136211 136757 137136
54111A37136J27M9M65J234J830J954J707J089m7j368k006j637r81p54o68j24N88
$$ 137136 137263 137312 137777 139011 140841 142795 144502 145591 145544 144176 142170 140533 139552 138798 138130 138006 138594
54094A38594O54O0l58j25M03P89R39P73K38k49j47K53K4r73j716j469p38l00m8
$$ 138594 139248 139308 138950 138825 139228 140017 140956 141729 141967 141718 141571 141824 141848 140875 139159 137690 136952 136652 136604
54075A36604M45Q81P11K03J66P57J441J980K589L113K950J963P92l6n98r62q03
$$ 136604 137049 137930 138641 138844 139010 139767 141208 143188 145777 148890 151840 153803 154595 154559 153961 152999 152196
54058A52196j08L70j1q19j092n44K70P91R26Q42Q08J106J659J874J382P71Q91
$$ 152196 152088 152458 152447 151628 150536 149992 150262 151053 151979 152821 153629 154735 156394 158268 159650 160421 161312
54041A61312J526J657J096Q96J738K814L009K480K210K547L081L618M265M681
$$ 161312 162838 164495 165591 166487 168225 171039 174048 176528 178738 181285 184366 187984 192249 196930
54027A96930M308L426L106L790M689M911M575M329M339M243L811L186K592K087
$$ 196930 201238 204664 207770 211560 216249 221160 225735 230064 234403 238646 242457 245643 248235 250322
54013B50322J584J006M98L94P24R95Q36O49J069J964K669L120L835M673M597L017
$$ 250322 251906 252912 253410 253804 254528 255523 256359 257008 258077 260041 262710 265830 269665 274338 278935 281952
53997B81952M87k298n211p879r230q750p460o649o239n377m108l373l563m130
$$ 281952 282439 280141 274930 267051 257821 249071 241611 234962 228723 223346 219238 215865 212302 208172
53983B08172m538m623m142k911j464p40q84j080p38k26j75o30j119j226r11n33
$$ 208172 203634 199011 194869 191958 190494 189754 188870 187790 187052 186826 186651 186021 184902 183676 182765 182232
53967A82232n51r63j228r32l32J90P33J455J930J709J190J097J276J005L74L00
$$ 182232 181681 180718 179490 178558 178226 178416 179149 180604 182534 184243 185433 186530 187806 188811 189185 189485
53951A89485J037J702J630J262J225J370J300J205J490J992K189J966J689J725
$$ 189485 190522 192224 193854 195116 196341 197711 199011 200216 201706 203698 205887 207853 209542 211267
53937B11267K205L066M016M599M557M060L425K815K239J683J108N04l6l87m44
$$ 211267 213472 216538 220554 225153 229710 233770 237195 240010 242249 243932 245040 245544 245508 245121 244677
53922B44677l7R31K018K378J796J227J616K531K809K291J931K309L030L771M753
$$ 244677 244640 245571 247589 249967 251763 252990 254606 257137 259946 262237 264168 266477 269507 273278 278031
53907B78031N821O135N364M370L981L829L185K275J930K227K316J546K04r11j297
$$ 278031 283852 289987 295351 299721 303702 307531 310716 312991 314921 317148 319464 321010 321214 320303 319006
53892C19006j183j275j976k861l260l277l626m374m681m157l633l962m705m754
$$ 319006 317823 316548 314572 311711 308451 305174 301548 297174 292493 288336 284703 280741 276036 271282
53878B71282l898k956k580k657k824k915k877k673k378k116j967k050k495l101
$$ 271282 267384 264428 261848 259191 256367 253452 250575 247902 245524 243408 241441 239391 236896 233795
53864B33795l325k909k257j902j891j988k168k492k770k809k771k803k618j852
$$ 233795 230470 227561 225304 223402 221511 219523 217355 214863 212093 209284 206513 203710 201092 199240
53850A99240p87j64k63n71l64N87J871K773K828K247J753J940K909M518O454P953
$$ 199240 198453 198289 198026 197455 197091 197678 199549 202322 205150 207397 209150 211090 213999 218517 224971 232924
53834B32924P877N684K097j427l843m967n184n065n011m989m714m215l840l653
$$ 232924 240801 246485 248582 247155 243312 238345 233161 228096 223085 218096 213382 209167 205327 201674
53820B01674l279k627k141j970j538n08L96K74o52j384j478j218p10K86J569K386
$$ 201674 198395 195768 193627 191657 190119 189611 190007 190281 189629 188245 186767 185549 184839 185125 186694 189080
53804A89080K350J883J584J630J907K295K625K786K937L320L794L961L753L487
$$ 189080 191430 193313 194897 196527 198434 200729 203354 206140 209077 212397 216191 220152 223905 227392
53790B27392L334L156K967L056L449L743L658L448L407L277K475R16p32j685j805
$$ 227392 230726 233882 236849 239905 243354 247097 250755 254203 257610 260887 263362 264278 263546 261861 260056
53775B60056j596j483j326q71m68p83j807k692k856k727k961l438l603l456l487
$$ 260056 258460 256977 255651 254780 254312 253529 251722 249030 246174 243447 240486 237048 233445 229989 226502
53760B26502l769l793l260k419j540o55R6L31j20r72j821k422k588k254j740j509
$$ 226502 222733 218940 215680 213261 211721 211066 211162 211493 211373 210401 208580 206158 203570 201316 199576 198067
53744A98067j545j297n03L26N12O8m29n98n93o73p50n09J10P43R82Q35O61O57
$$ 198067 196522 195225 194722 195048 195560 195628 195199 194601 194008 193335 192585 192076 192186 192929 193911 194746 195407 196064
53726A96064O13K66k87p08q03n90j59L87Q99J224J235P92p8r28j160p03j14K15
$$ 196064 196677 196943 196656 195948 195145 194555 194396 194783 195682 196906 198141 198933 198855 197927 196767 196064 195950 196165
53708A96165N70J310K129K472K409K529L014L393L290K886K526K229J808J257
$$ 196165 196735 198045 200174 202646 205055 207584 210598 213991 217281 220167 222693 224922 226730 227987
53694B27987P72N31N15N56N76P29J177J713J899J652J409J473J560J227M93k99
$$ 227987 228759 229290 229805 230361 230937 231666 232843 234556 236455 238107 239516 240989 242549 243776 244269 243970
53678B43970r18j312j453j466j631j931j950j491r18n23m7O58J010M77m53q73
$$ 243970 243052 241740 240287 238821 237190 235259 233309 231818 230900 230377 230330 230988 231998 232475 232022 231149
53662B31149p63p74r30n65L87J010O81j14n29l74l3O5l24j053j491j094k59M0
$$ 231149 230386 229612 228682 228117 228504 229514 230195 230081 229552 229178 229145 229210 228886 227833 226342 225248 224989 225029
53644B25029l99o70j61M83K94o15j220q47K45J330J791J397M73k35j82M32R06
$$ 225029 224630 223960 223799 224282 224576 223961 222741 221894 222139 223469 225260 226657 227130 226895 226713 227145 228051
53627B28051Q37N44O75J486K466K853K492J940J649J422J069J083K004L338L946
$$ 228051 228888 229432 230107 231593 234059 236912 239404 241344 242993 244415 245484 246567 248571 251909 255855
53612B55855L518K841K536K366K059J937K285K756K908K847K828K719K351J942
$$ 255855 259373 262214 264750 267116 269175 271112 273397 276153 279061 281908 284736 287455 289806 291748
53598B91748J690J350P39K01J02J61n3l64k97Q6L23L59N31Q12P16M7p19j036q95
$$ 291748 293438 294788 295527 295728 295830 295991 295938 295574 295277 295363 295686 296045 296576 297388 298104 298151 297432 296396 295501
53579B95501p01p99j192j580j637j385j205j343j591j644j515j328r25j04Q26
$$ 295501 294800 294001 292809 291229 289592 288207 287002 285659 284068 282424 280909 279581 278656 278552 279378
53564B79378J224Q92K85m2J06O32J331J861J931J694J708K263K908K919K184J414
$$ 279378 280602 281494 281779 281737 281843 282475 283806 285667 287598 289292 291000 293263 296171 299090 301274 302688
53548C02688J397K111K758K705K288K426L455M640N012M469L783L657M058M467
$$ 302688 304085 306196 308954 311659 313947 316373 319828 324468 329480 333949 337732 341389 345447 349914
53534C49914M601M687N125N936O701P084P278P702Q349Q816R022R518J0750J2385
$$ 349914 354515 359202 364327 370263 376964 384048 391326 399028 407377 416193 425215 434733 445483 457868
53520D57868J3661J4203J4199J4034J4109J4863J6422J8246J9578K0287K0964
$$ 457868 471529 485732 499931 513965 528074 542937 559359 577605 597183 617470 638434
53509F38434K2050K3254K3990K4132K4036K4043K4119K3997K3512K2760K1961
$$ 638434 660484 683738 707728 731860 755896 779939 804058 828055 851567 874327 896288
53498H96288K1163K0218J9185J8518J8585J9031J9089J8586J8258J8706J9462
$$ 896288 917451 937669 956854 975372 993957 1012988 1032077 1050663 1068921 1087627 1107089
53487A107089J9459J8344J6843J5811J5352J4992J4445J3889J3581J3409J2831
$$ 1107089 1126548 1144892 1161735 1177546 1192898 1207890 1222335 1236224 1249805 1263214 1276045
53476A276045J1352R043O557M413K412O0k459m265n036n773p777j1051j4314j6505
$$ 1276045 1287397 1296440 1302997 1307410 1309822 1309882 1307423 1303158 1298122 1292349 1284572 1273521 1259207 1242702
53462A242702j7659j8278j8573j8692j9139k0355k2014k3296k3854k4127k4645
$$ 1242702 1225043 1206765 1188192 1169500 1150361 1130006 1107992 1084696 1060842 1036715 1012070
53451A012070k5329k5599k5062k3909k2662k1588k0487j9118j7689j6597j5836
$$ 1012070 986741 961142 936080 912171 889509 867921 847434 828316 810627 794030 778194
53440G78194j4901j3470j1765j0130q569o945n349l980k791j525L4J961M198O492
$$ 778194 763293 749823 738058 727928 719359 712414 707065 703085 700294 698769 698803 700764 704962 711454
53426G11454Q492J0088J1484J2832J4085J5259J6521J7887J9188K0495K2165K4214
$$ 711454 719946 730034 741518 754350 768435 783694 800215 818102 837290 857785 879950 904164
53414I04164K6143K7629K8891L0079L0919L1463L2482L4472L6812L8670M0223
$$ 904164 930307 957936 986827 1016906 1047825 1079288 1111770 1146242 1183054 1221724 1261947
53403A261947M2114M4199M5835M7162M8885N0900N2239N2573N2743N3510N4649
$$ 1261947 1304061 1348260 1394095 1441257 1490142 1541042 1593281 1645854 1698597 1752107 1806756
53392A806756N5559N5988N5912N5290N4382N3578N2698N1062M8452M5370M2149
$$ 1806756 1862315 1918303 1974215 2029505 2083887 2137465 2190163 2241225 2289677 2335047 2377196
53381B377196L8577L4625L0750K7126K3349J9297J5430J1776P449J928l853q525
$$ 2377196 2415773 2450398 2481148 2508274 2531623 2550920 2566350 2578126 2585575 2587503 2583650 2575125
53369B575125j1984j5354j9650k5127l1566l8512m5251n1185n6234o0554o4018
$$ 2575125 2563141 2547787 2528137 2503010 2471444 2432932 2387681 2336496 2280262 2219708 2155690
53358B155690o6267o7091o6575o5121o3536o2534o1901o0592n8091n5201n2984
$$ 2155690 2089423 2022332 1955757 1890636 1827100 1764566 1702665 1642073 1583982 1528781 1475797
53347A475797n1443m9852m8017m6464m5536m4906m3992m2431m0151l7371l4538
$$ 1475797 1424354 1374502 1326485 1280021 1234485 1189579 1145587 1103156 1063005 1025634 991096
53336I91096l2047l0057k8576k7384k5834k3279j9944j6801j4380j2288j0219
$$ 991096 959049 928992 900416 873032 847198 823919 803975 787174 772794 760506 750287
53325G50287q667p980p532o511n018l530j898K26K390L871M830N940P136P849
$$ 750287 741620 733640 726108 719597 714579 711049 709151 709377 711767 715638 720468 726408 733544 741393
53311G41393Q373R690J1881J3896J5132J6117J7237J7956J7952J8014J9013K0682
$$ 741393 749766 759456 771337 785233 800365 816482 833719 851675 869627 887641 906654 927336
53299I27336K2203K3491K5026K6816K8358K9394L0041L0247K9887K9379K9467
$$ 927336 949539 973030 998056 1024872 1053230 1082624 1112665 1142912 1172799 1202178 1231645
53288A231645L0203L0637K9839K7812K5161K2213J8914J5385J2082R261O659L888
$$ 1231645 1261848 1292485 1322324 1350136 1375297 1397510 1416424 1431809 1443891 1453152 1459811 1463699
53276A463699R80j726m170o702r579j2515j4921j6529j7708j9124k1050k3077
$$ 1463699 1464679 1462953 1458783 1452081 1442502 1429987 1415066 1398537 1380829 1361705 1340655 1317578
53264A317578k4598k5627k6853k8701l0676l2001l2612l3038l3556l4087l4726
$$ 1317578 1292980 1267353 1240500 1211799 1181123 1149122 1116510 1083472 1049916 1015829 981103
53253I81103l5584l6103l5443l3804l2391l1691l0704k8580k6149k4896k4967
$$ 981103 945519 909416 873973 840169 807778 776087 745383 716803 690654 665758 640791
53242F40791k5194k4740k3760k2655k1612k0819k0290j9464j7761j5596j4038
$$ 640791 615597 590857 567097 544442 522830 502011 481721 462257 444496 428900 414862
53231D14862j3391j2745j1212q979o960n839n666n972o121n831n440n366n448
$$ 414862 401471 388726 377514 368535 361575 355736 350070 344098 337977 332146 326706 321340 315892
53218C15892n220m655m117l680l191k918l344m230m615m095l408l335l647l555
$$ 315892 310672 306017 301900 298220 295029 292111 288767 284537 279922 275827 272419 269084 265437 261882
53204B61882k870k123j822j993k334k566k647k766l012l063k487j414n87o00j353
$$ 261882 259012 256889 255067 253074 250740 248174 245527 242761 239749 236686 234199 232785 232198 231598 230245
53189B30245k320l037l218k788k034j456j297j396j484j391r54j68M59J90j005
$$ 230245 227925 224888 221670 218882 216848 215392 214095 212699 211215 209824 208870 208702 209161 209351 208346
53174B08346k165k287j354j59N84P08L80j80p95j313j522j155j73R41J448J067
$$ 208346 206181 203894 202540 202381 202965 203673 204053 203873 203078 201765 200243 199088 198915 199856 201304 202371
53158B02371K69k82l96l92o36j179j675j610q16K23P16L83k94o72n88k97k7K37
$$ 202371 202640 202358 201962 201570 200934 199755 198080 196470 195654 195877 196593 196976 196682 196010 195422 195125 195098 195335
53140A95335N68Q70R21O16J68j01j49k10l49l19k0K50K84L31N61N33k08j198j467
$$ 195335 195903 196773 197694 198310 198478 198377 198228 198018 197669 197350 197330 197580 197864 198195 198756 199289 199081 197883 196416
53121A96416p96J35Q07J389K006K255J819R92K29l73q00q27l92O6R9k00m94p33
$$ 196416 195620 195755 196562 197951 199957 202212 204031 205023 205252 204879 204079 203252 202860 202926 203025 202825 202331 201598
53103B01598j023j165q27r8M60M01j55p10q71o98o07r27j601k289k695k623j906
$$ 201598 200575 199410 198583 198485 198945 199346 199191 198481 197610 196912 196305 195378 193777 191488 188793 186170 184264
53086A84264o44N72J056P52K25k3L4K00L37K87o2n50r17j179j476j573j104l75
$$ 184264 183620 184192 185248 186000 186225 186202 186236 186436 186773 187060 186998 186448 185531 184352 182876 181303 180199 179824
53068A79824k23q88j590j599j127o82k02N46J109Q26nk15P05J791J693L09j049
$$ 179824 179601 178713 177123 175524 174397 173715 173513 174059 175168 175994 175989 175774 176479 178270 179963 180272 179223
53051A79223j122o8Q05N75l27q49o24j82N7K49N25M76k60j296j822j506p77k45
$$ 179223 178101 178033 178838 179413 179086 178237 177613 177431 177488 177737 178262 178738 178478 177182 175360 173854 173077 172832
53033A72832j14j81j95j77l64p83j107j041p44n37m14k18j36m19p43n88k21m44
$$ 172832 172718 172537 172342 172165 171801 171018 169911 168870 168126 167589 167175 166957 166821 166402 165659 165071 164850 164406
53015A64406j190j321k81Q85R84K94r0K4p3n26o17rO78Q06N21K45jm07r03j252
$$ 164406 163216 161895 161614 162499 163483 163777 163687 163711 163638 163112 162495 162486 163164 163970 164491 164736 164735 164328 163425 162173
52995A62173j386j334j055n31O6N05O76O01M11L54O10J017J150Q27L99L71Q42
$$ 162173 160787 159453 158398 157867 157933 158438 159114 159715 160126 160480 161090 162107 163257 164084 164483 164854 165696
52978A65696J362J415R30L30L0J3l7k24k84nM42Q12J163J660K068J930J245O15
$$ 165696 167058 168473 169403 169733 169763 169776 169739 169515 169231 169226 169668 170480 171643 173303 175371 177301 178546 179161
52960A79161M26K84l76j324j702j232o71p64j197j182p42p01j327j856j653j160
$$ 179161 179587 179871 179495 178171 176469 175237 174566 173802 172605 171423 170681 169980 168653 166797 165144 163984
52944A63984j182j705k041j796j081o7R48J340P79q4l41j38l73j119j334n05M70
$$ 163984 162802 161097 159056 157260 156179 156112 157060 158400 159179 159095 158754 158616 158243 157124 155790 155285 155755
52927A55755N40j56q60j356j769j748q86L01O71j00j096j325p65j09J97K83N39
$$ 155755 156295 156139 155279 153923 152154 150406 149520 149821 150492 150392 149296 147971 147206 147097 147294 147577 148116
52910A48116J141J908K444K463K019J449J065Q19L26o21j564j691q83q0k03r63
$$ 148116 149257 151165 153609 156072 158091 159540 160605 161424 161750 161129 159565 157874 156991 156911 156708 155745
52894A55745j290p41J76R71J627J990J517J95j025j208n45K8L9j68j04K58M90
$$ 155745 154455 153714 153890 154861 156488 158478 159995 160190 159165 157957 157412 157440 157479 157311 157207 157465 157955
52877A57955K17l89o76l53n7n59j496j654o21O55J209J171J134J210J276J529
$$ 157955 158172 157783 157107 156754 156697 156138 154642 152988 152367 153022 154231 155402 156536 157746 159022 160551
52861A60551K051K419K359K379L003L806L929L189K040Q03l40r51p10j07N2l58
$$ 160551 162602 165021 167380 169759 172762 176568 180497 183686 185726 186529 186189 185238 184528 184421 184473 184115
52845A84115q44j223j719k253k380k009j586j460j548j706j891j943j619j018
$$ 184115 183271 182048 180329 178076 175696 173687 172101 170641 169093 167387 165496 163553 161934 160916
52831A60916n63n21p63j007r78m22O79J917K707K733K062J011J05k09m9j11p86
$$ 160916 160353 159832 159069 158062 157084 156662 157341 159258 161965 164698 166760 167771 167876 167667 167618 167507 166721
52814A66721j655k094k044j687q69N44J984K583K202J596J500J976K504K430J464
$$ 166721 165066 162972 160928 159241 158372 158916 160900 163483 165685 167281 168781 170757 173261 175691 177155
52799A77155J2j141j736k206k837l254l137k809k583k207j559j218j554j828j148
$$ 177155 177167 176026 174290 172084 169247 165993 162856 160047 157464 155257 153698 152480 150926 149098 147950
52784A47950J50J062J373J470J181P8j248j535n63O09J180J336J371J174Q55P58
$$ 147950 148100 149162 150535 152005 153186 153264 152016 150481 149918 150527 151707 153043 154414 155588 156443 157201
52768A57201P16J70o66q67k12M15M47M02P97J242J141N69n3m75m65J57R45J057
$$ 157201 157917 158087 157421 156554 156342 156757 157204 157606 158403 159645 160786 161355 161302 160827 160362 160519 161464 162521
52750A62521M40o3l8j03o55j019n15M27R76J126J374J730J758J327O97Q0l56m15
$$ 162521 162961 162898 162860 162757 162102 161083 160568 160995 161971 163097 164471 166201 167959 169286 169983 170063 169707 169292
52732A69292j65Nj01k73m10p07j071j014m32J72N81J152J821J711M31j061j646
$$ 169292 169127 169132 169031 168758 168348 167641 166570 165556 165124 165296 165877 167029 168850 170561 170992 169931 168285
52715A68285j455j260j131o50M7M30M81M73K45m69j229j311q04m16l97m03l34
$$ 168285 166830 165570 164439 163789 163836 164266 164747 165220 165465 164996 163767 162456 161652 161236 160839 160436 160102
52698A60102m10n15l18mk1j90J23Q89J349J150P46M53j9p66j242j064o30m47l52
$$ 160102 159692 159177 158859 158855 158834 158644 158767 159656 161005 162155 162901 163354 163335 162569 161327 160263 159633 159186 158834
52679A58834N6O10P68L69k19o07o46l13L10Q93R89N48J15L77J301J929J353r5
$$ 158834 158890 159500 160268 160637 160418 159811 159165 158852 159162 160055 161044 161592 161707 162084 163385 165314 166667 166572
52661A66572j056p00L15Q09N97M14O05P16M20J64M66J150J667J936K384L230M083
$$ 166572 165516 164816 165131 165940 166537 166951 167556 168272 168692 168856 169322 170472 172139 174075 176459 179689 183772
52644A83772M226L229J331o82k052k593k678k694k656k365j771j079n77l87l58
$$ 183772 187998 191227 192558 191876 189824 187231 184553 181859 179203 176838 175067 173988 173411 173024 172666
52629A72666k08J79N90P58P31Q64J310J716J518N68o19j317j309j039j047j313
$$ 172666 172458 172637 173227 173985 174716 175580 176890 178606 180124 180692 180073 178756 177447 176408 175361 174048
52613A74048j351r01l02j19m82r45r18k60N55Q64N21J34L59J065J402P92m34j410
$$ 174048 172697 171796 171494 171375 170893 169948 169030 168770 169325 170189 170710 170844 171203 172268 173670 174462 174028 172618
52595A72618j541q65P7O61O48L48K79O07J077J357J248O45k78r28p81o5M30L19
$$ 172618 171077 170212 170289 170950 171598 171946 172225 172832 173909 175266 176514 177159 176881 175953 175172 175107 175537 175856
52577A75856m6k47k69j70J36N49P29O69P49R95Q46O9o85p75m71l96n27m20o0K24
$$ 175856 175810 175563 175294 175124 175260 175809 176538 177207 177956 178951 179797 179866 179181 178406 177935 177539 177012 176592 176532 176756
52557A76756L87N61N47J09l99m47k04k81o71p31k75J28J24J54O68J366J604J239
$$ 176756 177143 177704 178251 178360 177961 177514 177310 177029 176358 175627 175352 175480 175604 175758 176426 177792 179396 180635
52539A80635P15M86N91O30J71o99j278j009k28K12K1l34m47m26m28l30j34j29
$$ 180635 181350 181836 182427 183057 183228 182529 181251 180242 180014 180226 180247 179913 179466 179040 178612 178282 178148 178019
52521A78019l43k43N73J691K277J996J216M60mj38QL70R10J550K038K088J808
$$ 178019 177676 177433 178006 179697 181974 183970 185186 185646 185642 185504 185512 185882 186792 188342 190380 192468 194276
52504A94276J712K077K471K254J398M30l51j197k283l174l276k633j859j359r49
$$ 194276 195988 198065 200536 202790 204188 204618 204267 203070 200787 197613 194337 191704 189845 188486 187537
52489A87537l76K17N67P42R41J041P95M06M03Q54J166Q56J70k71j30N63J566K452
$$ 187537 187161 187378 187945 188687 189628 190669 191464 191870 192273 193127 194293 195149 195319 195048 194918 195481 197047 199499
52471A99499K771K586K507K799K779J673o5j013m40Q39J553J446J247J464J716
$$ 199499 202270 204856 207363 210162 212941 214614 214549 213536 213096 213935 215488 216934 218181 219645 221361
52456B21361J383M76m22r34j207j473j702j908k332k926l046k282j367j400k235
$$ 221361 222744 223220 222798 221864 220657 219184 217482 215574 213242 210316 207270 204988 203621 202221 199986
52441A99986k573j838j003j017j385j129m28k29o81r95p44k81J18O20J157J249
$$ 199986 197413 195575 194572 193555 192170 191041 190613 190384 189703 188708 187964 187683 187801 188421 189578 190827
52425A90827P80L35L77O26N21Kn10o21k35L90P84O27J23k37k35rL92J039J764
$$ 190827 191607 191942 192319 192945 193466 193468 192958 192337 192102 192492 193276 193903 194026 193789 193554 193545 193937 194976 196740
52406A96740K183K201K147K254K386K450K749L688N194O578O936N824L684J479
$$ 196740 198923 201124 203271 205525 207911 210361 213110 216798 221992 228570 235506 241330 245014 246493
52392B46493k86j926l716n044n077m042l074k776k650k098j327q55p52p29o03
$$ 246493 246207 244281 240565 235521 230444 226402 223328 220552 217902 215804 214477 213622 212870 212141 211538
52377B11538l06K84J072J611J501Q66J83j19J96J127K298L076L067K454J760J396
$$ 211538 211232 211516 212588 214199 215700 216566 216749 216630 216826 217953 220251 223327 226394 228848 230608 232004
52361B32004J408J475J133K33p75j352j514j705j992j930j271l08N77J287J685
$$ 232004 233412 234887 236020 236253 235478 234126 232612 230907 228915 226985 225714 225406 225983 227270 228955
52346B28955J492P64O7j73j91l58n51l95J13O52J067J501K085K706L072K909K308
$$ 228955 230447 231211 231278 231105 230914 230556 230005 229610 229723 230375 231442 232943 235028 237734 240806 243715 246023
52329B46023J927K448L699M694M788M426M354M510M268L530L006L282M099M699
$$ 246023 247950 250398 254097 258791 263579 268005 272359 276869 281137 284667 287673 290955 295054 299753
52315B99753M644M113L523L011K393J585R11P77J077J276J086P91P54R74J291
$$ 299753 304397 308510 312033 315044 317437 319022 319933 320710 321787 323063 324149 324940 325694 326668 327959
52300C27959J739K350K900L118L024K842K656K419K161J918J597J041K42o09j220
$$ 327959 329698 332048 334948 338066 341090 343932 346588 349007 351168 353086 354683 355724 355966 355357 354137
52285C54137j339r74n43n31q95j075p22j15L10N44Q43J231J511J632J762K028
$$ 354137 352798 351824 351281 350750 349855 348780 348058 347943 348253 348797 349640 350871 352382 354014 355776 357804
52269C57804K369K585K483K082J694J634J846K080K447L302M500N264N078M276
$$ 357804 360173 362758 365241 367323 369017 370651 372497 374577 377024 380326 384826 390090 395168 399444
52255C99444L439K662J906J582K075L000L557L640L827M298M385L523K077R40
$$ 399444 402883 405545 407451 409033 411108 414108 417665 421305 425132 429430 433815 437338 439415 440355
52241D40355N24N73O78P59R65J357J775J980J890J632J358J195J291J797K587
$$ 440355 440879 441452 442130 442889 443854 445211 446986 448966 450856 452488 453846 455041 456332 458129 460716
52226D60716L230L432L408L600M081M441M278L638K940K552K505K549K543K623
$$ 460716 463946 467378 470786 474386 478467 482908 487186 490824 493764 496316 498821 501370 503913 506536
52212E06536K942L315L417L286L308L582L684L296K726K607L204M286N399O031
$$ 506536 509478 512793 516210 519496 522804 526386 530070 533366 536092 538699 541903 546189 551588 557619
52198E57619N784M757L606K903K638K533K524K561K269J399N10N44J643K921L532
$$ 557619 563403 568160 571766 574669 577307 579840 582364 584925 587194 588593 589103 589647 591290 594211 597743
52183E97743L522L334K982K091O23q39j700k025k507l640n066n909n767n129m706
$$ 597743 601265 604599 607581 609672 610295 609456 607756 605731 603224 599584 594518 588609 582842 577713 573007
52168E73007m602m397l785k817j691p05k54m55p71m21P85K281L425M031M199L950
$$ 573007 568405 564008 560223 557406 555715 555010 554756 554301 553530 553109 553894 556175 559600 563631 567830 571780
52152E71780L239K091O76o41j368j216l39Q53K122L273L940L838L248K696K177
$$ 571780 575019 577110 577786 577145 575777 574561 574222 575075 577197 580470 584410 588248 591496 594192 596369
52137E96369J257lq24p23k20j10m51p53p94o75k92O67K225M042N849P609R207
$$ 596369 597626 597623 596799 596076 595856 595746 595295 594542 593748 593073 592781 593448 595673 599715 605564 613173 622380
52120F22380J0482J1519J2556J3483J3886J3649J3042J2045J0129P142L997J793
$$ 622380 632862 644381 656937 670420 684306 697955 710997 723042 733171 740313 744310 746103
52108G46103M99q48k724m578n858o836p920q697q360o870n019l329j509P36K874
$$ 746103 746602 745754 743030 738452 732594 725758 717838 709141 700781 693911 688892 685563 684054 684790 687664
52093F87664L979L816L147K891L159L166K083p1k418m174n405o616p771q162p325
$$ 687664 691643 695459 698606 701497 704656 707822 709905 709834 707416 703242 697837 691221 683450 675288 667963
52078F67963n643l834k234q99k7K08O9NQ2K3j63j16L07P92J102J371J653J567
$$ 667963 662320 658486 656252 655353 655326 655534 655603 655608 655690 655713 655550 655434 655741 656533 657635 659006 660659 662226
52060F62226Q35o4l52m3l7r62k301k992k664j839j190r27r58j164j412j613j926
$$ 662226 663061 662997 662645 662602 662565 661603 659302 656310 653646 651807 650617 649690 648732 647568 646156 644543 642617
52043F42617k569l338l620l212k693k664k956l038k932l034l180k658j283K19
$$ 642617 640048 636710 633090 629878 627185 624521 621565 618527 615595 612561 609381 606723 605440 605659
52029F05659J113J435J569J626J640J939K728L605L955L771L628L876M224M135
$$ 605659 606772 608207 609776 611402 613042 614981 617709 621314 625269 629040 632668 636544 640768 644903
$$ [...]
##END NTUPLES=NMR SPECTRUM
##END=
