##TITLE=AC1503_INDRS13310_8125488_1tnHXh314G
##JCAMPDX= 6.0         $$ Bruker NMR JCAMP-DX V2.0
##DATA TYPE= NMR SPECTRUM
##DATA CLASS= NTUPLES
##ORIGIN= BRUKER
##OWNER= Administrator
$$ 1.72 TOPSPIN		Version 2.1
$$ 2013-08-16 18:11:55.998 -0700  Administrator@X
$$ Compression mode = diff/dup
##.OBSERVE FREQUENCY= 400.02188249412
##.OBSERVE NUCLEUS= ^1H
##.ACQUISITION MODE= SIMULTANEOUS (DQD)
##.ACQUISITION SCHEME= undefined
##.AVERAGES= 64
##.DIGITISER RES= 22
##SPECTROMETER/DATA SYSTEM= spect
##.PULSE SEQUENCE= noesygpps1d.comp
##.SOLVENT NAME= COFFEE_meoh
##.SHIFT REFERENCE= INTERNAL, COFFEE_meoh, 1, 14.96082
##AUDIT TRAIL= $$ (NUMBER, WHEN, WHO, WHERE, PROCESS, VERSION, WHAT)
$$ ##TITLE= Audit trail, TOPSPIN		Version 2.1
$$ ##JCAMPDX= 5.01
$$ ##ORIGIN= Bruker BioSpin GmbH
$$ ##OWNER= Administrator
$$ $$ E:\/data/COFFEE/nmr/AC1503_INDRS13310_8125488_1tnHXh314G/22/pdata/1/auditp.txt
$$ ##AUDIT TRAIL=  $$ (NUMBER, WHEN, WHO, WHERE, PROCESS, VERSION, WHAT)
(   1,<2013-08-16 18:11:51.077 -0700>,<Administrator>,<X>,<go>,<TOPSPIN 2.1>,
      <created by zg
	started at 2013-08-16 18:00:21.780 -0700,
	POWCHK enabled, PULCHK disabled,
       configuration hash MD5:
       C8 4E 4E 5D D3 5C D8 9E 9F 52 82 E0 59 8A DE 15
       data hash MD5: 64K
       3B 86 51 66 9D 62 59 95 99 3A F1 D0 0E 82 93 35>)
(   2,<2013-08-16 18:11:54.077 -0700>,<Administrator>,<X>,<proc1d>,<TOPSPIN 2.1>,
      <Start of raw data processing
       efp LB = 0.3 FT_mod = 6 PKNL = 1 PHC0 = 0 PHC1 = 0 SI = 128K 
       data hash MD5: 128K
       99 99 A9 8D 87 D7 F9 32 20 C4 1F FE F4 2B B4 8A>)
(   3,<2013-08-16 18:11:55.077 -0700>,<Administrator>,<X>,<proc1d>,<TOPSPIN 2.1>,
      <pk PHC0 = -78.73901 PHC1 = 0 
       data hash MD5: 128K
       73 3B 66 D8 A8 52 74 2F 8F 92 AE 75 BA 28 B8 4F>)
(   4,<2013-08-16 18:11:55.452 -0700>,<Administrator>,<X>,<proc1d>,<TOPSPIN 2.1>,
      <abs ABSG = 1 
       data hash MD5: 128K
       15 51 9B 23 BC ED 0D 57 3D 2B 83 79 2B 9A 2A 15>)
(   5,<2013-08-16 18:11:55.545 -0700>,<Administrator>,<X>,<proc1d>,<TOPSPIN 2.1>,
      <abs ABSG = 2 
       data hash MD5: 128K
       1C AB AB 89 35 C7 0A 9E E8 D8 97 E8 D2 40 81 C1>)
(   6,<2013-08-16 18:11:55.639 -0700>,<Administrator>,<X>,<proc1d>,<TOPSPIN 2.1>,
      <abs ABSG = 3 
       data hash MD5: 128K
       95 2C 9D D8 85 90 19 10 E3 C5 39 A9 A5 30 89 20>)
(   7,<2013-08-16 18:11:55.733 -0700>,<Administrator>,<X>,<proc1d>,<TOPSPIN 2.1>,
      <abs ABSG = 4 
       data hash MD5: 128K
       42 7F 73 54 F8 3B 59 CD 8E 8F E5 FE 6F F8 A6 B7>)
(   8,<2013-08-16 18:11:55.811 -0700>,<Administrator>,<X>,<proc1d>,<TOPSPIN 2.1>,
      <abs ABSG = 5 
       data hash MD5: 128K
       80 8A A6 15 20 AD 39 E4 A9 C0 E7 6D D5 BE EE 33>)
$$ ##END=
$$ 
$$ $$ hash MD5
$$ $$ 68 9F 2D AD 5C 84 B6 6F E7 D4 67 F7 EC 2E DE 2F
##$RELAX= 
##$RELAX= 
##$RELAX= 
##$RELAX= 
##$RELAX= 
##$RELAX= 
##$RELAX= 
##$RELAX= 
$$ Bruker specific parameters
$$ --------------------------
##$DU= <E:\>
##$EXPNO= 22
$$ [...]
##$TP07= 0
##$TPNAME0= <>
##$TPNAME1= <>
##$TPNAME2= <>
##$TPNAME3= <>
##$TPNAME4= <>
##$TPNAME5= <>
##$TPNAME6= <>
##$TPNAME7= <>
##$TPOAL= (0..7)
0.5 0.5 0.5 0.5 0.5 0.5 0.5 0.5
##$TPOFFS= (0..7)
0 0 0 0 0 0 0 0
##$TUNHIN= 0
##$TUNHOUT= 0
##$TUNXOUT= 0
##$USERA1= <user>
##$USERA2= <user>
##$USERA3= <user>
##$USERA4= <user>
##$USERA5= <user>
##$V9= 5
##$VALIST= <valist>
##$VCLIST= <CCCCCCCCCCCCCCC>
##$VD= 0
##$VDLIST= <DDDDDDDDDDDDDDD>
##$VPLIST= <PPPPPPPPPPPPPPP>
##$VTLIST= <TTTTTTTTTTTTTTT>
##$WBST= 2048
##$WBSW= 25
##$XGAIN= (0..3)
0 0 0 0
##$XL= 0
##$YL= 0
##$YMAX_a= 6088759
##$YMIN_a= -11177279
##$ZGOPTNS= <>
##$ZL1= 120
##$ZL2= 120
##$ZL3= 120
##$ZL4= 120
##$ABSF1= 14.96082
##$ABSF2= -5.597362
##$ABSG= 5
##$ABSL= 3
##$ALPHA= 0
##$AQORDER= 0
##$ASSFAC= 0
##$ASSFACI= 0
##$ASSFACX= 0
##$ASSWID= 0
##$AUNMP= <proc_prof1d_extract.lims>
##$AXLEFT= 0
##$AXNAME= <>
##$AXNUC= <1H>
##$AXRIGHT= 0
##$AXTYPE= 0
##$AXUNIT= <>
##$AZFE= 0.1
##$AZFW= 0.1
##$BCFW= 0
##$BC_mod= 0
##$BYTORDP= 0
##$COROFFS= 0
##$CY= 15
##$DATMOD= 1
##$DC= 0
##$DFILT= <>
##$DTYPP= 0
##$F1P= 0
##$F2P= 0
##$FCOR= 0.5
##$FTSIZE= 131072
##$FT_mod= 6
##$GAMMA= 0
##$GB= 0
##$INTBC= 1
##$INTSCL= 1
##$ISEN= 128
##$LB= 0.3
##$LEV0= 0
##$LPBIN= 0
##$MAXI= 10000
##$MC2= 0
##$MEAN= 0
##$ME_mod= 0
##$MI= 0
##$NCOEF= 0
##$NC_proc= -2
##$NLEV= 6
##$NOISF1= 0
##$NOISF2= 0
##$NSP= 0
##$NTH_PI= 0
##$NZP= 0
##$OFFSET= 14.96082
##$PC= 1
##$PHC0= -78.73901
##$PHC1= 0
##$PH_mod= 1
##$PKNL= yes
##$PPARMOD= 0
##$PPDIAG= 0
##$PPIPTYP= 0
##$PPMPNUM= 2147483647
##$PPRESOL= 1
##$PSCAL= 4
##$PSIGN= 0
##$PYNMP= <proc.py>
##$REVERSE= no
##$SF= 400.020009707318
##$SI= 131072
##$SIGF1= 0
##$SIGF2= 0
##$SINO= 400
##$SIOLD= 131072
##$SPECTYP= <>
##$SREGLST= <1H.CDCl3>
##$SSB= 0
##$STSI= 131072
##$STSR= 0
##$SW_p= 8223.68421052631
##$SYMM= 0
##$S_DEV= 0
##$TDeff= 65536
##$TDoff= 0
##$TI= <>
##$TILT= no
##$TM1= 0
##$TM2= 0
##$TOPLEV= 0
##$USERP1= <user>
##$USERP2= <user>
##$USERP3= <user>
##$USERP4= <user>
##$USERP5= <user>
##$WDW= 1
##$XDIM= 131072
##$YMAX_p= 395134588
##$YMIN_p= -11911
##$CURPLOT= <Network HP LaserJet P1505>
##$CURPRIN= <$Network HP LaserJet P1505>
##$DFORMAT= <normdp>
##$LAYOUT= <+/1D_H.xwp>
##$LFORMAT= <normlp>
##$PFORMAT= <normpl>
##$SURQMSG= 1
$$ End of Bruker specific parameters
$$ ---------------------------------
##NTUPLES= NMR SPECTRUM
##VAR_NAME=  FREQUENCY,     SPECTRUM/REAL,   SPECTRUM/IMAG
##SYMBOL=    X,             R,               I
##VAR_TYPE=  INDEPENDENT,   DEPENDENT,       DEPENDENT
##VAR_FORM=  AFFN,          ASDF,            ASDF
##VAR_DIM=   131072,        131072,          131072
##UNITS=     HZ,            ARBITRARY UNITS, ARBITRARY UNITS
##FACTOR=    0.0627417313425164, 1,          1
##FIRST=     8223.62146879497, 1036,         -54119
##LAST=      0,             3277,            -54338
##MIN=       0,             -11911,          0
##MAX=       8223.62146879497, 395134588,    0
$$ Real data points
##PAGE= N=1
##DATA TABLE= (X++(R..R)), XYDATA
$$ [...]
63954D55768J9200K1702K4119K6727K9584L2704L6395M1281M7861N6034O5144
63943H56519P4773Q5348R7613J11417J25555J38837J50849J61503J70570J78023
63933B151007J84182J88921J91083J89220J82636J71300J55238J34701J10723
63924C659011Q4792N7965L0601K762k5560n4408q3290j10738j34917j54783j70218
63913C101217j81185j87448j89289j87866j84425j79426j72628j63751j52806
63904A502393j40071j26229j12387r9584q8096p7495o7480n8460n0996m4855l9102
63893E97638l3298k8121k4353k1665j9061j6388j4534j3973j3915j3334j2152
63882C86844j0864r541q007o629o061o234o265n514m170k762j599p51j05O82J841
$$ plain form
63954 455768 474968 496670 520789 547516 577100 609804 646199 687480 735341 791375 856519
63943 856519 931292 1016640 1114253 1225670 1351225 1490062 1640911 1802414 1972984 2151007
63933 2151007 2335189 2524110 2715193 2904413 3087049 3258349 3413587 3548288 3659011
63924 3659011 3743803 3801768 3832369 3835131 3809571 3755163 3671873 3561135 3426218 3271435 3101217
63913 3101217 2920032 2732584 2543295 2355429 2171004 1991578 1818950 1655199 1502393
63904 1502393 1362322 1236093 1123706 1024122 936026 858531 791051 732591 681595 636740 597638
63893 597638 564340 536219 511866 490201 471140 454752 440218 426245 412330 398996 386844
63882 386844 375980 366439 358432 351803 345742 339508 333243 327729 323559 320797 319198 318447 318342 319024 320865
63867C20865L054L785M180N065O782Q578R514R606R638J0192J1262J2635J4095
63854D29251J5292J5831J5633J4990J4239J3490J2624J1400R703P838O382N473
63842E72146M443K554l0k544m759p196j0066j2705j4503j5776j7128j8367j8833
63829D57236j8513j8082j7839j7433j6683j5938j5307j4281j2614j0889r734q956
63817B80967q061p193o811o761o460n909n686n889n809m949l789l129l078l068
63803B04375k664k052j718j824j970j601p45j16k83r69j443j429j201r92q18q37
63787A83713j282j912k085j571q32l43r1R8J67O1l4M8K18L25L15M6n94j303j523
63768A73421j196q49p41m41L55J090R77L2r56j323r77k01N53Q47O43L92M36M88
$$ plain form
63867 320865 323919 327704 331884 336949 343731 352309 361823 371429 381067 391259 402521 415156 429251
63854 429251 444543 460374 476007 490997 505236 518726 531350 542750 552453 560291 566673 572146
63842 572146 576589 579143 579113 576569 571810 564614 554548 541843 527340 511564 494436 476069 457236
63829 457236 438723 420641 402802 385369 368686 352748 337441 323160 310546 299657 289923 280967
63817 280967 272906 265713 258902 252141 245681 239772 234086 228197 222388 217439 213650 210521 207443 204375
63803 204375 201711 199659 197941 196117 194147 192546 191801 191685 191402 190433 188990 187561 186360 185368 184550 183713
63787 183713 182431 180519 178434 176863 176031 175688 175597 175695 175862 175923 175889 175937 176155 176480 176795 176841 176247 174944 173421
63768 173421 172225 171376 170635 170194 170549 171639 172616 172648 171692 170369 169392 169191 169744 170591 171234 171626 172062 172550
63750A72550M4q24j445j332o90j42n6k00j6O79J396J623J617K037K838L219K872
63733A84170K510K739L090K822K106J729J935K360K856L601M489N029N020M784
63719B29240M730N016N542N936N650M538L204K342J920J429P23L1o54j574k605
63704B65468l290l437l257k955k729k918l556l817k845j058J51K38R8O03J396
63689B38092J644J300R52R28J146J515J929K076J775J256Q59O94Q58J489K228
63674B58741K169J115L71J399L742N278M758L255K672L507M657N021M553L797
63660C05035L037K156J021k92j603k777l768m516m837m565l881l362l463l999
63646B74186m380m359m165l872l057j481K92J370J519J233R71Q11Q32J201J817
$$ plain form
63750 172550 172594 171770 170325 168993 168303 168161 168105 167905 167889 168568 169964 171587 173204 175241 178079 181298 184170
63733 184170 186680 189419 192509 195331 197437 199166 201101 203461 206317 209918 214407 219436 224456 229240
63719 229240 233970 238986 244528 250464 256114 260652 263856 266198 268118 269547 270270 270301 269647 268073 265468
63704 265468 262178 258741 255484 252529 249800 246882 243326 239509 236664 235606 235757 235995 236093 236696 238092
63689 238092 239736 241036 241988 242916 244062 245577 247506 249582 251357 252613 253472 254166 255024 256513 258741
63674 258741 260910 262025 262396 263795 267537 272815 277573 280828 283500 287007 291664 296685 301238 305035
63660 305035 308072 310228 311249 310957 309354 306577 302809 298293 293456 288891 285010 281648 278185 274186
63646 274186 269806 265447 261282 257410 254353 252872 253164 254534 256053 257286 258257 259068 259900 261101 262918
63631B62918K361K884L824N211O381O790O634O314N853N302N272O324Q138R860
63617C44066J1116J2142J3149J4163J5438J7308J9598K1700K3345K4892K6753
63606E43670K8974L1389L3775L5702L6639L6320L4740L1799K7247K1085J3830
63595H75170O365k62n130p968r335j0062j0576j1062j1885j3354j5319j7475j9860
63582G49247k2383k4206k4423k3265k1808k0527j9016j7126j5315j3682j1638
63571E35858r040o642m921l351j426L91J563K521L955N608O703P176P571Q030
63557E53996Q263Q352Q733R438J0145J0938J2279J4194J6240J8376K1113K4643
63545G16710K8457L2179L6188M0858M5440M8051M6830M1087L1651K0366R174o05
$$ plain form
63631 262918 265279 268163 271987 277198 283579 290369 297003 303317 309170 314472 319744 326068 334206 344066
63617 344066 355182 367324 380473 394636 410074 427382 446980 468680 492025 516917 543670
63606 543670 572644 604033 637808 673510 710149 746469 781209 813008 840255 861340 875170
63595 875170 881535 881273 876143 868175 858840 848778 838202 827140 815255 801901 786582 769107 749247
63582 749247 726864 702658 678235 654970 633162 612635 593619 576493 561178 547496 535858
63571 535858 526818 520176 515255 511904 510478 510869 512432 514953 518908 524516 531219 538395 545966 553996
63557 553996 562259 570611 579344 588782 598927 609865 622144 636338 652578 670954 692067 716710
63545 716710 745167 777346 813534 854392 899832 947883 994713 1035800 1067451 1087817 1096991 1096386
63533A096386q335j3719j6663j7399j6532j4909j3434j2777j3101j4212j6124
63522I39181j9134k3120k7082k9941l1577l2597l3166l2763l1183k9118k7321
63511F22179k5673k3533k0817j8193j6185j4521j2616j0513q954q428q432p982
63499D46332o776n469m847n070n802o574o838o192m964m151m249m503l921k725
63485C74251k019k114k180j614q58l70L26J824L546M251L707L071L395M421N089
63470C94726M813L802K483J118q0j020k025l674n961p914q415p363n697m349l566
63455C56878l241l309l555l486k834j930j253q06k46N62J590K983M815O548P382
63440C60098P273P101P659Q889J0334J1881J3721J5922J8501K1671K5493K9281
$$ plain form
63533 1096386 1088051 1074332 1057669 1040270 1023738 1008829 995395 982618 969517 955305 939181
63522 939181 920047 896927 869845 839904 808327 775730 742564 709801 678618 649500 622179
63511 622179 596506 572973 552156 533963 517778 503257 490641 480128 471174 462746 454314 446332
63499 446332 439556 434087 429240 424170 418368 411794 404956 398764 393800 389649 385400 380897 376976 374251
63485 374251 372232 370118 367938 366324 365466 365096 365422 367246 370792 375043 378750 381821 385216 389637 394726
63470 394726 399539 403341 405824 406942 406862 405842 403817 400143 394182 386268 377853 370490 364793 360444 356878
63455 356878 353637 350328 346773 343287 340453 338523 337270 336464 336218 336780 338370 341353 346168 352716 360098
63440 360098 367371 374472 382131 391020 401354 413235 426956 442878 461379 483050 508543 537824
63428E37824L1799L2163L0321K6619K1381J5266R724O459O188Q143J1084J4548
63416G51519J8847K4003K9269L3838L7569M0648M2763M3047M0737L5621K8007
63405A125868J8672Q924K38o525j1380j4716j6755j7695j8096j8790k0305k2550
63393A006890k5081k7588l0005l2231l3903l4582l4116l2676l0457k7594k4351
63382F74306k1189j8445j6142j4230j2676j1167r065o127l045p64N95J697L006
63369E66754M404N836P653R956J2111J3349J3692J3912J4804J6647J9190K1873
63357G20181K4268K6533K9270L2652L5980L8393L9798M0656M0891L9544L5684
63346A103850K9372K1593J3456N654j498p717j2572j5645j6949j7180j7425j8462
$$ plain form
63428 537824 569623 601786 632107 658726 680107 695373 705097 711556 717744 725887 736971 751519
63416 751519 770366 794369 823638 857476 895045 935693 978456 1021503 1062240 1097861 1125868
63405 1125868 1144540 1153464 1153702 1147177 1135797 1121081 1104326 1086631 1068535 1049745 1029440 1006890
63393 1006890 981809 954221 924216 891985 858082 823500 789384 756708 726251 698657 674306
63382 674306 653117 634672 618530 604300 591624 580457 571392 565265 562220 561456 562051 563748 566754
63369 566754 571158 576994 584647 594603 606714 620063 633755 647667 662471 679118 698308 720181
63357 720181 744449 770982 800252 832904 868884 907277 947075 987731 1028622 1068166 1103850
63346 1103850 1133222 1154815 1168271 1173925 1172427 1164710 1152138 1136493 1119544 1102364 1084939 1066477
63334A066477k0366k2692k5058k7437k9954l2415l4208l4773l4159l2948l1550
63323G40917k9788k7293k4069k0473j6744j2851q799m860j565L26p3l174q252
63310E83302j3598j7612j9668j9920j8750j6684j4534j2943j1802j0541r086p987
63298D10177p520p188o489n755n646o056o220n845n535n799o211o017n250m737
63284C25909m943n314m956l790k693k477k953l215k771k059j693j664j573j413
63270B84395j502j762j697j222q77r89j222j279j474k044k468k169j511j333j639
63255B61207j618r05q9K34J63P1Q2K53O82J126J014J87p41j101q82m60r4pm59
63236B58663j240j512p53L72P18P1p33r76p55m68j78L25J128K081K844L049K590
$$ plain form
63334 1066477 1046111 1023419 998361 970924 940970 908555 874347 839574 805415 772467 740917
63323 740917 711129 683836 659767 639294 622550 609699 600900 596040 594475 594801 594728 591554 583302
63310 583302 569704 552092 532424 512504 493754 477070 462536 449593 437791 427250 418164 410177
63298 410177 402657 395469 388980 383225 377579 371523 365303 359458 353923 348124 341913 335896 330646 325909
63284 325909 320966 315652 310696 306906 304213 301736 298783 295568 292797 290738 289045 287381 285808 284395
63270 284395 282893 281131 279434 278212 277335 276346 275124 273845 272371 270327 267859 265690 264179 262846 261207
63255 261207 259589 258684 258595 258829 258992 259063 259145 259398 260080 261206 262220 262407 261666 260565 259683 259223 259129 259122 258663
63236 258663 257423 255911 255158 255530 256248 256319 255586 254610 253855 253387 253209 253534 254662 256743 259587 262636 265226
63219B65226J803J163Q05O13O06R04J393J772J935J958J802J406J069J205J685
63204B85345J902J659J475J798K339K582K476K267J939J407J067J589L075M809
63190C15729N949O291O260O367O817P498Q261R048R765J0204J0281J0327J0755
63177D23552J1395J1548J0896R972R412R153Q792Q382Q242Q163P555O399N350
63164E38811M644L555J396j412l802n413o893q924j1361j3401j4354j4129j3214
63151D55503j2296j1811j1739j1757j1518j0727r280p511o175n804o115o294n917
63138C38559n214m421l310j726k19M14K21J93J045K291K895K601K183K449L440
63123C41401M625N468N675N268M758M921O019P401Q214Q349Q286Q194P743O865
$$ plain form
63219 265226 267029 268192 268997 269610 270216 271120 272513 274285 276220 278178 279980 281386 282455 283660 285345
63204 285345 287247 288906 290381 292179 294518 297100 299576 301843 303782 305189 306256 307845 310920 315729
63190 315729 321678 327969 334229 340596 347413 354911 363172 372220 381985 392189 402470 412797 423552
63177 423552 434947 446495 457391 467363 476775 485928 494720 503102 511344 519507 527062 533461 538811
63164 538811 543455 547010 548406 546994 543192 537779 530886 521962 510601 497200 482846 468717 455503
63151 455503 443207 431396 419657 407900 396382 385655 376375 368864 362689 356885 350770 344476 338559
63138 338559 333345 328924 325614 323888 323669 324083 324304 324497 325542 327833 330728 333329 335512 337961 341401
63123 341401 346026 351494 357169 362437 367195 372116 378135 385536 393750 402099 410385 418579 426322 433187
63109D33187O127O090O642P270P682P880P884P717P592P784Q294Q786Q848Q299
63095E40082P371O669O754P592Q545Q983Q694P705N996L743J493k35j449k567
63081F09376l888n455p224r078j0701j1770j2202j2143j1808j1531j1633j1918
63069D90025j1584j0091p991o386n699n409m885l976k795j514n01o7N7N54J600
63054D31338K559K829K561K386K730L646M870N885O290O370O818P744Q398Q175
63040E02599P415O801O473O201O011O014N990N664N263N157N199M988M591M314
63026E82680L885K600M41j661k894l378l683l993m094l830l274k659k301k264
63012E55575k080j214N9P81P26J025K845N714P983Q887R436J1042J3797J6501
$$ plain form
63109 433187 439314 445404 452046 459316 466998 474878 482762 490479 498071 505855 514149 522935 531783 540082
63095 540082 547453 554122 560876 568468 577013 585996 594690 602395 608391 612134 613627 613392 611943 609376
63081 609376 605488 600033 592809 583731 573030 561260 549058 536915 525107 513576 501943 490025
63069 490025 478441 468350 460359 453973 448274 442865 437980 434004 431209 429695 429194 429127 429184 429738 431338
63054 431338 433897 436726 439287 441673 444403 448049 452919 458804 465094 471464 478282 486026 494424 502599
63040 502599 510014 516815 523288 529489 535500 541514 547504 553168 558431 563588 568787 573775 578366 582680
63026 582680 586565 589165 589606 587945 585051 581673 577990 573997 569903 566073 562799 560140 557839 555575
63012 555575 553495 552281 552340 553121 553847 554872 557717 563431 571414 580301 589737 600779 614576 631077
62998F31077J7992J8050J7227J6212J5454J5057J4840J4579J4206J3816J3494
62987H02004J3247J2980J2425J1286R672Q137O956N399K418j886o081r132j1651
62974H55774j4786j8318k0875k1912k2418k3389k4429k4456k3168k1231j9347
62963F21445j7722j6280j4864j3361j1914j0881j0351r954r416q947q775q676
62951D80304q461q456q944r399r034p995p240p289p783q333q929r362r111q179
62937C61789p364p143o883n868m618m335n140n756n133l802l116l536m137l810
62923B91148k523j227p31r33j147r44m84j45j5J67N57R16Q33L76K25Q54J761J953
62905B90641J280P47J254K494L495L859L985M381N241O491P730Q323Q086P747
$$ plain form
62998 631077 649069 667119 684346 700558 716012 731069 745909 760488 774694 788510 802004
62987 802004 815251 828231 840656 851942 861614 869751 876707 882106 884524 882638 876557 867425 855774
62974 855774 840988 822670 801795 779883 757465 734076 709647 685191 662023 640792 621445
62963 621445 603723 587443 572579 559218 547304 536423 526072 516118 506702 497755 488980 480304
62951 480304 471843 463387 454443 445044 436010 428015 420775 413486 405703 397370 388441 379079 369968 361789
62937 361789 354425 347282 340399 334531 329913 325578 320438 314682 309549 305747 302631 299095 294958 291148
62923 291148 288625 287398 286667 285734 284587 283643 283159 283014 282999 283166 283723 284639 285472 285848 286073 286927 288688 290641
62905 290641 291921 292668 293922 296416 299911 303770 307755 312136 317377 323868 331598 339921 348007 355754
62891C55754Q093Q847R004Q218P115O167N087L598K034P56m63j977l622m952n834
62876C97825o425o859p233p659q047q096p730p241o813o291n618n092m908m861
62862C04952m784m864n166n303m998m525m106l346j942n54j57o96j171j032p48
62847B61560q27r90p06l0M57M10N8j60k00m33j038j482j025J92J090R78M27L08
62829B58589M98K98k54m75l03m36j020j238n88L01O71P24R68J149O63l34j089
62812B58124j317j313j148n42L48Q52P25N37P50J018Q03K72NJ34L45N57R42J330
62794B62422J238O66K34K42J49m84j059o30O33J490J258O06N11J033J632K124
62778B72065K663L092L092K895L152L950M537M308L593L161L274L546L525L079
$$ plain form
62891 355754 363847 372694 381698 389916 397031 403198 408285 411883 413917 414673 414210 412233 408611 403659 397825
62876 397825 391400 384541 377308 369649 361602 353506 345776 338535 331722 325431 319813 314721 309813 304952
62862 304952 300168 295304 290138 284835 279837 275312 271206 267860 265918 265364 265207 264511 263340 262308 261560
62847 261560 260733 259743 259037 259007 259464 259874 259932 259772 259572 259139 258101 256619 255594 255786 256876 257854 258281 258589
62829 258589 259087 259385 259131 258656 258353 257917 256897 255659 255071 255372 256043 256767 257735 258884 259547 259213 258124
62812 258124 256807 255494 254346 253804 254152 255004 255729 256266 257016 258034 258837 259109 259114 259248 259593 260150 261092 262422
62794 262422 263660 264326 264560 264802 264951 264467 263408 262778 263411 264901 266159 266765 267276 268309 269941 272065
62778 272065 274728 277820 280912 283807 286959 290909 295446 299754 303347 306508 309782 313328 316853 319932
62764C19932K317J417N37k84j075j720j979j869j812k155k670k836k591k492l021
62749B99699l941m523m314l561k898k694k777k836k925l359m024m211l462k373
62735B51801k033k635l125k458q33O73J360J373J150R11Q06J003J395J520J160
62720B52068Q18J248K504L728M027L448K948L356M504N475N751N812O477P791
62706C09955R019R711J0269J1273J2711J4273J5976J8016K0167K1972K3417K4914
62694E01673K6528K7835K8636K9309L0146L0832L0853K9991K8082K4834K0361
62683H09080J5478J0814N964K70n789j0924j4827j8612k3038k7143k9429k9807
62671F82037k9504k9355k9132k8542k7846k7175k6001k3913k1396j9262j7585
$$ plain form
62764 319932 322249 323666 324203 323919 322844 321124 319145 317276 315464 313309 310639 307803 305212 302720 299699
62749 299699 295758 291235 286921 283360 280462 277768 274991 272155 269230 265871 261847 257636 254174 251801
62735 251801 249768 247133 244008 241550 240717 241390 242750 244123 245273 246184 246990 247993 249388 250908 252068
62720 252068 252886 254134 256638 260366 264393 267841 270789 274145 278649 284124 289875 295687 302164 309955
62706 309955 318974 328685 338954 350227 362938 377211 393187 411203 431370 453342 476759 501673
62694 501673 528201 556036 584672 613981 644127 674959 705812 735803 763885 788719 809080
62683 809080 824558 835372 841336 841606 835817 824893 810066 791454 768416 741273 711844 682037
62671 682037 652533 623178 594046 565504 537658 510483 484482 460569 439173 419911 402326
62660D02326j5852j3993j2560j1831j1256j0143q548p242o834p053o952n856m150
62647B80056k906k631k737k523k197k360k815k776k138j599j389q60K05R44P04
62632B54978J55K44P60R22P89R39J055K47j264k022j355l67m25j457k443k885
62616B47871l059l124k761j694k25Q60R41J86m71k89M81J032J065Q87O45J94k98
62599B42241l52k7N3l19n69k71L31R94J837K583K371J039j53P8J442K604K886
62582B56768K606K171J649J016J98r75k200k595j812q65r49j797k201j828j480
62567B47706j576j604j228q81r15j038r86r81j074q16m6O19O24L13L75Q19J087
62550B40398R14N39J94j34m48n90m05J7L74M08K57M23J177K084K419K058J575
$$ plain form
62660 402326 386474 372481 359921 348090 336834 326691 318143 310901 304067 297014 290062 284206 280056
62647 280056 277150 274519 271782 269259 267062 264702 261887 259111 256973 255374 253985 253125 253330 254274 254978
62632 254978 255133 255377 256137 257059 257848 258787 259842 260089 258825 256803 255448 255081 254656 253199 250756 247871
62616 247871 244812 241688 238927 237233 237008 237868 238809 238995 238524 238235 238716 239748 240813 241700 242345 242539 242241
62599 242241 241889 241862 241915 241596 241027 240756 241087 242081 243918 246501 248872 249911 249758 249836 251278 253882 256768
62582 256768 259374 261545 263194 264210 264408 263433 261233 258638 256826 255961 255012 253215 251014 249186 247706
62567 247706 246130 244526 243298 242417 241502 240464 239478 238497 237423 236607 236561 237180 237804 238117 238492 239311 240398
62550 240398 241312 241851 242045 241911 241463 240873 240468 240485 240859 241267 241524 241947 243124 245208 247627 249685 251260
62533B51260J492J799K250K713L056L076K743K289J972J963K529L860N545O675
62519B93222O801O512O761P798R098J0249J1476J3202J5338J7234J8419J9091
62507D35201J9740K0317K0261J9372J8169J7105J5827J3768J1043Q182N309K296
62495F06590m31k169l071m143n787p118p103n783l922j921L39K965N812Q726J1633
62480E94617J4540J7540K0677K3634K5822K6935K7141K6607K5115K2385J8561
62469H43574J4201R910N978K144k263p682j3792j9854k5320k9776l2607l3558
62457G10955l3500l3740l4396l4303l2786l0555k8491k6459k3962k1101j8188
62446C93474j5106j1932r519q479q046o954n217l961l691l695l335k914k992l532
$$ plain form
62533 251260 252752 254551 256801 259514 262570 265646 268389 270678 272650 274613 277142 281002 286547 293222
62519 293222 300023 306535 313296 321094 330192 340441 351917 365119 380457 397691 416110 435201
62507 435201 454941 475258 495519 514891 533060 550165 565992 579760 590803 598985 604294 606590
62495 606590 606159 603990 600919 596776 590989 583871 576768 570985 567063 565142 565481 568446 574258 582984 594617
62480 594617 609157 626697 647374 671008 696830 723765 750906 777513 802628 825013 843574
62469 843574 857775 867685 873663 875807 873544 865862 852070 832216 806896 777120 744513 710955
62457 710955 677455 643715 609319 575016 542230 511675 483184 456725 432763 411662 393474
62446 393474 378368 366436 356917 348438 340392 333438 328221 324260 320569 316874 313539 310625 307633 304101
62432C04101m076m286m073l510k808k111j355n76k08n49j089r70j49N10M40L3
62416B79324r6pq5l36m06k21j09l76q74j149q69j63N41R74J233J458J468R92J09
62397B81408p71j341j543j349o55N49K074L519M349M210L405K806L030L805M498
62382C07994M955N480O199O938P562P990Q011P671P639Q590J0274J1810J2850
62369D13963J3786J4774J5430J5711J6271J7598J9486K1801K4983K9219L3763
62358F36785L7802M1565M5778N0443N4969N9246O3619O7772P0499P0780O8391
62347A267649O3372N5618M5471L4052K2482J1144J47r987j8690k6166l3145l9780
62335A372167m5402m9443n2079n3670n3996n2578m9633m6253m3480m1304l8771
$$ plain form
62432 304101 300025 295739 291666 288156 285348 283237 281882 281306 281098 280549 279460 278490 278341 278851 279291 279324
62416 279324 279228 279221 279136 278800 278394 278173 278064 277688 276814 275665 274796 274633 275174 276148 277381 278839 280307 281299 281408
62397 281408 280637 279296 277753 276404 275749 276298 278372 281891 286240 290450 293855 296661 299691 303496 307994
62382 307994 312949 318429 324628 331566 339128 347118 355129 362800 370439 379029 389303 401113 413963
62369 413963 427749 442523 457953 473664 489935 507533 527019 548820 573803 603022 636785
62358 636785 674587 716152 761930 812373 867342 926588 990207 1057979 1128478 1199258 1267649
62347 1267649 1331021 1386639 1432110 1466162 1488644 1499788 1499935 1489948 1471258 1445092 1411947 1372167
62335 1372167 1326765 1277322 1225243 1171573 1117577 1064999 1015366 969113 925633 884329 845558
62324H45558l5049l0464k6402k4111k3543k3520k3041k2125k1242k0311j8842
62313E76908j6972j5653j5518j5926j5673j4431j3021j2253j1918j1171r660p910
62301D16802o690o210o086n895n480m735l418j546K38J040O83pq5N72J411K053
62285C82647K593L159L576L647L530L599M035M686N283N718O075O441O717O744
62271D48450O590O678P442Q895J0685J2523J4463J6641J8962K1220K3505K6279
62259F22333K9891L4109L8326M2263M6427N1588N7772O3874O8440P0830P1420
62248A197273P0579O7636O1285N1081L8262K4788J1855l42j1589k1207k8934l5629
62236A425058m2435m9426n5538n9749o1863o2256o1328n9328n6359n2431m7752
$$ plain form
62324 845558 810509 780045 753643 729532 705989 682469 659428 637303 616061 595750 576908
62313 576908 559936 544283 528765 512839 497166 482735 469714 457461 445543 434372 424712 416802
62301 416802 410112 403902 397816 391921 386441 381706 378288 376742 376980 378020 378703 378696 378611 379183 380594 382647
62285 382647 385240 388399 391975 395622 399152 402751 406786 411472 416755 422473 428548 434989 441706 448450
62271 448450 455040 461718 469160 478055 488740 501263 515726 532367 551329 572549 596054 622333
62259 622333 652224 686333 724659 766922 813349 864937 922709 986583 1055023 1125853 1197273
62248 1197273 1267852 1335488 1396773 1447854 1486116 1510904 1522759 1522417 1510828 1489621 1460687 1425058
62236 1425058 1382623 1333197 1277659 1217910 1156047 1093791 1032463 973135 916776 864345 816593
62225H16593m2920l8535l4688l1103k7685k4482k1357j8245j5669j4220j3419
62214E34270j2045r815p984p618q124q162p477o853o639o307n497m575l956l484
62200D35734k809j944j178o87l79L7Q29J903K713K889K878L605N397P558R142
62185D65688R830R983J0067J0248J0357J0163R720R503R997J1110J2107J2270
62173E91043J1483J0245R201Q863R661J1941J5738K0529K5550L0470L5539M0833
62161H21096M5701M9346N1756N3354N3751N1620M6068L7646K7760J7657Q265K41
62149A264261o447j2548j8610k4352k9386l3938l8259m1747m3443m3093m1140
62138I31298l8052l4418l1224k9034k7108k4345k0937j8108j6355j5001j3625
$$ plain form
62225 816593 773673 735138 700450 669347 641662 617180 595823 577578 561909 547689 534270
62214 534270 522225 512410 504426 496808 488684 480522 473045 466192 459553 453246 447749 443174 439218 435734
62200 435734 432925 430981 429803 429116 428737 428774 429603 431506 434219 437108 439986 443591 448988 456546 465688
62185 465688 475518 485501 495568 505816 516173 526336 536056 545559 555556 566666 578773 591043
62173 591043 602526 612771 621972 630835 640496 652437 668175 688704 714254 744724 780263 821096
62161 821096 866797 916143 967899 1021253 1075004 1126624 1172692 1210338 1238098 1255755 1264020 1264261
62149 1264261 1257814 1245266 1226656 1202304 1172918 1138980 1100721 1058974 1015531 972438 931298
62138 931298 893246 858828 827604 798570 771462 747117 726180 708072 691717 676716 663091
62127F63091j2678j2381j2092j1331j0554j0259j0034r087p238m884k437k46J518
62114E61388L381O339J0541J4611J6827J6603J4350J0509N546O47k613l469k389
62101F52271l09J996L745L937J809k422p408j1342j3073j2769j1451r915q245
62088E86824o270m061j767O18L081N418P511R502J1462J3197J4647J6149J7978
62075F74289J9891K1525K3025K4803K6802K8496K9534L0023L0124K9878K9547
62064I67937K9872L1581L4663L8227M1135M2776M3152M2296L9873L5544K9468
62053A376524K2148J3911N003l838j1519j7469k2047k5976k9752l3722l8040m2203
62041A193020m5113m6123m5734m4848m3674m1760l8873l5304l1476k7737k4451
$$ plain form
62127 663091 650413 638032 625940 614609 604055 593796 583762 574675 567437 562553 560116 559870 561388
62114 561388 564769 571108 581649 596260 613087 629690 644040 654549 660095 660742 658129 654660 652271
62101 652271 651962 653958 657703 661640 663449 661027 653619 642277 629204 616435 604984 595069 586824
62088 586824 580554 576493 574726 575344 578425 583843 591354 600856 612318 625515 640162 656311 674289
62075 674289 694180 715705 738730 763533 790335 818831 848365 878388 908512 938390 967937
62064 967937 997809 1029390 1064053 1102280 1143415 1186191 1229343 1271639 1311512 1347056 1376524
62053 1376524 1398672 1412583 1417586 1413748 1402229 1384760 1362713 1336737 1306985 1273263 1235223 1193020
62041 1193020 1147907 1101784 1056050 1011202 967528 925768 886895 851591 820115 792378 767927
62030G67927k1853j9769j7804j5778j3748j1734r743q030o919o392o080n723n427
62017F18927n400n665o064o476o918p415p753p499o451n021l840k989j998o47
62003E44791O79J584K227K980L910M844N623O052N962N574N361N304M724L303
61989F02918J710O78l9j164k743m242n538o903q167q746q584q241p934p323o464
61974E29218o096o498o821o177m958m256m316m314l695k968k867l226l225k570
61960D67231j858j708j908j797j213o33m74o38q03o79JJ302K727L508L616L932
61944D70606N077O598P752Q664J0060J2161J4532J6817J8945K0707K1857K2589
61932F36365K3296K3805K3532K2467K1280K0296J9050J7157J4950J2854J0625
$$ plain form
62030 767927 746074 726305 708501 692723 678975 667241 657498 649468 642549 636157 630077 624354 618927
62017 618927 613527 607862 601798 595322 588404 580989 573236 565737 559286 554265 550425 547436 545438 544791
62003 544791 545470 547054 549281 552261 556171 561015 566638 572690 578652 584226 589587 594891 599615 602918
61989 602918 604628 605306 605267 604103 601360 597118 591580 584677 576510 567764 559180 550939 543005 535682 529218
61974 529218 523122 516624 509803 503626 498668 494412 490096 485782 482087 479119 476252 473026 469801 467231
61960 467231 465373 463665 461757 459960 458747 458114 457640 457002 456199 455520 455521 456823 459550 463058 466674 470606
61944 470606 475683 482281 490033 498697 508757 520918 535450 552267 571212 591919 613776 636365
61932 636365 659661 683466 706998 729465 750745 771041 790091 807248 822198 835052 845677
61921H45677P779M380Q89k514n928r167j1679j3084j3437j2921j1485q997n616
61908G63897j857J743M993Q091J1266J4445J7270J9285K0049J9248J6881J3260
61896I08571Q773L803j040m996p859j0285j2985j5732j7634j8290j8160j7847
61884G96319j7556j7303j7103j6778j6036j5002j4285j4274j4684j4961j4883
61873F23454j4527j3979j3331j2709j2154j1548j0812r898q635o812m539k199
61861E02311QK174M232N887P133Q490J0457J2994J5779J8582K1236K3646K6075
61848F59004K9073L2725L6329L9118M1005M2237M2620M1620L9043L5157L0300
61837A068231K4725J8670J2150M881l019j0378j5637j8303j9155j8978j7673j4902
$$ plain form
61921 845677 853456 857836 858725 856211 850283 841116 829437 816353 802916 789995 778510 769513 763897
61908 763897 762040 763783 768776 776867 788133 802578 819848 839133 859182 878430 895311 908571
61896 908571 917344 921147 920107 915111 907252 896967 883982 868250 850616 832326 814166 796319
61884 796319 778763 761460 744357 727579 711543 696541 682256 667982 653298 638337 623454
61873 623454 608927 594948 581617 568908 556754 545206 534394 524496 515861 509049 504510 502311
61861 502311 502319 504493 508725 514612 521745 530235 540692 553686 569465 588047 609283 632929 659004
61848 659004 688077 720802 757131 796249 837254 879491 922111 963731 1002774 1037931 1068231
61837 1068231 1092956 1111626 1123776 1128657 1125638 1115260 1099623 1081320 1062165 1043187 1025514 1010612
61825A010612j1028o833k534K311P816J3090J6748J7898J6617J3581R412M258
61813A091948k041r415j7108k3985k9411l3774l7782m1304m3271m2926m0820l8200
61801G31911l5672l2998l0052k7274k5021k3025k0923j8891j7294j5977j4423
61790D70361j2502j0589q992p682o639n991n633n096m096k951k182j772j257m43
61776C94536K36L31K1j09J32L24J27j06L42J698L374M506M692M219L703L572L794
61759D25392M102M411M832N272N336M925M640N163O293P039O653N241L312J295
61745D93906m11j396j642j638j855k326k934l653m223m017k862j617j357k033
61731D61942k604k475k140k211k430k103j143j34N46J174K195L503M471M580L917
$$ plain form
61825 1010612 999584 992751 990217 992528 1000344 1013434 1030182 1048080 1064697 1078278 1087690 1091948
61813 1091948 1089907 1080492 1063384 1039399 1009988 976214 938432 897128 853857 810931 770111 731911
61801 731911 696239 663241 633189 605915 580894 557869 536946 518055 500761 484784 470361
61790 470361 457859 447270 438278 430596 423957 417966 412333 407237 403141 400190 398008 396236 394979 394536
61776 394536 394772 395103 395124 395015 395147 395471 395598 395492 395834 397532 400906 405412 410104 414323 418026 421598 425392
61759 425392 429494 433905 438737 444009 449345 454270 458910 464073 470366 477405 484058 489299 492611 493906
61745 493906 493495 492099 490457 488819 486964 484638 481704 478051 473828 469811 466949 465332 463975 461942
61731 461942 459338 456863 454723 452512 450082 447979 446836 446702 447248 448422 450617 454120 458591 463171 467088
61716D67088K997K199J532R01L48j11p31j742k930l761m012m010m193m631n111
61701D43833n406n337m807m014l442l343l361k994k356k059k369k796k742k174
61687C96633j400n47L87J152J448J416J496J679J461P09Q0K54J039J746K139K463
61671D12155K700K430J628R55R72J415J640J507J390J478J540J433J396J610J787
61656D36036J490Q48O01J299K607L569L528K695J799J442J775K601L520M099M141
61641D72050L909L911M427N223N714N389M188K603J290M72k57j329k576l411l603
61626D98000l521l589l812l954l966m004m155m249l981l206k167j421j325j639
61612D53011j823j761j942k773l973m849n052m901n011n671o584p098o814n990
$$ plain form
61716 467088 470085 472284 473816 474717 475065 474954 474223 472481 469551 465790 461778 457768 453575 448944 443833
61701 443833 438427 433090 428283 424269 420827 417484 414123 411129 408773 406714 404345 401549 398807 396633
61687 396633 395233 394686 395073 396225 397673 399089 400585 402264 403725 404434 404514 404768 405807 407553 409692 412155
61671 412155 414855 417285 418913 419868 420840 422255 423895 425402 426792 428270 429810 431243 432639 434249 436036
61656 436036 437526 438374 438975 440274 442881 446450 449978 452673 454472 455914 457689 460290 463810 467909 472050
61641 472050 475959 479870 484297 489520 495234 500623 504811 507414 508704 509176 508919 507590 505014 501603 498000
61626 498000 494479 490890 487078 483124 479158 475154 470999 466750 462769 459563 457396 455975 454650 453011
61612 453011 451188 449427 447485 444712 440739 435890 430838 425937 420926 415255 408671 401573 394759 388769
61598C88769n309n183n368n294m660l689k856k460k420k465k534k817l307l499
61584C36908k892j735r05r36j497j955k143k299k494k470k011j238m85l1R4L2
61568C13943o2j32j69j55j82m39r33j300j185o85j68J94L84J90n81j505j770j096
61550C04349n9P25J127J137O01k81q14p08n77r74j390r26L53J486J866J663J137
61533C08715L55l02j47R21K036K237J485N13k3j31m01j379k831l729l304k075
61517C01940j306j493j925j834j362j088j211j508j707j458n28O35R39l3j197
61502B86864j183j75L16m67j560j689q75q0J94K64M35N75N49N20N81M84K2n62
61484B84213q56q40q08q80r33r33j003j046p36n7N31P31Q92J394J927J861J217
$$ plain form
61598 388769 383460 378277 372909 367615 362955 359266 356410 353950 351530 349065 346531 343714 340407 336908
61584 336908 334016 332281 331376 330440 328943 326988 324845 322546 320052 317582 315571 314333 313848 313817 313911 313943
61568 313943 313881 313749 313580 313425 313243 312804 311871 310571 309386 308701 308533 308727 309111 309301 308720 307215 305445 304349
61550 304349 304290 305015 306142 307279 307880 307599 306785 306077 305500 304526 303136 302210 302563 304049 305915 307578 308715
61533 308715 309070 308768 308621 309542 311578 313815 315300 315813 315790 315659 315258 313879 311048 307319 304015 301940
61517 301940 300634 299141 297216 295382 294020 292932 291721 290213 288506 287048 286520 287155 288094 288061 286864
61502 286864 285681 285506 285822 285355 283795 282106 281231 281151 281345 281609 282044 282619 283168 283688 284269 284753 284775 284213
61484 284213 283357 282517 281709 280829 279896 278963 277960 276914 276178 276121 276652 277383 278275 279669 281596 283457 284674
61467B84674O20L43M4m87r50j170j376j539j129j18M80j28j218j443p02k2J76
61450B76055M66R39P24m09j173m10J202K160K168K073K178J984J459J349J888
61435B92653K291J958J354J212J567K077K713L465L853L342K117R92O56J203K155
61420C23608K723K455J796J684K320K834K533J851J633J919K108J864J271L88
61406C50987o69j455j649j613j846k156k115j984k399l208l542l092k441k067
61392C20751j819j532j319j066m63K22K43m28q41m77m4k67o82l71O76J754K526
61375C16863L085L250K722J824J314J438J706J699J570J632J857J935J632J048
61361C43575O63R72J902K743K900K521K253K519L307M346N238N672N846O360P462
$$ plain form
61467 284674 285294 285637 285681 285194 284244 283074 281698 280159 279030 278912 279392 279264 278046 276603 275901 275879 276055
61450 276055 276521 277460 278184 277775 276602 276192 277394 279554 281722 283795 285973 287957 289416 290765 292653
61435 292653 294944 296902 298256 299468 301035 303112 305825 309290 313143 316485 318602 319594 320250 321453 323608
61420 323608 326331 328786 330582 332266 334586 337420 339953 341804 343437 345356 347464 349328 350599 350987
61406 350987 350318 348863 347214 345601 343755 341599 339484 337500 335101 331893 328351 325259 322818 320751
61392 320751 318932 317400 316081 315015 314552 314774 315017 314589 313748 313271 313227 312960 312278 311907 312583 314337 316863
61375 316863 319948 323198 325920 327744 329058 330496 332202 333901 335471 337103 338960 340895 342527 343575
61361 343575 344238 345210 347112 349855 352755 355276 357529 360048 363355 367701 372939 378611 384457 390817 398279
61346C98279Q695R607J0359J1204J1801J1600J0653R408P954O109M093K490J517
61333E03769R34N81M92M50J8r28k122l323m372m975m991m870n224n938o319o072
61317D57110n523m819l719k356j403j111q90k85L70P19J161K133L130L340L006
61302D50863L292M740O589P778Q010P605O788N549L881J825o08l209n421o672
61288D91010o956o760o405n717m506l147k266j948j619q91o3M75J015K113L579
61273D57914M509M558M597N610P285Q311Q091P555P914R091R902R671Q923Q398
61259E62329Q043P589P529Q664J0769J2645J3641J4355J5358J6029J5274J2893
61247G05118R561N914K373m88k361l776n464p211q237q679r619j1335j2574j2188
$$ plain form
61346 398279 406974 416581 426940 438144 449945 461545 472198 481606 489560 495669 499762 502252 503769
61333 503769 504703 505284 505776 506226 506244 505316 503194 499871 495499 490524 485533 480663 475439 469501 463182 457110
61317 457110 451587 446768 443049 440693 439290 438179 437289 437004 437374 438093 439254 441387 444517 447857 450863
61302 450863 454155 458895 465484 473262 481272 488877 495665 501214 505095 506920 506312 503103 497682 491010
61288 491010 484054 477294 470889 465172 460666 457519 455253 453305 451686 450795 450732 451207 452222 454335 457914
61273 457914 462423 466981 471578 477188 484473 492784 500875 508430 516344 525435 535337 545008 553931 562329
61259 562329 570372 577961 585490 594154 604923 617568 631209 645564 660922 676951 692225 705118
61247 705118 714679 720593 722966 722478 720117 716341 710877 703666 695429 686750 677131 665796 653222 641034
61233F41034j0642r221q365p635o815o144n648n118m639m412m053k936j307k75
61219E63824m47j224j811k252k985l899m510m666m521m009l014j871j047m15M83
61204E27636J444J647Q30l48j327k234k978k640n87K364M782O301P587Q964J0176
61189E61617J1473J3752J7152K0318K1662K0872J8731J6034J3150J0349Q005O563
61177G39678O359P221Q186Q163P105N939N105L862J517j255l092l528l311l308
61163G78641l744m406n047n606o317p438q744r566r652r507r526r268q261p004
61149F74555o376o215n372l204k99K328M178N173N211M104J789j502n187q467
61135F60716j0849j2374j3242j3390j2696j1375r762p945n958m090k618j389j06
$$ plain form
61233 641034 630392 621171 612806 605171 598356 592212 586564 581446 576807 572395 568342 565406 564099 563824
61219 563824 563377 562153 560342 558090 555105 551206 546696 542030 537509 533500 530486 528615 527568 527153 527636
61204 527636 529080 530727 531557 531209 529882 527648 524670 522030 521443 523807 528589 534890 542477 551441 561617
61189 561617 573090 586842 603994 624312 645974 666846 685577 701611 714761 725110 733115 739678
61177 739678 746037 753258 761444 769607 776712 782651 787756 791618 793135 791880 788788 785260 781949 778641
61163 778641 774897 770491 765444 759838 753521 746083 737339 727773 718121 708614 699088 689820 681559 674555
61149 674555 668179 661964 656592 653388 653089 655417 659595 664768 669979 674083 675872 674370 669183 660716
61135 660716 649867 637493 624251 610861 598165 586790 577028 569083 563125 559035 556417 555028 554922
61122E54922J180K240L051L745M387N197O525Q199R353R509R423J0165J1771J3492
61108F53159J4958J6238J7050J6996J6477J6459J7196J7919J7912J7178J6094
61097H37636J4996J4069J2989J0877P295L138k64k767n206p761r666j0595j1211
61084H53530j2011j2672j2884j2947j3091j2990j2416j1738j1359j1157j0771
61073G19494j0003q835p511o627o504o511n762m404l377k854j990l75J253K114
61059F58108K304K292K360K894M323O330P857Q376Q465Q848R504J0091J0539J0926
61045G53217J1419J2519J4683J7561K0269K2393K3995K4942K5330K6335K9105
61034I81768L2789L5301L6283L7596M0336M3312M5311M7174N0342N4781N9651
$$ plain form
61122 554922 556102 558342 561393 565138 569525 574722 581247 589446 598799 608308 617731 627896 639667 653159
61108 653159 668117 684355 701405 718401 734878 751337 768533 786452 804364 821542 837636
61097 837636 852632 866701 879690 890567 897862 901000 900736 897969 892763 885002 875336 864741 853530
61084 853530 841519 828847 815963 803016 789925 776935 764519 752781 741422 730265 719494
61073 719494 709491 700656 693145 686518 680014 673503 667741 663337 659960 657106 655116 654741 655994 658108
61059 658108 660412 662704 665064 667958 672281 678611 686468 694844 703309 712157 721661 731752 742291 753217
61045 753217 764636 777155 791838 809399 829668 852061 876056 900998 926328 952663 981768
61034 981768 1014557 1049858 1086141 1123737 1164073 1207385 1252696 1299870 1350212 1404993 1464644
61023A464644O4830P0389P5470P8905Q0459Q0758Q0815Q2238Q6720R4619J05099
61012B364946J18102J34566J54044J74143J93544K13906K37829K67119L04386
61003D162585L53778M18232M98340N95852P15397Q60550J032461J236794J488329
60994A1362318J802892K186773K634829L120222L556769L770227L553790K814896
60986C4802716J695927N34098l27516p14205o44460k44349L12476P95404R33001
60977C7143092N31902l78469j529887k568265l247111l509989l439411l162276
60969A9839586k790532k403102k043818j726978j451427j213889j011935q41532
60961F356373o98032n79014m83197m07686l48565l02910k68089k40325k16130
$$ plain form
61023 1464644 1529474 1599863 1675333 1754238 1834697 1915455 1996270 2078508 2165228 2259847 2364946
61012 2364946 2483048 2617614 2771658 2945801 3139345 3353251 3591080 3858199 4162585
61003 4162585 4516363 4934595 5432935 6028787 6744184 7604734 8637195 9873989 11362318
60994 11362318 13165210 15351983 17986812 21107034 24663803 28434030 31987820 34802716
60986 34802716 36498643 37032741 36705225 35991020 35346560 35102211 35414687 36210091 37143092
60977 37143092 37674994 37296525 35766638 33198373 29951262 26441273 23001862 19839586
60969 19839586 17049054 14645952 12602134 10875156 9423729 8209840 7197905 6356373
60961 6356373 5658341 5079327 4596130 4188444 3839879 3536969 3268880 3028555 2812425
60952B812425j94295j74794j56748j39141j22439j07600r4319q1936p1358o4252
60942A605543o0837n9834o0082o0755o0618n8679n5398n1996m8883m5808m3034
60931I99619m1038l9467l7589l5524l3792l1995k9272k5952k3502k2610k2348
60920F56530k1367j9294j6780j4771j3671j2869j1340r138p645p750q431q017
60908E05457o211l990k007k81R21J245J152J591K588L217L037K663K735L110L382
60893E18609L446L224K355O17j570l343m140m307m889o524q610r983j0417j0721
60879D63747j1248j1313j0542r736r598r496q469o777n335m323l454l063l591
60866C66802m338m091k805j544q30k57M00R40J578K826M386N345N567N747O008
$$ plain form
60952 2812425 2618130 2443336 2286588 2147447 2025008 1917408 1823089 1741153 1669795 1605543
60942 1605543 1544706 1484872 1424790 1364035 1303417 1244738 1189340 1137344 1088461 1042653 999619
60931 999619 958581 919114 881525 846001 812209 780214 750942 724990 701488 678878 656530
60920 656530 635163 615869 599089 584318 570647 557778 546438 537300 529655 521905 513474 505457
60908 505457 499246 495256 493249 492968 493889 495134 496286 497877 500465 503682 506719 509382 512117 515227 518609
60893 518609 522055 525279 527634 528251 526681 523338 519198 514891 510002 503478 494868 484885 474468 463747
60879 463747 452499 441186 430644 420908 411310 401814 393345 386568 381233 376910 373456 370393 366802
60866 366802 362464 358373 355568 354024 353194 352937 353337 354277 355855 358681 363067 368412 373979 379726 385734
60851C85734N718M998M991O051O939O572N539N038N150N125M674M011L102J776
60837D55418K98r17j946l027l866m024l822m026m592m571l575k690l257n062o412
60822D03929o148n002m633n565o698o799n991n420n849o871p398o705n117l758
60808C21975l415l673l565k969k639k795k593j580o29o03r04m91K88K73m37n29
60792B95714L95J214J203J136J858K852L159K915L007L730M597N194N563N854
60778C38391O159O559O987P164O978O663O386N997N468N212N545O114O302O004
60764D25929N611N353N067M603M092L801L879M283M842N367N739N857N587M968
60750D94978M345M141M479N247O390P839R305J0537J1742J3300J5108J6728J8091
$$ plain form
60851 385734 391452 396450 401441 407492 414431 421003 426542 431580 436730 441855 446529 450540 453642 455418
60837 455418 455716 454799 452853 449826 445960 441936 438114 434088 429496 424925 421350 418660 415403 410341 403929
60822 403929 397781 392779 388146 382581 375883 369084 363093 357673 351824 344953 337555 330850 325733 321975
60808 321975 318560 314887 311322 308353 305714 302919 300326 298746 298117 297514 296610 296119 296407 296680 296243 295714
60792 295714 296109 297323 298526 299662 301520 304372 307531 310446 313453 317183 321780 326974 332537 338391
60778 338391 344550 351109 358096 365260 372238 378901 385287 391284 396752 401964 407509 413623 419925 425929
60764 425929 431540 436893 441960 446563 450655 454456 458335 462618 467460 472827 478566 484423 490010 494978
60750 494978 499323 503464 507943 513190 519580 527419 536724 547261 559003 572303 587411 604139 622230
60737F22230J9516K0923K1790K2107K2617K3611K4087K2657J8969J3766P888J775
60725H41936m313j0125j5452k0020k3448k5631k6910k7576k7465k6354k4549k2630
60713E87463k0768j8748j6579j4601j2977j1407r594p747o506o294o806p191o971
60700D41274o644p022q025q725q686q593r031r401q812p592o915p058p027o109
60686C31634m903m382m658n130n351n162m362k892j170J99J054J614J957J917
60672C00365J507J007N31r7r00j428j143p3J096J587J094j10j469k421k566j850
60656B95130p38kOj85K39J317K212K392K395L001M052M709M679M482M504M547
60640C32740M437M356M275L719K639J857K023K576K495J714J055Q78O41j08j062
$$ plain form
60737 622230 641746 662669 684459 706566 729183 752794 776881 799538 818507 832273 840161 841936
60725 841936 837623 827498 812046 792026 768578 742947 716037 688461 660996 634642 610093 587463
60713 587463 566695 547947 531368 516767 503790 492383 482789 475042 468536 462242 455436 448245 441274
60700 441274 434630 427608 419583 410858 402172 393579 384548 375147 366335 358743 351828 344770 337743 331634
60686 331634 326731 322349 317691 312561 307210 302048 297686 294794 293624 293823 294877 296491 298448 300365
60672 300365 301872 302879 303410 303313 302413 300985 299842 299769 300865 302452 303546 303436 301967 299546 296980 295130
60656 295130 294392 294390 294396 294211 294450 295767 297979 300371 302766 305767 309819 314528 319207 323689 328193 332740
60640 332740 337177 341533 345808 349527 352166 354023 356046 358622 361117 362831 363886 364764 365405 365297 364235
60625C64235j606j522j036o37q75j929l306m307m720m661m082l018k127k079k447
60610C25883k162j113l14k94l79jL69J52l52o11o64n85o1P38P54m60j645j436
60592C17819l69k0o41j085q74p41j058j139n10K97P11R70J452K015K436K845L323
60575C25431L648L907M698O266P921Q855R191R755J1079J2937J4773J6293J7689
60562D52443J9313K1035K2100K1850K0297J7626J3602Q110K068l135p056j0167
60550E78086j2461j3056j1494q489n000j399K112N178Q049J1851J7270K3398K8599
60537F22644L2142L4297L5176L4257L0998K5367J7732Q723p24r403j6128k0120
60525G94961k1338k0512j8597j6184j3574j1212r541q461p527o703o343o377o212
$$ plain form
60625 364235 362629 361107 360071 359434 358559 356630 353324 349017 344297 339636 335554 332536 330409 328330 325883
60610 325883 323721 322608 322294 322000 321621 321620 321989 322141 321789 321178 320514 319929 319868 320606 321360 320900 319255 317819
60592 317819 317450 317430 316789 315704 314830 314089 313031 311892 311382 311679 312390 313360 314812 316827 319263 322108 325431
60575 325431 329079 332986 337684 343950 351871 360726 369917 379672 390751 403688 418461 434754 452443
60562 452443 471756 492791 514891 536741 557038 574664 588266 596376 598444 595309 588253 578086
60550 578086 565625 552569 541075 532586 527586 526187 528299 533477 541526 553377 570647 594045 622644
60537 622644 654786 689083 724259 758516 789514 814881 832613 841336 840612 831209 815081 794961
60525 794961 773623 753111 734514 718330 704756 693544 684003 675542 668015 661312 654969 648592 642380
60512F42380n534m514l029o19K453M996O373P483R586J2805J6570K0885K6248
60499G36083L2624L9512M6899N5310O4795P4476Q3200R0355R5966J00245J02928
60488A522393J02749R7756Q6508O8899M5830J8576j1182m1128o8748r1855j08632
60477A621166j17761j19255j14880j07138r7822q7796p7710o8202n9560n1791
60467G19251m5019l9355l4504l0024k5920k2528j9893j7676j5710j4104j2791
60456D41727j1356r570p805o690o430o611o652o388n988n394m225k572j430j640
60442C58976k607k899k070r56j59O74J654K033J448Q07R63J356R61j02r60j512
60426C57607k426l867n200n849n691m838l677k875k599k174j139j48L8j50J18
$$ plain form
60512 642380 636846 632332 629303 628684 631137 636133 642506 649989 659575 672380 688950 709835 736083
60499 736083 768707 808219 855118 910428 975223 1049699 1132899 1223254 1319220 1419465 1522393
60488 1522393 1625142 1722898 1809406 1878305 1924135 1942711 1931529 1890401 1821653 1729798 1621166
60477 1621166 1503405 1384150 1269270 1162132 1064310 976514 898804 830602 771042 719251
60467 719251 674232 634877 600373 570349 544429 521901 502008 484332 468622 454518 441727
60456 441727 430371 420801 412996 406306 399876 393265 386613 380225 374237 368843 364618 362046 360616 358976
60442 358976 356369 353470 351400 350444 350285 350959 352613 354646 356094 356901 357864 359220 360181 360079 359119 357607
60426 357607 355181 351314 346114 340265 334574 329736 326059 323184 320585 318411 317272 317124 317162 317012 317130
60411C17130N59K94m97p76l39K6M9L05J007J658K087K620L067K747J718Q61N20
60394C33036J92k45k29L10P32R31J527K385K388J253J82MJ6m07m74N78J949K515
60376C46643K636L298M169L996K604J122M13L96P27J165J331J107J105J882K838
60361C75432K814J691N13O3R6O2k27o98j158j275q76l27j32k59k88nN79J544K817
60342C80366L917M460M655M733M336L146J736R25O59L51j2q8j85q59j722j828
60326D04590j235r26j061o73N77J610J551J031J120J851K513K753K663K417K330
60311D21111K789L596M029M028M573O312Q552J0373J2093J4769J8769K3589K8441
60298E63024L2166L3113L0356K4738J7816J0036J023q639j7191k3375k7158k8709
$$ plain form
60411 317130 317689 317983 317486 316710 316371 316397 316446 316751 317758 319416 321503 324123 327190 329937 331655 332516 333036
60394 333036 333228 332983 332754 333064 333796 334727 336254 338639 341027 342280 342462 342466 342482 342075 341601 342179 344128 346643
60376 346643 349279 352577 356746 360742 363346 364468 364881 365277 366004 367169 368500 369607 370712 372594 375432
60361 375432 378246 379937 380450 380513 380609 380671 380444 379746 378588 377313 376437 376110 375978 375719 375431 375426 376005 377549 380366
60342 380366 384283 388743 393398 398131 402467 405613 407349 408274 408933 409284 409272 409184 408999 408140 406418 404590
60326 404590 403355 402429 401368 400695 401272 402882 404433 405464 406584 408435 410948 413701 416364 418781 421111
60311 421111 423900 427496 431525 435553 440126 446438 454990 465363 477456 492225 510994 534583 563024
60298 563024 595190 628303 658659 683397 701213 711249 712272 703633 686442 663067 635909 607200
60286F07200k7907k5281k2278j9872j7682j5063j2317j0135q523p110n974n344
60274D29714m858m010l064k696k840k710k022j408j430j889k330k656k851k633
60260C92317j878j012n87o45r17j315j868k294k233j824j612j731j664r66P7P77
60244C72625P95L48j50l90k86k8M6j27j38M01J298J976K194K134J888J299N52
60227C84437L05R45K038K941L540L896L601K276N85j66L71J161J289J150J571
60212D09940K413K822K571K238K199K163J900J703J843K074K075J967K071K330
60198D40309K379K089J714J553J662J901K130K262K229J933J362P69N28O45N84
60183D64049j21j150j732j660j522j838k358k506k101j416q27o37r28j312j153
$$ plain form
60286 607200 579293 554012 531734 511862 494180 479117 466800 456665 448142 441032 435058 429714
60274 429714 424856 420846 417782 415086 412246 409536 407514 406106 404676 402787 400457 397801 394950 392317
60260 392317 390439 389427 388840 388195 387278 385963 384095 381801 379568 377744 376132 374401 372737 371771 371848 372625
60244 372625 373420 373768 373618 373228 372942 372914 372960 372833 372695 373096 374394 376370 378564 380698 382586 383885 384437
60227 384437 384742 385687 387725 390666 394206 398102 401703 403979 404564 404398 404769 405930 407219 408369 409940
60212 409940 412353 415175 417746 419984 422183 424346 426246 427949 429792 431866 433941 435908 437979 440309
60198 440309 442688 444777 446491 448044 449706 451607 453737 455999 458228 460161 461523 462292 462820 463465 464049
60183 464049 463928 462778 461046 459386 457864 456026 453668 451162 449061 447645 446818 446181 445253 443941 442788
60168D42788l85K50J50l89p56r73j383j726j430p32n78j181j510p00Q12K055K859
60151D37171L677M503M861M785M962N676O234N932N078M496M234L462J736j84
60137D96623j183j100o72k78N86K375M480N667N319L877K201Q27j82j008j804
60122E15728k412k445j813r41j68Q26K424M133M959M832M801N516O233N964M974
60107E52611M406M701N130M812L500J414j013l151m453n028n487o083o399o049
60093E38911n281m600m118l634l022k247j191P6J093J468J532K006K910L317K438
60078E29658P25n56p32l79n51j604k962l811l819l303k857k832l045l076k914
60063D97942l143m221n739o748o885o682o645o493n779m823m393m528m395l493
$$ plain form
60168 442788 442403 442653 442803 442414 441658 440685 439302 437576 436146 435414 434836 433655 432145 431445 432257 434312 437171
60151 437171 440848 445351 450212 454997 459959 465635 471869 477801 482879 487375 491609 495071 496807 496623
60137 496623 495440 494340 493668 493390 493976 496351 500831 506498 511817 515694 517895 518722 518540 517532 515728
60122 515728 513316 510871 509058 508117 507949 508775 511199 515332 520291 525123 529924 535440 541673 547637 552611
60107 552611 557017 561718 566848 571660 575160 576574 575561 572410 567957 562929 557442 551359 544960 538911
60093 538911 533630 529030 524912 521278 518256 516009 514818 514894 515987 517455 518987 520993 523903 527220 529658
60078 529658 530383 529827 529095 528716 528165 526561 523599 519788 515969 512666 509809 506977 503932 500856 497942
60063 497942 494799 490578 484839 478091 471206 464524 457879 451386 445607 440784 436391 431863 427468 423975
60049D23975k361j768j685j598j481j759k360k458j435K48J528J855J597J474
60035D13772J834K537L260L778L984L789L135K145J169M85K8m76j110j757k408
60020D34165l180l940m266m076l944m384n055n160m633m223m352m409l665k378
60006C76500j481j282j092k12J163K254K608K424K162K123K385K841L172L027
59992C96592K367J650J414J681J962J890J656J702K179K849L445L832L951L860
59978D31030L784L867L941L773L529L501L480K882J681P14O95J315J684J370N92
59963D67838l20j166j666j583j092o66n45n61n37n54q06j390k241l035l292k800
59947D45584j922j180o41m5N08N33p1p05p58l15J06K93M96R63J586K107K441K676
$$ plain form
60049 423975 421614 419846 418161 416563 415082 413323 410963 408505 407070 407318 408846 410701 412298 413772
60035 413772 415606 418143 421403 425181 429165 432954 436089 438234 439403 439888 439916 439440 438330 436573 434165
60020 434165 430985 427045 422779 418703 414759 410375 405320 400160 395527 391304 386952 382543 378878 376500
60006 376500 375019 373737 372645 372433 373596 375850 378458 380882 383044 385167 387552 390393 393565 396592
59992 396592 398959 400609 402023 403704 405666 407556 409212 410914 413093 415942 419387 423219 427170 431030
59978 431030 434814 438681 442622 446395 449924 453425 456905 459787 461468 462182 462877 464192 465876 467246 467838
59963 467838 467518 466352 464686 463103 462011 461345 460800 460239 459702 459148 458342 456952 454711 451676 448384 445584
59947 445584 443662 442482 441841 441796 442304 442837 442766 442061 441303 440988 441094 441387 441883 442846 444432 446539 448980 451656
59929D51656K764K441J628Q12O94J324J988K147K090K330K716K736K367J994J628
59914D81315R71K47J78R14J716J919J617J112M10l35n46PO92Q39O42O69R16J080
59896D94363J292J853K433K376J685Q87Q8j001k070k254j412m21J21O88J730K614
59880E02972K520J844J804K823M153N024N408N574N507N061M222L036J612L22
59866E51882m47q67j587k830l989m494m595m871n245n076m142k959k104j627j304
59851E05745r83n13L77J821L580N238O627P957R650J2003J4814J7197J7967J6343
59837F17823J2381O952J511k295l344j723J394M543O564O618M288p6n420j0586
59823F38630j4645j6860j6999j5802j4526j3605j2418j0711r386r213r445q718
$$ plain form
59929 451656 454420 456861 458489 459301 459995 461319 463307 465454 467544 469874 472590 475326 477693 479687 481315
59914 481315 482286 482533 482711 483625 485341 487260 488877 489989 490399 490064 489518 489525 490217 491056 491698 492367 493283 494363
59896 494363 495655 497508 499941 502317 504002 504889 504977 503976 501906 499652 498240 497819 497940 498628 500358 502972
59880 502972 505492 507336 509140 511963 516116 521140 526548 532122 537629 542690 546912 549948 551560 551882
59866 551882 551435 550568 548981 546151 542162 537668 533073 528202 522957 517881 513739 510780 508676 507049 505745
59851 505745 504762 504249 504626 506447 510027 515265 521892 529849 539499 551502 566316 583513 601480 617823
59837 617823 630204 637156 638667 636372 633028 631305 632699 637242 643806 650424 654712 654636 649216 638630
59823 638630 623985 607125 590126 574324 559798 546193 533775 523064 513678 504465 495020 486302
59811D86302o910n163m226l833l583l515l625l691l734l960m058l385k063j117
59797D33439j189j800k146j979j474q79o65j291k463l281l469l703m286m416l451
59782C96947k138j698k195k754k963l111l303l258k948k633k321j806j196p43
59768C63880l34K46O98O36N15J209K550L215K454J100N16J020J961K715L085L044
59752C88510K757K729L412M580N443N457M842M264M104M137L820K929J791R28
59738D39703M96K10k55r73j780k398k574k284j838j626j731j911j975j953j938
59723D17173j935j966k124k448k776k819k428j725j012m89j05K67N85P44Q30J058
59707D00830J451J817K106K417K652K517K139K220L226M689N705N928N741N613
$$ plain form
59811 486302 479392 474229 470003 466170 462587 459072 455447 451756 448022 444062 440004 436619 434556 433439
59797 433439 432250 430450 428304 426325 424851 423972 423307 422016 419553 416272 412803 409100 404814 400398 396947
59782 396947 394809 393111 390916 388162 385199 382088 378785 375527 372579 369946 367625 365819 364623 363880
59768 363880 363546 363792 364490 365126 365641 366850 369400 372615 375069 376169 376685 377705 379666 382381 385466 388510
59752 388510 391267 393996 397408 401988 407431 412888 417730 421994 426098 430235 434055 436984 438775 439703
59738 439703 440199 440409 440154 439181 437401 435003 432429 430145 428307 426681 424950 423039 421064 419111 417173
59723 417173 415238 413272 411148 408700 405924 403105 400677 398952 397940 397451 397346 397613 398198 398942 399772 400830
59707 400830 402281 404098 406204 408621 411273 413790 415929 418149 421375 426064 431769 437697 443438 449051
59693D49051N721O049O463O691O537O087N495M642L320J682K55m63l46K63O87
59678E02134M13l25q13q46j024j734k398k374k084k459l480m171l941l236k701
59663D70961k415k170j864j414p19R7Q35J624K668L583L670K977K450K685L183
59648D86151L162K648K242K235K390K323J699K94j700l587m697n013n003n021
59634D78123n042m934m696m421m141l773l245k674k323k273k300k227k135k029
59620D31910j626r22n98j264k463l181l209l271l731m089l926l561l330k952k131
59605C91656j176n69l86n70j185j946k048j100J98Q45O89K63r9l74m79l57k68
59588C83094m14n30k84J33L83N42P11M83m89j597j817j087l85m61j199k175l059
$$ plain form
59693 449051 454772 460821 467284 473975 480512 486599 492094 496736 500056 501738 501993 501530 501184 501447 502134
59678 502134 502547 502222 501409 500563 499539 497805 495407 493033 490949 488490 485010 480839 476898 473662 470961
59663 470961 468546 466376 464512 463098 462379 462476 463311 464935 467603 471186 474856 477833 480283 482968 486151
59648 486151 489313 491961 494203 496438 498828 501151 502850 503144 501444 497857 493160 488147 483144 478123
59634 478123 473081 468147 463451 459030 454889 451116 447871 445197 442874 440601 438301 436074 433939 431910
59620 431910 430284 429362 428764 427500 425037 421856 418647 415376 411645 407556 403630 400069 396739 393787 391656
59605 391656 390480 389911 389525 388955 387770 385824 383776 382676 382874 383719 384408 384671 384572 384198 383719 383362 383094
59588 383094 382680 382150 381866 381999 382382 382924 383635 384118 383629 382032 380215 379128 378743 378282 377083 374908 371849
59571C71849l399k807j645q32p19p49m41l9N4j22m67j128j974k280j572l82M29
59554C53776P82J278K139K847K876K266J525J200J561K352K970L116L246L962
59540C85896N149O140O781P725R552J2133J5032J8012K0535K1089J7893J0668
59528E36605J466o543j1125j2014j0435p967n765m242l151j927k47J593K903L253
59514D82404K865K230J463K57j443l043l894m080m311m976n640n703n276n122
59500D45731n715o660p104o649n725n030m727m338l480k485j991k045j968j216
59486C86598n8P82R50P67Q59J575K628L283L151K769L005L850M362M074L735M116
59470D26446M635M044K153Q9j129j447j238p44k73k08n10o46l28J88O85J341K267
$$ plain form
59571 371849 368450 365643 363998 363166 362447 361698 361257 361218 361272 361150 360683 359555 357581 355301 353729 353347 353776
59554 353776 354558 355836 357975 360822 363698 365964 367489 368689 370250 372602 375572 378688 381934 385896
59540 385896 391045 397185 403966 411691 421243 433376 448408 466420 486955 508044 525937 536605
59528 536605 538071 531528 520403 508389 497954 489987 484222 479980 476829 474902 474655 476248 479151 482404
59514 482404 485269 487499 488962 489219 487776 484733 480839 476759 472448 467472 461832 456129 450853 445731
59500 445731 440016 433356 426252 419603 413878 408848 404121 399783 396303 393818 391827 389782 387814 386598
59486 386598 386540 387322 388272 389039 389898 391473 394101 397384 400535 403304 406309 410159 414521 418595 422330 426446
59470 426446 431081 435125 437278 437367 436238 434791 433553 432809 432536 432328 431818 431172 430844 431032 431717 433058 435325
59453D35325L230M180N519P391R146R996R947R655R526R383Q839P669N909L810
59439E39525J611p48l445o214q296r186r128q662q075p549p400p697p847p054
59425D49835n136k734q07K7o7p7J034L198N290O574P666R589J2379J5233J7822
59410E19826K0746K4574K8684L1012K8960K1199R264k917j1678j5874j6471j4637
59398F22688j0937n868j58N422R673J0516O092l211j4308k3393k8182k8517k5743
59385E14074k1808j8249j5443j2969j0695r047q139p325n950m055k099m09P96
59372C98682J327J356J375J522J387Q06L27L80N14J05n49n70J55Q12Q56O88R84
59355D10157J807K768L580M170M487M637M981N804O885P736Q343R270J0865J2654
$$ plain form
59453 435325 438555 442735 448254 455645 464791 474787 484734 494389 503915 513298 522137 529806 535715 539525
59439 539525 541136 540388 536943 530729 522433 513247 504119 495457 487382 479833 472433 464736 456889 449835
59425 449835 444699 441965 441158 441185 441118 441041 442075 445273 450563 457137 464803 474392 486771 502004 519826
59410 519826 540572 565146 593830 624842 653802 675001 684265 681348 669670 653796 637325 622688
59398 622688 611751 605883 605725 611147 620820 631336 637428 634217 619909 596516 568334 539817 514074
59385 514074 492266 474017 458574 445605 434910 425863 417724 410399 404449 400394 398295 397886 398682
59372 398682 400009 401365 402740 404262 405649 406455 406782 407162 407676 407781 407232 406662 406817 407629 408485 409173 410157
59355 410157 411964 414732 418312 422482 426969 431606 436587 442391 449276 457012 465355 474625 485490 498144
59341D98144J3826J4234J4460J4880J5204J5059J4626J4166J3390J1844R711P581
59329F57125N511L125O20j133j865k473l741n140n720n647n905o646o853n884
59315F15374m498l894m243m633m182k839j318m78o02j079r78q6R99J834K762M150
59299E96289N577O431O925P818R225J0564J1723J3456J6374K0220K4239K7300
59287G56141K7253K1540R795m543j6539k3708k6923k7823k6780k3749j9667j5910
59275F29087j2924j0205p344m470j782P44L161N382P189Q363Q951R390J0000J0365
59261F55907R774Q351P030O096M598J817j429l729m772n269n637n805o042o884
59247F54006q110q777q440p658p123o955o986p021o616n353l579k270j844j774
$$ plain form
59341 498144 511970 526204 540664 555544 570748 585807 600433 614599 627989 639833 649544 657125
59329 657125 662636 665761 666381 665248 663383 660910 657169 652029 646309 640662 634757 628111 621258 615374
59315 615374 610876 606982 602739 598106 593924 591085 589767 589289 588687 587608 586630 586544 587543 589377 592139 596289
59299 596289 601866 608297 615222 623040 632265 642829 654552 668008 684382 704602 728841 756141
59287 756141 783394 804934 814729 810186 793647 769939 743016 715193 688413 664664 644997 629087
59275 629087 616163 605958 598614 594144 592362 593106 596267 601649 608838 617201 626152 635542 645542 655907
59261 655907 665681 674032 681062 687158 691756 693573 692144 688415 683643 678374 672737 666932 660890 654006
59247 654006 645896 637119 628679 621021 613898 606943 599957 592936 586320 580967 577388 575118 573274 571500
59233E71500j624j737k424l122l019k142j188o06l81n01j063j961k932l955n224
59218E39621o701p984q649q600q098p535p099o597n775m835m382m651n055m762
59204D48898l606k207j232q51q08q22p75o49l87O5N64P84O12M70R24K029L288
59187D46297M329N199N962O353O120N448M813M499M370M050L283K323J933K661
59173E07640M087N117N141M606M294M430M688M739M506M188M299N340P120Q678
59159E78873R221Q953Q620Q515Q290P674O850O109N379M289K548L63j540k500
59145F51644k672k912l738m720n220n337n697o484p211p367o803n605m066k833
59131E80979k512k920l158k574j356n4J052J930K572L150M127N702P383Q525R238
$$ plain form
59233 571500 569876 568139 565715 562593 559574 557432 556244 555638 555257 554756 553693 551732 548800 544845 539621
59218 539621 532920 524936 516287 507687 499589 492054 484955 478358 472583 467748 463366 458715 453660 448898
59204 448898 445292 443085 441853 441002 440194 439372 438597 437948 437561 437626 438190 438974 439586 440056 440980 443009 446297
59187 446297 450626 455825 461787 468140 474260 479708 484521 489020 493390 497440 500723 503046 504979 507640
59173 507640 511727 516844 521985 526591 530885 535315 540003 544742 549248 553436 557735 563075 570195 578873
59159 578873 588094 597047 605667 614182 622472 630146 636996 643105 648484 652773 655321 655684 654144 651644
59145 651644 648972 646060 642322 637602 632382 627045 621348 614864 607653 600286 593483 587878 583812 580979
59131 580979 578467 575547 572389 569815 568459 568405 569457 571387 573959 577109 581236 586938 594321 602846 612084
59116F12084J0250J1809J3205J3684J3457J3389J3837J4263J4046J3197J2145
59105G55366J1155J0272R574R090Q649Q075P429O746N720M094K260R38J93o72
59091H38889k075l551m443m732m764m669m551m894o069p619q682r147r861j1448
59077G52384j3437j4807j5076j4647j4265j4361j4744j4798j4102j2911j1860
59066E97376j1173j0414r150p584o265n419m859m393l993l557k885k038j397j227
59052E23022j420j827k512l320l538k582j034l02r44j935j998j197n47m25k12
59037D99229M85J160J329J381J941K791L164K893K709L235M241N054N438N765
59023E40815O462P503Q518R228R728J0313J1145J2046J2615J2447J1374R528P262
$$ plain form
59116 612084 622334 634143 647348 661032 674489 687878 701715 715978 730024 743221 755366
59105 755366 766521 776793 786367 795457 804106 812181 819610 826356 832076 836170 838430 839368 839561 838889
59091 838889 836814 833263 828820 824088 819324 814655 810104 805210 799141 791522 782840 773693 763832 752384
59077 752384 738947 724140 709064 694417 680152 665791 651047 636249 622147 609236 597376
59066 597376 586203 575789 566639 559055 552790 547371 542512 538119 534126 530569 527684 525646 524249 523022
59052 523022 521602 519775 517263 513943 510405 507823 506789 506487 505543 503608 501610 500413 499866 499441 499229
59037 499229 499714 500874 502203 503584 505525 508316 511480 514373 517082 520317 524558 529612 535050 540815
59023 540815 547277 554780 563298 572526 582254 592567 603712 615758 628373 640820 652194 661722 668984
59010F68984M906K608M52j429k884l808m119l784k951j904q00L69J448K126K437
58995F61651K855L537L893L470K775K467K063M61k286m788o109o806p686q579
58981F46918q988r135r445r512q622p031n852n581n514m691k946q80Q04J808K375
58966E73708L015L924M788N302N594N914O146O050N748N491N119M188K572N60
58952F38119j563l641n449o786p786q755r736j0440j0550r852q287o233m478l485
58938E41078k834j795l70P05Q34J1j444l010l940l796l075k780l183l571l331
58923E09499k734k357k253k098j903k037k617l141k942j927p46o2J85N23J038
58908D86428J299J321J841L126M232M291M039M993P349R798J1350J2227J2779
$$ plain form
59010 668984 673890 676498 676950 675521 672637 668829 664710 660926 657975 656071 655271 655640 657088 659214 661651
58995 661651 664506 668043 671936 675406 678181 680648 682711 683172 680886 676098 669989 663183 655497 646918
58981 646918 637930 628795 619350 609838 601216 594185 588333 582752 577238 572547 569601 568721 569525 571333 573708
58966 573708 576723 580647 585435 590737 596331 602245 608391 614441 620189 625680 630799 634987 637559 638119
58952 638119 636556 632915 627466 620680 612894 604139 594403 583963 573413 563561 555274 549041 544563 541078
58938 541078 538244 536449 536079 536784 537618 537629 536185 533175 529235 525439 522364 519584 516401 512830 509499
58923 509499 506765 504408 502155 500057 498154 496117 493500 490359 487417 485490 484744 484682 484867 485390 486428
58908 486428 487727 489048 490889 494015 498247 502538 506577 511570 518919 528717 540067 552294 565073
58895E65073J2703J1808J0625R649Q730P746P248P783R161J0907J2921J5077J6688
58882G06119J7084J6362J5069J3463J1654J0016Q768P406N320K738L81j692m118
58869H08570p072r686j0918j0589r436q374p798p377o592n597n316o338q058r350
58855F96069r984j0750j2222j3909j4876j4731j3815j2733j1875j1226j0479r409
58843E50060q141o982o033n225m618m380m519m838n129n206m898m243l649l508
58829D78691l733l976m133m310m387m093l518l054k747k215j345o14m38n68m24
58814D39136J76Q92J276J140O94M28P35J523K399L159L834M253M058L280K402
58799D69385J691R19Q5j93M59J315J320M70j68J10R41J633K007K217K270K120
$$ plain form
58895 565073 577776 589584 600209 609858 618588 626334 633582 641365 650526 661433 674354 689431 706119
58882 706119 723203 739565 754634 768097 779751 789767 798535 805941 811261 813999 814380 812688 808570
58869 808570 801498 791812 780894 770305 760869 752495 744697 737320 730728 725131 719815 713477 705419 696069
58855 696069 686085 675335 663113 649204 634328 619597 605782 593049 581174 569948 559469 550060
58843 550060 541919 534937 528904 523679 519061 514681 510162 505324 500195 494989 490091 485848 482199 478691
58829 478691 474958 470982 466849 462539 458152 454059 450541 447487 444740 442525 441180 440566 440128 439560 439136
58814 439136 439312 440204 441480 442620 443314 443742 444477 446000 448399 451558 455392 459645 463703 466983 469385
58799 469385 471076 471995 472080 471887 472346 473661 474981 475451 475283 475393 476334 477967 479974 482191 484461 486581
58783D86581K013K358L290M545N695O401O604O568O653O976P318P313O576M769
58769E63660J990r65l105m146m567m712m392l576k844k672k753k633k642l338
58755E23305m250m148k674r07L5K77O14J281J907K362K928L703M334M474M234
58740E37475M093M508N542O763P571P795P800P974Q307Q621Q916R245R520R712
58726F43842R913R944R231P570N687M517M182M240M689N881P495Q529Q570Q353
58712G42643Q641R241R497R174Q357P017N216L340J557n42l273o218q867j1461
58698G74322j4424j7278j9115k0000k0889k1980k2258k1053j9147j7641j6465
58687E64072j4841j2758j1010r955r073p834o383n184m454m124l962l605k804
$$ plain form
58783 486581 488594 490952 494242 498787 504482 510883 517487 524055 530708 537684 545002 552315 558891 563660
58769 563660 565650 564685 561580 557434 552867 548155 543763 540187 537343 534671 531918 529285 526643 523305
58755 523305 519055 514907 512233 511326 511361 511638 512252 513533 515440 517802 520730 524433 528767 533241 537475
58740 537475 541568 546076 551618 558381 565952 573747 581547 589521 597828 606449 615365 624610 634130 643842
58726 643842 653755 663699 672930 680500 686187 690704 694886 699126 703815 709696 717191 725720 734290 742643
58712 742643 751284 760525 770022 779196 787553 794570 799786 803126 804683 804141 800868 794650 785783 774322
58698 774322 759898 742620 723505 703505 682616 660636 638378 617325 598178 580537 564072
58687 564072 549231 536473 525463 515508 506435 498601 492218 487034 482580 478456 474494 470889 468085
58674D68085j794j070p26l67K09P35J089J724L055M750O179P282Q451R634J0203
58659E17439R768Q564O841M451J387j659l787m727m820m375l576k837k689l126
58645E16854l546l580l635m223n097n476n058m329l817l456k914k211j643j221
58631D66648o27K21R63J262J247J228J243J148J009R53P56Q5p52q39J96J482J867
58614D78090J428J416K695M646N934N923N080M185L551K985K234J304M64nn4J21
58598E19997K65K11j73r55j899k425k061r73J84R93J576K177K735L188L894N301
58582E32035P218Q784R304Q892Q226P905Q094Q472Q381P363N808M822N171O492
58568F36967P832Q733R508J0665J2419J4657J6927J8588J9373J9795K0561K1637
$$ plain form
58674 468085 466291 465221 464495 464128 464337 465072 466161 467885 470940 475690 481869 489151 497602 507236 517439
58659 517439 527207 535771 542612 547063 548450 546791 543004 538277 533457 529082 525506 522669 519980 516854
58645 516854 513308 509728 506093 501870 496773 491297 486239 481910 478093 474637 471723 469512 467869 466648
58631 466648 466021 466242 467205 468467 469714 470942 472185 473333 474342 475295 476051 476136 475384 474545 474741 476223 478090
58614 478090 479518 480934 483629 488275 494209 500132 505212 509397 512948 515933 518167 519471 519935 519930 519876 519997
58598 519997 520262 520473 520300 519345 517446 515021 512960 511987 512171 513164 514740 516917 519652 522840 526734 532035
58582 532035 539253 548037 557341 566233 574459 582364 590458 598930 607311 614674 620482 625304 630475 636967
58568 636967 644799 653532 663040 673705 686124 700781 717708 736296 755669 775464 796025 817662
58556H17662K2264K1892K0568J8446J5543J2120Q677N302J601k461o166q916j0935
58543I15597j2681j4027j4642j4747j4884j5196j5505j5892j6498j7014j6956
58532G47555j6409j5869j5405j4634j3445j2157j0854r246p330n624m488l686
58520F18408k880k109j557j242j100j080r71n01K11O93P21N55M88O40J211K346
58504F13833L505L682K633J304N54J08o26j324j245n32l5N9L67J073J461J083
58488F25900M93L86O43Q15J049J864L283M794O077P228Q360R447J0566J1827J2976
58473G05708J3403J2729J1140R074O843M531K101m78k995m895n734n791n873o348
58459G33415o718o329n161l631j980k69J239K181K608K997L689M525N093N097
$$ plain form
58556 817662 839926 861818 882386 900832 916375 928495 937172 942474 944075 941614 935448 926532 915597
58543 915597 902916 888889 874247 859500 844616 829420 813915 798023 781525 764511 747555
58532 747555 731146 715277 699872 685238 671793 659636 648782 639536 632206 626582 622094 618408
58520 618408 615528 613419 611862 610620 609520 608440 607469 606968 607179 607872 608593 609148 609636 610276 611487 613833
58504 613833 617338 621020 623653 624957 625511 625619 624993 623669 622424 621892 621857 621916 622283 623356 624817 625900
58488 625900 626393 626779 627422 628237 629286 631150 634433 639227 645304 652532 660892 670339 680905 692732 705708
58473 705708 719111 731840 742980 752054 758897 763428 765529 765051 762056 757161 751427 745636 739763 733415
58459 733415 726697 720368 715207 711576 709596 709327 710566 712747 715355 718352 722041 726566 731659 736756
58445G36756M452L286J855L16j362l112m509n065m722l836k718j512m10M46J204
58430G21069K087K944L400L466L541L853M377N240O575P868Q211P489O742O857
58416G93719P494P730P191O031M304K099J3j311j967k520l044l047k418j791j782
58401H10701k213k385j869r49k88j78j55M79J739K934L628M123M707N006M569
58386H29849L680K913K167R38o48j752j846j167j47R81J926K370K520L125M554
58371H49463O182P041O916O479O485P084P860Q361Q526Q681R199J0266J1751J3177
58357I67471J3932J3841J3459J3410J3514J3040J1833J0548R586Q594P385O583
58345A103196O718P295P534P522P902Q772R763J0840J2175J3439J3995J3780J3311
$$ plain form
58445 736756 741208 744494 746349 746665 745303 742191 737682 732617 727895 724059 721341 719829 719419 719865 721069
58430 721069 723156 726100 729500 732966 736507 740360 744737 749977 756552 764420 772631 780120 786862 793719
58416 793719 801213 808943 816134 822165 826469 828568 828581 827270 825303 822783 819739 816692 814274 812483 810701
58401 810701 808488 806103 804234 803285 802997 802819 802664 803143 804882 807816 811444 815567 820274 825280 829849
58386 829849 833529 836442 838609 839547 838899 837147 835301 834134 833987 834968 836894 839264 841784 844909 849463
58371 849463 855645 862686 869602 876081 882566 889650 897510 905871 914397 923078 932277 942543 954294 967471
58357 967471 981403 995244 1008703 1022113 1035627 1048667 1060500 1071048 1080634 1089228 1096613 1103196
58345 1103196 1109914 1117209 1124743 1132265 1140167 1148939 1158702 1169542 1181717 1195156 1209151 1222931 1236242
58332A236242J2958J2838J3174J4003J4639J4342J3425J2882J2971J2952J2319
58321A382745J1419J0728J0273J0011J0077J0354J0417J0192J0212J0954J2221
58310A499603J3354J3757J3258J2302J1791J2315J3593J4960J6165J7301J8254
58299A656653J8831J9219J9731K0302K0826K1597K2742K3594K3532K3154K3567
58288A893748K4719K5486K5491K5726K7104K9363L1658L3529L4927L5844L6283
58277B223878L6205L5600L4927L5252L7340M0862M5095M9986N5714O1561O6249
58266B722669O9362P1498P3218P4668P6101P7778P9484Q0993Q2761Q5247Q7903
58255C581682Q9864R1321R3026R4849R6114R7072R8651J00939J03392J06437J11294
$$ plain form
58332 1236242 1249200 1262038 1275212 1289215 1303854 1318196 1331621 1344503 1357474 1370426 1382745
58321 1382745 1394164 1404892 1415165 1425176 1435253 1445607 1456024 1466216 1476428 1487382 1499603
58310 1499603 1512957 1526714 1539972 1552274 1564065 1576380 1589973 1604933 1621098 1638399 1656653
58299 1656653 1675484 1694703 1714434 1734736 1755562 1777159 1799901 1823495 1847027 1870181 1893748
58288 1893748 1918467 1943953 1969444 1995170 2022274 2051637 2083295 2116824 2151751 2187595 2223878
58277 2223878 2260083 2295683 2330610 2365862 2403202 2444064 2489159 2539145 2594859 2656420 2722669
58266 2722669 2792031 2863529 2936747 3011415 3087516 3165294 3244778 3325771 3408532 3493779 3581682
58255 3581682 3671546 3762867 3855893 3950742 4046856 4143928 4242579 4343518 4446910 4553347 4664641
58244D664641J18143J25913J34011J42777J52167J61416J70376J79893J90604
58235F039941K02474K15602K30311K46385K63258K80965K99895L19953L41093
58226H439877L64204L90188M18737M49506M83743N23029N66995O14231O64953
58217A2915463P20891P83161Q52280R29858J018261J119019J233501J364573J516012
58208B2453019J691439J895822K136861K422973K761522L161316L634914M196386
58200D4354252M859415N640781O563962P657627Q953875J0489535J2304540J4437742
58192A15261729J6929672J9824035K3138638K6795464L0527668L3770485L5563106
58185C01810797L4613734K9739845K0621692Q348520m814552j6400112k4743354
$$ plain form
58244 4664641 4782784 4908697 5042708 5185485 5337652 5499068 5669444 5849337 6039941
58235 6039941 6242415 6458017 6688328 6934713 7197971 7478936 7778831 8098784 8439877
58226 8439877 8804081 9194269 9613006 10062512 10546255 11069284 11636279 12250510 12915463
58217 12915463 13636354 14419515 15271795 16201653 17219914 18338933 19572434 20937007 22453019
58208 22453019 24144458 26040280 28177141 30600114 33361636 36522952 40157866 44354252
58200 44354252 49213667 54854448 61418410 69076037 78029912 88519447 100823987 115261729
58192 115261729 132191401 152015436 175154074 201949538 232477206 266247691 301810797
58185 301810797 336424531 366164376 386786068 395134588 390320036 373919924 349176570
58178C49176570k9351577l0628802k9402968k6569602k2878712j8873088j5021875
58171A76449946j1895301j0075737r780419j0599348j1703385j2359111j2273329
58164I7763316j1546967j0435081r176534p942116o825366n850228n006346m284051
58156C6696627l676531l167869k738182k375589k072502j816672j596040j407448
58148A7845794j251732j124193j016866r26041q50778p87277p30636o79292o32786
58139I846193n87927n41727m95558m52395m12348l74282l39204l08561k81592
58130F052599k57594k38502k26211k19291k14807k11128k06770j99185j87623
58121D091488j74941j64023j54357j44349j34597j26359j18943j11295j04265
$$ plain form
58178 349176570 319824993 289196191 259793223 233223621 210344909 191471821 176449946
58171 176449946 164554645 154478908 144698489 134099141 122395756 110036645 97763316
58164 97763316 86216349 75781268 66604734 58662618 51837252 45987024 40980678 36696627
58156 36696627 33020096 29852227 27114045 24738456 22665954 20849282 19253242 17845794
58148 17845794 16594062 15469869 14453003 13526962 12676184 11888907 11158271 10478979 9846193
58139 9846193 9258266 8716539 8220981 7768586 7356238 6981956 6642752 6334191 6052599
58130 6052599 5795005 5556503 5330292 5111001 4896194 4685066 4478296 4279111 4091488
58121 4091488 3916547 3752524 3598167 3453818 3319221 3192862 3073919 2962624 2858359
58112B858359r8867r3970q8203q2427p7991p4193o9733o5182o1605n8249n3872
58101B034067m9190m5707m3255m0796l8594l7590l7533l7708l8412l9902m0868
58090A584512l9868l7414l4814l2004k8334k4544k1920k0289j8807j8037j9112
58079A289369k1384k2946k3278k3473k4004k4113k3522k3013k2996k2816k1924
58068A035900k0772k0138k0179k0299j9695j8194j6690j6122j5919j4504j1842
58057H41546j0097j0755j2465j3080j2647j2700j3414j3533j2751j2209j2463
58046G05432j2635j1936j0775r906r403q900q146p076n900n188n402o301p225
58033E96639p810q026p933p846q341r427j0193r925r170q898r068q925q380q018
$$ plain form
58112 2858359 2759492 2665522 2577319 2494892 2416901 2342708 2272975 2207793 2146188 2087939 2034067
58101 2034067 1984877 1939170 1895915 1855119 1816525 1778935 1741402 1703694 1665282 1625380 1584512
58090 1584512 1544644 1507230 1472416 1440412 1412078 1387534 1365614 1345325 1326518 1308481 1289369
58079 1289369 1267985 1245039 1221761 1198288 1174284 1150171 1126649 1103636 1080640 1057824 1035900
58068 1035900 1015128 994990 974811 954512 934817 916623 899933 883811 867892 853388 841546
58057 841546 831449 820694 808229 795149 782502 769802 756388 742855 730104 717895 705432
58046 705432 692797 680861 670086 660180 650777 641877 633731 626655 620755 615567 610165 603864 596639
58033 596639 588829 580803 572870 565024 556683 547256 537063 527138 517968 509070 500002 491077 482697 474679
58019D74679p912p501o659n946n645n395m941m585m594m747m715m461m093l670
58005C99815l277k988k709k278j757j374j154q60k32P39J730K190J819J018O08
57990C91290R35J580K024K172K058J528N26o78j811k712l040k466j474j252k256
57975C86424l467l645k835k021j735j739j750j719j498q94j7P85J296J472J316
57960C69973J043J082J479J614Q74n99k163l417m283m645m411l802l240k967k978
57945C43560l114l090k672k008j453j044n09J18M54N23Q88J825L012M322O061
57930C46873P991Q965Q367P191O809P188P269O671N965N409M508K981J309J3j066
57915D26443k449m234n932o916p024o714o584o741o854o754o605o480o292o228
$$ plain form
58019 474679 466767 459266 452607 446661 441016 435621 430680 426095 421501 416754 412039 407578 403485 399815
58005 399815 396538 393550 390841 388563 386806 385432 384278 383418 383186 383925 385655 387845 389664 390682 391290
57990 391290 392225 393805 395829 398001 400059 401587 402113 401435 399624 396912 393872 391406 389932 388680 386424
57975 386424 382957 379312 376477 374456 372721 370982 369232 367513 366015 365121 365104 365889 367185 368657 369973
57960 369973 371016 372098 373577 375191 376065 375466 373303 369886 365603 360958 356547 352745 349505 346538 343560
57945 343560 340446 337356 334684 332676 331223 330179 329670 329788 330242 330765 331653 333478 336490 340812 346873
57930 346873 354864 363829 372196 379387 386196 393384 400653 407324 413289 418698 423206 426187 427496 427509 426443
57915 426443 423994 419760 413828 406912 399888 393174 386590 379849 372995 366241 359636 353156 346864 340636
57901C40636o647p359p712p608p662p959p576o031m400m042m732n048m261k948
57887B56651j911j359j118r34m96L08J187J801K161K351K209J719J278J066O14
57872B65527m09j454j835j778j931k254k361k585l556m860n181m025k362j356
57858B29580j230j494j569r04P07K632L862M277M802O045P390P942P777P660P864
57843B85341P922P494O896O579O420N793M331K362M61j198k797m311n416o008
57829C13869o320o420o047n185m314l706l038k108j472j677k279k305j541o23
57815B66834j5M38R23J263J278J060P24K24m73j277k095k914l745m625n554o323
57799B45723o606o338n794n168m406l588k991k594j989j135n87n80m81L02J393
$$ plain form
57901 340636 333989 326630 318918 311310 303648 295689 288113 282082 277682 273640 268908 263860 259599 256651
57887 256651 254740 253381 252263 251329 250833 251141 252328 254129 256290 258641 260850 262569 263847 264913 265527
57872 265527 265118 263664 261829 260051 258120 255866 253505 250920 247364 242504 237323 233298 230936 229580
57858 229580 228350 226856 225287 224383 225090 227722 231584 235861 240663 246708 254098 262040 269817 277477 285341
57843 285341 293263 300757 307653 314232 320652 326445 330776 333138 333599 332401 329604 325293 319877 313869
57829 313869 307549 301129 295082 289897 285583 281877 278839 276731 275259 273582 271303 268998 267457 266834
57815 266834 266819 267257 268180 269443 270721 271781 272505 272729 272256 270979 268884 265970 262225 257600 252046 245723
57799 245723 239117 232779 226985 221817 217411 213823 210832 208238 206249 205114 204527 203947 203466 203768 205161
57784B05161K050K218K275K224J887J500J397J381J233J457K564L948M499M187
57770B37981M052M580N126N087M770M696M740M325L062J083q87j931j954k081
57756B72649l395n450o818p006o855p004p054o529n724n147m794m410l914l266
57742A95283k492k012k286k890k719j483k71j48q47j407j504j525j695j826j715
57727A70463j274n01L65Q59P88N27M67N20M65M48P23J146J335J189Q61L51m86
57710A78246j516k241k210j408k78N59P30L56j09l52l40l2P45J880K814L045K781
57693A82670K718L151L532L104J843M67m86j277k347l362l417k279q13J22P73
57678A84399J945L769N586P046Q687J1330J5265K0202K5779L1929L8822M6502
$$ plain form
57784 205161 207211 209429 211704 213928 215815 217315 218712 220093 221326 222783 225347 229295 233794 237981
57770 237981 242033 246613 251739 256826 261596 266292 271032 275357 278419 279502 278615 276684 274730 272649
57756 272649 269254 263804 256986 249980 243125 236121 229067 222538 216814 211667 206873 202463 198549 195283
57742 195283 192791 190779 188493 185603 182884 181401 181130 180982 180135 178728 177224 175699 174004 172178 170463
57727 170463 169189 168688 169053 169912 170700 171227 171694 172214 172679 173127 173850 174996 176331 177520 178381 178732 178246
57710 178246 176730 174489 172279 170871 170593 171152 171882 172238 172129 171777 171437 171405 172150 174030 176844 179889 182670
57693 182670 185388 188539 192071 195175 197018 197485 196999 195722 193375 190013 186596 184317 183504 183626 184399
57678 184399 186344 190113 195699 202745 211432 222762 238027 258229 284008 315937 354759 401261
57666D01261N4606O2268O7859O8425O0126M0873J3340j5482l8709n3542o0932
57655F00093o2590n9640n3375m5628l7904l0959k5260k0990j7560j4078j0549
57644B21560p874o557o150o045n977n543m185k104m52j01p07j296j325q29r7M58
57628A72776N58M81P62J252J043l07j959k705k311j585j360j785k372k517k028
57613A57943j283p68n45m50n46r46j287j045l80j5k09m30k40J45L36K66M1j96
57595A50391j52K50M32k66j478k130j964j852k307k722k551k255k424k741k603
57580A25628k084j578j067m79j79m39q73j145j616k517l103k602j573j171j395
57565A03807j212l76J38k89r64j017o29n28q00q68m34R9K04j04k65K10J181K003
$$ plain form
57666 401261 455867 518135 585994 654419 714545 755418 768758 753276 714567 661025 600093
57655 600093 537503 477863 424488 378860 340956 309997 284737 263747 246187 232109 221560
57644 221560 213686 207129 200979 194934 188957 183414 179229 177125 176673 176572 175865 174569 173244 172415 172318 172776
57628 172776 173334 173815 174577 175829 176872 176565 174606 171901 169590 168005 166645 164860 162488 159971 157943
57613 157943 156660 155892 155347 154897 154351 153405 152118 151073 150693 150678 150469 150039 149799 149944 150280 150546 150587 150391
57595 150391 150239 150489 150921 150655 149177 147047 145083 143231 140924 138202 135651 133396 130972 128231 125628
57580 125628 123544 121966 120899 120420 120241 119802 118929 117784 116168 113651 110548 107946 106373 105202 103807
57565 103807 102595 102219 102357 102068 101104 100087 99458 98930 98130 97262 96828 96927 97131 97027 96762 96972 98153 100156
57547A00156K225J963J524R67L26r7j11j73r41k190k770j899j56J140J337R17
57531A02218O73Q60J204J399J313Q69J35m58l88L06Q94P65Q2n41p80o47j34O32
57513A08402J098Q13J73J03Q78J790K125J868J280M18n60j203j295j293j734k500
57497A10363k996k885k330j723j425j572j924k037j747j372j237j287j268j089
57483H5471q29n48k85r1O0K24L76M23L82K86O8k75m87m04k96n15q91j010r00q47
57463G9912o87j4Q65J109N39j05l30m50o70n56Q4O09M92J53J93M17L55K12M53
57444H2581P91N29k49o60k74L36M12q3n90o60l14Q7K80L54N59Q76J000P48L04
57425H6027L6K30Q56J391J109L1p47l48N57O20j55m27L20R02K34j096j781j428
$$ plain form
57547 100156 102381 104344 105868 106835 107161 107064 106953 106780 105839 103649 100879 98980 98824 99964 101301 102218
57531 102218 102891 103751 104955 106354 107667 108536 108671 108213 107825 108131 109025 109790 109872 109331 108551 107904 107770 108402
57513 108402 109500 110313 110486 110589 111467 113257 115382 117250 118530 118948 118388 117185 115890 114597 112863 110363
57497 110363 107367 104482 102152 100429 99004 97432 95508 93471 91724 90352 89115 87828 86560 85471
57483 85471 84642 84094 83809 83718 83778 84002 84378 84801 85183 85469 85537 85262 84775 84371 84075 83560 82669 81659 80759 79912
57463 79912 79225 79211 80076 81185 81724 81619 81289 80839 80169 79613 79697 80306 80798 80951 81144 81561 81916 82128 82581
57444 82581 83372 83901 83652 82992 82718 83054 83466 83383 82793 82133 81819 81906 82186 82540 83099 83975 84975 85723 86027
57425 86027 86063 86293 87149 88540 89649 89680 88933 88585 89142 89762 89607 89180 89500 90402 90636 89540 87759 86331
57407H6331m68O90J624J722R59K65L26N76J58o81j091r75q65q09l78L95R75J166
57389H9920J246J352J394J418J483J408J201J393K289L177L092K068R80L83K13
57374A13017L79P92R80M65n22j342j817k145k207j765j177j091j455j625j340
57359I9147r04m80K5M11L44nj57j96n75j134j126l71M32P05N98M49L31L15M82
57340I8291N15l9q50q84K41J560J850R91r1n10q9P14J215R46J1r60j257n71P02
57321A01785J632J489N31k73m23l45m73n04l5O50J113J486J935J912R51k19l65
57304A10847N67J491J745J640J530J331J129J260J625J703J410J224J314J369
57290A30185J369J646K036J885J136O17Q72J418J549J215Q35P29J048J688K130
$$ plain form
57407 86331 85863 86553 88177 89899 90858 91123 91449 92025 92183 91502 90411 89436 88571 87762 87384 87779 88754 89920
57389 89920 91166 92518 93912 95330 96813 98221 99422 100815 103104 106281 109373 111441 112421 112804 113017
57374 113017 113396 114188 115168 115633 115111 113769 111952 109807 107600 105835 104658 103567 102112 100487 99147
57359 99147 98243 97763 97788 98199 98543 98538 98381 98185 97610 96476 95350 94979 95411 96116 96714 97163 97494 97809 98291
57340 98291 98806 98767 97917 97033 97274 98834 100684 101675 101584 101074 100985 101699 102914 103860 103871 102911 101654 101083 101785
57321 101785 103417 104906 105437 105164 104741 104396 103923 103419 103384 104034 105147 106633 108568 110480 111431 111212 110847
57304 110847 111414 112905 114650 116290 117820 119151 120280 121540 123165 124868 126278 127502 128816 130185
57290 130185 131554 133200 135236 137121 138257 138874 139746 141164 142713 143928 144763 145492 146540 148228 150358
57275A50358J890J200O84L53l53j430k102j935j359q19k11N56J198J611K068K511
57259A54220K368J493O35M87R19J461J932K211J971J236O34O22R01R89R34J094
57243A74107J563K173K721K969K873K860L421M249M485L964L475L520L659L459
57229B19498L273L517L886L941L902M169M530M541M278M146M177M112L933L854
57215B75757L982M309M838N420N786N968O313O898P328P390P381P576P860Q165
57201C64971Q747R645J0413J0763J0988J1378J1727J1801J1753J1724J1536J1184
57189D96630J1110J1574J2304J3082J4096J5265J5915J5709J5276J5351J5808
57178F52120J6118J6180J6080J5624J4808J4243J4413J4988J5572J6524J8175
$$ plain form
57275 150358 152248 153448 154132 154485 154132 152702 150600 148665 147306 146487 146276 146832 148030 149641 151709 154220
57259 154220 156588 158081 158716 159203 160122 161583 163515 165726 167697 168933 169567 170189 171090 172079 173013 174107
57243 174107 175670 177843 180564 183533 186406 189266 192687 196936 201421 205385 208860 212380 216039 219498
57229 219498 222771 226288 230174 234115 238017 242186 246716 251257 255535 259681 263858 267970 271903 275757
57215 275757 279739 284048 288886 294306 300092 306060 312373 319271 326599 333989 341370 348946 356806 364971
57201 364971 373718 383363 393776 404539 415527 426905 438632 450433 462186 473910 485446 496630
57189 496630 507740 519314 531618 544700 558796 574061 589976 605685 620961 636312 652120
57178 652120 668238 684418 700498 716122 730930 745173 759586 774574 790146 806670 824845
57167H24845J9787K0343K0162K0660K2502K4809K6369K6875K6938K7297K8207
57156A088794K9295K9971L0071K9892K9534K8766K7769K7277K7484K7540K6831
57145A403224K6076K6308K7286K8016K8322K8880K9828L0533L0741L0929L1397
57134A721540L1770L1696L1382L1371L2292L4707L8638M3229M7461N1140N4640
57123B149866N7999O1037O4188O8165P2886P7622Q2387Q8187R5674J04325J13341
57112C035677J22673J32868J44562J58471J75327J95477K18963K46229K78341
57103D708588L16449L61628M15324M79321N55056O43590P46355Q65128J000878
57094A0092317J153211J321038J502787J695322J893373K090390K278911K449437
$$ plain form
57167 824845 844632 864975 885137 905797 928299 953108 979477 1006352 1033290 1060587 1088794
57156 1088794 1118089 1148060 1178131 1208023 1237557 1266323 1294092 1321369 1348853 1376393 1403224
57145 1403224 1429300 1455608 1482894 1510910 1539232 1568112 1597940 1628473 1659214 1690143 1721540
57134 1721540 1753310 1785006 1816388 1847759 1880051 1914758 1953396 1996625 2044086 2095226 2149866
57123 2149866 2207865 2268902 2333090 2401255 2474141 2551763 2634150 2722337 2818011 2922336 3035677
57112 3035677 3158350 3291218 3435780 3594251 3769578 3965055 4184018 4430247 4708588
57103 4708588 5025037 5386665 5801989 6281310 6836366 7479956 8226311 9091439 10092317
57094 10092317 11245528 12566566 14069353 15764675 17658048 19748438 22027349 24476786
57086B4476786K589725K685270K717808K661086K481604K152580J675631J091299
57078D2531789M65770j37193o77272j139150j521059j824335k050544k203117
57070C3444889k288564k315786k294451k233504k140602k022670j886708j739710
57062A6522894j587925j436575j290077j151937j024331r08323q04540p13175
57054G606011o33345n63307n01723m48193m02332l63062l29230l00221k75360
57045C789238k53392k33258k14908j98579j83676j69221j55122j42084j30367
57036B108631j19512j09253r9812r1223q3036p4858o6645n8444n0360m2694l5417
57025A277377k7630j8315p613L696J6001L0930M9229O9657R0329J09233J21598
$$ plain form
57086 24476786 27066511 29751781 32469589 35130675 37612279 39764859 41440490 42531789
57078 42531789 42997559 42860366 42183094 41043944 39522885 37698550 35648006 33444889
57070 33444889 31156325 28840539 26546088 24312584 22171982 20149312 18262604 16522894
57062 16522894 14934969 13498394 12208317 11056380 10032049 9123726 8319186 7606011
57054 7606011 6972666 6409359 5907636 5459443 5057111 4694049 4364819 4064598 3789238
57045 3789238 3535846 3302588 3087680 2889101 2705425 2536204 2381082 2238998 2108631
57036 2108631 1989119 1879866 1780054 1688831 1605795 1530937 1464292 1405848 1355488 1312794 1277377
57025 1277377 1249747 1231432 1223819 1227515 1243516 1274446 1323675 1393332 1483661 1592894 1714492
57014A714492J18287R0444L8089k6484q5220j25076j43437j45285j37152j23853
57004A174805j08659r4001q1167p0042n9948n0719m2718l6053l0357k5300k0961
56993E54880j7542j4979j3008j1397r954q471o789m880k773m72J823L444L457
56980D73339J382k234o129r295j1535j3049j3829j3704j2836j1760j0851j0077
56968C59422r234q151o713m998l357k001n17J682M458P032R006J0620J1790J1680
56954C80719R654O083J697l154q092j2142j4455j5212j5138j4385j2645j0099
56942B92831p480n272l442j840j90K115N454R279J2617J5244J7658J9848K0914
56929C77736J9950J6673J1128L604m791j2230j7306j9837k0426j9738j8449j7212
$$ plain form
57014 1714492 1832779 1923223 1961312 1934828 1849608 1724532 1581095 1435810 1298658 1174805
57004 1174805 1066146 972145 890978 820936 760988 710269 667551 631498 601141 575841 554880
56993 554880 537338 522359 509351 497954 488000 479529 472740 467860 465087 464615 466438 469882 473339
56980 473339 474721 472487 466358 457063 445528 432479 418650 404946 392110 380350 369499 359422
56968 359422 350188 342037 335324 330326 326969 324968 324451 326133 330591 337623 346629 357249 369039 380719
56954 380719 390373 396456 398153 394999 386907 374765 360310 345098 329960 315575 302930 292831
56942 292831 285351 280079 276637 274797 274607 276722 282176 291455 304072 319316 336974 356822 377736
56929 377736 397686 414359 425487 429091 424300 412070 394764 374927 354501 334763 316314 299102
56917B99102j6241j5181j3748j2152j0695r270p699o221n257m839m581m146l516
56904A85556k843k203j552q07qO90J202J645K155K741L479M654O356Q161R569
56889B18795J0693J2061J3756J5219J5842J5315J3333R593M461q17m988p724r402
56876C06137j0212r903q444o434m551k762n16K307N029P148R227J2250J6256K0391
56862C35923K4301K8573L3333L7202L8246L5418K8651J8347N762o672j6535k2951
56850E39598k6304k6859k4685k0671j6352j2437q363l515J894P343J2691J8093
56838D40433K3901L0712L8801M7265N4423N9125O0849N8322M9352L2931J1112
56827I07226j1782l1505m5462n2977n4983n3224m9085m3208l6232k9221k2934
$$ plain form
56917 299102 282861 267680 253932 241780 231085 221815 214116 207895 202638 197799 193218 189072 185556
56904 185556 182713 180510 178958 178151 178143 178833 180035 181680 183835 186576 190055 194709 201065 209226 218795
56889 218795 229488 241549 255305 270524 286366 301681 315014 324607 329068 328251 323263 315539 306137
56876 306137 295925 286022 277578 271144 266593 263831 263315 265622 270651 277799 287026 299276 315532 335923
56862 335923 360224 388797 422130 459332 497578 532996 561647 579994 585756 579084 562549 539598
56850 539598 513294 486435 461750 441079 424727 412290 403927 400412 402306 409649 422340 440433
56838 440433 464334 495046 533847 581112 635535 694660 755509 813831 863183 896114 907226
56827 907226 895444 863939 818477 765500 710517 657293 608208 565000 528768 499547 476613
56816D76613j7115j1080m612K121R113J6339K3335K9559L4954L9570M2570M2097
56804F83464L6341K4808Q861q634k4411l6156m3148m5791m4915m1551l6897l1939
56792D40032k7093k2366j7769j3375r194n218j492K084N858J0146J4745J8855
56780C95213K1452K1717J9215J3857N871l906j3773k1681k6473k8538k9006k8469
56768C25479k6828k4103k0828j7722j5365j4023j3290j2193j0216q080o773o059
56756A49999m938l422k717l298l991l589k444j664j471j237p33l96n06q13r93
56741A17787j018j070j373j994k641k834k471j957j621j287o96M4O05P82N27j3
56725A00770l37K1P52R41L03l58k70K55M21J47L6M02Q79R31L51o18j410j549j145
$$ plain form
56816 476613 459498 448418 443806 445927 455040 471379 494714 524273 559227 598797 641367 683464
56804 683464 719805 744613 753474 744840 720429 684273 641125 595334 550419 508868 471971 440032
56792 440032 412939 390573 372804 359429 350235 345017 343525 345609 351467 361613 376358 395213
56780 395213 416665 438382 457597 471454 477325 473419 459646 437965 411492 382954 353948 325479
56768 325479 298651 274548 253720 235998 220633 206610 193320 181127 170911 162831 156058 149999
56756 149999 145061 141639 138922 135624 131633 128044 125600 123936 122465 121228 120495 120099 119593 118780 117787
56741 117787 116769 115699 114326 112332 109691 106857 104386 102429 100808 99521 98825 98869 99474 100256 100783 100770
56725 100770 100433 100454 101206 102147 102450 102092 101822 102077 102498 102645 102681 103083 103962 104893 105244 104626 103216 101667 100522
56706A00522p35m77NQ60J614J795J512J034L42m85r78q76n88n45m82L1P71J129
56688A04449R80P12O18P21R70J206J141Q12O93J021J361J262Q92N58J17n19q33
56671A16161m33J53K19mJ53N06L13l02l61M76J355J491J098P24M46J12j47j63
56653A21797o2mJ28M92R53J230J245J168J159J119O87k83j242j291k98P74J095
56636A28667R99J261J791J905J582J410J356P31m34r97k15J152J837J558R42M79
56620A44024J92J3r6k93o47r24q66o02m75n82p81r82j185j297j136o06K09J028
56602A34994J380R22r3q77q90m28k05m45o72l66L33P56M50k64o51m12n3j37m53
56583A32889k64O67J735K222J926J027j84j121j020J99J513J881J598J867L036
$$ plain form
56706 100522 99787 99310 99315 100175 101789 103584 105096 106130 106472 105987 105009 104133 103545 103000 102518 102549 103320 104449
56688 104449 105429 106141 106759 107480 108450 109656 110797 111609 112302 113323 114684 115946 116838 117396 117513 116994 116161
56671 116161 115728 115881 116100 116096 116249 116755 117068 116766 116405 116881 118236 119727 120825 121549 121995 122107 121960 121797
56653 121797 121735 121731 121859 122351 123304 124534 125779 126947 128106 129225 129912 129629 128387 127096 126798 127572 128667
56636 128667 129666 130927 132718 134623 136205 137615 138971 139702 139268 138271 138056 139208 141045 142603 143545 144024
56620 144024 144216 144229 144133 143840 143193 142269 141403 140801 140326 139744 138963 137981 136796 135499 134363 133757 133966 134994
56602 134994 136374 137296 137203 136326 135436 135008 134803 134358 133686 133320 133653 134409 134859 134595 133944 133532 133479 133342 132889
56583 132889 132625 133292 135027 137249 139175 140202 140018 138897 137877 138076 139589 141470 143068 144935 147971
56568A47971M017L779K693J918J944K460L251M354N461O085O511P724R924J1780
56554B19872J1779R811O847L610M15k078l048k598j804j409j196q27o33j065j930
56539B35746k645k971l018k867k593k441k639l101l536l768l759l526l159k802
56525A92921k489k171j936j903j948j833j609j495j329p55oQ9p65j804k124j732
56509A69111j166o78j86K65O04R76J406J412M79j114k418k694k001r31o8M06O63
56492A64066Q21P23K74j00J20P38J068R45Q57R16O09j66o80n60m53q46j021j86
56474A67125R97J176L00l36J0O42P25M89P25J515K050J573L03o37l08J034K200
56457A79583K361J738J001N39N48J204K254K985L015K729K507K066J162L63L97
$$ plain form
56568 147971 151988 155767 158460 160378 162322 164782 168033 172387 177848 183933 190444 198168 208092 219872
56554 219872 231651 241462 248309 251919 252334 250256 247208 244610 242806 241397 240201 239374 238741 237676 235746
56539 235746 233101 230130 227112 224245 221652 219211 216572 213471 209935 206167 202408 198882 195723 192921
56525 192921 190432 188261 186325 184422 182474 180641 179032 177537 176208 175453 175447 175536 174771 172967 170843 169111
56509 169111 167945 167267 167081 167346 167950 168926 170332 171744 172223 171109 168691 165997 163996 163065 162997 163403 164066
56492 164066 164887 165610 165884 165784 165904 166642 167710 168655 169512 170428 171037 170871 170191 169631 169178 168332 167311 167125
56474 167125 168122 169298 169598 169262 169272 169914 170639 171128 171853 173368 175418 176991 177294 176657 176349 177383 179583
56457 179583 181944 183682 184683 185222 185770 186974 189228 192213 195228 197957 200464 202530 203692 204055 204452
56442B04452J111J720J863J742J549J359J309J296Q73j8n99k68L83L32m03r41
56426B15760r31r12j336k018k482k331j388m1Q18P20J88j52m54j006j305q12j05
56409B02213j46o96o73J13P44P07M71M70N35M93M13J54m15p32q8J121J678J225
56391B07587O67P21J124J416J559J450Q41K5k38J98O53P30P47Q51P04L47L95R58
56373B20735J343J240J223J572J635R90L35M33R57J179J146J260J263N88n44j273
56357B34082j188o17Q5Q35J386J240K97p03p98J17J012P82m68j549j629j037m16
56340B31431L02J401K460K750K301J765J417J101R45J343K222L127L867M370M209
56325B65011L175K119K173L178L902L732L128K529J929J502J467J298L04j010
$$ plain form
56442 204452 205563 207283 209146 210888 212437 213796 215105 216401 217274 217256 216657 216389 216772 217104 216701 215760
56426 215760 214829 213917 212581 210563 208081 205750 204362 204321 205139 205859 206047 205895 205441 204435 203130 202318 202213
56409 202213 202067 201371 200698 200811 201555 202262 202733 203203 203738 204231 204644 204798 204383 203651 203563 204684 206362 207587
56391 207587 208254 208975 210099 211515 213074 214524 215365 215390 215152 215350 216003 216733 217480 218331 219035 219382 219777 220735
56373 220735 222078 223318 224541 226113 227748 228738 229073 229506 230463 231642 232788 234048 235311 235899 235355 234082
56357 234082 232894 232277 232362 233197 234583 235823 236120 235417 234619 234736 235748 236530 236062 234513 232884 231847 231431
56340 231431 231733 233134 235594 238344 240645 242410 243827 244928 245873 247216 249438 252565 256432 260802 265011
56325 265011 268186 270305 272478 275656 279558 283290 286418 288947 290876 292378 293845 295143 295447 294437
56311B94437j405q25m22n50k86O78J244O66k82o27m34j31K70O60O86O59J322K272
56293B97932K012K63j321j549j168j045n70P62J796J409M85M68R99Q16J43K44
56277C01676J116J525J057N09L29K50L26R83J967K521K577K639K577J792N77P7
56261C22498P11J727K425K838L076L093L253M105N333N817N163M380M606N781
56247C74806P039P851Q389R008R724J0154R951R408R409J0445J1844J2351J1383
56234E01762R395P249N521M348L531K789K045J363N84n52j868k779l071l128l221
56219E23968l186l005l080l510l793l635l400l370l261k913k725k824k655j931
56205D80680j268j133j068o43l99q37j305r23l2L89K49K01L40J69l47o43m09K03
$$ plain form
56311 294437 293032 292207 291785 291235 290949 291627 292871 293537 293255 292628 292194 292063 292333 292993 293679 294338 295660 297932
56293 297932 299944 300207 298886 297337 296169 295124 294554 295316 297112 298521 299006 299474 300473 301289 301432 301676
56277 301676 302792 304317 305374 305883 306212 306462 306788 307771 309738 312259 314836 317475 320052 321844 322421 322498
56261 322498 323209 324936 327361 330199 333275 336368 339621 343726 349059 354876 360039 364419 369025 374806
56247 374806 381845 389696 398085 407093 416817 426971 436922 446330 455739 466184 478028 490379 501762
56234 501762 511157 518406 523927 528275 531806 534595 536640 538003 538587 538035 536167 533388 530317 527189 523968
56219 523968 520782 517777 514697 511187 507394 503759 500359 496989 493728 490815 488090 485266 482611 480680
56205 480680 479412 478279 477211 476568 476169 475332 474027 473104 473072 473461 473710 473911 474251 474420 474073 473430 473021 473224
56187D73224J039J953K586K680K408J962J366J058J839L546M647M111K889K540
56173E07848L139L641L681L700L825L861M023M477M593L820L006L488N086O354
56159E64542O614O596P054P937Q951R901J0434J0377J0261J0784J1915J3308J5136
56146F93810J7530J9758K1143K2480K5179K9288L3641L7834M2672M8801N6351
56135A048487O6017P8878R4644J11131J25744J36546J41788J39829J30288J14795
56125B188147R6381P8615O4861N6978N4057N2989N0294M3317L0703J3429m598
56114B725173j8630k6502k9575l0682l2443l7448m8010o4378q3794j02088j16015
56103B135608j24069j25946j22031j13271j01195q7858p5171o3778n2948m2195
$$ plain form
56187 473224 474263 476216 478802 481482 483890 485852 487218 488276 490115 493661 498308 502419 505308 507848
56173 507848 510987 514628 518309 522009 525834 529695 533718 538195 542788 546608 549614 553102 558188 564542
56159 564542 571156 577752 584806 592743 601694 611595 622029 632406 642667 653451 665366 678674 693810
56146 693810 711340 731098 752241 774721 799900 829188 862829 900663 943335 992136 1048487
56135 1048487 1114504 1193382 1288026 1399157 1524901 1661447 1803235 1943064 2073352 2188147
56125 2188147 2284528 2363143 2428004 2484982 2539039 2592028 2642322 2685639 2716342 2729771 2725173
56114 2725173 2706543 2680041 2650466 2619784 2587341 2549893 2501883 2437505 2353711 2251623 2135608
56103 2135608 2011539 1885593 1763562 1650291 1549096 1461238 1386067 1322289 1269341 1227146
56093A227146l2490k5150k0037j5904j2131r023o624m334j788P62K992M699N663
56080A113781O074O796Q413J0331J1603J2131J2227J1587R876P857O691O477O615
56067A230459P164Q513J0162J1165J1527J1957J2590J3234J4360J6390J8410J9186
56055A385117J9141J9731K1158K2273K2614K2838K3218K3325K3221K3441K3813
56044A629890K3716K3496K4130K5596K6925K7753K8414K8797K8657K8739L0088
56033A926201L2546L5480L9366M4876N0846N5275N7965O0151O1889O2049O0861
56022B487505O0060O0448O1232O1966O3133O4789O6514O8625P1629P4783P7196
56011C217880P9835Q4255Q9836R4697R8811J03639J09165J14225J19333J26182
$$ plain form
56093 1227146 1194656 1169506 1149469 1133565 1121434 1112411 1105787 1101453 1099665 1100427 1103419 1108118 1113781
56080 1113781 1119855 1126651 1135064 1145395 1156998 1169129 1181356 1192943 1202819 1210676 1217367 1223844 1230459
56067 1230459 1237623 1246136 1256298 1267463 1278990 1290947 1303537 1316771 1331131 1347521 1365931 1385117
56055 1385117 1404258 1423989 1445147 1467420 1490034 1512872 1536090 1559415 1582636 1606077 1629890
56044 1629890 1653606 1677102 1701232 1726828 1753753 1781506 1809920 1838717 1867374 1896113 1926201
56033 1926201 1958747 1994227 2033593 2078469 2129315 2184590 2242555 2302706 2364595 2426644 2487505
56022 2487505 2547565 2608013 2669245 2731211 2794344 2859133 2925647 2994272 3065901 3140684 3217880
56011 3217880 3297715 3381970 3471806 3566503 3665314 3768953 3878118 3992343 4111676 4237858
56001D237858J34448J42180J49236J57316J66704J76118J85639J96653K08981
55992E755133K21392K34686K50750K68800K86343L03679L23501L46332L70559
55983H361175L96793M27625M62969N00470N40604N86502O38618O94870P56315
55974A3365941Q27082R08327R98163J098125J213639J347850J501734J680855
55966B2941716J894867K149792K448884K801916L225088L730744M326827N028219
55958D8548053N859288O845096Q012109R398808J1052391J3014003J5321594J8021842
55950A36073184K1143650K4626423K8242435L1510111L3579590L3225749K9208908
55943C37610050K1011413R457968l388698j5103818k3917033k9190678l1241110
$$ plain form
56001 4237858 4372306 4514486 4663722 4821038 4987742 5163860 5349499 5546152 5755133
55992 5755133 5976525 6211211 6461961 6730761 7017104 7320783 7644284 7990616 8361175
55983 8361175 8757968 9185593 9648562 10149032 10689636 11276138 11914756 12609626 13365941
55974 13365941 14193023 15101350 16099513 17197638 18411277 19759127 21260861 22941716
55966 22941716 24836583 26986375 29435259 32237175 35462263 39193007 43519834 48548053
55958 48548053 54407341 61252437 69264546 78663354 89715745 102729748 118051342 136073184
55950 136073184 157216834 181843257 210085692 241595803 275175393 308401142 337610050
55943 337610050 358621463 368079431 364690733 349586915 325669882 296479204 265238094
55936B65238094l0869206k8960622k6259827k3282673k0331732j7568646j5076572
55929A02888816j2885393j0987242r360368p982716o826845n857880n044521m364811
55921C9579040l798200l321129k914586k568252k273489k019069j796847j604735
55913A9282733j440335j297087j169572j057023r58764q71105p91421p20536o58538
55904A0318352o02560n50992n05576m67022m32535l99894l70143l44077l19820
55895F325733k96017k73974k54470k35668k16338j98000j81720j65784j48663
55886D355099j31534j15653r9709q1976o2881m3498k3443k240J8889L8017N3563
55875C904634O2961O2241M8570K2191j4681n8713j04405j44613j74088j91584
$$ plain form
55936 265238094 234368888 205408266 179148439 155865766 135534034 117965388 102888816
55929 102888816 90003423 79016181 69655813 61673097 54846252 48988372 43943851 39579040
55921 39579040 35780840 32459711 29545125 26976873 24703384 22684315 20887468 19282733
55913 19282733 17842398 16545311 15375739 14318716 13359952 12488847 11697426 10976890 10318352
55904 10318352 9715792 9164800 8659224 8192202 7759667 7359773 6989630 6645553 6325733
55895 6325733 6029716 5755742 5501272 5265604 5049266 4851266 4669546 4503762 4355099
55886 4355099 4223565 4107912 4008203 3926227 3863346 3819848 3796405 3794165 3813054 3851071 3904634
55875 3904634 3967595 4029836 4078406 4100597 4085916 4027203 3922798 3778185 3604097 3412513
55865C412513j98063j94876j84480j70454j55154j38843j22010j06571r3843q3386
55855A964833p5040o9858o7575o5338o0887n5302n0890m7883m5043m2120l9655
55844A345242l7394l4745l2140l0456k9555k8668k7565k6361k4871k3148k1836
55833A028503k1121k0244j8851j7807j7694j7644j6734j5508j4935j4809j4494
55822H38662j4341j4992j5872j5789j4668j3486j2755j2088j1155j0172r529r454
55810F84361r794r870q916p122n571m785m089k860j632j173j261j081l82M67J089
55795F27381J215P30J12L22J697L414M475M702M413L746K737J472j56k335m767
55780F49158o919r015j1902j5621j9048k1232k2137k1786j9942j7092j4480j2367
$$ plain form
55865 3412513 3214450 3019574 2835094 2664640 2509486 2370643 2248633 2142062 2048219 1964833
55855 1964833 1889793 1819935 1752360 1687022 1626135 1570833 1519943 1472060 1427017 1384897 1345242
55844 1345242 1307848 1273103 1240963 1210507 1180952 1152284 1124719 1098358 1073487 1050339 1028503
55833 1028503 1007382 987138 968287 950480 932786 915142 898408 882900 867965 853156 838662
55822 838662 824321 809329 793457 777668 763000 749514 736759 724671 713516 703344 693815 684361
55810 684361 674567 664697 655781 648659 643088 638303 634214 631354 629722 628549 627288 626207 625825 626292 627381
55795 627381 628596 629326 629438 629760 631457 634871 639346 644048 648461 652207 654944 656416 656260 653925 649158
55780 649158 642239 633224 621322 605701 586653 565421 543284 521498 501556 484464 469984 457617
55768D57617r567n553j870l31q61k147l514m857n614n260m373l967m110m191m119
55753C97283m216m366m372m805o281q205r289r250q924q776q350p326o157n419
55739C01547n137m948m502l609k409j415j048j258j749k311k665k495j998j932
55725B64071k667l643m286m809n541o012n538m319l137k328j778j525j534j241
55711B15713j87J114J838K142K875M098M838M403L085J457k52j890l159l961m532
55696B27582n068n569o061o547o733o225n027l531k100j054q10j445k238k226
55682A72948j316k85K83N86J039J625J983J834J185L13m59j101j863k762l382
55667A70628l518l611l992m031k849p78O73N88k87n48K38J297J774J595J217R28
$$ plain form
55768 457617 448050 442497 440627 440296 439435 437288 433774 428917 423303 418043 413670 409703 405593 401402 397283
55753 397283 393067 388701 384329 379524 373243 365038 355749 346499 337575 328799 320449 313123 306966 301547
55739 301547 296410 291462 286960 283351 280942 279527 278479 277221 275472 273161 270496 268001 266003 264071
55725 264071 261404 257761 253475 248666 243125 237113 231575 227256 224119 221791 220013 218488 216954 215713
55711 215713 215526 216640 218478 220620 223495 227593 232431 236834 239919 241376 241124 239234 236075 232114 227582
55696 227582 222514 216945 210884 204337 197604 191379 186352 182821 180721 179667 178857 177412 175174 172948
55682 172948 171632 171347 171630 172216 173255 174880 176863 178697 179882 180195 179736 178635 176772 174010 170628
55667 170628 167110 163499 159507 155476 152627 151849 152522 153110 152823 152275 152513 153810 155584 157179 158396 159324
55651A59324O90N58Q42J574K169K155K036K702L964M589M012L112K819K768K093
55636A95407P70o87k288m181n766o268o013n983o219n831m611l469l067l035k915
55621A35844k802k654j975p85o0l86r85q65l80n93j513k024j601j016j087j545
55605A15573j667j415j285j347j193p68n59p11o41Q8Q73P54k60j134j165o89l87
55588A04067l81l71j64K24O23P08K97j10L12J535K512K576K359K752L515L810
55572A24264L662L943N055O486P650Q384Q560P913O414M338J895o64k724l743
55558A81433m060m591n653o715p367p817q179q039p115n813m726l971l400l017
55544A00970k826k538j858r96n24q07j562k055j772j043p32j142j453p97M72J128
$$ plain form
55651 159324 160014 160572 161414 162988 165157 167312 169348 172050 176014 180603 184615 187727 190546 193314 195407
55636 195407 196177 195490 193202 189021 183255 176987 170974 164991 158772 152941 148330 144861 141794 138759 135844
55621 135844 133042 130388 128413 127628 127568 127182 126197 125332 124952 124359 122846 120822 119221 118205 117118 115573
55605 115573 113906 112491 111206 109859 108666 107898 107339 106628 105987 106075 106948 107702 107442 106308 105143 104454 104067
55588 104067 103686 103315 103151 103375 103998 104706 105003 104893 105205 106740 109252 111828 114187 116939 120454 124264
55572 124264 127926 131869 136924 143410 151060 159444 168004 175917 182331 186669 188564 187900 185176 181433
55558 181433 177373 172782 167129 160414 153047 145230 137051 129012 121897 116084 111358 107387 103987 100970
55544 100970 98144 95606 93748 92752 92228 91421 89859 87804 86032 84989 84257 83115 81662 80865 81337 82465
55528H2465O43l26r54j005n45K97J008R03K5q04j076j154j357j348q77m84p16
55511G4695j210j257q62n24l18J2K98P6n64j001r73p62n03PO73R57O47K07J10
55492F9708K39K62J39n0l83q07q78k98N01Q00N62M45Q30J270J146M63k82p00p16
55473G2251m03OJ05k81p26o33m1L73J18n95j276j599j397o52K56P44P48Q05J138
55454F8941J245P78K64K26J37q13k220k745j911o63L8L03O64J124J334J162O91
55437F8555Q8k63m2L34Kj038j627j003L6K81j03P2J189K353K737K443J779O35
55419G6428r43k117j965o38P12J190R61O70N17J83m08p24l02M97Q30M29j17k23
55401G4980j4Q7K2n9l19j017j835k000j246k64N5m04r79j077p76n63o86r18r11
$$ plain form
55528 82465 83108 82782 81828 80823 80278 80575 81583 82486 82511 81707 80631 79477 78120 76772 75895 75411 74695
55511 74695 73485 72228 71366 70842 70524 70536 70834 70910 70346 69345 68372 67610 67107 67114 67787 68744 69391 69598 69708
55492 69708 69947 70209 70348 70298 69915 69108 68230 67932 68433 69233 69795 70240 71070 72340 73486 73949 73667 72967 72251
55473 72251 71848 71854 71959 71678 70952 70319 70278 70651 70769 70174 68898 67299 65902 65250 65506 66250 66998 67803 68941
55454 68941 70186 70964 71228 71454 71591 70778 68558 65813 63902 63239 63277 63580 64244 65368 66702 67864 68555
55437 68555 68643 68380 68338 68672 68674 67636 66009 65006 65042 65323 65220 65292 66481 68834 71571 74014 75793 76428
55419 76428 75485 73368 71403 70765 71477 72667 73628 74298 74815 74998 74590 73866 73564 74061 74891 75320 75203 74980
55401 74980 74966 75053 75075 75016 74697 73680 71845 69845 68599 68335 68390 67986 67007 65930 65154 64591 63905 62987 62076
55382F2076n91j17L74Q11J005P68K03l04n38o98j082j645k012j811r22M03J616
55365E7536K182J966J264M62j61l72j6P00J242J265R02M64L9m07p22o37j06N58
55347F6159R28P87L45N2R6J67n3l20j46M17Q26R05R89J137Q37q7r40j084q13p45
55327F9457p96n17p6p6n23p65m56O8M70P47Q20L91n16j352j613j253m80M37J061
55308F5028J011M78O9l4k44p44j025o63j07j12o93j180j125p11k70Q3L60N77Q59
55289F1557J360J933K116J603O82J3k2L27M94K68qP0L97M75Q1m29n50j52M43Q01
55269G1459P19L40L9N0K05K07J29L40Q18R46K82p60j382j370j103p57o2R33J497
55250G2530J043L5n17l10L3Mj14J20M75L74j87n63l47J29K59j11o43r21p91m06
$$ plain form
55382 62076 61485 61368 61742 62553 63558 64326 64529 64225 63687 62989 61907 60262 58250 56439 55517 55920 57536
55365 57536 59718 61684 62948 63410 63249 62877 62861 63561 64803 66068 66970 67434 67473 67066 66344 65707 65601 66159
55347 66159 67087 67874 68219 68271 68367 68534 68481 68161 68015 68432 69258 70163 71152 72289 73126 73039 72099 71015 70202 69457
55327 69457 68661 68144 68068 67992 67469 66704 66248 66316 66786 67533 68353 68744 68228 66876 65263 64010 63530 63967 65028
55308 65028 66039 66517 66586 66552 66308 65564 64539 63876 63769 63657 62964 61784 60659 59948 59678 59761 60121 60698 61557
55289 61557 62917 64850 66966 68569 69251 69264 69242 69569 70063 70331 70323 70393 70790 71265 71346 70917 70367 70215 70658 71459
55269 71459 72178 72518 72557 72607 72812 73019 73148 73488 74306 75252 75534 74774 73392 72022 70919 70162 70100 71033 72530
55250 72530 73573 73608 73091 72781 72814 72818 72704 72824 73299 73673 73486 72923 72576 72705 72964 72853 72210 71289 70498 70092
55230G0092r2q8l23m98m02o1L28M78J80m16p57m61J85O13P81J089J515J454O42
55211G4259l90j027j202j008l50N84R79L12q42j441j132k25R92K193K575J548
55195G5825k92j593j697j012j22O25P59m8j145j329m25L92K16m19m56K84J172
55178G0735J647J525Q83J44j39O6K07K6j01J9m1m57n98j9O34N25o1k19J33K95
55158G5204L6r2K57P77J126J328J423J287R09L79l75j314j933j755j116p81p94
55141G4566n00K02M78k10j176j319m50O66J213R50J71o17j080j222j120o04L96
55124G0344J299J284L51n50o28o3N06P59O66L02m5PL15K56k19k77N33J318J016
55105G7174N4k00N14J050O84K24O57J588J804R59q8m81k07K79O44O93K64n69j352
$$ plain form
55230 70092 70000 69912 69589 69091 68689 68628 68956 69434 69614 69198 68441 67980 68165 68778 69559 70648 72163 73617 74259
55211 74259 73869 72842 71640 70632 70282 70866 71845 72157 71315 69874 68742 68517 69509 71702 74277 75825
55195 75825 75533 73940 72243 71231 71109 71734 72493 72445 71300 69971 69546 69938 70154 69735 69279 69563 70735
55178 70735 72382 73907 74790 74934 74795 74861 75068 75094 74993 75012 74971 74514 73916 73897 74531 75056 74995 74776 74909 75204
55158 75204 75240 75148 75405 76182 77308 78636 80059 81346 82255 82634 82259 80945 79012 77257 76141 75360 74566
55141 74566 74066 74268 74746 74536 73360 72041 71591 72257 73470 74420 74591 73974 72894 71672 70552 69948 70344
55124 70344 71643 72927 73278 72728 72100 72037 72543 73302 73968 74270 74225 74232 74547 74803 74584 74307 74840 76158 77174
55105 77174 77228 77028 77542 78592 79276 79500 80157 81745 83549 84508 84420 83939 83732 84011 84655 85348 85612 85043 83691
55086H3691j632j374q72l83m6L1j51l15j30L39O54N13K2n78j138j423j136l54
55068G5718K59J79k95m27q1J67p9n34p67q21r48j045p31J04J088J676J643J205
55050G6311Q02O61O29M73K07qj89l91l92R7Q60J238R11K61k44n94r21r99n04M09
55030G8617J132J204O20k96j026j078l67N89J082Q40J90k93k24L47Q93P67j30
55013H2867j174j660j499j090p15l52KK51L74M89O79R44J261J509J477J146Q46
54996H5355Q56R48O56k1m93k34O52J550J836J327M23k08k48k3K2m5J47O04Q88
54977I3992Q04O65Q18J159J327J133O53Q2l36m36k57K7L35O50P96N37m8n32n89
54958A00780k46L28R31J182O91l94j322j490j024m02J43N36M92j76j008j241p15
$$ plain form
55086 83691 82059 80685 79813 79430 79384 79415 79264 78949 78819 79158 79812 80325 80347 79769 78631 77208 76072 75718
55068 75718 75977 76156 75861 75434 75353 75520 75441 74907 74140 73319 72371 71326 70595 70699 71787 73463 75106 76311
55050 76311 77113 77774 78403 78876 79083 79075 78886 78495 78103 78200 79060 80298 81209 81470 81226 80632 79711 78712 78208 78617
55030 78617 79749 80953 81573 81277 80251 79173 78806 79395 80477 81317 81507 81214 80990 81337 82230 82997 82867
55013 82867 81693 80033 78534 77444 76729 76377 76379 76630 77004 77493 78172 79116 80377 81886 83363 84509 85355
54996 85355 86211 87159 87815 87794 87301 87067 87719 89269 91105 92432 92855 92647 92399 92376 92398 92353 92500 93104 93992
54977 93992 94796 95461 96279 97438 98765 99898 100551 100633 100297 99861 99604 99631 99966 100616 101412 101949 101901 101369 100780
54958 100780 100534 100862 101793 102975 103666 103272 101950 100460 99436 99034 99177 99713 100205 100029 99021 97780 97065
54941I7065p1J30Jp9j09l35p24r64r52r25j056j139q43j29O90J313J684J930K132
54922I7619K283K345K312K205K088K176K775L973N376O290O363N945N657N590
54908A52997N179L877J779n74k714m363n247n265m790m440m419m350l880l168
54894A20622k603k351k304k271k053j565j057q96r41m89P54K022K274J469N20
54879A11131Q9k6j92j98M78J923L578M677M876M572M557N194N964O103N478M502
54863A62706L292J509q66l143m621n300n559n496m985m195l592l436l496l360
54849A19458k904k438k382k744k981k578j756j279j508j960j942j355o60l18m61
54834I2192r10j283j205o41M2M33M22J12l84q76j053p18k8O37R51Q28M65J91J26
$$ plain form
54941 97065 96994 97124 97125 97046 96937 96602 95878 94914 93962 93037 91981 90842 89999 89870 90560 91873 93557 95487 97619
54922 97619 99902 102247 104559 106764 108852 111028 113803 117776 123152 129442 135805 141750 147407 152997
54908 152997 158176 162053 163832 163258 160544 156181 150934 145669 140879 136439 132020 127670 123790 120622
54894 120622 118019 115668 113364 111093 109040 107475 106418 105522 104581 104092 104846 106868 109142 110611 111131
54879 111131 111220 111194 111002 110804 111282 113205 116783 121460 126336 130908 135465 140659 146623 152726 158204 162706
54863 162706 165998 167507 166641 163498 158877 153577 148018 142522 137537 133342 129750 126314 122818 119458
54849 119458 116554 114116 111734 108990 106009 103431 101675 100396 98888 96928 94986 93631 92971 92653 92192
54834 92192 91282 89999 88794 88153 88195 88628 89050 89162 88778 87902 86849 86131 86103 86740 87691 88519 88984 89175 89301
54815H9301J2l06m33J15J009J382J020O19N47K17p58j568j248j87L90J80NL45
54797I0642O77M80L1k11k47j89J38Q11J386J344O61k60r79j078l48Q20J579J501
54779I6758J007O44L54j34n38k57Q08K084K978L269K973K259J596J537K218L217
54763A20773L954M059L567K997L131M277N692O190N415M121L032J932K67j754
54749A67653l251l785l841m099m605m863m506l651k751k247k270k518k481j965
54735A20820j321j049j209j350j026k34N95J000Q79N63M73O65Q15O67L94L77P64
54718A21823J444K315L350M419N264N703N658N066L963K587J188k26j719l116
54704A57719m159m819n130m851l907l014l132m082m532l691k346j660j626j466
$$ plain form
54815 89301 89313 89007 88574 88689 89698 91080 92100 92719 93266 93483 92725 91157 89909 89722 90112 90292 90297 90642
54797 90642 91319 91799 91830 91619 91372 91183 91321 92132 93518 94862 95523 95263 94284 93206 92858 93678 95257 96758
54779 96758 97765 98409 98763 98629 98091 97834 98642 100726 103704 106973 109946 112205 113801 115338 117556 120773
54763 120773 124727 128786 132353 135350 138481 142758 148450 154640 160055 164176 167208 169140 169407 167653
54749 167653 164402 160617 156776 152677 148072 143209 138703 135052 132301 130054 127784 125266 122785 120820
54735 120820 119499 118450 117241 115891 114865 114631 115226 116226 117105 117668 118141 118806 119621 120288 120682 121059 121823
54718 121823 123267 125582 128932 133351 138615 144318 149976 155042 159005 161592 162780 162554 160835 157719
54704 157719 153560 148741 143611 138760 134853 131839 128707 124625 120093 116402 114056 112396 110770 109304
54690A09304j030q20q95o97p1L76J30n92j273j654j719j522j252j010m89O81K145
54673I9612K882K320R48l31j075j310j128o72k50r3j35j97k20k31l25p39j569
54656I7487k276k023p77L71M43k32n39o7M83L17n06j168r45J33J306J821J668
54639I5496J426J338R52l7r98r84P2J268J819J727J425J193J073R81P55K94l04
54622A07496q60j326j634j473o71K10K15q08j765j501j53J054J271Q10M56M07
54606A01728K14l81r67r26j57Q24J435J430Q51j21j108j596j402q98o13n34j60
54589I7619P17J567J686J056L97L26O44O58J58k45Q1Q84J267Q30J24j15J57M89
54571A08300O74Q62J044R65N43O0j87j64P7N11Q94P15k30j316j508m98Q37J315
$$ plain form
54690 109304 108274 107454 106559 105862 105791 106167 106297 105705 104432 102778 101059 99537 98285 97275 96786 97467 99612
54673 99612 102494 104814 105762 105431 104356 103046 101918 101246 100996 100903 100768 100571 100351 100120 99795 99056 97487
54656 97487 95211 93188 92411 92782 93225 92993 92454 92387 92870 93187 92681 91513 90568 90701 92007 93828 95496
54639 95496 96922 98260 99212 99175 98177 97193 97265 98533 100352 102079 103504 104697 105770 106751 107506 107800 107496
54622 107496 106636 105310 103676 102203 101532 101742 101957 101149 99384 97883 97730 98784 100055 100865 101321 101728
54606 101728 101942 101561 100594 99668 99511 100335 101770 103200 104051 103930 102822 101226 99824 98926 98313 97779 97619
54589 97619 98336 99903 101589 102645 103042 103368 104012 104670 104828 104583 104664 105548 106815 107645 107769 107654 107811 108300
54571 108300 108974 109836 110880 111845 112388 112448 112261 112097 112174 112685 113579 114294 114064 112748 111240 110742 111579 112894
54553A12894O90j59k95K76Q46R69Q55Q62R81J034J052J166J289J213R58P59P71
54536A26161R94J473K219K927L057K437J589J200J296J274P45Q2j18Q1R1k43l57
54519A44908O5L60l04j612k335j862q49j28K71P26J233J528J535J169J84j240
54503A43649k185k025j452j634k475k663j482K68J407J623J265O16n8k92R8O05
54487A35265N98J38j50J43Q71J561J705J070J02k83L34J326J834J845J954K265
54471A50578K242J681J153J247J851K477K886L028K704J781O26j19k49j49j35
54456A71602K3O31J412J648J085K83p3k5j46p20j429j898k124k260k298k138j826
54439A61747j381o94J67P31N58j28o64p72q41j206j585j489j010p15p87p43j77
$$ plain form
54553 112894 113584 113425 113130 113406 114252 115221 116076 116938 117919 118953 120005 121171 122460 123673 124631 125390 126161
54536 126161 127155 128628 130847 133774 136831 139268 140857 142057 143353 144627 145372 145454 145336 145417 145508 145265 144908
54519 144908 144973 145333 145029 143417 141082 139220 138371 138243 138514 139240 140473 142001 143536 144705 144889 143649
54503 143649 141464 139439 137987 136353 133878 131215 129733 130001 131408 133031 134296 134912 134854 134562 134660 135265
54487 135265 135863 136001 135851 135994 136865 138426 140131 141201 141303 141020 141354 142680 144514 146359 148313 150578
54471 150578 152820 154501 155654 156901 158752 161229 164115 167143 169847 171628 172254 172135 171886 171737 171602
54456 171602 171625 172256 173668 175316 176401 176684 176611 176586 176440 175720 174291 172393 170269 168009 165711 163573 161747
54439 161747 160366 159672 159839 160570 161128 161000 160336 159564 158723 157517 155932 154443 153433 152718 151931 151188 151011
54422A51011N23O30R8l66l32k49o44j149r29P1R53J046O39L40K38J12M5K74O79
54403A52990Q85P67M69N6m06n73j12P32J320J411J333J329J183O83L1m31o08n28
54385A60531j45M24O83J61r79j980k151j427l59L80N16K70l1l30o99r42o83J38
54367A53377J140J926K324K242J628P66J91J13J77L5k51m80p02r60j093j049j098
54350A58286j277j109l79K28r9j101j820j953k041k305k246j680j263j477j743
54335A38021j184Q8J084J130M42l67q99j180j483j904j990j134M37J516J217J34
54319A33928l31L49J367J711J176K46n24q31p26o24q78j273j223o14o5j47o14
54302A30927p41k81K70L96K59M57J163J775J590O62k57o24o22o75q44r43q61n47
$$ plain form
54422 151011 151534 152164 152262 151896 151564 151315 150671 149522 148593 148664 149617 150663 151302 151642 151880 151992 152037 152311 152990
54403 152990 153875 154642 155111 155167 154761 154188 154076 154808 156128 157539 158872 160201 161384 162067 162098 161667 161059 160531
54385 160531 160386 160810 161493 161654 160675 158695 156544 155117 154758 155138 155654 155924 155893 155563 154864 153922 153239 153377
54367 153377 154517 156443 158767 161009 162637 163403 163594 163707 163884 163919 163668 163188 162486 161526 160433 159384 158286
54350 158286 157009 155900 155521 155749 155650 154549 152729 150776 148735 146430 144184 142504 141241 139764 138021
54335 138021 136837 136925 138009 139139 139581 139214 138315 137135 135652 133748 131758 130624 131061 132577 133794 133928
54319 133928 133597 133946 135313 137024 138200 138446 137922 137091 136365 135741 134863 133590 132367 131753 131688 131541 130927
54302 130927 130186 129905 130175 130571 130830 131287 132450 134225 135815 136477 136220 135596 134974 134299 133455 132512 131651 131104
54284A31104N7O69O44j89j010r60m03m23j146j508q91k8J55j49j81J29K53O8m4
54265A26147K7p4m85q08o48j26L40N32N54N97O70O14L98L60Q09J370J219K56m66
54246A31286k6R93J159J44p41k52J220K181J774N05n77j016j119j307j541j489
54230A31194j049n43k92k77l56n32q09r92r32q23r05j034r03n79l85l17n3M10
54212A20823O63M90J57j03l76o57o36k35N7k31q79j301j303j069n93L36J517K226
54194A18886J946R88J89O6M20O40L15m53j216j603j553j210p12j72K23K77k3m02
54176A16606m86j63K78M92N47Q75J572K015J581N48j70k76m78j395k546k973k434
54159A13593j484n43L59J025R97L32j88n5J88j80q07o15N71J542J202j1p75n88
$$ plain form
54284 131104 131161 131830 132474 132285 131275 130315 129912 129489 128343 126835 125944 125916 126071 125922 125741 125870 126123 126191 126147
54265 126147 126174 126100 125615 124807 124159 124033 124373 124905 125459 126056 126726 127340 127738 128098 128907 130277 131496 131752 131286
54246 131286 131260 132253 133412 133556 132815 132563 133783 135964 137738 138243 137666 136650 135531 134224 132683 131194
54230 131194 130145 129602 129310 129033 128677 128145 127336 126344 125412 124589 123684 122650 121747 121168 120783 120466 120413 120823
54212 120823 121486 121976 122133 122030 121654 120997 120361 120126 120183 119952 119073 117772 116469 115400 114807 115143 116660 118886
54194 118886 120832 121820 122009 122075 122495 123135 123450 122997 121781 120178 118625 117415 116703 116531 116754 117031 117008 116606
54176 116606 116120 115957 116235 116727 117274 118149 119721 121736 123317 123865 123695 123419 122941 121546 119000 116027 113593
54159 113593 112109 111566 111925 112950 113947 114279 114091 114036 114224 114044 113237 112622 113193 114735 115937 115926 115151 114563
54141A14563j57j73l94k01M90J192J465J191M93k65n50j25N82Q70N47O4p4K10
54123A19728O86J029R24K18q36j665j802j220k91M24N03J29Q5R17K088K457J687
54106A25061O70L36N36N28J30j60r4o1m68j112j480j410j185j076r36m86J59M79
54088A19431K61LL10J002J305R50N57P03J123J196Q41M32J09k76n99l93M97J549
54070A29001K036J700R01K27N4L26O90P85M36k97j082j351p60K57P52L53k56k14
54052A33558M23R10Q57N72M26M50O11R58J341J387J008O92R94J950L060L762L808
54035A56767L330K746K481K714L376M284N150N523N079M013L013K667K981L455
54021B07579L576L244K828K724K793K403J244j03o72j32R28J619J359P9j701l068
$$ plain form
54141 114563 114406 114233 113839 113638 114128 115320 116785 117976 118469 118204 117654 117529 118111 118981 119528 119592 119518 119728
54123 119728 120414 121443 122367 122585 121749 120084 118282 117062 116771 117195 117698 117827 117912 118829 120917 123374 125061
54106 125061 125731 126067 126603 127131 127261 127101 127007 126946 126478 125366 123886 122476 121291 120215 119279 118793 118952 119431
54088 119431 119692 119695 120005 121007 122312 123262 123819 124522 125645 126841 127682 128114 128223 127947 127348 126955 127452 129001
54070 129001 131037 132737 133638 133865 133919 134245 134935 135720 136156 135859 134777 133426 132666 132923 133675 134028 133772 133558
54052 133558 133981 134891 135748 136320 136746 137196 137807 138765 140106 141493 142501 143193 144187 146137 149197 152959 156767
54035 156767 160097 162843 165324 168038 171414 175698 180848 186371 191450 195463 198476 201143 204124 207579
54021 207579 211155 214399 217227 219951 222744 225147 226391 226288 225616 225484 226412 228031 229390 229469 227768 224700
54005B24700l419l061k790k829k638j770n16M79Q36N90J22P6R38K387L487L659
53989B20251L156K374J162p59l069m990o009o171n844n478n342n257m753l778
53975A75493k906k586k450j817o67L03N23Lq41j502j588j148o92o10o25j90P40
53958A59440J636K026J835J252N91K23K52L84L68M28Q24J301J512J659K057K247
53942A78035J539M14L36J785L413L762L037K505K742L252L474L344K988K537K225
53927B15388K161K117J856J576J531J468J017M20L39R39J783K603L507M346M607
53912B45658M242L933M184M655M862N078N870O993P368O313M345K665J994K041
53898C10201J895R09o69j882k010j299p28j025k095l312m179m574m560m251l954
$$ plain form
54005 224700 221281 218220 215430 212601 209963 208193 207677 208156 208992 209582 209704 209780 210718 213105 216592 220251
53989 220251 223407 225781 226943 226184 223115 218125 212116 205945 200101 194623 189281 184024 179271 175493
53975 175493 172587 170001 167551 165734 165067 165370 165893 165896 165055 163553 161965 160817 160125 159515 158890 158700 159440
53958 159440 161076 163102 164937 166189 166780 167003 167255 167639 168007 168435 169259 170560 172072 173731 175788 178035
53942 178035 179574 179988 180324 182109 185522 189284 192321 194826 197568 200820 204294 207638 210626 213163 215388
53927 215388 217549 219666 221522 223098 224629 226097 227114 227534 227873 228812 230595 233198 236705 241051 245658
53912 245658 249900 253833 258017 262672 267534 272612 278482 285475 292843 299156 303501 306166 308160 310201
53898 310201 312096 313005 312336 310454 308444 307145 306417 305392 303297 299985 295806 291232 286672 282421 278467
53883B78467m128m904n720n810n119m385m078l725k770j704j600k520l228k808
53869B25968j831j438j834k358k627k841l088l155l079l184l377l045j986r11
53855A91214n60p35p53n88q54j686k256j795o70K4j96p19q15n81n60p28m66M31
53837A77707J239J171L93k26j35N78J662K905L868M028L455K898K860K997K608
53822B08008J439k89k290m156n247n164m321l556l131k565j477k46M45M32J91
53807A78073K80Q46J656K423L027L433L615L649L865M524N286N382M586L654L347
53792B27646L355K782J590P38Q32J284J248P93N96Q79J202J170Q15L28j76o49
53776B44433j080j559k171k877l602m221m391l729k468j595j797k566k965k962
$$ plain form
53883 278467 274339 269435 263715 257905 252786 248401 244323 240598 237828 236124 234524 232004 228776 225968
53869 225968 224137 222699 220865 218507 215880 213039 209951 206796 203717 200533 197156 194111 192125 191214
53855 191214 190654 189919 189166 188578 187724 186038 183782 181987 181317 181341 181145 180426 179611 179030 178470 177742 177276 177707
53837 177707 178946 180117 180510 180284 180149 180727 182389 185294 189162 193190 196645 199543 202403 205400 208008
53822 208008 209447 209158 206868 202712 197465 192301 187980 184424 181293 178728 177251 177005 177450 177882 178073
53807 178073 178353 179199 180855 183278 186305 189738 193353 197002 200867 205391 210677 216059 220645 224299 227646
53792 227646 231001 233783 235373 236111 236943 238227 239475 240268 240864 241743 242945 244115 244930 245258 245082 244433
53776 244433 243353 241794 239623 236746 233144 228923 224532 220803 218335 216740 214943 212377 209412 206450
53762B06450l241l786l658k514j376j285j833j836j046l88o13j429k066k161j922
53747A77296j733j703j493o40O94J598J385M96o2mR0j55l86k39J41N11R36J387
53729A78119J473R47K07k21l42n05p67r08q16n32l9N73R06O46K4m28n07l62m6
53710A77422N10J166J597J713J699J681J645J643J747J844J798J750J906K121
53696B00242K119K004K039K030J560Q47O82J286J895J773J107N30L10L72O78J029
53680B20503R73L66k75m33l28m43p33p87n99n10o03o99q66j306j796j834j326
53663B09304o07J81J071J682J381K43q15j130r67q11o09j69K40K06j63m68o65
53646B07904r41j149r13k46L61N50M09J96O9J51N13R95J343J549J790J990J752
$$ plain form
53762 206450 203209 199423 195765 193251 191875 190590 188757 186921 185875 185487 184874 183445 181379 179218 177296
53747 177296 175563 173860 172367 171727 172421 174019 175404 175900 175838 175834 175924 175769 175383 175144 175285 175796 176732 178119
53729 178119 179592 180539 180746 180525 180183 179678 178911 178003 177187 176655 176616 177189 178095 178741 178765 178337 177830 177468 177422
53710 177422 177932 179098 180695 182408 184107 185788 187433 189076 190823 192667 194465 196215 198121 200242
53696 200242 202361 204365 206404 208434 209994 210841 211523 212809 214704 216477 217584 218114 218424 218796 219474 220503
53680 220503 221476 221842 221567 221134 220806 220363 219630 218843 218244 217734 217131 216432 215566 214260 212464 210630 209304
53663 209304 208697 208878 209949 211631 213012 213255 212440 211310 210343 209532 208923 208754 208994 209200 209037 208569 207904
53646 207904 206963 205814 204901 204655 205016 205566 205975 206171 206240 206391 206904 207899 209242 210791 212581 214571 216323
53629B16323R98L08L56J137J977K330K261K129K056J869J534J393J800K623L218
53614B42312L072K374J879K124K854L303L016K328J966K189K445K016R18l9k43
53599B72514L2J10j04o3M61R22P30J19k53k74m53r69j296r55k42J53l3n57j090
53580B68752j399j284p93l37k40k72m5K89K34k18n74o73q41j117j080p11o18r80
53562B58093j009j64Q45J070Q32J093J795J987J560J501K198K714K294J545J416
53547B77770J829K163K416K992L755M225M386M552M616M311L972M219M867N101
53533C31174M800M825N727O977P884Q556R422J0362J0997J1387J1822J2188J2169
53520D48290J1989J2329J3487J5065J6585J7960J9318K0654K1820K2628K2948
$$ plain form
53629 216323 217321 217629 217985 219122 221099 223429 225690 227819 229875 231744 233278 234671 236471 239094 242312
53614 242312 245384 247758 249637 251761 254615 257918 260934 263262 265228 267417 269862 271878 272796 272757 272514
53599 272514 272546 272656 272552 272489 272950 273872 274602 274721 274468 274194 273741 272772 271476 270521 270279 270432 270399 269842 268752
53580 268752 267353 266069 265276 264939 264699 264427 264382 264671 264905 264687 264113 263440 262599 261482 260402 259691 259073 258093
53562 258093 257084 256920 257765 258835 259667 260760 262555 264542 266102 267603 269801 272515 274809 276354 277770
53547 277770 279599 281762 284178 287170 290925 295150 299536 304088 308704 313015 316987 321206 326073 331174
53533 331174 335974 340799 346526 353503 361387 369943 379365 389727 400724 412111 423933 436121 448290
53520 448290 460279 472608 486095 501160 517745 535705 555023 575677 597497 620125 643073
53509F43073K2875K2820K3121K3566K3624K3128K2451K1883K1277K0502J9800
53498H88120J9438J9253J8958J8674J8764J9202J9508J9302J8649J7860J7260
53487A094988J7083J7249J7165J6207J4513J2982J2242J1934J1327J0349R507
53476A245546Q912P902N898L217P40j160k935n147p708j0092j2093j3981j5870
53463A203229j7366j8115j8462j9108k0196k1162k1611k1909k2630k3686k4341
53452I74643k4036k2968k1818k1089k0664k0039j8941j7680j6722j6038j5166
53441G59482j3935j2770j1985j1201r807p782n662l833k274q83L92J756L522N686
53427F90706P812R531J0949J2471J4319J6305J7982J8986J9369J9637K0363K1737
$$ plain form
53509 643073 665948 688768 711889 735455 759079 782207 804658 826541 847818 868320 888120
53498 888120 907558 926811 945769 964443 983207 1002409 1021917 1041219 1059868 1077728 1094988
53487 1094988 1112071 1129320 1146485 1162692 1177205 1190187 1202429 1214363 1225690 1236039 1245546
53476 1245546 1254458 1262360 1268258 1271475 1272215 1271055 1268120 1262973 1255265 1245173 1233080 1219099 1203229
53463 1203229 1185863 1167748 1149286 1130178 1109982 1088820 1067209 1045300 1022670 998984 974643
53452 974643 950607 927639 905821 884732 864068 844029 825088 807408 790686 774648 759482
53441 759482 745547 732777 720792 709591 699784 692002 686340 682507 680233 679350 679742 681498 685020 690706
53427 690706 698518 708049 718998 731469 745788 762093 780075 799061 818430 838067 858430 880167
53415H80167K3486K5168K6484K7483K8590L0234L2250L3958L5066L6240L8316
53404A217442M1124M3639M5241M6355M7745M9665N1818N3703N4904N5316N5232
53393A762184N4918N4133N2594N0911N0311N1058N1720N0599M7487M3524L9646
53382B309085L5922L2240K8844K5912K3081J9758J5782J1545P501L709j89m580
53370B508610r553j4989k0878k7296l4055m0603m6469n1622n6197n9936o2221
53359B084791o2689o1755o0448n9698n9628n9522n8539n6597n4422n2758n1659
53348A447076n0619m9214m7489m5821m4530m3573m2562m1132l9251l7091l4753
53337I71041l2320l0085k8286k6651k4614k2068j9457j7068j4663j2092r706p897
$$ plain form
53415 880167 903653 928821 955305 982788 1011378 1041612 1073862 1107820 1142886 1179126 1217442
53404 1217442 1258566 1302205 1347446 1393801 1441546 1491211 1543029 1596732 1651636 1706952 1762184
53393 1762184 1817102 1871235 1923829 1974740 2025051 2076109 2127829 2178428 2225915 2269439 2309085
53382 2309085 2345007 2377247 2406091 2432003 2455084 2474842 2490624 2502169 2509670 2513379 2513190 2508610
53370 2508610 2499057 2484068 2463190 2435894 2401839 2361236 2314767 2263145 2206948 2147012 2084791
53359 2084791 2022102 1960347 1899899 1840201 1780573 1721051 1662512 1605915 1551493 1498735 1447076
53348 1447076 1396457 1347243 1299754 1253933 1209403 1165830 1123268 1082136 1042885 1005794 971041
53337 971041 938721 908636 880350 853699 829085 807017 787560 770492 755829 743737 734031 726134
53325G26134o535n358m452l889l182j735K68J954K759L021L482M575O178P823
53311G31043R109J0065J1060J2306J3644J4927J6230J7465J8194J8393J8964K0844
53299I12244K3689K6148K7405K7810K8009K8146K8224K8501K9050K9334K8775
53288A217335K7459K5937K4438K2722K0632J8342J6061J3681J0906P649M184R64
53276A410310j759m085o279q473j0566j2405j3961j5445j7205j9379k1657k3522
53264A255574k4879k6200k7907k9791l1296l2141l2431l2362l2216l2446l3272
53253I20633l4177l4269l3247l1680l0235k8989k7636k6118k4787k4056k3987
53242F01452k4118k3768k2678k1315k0325j9803j9304j8478j7288j5671j3516
$$ plain form
53325 726134 719599 714241 709789 705900 702718 700983 701251 703205 705964 708985 712467 717042 723220 731043
53311 731043 740152 750217 761277 773583 787227 802154 818384 835849 854043 872436 891400 912244
53299 912244 935933 962081 989486 1017296 1045305 1073451 1101675 1130176 1159226 1188560 1217335
53288 1217335 1244794 1270731 1295169 1317891 1338523 1356865 1372926 1386607 1397513 1405162 1409346 1410310
53276 1410310 1408551 1404466 1398187 1389714 1379148 1366743 1352782 1337337 1320132 1300753 1279096 1255574
53264 1255574 1230695 1204495 1176588 1146797 1115501 1083360 1050929 1018567 986351 953905 920633
53253 920633 886456 852187 818940 787260 757025 728036 700400 674282 649495 625439 601452
53242 601452 577334 553566 530888 509573 489248 469445 450141 431663 414375 398704 385188
53231C85188j1105r173q196p922p779p490p055o443n627m809m281m076l961l830
53217B93441l897m396n190n733n537m641l562k773k406k376k615k947l058k862
53203B41448k704k943l461l822l811l535l152k821k763k990l110k853k534k544
53189A98405k576k025j090o75j037j379j095o96r96j858k371k023j174m63j91
53174A78756k37l61m80o83r37r66o61l84l86k27N86J476J280qr53o04K70M73N7
53155A76011j84j37k83n79n31j97j34l81m01r9ql68p52q58q77q70n13K19P55P39
53135A70552N31N22M51l0n61m28M02J178J227N96j76o00n42k08N9J22J82M19O97
53116A74393P29N20M07O18R66J109R67P39N38K00l88r76j222j183j246j516j680
$$ plain form
53231 385188 374083 364910 356714 348792 341013 333523 326468 320025 314398 309589 305308 301232 297271 293441
53217 293441 289544 285148 279958 274225 268688 264047 260485 257712 255306 252930 250315 247368 244310 241448
53203 241448 238744 235801 232340 228518 224707 221172 218020 215199 212436 209446 206336 203483 200949 198405
53189 198405 195829 193804 192714 192039 191002 189623 188528 187832 186836 184978 182607 180584 179410 178947 178756
53174 178756 178519 178158 177678 176995 176058 175092 174431 174047 173661 173434 174020 175496 176776 176768 175815 175211 175481 175954 176011
53155 176011 175827 175690 175407 174828 174297 174100 173966 173585 173184 173085 173077 172709 171957 171099 170222 169352 168839 169058 169813 170552
53135 170552 171083 171605 172056 172026 171465 171037 171439 172617 173844 174440 174264 173664 173122 172914 172973 173095 173277 173696 174393
53116 174393 175122 175642 176049 176667 177633 178742 179709 180448 180986 181186 180798 179822 178600 177417 176171 174655 172975
53099A72975j597j584j833j940j434n91j47l09n39l75K0K11N6k51m01j76L17O58
53081A63060N88M58P68J317J365O52k69q81j273j544j309m09M23K84o41j258r54
53064A60377k42N7k39p15r32p35j98M33Q15P32K43l47o51m67nK66J95J62N14J003
53044A60266J123Q57O07M27n0q10j244j080r75j654k800l406l015k057j060k09
53028A44920K99J56m31o13J46J240J555P94k42o87m47lL14N15N97L87j43o00m92
53009A47265J55P49P96M27N0k35m91n22j48J45l58j353j517l33R01P03m91r37
52991A44806j41M78k41j512j790q69J08L22Q0j0J46K84K48K8l03n09k77L65R34
52972A42147J014P79P27R56R51L30m54m61O18J987K594K239J604J306J314J249
$$ plain form
53099 172975 171378 169794 167961 166021 164587 163996 163849 163540 163001 162626 162646 162857 162913 162662 162261 162085 162402 163060
53081 163060 163648 164106 164874 166191 167556 168208 167939 167058 165785 164241 162932 162523 162946 163230 162589 161331 160377
53064 160377 160135 160192 159953 159238 158306 157571 157373 157806 158621 159353 159596 159249 158598 158131 158126 158392 158587 158749 159263 160266
53044 160266 161389 162246 162853 163280 163230 162420 161176 160096 159121 157467 154667 151261 148246 146189 145129 144920
53028 144920 145219 145375 144944 144331 144477 145717 147272 148066 147824 147137 146690 146687 147001 147516 148113 148500 148357 147757 147265
53009 147265 147420 148169 148965 149392 149442 149207 148716 148194 148046 148191 147833 146480 144963 144630 145531 146234 145743 144806
52991 144806 144665 145143 144902 143390 141600 140731 140839 141161 141241 141231 141377 141661 141909 141937 141634 141125 140848 141213 142147
52972 142147 143161 143940 144667 145623 146574 146904 146450 145989 146607 148594 151188 153427 155031 156337 157651 158900
52956A58900R57O05M10L60J69m37j274j735j534j242j615k506k982k565j789j333
52940A42389j221j184j269j543j604j027j08M08K67j04k98l37l50l22l02m60q00
52923A32135j017q46l93M3L54O82J186J779K141J971J259L36m18q20q84p16m15
52906A36377p1K66N12N51L95K84L52L41n1n98p14k77K01L10K41K93K97q8q42j540
52886A36239j661q66O58J967K029Q70m43j158j538j835j518k14J245J723J287
52871A36785Q71P60M74k1o8N66J331J794K111K383K375K135K139K502K705K393
52855A61235J858J401Q54K8q67j572k036k087j465m32K40K49J18J81p1j091k317
52838A54226k844k580k118j754j383j077j056j144r25m33j70l04l48J96J168J878
$$ plain form
52956 158900 159857 160462 160872 161232 161401 160964 159690 157955 156421 155179 153564 151058 148076 145511 143722 142389
52940 142389 141168 139984 138715 137172 135568 134541 134433 134841 135108 135004 134706 134369 134019 133697 133395 132935 132135
52923 132135 131118 130272 129879 129922 130276 130958 132144 133923 136064 138035 139294 139630 139212 138392 137508 136792 136377
52906 136377 136306 136572 137084 137635 138030 138314 138666 139007 138956 138358 137644 137367 137568 137878 138119 138412 138709 138621 137779 136239
52886 136239 134578 133712 134370 136337 138366 139236 138793 137635 136097 134262 132744 132530 133775 135498 136785
52871 136785 137656 138416 138890 138869 138801 139367 140698 142492 144603 146986 149361 151496 153635 156137 158842 161235
52855 161235 163093 164494 165348 165376 164509 162937 160901 158814 157349 156917 157157 157406 157524 157705 157634 156543 154226
52838 154226 151382 148802 146684 144930 143547 142470 141414 140270 139345 138912 138742 138438 138090 138286 139454 141332
52822A41332J814J086K54k83o23j008j275j043m08K8L2Q0N66J090J034M87J89
52805A43352O56J743K807L078K152M96q03j155j098j451k178k536k096j171l36
52790A41460o1m77j143j257o09q1n82j788k594k625k422k235j622n21K56J96O
52773A23901O88K061K964K722J858J291J254J189N49m56j005o11K14N03j8o49
52757A36455o82k09K30L95M09L12K3l44m80k23L04Q70J253J237P57J35j33J37
52739A40446O59J109J481J893K239K262J884J266N56j64o71o46r5M60N20K09K9
52722A53437J51K88K66K42J79l52j482k479k427j388l73j90p05j360j866k124
52706A39817j934j197l29J1l05o92n70p3K18Q7r9K5L24M26L06K56M09N88O87Q09
$$ plain form
52822 141332 143146 144232 144486 144203 143580 142572 141297 140254 139846 139874 139906 139986 140552 141642 142676 143163 143352
52805 143352 144008 145751 148558 151636 153788 154284 153481 152326 151228 149777 147599 145063 142967 141796 141460
52790 141460 141399 140922 139779 138522 137913 137832 137250 135462 132868 130243 127821 125586 123964 123443 123699 123895 123901
52773 123901 124589 126650 129614 132336 134194 135485 136739 137928 138477 138021 137016 136405 136619 137122 137104 136455
52757 136455 135773 135564 135794 136189 136598 136910 136933 136589 136109 135886 136190 137060 138313 139550 140307 140442 140309 140446
52739 140446 141105 142214 143695 145588 147827 150089 151973 153239 153795 153631 152960 152314 152219 152679 153199 153408 153437
52722 153437 153588 153876 154142 154384 154563 154211 152729 150250 147823 146435 146062 145872 145167 143807 141941 139817
52706 139817 137883 136686 136357 136368 136063 135371 134801 134728 134946 135033 134934 134959 135283 135709 136015 136271 136680 137268 137955 138764
52686A38764R33P59J96k95j82L89P09M22K9L14J342K259K148J020j77o04l96l35
52668A47295p71j280j329r03k58M27R38R12L09k57j60M27P99P09N43N76O48O99
52650A49324J104K117L329M012L838K973J748M49o63j503k287l216m005m007k923
52635A50290j306j94j87r33j557j486q63j68L71R06J556K117K252J918J453J171
52619A55340J012P10K48j31m24r76j796k138j357o5L85l59j076o66L45N86k57
52602A49381j149j159m11M28R70J145R85O50M15M18N42O44O66N90M12K09M1j35
52584A54642k22M9N90P19%q83q17K83J403J825J753J430O32n31j229r58l34r9
52566A58253l4L50O42J53o82o58L92J284J123L57k06n58j113j763j984j573q70
$$ plain form
52686 138764 139697 140456 140652 140357 140175 140564 141273 141695 141724 142038 143380 145639 147787 148807 148630 148026 147630 147295
52668 147295 146524 145244 143915 143012 142754 143181 144119 145031 145340 145083 144923 145350 146149 146858 147401 147977 148625 149324
52650 149324 150428 152545 155874 159886 163724 166697 168445 168894 168231 166728 164441 161225 157220 153213 150290
52635 150290 148984 148790 148603 147670 146113 144627 143764 143596 143967 144873 146429 148546 150798 152716 154169 155340
52619 155340 156352 157062 157310 157179 156755 155779 153983 151845 150488 150423 150808 150449 149373 148707 149052 149638 149381
52602 149381 148232 147073 146662 147090 148060 149205 150190 150840 151255 151673 152215 152859 153525 154115 154527 154736 154777 154642
52584 154642 154420 154469 155059 155778 155778 154895 154078 154361 155764 157589 159342 160772 161404 160873 159644 158686 158352 158253
52566 158253 158219 158569 159211 159364 158682 158024 158416 159700 160823 161180 160974 160416 159303 157540 155556 153983 153113
52549A53113l41k61n49o82j18R63J683J576J224J358J693J307N1j173j537j148
52533A57159n77o5M54R09J012N46m13j438j887j390l29M42N43M52P34J200J215
52516A58567O20o2l04m3M90J006J290J340J447J824K231K257K000J909J983J653
52500A78208P42j16l78m43r90j844k182j760j215j072j091q15l19kj4j83l44m02
52482A65780k74j0J37rk19p0M97J061J216J048R41J048J178J166J156J384J818
52465A77848K173K236J965J402P16K91M42R20J096P55L50K19l5r22k080k534j859
52448A82983o69J32J29n86j679k631k923k465j729j256j102r21m58J41M60K64
52432A67690j11m0N71R97N70l45q00n89m41p78r92l91O93J323J200Q74Q90J187
$$ plain form
52549 153113 152772 152511 151962 151280 151162 152125 153808 155384 156608 157966 159659 160966 161017 159844 158307 157159
52533 157159 156582 156517 156971 157880 158892 159438 159025 157587 155700 154310 153981 154423 154966 155418 156152 157352 158567
52516 158567 159187 159125 158821 158778 159268 160274 161564 162904 164351 166175 168406 170663 172663 174572 176555 178208
52500 178208 178950 178834 178456 178013 177023 175179 172997 171237 170022 168950 167859 167044 166725 166723 166709 166526 166182 165780
52482 165780 165506 165496 165633 165624 165405 165335 165832 166893 168109 169157 170098 171146 172324 173490 174646 176030 177848
52465 177848 180021 182257 184222 185624 186340 186631 187073 187993 189089 189844 190194 190413 190378 189456 187376 184842 182983
52448 182983 182314 182446 182575 181989 180310 177679 174756 172291 170562 169306 168204 167283 166825 166966 167426 167690
52432 167690 167579 167539 168110 169107 169677 169332 168532 167943 167502 166724 165732 165341 166034 167357 168557 169431 170321 171508
52414A71508J379J251Q99O09N89P25P58P49J099J924K741L131L348L816M281M089
52398B02896L203K277J645Q85l80j784k684k978k977k788k288j588j070q66o87
52383A90816k99P3L0m20p63n45J22P31J019J201J532J842J746J266R16J101J641
52366B02009K061K072J687J019K99j17j3L21L67l4n51q83j069j175j037n69j01
52349B04286k9k48k76R0N67Q73J049J179J081N72j18m17nQ49J504J589J389J529
52331B15464K195K883L143L319M100N348O077N695M790M312M472M896N416O047
52317B78157O436O093N130M199L632L178K654K293K207K051J522Q91O66R00J182
52302C21191J230J230J540K129K513K345J999K186K897L208K468J271O45N78J50
$$ plain form
52414 171508 172887 174138 175037 175646 176235 176960 177718 178467 179566 181490 184231 187362 190710 194526 198807 202896
52398 202896 206099 208376 210021 210906 210526 208742 206058 203080 200103 197315 195027 193439 192369 191503 190816
52383 190816 190517 190590 190620 190200 189437 188892 189014 189745 190764 191965 193497 195339 197085 198351 199267 200368 202009
52366 202009 204070 206142 207829 208848 209147 209030 209017 209338 209705 209671 209120 208237 207168 205993 204956 204387 204286
52349 204286 204257 204009 203733 203823 204390 205263 206312 207491 208572 209144 209026 208609 208604 209453 210957 212546 213935 215464
52331 215464 217659 220542 223685 227004 231104 236452 242529 248224 253014 257326 261798 266694 272110 278157
52317 278157 284593 290686 295816 300015 303647 306825 309479 311772 313979 316030 317552 318443 319109 320009 321191
52302 321191 322421 323651 325191 327320 329833 332178 334177 336363 339260 342468 344936 346207 346852 347430 347580
52287C47580r27j773j586p24j04o3k42j77L61J337K374K923K773K277J876J740
52271C57645J906K424L099L432L134K528K210K495L206L784L630K786K113K225
52257C96617K406J511l4l35J363L417L941L248K988L719M661N312N813N882M884
52242D45393L116J767J316J041M53J07N51J396K046K542L037L166K617J869J665
52227D72082K089K688L177L520L611L398L140L112L203L184L139L314L675L953
52213E17285M015L924L794L755L922M187M262M075L914L993M122M013L702L438
52199E72401L381L500L540L071J962R31R56J951K598J977P73K54N99J053J316
52184F00263J822K601K857K027O33l32n35m67q19j829l125m053m300m241m489
$$ plain form
52287 347580 346653 344880 343294 342570 342466 342403 342161 341984 342345 343682 346056 348979 351752 354029 355905 357645
52271 357645 359551 361975 365074 368506 371640 374168 376378 378873 382079 385863 389493 392279 394392 396617
52257 396617 399023 400534 400500 400165 401528 404945 408886 412134 415122 418841 423502 428814 434627 440509 445393
52242 445393 448509 450276 451592 452633 453086 453193 453744 455140 457186 459728 462765 465931 468548 470417 472082
52227 472082 474171 476859 480036 483556 487167 490565 493705 496817 500020 503204 506343 509657 513332 517285
52213 517285 521300 525224 529018 532773 536695 540882 545144 549219 553133 557126 561248 565261 568963 572401
52199 572401 575782 579282 582822 585893 587855 588786 589742 591693 594291 596268 597041 597295 597894 598947 600263
52184 600263 602085 604686 607543 609570 610203 609871 609336 608869 608050 606221 603096 599043 594743 590502 586013
52169E86013n079n351m723l406k225j869k252k530j842k28J344J998J883J778
52155E63511K069K470K605K317J520K89q76j434j482j517j436n63J110K526K867
52140E73976K661K836L248K957J714K43q80j743k333k084p51Q65J613J293Q02
52125E84417J139K535M481O332P840R288J1025J2830J3884J3622J2434J1325J0863
52112G02015J0670R947Q264N856L334J221m06j931l739n643o941p112o416n594
52098G03525n040m433l271j599q5O62P00O66J092J925K670K900K437J217o98k892
52082F99776m625n345n154m564l902l081j967o96L90R58Q40J48o46j023q63m84
52066F69762j36K59P61J055Q26K57k02n40j127j979k508k259j598j294j629k211
$$ plain form
52169 586013 580934 575583 570860 567454 565229 563360 561108 558578 556736 556508 557852 559850 561733 563511
52155 563511 565580 568050 570655 572972 574492 574781 573905 572471 570989 569472 568036 567473 568583 571109 573976
52140 573976 576637 579473 582721 585678 587392 587635 586755 585012 582679 580595 579844 580709 582322 583615 584417
52125 584417 585556 588091 592572 598904 606744 616032 627057 639887 653771 667393 679827 691152 702015
52112 702015 712685 722632 730896 736752 740086 741307 740901 738970 735231 729588 722647 715535 709119 703525
52098 703525 698485 694052 690781 689182 689097 689759 690459 691125 692217 694142 696812 699712 702149 703366 702668 699776
52082 699776 695151 689806 684652 680088 676186 673105 671138 670442 670832 671790 672630 672778 672132 671109 670246 669762
52066 669762 669626 669885 670646 671701 672527 672784 672582 672042 670915 668936 666428 664169 662571 661277 659648 657437
52050F57437k538k414j893j171o55q25j743k837l325k931k160j829k361l410m268
52035F23077m496m206l639k797j615l31O74J320J837K311K553K543K610K975L374
52020F26190L360K851K065J158K73k45o3O06J105J026O39M49N48N21j26j575l602
52003F35180n753p577q791r279r219r168r754j0930j1831j1777j1290j1441j2226
51990E06144j2349j0980r008p909p829p670o808n820n367n222m873m421m289m409
51976D09190m377m265m597n451o174o218n838n587n473n018m011k752j584n58
51962C47287M09J391K640M465O724Q654R574R534R009Q206P029N608M293L164
51948D27987J999P63k74j068j875k578k438r27J463L723N414O909Q591J0375J1966
$$ plain form
52050 657437 654899 652485 650592 649421 648766 647941 646198 643361 640036 637105 634945 633116 630755 627345 623077
52035 623077 618581 614375 610736 607939 606324 605993 606667 607987 609824 612135 614688 617231 619841 622816 626190
52020 626190 629550 632401 634466 635624 635897 635652 635589 636195 637300 638326 638965 639414 639962 640483 640357 638782 635180
52003 635180 629427 621850 613059 603780 594561 585393 575639 564709 552878 541101 529811 518370 506144
51990 506144 493795 482815 473807 465898 458069 450399 443591 437771 432404 427182 422309 417888 413599 409190
51976 409190 404813 400548 395951 390500 384326 378108 372270 366683 361210 356192 352181 349429 347845 347287
51962 347287 347696 349087 351727 356192 362916 371570 381144 390678 399687 407893 414922 420530 424823 427987
51948 427987 429986 430749 430475 429407 427532 424954 422516 421589 423052 426775 432189 439098 447689 458064 470030
51933D70030J3159J3779J3640J2755J1365R651P562N078K396l17l262o807j0807
$$ plain form
51933 470030 483189 496968 510608 523363 534728 544379 551941 557019 559415 559098 555836 549029 538222
$$ [...]
##END NTUPLES=NMR SPECTRUM
##END=
