##TITLE=AC1504_CUNCR13311_8126415_M5UcxKlBcI
##JCAMPDX= 6.0         $$ Bruker NMR JCAMP-DX V2.0
##DATA TYPE= NMR SPECTRUM
##DATA CLASS= NTUPLES
##ORIGIN= BRUKER
##OWNER= Administrator
$$ 1.72 TOPSPIN		Version 2.1
$$ 2013-08-15 21:25:52.190 -0700  Administrator@X
$$ Compression mode = diff/dup
##.OBSERVE FREQUENCY= 400.02188249412
##.OBSERVE NUCLEUS= ^1H
##.ACQUISITION MODE= SIMULTANEOUS (DQD)
##.ACQUISITION SCHEME= undefined
##.AVERAGES= 8
##.DIGITISER RES= 22
##SPECTROMETER/DATA SYSTEM= spect
##.PULSE SEQUENCE= zg30
##.SOLVENT NAME= COFFEE_meoh
##.SHIFT REFERENCE= INTERNAL, COFFEE_meoh, 1, 14.98509
##AUDIT TRAIL= $$ (NUMBER, WHEN, WHO, WHERE, PROCESS, VERSION, WHAT)
$$ ##TITLE= Audit trail, TOPSPIN		Version 2.1
$$ ##JCAMPDX= 5.01
$$ ##ORIGIN= Bruker BioSpin GmbH
$$ ##OWNER= Administrator
$$ $$ E:\/data/COFFEE/nmr/AC1504_CUNCR13311_8126415_M5UcxKlBcI/10/pdata/1/auditp.txt
$$ ##AUDIT TRAIL=  $$ (NUMBER, WHEN, WHO, WHERE, PROCESS, VERSION, WHAT)
(   1,<2013-08-15 21:25:45.455 -0700>,<Administrator>,<X>,<go>,<TOPSPIN 2.1>,
      <created by zg
	started at 2013-08-15 21:24:36.799 -0700,
	POWCHK enabled, PULCHK disabled,
       configuration hash MD5:
       C8 4E 4E 5D D3 5C D8 9E 9F 52 82 E0 59 8A DE 15
       data hash MD5: 64K
       AD 08 2B 54 1A FB C7 98 C7 30 96 57 06 C7 9B F2>)
(   2,<2013-08-15 21:25:48.330 -0700>,<Administrator>,<X>,<proc1d>,<TOPSPIN 2.1>,
      <Start of raw data processing
       efp LB = 0 FT_mod = 6 PKNL = 1 PHC0 = 0 PHC1 = 0 SI = 32K 
       data hash MD5: 32K
       8F E2 2C 8A 9E EB 62 B2 37 57 55 49 D2 FE 7D 74>)
(   3,<2013-08-15 21:25:48.627 -0700>,<Administrator>,<X>,<proc1d>,<TOPSPIN 2.1>,
      <pk PHC0 = 97.82776 PHC1 = 0 
       data hash MD5: 32K
       A3 AE D6 3C 69 E1 D3 3B 04 9B 47 C3 0C A2 80 23>)
(   4,<2013-08-15 21:25:48.815 -0700>,<Administrator>,<X>,<proc1d>,<TOPSPIN 2.1>,
      <abs ABSG = 1 
       data hash MD5: 32K
       35 87 C5 49 99 0B F1 63 F6 4D 90 65 0E C6 86 A9>)
(   5,<2013-08-15 21:25:48.908 -0700>,<Administrator>,<X>,<proc1d>,<TOPSPIN 2.1>,
      <abs ABSG = 2 
       data hash MD5: 32K
       FE 37 36 14 88 E4 36 A6 72 B5 B8 5D 62 26 EF D2>)
(   6,<2013-08-15 21:25:48.955 -0700>,<Administrator>,<X>,<proc1d>,<TOPSPIN 2.1>,
      <abs ABSG = 3 
       data hash MD5: 32K
       6E 0E 66 3B E0 AC 54 30 63 F5 D1 FF 34 9F 80 A6>)
(   7,<2013-08-15 21:25:49.065 -0700>,<Administrator>,<X>,<proc1d>,<TOPSPIN 2.1>,
      <abs ABSG = 4 
       data hash MD5: 32K
       AC A8 3B 8F D6 0A C6 37 35 27 77 8B E6 8B C4 DC>)
(   8,<2013-08-15 21:25:49.112 -0700>,<Administrator>,<X>,<proc1d>,<TOPSPIN 2.1>,
      <abs ABSG = 5 
       data hash MD5: 32K
       E6 C5 1C D2 A0 FC 4E 72 D7 34 DF A1 E6 DC 9E 47>)
$$ ##END=
$$ 
$$ $$ hash MD5
$$ $$ 2D 3C AD 8E F3 4C E4 2A 71 FF EA 0D D1 7B F5 88
##$RELAX= 
##$RELAX= 
##$RELAX= 
##$RELAX= 
##$RELAX= 
##$RELAX= 
##$RELAX= 
$$ Bruker specific parameters
$$ --------------------------
##$DU= <E:\>
##$EXPNO= 10
##$NAME= <AC1504_CUNCR13311_8126415_M5UcxKlBcI>
$$ [...]
##$TP= (0..7)
150 150 150 150 150 150 150 150
##$TP07= 0
##$TPNAME0= <>
##$TPNAME1= <>
##$TPNAME2= <>
##$TPNAME3= <>
##$TPNAME4= <>
##$TPNAME5= <>
##$TPNAME6= <>
##$TPNAME7= <>
##$TPOAL= (0..7)
0.5 0.5 0.5 0.5 0.5 0.5 0.5 0.5
##$TPOFFS= (0..7)
0 0 0 0 0 0 0 0
##$TUNHIN= 0
##$TUNHOUT= 0
##$TUNXOUT= 0
##$USERA1= <user>
##$USERA2= <user>
##$USERA3= <user>
##$USERA4= <user>
##$USERA5= <user>
##$V9= 5
##$VALIST= <valist>
##$VCLIST= <CCCCCCCCCCCCCCC>
##$VD= 0
##$VDLIST= <DDDDDDDDDDDDDDD>
##$VPLIST= <PPPPPPPPPPPPPPP>
##$VTLIST= <TTTTTTTTTTTTTTT>
##$WBST= 1024
##$WBSW= 4
##$XGAIN= (0..3)
0 0 0 0
##$XL= 0
##$YL= 0
##$YMAX_a= 651689
##$YMIN_a= -555345
##$ZGOPTNS= <>
##$ZL1= 120
##$ZL2= 120
##$ZL3= 120
##$ZL4= 120
##$ABSF1= 14.98509
##$ABSF2= -5.573092
##$ABSG= 5
##$ABSL= 3
##$ALPHA= 0
##$AQORDER= 0
##$ASSFAC= 0
##$ASSFACI= 0
##$ASSFACX= 0
##$ASSWID= 0
##$AUNMP= <proc_prof1d_extract_pilot.lims>
##$AXLEFT= 0
##$AXNAME= <>
##$AXNUC= <1H>
##$AXRIGHT= 0
##$AXTYPE= 0
##$AXUNIT= <>
##$AZFE= 0.1
##$AZFW= 0.1
##$BCFW= 0
##$BC_mod= 0
##$BYTORDP= 0
##$COROFFS= 0
##$CY= 15
##$DATMOD= 1
##$DC= 0
##$DFILT= <>
##$DTYPP= 0
##$F1P= 0
##$F2P= 0
##$FCOR= 0.5
##$FTSIZE= 32768
##$FT_mod= 6
##$GAMMA= 0
##$GB= 0
##$INTBC= 1
##$INTSCL= 1
##$ISEN= 128
##$LB= 0
##$LEV0= 0
##$LPBIN= 0
##$MAXI= 10000
##$MC2= 0
##$MEAN= 0
##$ME_mod= 0
##$MI= 0
##$NCOEF= 0
##$NC_proc= -8
##$NLEV= 6
##$NOISF1= 0
##$NOISF2= 0
##$NSP= 0
##$NTH_PI= 0
##$NZP= 0
##$OFFSET= 14.98509
##$PC= 1
##$PHC0= 97.82776
##$PHC1= 0
##$PH_mod= 1
##$PKNL= yes
##$PPARMOD= 0
##$PPDIAG= 0
##$PPIPTYP= 0
##$PPMPNUM= 2147483647
##$PPRESOL= 1
##$PSCAL= 4
##$PSIGN= 0
##$PYNMP= <proc.py>
##$REVERSE= no
##$SF= 400.02
##$SI= 32768
##$SIGF1= 0
##$SIGF2= 0
##$SINO= 400
##$SIOLD= 32768
##$SPECTYP= <>
##$SREGLST= <1H.CDCl3>
##$SSB= 0
##$STSI= 32768
##$STSR= 0
##$SW_p= 8223.68421052631
##$SYMM= 0
##$S_DEV= 0
##$TDeff= 65536
##$TDoff= 0
##$TI= <>
##$TILT= no
##$TM1= 0
##$TM2= 0
##$TOPLEV= 0
##$USERP1= <user>
##$USERP2= <user>
##$USERP3= <user>
##$USERP4= <user>
##$USERP5= <user>
##$WDW= 1
##$XDIM= 32768
##$YMAX_p= 455555554
##$YMIN_p= -685929
##$CURPLOT= <Network HP LaserJet P1505>
##$CURPRIN= <$Network HP LaserJet P1505>
##$DFORMAT= <normdp>
##$LAYOUT= <+/1D_H.xwp>
##$LFORMAT= <normlp>
##$PFORMAT= <normpl>
##$SURQMSG= 1
$$ End of Bruker specific parameters
$$ ---------------------------------
##NTUPLES= NMR SPECTRUM
##VAR_NAME=  FREQUENCY,     SPECTRUM/REAL,   SPECTRUM/IMAG
##SYMBOL=    X,             R,               I
##VAR_TYPE=  INDEPENDENT,   DEPENDENT,       DEPENDENT
##VAR_FORM=  AFFN,          ASDF,            ASDF
##VAR_DIM=   32768,         32768,           32768
##UNITS=     HZ,            ARBITRARY UNITS, ARBITRARY UNITS
##FACTOR=    0.250966925370066, 1,           1
##FIRST=     8223.43324360094, -153480,      20831
##LAST=      0,             -48826,          126388
##MIN=       0,             -685929,         0
##MAX=       8223.43324360094, 455555554,    0
$$ Real data points
##PAGE= N=1
##DATA TABLE= (X++(R..R)), XYDATA
$$ [...]
19550h4806D1971i2773A03893c49257h1477j65998b1155C253J94669a92531j66409
19539c58940d2547B90392a37118a3255j12205k27977P7239M3735j96604d6503
19528A10666b66788b0555j67859A46880A9395b4410J288j5457B18553C6917b14114
19516C6793N1131Q2340c19018a34904D9711b27002M5385F120O2505K8142b95724
19504e23822A26335a82176K9355C11292b06094i6717I693d3700A02409d9504k54018
19493c03522e4024a8314A53693b23956a05218p7487j03454a42245C7611a99904
19482A68814d1501l86828B07442b17190f6678b8745j73749H5541h2561q4510D913
19470d8931k7903B7417b43242P7661C97292B1763g3854A2517J22572d7911I1730
$$ plain form
19550 -84806 41971 -92773 103893 -349257 -81477 -247475 -21155 3253 197922 -192531 -358940
19539 -358940 -42547 290392 -137118 -13255 -125460 -353437 -276198 -232463 -429067 -46503
19528 110666 -266788 -20555 -188414 146880 19395 -24410 -23122 -38579 218553 36917 -214114
19516 36793 87924 170264 -319018 -134904 49711 -227002 -181617 6120 68625 96767 -295724
19504 -523822 126335 -182176 -152821 311292 -206094 -96717 9693 -43700 102409 -49504 -303522
19493 -303522 -54024 -18314 153693 -223956 -105218 -182705 -286159 -142245 37611 -199904
19482 168814 -41501 -428329 207442 -217190 -66678 -28745 -202494 85541 -82561 -167071 4913
19470 -48931 -76834 27417 -243242 -165581 397292 21763 -73854 12517 135089 -47911 91730
19458B40746j2893j10419N1320K65066L976E5303g0862d927j33853r1926A76001
19446a68601J3343r0335j19766a76866N9645l8458A15232b92094A65615J00109
19436B65724C8896c13148H4535m2263f0666A28923l1830a59719a0124j51133k2389
19425a83646H0387d1102o085H8842J49781C3371b2427p5325b8698E2441O1388
19414A13829o456g1300K9718m90753K19491C16794j23124a43647E3706c4406D3032
19402a77357B36596C4678J50342l6297a38912e5777G25b41731e8027B79441i8208
19390H4198d31740J42133M5902M9508M6719o3899I4937a72489j41322B39241B3069
19378B7541a81659A67378a58683p4063j20537J75256G7130Q4230g2379k81902
$$ plain form
19458 240746 227853 117434 168754 433820 437796 55303 -70862 -4927 -138780 -230706 176001
19446 -168601 -155258 -245593 -365359 -176866 -117221 -155679 115232 -292094 165615 265724
19436 265724 38896 -313148 84535 42272 -60666 128923 97093 -159719 -10124 -161257 -183646
19425 -183646 80387 -41102 -47187 88842 238623 33371 -22427 -97752 -28698 52441 113829
19414 113829 107373 -71300 -41582 -532335 -312844 316794 193670 -143647 53706 -34406 43032
19402 -177357 236596 34678 185020 148723 -138912 -55777 725 -241731 -58027 279441 -98208
19390 84198 -431740 -289607 -243705 -194197 -147478 -211377 94937 -172489 -313811 239241 23069
19378 27541 -181659 167378 -158683 -232746 -353283 -178027 77130 161360 -72379 -354281
19368c54281a03070k0003c8866j08742N4913H8309a65086A46075c21144A6038
19357d2561l35382e6222n8727j99561d8644B98437A02576k6078d0707a1794B11826
19345a80057l9549c6634r2809n2459g7656D3716b42127N625A23978c811B01683
19333c21962A82719c62803I7104b1686A19982b38239l25849b44664a07348H7414
19322c04740n5845a44045n5614E1722a41785D50730a74204c606k12839a05513
19311A67368n6482c45342e1742C1119K36226G7095J2380a89471A49808i1702B557
19299A29195a39731D5356J49297a94487j5545N8893j78167A70079g7412A05246
19288g6380j34956a4753o7062o579j69339J07479m49071b47849E1052c96475g749
$$ plain form
19368 -354281 -103070 -123073 -38866 -147608 -92695 88309 -165086 146075 -321144 16038
19357 -42561 -377943 -56222 -114949 -314510 -48644 298437 102576 76498 -40707 -11794 211826
19345 -180057 -219606 -36634 -129443 -181902 -77656 43716 -242127 -236502 123978 -3811 201683
19333 -321962 182719 -362803 97104 -21686 119982 -238239 -564088 -244664 -107348 87414
19322 -304740 -360585 -144045 -199659 51722 -141785 450730 -174204 -3606 -216445 -105513
19311 167368 110886 -345342 -51742 31119 267345 77095 89475 -189471 149808 -91702 2557
19299 129195 -139731 45356 194653 -194487 -210032 -151139 -329306 170079 -77412 105246
19288 -76380 -211336 -14753 -81815 -88394 -257733 -150254 -599325 -247849 51052 -396475 -7749
19276I6175k7695a30734m7307A02544R5437a43189A95449b80888h683j78551D8746
19264A7565a08267c3870j75892g6365b8437n2693A2403J26048b34663R9392B44173
19252H5883L1797e7569A36769M969i0504j06644f3449A192b53607a02399A17405
19240B75618e016A0889b1988F4516f7464M102l84307H7887a65680O7698D01170
19228g7585A42683d55982C2086b63075n3962d5235m36970a95776p846l0451R989
19217b24084I1741j9086J50076G9644b88886J20467l0080A08295E0224i8008A85546
19205I2672C633h4483K1428M166j82097G079a16766I3144h0909j73313B58961
19193C9710K9307a99548h0339C7332a43939m984n1354B4609b50721e0053p8001
$$ plain form
19276 96175 68480 -130734 -178041 102544 197981 -143189 195449 -280888 -8683 -187234 48746
19264 17565 -108267 -33870 -209762 -76365 -28437 -81130 12403 138451 -234663 -135271 244173
19252 85883 117680 -57569 136769 141738 -90504 -197148 -63449 1192 -253607 -102399 117405
19240 275618 -5016 10889 -21988 64516 -67464 -63362 -447669 87887 -165680 -97982 401170
19228 -77585 142683 -455982 32086 -263075 -317037 -45235 -482205 -195776 -203622 -234073 -224084
19217 -224084 91741 72655 222731 79644 -288886 -168419 -198499 108295 50224 -98008 185546
19205 92672 3633 -84483 -63055 -58889 -240986 7079 -116766 93144 -80909 -254222 258961
19193 39710 69017 -199548 -80339 37332 -143939 -148923 -200277 24609 -250721 -50053 -128054
19182a28054B2076b28281r6988B94831I9188K2308a84727J5954j77706C78920
19171g7522E9302J42468h2240k75492A1626J46887g8733J9543A54722b77624P1352
19160b06272m0477m9896G112b47159f9274K8159A65686G7288O6089B1526K4495
19149D6021a91612I8502a15442j36686J10636A24136L98l2781a72208g5560G4447
19137a28494M0494C02089A4634K24896j19287a45003D0242R7805E6308J68210
19127B24518c4558A51127N7843b57072i3257l31778F1756a14115M9763p4868A45920
19115E606K15298c16759E4304a16853j60024B9341b5589j98543A412c7830j01139
19104a38969o3864j99067A15762L1350M6458c75377J79583B06853C5961j4910
$$ plain form
19182 -128054 22076 -228281 -325269 294831 99188 121496 -184727 -168773 -346479 378920
19171 -77522 59302 201770 -82240 -357732 11626 158513 -78733 -59190 154722 -277624 -206272
19160 -206272 -246749 -296645 7112 -247159 -69274 -41115 165686 77288 143377 21526 46021
19149 46021 -191612 98502 -115442 -252128 -141492 124136 124534 91753 -172208 -75560 74447
19137 -128494 -88000 302089 14634 239530 120243 -145003 40242 138047 56308 224518
19127 224518 -34558 151127 208970 -257072 -93257 -425035 61756 -114115 -64352 -139220 145920
19115 5606 220904 -316759 54304 -116853 -276877 29341 -25589 -224132 1412 -37830 -138969
19104 -138969 -202833 -401900 115762 147112 193570 -375377 -195794 206853 35961 21051
19094B1051N2604a21404E1096J50785a94888A469P5153R0493g2834j8638l10329
19083d01801J3762J42875B9893O7293J18081j00248f0409M02A03594c14474J12675
19072b01799j20977f4463l095n2003o4261q5716A5498b20685h5661j17342c9664
19060A89034c30252F7083a3420j28740l3328C6812b41181O6218B73072a74799
19049E8268Q6491a21104F362a26221i747C1869r007J2523L6159b95497J4798A09703
19036b21736A51565b58863N7275I8772a17202H0676c3889B01171E679J17926j79
19025A23426b10084B64692e5656l4781b5894A72954a80317A85409d5185A87851
19014A86753E4946i7865D29780a07955M1619j56815f7209j62128D7345c58882
$$ plain form
19094 21051 73655 -121404 51096 201881 -194888 1469 76622 167115 -72834 -91472 -401801
19083 -401801 -388039 -245164 29893 97186 215267 115019 -60409 -60007 103594 -314474 -201799
19072 -201799 -322776 -64463 -67558 -119561 -183822 -269538 15498 -220685 -85661 -203003 -39664
19060 189034 -330252 67083 -13420 -142160 -175488 36812 -241181 -174963 273072 -174799
19049 58268 144759 -121104 6362 -126221 -9747 31869 22862 35385 71544 -295497 -280699 109703
19036 -221736 151565 -258863 -201588 98772 -117202 80676 -33889 201171 5679 123605 123426
19025 123426 -210084 264692 -55656 -90437 -25894 172954 -180317 185409 -45185 187851
19014 186753 54946 -97865 429780 -107955 -66336 -223151 -67209 -229337 47345 -358882
19003B13486h3393B15561G6027b45232f6184l610a5981B18798I4144a52869I2824
18991a4746q3820k14476d9210q4593a0515A80628b63672D9596a38310A87151b03429
18979a71728P1868l5260F5609d10471a46704d8844j28461f0669j69664e7474A02360
18967F2238P2847l5668c2247A536B67a71333Q1262A34666b57803J05734J7434
18956a34635a8823Q337A24401c03300c9297B66346b05886j08240i1714A44251
18945B30931b73021g8738D7646g2289a0446k04158R4166Q81B81898a97316A71954
18933a29685m3667K2963P1408o521k7861B48549K4146B6731a72733A25322E3260
18921f2592C02951A01524J4819c9667k46212L7264A19233c0800k37565B5787g0725
$$ plain form
19003 213486 -83393 215561 76027 -245232 -66184 -69794 -15981 218798 94144 -152869 92824
18991 -14746 -98566 -313042 -49210 -133803 -10515 180628 -263672 49596 -138310 187151 -203429
18979 -171728 -99860 -135120 65609 -410471 -146704 -48844 -177305 -60669 -230333 -57474 102360
18967 62238 135085 99417 -32247 1536 267 -171333 -90071 134666 -257803 -152069 -134635
18956 -134635 -18823 -10486 124401 -303300 -39297 266346 -205886 -314126 -91714 144251
18945 230931 -273021 -78738 47646 -72289 -10446 -214604 -120438 -119557 281898 -197316 171954
18933 -129685 -173352 -150389 -78981 -85502 -113363 248549 272695 26731 -172733 125322 53260
18921 -62592 302951 101524 116343 -39667 -285879 -248615 119233 -30800 -268365 25787 -70725
18909d2903A59950b07069h7912k2127B12175b21328M0332E1481a07105L6192o1525
18898a32438B04519b56626A89153a47594A71118G9703r440a18398B584a19312
18887a44720A49942C2924J1831c03292J5653h4959q3676a5229j40551o9379f1004
18875f9611b493n862p8646k28934M2446F917f3958O941I1591a9347k54882B08167
18862A34893b19038B07284F291d3953H0405J01597a26760e9380B66524a89589
18851g2820p2624B18489C5528d53378A35661d0365j27759A51552l8022A957a74369
18839f6833Q348k45612C0797K37304G4806e4945p6372d401k15956o8607H2733
18827a03484H6338L9793a21010J7451n6315j81014A51048J59157E6086O2538J01232
$$ plain form
18909 -42903 159950 -207069 -87912 -110039 212175 -221328 -180996 51481 -107105 -70913 -132438
18898 -132438 204519 -256626 189153 -147594 171118 79703 70263 -118398 2584 -119312
18887 -144720 149942 32924 44755 -303292 -287639 -84959 -168635 -15229 -155780 -225159 -61004
18875 -69611 -2493 -8355 -87001 -315935 -273489 6917 -63958 -57017 91591 -19347 -274229 208167
18862 134893 -219038 207284 6291 -43953 80405 182002 -126760 -59380 266524 -189589
18851 -72820 -145444 218489 35528 -453378 135661 -40365 -168124 151552 113530 1957 -174369
18839 -66833 -58485 -304097 30797 268101 74806 -54945 -131317 -4401 -220357 -288964 82733
18827 -103484 86338 126131 -121010 -103559 -159874 -340888 151048 310205 56086 118624 219856
18816B19856C2306g9580j76356I9593J73861l3170e7155p5238B31011I2159J9761
18805A11920g1675a7864k72162P4330Q2461I1382b48408i0612A0034P4127k3058
18794F1103e6465j06194O8728J8740o63A96349F799J9199K3433K8815a30192D6988
18781b57397I7592J9110b36251Q9567A64881g2076j3870C9618K1503K04488a38732
18769d8747j11121H3415A6525L2358J2658B6556e301j4350l56193A95627b46979
18757g7271A8057d02281a62669K2617l14185a2363B12739d1262k29322a30090
18746a16054a9224m41896f4707A2097a15658e4438C20111A22960a19446K6871
18736i2575D1693c16893A42258a19802d6579r8375A16559n6448P7185f6251D2684
$$ plain form
18816 219856 32306 -79580 -255936 99593 273454 240284 -57155 -132393 231011 92159 111920
18805 111920 -71675 -17864 -290026 -215696 -133235 91382 -248408 -90612 10034 84161 61103
18794 61103 -56465 -162659 -93931 -75191 -75854 196349 6799 25998 49431 78246 -130192 46988
18781 -257397 97592 116702 -236251 -146684 164881 -72076 -85946 39618 61121 265609 -138732
18769 -48747 -159868 83415 16525 48883 61541 26556 -5301 -19651 -375844 195627 -246979
18757 -77271 18057 -402281 -162669 -140052 -454237 -12363 212739 -41262 -270584 -130090
18746 -116054 -19224 -461120 -64707 12097 -115658 -54438 320111 122960 -119446 -92575
18736 -92575 41693 -316893 142258 -119802 -46579 -144954 116559 60111 137296 -66251 42684
18724h2872G0803d4514H1925J16227D4866b84654A3154c96248J41907B9033a01805
18712b24712j85601a48555A91490p0757k5172b14500b7821I0114a4674n79596
18702e94270a23781D0265e05183a48481j4162C46545a45755k1402M367B29915
18691A0480c07454B33597H5575a83578D4928b99381a44919A06892c3742I5338
18680A18082a51405M5481a9815D6389M1283d0628D4041M8182a50596B8834M9881
18669G8715A0415c08527I1602O6901e3467j76174J01622K5328A44926o1328b15458
18657a07345j32898b0157D0398d3283B16778A8108J1615a87360B89121A40596
18646a11515o1251F9218a65106h1240J5872B87252a05940j35881a9577j89165
$$ plain form
18724 -82872 70803 -44514 81925 198152 44866 -284654 13154 -396248 -254341 29033 -101805
18712 -224712 -410313 -148555 191490 120733 95561 -214500 -27821 90114 -14674 -594270
18702 -594270 -123781 40265 -505183 -148481 -162643 346545 -145755 -167157 -162790 229915
18691 10480 -307454 233597 85575 -183578 44928 -299381 -144919 106892 -33742 95338
18680 118082 -151405 -105924 -19815 46389 87672 -40628 44041 92223 -150596 28834 78715
18669 78715 10415 -308527 91602 158503 -53467 -229641 -128019 -102691 144926 83598 -215458
18657 -107345 -240243 -20157 40398 -43283 216778 18108 29723 -187360 289121 140596
18646 -111515 -172766 69218 -165106 -81240 -65368 287252 -105940 -241821 -19577 -208742
18636b08742K0049F9524C2846a07808j86994A06862a40921M9268C7739a57833
18625i5148B01304D6292b3016i821o7039k96218a14633M096A41353p0319I045
18613b53713i6034B21426a06395j84683I6965d1545J6122j76001f7337j15261
18603a82598J4893A036c4444D1988b23219A32150a11537B97952a5941B51277H0557
18591a07861C9784L17363d24388i2427l74687E1348a09963B16832C4460e3287
18580b38360D6973g4591l49712a56544r4510f9948L653A05768a48358A30131b27790
18568a65431A39150d44790a34505D598K73285a84457B7210b6967j95970b7699
18557b26003A83163B8877N3031b30648f9576j45106a284l28910b1432m70289K26568
$$ plain form
18636 -208742 -188693 69524 32846 -107808 -294802 106862 -140921 -91653 37739 -157833
18625 -95148 201304 46292 -23016 -9821 -76860 -373078 -114633 -110537 141353 71034 9045
18613 -253713 -96034 221426 -106395 -291078 96965 -41545 -25423 -201424 -67337 -182598
18603 -182598 -167705 1036 -34444 41988 -223219 132150 -111537 297952 -15941 251277 80557
18591 -107861 39784 357147 -424388 -92427 -467114 51348 -109963 216832 34460 -53287
18580 -238360 46973 -74591 -424303 -156544 -251054 -69948 -66295 105768 -148358 130131 -227790
18568 -165431 139150 -444790 -134505 4598 277883 -184457 27210 -26967 -222937 -27699
18557 -226003 183163 28877 81908 -230648 -69576 -214682 -1284 -330194 -21432 -491721 -265153
18546b65153A06525b6906O216i579k88727A48115d54661e5706l93356h8142l7650
18535a25792J0161k05791E0121a64359d2736C88669c26611A44571c74177f2959
18524f5052F9164K3858J49937q3975L17i6650A2855J4698K64705A9141i7145A25963
18511a00643B5263j1113a05606m0598H0074a15225b5896A95204p6102a40567A20560
18499C1566f7047B7232b25980C03947A5548b04569i2270l1544A65876E9124g2351
18487H2350a77052q000b2348B27831K29903d4204n2623L4697k29275R5601M3495
18476a52309O757J5769E831a75616A22911g1657m246G111J64560b73956a14054
18464a20838G1538a28138j30453A23696e2063A23080b21257a3498A21616B7955
$$ plain form
18546 -265153 106525 -26906 -20690 -9579 -298306 148115 -454661 -55706 -449062 -88142 -125792
18535 -125792 -115631 -321422 50121 -164359 -42736 388669 -326611 144571 -374177 -62959
18524 -65052 69164 93022 242959 158984 159301 -96650 12855 27553 292258 19141 -97145 125963
18511 -100643 25263 14150 -105606 -146204 80074 -115225 -25896 195204 119102 -140567 120560
18499 31566 -67047 27232 -225980 303947 15548 -204569 -92270 -123814 165876 59124 -72351
18487 82350 -177052 -185052 -22348 227831 457734 -44204 -96827 -62130 -291405 -195804 -152309
18476 -152309 -145552 -129783 5831 -175616 122911 -71657 -75903 7111 171671 -273956 -114054
18464 -120838 71538 -128138 -258591 123696 -52063 123080 -221257 -13498 121616 27955
18453h2224C27221A07899h9259B32317b27741a05709c89j96919P7576p9640A12444
18441A23638d81003d0969A04071E1090b7402E7916J44310Q770a8317C148L25494
18430C28642A35396e9633K482A89059a28104e4872B87631j38874b364m39151l2637
18419d74152B63979a61294a7747A6120b20918a3876k63092J28096A97092a45076
18408D1092R6551l6992J34053A05407j3353d6018j40914M2695k48346B90653c19954
18396I3462c15620J18464g2459A05481K1397E610a89916k889l7157n7009F1636
18384g6271B64584N384f2154p3983k5198l06738B32469b84842D336b63457a19681
18372a49468j77079B34315B3029c3273k73200h9033A71968a04163C47813d7776
$$ plain form
18453 -82224 327221 107899 -89259 232317 -227741 -105709 -389 -197308 -119732 -199372 112444
18441 123638 -481003 -40969 104071 51090 -27402 57916 202226 210996 -18317 3148 328642
18430 328642 135396 -59633 -57151 189059 -128104 -54872 287631 148757 -2364 -441515 -474152
18419 -474152 263979 -161294 -17747 16120 -220918 -13876 -276968 -148872 197092 -145076
18408 41092 137643 100651 234704 105407 92054 -46018 -186932 -144237 -392583 290653 -319954
18396 93462 -315620 -197156 -72459 105481 126878 5610 -189916 -192805 -229962 -286971 61636
18384 -76271 264584 269968 -62154 -136137 -161335 -468073 232469 -284842 4336 -263457 -119681
18372 -149468 -326547 234315 23029 -33273 -306473 -89033 171968 -104163 347813 -47776
18361a11450B29912a2503j01171j7501E6763a03444A61255i4744l96173R0587
18351d00330Q1960d370D10206f0563E815a37974j70528J11878F3359a99981A67387
18339A31680c2619B1443b52164G6065b61904m8245m0333F6085c8763l13740b0327
18327E5612c0905d124k6706m2775D33662E2595b40598A30658k924b10985b6286
18315b270k04540Q3201c3788l75749f7754k82568E0485a95275j20867F476O3557
18304G0033i7651j43861b7235C38120I5806b5907q7565D4294H803J8991K18059
18293B45853a70183B03686j00256m2492g6892C6792c3197l2043c98j08586B13720
18281a86878O5980B45993a28885K178j32380O2594L8007p6938L3284k7568N0851
$$ plain form
18361 -111450 229912 -12503 -113674 -131175 56763 -103444 161255 -94744 -490917 -400330
18351 -400330 -318370 -4370 410206 -60563 5815 -137974 -308502 -196624 63359 -199981 167387
18339 131680 -32619 21443 -252164 76065 -261904 -310149 -350482 66085 -38763 -352503 -20327
18327 55612 -30905 -4124 -30830 -73605 433662 52595 -240598 130658 127734 -210985 -26286
18315 -2270 -206810 -123609 -33788 -409537 -67754 -350322 50485 -195275 -316142 6476 70033
18304 70033 -97651 -241512 -27235 338120 95806 -25907 -113472 44294 8803 27794 245853
18293 245853 -170183 203686 103430 60938 -76892 36792 -33197 -65240 -398 -108984 213720
18281 -186878 -120898 245993 -128885 -126707 -259087 -196493 -158486 -235424 -202140 -229708 -178857
18270a78857n8102K9331H9601e6433A54078g3337j14800A78121H8672a24706P526
18259a17180E8108b40864b6384k44614d5093A7751N3204d9500B39239a25690C99865
18247a34933O241k8801p7940i0033m6443a1511B2392K39358g7375m119B04630
18235a70162M5678n6972L6582p0779c7192I6346J28075n4174a9907k16661J0491
18224b26077p4998C06629A05640e7852E1897k5131b86715C19203a89466A42476
18213a14473m0544m949o9031A49927f7628c2523n9255l58943a70104c523j22442
18202a25965m7059g5116k02874A62441p7015b99730d5601j47932a1746D61172
18191B35137K44107a24247k78145a73365C73247b91114J38882j01179a6815G7974
$$ plain form
18270 -178857 -236959 -207628 89601 -56433 154078 -73337 -188137 178121 88672 -124706 -117180
18259 -117180 58108 -240864 -26384 -270998 -45093 17751 70955 -49500 239239 -125690 399865
18247 -134933 -128692 -157493 -235433 -90033 -136476 -11511 22392 261750 -77375 -81494 204630
18235 -170162 -124484 -181456 -144874 -215653 -37192 96346 224421 170247 -19907 -236568 -226077
18224 -226077 -301075 306629 105640 -57852 51897 26766 -286715 319203 -189466 142476
18213 -114473 -155017 -159966 -228997 149927 -67628 -32523 -91778 -450721 -170104 -3523 -125965
18202 -125965 -173024 -75116 -277990 162441 85426 -299730 -45601 -193533 -11746 461172
18191 235137 479244 -124247 -402392 -173365 373247 -291114 -152232 -253411 -16815 77974
18180a24942B26492a53604C6335a73273A52232J75564A31189e4998D6885a00983
18169a08022j13374L8100A4022J83697b01449E7578a77383e4963A60193b85828
18158A97752a79696A03040P4821M35932a69049J7711G9210a49145f2370j24174
18148a86544c5229A15319c6296H9941b39914g3280c5978F1536J5593b30056L1688
18137a98368G7129a78374p1271E7483J04334c23035A16131b35062a00119l34528
18127d34647J60702g1849E3835Q1050D2364c11439J44529B33725g6155L6838I3777
18115d65B1145J3668K9728R1455G0538c83376A40250b17049A44315a53720j93932
18104c47652A46767k9940b93918E3723M2232i7134n5407E1706D362rb35594A12872
$$ plain form
18180 -124942 226492 -153604 36335 -173273 152232 327796 131189 -54998 46885 -100983
18169 -108022 -221396 -183296 14022 197719 -201449 57578 -177383 -54963 160193 -285828
18158 197752 -179696 103040 177861 613793 -169049 -151338 79210 -149145 -62370 -186544
18148 -186544 -35229 115319 -36296 89941 -239914 -73280 -35978 61536 77129 -230056 -198368
18137 -198368 77129 -178374 -249645 57483 161817 -323035 116131 -235062 -100119 -434647
18127 -434647 -273945 -71849 53835 134885 42364 -311439 -166910 233725 -76155 -39317 93777
18115 -465 21145 34813 64541 155996 70538 -383376 140250 -217049 144315 -153720 -347652
18104 -347652 146767 116827 -293918 53723 95955 -97134 -152541 51706 4362 4353 -235594 112872
18091f8293B50924r6940b64391B8091c01071I5191h1776m6676q8783E0630J22424
18080A73054a73177C3650g942j05959M822K7804B17185E7973d6677E5960f2393
18068a28819f420k3020O347A44961a28842A08309k8933G837a00005c233l0841
18057c4074j7029A10140d2890p3752c5017B21626I6322a59500o988i836j63202
18046a73038A54026j6508f3376k90090C9217a61641P5048H5137a03025B88290
18035i8874q939A36978D1362N8825c4986e492B37269H2916a14041H3234c26789
18023I8478b66836G4266l079i6076k7347B95899b07897A59440a76506C6620a67541
18011A55206h3572m065O373B65427A29619j0455a72176b3752G3683J5751J21019
$$ plain form
18091 -68293 250924 153984 -264391 28091 -301071 95191 -81776 -128452 -217235 50630 173054
18080 173054 -173177 33650 -7942 -113901 -109079 -81275 217185 57973 -46677 55960 -62393
18068 -128819 -6420 -29440 -23093 144961 -128842 108309 79376 7837 -100005 -3233 -34074
18057 -34074 -51103 110140 -42890 -116642 -35017 221626 96322 -159500 -166488 -9836 -173038
18046 -173038 154026 137518 -63376 -353466 39217 -161641 -86593 85137 -103025 288290
18035 -98874 -107813 136978 41362 100187 -34986 -5492 237269 82916 -114041 83234 -326789
18023 98478 -266836 74266 71187 -96076 -123423 295899 -207897 159440 -176506 36620 -167541
18011 155206 -83572 -87637 -81264 265427 129619 119164 -172176 -23752 73683 89434 210453
18000B10453a44490B3914a16966D7608f220j16112I3791J89054i4571j39583R9133
17989a35021A9242b08526H7338C3071J66501c012l17608A19222Q0122a20261j60045
17978b80306A31478B5759L2147c5059A12344m9607K48153a8348k57622G1347i7060
17966I3577b34878A04826h2164A45128J11191b80063F2805a03535B10300a73485
17955a0802k4438l1135J2803o5136A60964b5408k5947C0278c18292B78715h1129
17943c6434A96131l9945N0433a81992A33405m0487h8027A97691b50201e0757k1269
17932g2026j22982A82075C1397a63950o0076A09241a43808I285a14032N75K7240
17921h6217j04513B3760L7508a1148A20821R6655a4701k71714j27502C7945b13847
$$ plain form
18000 210453 -144490 23914 -116966 47608 -6220 -122332 93791 282845 -94571 -234154 -135021
17989 -135021 19242 -208526 87338 33071 199572 -3012 -320620 119222 199344 -120261 -280306
17978 -280306 131478 25759 57906 -35059 112344 62737 310890 -18348 -275970 71347 -97060
17966 93577 -234878 104826 -82164 145128 256319 -280063 62805 -103535 210300 -173485
17955 -10802 -35240 -66375 -53572 -118708 160964 -25408 -51355 30278 -318292 278715 -81129
17943 -36434 196131 156186 206619 -181992 133405 92918 -88027 197691 -250201 -50757 -72026
17932 -72026 -195008 182075 31397 -163950 -224026 109241 -143808 9285 -114032 -113457 -86217
17921 -86217 -190730 23760 61268 -11148 120821 217476 -14701 -286415 -413917 37945 -213847
17909A42666E8944c8782l76111b04269B42922b13336A91125m5594m9294a48339
17898C61852b19770A62212c44690M9462h7121b5113o8697d3671o1251A91251F7363
17886A12424Q9385J98775A97159a11071o825n4773A04719K24650c68402a54732
17875b90878c809j08759E9898n083a82253h2380J5284j59276j21330A70458C3861
17863E6957K60951e9959k24923G065Q2860a9148C5593N4504d29472D7941d65677
17851b31884G7328a64236C8220b24723P8608A62701a18794G42J10729a22137G2330
17839A53506a470j99331I7170O4768B6258J26086i6327M6698n8987B00818h7025
17827g9022k82017a24944L2077A7333J47352D0999b65702A69455A0332J08692
$$ plain form
17909 142666 58944 -38782 -414893 -204269 242922 -213336 191125 145531 96237 -148339
17898 361852 -219770 162212 -344690 -295228 -87121 -25113 -93810 -43671 -104922 191251 67363
17886 112424 201809 400584 197159 -111071 -117896 -172669 104719 329369 -368402 -154732
17875 -290878 -3809 -112568 59898 54815 -182253 -82380 -67096 -226372 -347702 170458 33861
17863 56957 317908 -59959 -284882 7065 89925 -19148 35593 90097 -429472 47941 -465677
17851 -231884 77328 -164236 38220 -224723 -146115 162701 -118794 742 111471 -122137 72330
17839 153506 -1470 -200801 97170 161938 26258 152344 -96327 -49629 -108616 200818 -87025
17827 -79022 -361039 -124944 -92867 17333 164685 40999 -265702 169455 10332 119024
17817A19024h4459A29042J02565a51678E3409K2452L0403a93l41663A75164C4798
17805I2625a45243A35349l6095P3540A556a00107l2785K0586j49705H7656b43296
17793a72673e1109q722j266l6733d3680J0553A92803e1194I7122g417j64739k31902
17781d04058a6638j73376H0441a96291A99311B5955J41242o0311M7099b302B18660
17769A90325O701F0967d40488A66736g8990k03875A54183A5057K78953A8652a67656
17757B73539D3183L0963B5874J43895O7586b65022A91876L957a26421B52662g0194
17745a20798l6218e9363o7400j74978J27623P1330m3735A04086i2435j34906b1294
17733B64650a42545A01971J84224A27793J05938C279i6082p8570H8133h4164J0737
$$ plain form
17817 119024 -84459 129042 231607 -151678 53409 75861 106264 -193 -341856 175164 34798
17805 92625 -145243 135349 99254 172794 1556 -100107 -132892 -112306 -262011 87656 -243296
17793 -172673 -51109 -59831 -61097 -97830 -43680 -33127 192803 -51194 97122 -7417 -172156 -404058
17781 -404058 -16638 -190014 80441 -196291 199311 25955 167197 106886 153985 -2302 218660
17769 190325 197026 60967 -440488 166736 -78990 -282865 154183 15057 294010 18652 -167656
17757 273539 43183 74146 25874 169769 237355 -265022 191876 195833 -126421 252662 -70194
17745 -120798 -157016 -59363 -126763 -301741 -174118 -102788 -146523 104086 -92435 -227341 -21294
17733 264650 -142545 101971 286195 127793 233731 3279 -96082 -174652 88133 -84164 -73427
17722g3427j10098I0425R9491E3413k0874J68652G7428f9394l24657A66605a72035
17710B16444E8332b20729D5562a08869d1048H9344k5583J08743a24832d6438A72850
17698A65928b75608b5150k26593J05518M4284K789b8414E9245a87432d3279A91777
17686B01455d82785B4003J78670b0866B2234N8620i7593j19672G901J92297a13570
17674A87126J08598D967M10037j78643d08673d009A98568f6530j5425b0643L116
17663a7527B41375h8589H2123h2437J5646h607j31053O761A35533b37918d1083
17651d5419k17025P4566m267A16855D7542K53399C7354J091J65311m6355c00884
17639a81309A85291H8295N3563M9273h398A42690C3162K10271g4396A46090j0659
$$ plain form
17722 -73427 -183525 90425 189916 53413 32539 201191 77428 -69394 -394051 166605 -172035
17710 216444 58332 -220729 45562 -108869 -41048 89344 63761 172504 -124832 -46438 172850
17698 165928 -275608 -25150 -251743 -146225 -101941 -99152 -28414 59245 -187432 -43279 191777
17686 201455 -482785 24003 202673 -20866 22234 80854 -97593 -217265 7901 200198 -113570
17674 187126 295724 4967 415004 236361 -408673 -4009 198568 -66530 -81955 -20643 -17527
17663 -17527 241375 -88589 82123 -82437 -66791 -8607 -139660 -132899 135533 -237918 -41083
17651 -45419 -262444 -187878 -192145 116855 47542 300941 37354 38445 203756 157401 -300884
17639 -181309 185291 88295 141858 191131 -8398 142690 33162 243433 -74396 146090 135431
17628A35431J16831k8963a13122B18057C481K0035c01014D2213h4204I651a23220
17616I961d9550D1144K57897G2400J43426c04910H5505c7021j2547A11176P0981
17605A82157a62779O9535A44954B1721L08336A55233b99277B12706d7761A48427
17594H0324N6898a10001L886C31943A58620o867a35473A94070a3556n0786A55833
17582b60039A51855A1277d36034A71672L7819J65074a4761A65033h9581B0769
17571b18787g1591I0976a54573A53344M906e52920a89696B49127j12379e2566
17560B71092I0468O618e42473c1021m0360F2468b3543p5512A13826L3763m1583
17549A06006B2170J12167a2573E9473L8781O9766i4072A19883D3782j4766J2207
$$ plain form
17628 135431 252262 223299 -113122 218057 3481 23516 -301014 42213 -84204 9651 -123220
17616 9961 -49550 41144 299041 72400 215826 -304910 85505 -37021 -49568 111176 182157
17605 182157 -162779 -93244 144954 21721 330057 155233 -299277 212706 -47761 148427
17594 80324 137222 -110001 -106115 331943 158620 151753 -135473 194070 -13556 -64342 155833
17582 -260039 151855 11277 -436034 171672 209491 374565 -14761 165033 -89581 20769
17571 -218787 -71591 90976 -154573 153344 158250 -552920 -189696 249127 136748 -52566
17560 271092 90468 97086 -542473 -31021 -71381 62468 -23543 -99055 113826 147589 106006
17549 106006 22170 134337 -12573 59473 98254 168020 -94072 119883 43782 29016 41223
17538D1223i0358A65084a22315h805B59797r9857n9138o886k2616a61026B04215
17526D94525A40557a72229C7356i2440o1758A06922i0992j1356B69762R2248A74738
17514B16101M3758p3183i579C59079i6718B07368D4941c228B0155O27327e1453
17502a22965A10107l7500P7638c6747C67118B6127L4669J76760G93a9788p1653
17491i1441A3989J80789d5548D46515g4662D24455H3888b1181C8725A2275J69946
17480A82221b0962C14542d5116I9908R0916F1524J25404N7412J24855b03106a4861
17468a10976B56834a10933G5762e6744j36212G2866a52973B22613a11467j64367
17458b75834D03103j36018G9956J50232r7510r447C0720L5312K33882K94106k78965
$$ plain form
17538 41223 -90358 165084 -122315 -8805 259797 159940 100802 93916 71300 -161026 204215
17526 494525 140557 -172229 37356 -92440 -154198 106922 -90992 -102348 269762 362010 174738
17514 216101 259859 186676 -9579 359079 -96718 207368 44941 -3228 20155 647482 -51453
17502 -122965 110107 72607 150245 -36747 367118 26127 60796 237556 793 -19788 -91441
17491 -91441 13989 194778 -45548 446515 -74662 424455 83888 -21181 38725 12275 182221
17480 182221 -20962 314542 -45116 99908 190824 61524 186928 244340 369195 -203106 -14861
17468 -110976 256834 -110933 75762 -56744 -192956 72866 -152973 222613 -111467 -275834
17458 -275834 403103 267085 79956 230188 132678 123231 30720 66032 299914 594020 315055
17447C15055K621Q7066A5836L47319A76395J23256C5002L81474A02525e0776C21228
17435A23340J83940n2303I8047J05640J42083N5543j63198A16129K5515J88726
17425C30370D9234L68307o9107A58633M93665J7803k75596j92503O587n651K54299
17414D57237r9343C3605K87771e8249D06248j96723H2500K27002j0415M1189B7750
17402b1747j32010E18459F1344K67649O360A130J37053K21378J52483A86001h9612
17390B73414A02586J66595N4304K0710e1978B9334O6042M20293j70798b29131
17379A93019q3010a44356E01808k45688a85499a2471D29915e1778C73404G8684
17368A55022o3795J17184l6886J62255c42590J33426A27512J41476A11495J9472
$$ plain form
17447 315055 317676 404742 15836 363155 176395 299651 35002 416476 102525 -50776 321228
17435 123340 307280 254977 98047 203687 345770 401313 238115 116129 141644 330370
17425 330370 49234 417541 348434 158633 652298 670101 394505 202002 208589 202938 457237
17414 457237 357894 33605 321376 -58249 406248 209525 82500 309502 299087 340276 27750
17402 -21747 -153757 518459 61344 328993 335353 1130 138183 359561 512044 186001 -89612
17390 273414 102586 269181 323485 344195 -51978 29334 95376 515669 344871 -229131
17379 193019 110009 -144356 501808 256120 -185499 -12471 429915 -51778 373404 78684
17368 155022 91227 208411 171525 333780 -342590 -209164 127512 268988 111495 130967
17358A30967b14902b3679B14462d3658r135j61300D6192J93102l9901D7780J2106
17347E9886O6107K9140L91688F1886J3517a39274I3078J12073k748m2958k1292
17336A38153A3878K35242O0335K387I8103a33026A08437l546D5416K25157O2486
17325C33059A56431A8976l829L26311E5269d1198E78383k78887O9650G4890J63897
17314B38787j12054K4080J36314A13046J44773K2993A1367i8792j264A55839j4174
17303A41665k176B4650L39051A47379J99822A2592a83443b0248C16840R4981F2064
17291B43993E8758N6677K19458n598A63873o5469O4771K1527K09152j876A0194
17279A14230L10235B06631K4484j10440q098K73386A22406M56807B51196G2673
$$ plain form
17358 130967 -214902 -23679 214462 -43658 -52793 -214093 46192 239294 199393 47780 59886
17347 59886 125993 155133 546821 61886 75403 -139274 93078 205151 202403 159445 138153
17336 138153 13878 249120 309455 311842 98103 -133026 108437 104891 45416 270573 333059
17325 333059 156431 18976 15147 341458 55269 -41198 578383 299496 369146 74890 238787
17314 238787 126733 150813 287127 113046 257819 280812 11367 -98792 -100056 155839 141665
17303 141665 139489 24650 363701 147379 347201 12592 -183443 -20248 316840 411821 62064
17291 243993 58758 115435 334893 329295 163873 98404 163175 184702 393854 391978 10194
17279 114230 424465 206631 231115 120675 112577 385963 122406 579213 251196 72673
17268A13606k8655J10761C8811N9864J47319H1816N38952A35934o4244J71903
17258B43593k7484G3789J27938g6573A89464l2901e2476G7623J29217A440L60946
17247C62386c084G6931L06410N9687f7575A53632G4088R6847l4908M2393K59478
17236D37898A74908J55465J66912k35593J3301E500J73053J07203J38845A52736
17225D10272k02789J15610a01127A40613J24073B3112M52187b97570C94383a82801
17214C28488j48522M6517q9963J21222C9496b5175B70959K59851B46132r0577
17204A55555K40284A42348F1409K01612H4217O9755K43548J7583B1073K79021
17194C00094r5302N2570J05334j42092J32298d8518D11363r3410A4278K81911
$$ plain form
17268 113606 84951 195712 38811 98675 245994 81816 620768 135934 71690 243593
17258 243593 216109 73789 201727 -76573 189464 156563 -52476 77623 206840 1440 362386
17247 362386 -3084 76931 383341 443028 -67575 153632 74088 170935 136027 178420 437898
17236 437898 174908 330373 497285 261692 274993 5500 178553 285756 424601 152736
17225 410272 207483 323093 -101127 140613 264686 23112 475299 -297570 394383 -182801
17214 328488 179966 226483 136520 257742 39496 -25175 270959 530810 246132 155555
17204 155555 395839 142348 61409 263021 84217 153972 397520 415103 21073 300094
17194 300094 204792 257362 362696 220604 352902 -48518 411363 317953 14278 296189
17184B96189j13938M91655B81842b8785B77210Q0134j37755J90576k7461n0557
17174C32147r5775J86455N0082A54021K81634A25601J53924a7501D51696k606
17164D49090A93166K2608L3484K12994k23435M4344J49661Q5094j96115D5473
17153E32158B05011r4279K81038c8250B98873g4901B99375M2009A20979K16236
17143C37215A39021Q7647M9874J063J91547j99109L02779A77468N12578o7581
17133F22465j21883O643j91948K99563k62738P1722j96964L60406A37523K29753
17123C67276J04219B27138J7371n8374K04529R6307j18679A07607K34208K60824
17113F02639B70001K29909k07785J3830J23120n1187J22079J88371r4134A14292
$$ plain form
17184 296189 182251 673906 281842 -28785 277210 357344 219589 410165 382704 332147
17174 332147 236372 422827 472909 154021 435655 125601 279525 -17501 451696 449090
17164 449090 193166 215774 249258 462252 238817 283161 432822 517916 321801 45473
17153 532158 205011 110732 391770 -38250 298873 -74901 299375 341384 120979 337215
17143 337215 139021 226668 276542 277605 469152 270043 572822 177468 690046 622465
17133 622465 500582 507225 315277 614840 352102 423824 226860 587266 137523 367276
17123 367276 471495 227138 244509 186135 390664 486971 368292 107607 341815 602639
17113 602639 270001 499910 292125 305955 429075 377888 499967 688338 594204 114292
17102C45389d1603C92735p0183J51419J3537K31024B75200J65331k00130K66180
17092E06581j16961j51282K44007k23219L29897k81932K36056J19311G7799O14753
17082F92552B89009A04398N41731j86962A44629L35220J77466l00719M05540J5655
17072G77791k17340A56695M13631J7179j35161K35861k17262j76841O8140Q5035
17062D47277j75276k2828P0108K98731B68451K91509k3639j01332R5619k05347
17052C25261K26570J75353B87236L20628R7317k44733B25024K97507J86216N986
17042G14733k82862Q1603j17740J42280J08853j81787R7291J17581K50747l34156
17032E96543N6044K36483l72342j74333K17570M42040D03181M39220R1398m43513
$$ plain form
17102 345389 -41603 392735 322552 473971 487508 718532 275200 440531 240401 506581
17092 506581 389620 238338 482345 259126 589023 307091 543147 662458 77799 692552
17082 692552 289009 104398 646129 459167 144629 479849 657315 356596 762136 777791
17072 777791 560451 156695 570326 587505 452344 688205 470943 294102 362242 447277
17062 447277 272001 249173 319281 618012 268451 559960 536321 434989 530608 325261
17052 325261 551831 727184 287236 607864 705181 460448 225024 522531 708747 714733
17042 714733 431871 513474 395734 538014 646867 465080 562371 679952 930699 596543
17032 596543 652587 889070 516728 342395 559965 1002005 403181 842401 933799 490286
17022D90286J07326j96348L28230K927j43593R6546R8125C51912N03303k17692
17012F37523P3207l7200k78956N72493m11560L67648k65167L22354l86556R8287
17002F92073M3676J31377j14238j86926r0977N01043k18938L55877m30514q6417
16992E96036J98839J95911l09888k05590M34957J06451l22781o8826K23198k52419
16982E95888j86371K18207L00123m2900K18017l43427K26572r3064M1986L39324
16972A274355n14277J57712j8066k80147O39289j56044j58572J66552j51128p8184
16962H81490P7730k43544J36756R2318j85632J00687J34092p4873j71181N15472
16952A263315J4648l44354L30836J4046j47883l92852M53884q2813K12173k68324
$$ plain form
17022 490286 597612 401264 729494 732421 588828 685374 783499 351912 855215 637523
17012 637523 710730 673530 394574 967067 555507 923155 657988 980342 593786 692073
17002 692073 735749 867126 752888 565962 474985 976028 757090 1112967 682453 596036
16992 596036 794875 990786 680898 475308 910265 1016716 693935 625109 848307 595888
16982 595888 409517 627724 927847 884947 1102964 759537 986109 893045 935031 1274355
16972 1274355 760078 917790 899724 619577 1258866 1102822 944250 1110802 959674 881490
16962 881490 959220 715676 852432 944750 759118 859805 993897 919024 747843 1263315
16952 1263315 1277963 933609 1264445 1278491 1130608 737756 1191640 1108827 1321000 1052676
16942A052676L66595l54819N1908P0242J76867j07890j27272k31678m3131Q99848
16932A753346p66431N20268k00113r7961K21400k20975K46102l25102m6459K41034
16922A325109K3333r5030R5924K00960J41752l36507M101K02094M4439j31482
16912A474693o3469J57638j0688J45167j84783O1757L66857m28769K9667j95060
16902A353010K96114m8761R2852n2134k01923L09115k35862M26028N8544m37066
16892A559917L11816K80417j27670k90732J42988q1631K14632r0623j04337j02756
16882A712021O51342j56439j84888J81823Q2889M4125l4839J3747M2577J25736
16872B478094l90455K19378j17385P7852K13964L34469o7726n00204J94597J86600
$$ plain form
16942 1052676 1419271 1064452 1116360 1186602 1363469 1255579 1128307 896629 853498 1753346
16932 1753346 986915 1507183 1307070 1209109 1430509 1209534 1455636 1130534 1084075 1325109
16922 1325109 1348442 1253412 1349336 1550296 1692048 1355541 1359642 1561736 1606175 1474693
16912 1474693 1411224 1568862 1558174 1703341 1518558 1580315 1947172 1518403 1548070 1353010
16902 1353010 1649124 1600363 1693215 1641081 1439158 1748273 1512411 1938439 1996983 1559917
16892 1559917 1871733 2152150 2024480 1733748 1876736 1795105 2009737 1919114 1814777 1712021
16882 1712021 2363363 2206924 2022036 2203859 2286748 2330873 2296034 2309781 2352358 2478094
16872 2478094 2087639 2307017 2189632 2267484 2481448 2815917 2748191 2247987 2442584 2629184
16862B629184n0646J28496k6618p0607o1830o4722M37596J17068m04775M60322
16852C093468l0717j97155M2726L47688p66k10661M61731n03015M32404j69591
16842C266112J80540K53775k17665M32816L2389k5429J44983P4538m00907j10896
16832C630256K64697O39618l26279K85009l52185M72534l79173O03762j93136
16823D645103J81275r1366N5262K34284J57679j96596M3297O10375k82453J83052
16813E539912P8626k23484M89588J01233K24074P9675P4137M81067K8615q8435
16803F785008N39010l41254M74674l03071N36659L73615K33622j28017N32192
16794H702438J9892O42420l09890M36356j75091M31339L22502K02698J60637R13708
$$ plain form
16862 2629184 2578538 2707034 2680416 2609809 2547979 2483257 2920853 3037921 2633146 3093468
16852 3093468 3062751 2865596 2908322 3256010 3255244 3044583 3506314 3003299 3435703 3266112
16842 3266112 3446652 3700427 3482762 3915578 3947967 3922538 4067521 4142059 3741152 3630256
16832 3630256 3894953 4534571 4208292 4493301 4141116 4613650 4234477 4838239 4645103
16823 4645103 4826378 4735012 4790274 5024558 5182237 4985641 5028938 5639313 5356860 5539912
16813 5539912 5618538 5395054 5884642 5985875 6209949 6289624 6363761 6844828 6873443 6785008
16803 6785008 7324018 6982764 7457438 7154367 7691026 8064641 8298263 8170246 8702438
16794 8702438 8722330 9364750 9054860 9491216 9316125 9747464 10069966 10272664 10433301 11347009
16784A1347009J89324r5172M30757L25304Q87043j47082N95127L91437O44939
16775A4568686K77297M00046M02018P10265o1459J100526N48492L85307R02713
16766A9233891Q95055P56925O94930N47932R36877J261047J012229Q62877J000541
16757B7202304J306675R93424J612723J140742J741298J606244J884605J508817
16749C8996832J862461K357208K136259K753052K498637K436249L463909L174498
16741E9679105L101937L894848M141310M247894M597147N274338N139594N709528
16733I5785701O162437O483240P340916P310739P864509Q237875Q419223Q630342
16725A56234982Q515228P845411Q286886P478326O223215N671571M169753L030422
$$ plain form
16784 11347009 11536333 11441161 11871918 12197222 13084265 12937183 13532310 13923747 14568686
16775 14568686 14845983 15246029 15648047 16358312 16296853 17397379 17945871 18331178 19233891
16766 19233891 20128946 20885871 21580801 22128733 23065610 24326657 25338886 26201763 27202304
16757 27202304 28508979 29502403 31115126 32255868 33997166 35603410 37488015 38996832
16749 38996832 40859293 43216501 45352760 48105812 50604449 53040698 56504607 59679105
16741 59679105 62781042 66675890 70817200 75065094 79662241 84936579 90076173 95785701
16733 95785701 101948138 108431378 115772294 123083033 130947542 139185417 147604640 156234982
16725 156234982 164750210 172595621 180882507 188360833 194584048 200255619 204425372 207455794
16717B07455794R68260o9088j551426l391304m853702o039147p243506p282905
16709A77992976q408536q759604q561912q886069q417304q079285q425259p179105
16701A11275902p101553o702697o257626n713781n500385m700951m863516m284388
16693F6151005l872483l733841l302596l230669k861510k869279k614484k219993
16685D1446150k076116k098858j752998j911416j617756j575233j056915j598052
16677B7758806j125988r51081j443321r42163j074738j295661o88399o96801o53783
16668A8886871q42254o61919m57088m18568q95080l34751p54125n8207o81526
16659A3783353m80090p07930l29979n32363p9601o46177k96212j60872n51562
$$ plain form
16717 207455794 208424054 208354966 206803540 203412236 198558534 192519387 185275881 177992976
16709 177992976 169584440 160824836 152262924 143376855 134959551 126880266 118455007 111275902
16701 111275902 104174349 97471652 91214026 85500245 79999860 75298909 70435393 66151005
16693 66151005 62278522 58544681 55242085 52011416 49149906 46280627 43666143 41446150
16685 41446150 39370034 37271176 35518178 33606762 31989006 30413773 29356858 27758806
16677 27758806 26632818 25681737 24238416 23296253 22221515 20925854 20237455 19540654 18886871
16668 18886871 18044617 17382698 16925610 16507042 15611962 15277211 14523086 14464879 13783353
16659 13783353 13303263 12595333 12265354 11732991 11653390 11007213 10711001 10550129 9998567
16650I998567j67980j66340k02465l64583r2758k07915m76364L3615l03700l67253
16640G682824N0427n56229q0666j05423m9676l41334j28948j05337l70121n7985
16630E937532k37836j53083R3565l00469J13338j45619j20756j75629j68855k05599
16620D636589j8900K8825j35996j48430j30853K0019j26947k19733K71906m18192
16610C758288R3912J83765m60828j90522K42480r8711p6558j0633k11895k35561
16600B993737J41253j0125J0853l85762j75746L05436K48715j93112J17592k81450
16590B771391o0185j8891j65757p9397j43670j24394L88411n27581L38537J92603
16580B571067j34927m16316J90886j62511L69209n01088l9242J73668m01689L19821
$$ plain form
16650 9998567 9830587 9664247 9461782 9097199 9004441 8796526 8320162 8353777 8050077 7682824
16640 7682824 7733251 7177022 7096356 6990933 6941257 6599923 6470975 6365638 5995517 5937532
16630 5937532 5699696 5546613 5640178 5339709 5453047 5307428 5186672 5011043 4842188 4636589
16620 4636589 4617689 4646514 4510518 4362088 4231235 4251254 4124307 3904574 4176480 3758288
16610 3758288 3852200 4035965 3575137 3384615 3627095 3528384 3451826 3441193 3229298 2993737
16600 2993737 3134990 3124865 3135718 2749956 2574210 2879646 3128361 2935249 3052841 2771391
16590 2771391 2711206 2692315 2526558 2447161 2303491 2179097 2567508 2039927 2378464 2571067
16580 2571067 2436140 2019824 2210710 2048199 2417408 1916320 1877078 2050746 1649057 1968878
16570A968878L4186M3949j52391j19871P0605j99616l61520N13431o8343P6585
16560A805893l17325j60581N10059k24873R6490j95480j03935Q7876J94925l30175
16550A362874O7210N4668J494l89462J16681J73657k01141j1360K60318j16310
16540A318629j55450O7259L3043l62011K02451L03904l1332l99907J33493j23986
16530I86093k45676N79571l14928j34883K3703M66775m56377K35908j09139j00964
16520I30083N2388J34553O0625j60253l14854J48730k36702L14344l8201k18488
16510F72225Q2390l46255N34500K32861l14370K2077l91186L97146J5205j88877
16500G15716K80421K9126k29757j60042K50718k97060L34883j04673k93778L38634
$$ plain form
16570 1968878 2003064 2047013 1894622 1774751 1845356 1645740 1284220 1797651 1729308 1805893
16560 1805893 1488568 1327987 1838046 1613173 1709663 1514183 1410248 1498124 1693049 1362874
16550 1362874 1430084 1484752 1486246 1096784 1213465 1387122 1185981 1174621 1434939 1318629
16540 1318629 1163179 1230438 1263481 901470 1103921 1407825 1376493 976586 1110079 986093
16530 986093 740417 1319988 1005060 870177 893880 1360655 904278 1140186 1031047 930083
16520 930083 982471 1117024 1177649 1017396 702542 851272 614570 928914 890713 672225
16510 672225 754615 408360 942860 1175721 861351 883428 492242 889388 904593 715716
16500 715716 996137 1025263 795506 635464 886182 589122 924005 819332 525554 864188
16490H64188j48070P9080k21059k06473J43151J14677j2078K72138l0723j14996
16480G39835B93784M97197C55953n519L82154k61699J24846J5956j57994A79931
16469F61798k65650j02122P6426J60821q0902P4167J06071k15827j14553R1948
16459C92177K77477k92093K46275n838k37425j05231K77754j23746L28172j2015
16449G45507k21193j52012q023D9364J07827N39984r0152A99197K22425j5718
16439D05904L9134N740k9765R7455R6343k71644l5484J24706M755L7533j52925
16428C21752A12689M40138B06882R5734j0145k7204Q5665A15270K39253j02228
16418B52295j2946j3571K76702R4039j32649J2976m8341J12158j55547A17488
$$ plain form
16490 864188 716118 795198 574139 367666 510817 625494 613416 885554 854831 739835
16480 739835 293784 790981 355953 350434 732588 470889 595735 611691 453697 179931
16469 661798 396148 294026 370452 531273 450371 524538 630609 414782 300229 392177
16459 392177 669654 377561 623836 617998 380573 275342 553096 429350 757522 745507
16449 745507 524314 372302 364279 49364 157191 697175 607023 199197 421622 405904
16439 405904 445038 450778 421013 518468 614811 343167 307683 432389 437144 474677 321752
16428 321752 112689 552827 206882 302616 292471 265267 350932 115270 354523 252295
16418 252295 239349 225778 502480 596519 463870 476846 428505 540663 385116 117488
16407E70129D97K95211j24943K87745A60381J1775J29430K987A00944J36754J6737
16396B54435m5889I290M40716B02913R2446J55852D9299R4321J1843O2725J80539
16385C98727m699q6825l9980L0404A09845G061J13612N566N9829k3158K26343
16374C89253J04233J5682q6350f3007B15225B4222R851M40789A74684j240g8917
16362D2914P7019J14358c9870B28202E8889j0137K40281e3913f030C35130j24875
16351B10255a9846h926B0154M73511A08528N7555A3613J60341G9911i4288B24556
16339A91206J9903N991k0766J59632A41845K55993n2450B5229a96086B05641p9109
16328A26532b4875p0432A14948D3711K40170A9997J67520N8991I2698b1112A84450
$$ plain form
16407 570129 497 295708 170765 458510 160381 172156 301586 304573 100944 237698 254435
16396 254435 208546 9290 450006 202913 295359 451211 49299 143620 155463 218188 398727
16385 398727 394028 307203 267223 297627 109845 7061 120673 126239 186068 162910 389253
16374 389253 493486 509168 422818 -63007 215225 24222 34073 474862 174684 173444 -78917
16362 42914 119933 234291 -39870 228202 58889 48752 289033 -53913 -6030 335130 210255
16351 210255 -19846 -8926 20154 493665 108528 166083 13613 173954 79911 -94288 224556
16339 191206 211109 217100 196334 355966 141845 397838 345388 25229 -196086 205641 126532
16328 126532 -24875 -95307 114948 43711 283881 19997 187517 246508 92698 -21112 184450
16316B26772r0452K24227p6082A14160J73494I8560Q7447a75149B92189b00138
16305c6987A48759c4392j00274q9127N7406A17947m5968J8896d9394C0401b560
16293E4269b99298A48439J61843a7170B14496K5914M0289a70628f639A11004K01526
16282C12530G0560K26676q163a20588A5427K6577J68193Q815a1596q1877j09939
16271b03412A31186g0921B1393K67777j2669L6066b60340O3472j34277B34816
16260B83473g6911A7332f2282l8220A73044G5637b07994G6981a3883C59340g3347
16248a00585B22941A9905a6028j8487I5946N7463K69260a18396A70129c10989
16237e9942C0696K67808A0692h1422H351g6820k74612a10625b050B4287K41985
$$ plain form
16316 226772 136320 360547 284465 114160 287654 98560 186007 -175149 292189 -200138
16305 -36987 148759 -34392 -134666 -223793 -166387 117947 71979 90875 -49394 30401 -2560
16293 54269 -299298 148439 310282 -17170 214496 240410 280699 -170628 -6639 111004 312530
16282 312530 70560 297236 289073 -120588 15427 42004 210197 219012 -11596 -93473 -203412
16271 -203412 131186 -70921 21393 289170 276501 312567 -260340 -196868 -331145 234816
16260 283473 -76911 17332 -62282 -100502 173044 75637 -207994 76981 -13883 359340 -73347
16248 -100585 222941 19905 -16028 -34515 95946 153409 422669 -118396 170129 -310989
16237 -59942 30696 298504 10692 -81422 8351 -76820 -351432 -110625 -2050 24287 266272
16226B66272a95510h1531m7901C0997Q9534E8203a05959o7784E8168q583c9480
16214a30960o3483Q7591K8594D0673c61428A74272a61467H307K2144a60647g8961
16202e0052E5524g7475G1405K45211A19152b68713O2535A23681b2777j77858D85536
16190C61444j80307H0990N8858Q3320G4603e8522A32762B2129b76493E5171c07878
16178c5721a0142G683e01552B02152b16449P7320B02288g1759k14456C19837m6860
16167B72977d739A69807h1368B85041e648B31858A01552l8643K2624N4659l2767
16156A07425h7521j80767M2393O8739A7041a38132b246k84756a41792D37474a4822
16144a52260D9266a69942Q3423C21781A33992m6769c37856a8317k8532o6204c8610
$$ plain form
16226 266272 -195510 -81531 -129432 30997 120531 58203 -105959 -173743 58168 49585 -39480
16214 -130960 -194443 -106852 -78258 40673 -361428 174272 -161467 8307 30451 -160647 -78961
16202 -50052 55524 -77475 71405 316616 119152 -268713 -206178 123681 -22777 -200635 485536
16190 361444 181137 80990 139848 223168 74603 -58522 132762 22129 -276493 55171 -307878
16178 -35721 -10142 7683 -501552 202152 -216449 -139129 202288 -71759 -286215 319837 272977
16167 272977 -4739 169807 -81368 285041 -5648 231858 101552 62909 85533 140192 107425
16156 107425 -87521 -268288 -225895 -157156 17041 -138132 -2246 -287002 -141792 437474 -14822
16144 -152260 49266 -169942 -86519 321781 133992 87223 -337856 -18317 -46849 -113053 -38610
16132B1675K01974f1691A21986a7513A23617h2513J1532A06268c58910A34480
16121c26608B46841C246g7404A0548c1732k5709k09782A38505k4186Q9551f1932
16109a52898B52226j25771e3241k78300a9663n0670b898j28132B35307E3239b7201
16097a5541B36267j14769g7135C1760d4934E750L05459F2142a62160G109c35144
16085B36915C551L2946J62921i0677a9734F0416b9626n0161r7501f399A11020
16073G4573L7929a23650G4810a45425A5525b29587a3011j05648e0425p9992B42043
16061G527K6303c28363D0482J43396b13215f2041a1555l76774A35835C7179K5549
16050F2728e2755j97424G8677d6364B42550a70972g0194C17656g9237A55197G5823
$$ plain form
16132 21675 223649 -61691 121986 -17513 123617 -82513 -70981 106268 -358910 134480
16121 -326608 246841 3246 -77404 10548 -31732 -57441 -267223 138505 114319 203870 -61932
16109 -152898 252226 126455 -53241 -331541 -19663 -70333 -2898 -131030 235307 53239 -27201
16097 -15541 236267 121498 -77135 31760 -44934 5750 311209 62142 -162160 7109 -335144
16085 236915 3551 36497 199418 -90677 -19734 60416 -29626 -79787 -177288 -6399 111020
16073 74573 112502 -123650 74810 -145425 15525 -229587 -13011 -118659 -50425 -130417 242043
16061 7527 33830 -328363 40482 183878 -213215 -62041 -11555 -388329 135835 37179 62728
16050 62728 -52755 -250179 78677 -46364 242550 -170972 -70194 317656 -79237 155197 75823
16038e566j15446o0069A77019N3964b68606n6961L652a19956M688n4850O4380
16027a05738A4764a79761n9837A56688B749Q0658K45105B5125n778g5365I4895
16015a33077a6512k81248j55641c7857J6222j13647N1708c9881k48378R8459R0309
16004i9491j57375A34259E3140b69207h4815p5396a1386A69394c6260k72747b8556
15992D45154e08535h5273C9969p624a12417E7386b04660N7249B31875K27513M172
15981D63560o5947j77181a7373j11287n9950A84282J18499c16935C4056J62660
15971A96716D0072J60024m8030m7304b20074A32945J9763Q0119p2576E1794a19176
15959a21953C4316a53269c0148N753j98691B14174b59449G7143a03839A44070
$$ plain form
16038 -5566 -121012 -181081 177019 230983 -268606 -325567 -321915 -119956 -115268 -170118 -105738
16027 -105738 14764 -179761 -239598 156688 2749 83407 328512 25125 19347 -75365 94895
16015 -133077 -16512 -297760 -453401 -37857 -21635 -135282 -83574 -39881 -288259 -189800 -99491
16004 -99491 -256866 134259 53140 -269207 -84815 -160211 -11386 169394 -36260 -309007 -28556
15992 445154 -508535 -85273 39969 32345 -112417 57386 -204660 -147411 231875 459388 463560
15981 463560 397613 220432 -17373 -128660 -188610 184282 302781 -316935 34056 196716
15971 196716 40072 200096 152066 104762 -220074 132945 152708 232827 160251 51794 -119176
15959 -121953 34316 -153269 -30148 -24395 -223086 214174 -259449 77143 -103839 144070
15948A57356k8612a47455l7691j01314G6491D303a13535E9848c06531A8417b08270
15936c5038I0981J677a5723r4859j77995a37989j05610O3216j68999A43535a74475
15924h0903D1351b77969n2564i5246j53603H3870A8625f24796K51917b4414F7631
15912h984m8418k37592g4523b4607p5176E9194a81107A76352q3118b25958d8010
15900b00059Q9964l64981a93152A3114b52870C14780E8580c4185E947a42087H3912
15888c23236G2127b04163A32494a16786o1929A02051c01588a45801L4082c511
15877A48041a04305B55695E4515a55810E7654a59081j79472A15825D0916J43763
15867A84679G480a48046n6516D8518h7034A53612F3131b48560N6937m8148J09987
$$ plain form
15948 157356 128744 -147455 -185146 -286460 76491 4303 -113535 59848 -306531 18417 -208270
15936 -35038 90981 92658 -15723 -110582 -288577 -137989 -243599 -180383 -349382 143535 -174475
15924 -80903 41351 -277969 -330533 -95246 -248849 83870 18625 -624796 -372879 -24414 67631
15912 -8984 -57402 -294994 -74523 -24607 -99783 59194 -181107 176352 93234 -225958 -48010
15900 -200059 -110095 -475076 -193152 13114 -252870 314780 58580 -34185 5947 -142087 83912
15888 -323236 72127 -204163 132494 -116786 -178715 102051 -301588 -145801 -111719 -3511
15877 148041 -104305 255695 54515 -155810 57654 -159081 -338553 115825 40916 184679
15867 184679 7480 -148046 -204562 48518 -87034 153612 63131 -248560 -191623 -239771 -129784
15856a29784L1129A64825a86678A82746J60274I3534i6270A54035P8921a29227
15845h2282r5469h6159l4355C69799j69170a74102j18236p7835A58428a22241
15834a1135j16852A27719c6174B60917F7389a39381A1171a67731o3045A52363
15823E8930a68864H901d1682j55013E4667J08781F5430c06552j81716a81772b0979
15811a12j05205n3489K1932f3437p6989L0800q6465a2249p5435A13513C8533a13772
15798i0791A58306L5403o2105C6175a05977A00300B0233M4206b60682n1152D3606
15786a1640l44127J73368k38541A68841g6883G408a95528j60585G7295g2170m5066
15775a17236A49769a50851q398B36624d8423f829j17312e6651C35717a87486A35434
$$ plain form
15856 -129784 -98655 164825 -186678 182746 343020 93534 -96270 154035 232956 -129227
15845 -82282 -177751 -86159 -120514 369799 200629 -174102 -292338 -370173 158428 -122241
15834 -11135 -127987 127719 -36174 260917 67389 -139381 11171 -167731 -230776 152363
15823 58930 -168864 8901 -41682 -196695 54667 163448 65430 -306552 -488268 -181772 -20979
15811 -112 -105317 -158806 -136874 -63437 -140426 -109626 -196091 -12249 -87684 113513 38533 -113772
15798 -90791 158306 193709 131604 36175 -105977 100300 20233 64439 -260682 -311834 43606
15786 -11640 -355767 -182399 -420940 168841 -76883 7408 -195528 -356113 77295 -72170 -117236
15775 -117236 149769 -150851 -159249 236624 -48423 -6829 -124141 -56651 335717 -187486 135434
15763b24619A0986a13218B265i4990E05878F5201d0574q0978B6041k537d0776
15751b22407g322C5534M7349C8267Q8337J60045I7194M3102b4829r5680B36586
15739B0049c8335G320c80370a33054m1003f6081j09740a5804B50b60340A4161
15727a30262p1014G0927a39539A06003a02607B40706g1265B63227g7316k87323
15717c64639F672e6149A35682a13902c5308k80908e7632A8385J56165b1448j97138
15706b18586G4816A9659O6191a55210a8772C7180M8243c86416J28421Q5853c1053
15694a90389B7547b161j15897A86039c74599c147E8981J89995F5634a9357r819
15683b9176p864B79256b78233Q5779A46121c48561J45195A33450D3995L0417a3676
$$ plain form
15763 -224619 10986 -113218 2265 -94990 505878 65201 -40574 -121552 26041 23504 -40776
15751 -222407 -7322 35534 82883 38267 126604 286649 97194 140296 -24829 -120509 236586
15739 20049 -38335 7320 -380370 -133054 -174057 -66081 -175821 -15804 250 -260340 14161
15727 -130262 -201276 70927 -139539 106003 -102607 240706 -71265 263227 -77316 -364639
15717 -364639 6672 -56149 135682 -113902 -35308 -316216 -57632 18385 174550 -21448 -218586
15706 -218586 74816 19659 85850 -155210 -18772 37180 85423 -386416 -257995 -172142 -31053
15694 -190389 27547 -2161 -118058 186039 -374599 -3147 58981 248976 65634 -19357 -29176
15683 -29176 -37040 279256 -278233 -192454 146121 -348561 -203366 133450 43995 74412 -13676
15671B57075a20520C39283e54038D6498g0007k98367g7245k24911i4233k5281
15661a19514A60429o7024c7635r3197I1665b15896A90361h4767k20250a6710k3235
15650c9945j44862c9122G691L16596B9104g9248A9102J53648c4686q911A66534
15638a43537M0358A16851a01591l3291a9930q1738k24028j79801a42795K6549
15628a16246o8540J6020D4745c9477k81094g281l05264J41011j16199R0242i1464
15616b8995e171k15434B03754b48584N4489I0542l4047b56261R3201B1134J13986
15605A35120m9654a8127B98994d3361o6901e3887p393B04617a4855k0243I5298
15593A41204a54937A5052P0846a02658J0607D0512J55748E4711J05840f6454b9333
$$ plain form
15671 257075 -120520 339283 -554038 46498 -70007 -368374 -77245 -302156 -94233 -119514
15661 -119514 160429 93405 -37635 -130832 91665 -215896 190361 -84767 -305017 -16710 -39945
15650 -39945 -184807 -39122 7691 324287 29104 -79248 19102 172750 -34686 -43597 166534
15638 -143537 -103179 116851 -101591 -134882 -19930 -101668 -325696 -505497 -142795 -116246
15628 -116246 -184786 -168766 44745 -39477 -320571 -7281 -312545 -171534 -287733 -197491 -91464
15616 -28995 -5171 -220605 203754 -248584 -194095 90542 56495 -256261 -163060 21134 135120
15605 135120 85466 -18127 298994 -43361 -110262 -53887 -61280 204617 -14855 -35098 95298
15593 141204 -154937 15052 85898 -102658 -92051 40512 196260 54711 160551 -66454 -29333
15581E6292O4601J44279H7659M6240F5544c73415c9176k08663j17035a4802I7575
15569B9126g5565C2608b14234O9128j97033a23486K6795q7103c1138j58636E4311
15557e6260C0366a80509A77891e697l47785A0142J9406J33597N8384i1067j60725
15546b51792I639d43375E33107B07818g356B40545b71216H0534K21465B1287e1959
15534h6207a9858A70283b2873D71797e2043A9357a11445L7139A89813B6409a25394
15522G0361a45965a5604A92324h4420A19869a10149j3496j80993A54394f0920
15511B17114a29557q3024C43498C024d17246h0690A02834J04283a2712j45408
15501a58120F3412D664K72251e7779j53494B32417F4223M00773k19732A04191
$$ plain form
15581 56292 120893 265172 87659 133899 65544 -373415 -39176 -247839 -364874 -14802 97575
15569 29126 -75565 32608 -214234 -145106 -342139 -123486 -96691 -183794 -31138 -189774 54311
15557 -56260 30366 -180509 177891 -5697 -353482 10142 29548 163145 221529 -91067 -251792
15546 -251792 9639 -443375 533107 207818 -7356 240545 -271216 80534 301999 21287 -51959
15534 -86207 -19858 170283 -22873 471797 -52043 19357 -111445 -74306 189813 26409 -125394
15522 70361 -145965 -15604 192324 -84420 119869 -110149 -123645 -304638 154394 -60920
15511 217114 -129557 -212581 343498 3024 -417246 -80690 102834 207117 -12712 -158120
15501 -158120 63412 4664 276915 -57779 -211273 232417 64223 464996 245264 104191
15490d19377B6168P7744e11595A51166h1723n9591A4159b15055O063g9170n1855
15479a31025b5313j92343P3257j63680B1187c873A75491D4478h700k44338L1270
15468b21768i3397A23442k0127L4027D226a86105F5555c6574k36990A63448A7028
15456E6608j8000e1384A59714G2713e0637j39344j25627L6239g2098k78682G3304
15444C13951a85216E7726a27971j13353j88483I370a8168j2015k37599B6830h475
15432B21817I749N4394c6315o0047m9796e7634j48869A09252a26311C06398a89405
15420a04623C3064a82565F4294M4086O337J5240c61069l1603B10601i0330I8678
15408B19938A9466d3943j77200B5888L02427B9804L14838E9263c6180A0846b49049
$$ plain form
15490 -419377 26168 103912 -511595 151166 -81723 -141314 14159 -215055 -208992 -79170 -131025
15479 -131025 -25313 -217656 -144399 -308079 21187 -3873 175491 44478 -8700 -253038 -221768
15468 -221768 -93397 123442 103315 137342 4226 -186105 65555 -36574 -273564 163448 17028
15456 56608 38608 -51384 159714 72713 -50637 -189981 -315608 -279369 -72098 -350780 73304
15444 313951 -185216 57726 -127971 -241324 -429807 9370 -18168 -30183 -267782 26830 -8475
15432 221817 9749 64143 -36315 -96362 -146158 -57634 -206503 109252 -126311 306398 -189405
15420 -104623 33064 -182565 64294 108380 114717 129957 -361069 -392672 210601 -90330 98678
15408 219938 19466 -43943 -221143 25888 328315 29804 344642 59263 -36180 10846 -249049
15396f6170j86357C03103A23159J263b57109o7037B11339d6041A6972J05276e7277
15384F1873b30181E1094J80980c33366B09910a36512a1577I0615N3334c20969
15373a47285A73667b84479L1847B14427e8156E6813e283q9641F6390J15408i0999
15361A66307J56017H1393b80079A39192J52360a61208C30497i3843q7487N8661
15351a22669M5746B7691b33780b8250j4179C41912A63619e7800l8024k7694A21070
15339g0898B4105L1364K78861b25145j86160d4801A04313j0497a97523A74216
15328a79101f26B13932F1847a7952D29037A04543C3284d9499a2243n467n9162
15317g6872j33263N3042g0514B10472a56702A7351J61191N7162f0146b9461N719
$$ plain form
15396 -66170 -252527 303103 123159 124422 -257109 -324146 211339 -46041 16972 122248 -57277
15384 61873 -230181 51094 232074 -333366 209910 -136512 -11577 90615 143949 -320969
15373 -147285 173667 -284479 -252632 214427 -58156 56813 -5283 -94924 66390 181798 -90999
15361 166307 322324 81393 -280079 139192 291552 -161208 330497 -93843 -181330 -122669
15351 -122669 -76923 27691 -233780 -28250 -42429 341912 163619 -57800 -95824 -123518 121070
15339 -70898 24105 55469 334330 -225145 -411305 -44801 104313 93816 -197523 174216
15328 -179101 -626 213932 61847 -17952 429037 104543 33284 -49499 -12243 -17710 -76872
15317 -76872 -210135 -157093 -70514 210472 -156702 17351 178542 235704 -60146 -29461 -23742
15306b3742p2177B06067c1462A10719J6116n3587q293b68862B0356J05149i5770
15294b0598A52714b82724B48424A18463A9262J19926L2063c57425g7150D1192
15283B4787J067a3679A97286b42992M9872A10883h4011q9552E45410A94402P714
15272B02116L1371A15468m7900K76794k2888A23904D7649K1118K5135E350L0480
15261C5830J25894a81037A7044h674B8449K58423j15008I364g5310A15026l3647
15250H1379Q0325M08993L38788O45766L5230j63501L70776q59814D21417f434
15239C62404c7110A71819N3614r2592C8011J57392a7562A34342a86175B29812
15228A56781J35305a77222F9020e5878A70029F6260P8547j2115J94427a01583
$$ plain form
15306 -23742 -95919 206067 -31462 110719 126835 73248 64955 -268862 20356 125505 -95770
15294 -20598 152714 -282724 248424 118463 19262 139188 171251 -357425 -77150 41192
15283 24787 25854 -13679 197286 -242992 -193120 110883 -84011 -173563 545410 194402 202116
15272 202116 233487 115468 67568 344362 321474 123904 47649 68767 93902 5350 35830
15261 35830 161724 -181037 17044 -8674 28449 286872 171864 9364 -75310 115026 81379
15250 81379 161704 570697 909485 1555251 1590481 1426980 1797756 937942 421417 -6434
15239 362404 -37110 171819 225433 132841 38011 195403 -17562 134342 -186175 229812
15228 156781 292086 -177222 69020 -55878 170029 66260 144807 132692 327119 -101583
15217A5251a04815C5914L67262j93316D0367L5808P9993K85863a89915k1470A94508
15205A14191a24539c5143B4516J14771B152K69614a26473p6104B17062j08405
15195A08657f7370G5978a6105B53485h8447B02603n4773c6356Q45A62619B948
15183e2704D1481b42599B27103d398A09863K01676a62020o592C10847M127F4910
15171H7247k7609J20350a07363P935j31434C236J92738J3632e0362C5906J44948
15160A80854e9845B30051Q5419A35505B8006c27881B63880p3459O2742a2943F7964
15148D14573F5450K57489o207g2339D420c9924j3497A13441l6962J89912a20160
15136a49943k10705G7285K71628I5871a94961C95444F99c1679j35744n8993d9662
$$ plain form
15217 15251 -104815 35914 403176 209860 40367 76175 156168 442031 -189915 -211385 194508
15205 114191 -124539 -35143 24516 139287 2152 271766 -126473 -202577 217062 108657
15195 108657 -67370 75978 -16105 253485 -88447 202603 147830 -36356 -35511 162619 2948
15183 -52704 41481 -242599 227103 -4398 109863 311539 -162020 -168612 310847 314974 64910
15171 87247 59638 179988 -107363 -99428 -230862 3236 195974 209606 -50362 35906 180854
15160 180854 -59845 230051 315470 135505 28006 -327881 263880 190421 253163 -12943 67964
15148 414573 65450 322939 316732 -72339 4420 -39924 -53421 113441 76479 266391 -120160
15136 -149943 -360648 77285 348913 95871 -194961 395444 699 -31679 -167423 -226416 -49662
15124a78535A85851h1923A88580R4175A27636K39656h1852Q145f28C92724G037
15112A70480k7948g3723B22750p2070j2020J4452j153J9823l0727e3704D929a8933
15099H7148L68682A08385J62043q0556K7503L9880b3365D3643J71615o0311J28227
15088B83174A09925m612J04132m5511Q5339c7145B23794r6298J57391A01375D2949
15076B40669L2440j2774K64664G6030K74942j59856B7028N86733d0651F173L7484
15065D3657J58570B5905J75481R0215j37482k8774K97972G8107b8336C97257A89884
15053C16099j40136C081M86810A56177R2412i046A74312a28670A52788P2633J27440
15042C52861j46079C2482L84F506J76040a21401B21797j5252o0485D2338K71837
$$ plain form
15124 -178535 185851 -81923 188580 282755 127636 367292 -81852 -73707 -628 392724 7037
15112 170480 142532 -73723 222750 150680 138660 153112 151959 171782 141055 -53704 4929 -18933
15099 87148 455830 108385 270428 189872 217375 257255 -23365 43643 215258 154947 283174
15088 283174 109925 105313 209445 163934 249273 -37145 223794 127496 284887 101375 42949
15076 240669 273109 260335 524999 76030 350972 191116 27028 613761 -40651 6173 43657
15065 43657 202227 25905 201386 291601 154119 125345 423317 78107 -28336 397257 189884
15053 316099 175963 3081 489891 156177 248589 -9046 174312 -128670 152788 225421 352861
15042 352861 206782 32482 32866 6506 182546 -121401 221797 206545 146060 42338 314175
15031C14175j54966K16656k1971A20728n2440K26511q2428H8375J17693H0056
15020A89647J18434j02035K21741j5235j40617L79733B16297B6671J71637a12237
15009F5511K19831R3272a02903C66318A70176M6504K38849A80324P5751R5666
14999C51741a62821B01950K29441B14300G6545J70297J70368j54141P3728a01164
14988B95238p4006J47090A55663K60918G0067J02091K92873a5071B31161J02676
14978C33837n0812J05258j68986m4583o5667C7372K06138K24193H2436h966A56166
14966A23008k7792K93361A83201L7478L2423J10477M6453G0421K1609J28202Q1373
14955C01605f4193A34058K60633j33739I0309J03638J53805n0986j16285G5023
$$ plain form
15031 314175 159209 375865 353894 120728 68288 294799 212371 88375 206068 80056
15020 189647 308081 206046 427787 412552 271935 651668 216297 26671 198308 -112237
15009 65511 285342 378614 -102903 366318 170176 216680 455529 180324 256075 351741
14999 351741 -162821 201950 431391 214300 76545 246842 417210 263069 336797 -101164
14988 295238 221232 368322 155663 416581 70067 172158 465031 -15071 231161 333837
14978 333837 283025 388283 219297 174714 109047 37372 243510 467703 82436 -8966 156166
14966 123008 95216 388577 183201 220679 253102 363579 410032 70421 92030 220232 301605
14955 301605 -64193 134058 394691 260952 90309 193947 347752 296766 180481 75023
14944F3911L52578j12126L9635j00095K14867A54969K01401o7897N1804A58179
14933A21993L01886D5874c0041C61114A04012L70855o7639n8466K4259L25367
14923F98388A83093J27856J40399k8603m9387A44543L92544a241D73490j62889
14913C10601l6852L8293j42499K7095J40354L16428C01624n1257r1915K52268
14903D10720A06404L67878L03754l82928J06817k2987B19208D2951N97965B08626
14892D68121j04300j09172R6584K7769q1798j1531N33385l92351o7950R5020I2160
14880D02574j18828N1820N2487L2294R0312j91340J93538j19051O1065j243p9001
14869C74627L44008k81144p470K55572j57436K11243C67817j11906J81508P8079
$$ plain form
14944 63911 416489 304363 343998 243903 458770 154969 356370 288473 340277 158179
14933 121993 423879 45874 -30041 361114 104012 474867 407228 348762 373021 698388
14923 698388 183093 310949 451348 422745 373358 144543 537087 -1241 473490 310601
14913 310601 273749 312042 169543 196638 336992 653420 301624 250367 158452 410720
14903 410720 106404 474282 778036 395108 501925 478938 219208 42951 640916 208626
14892 468121 363821 254649 351233 379002 297204 285673 819058 426707 358757 453777 92160
14880 402574 283746 335566 388053 420347 510659 319319 512857 393806 454871 453628 374627
14869 374627 718635 437491 430021 685593 528157 739400 367817 255911 437419 515498
14859E15498L1554k18457K07960j56059J70069R7638l10022l4499M12104k5406
14849F90380l31425q6361O21286l84337j16809J12444j71280L7322K58171l2474
14839E96917J66814j31531B80545J86306P9099j12525j25772j31253M07977k89569
14829B94808J99071j79980J42031N2208L2540j42288N68955D56789R8236k39200
14819C15825M24795n565l64688r1888M06428A71897M58129k27355K89245B67295
14808D11903Q2440Q0519j95140J01661p0711L51000A85495N64962l05649A92414
14797D43966J98591O5754m4446q6100M0136j90296K21061j40048k12936L00754
14787E96436j26083k0664L64660j91871r546k78382K80624j67782K0998J99216
$$ plain form
14859 515498 547052 328595 536555 380496 550565 648203 338181 303682 715786 690380
14849 690380 358955 272594 893880 509543 392734 505178 333898 371220 629391 596917
14839 596917 763731 632200 280545 466851 545950 433425 307653 176400 584377 294808
14829 294808 493879 313899 455930 508138 540678 398390 967345 456789 555025 315825
14819 315825 740620 735055 370367 278479 684907 171897 630026 402671 691916 267295
14808 411903 494343 574862 379722 481383 410672 761672 185495 750457 444808 192414
14797 443966 642557 708311 663865 577765 617901 427605 648666 508618 295682 596436
14787 596436 470353 449689 814349 622478 612932 334550 615174 447392 468390 667606
14777F67606J72229l45894P6772j02176J24804K07501j7474C89247L73540k65107
14767D97680q3840M98689k03522j51598J72591j622j91359J81898j09307q7983
14757E21627r8242n6859L58111j31655q88M1366J39564j71196K14966o8121q607
14746G40066K70651j74847J65161k73090L10124j90278n8691k77670J87200K9346
14736G27972J39785j09890k98093L9371O95957k55658m6639j68915P4947J27920
14726I26757q7822j11760P9611K28306j30065o4480J09245m3041k54865J44517
14716G96403J55245j23589o2673L869j95551J46327o8653M91421k70116r8176
14706G74507J6299L9524M8405K20539m41810K3492L73392j13272K04242m51560
$$ plain form
14777 667606 839835 493941 570713 468537 593341 800842 783368 389247 762787 497680
14767 497680 413840 912529 709007 557409 730000 728378 537019 718917 609610 521627
14757 521627 423385 366526 724637 592982 592094 633460 773024 601828 816794 748673 740066
14746 740066 1010717 835870 1001031 727941 1038065 847787 789096 511426 698626 727972
14736 727972 867757 757867 459774 499145 1195102 939444 892805 723890 798837 926757
14726 926757 838935 727175 806786 1035092 905027 840547 949792 906751 651886 796403
14716 796403 951648 828059 765386 769255 573704 720031 651378 1142799 872683 774507
14706 774507 790806 830330 878735 1099274 657464 680956 1054348 941076 1145318 693758
14696F93758M14614j31634N7194j44096m0042K27545J02966M4419l23863J0040
14686I10901k43521N44984k42864l909L87259l36453m2289L3298n3098J62001
14676A116309K11031j94220k63486L44055j31448n6416K05223l33758K89206M3075
14666A229571m41143K53720k8582j00133K27564N4559L6782K83631n10001k5884
14656I80084K1436k0536L66620l19660M0651j0662M9202J01835l2747j59064K67344
14645A284503j51582O4048j17850K87877m0643k08927q078L01142n20871L02351
14635A191970J6535o1084K19694k02732K36751n1347M01758k84220J59118l15271
14625A311172R9912m9713l1382L05245k6984k36001K76605l0758k75018K10916
$$ plain form
14696 693758 1108372 976738 1033932 889836 849794 1077339 1180305 1224724 900861 910901
14686 910901 667380 1212364 969500 965591 1352850 1016397 974108 1007406 954308 1116309
14676 1116309 1327340 1133120 869634 1213689 1082241 1025825 1231048 897290 1186496 1229571
14666 1229571 788428 1042148 1013566 913433 1140997 1195556 1232338 1515969 1005968 980084
14656 980084 1001520 980984 1347604 1027944 1068595 1057933 1107135 1208970 1176223 1017159 1284503
14645 1284503 1132921 1196969 1079119 1366996 1326353 1117426 1109348 1410490 889619 1191970
14635 1191970 1208505 1147421 1367115 1164383 1401134 1349787 1751545 1467325 1626443 1311172
14625 1311172 1411084 1361371 1329989 1635234 1608250 1372249 1648854 1618096 1343078 1553994
14615A553994r2166n431K23221l80078O5754J30811n0883K90883p2648j963k75360
14604A386134J41693j96303O9614J92154J83777j7128M89q4303L31615l50210
14594A657532K69835k74315M42792k00078j5745j7052k85173K35203j05776R3189
14584A800412K31343K00231r9994j13807R4311L18147k21962r6166L518n3051
14574B062982q871J85017Q470K47031q2985J27262l7872J59795l59253L33126
14564B634702r3601K13200l99697M45052o407K98212l15230L34455j91189J60095
14554C079592L56440L69143L21395N27647J108174K652699N121199R609877J5126162
14545C8272328M107908j9555640A0624798n029825k281414p05666l96307K6782
$$ plain form
14615 1553994 1461828 1456397 1679618 1299540 1365294 1496105 1445222 1736105 1663457 1661494 1386134
14604 1386134 1527827 1331524 1401138 1593292 1777069 1759941 1760430 1676127 2007742 1657532
14594 1657532 1927367 1653052 2095844 1895766 1880021 1862969 1577796 1812999 1707223 1800412
14584 1800412 2031755 2231986 2131992 2018185 2112496 2430643 2208681 2112515 2116033 2062982
14574 2062982 2054111 2239128 2247598 2494629 2411644 2538906 2501034 2660829 2301576 2634702
14564 2634702 2541101 2754301 2354604 2799656 2793249 3091461 2776231 3110686 2919497 3079592
14554 3079592 3436032 3805175 4126570 4654217 5762391 8415090 13536289 23146166 38272328
14545 38272328 42380236 22824596 10624798 5594973 3313559 2607893 2211586 2238368
14537B238368m89677M58860J04196J6659p7652k27796M15228l45442J78994k1118
14527B250620K23403J29998N9933n7617j12104k17482J65574R4226j19264p364
14517B409923j90422M59682p0877L4377n1439O5408K10571K75172n7083j08761
14507B976551N0229J05967k95887M56952j28869q0394J97886n7762P7886l0169
14497C272390K66335l54603J42067K9888N09302k06061m1838J259o2418J51648
14487C707969n7277K31747j74897j53237J42705q4974J72397K26204k33923K99714
14477D076428l87049M46927O869n7227j41862N75774J50131k72337j96681M83906
14467D684879n5214J24601k61209L06737O9956K92218j18290j62097J85332j24275
$$ plain form
14537 2238368 1748691 2207551 2311747 2328406 2250754 2022958 2438186 2092744 2271738 2250620
14527 2250620 2474023 2604021 2663954 2606337 2494233 2276751 2442325 2536551 2417287 2409923
14517 2409923 2219501 2679183 2608306 2642683 2591244 2656652 2867223 3142395 3085312 2976551
14507 2976551 3026780 3132747 2836860 3293812 3164943 3084549 3282435 3224673 3302559 3272390
14497 3272390 3538725 3184122 3326189 3356077 3865379 3659318 3617480 3618739 3556321 3707969
14487 3707969 3650692 3882439 3707542 3554305 3697010 3612036 3784433 4010637 3776714 4076428
14477 4076428 3689379 4136306 4143175 4085948 3944086 4519860 4669991 4397654 4200973 4684879
14467 4684879 4629665 4754266 4493057 4799794 4869750 5161968 5043678 4881581 5066913 4942638
14457D942638J96071l3465J44977k03533j0202M71261L11700l31426j47102N63211
14447E904130j79595J57339K56607k80941L93049k31812Q2248K13632K24329l09472
14437F229514J37974L13710l72605J49300J78688J29939l21752O17705K25489
14428G287962j88216J28045M71232n95036N40194K06440m72899M71381K06887
14419H055990Q801Q7276K64527r0535M25696j17747N10227l28262L49303j7939
14409I147337n8603N48284j33811J56144M31711L59119l27582J33535M06330k7012
14399A0635452J69449J99864J71108J83383J83720L52988p7127K47403J70237
14390A2236477J36192M02252M02262J98514o0380L20639R7888L82042Q9483O96234
$$ plain form
14457 4942638 5138709 5105244 5250221 5046688 5036486 5507747 5819447 5488021 5340919 5904130
14447 5904130 5724535 5881874 6138481 5857540 6250589 6018777 6101025 6314657 6538986 6229514
14437 6229514 6367488 6681198 6308593 6457893 6636581 6766520 6444768 7062473 7287962
14428 7287962 7099746 7227791 7699023 7103987 7644181 7850621 7377722 7849103 8055990
14419 8055990 8064791 8152067 8416594 8326059 8751755 8634008 9144235 8815973 9165276 9147337
14409 9147337 9088734 9637018 9503207 9659351 10091062 10450181 10122599 10256134 10662464 10635452
14399 10635452 10804901 11004765 11175873 11359256 11542976 11895964 11818837 12066240 12236477
14390 12236477 12372669 12774921 13177183 13375697 13315317 13635956 13733844 14115886 14205369 14901603
14380A4901603j41876K43140K81420M68538K62587P18200N5871J28527M77185
14371A7395195L62684L43531L79448K46202L07856Q77926L3122N39080M48017
14362B0933061L61473J78102O99142M52172O24562M52858M05318O61827N85961
14353B5354476N86593O30955Q83359P13598M99060L83747R94178J006770O53606
14344C1706342N99225J371833M48257R91371O29870J086943J270761J235203J021820
14335D0361625J051102J023461J314057J521786J478408J421906J457029J523857
14327E1153231J315542J877395J941694J557616K481118J434881K706744K062707
14319F6530928K091354K709902K644862K544260L460685K748057L143946L416149
$$ plain form
14380 14901603 14759727 15002867 15284287 15752825 16015412 16733612 16789483 16918010 17395195
14371 17395195 17757879 18101410 18480858 18727060 19034916 19912842 19945964 20485044 20933061
14362 20933061 21294534 21472636 22171778 22623950 23248512 23701370 24106688 24768515 25354476
14353 25354476 25941069 26572024 27455383 28168981 28668041 29051788 30045966 31052736 31706342
14344 31706342 32305567 33677400 34125657 35117028 35746898 36833841 38104602 39339805 40361625
14335 40361625 41412727 42436188 43750245 45272031 46750439 48172345 49629374 51153231
14327 51153231 52468773 54346168 56287862 57845478 60326596 61761477 64468221 66530928
14319 66530928 68622282 71332184 73977046 76521306 79981991 82730048 85873994 89290143
14311H9290143L425765L836672M332514M302723M570026M299588N354626N147835
14303A24559892N894631N545232O387779O924504P090502P299222Q199786Q445772
14295A80347320Q926557R601167R627881J1015439J1032966J1432718J1978796
14288B53962844J2942341J3250717J3718913J4253055J4806092J4671608J5015873
14281C52621443J4783177J4772035J4264610J3560284J2592742J1557707R959907
14274D44111905P337869L505549O00231j159392r45201P86758j253432k248913
14266D50735374o412206r044931j0055243j1377125j2677948j4228187j4692372
14259C72247362j5109398j5318168j5571693j5170899j4876162j3636598j3001110
$$ plain form
14311 89290143 92715908 96552580 100885094 105187817 109757843 114057431 119412057 124559892
14303 124559892 130454523 135999755 142387534 149312038 156402540 163701762 171901548 180347320
14295 180347320 189273877 198875044 208502925 219518364 230551330 241984048 253962844
14288 253962844 266905185 280155902 293874815 308127870 322933962 337605570 352621443
14281 352621443 367404620 382176655 396441265 410001549 422594291 434151998 444111905
14274 444111905 451449774 454955323 455555554 454396162 453450961 454237719 452984287 450735374
14266 450735374 444323168 435278237 425222994 413845869 401167921 386939734 372247362
14259 372247362 357137964 341819796 326248103 311077204 296201042 282564444 269563334
14252B69563334j3299690j2802697j1968551j1103575j1066777j0364349r654161
14245A89303534q920574q326058q292955p431654p566930o846387o369758n483611
14237A30065607n711828n483727n146816m890410m612983l708265m036273l587450
14229I2887855l751085l349525l529082l246711l054222k425299k817423k690883
14221F8023625k211444j889901k247704k374637j949866j493396j887417j540760
14213E2428500j430809j821305j690468j270568j489413r56816j117550r20139
14205D1731432j304865j321449j150847j681101R4924j097528p74171o06224j646864
14196C2243307n12978o00174p04326q15170r99258k25548q14016r56392o55240
$$ plain form
14252 269563334 256263644 243460947 231492396 220388821 209322044 198957695 189303534
14245 189303534 180382960 172056902 163763947 156332293 148765363 141918976 135549218 130065607
14237 130065607 124353779 118870052 113723236 108832826 104219843 100511578 96475305 92887855
14229 92887855 89136770 85787245 82258163 79011452 75957230 73531931 70714508 68023625
14221 68023625 65812181 63922280 61674576 59299939 57350073 55856677 53969260 52428500
14213 52428500 50997691 49176386 47485918 46215350 44725937 43769121 42651571 41731432
14205 41731432 40426567 39105118 37954271 36273170 36368094 35270566 34496395 33890171 32243307
14196 32243307 31730329 31130155 30425829 29610659 28611401 28385853 27571837 26615445 25960205
14187B5960205m92483l63323q73384m41328o11357j37861q63204l87259n04022
14178B1285984l20877o01507j16910m37383p80757j01919o49330j18517m10390
14169A7748394k47094j97245m10157l42235l79075m32016j61094k3034l27684
14160A5228760m61680j87177k40760k32294k65630m86255r0504j8339l60336j24893
14150A2760892l70534K0895m20699j25183M6975K4102o74555l67233J83741k71831
14140A0806570j62116r0579k03852j52506m5282j33134l60423k90523P0905j41297
14130I297763k9766r3456j90507n3349l03205K20772k43576l02369K0016j52740
14120H169583q7253o60708M84169j65342l97721K79843r1042k30853J79157k14958
$$ plain form
14187 25960205 25467722 25104399 24231015 23789687 23178330 23040469 22177265 21790006 21285984
14178 21285984 20965107 20363600 20246690 19809307 19028550 18926631 18277301 18158784 17748394
14169 17748394 17501300 17304055 16893898 16551663 16172588 15740572 15579478 15556444 15228760
14160 15228760 14767080 14579903 14339143 14106849 13841219 13354964 13264460 13246121 12885785 12760892
14150 12760892 12390358 12411253 11990554 11865371 11912346 11936448 11261893 10894660 11078401 10806570
14140 10806570 10644454 10553875 10350023 10197517 10152235 10019101 9658678 9368155 9439060 9297763
14130 9297763 9267997 9174541 8984034 8930685 8627480 8848252 8604676 8302307 8322323 8169583
14120 8169583 8082330 7421622 7905791 7740449 7342728 7622571 7531529 7300676 7479833 7264875
14110G264875j937j77453j83198j76383J24793j65239l2003k18523m5343J86307
14100F575896m59192O9987p0060Q4807k46571j78373J3410J25719l89521k1755
14090E504347K26830l68834J26347j15362m6677k32969j69562P8173Q0063k18951
14080D863405K38324K77304n48115k66311K1590L8870J24174p5459l7283j99944
14070D436555J00733j8395j08445k2757j12724K04895m56052K26146l09607M45334
14060D385683k58189J06479J0510Q936K6464j80455k29220J7845K7450l15935
14050C599568J64370r2477m1172r8290l59638J53210M31961m57544j87555K80977
14040C393410m9999K12446n31801J94461q8775M8051k31664L29397k8836P7587
$$ plain form
14110 7264875 7262938 7085485 6902287 6725904 6850697 6685458 6653455 6434932 6389589 6575896
14100 6575896 6116704 6186691 6116631 6201438 5954867 5776494 5789904 5915623 5526102 5504347
14090 5504347 5731177 5362343 5488690 5373328 5326651 5093682 4924120 5002293 5082356 4863405
14080 4863405 5101729 5379033 4830918 4564607 4586197 4625067 4749241 4673782 4636499 4436555
14070 4436555 4537288 4518893 4410448 4387691 4274967 4479862 4023810 4249956 3940349 4385683
14060 4385683 4127494 4233973 4244483 4253419 4279883 4099428 3870208 3888053 3915503 3599568
14050 3599568 3763938 3671461 3630289 3531999 3172361 3325571 3757532 3299988 3112433 3393410
14040 3393410 3343411 3555857 3024056 3218517 3129742 3177793 2946129 3275526 3246690 3324277
14030C324277j23397K90738m97688k20634J51630o0889l14414n6817J25845j74831
14020B443820O29513l30854j75006o8658O14949o43475N476l82956J76807Q4432
14010B354048m1915P5495J41053k67320q1129J0845P052p9409J76645k9363j01604
13999B164398L09955k63721k01754j5996k20676L08072j13496n6312L79997L84659
13989B675126J195579L598516R111044J6018568J0637137j5234484A3411326n742905
13981G668421j876308j119742p65393l91365k5386k25763j54326k74319j74474
13972B661345j8349Q2837l29776N5579K5171k3910o11885L17804J92728J39355
13962B490899k13604k44909K62355j18883k34097J28385J72856q3286J92699n00434
$$ plain form
14030 3324277 3200880 3491618 2993930 2773296 2924926 2864037 2549623 2492806 2618651 2443820
14020 2443820 3073333 2742479 2567473 2498815 3113764 2470289 2475765 2092809 2269616 2354048
14010 2354048 2312133 2387628 2528681 2261361 2180232 2191077 2198129 2118720 2295365 2266002 2164398
13999 2164398 2474353 2210632 2008878 1992882 1772206 2080278 1966782 1910470 2290467 2675126
13989 2675126 3870705 7469221 16580265 32598833 43235970 28001486 13411326 7668421
13981 7668421 5792113 4672371 3906978 3515613 3490227 3264464 3110138 2835819 2661345
13972 2661345 2642996 2725833 2396057 2451636 2476807 2452897 1841012 2158816 2351544 2490899
13962 2490899 2277295 2032386 2294741 2175858 1941761 2070146 2243002 2159716 2352415 1851981
13952A851981J9371n67K22890N9451m8427l26560j02347L71692k44672L44552
13942B147364k62725k55645r9749J87775J86616k04843n8491J42681m075P8808
13932A857716k76779k10858M31916j07999Q8618j07220k34433J24044K8246J81201
13922A774452r3872J42036m86777J25502K66579k09359L3792N4362Q3927k14594
13912A476048K10761o9689j21628K97952n5415l16244Q2769J72834p37979M21200
13902A360609J09859j03450j08500L24587o86944M43490J05093j02131j43624
13893A198989K55629k88968O5383K76506J26043n52117K92281k49589P3297J38674
13883A336128l1695J42068j80169K66800o98980J99170o6955N53776k04535J12171
$$ plain form
13952 1851981 1871352 1870785 2093675 2153126 2104699 1778139 1675792 2047484 1802812 2147364
13942 2147364 1884639 1628994 1529245 1717020 1903636 1698793 1640302 1782983 1778908 1857716
13932 1857716 1580937 1370079 1801995 1693996 1782614 1675394 1440961 1565005 1593251 1774452
13922 1774452 1680580 1822616 1335839 1461341 1727920 1518561 1552353 1606715 1690642 1476048
13912 1476048 1686809 1617120 1495492 1793444 1738029 1421785 1504554 1677388 939409 1360609
13902 1360609 1470468 1367018 1258518 1583105 896161 1339651 1444744 1342613 1198989
13893 1198989 1454618 1165650 1231033 1507539 1633582 1081465 1373746 1124157 1197454 1336128
13883 1336128 1304433 1446501 1266332 1533132 834152 1033322 966367 1520143 1315608 1427779
13873A427779j58061J55000k50083j72768J04203p8726R4037n6781m7452J73364
13863A190512j32046J86334j65816r6418K15229P0635J68208n77868J82461l8793
13853A002438K94411j57095j16538J5233K10016j00510j00704P3464p1369r4271
13843I55075J45307L3346k22653J4393O593q8594M13578j22714k5962k90107J32857
13832I51119P7748J1070L05329l56145m6861Q2666j11651o3688P7216K8750J1977
13821I67530K1804k21272M05862k25500J19105m8248k03470K10083j3573k67751
13811G44570J00419N9445j55762K20696k06194J86864o0464O6064j93030j01733
13801F60875M7778J07247J01696j41871K6276K8967k93361L79666o5875C83475
$$ plain form
13873 1427779 1269718 1424718 1174635 1001867 1106070 1027344 1121381 1064600 1017148 1190512
13863 1190512 1058466 1244800 1078984 982566 1197795 1268430 1436638 858770 1041231 1002438
13853 1002438 1296849 1139754 1023216 1038449 1248465 1147955 1047251 1120715 1049346 955075
13843 955075 1100382 1133728 911075 925468 932061 843467 1257045 1134331 1108369 818262 951119
13832 951119 1028867 1039937 1345266 989121 942260 1024926 913275 849587 926803 955553 967530
13821 967530 989334 768062 1173924 948424 1067529 1019281 815811 1025894 1012321 744570
13811 744570 844989 904434 748672 969368 763174 950038 889574 955638 762608 660875
13801 660875 708653 815900 917596 775725 802001 830968 537607 917273 851398 383475
13790H28778j41992K00755J36444k52917L51200m64509K15756o9059j8576k73121
13780E12759q314K04370J38661k47660M02031l88376J47451j04385K66621l3579
13770H89579l7086l90617M30451O2190m15654J87298n6109n8530J22560k13725
13760E20357A42789P70781k52747P5413L7775o7438n0602K17661B65928O41914
13750I07842l90724J93009l03436L63607j33043R3551l47367K07341J9137M0799
13740F50716p2458k1528p6210o006B31333P07620k79798K3047j96392M8396K51172
13729G85378C43308J17726J09314K9089j53882O6574J83378k15427j873L64777
13719H42984k46434L6041j06960L52160j56295j41109q4440J88811J3962C37882
$$ plain form
13790 828778 686786 887541 1023985 771068 1122268 657759 873515 804456 785880 512759
13780 512759 504445 708815 847476 599816 1001847 613471 760922 656537 923158 889579
13770 889579 852493 461876 892327 954517 538863 726161 670052 611522 734082 520357
13760 520357 142789 913570 660823 736236 774011 706573 655971 873632 265928 907842
13750 907842 517118 710127 406691 770298 637255 730806 383439 590780 609917 650716
13740 650716 578258 556730 480520 474514 231333 938953 659155 682202 485810 534206 785378
13729 785378 343308 461034 570348 599437 445555 512129 695507 480080 478207 842984
13719 842984 596550 632591 525631 877791 721496 580387 495947 684758 698720 337882
13708B55898P04802l66887B24601J92555O13583m87988K13920B76877J62552A50530
13697F15876m9216r7375N1281r5096Q2547J38054k70919l7452K90212k8491k10718
13686C88703j12363Q08122n25405j2481B59033L76717B77144O12571m44543L3492
13676D78664K97900B75325P07184D90237k14918K65055N6894J09982l06961L67595
13666G67884C03580l6102M02435l33181J83157k05637K57478n1207k5963j54380
13656C40180M2700A82609M27630j56491J01588j54987k1127K39158o6731R7471
13646F49120O9360B15723K17725j77573K33528k02350k922J49903n2750J97068
13636E78352m0291J29255l01773H9186O34333C30577L45158k08083j40160J81068
$$ plain form
13708 255898 960700 593813 224601 417156 1030739 542751 756671 276877 439429 150530
13697 615876 566660 469285 520566 425470 508017 646071 375152 337700 627912 599421 388703
13686 388703 276340 1084462 559057 546576 259033 635750 277144 889715 445172 478664
13676 478664 776564 275325 982509 490237 275319 540374 597268 707250 400289 767884
13666 767884 303580 267478 669913 336732 519889 314252 571730 520523 494560 340180
13656 340180 382880 182609 610239 453748 555336 400349 379222 618380 551649 649120
13646 649120 718480 215723 433448 255875 489403 287053 284131 434034 381284 578352
13636 578352 538061 667316 365543 89186 723519 330577 675735 467652 327492 508560
13626E08560M0855a9827D64245j60611K82553k48238L58265k23424A99392p5733
13616A23659L47673k30599J28824a50376B32929m7101K18354p7704G3834J89781
13606B63615K65080j44612L38811H1096L78348k19560j01325L73605K56900A55430
13595A10141L34692J18945k50877A37853K00743j0771d1969B82605J12476K19136
13585F14217j36848A63591J13753A13090M37533j70494N3551R3372A16283A0839
13574D64942F7899O85462C70738J03541j21261j50670J28061J64131A04462L28694
13564D33156j0914L5378p0052A17720J70782J99009J0943E7912K90142J26130
13554D74184q9828L45008k10563k56663b9690B09290O027m8321K34578G0861J56036
$$ plain form
13626 508560 549415 -19827 464245 303634 586187 337949 696214 472790 199392 123659
13616 123659 471332 240733 369557 -150376 232929 185828 404182 326478 73834 263615
13606 263615 528695 384083 722894 81096 459444 239884 138559 512164 769064 155430
13595 110141 444833 563778 312901 137853 338596 327825 -41969 282605 395081 614217
13585 614217 477369 163591 277344 113090 550623 380129 433680 527052 116283 10839
13574 464942 67899 753361 370738 474279 353018 202348 330409 494540 104462 433156
13564 433156 422242 457620 387568 117720 288502 487511 498454 57912 348054 474184
13554 474184 384356 729364 518801 262138 -29690 209290 215317 166996 401574 70861 226897
13543B26897K32782j63152k4366N1805K92937A12255M61761k27058j57401A0305
13532a9484B08978K79318B40387G4848K14495Q7536I2660k6512J42257m6284K64322
13521D26443q481k04313r7141L1738o5349R3937L3246a31351C12662j4198R878
13510C08342A27997P3048L57865j99975j75119L08643j31557G9515K70272A73252
13499C44033r8665a04380I9310P0446M9523J53683k3860A26602N14178A82327
13488B43062j04363Q2842J14475K7178r091i8241A15994L45812m5858q7806j20769
13477B07373A02987c2318D23338P930J33153A81668L88471j81891j05535j4585
13467B68128k3909K50853A35441K87850A86702p7479R8887K85239k35523C3757
$$ plain form
13543 226897 459679 296527 272161 323966 616903 112255 574016 346958 189557 10305
13532 -19484 208978 488296 240387 74848 289343 376879 92660 66148 208405 162121 426443
13521 426443 417962 213649 116508 148246 82897 176834 210080 -131351 312662 298464 308342
13510 308342 127997 201045 558910 358935 183816 492459 360902 79515 349787 173252
13499 344033 245368 -104380 99310 169756 219279 372962 349102 126602 640780 182327
13488 243062 138699 221541 336016 363194 354103 -98241 115994 461806 415948 328142 207373
13477 207373 102987 -32318 423338 431268 564421 181668 570139 388248 282713 268128
13467 268128 244219 495072 135441 423291 186702 109223 208110 493349 257826 33757
13456D9286M88480k35208j22583J724r0820h9509A89067J17798j00471G2706J11491
13445A84197K62428G7651J23680a74572I4027L26896J7406r087A69579L44921
13435E14500k14409A48870M4362O548E6831P9158J09371g879C49342J70996B23603
13423h8169B40341L59801G315L34077p0590n5122K32075p8449A44043K13070d0039
13411A08631N2512b4042A69759a53703B47432p5523j3899n6496a8448j1395r94
13400c0837h314B85215j23073n6770R7566I4566L56668E7731K49638j35706a1654
13388i4112A57267O2896h3173F3441l0736b2061I5559J16257G4979N8352J81864
13377C15195a53564A92311R1743A26577J42679b469A66283J48061K90509k84232
$$ plain form
13456 49286 537766 302558 179975 181699 90879 -89509 189067 306865 206394 72706 184197
13445 184197 446625 77651 201331 -174572 94027 420923 438329 429242 169579 514500
13435 514500 300091 148870 193232 199780 56831 135989 245360 -7879 349342 520338 223603
13423 -88169 240341 600142 7315 341392 270802 215680 447755 369306 144043 357113 -40039
13411 108631 161143 -24042 169759 -153703 247432 171909 158010 101514 -18448 -29843 -30837
13400 -30837 -8314 285215 162142 105372 202938 94566 451234 57731 307369 171663 -11654
13388 -94112 157267 220163 -83173 63441 32705 -22061 95559 211816 74979 133331 315195
13377 315195 -153564 192311 284054 126577 269256 -2469 166283 314344 604853 320621
13367C20621j20409K10880A8041M16411j77932A01674K32702A60315C098K33777
13357B36875D3969K18376A16974P3597J35164p5994J24845l9494J13341j71432
13347B77001J48060n1153j22265l7745J09562A01856J53672C7094L12058j0938
13337C38214J86813B51220L9K52981j32067D4259K78348C8680k646J58468J36034
13326C30536q9193a9374B8898M96839k28148O583b9213j507B14959n9853p3658
13315H1448J83873C2774L13882j24588K35568j96516g7846D0141K03793r0989
13305A52945K50139E3129a40031B17103e3116B14290J06826J15345J65191C0388
13294c8862C51235a14935d5071A96444J0465K45010j62065i8894B5763J75890
$$ plain form
13367 320621 200212 411092 18041 434452 256520 101674 334376 160315 3098 236875
13357 236875 43969 262345 116974 190571 325735 249741 374586 335092 448433 277001
13347 277001 425061 373908 251643 213898 323460 101856 255528 37094 349152 338214
13337 338214 525027 251220 251259 504240 372173 44259 322607 38680 36034 194502 330536
13326 330536 241343 -19374 28898 525737 297589 304172 -29213 -30720 214959 155106 81448
13315 81448 265321 32774 346656 222068 457636 261120 -77846 40141 243934 152945
13305 152945 403084 53129 -140031 217103 -53116 214290 321116 436461 601652 30388
13294 -38862 351235 -114935 -45071 196444 206909 451919 289854 -98894 25763 201653
13284B01653K21902A21565J63289j4465e9442B06135l833O7703j7443o2515f4520
13272A06373b28605A14474J5443b3256F7972j9372K59879F6016a57819c841n8039
13261f1880l2265B80204d1616C37811K795A44869L9201M1046J18631H1650l1906
13250D9744K30931H0722l2117Q1555a03253a8660j66307R775A20247A7040J21484
13239A38524F5476J73943d9861A2965J32407K56167g4314A73988B6015i6998B33929
13227H1933j6489J07963P5197d2994A48609m4795d0159D1860P7802P3118C8981
13215i0917B12769K16978A83698m2561c1282o8767E5901J1499a40180E39649k15507
13204C24142n4030l7752n1223b435A90443J00032h823j34614A6254K50566J4271
$$ plain form
13284 201653 423555 121565 284854 270389 -59442 206135 202302 270005 252562 190047 -64520
13272 106373 -228605 114474 129917 -23256 67972 48600 308479 66016 -157819 -3841 -61880
13261 -61880 -94145 280204 -41616 337811 340606 144869 184070 225116 343747 81650 49744
13250 49744 280675 80722 48605 130160 -103253 -18660 -184967 -175192 120247 17040 138524
13239 138524 65476 239419 -49861 12965 145372 401539 -74314 173988 26015 -96998 233929
13227 81933 65444 173407 248604 -42994 148609 103814 -40159 41860 119662 192780 38981
13215 -90917 212769 429747 183698 141137 -31282 -100049 55901 67400 -140180 539649 324142
13204 324142 270112 232360 181137 -2435 190443 290475 -8823 -143437 16254 266820 281091
13193B81091o2306j07031C4033C32b22038c4289B4242c4955B66458j32097f0078
13181H0827g7267B70790K36154D4373D951K60939P9168j43708E4152A1805K56467
13170B68272a1311B22085r2112N3652N5947c73533J77758C47028D4696K2808O2030
13159A29534n1863g8437A41833K9076C0007b80720i4717D00335h913E4240J46344
13148B00584C664j799J51619A45K1994g6410A33652g0867Q862D0280d0461I192
13135a72660B88285E7066f2775C0625P2951g1779O100c512j48949e3937B60282
13123A05894R8091a79236b7819B13958c38432B06021a02073B35017B8170J95894
13113B24064A06039e3789H3768g5417A495a92470N0306j97908A89204F4753R2528
$$ plain form
13193 281091 218785 111754 34033 332 -222038 -34289 24242 -34955 266458 134361 -60078
13181 80827 -77267 270790 506944 44373 4951 265890 345058 201350 54152 11805 268272
13170 268272 -11311 222085 129973 183625 239572 -373533 -195775 347028 44696 67504 129534
13159 129534 77671 -78437 141833 170909 30007 -280720 -94717 400335 -8913 54240 200584
13148 200584 3664 1865 153484 145 22139 -76410 133652 -70867 -62005 40280 -40461 9192
13135 -172660 288285 57066 -62775 30625 103576 -71779 -65679 -3512 -152461 -53937 260282
13123 105894 203985 -179236 -27819 213958 -338432 206021 -102073 235017 28170 224064
13113 224064 106039 -53789 83768 -75417 1495 -192470 -142164 -340072 189204 64753 157281
13102A57281b50438A80317m2770e6724I736h5862E9120P2221Q5546a52286n0586
13091b02872i3577j49006E2532P1783a54183A47045b42181B32796A2187M54240
13081D66427m5289C8875L02076a00545n8765G2099J73345K16022B11092l339H0603
13069a47741G6918c3901D91703I8805J23533n0450H3215p946J47005I5399i0283
13057A58748f6812H0034l1852h7775n38A27684l258E0897J74263b15744E893J21557
13045A27450f0252H6320J7541K1295b5351l37853A88872e3319C20854n2430o1371
13034B07053G9279J12244O8162a37171j98931a01951d4456L433A12794a27601
13023D61L67951N9085A33506f044E39088A24994a54874B21429G3651M14632B17599
$$ plain form
13102 157281 -250438 180317 137547 -56724 9736 -85862 59120 131341 216887 -152286 -202872
13091 -202872 -93577 -242583 52532 124315 -154183 147045 -242181 232796 12187 466427
13081 466427 421138 38875 340951 -100545 -159310 72099 245444 461466 211092 207753 80603
13069 -147741 76918 -33901 491703 98805 222338 171888 83215 75269 222274 95399 -90283
13057 158748 -66812 80034 48182 -87775 -88313 127684 124426 50897 225160 -215744 5893 127450
13045 127450 -60252 86320 103861 125156 -25351 -363204 188872 -53319 320854 268424 207053
13034 207053 79279 191523 259685 -137171 -336102 -101951 -44456 -41023 112794 -127601
13023 461 368412 427497 133506 -6044 539088 124994 -154874 221429 73651 488283 217599
13011A23180J08102m9016B9660L6643j1477f8067j22565c2917A33512l7974L266
13000I8804j4218L40629C4566a06391B38681b49796C17513b77276A86614j108
12990A85506o2349Q568a13196e3037C60234g2794A31762J5343J12271J940C9514
12978b5540j03525K390n2139A03255Q6871l1204J85637A7782a63965A70409R9673
12967B70082m5797i8776G3685O932K72138j61261i9928B65056Q5355q8462A05151
12955G3849i2379n006q6391D96485H6377R6224f7700N672p3146I1138J91114E367
12942b24042f7524q6739B51351N746j27582a9485H0251g6257L3029k71126B30160
12930a6777I5932k5892c70617a48411b0574k42304A9242J78099L7580F3997O2032
$$ plain form
13011 123180 231282 182266 29660 66303 54826 -68067 -190632 -32917 133512 95538 98804
13000 98804 84586 425215 34566 -106391 238681 -249796 317513 -277276 186614 185506
12990 185506 123157 131725 -113196 -53037 360234 -72794 131762 147105 259376 261316 39514
12978 -25540 -129065 -126675 -178814 103255 190126 158922 344559 17782 -163965 170409 270082
12967 270082 224285 -98776 73685 80617 352755 191494 -99928 265056 350411 261949 105151
12955 73849 -92379 -97385 -183776 496485 86377 182601 -67700 -62028 -135174 91138 282252 5367
12942 -224042 -67524 -154263 251351 257097 129515 -19485 80251 -76257 -43228 -314354 230160
12930 -16777 95932 70040 -370617 -148411 -20574 -262878 19242 197341 234921 63997 126029
12919A26029g888l5102j23588e4886B6717d0720B22776K71740A22414J6885K96255
12908D35554c6250k43641G8764R5179c09168C37840q1264A14199a87266e1796
12897a80579O6772C90775A42462D130K37733r6344o3418K42564A11490K5802l3337
12886A03955A3163b09235R3051b2009B2706b61988J9085A13076c05262A89798
12875a8976I7014J26184a18027k13626c9867k4715j82675B52748r1315c0561B39076
12863a25539H1182f3427A30106a06019e2906A58841N0460I8663C5937J58645O4224
12852B58806b4212I232d8561A04603b29142K8514O0865M8444P225j88818A51517
12840a2439A31015c55335C8740i6717A953a65166B0433i622J229K592A14799J35491
$$ plain form
12919 126029 -7888 -42990 -166578 -54886 26717 -40720 222776 494516 122414 139299 435554
12908 435554 -36250 -279891 78764 173943 -309168 337840 256576 114199 -187266 -51796
12897 -180579 -113807 390775 142462 4130 241863 145519 82101 324665 111490 137292 103955
12886 103955 13163 -209235 -116184 -22009 22706 -261988 -242903 113076 -305262 189798
12875 -18976 97014 223198 -118027 -331653 -39867 -64582 -247257 252748 161433 -30561 239076
12863 -125539 81182 -63427 130106 -106019 -52906 158841 209301 98663 35937 194582 258806
12852 258806 -24212 9232 -48561 104603 -229142 -200628 -139763 -91319 -84094 -272912 151517
12840 -12439 131015 -355335 38740 -96717 1953 -165166 20433 -9622 -8393 -5801 114799 250290
12828B50290a16616A7358J83065b10359b866I8783K1892J53391a37035B74114
12817b9873r1610d4348a4166o5686k6553j75864e1162m11244A01235a69337L1301
12806a38036k2055r159e5927C18409p8914I8739A4773a42728b6861j62426A29319
12794H1440b68998B17567i2968q1562j77809a56031G3554K2756J39561a36491
12783b19711B50198a97349o4963A32235F2537b27041B88075f1624B28124b50036
12772A74913b67261A62780E7359J67534d25B40180h8195A93558i2539r9597B0487
12760a38693N1153B9858o730J2339J22141K60687a61626B1255K44771q7116a49075
12748A29632a5964A61309a01495A03459b39949c5347H459J42752a55823a5702
$$ plain form
12828 250290 -116616 17358 200423 -210359 -2866 98783 120675 274066 -137035 274114
12817 -29873 -121483 -44348 -14166 -79852 -106405 -282269 -51162 -462406 101235 -169337 -138036
12806 -138036 -160091 -169250 -55927 318409 239495 98739 14773 -142728 -26861 -189287 129319
12794 81440 -268998 217567 -92968 -174530 -352339 -156031 73554 96310 235871 -136491
12783 -219711 250198 -197349 -262312 132235 62537 -227041 288075 -61624 228124 -250036
12772 174913 -267261 162780 57359 224893 -425 240180 -88195 193558 -92539 -192136 20487
12760 -138693 -87540 29858 23128 35467 157608 418295 -161626 21255 266026 178910 -149075
12748 129632 -15964 161309 -101495 103459 -239949 -35347 8459 151211 -155823 -15702
12737b54138A47861e5154C93423a0454C4281M9132K13951q0197n7434J15317j11211
12726A63839k9085K46118G495Q572a51712A47708b30766D9359M2563i7557B04760
12714A93441m2568A2966M5069K73270o6995a08399A85326n8912K54864A58574
12703C7952K07488G1173R655J54205K784E2780L6367R9211D7520K23008B1533
12691A59465a77634C68228A78641o1050B3245J15208a62363A50210O4590J05460
12681C20260A27250R6662p8698F8358K6490J54406A01394L1892J08668N9391p3610
12670B27735b730C78699d4475J1688A26215J71608g4513A76128A4414K5926P19
12659D1059J70326P587H4858J83144f1241B38527i9607A40932e5870B39856O2155
$$ plain form
12737 -254138 147861 -55154 393423 -10454 34281 83413 297364 217167 159733 275050 163839
12726 163839 134754 380872 7495 16067 -151712 147708 -230766 49359 91922 -97557 204760
12714 193441 150873 12966 58035 331305 264310 -108399 185326 126414 381278 158574
12703 37952 245440 71173 80828 235033 237817 52780 89147 188358 47520 270528 21533
12691 159465 -177634 368228 178641 117591 23245 138453 -162363 150210 214800 320260
12681 320260 127250 223912 145214 68358 94848 249254 101394 133286 241954 301345 227735
12670 227735 -2730 378699 -44475 -32787 126215 297823 -74513 176128 14414 40340 41059
12659 41059 211385 218972 84858 268002 -61241 238527 -99607 140932 -55870 239856 302011
12648C02011m2160A17544c8677A36966k3187B7943K79291G8056a13927A12305
12637B71450b10181F8069N9362R6392b77490B1860b3096G7104K24594r3882o3152
12626A44664K56269j44595G9600O7883K55631A95994K13987e9071B402b74941
12615C14387I6796a64714F7424K19917i9891A91290H5232Q1320D524c10625k5574
12604c36199A3700a56536B71832q2037E166L62432j19665P2888A35963Q7521A7507
12592d5325C0226M5318O7881P6011a09615B93887j38654A3035K52798n9717a56026
12580g1246r1495A4103a80783b4350R523B77731e4359A26314a40338B65315f6951
12568A09222d304k91794B29599a909E2502b42904B87846B9631L36311e1156I4140
$$ plain form
12648 302011 259851 117544 -38677 136966 113779 27943 307234 78056 -113927 112305
12637 271450 -210181 68069 127431 223823 -277490 21860 -23096 77104 301698 207816 144664
12626 144664 400933 256338 79600 147483 403114 195994 409981 -59071 2402 -274941
12615 314387 96796 -164714 67424 287341 -99891 191290 85232 166552 4524 -310625 -336199
12604 -336199 13700 -156536 271832 189795 5166 367598 247933 320821 135963 223484 17507
12592 -45325 30226 75544 143425 219436 -109615 293887 155233 13035 265833 206116 -156026
12580 -71246 -162741 14103 -180783 -24350 -14827 277731 -54359 126314 -140338 265315 -66951
12568 109222 -4304 -296098 229599 -1909 52502 -242904 287846 29631 365942 -51156 94140
12556a06408J1261H9841L13094c1460j48176h2341j81380G4869c30255B10976
12545A63350b56640C1786M6466J40655n6421B0526D821c12879J50329A60435a08018
12533a32989B90352H6539A5979a61478B44076n9517C298R2550a54694A4403J18614
12522A33017L33623A77915b59m2076A15607m036n3447D854J44133a13987d225
12510A83679H5266a01486C4188P7723M4906c62087a73063R931I3982a97707B79411
12498i6424B34651m8627b20163I6110e8430o4009C10456B3255e7570j51204J2336
12487a96438B40261c179B26593a12924b7763k7705j77679Q9372A18016J33983
12477B51999i3616K609l5958A60675a62050B82208n8044K1842a58167I6421K28558
$$ plain form
12556 -106408 -95147 89841 402935 -31460 -179636 -82341 -263721 74869 -330255 210976
12545 163350 -256640 31786 78252 218907 162486 20526 4821 -312879 -162550 160435 -108018
12533 -132989 290352 86539 15979 -161478 244076 184559 3298 95848 -154694 14403 133017
12522 133017 466640 177915 -259 -42335 115607 111571 58124 4854 148987 -113987 -4225
12510 183679 85266 -101486 34188 111911 156817 -362087 -173063 -163132 93982 -197707 279411
12498 -96424 234651 186024 -220163 96110 -58430 -122439 310456 23255 -57570 -208774 -196438
12487 -196438 240261 -3179 226593 -112924 -27763 -55468 -233147 -143775 118016 251999
12477 251999 -93616 -91007 -126965 160675 -162050 282208 224164 246006 -158167 96421 324979
12466C24979b99857h5716C53440a21224d0463B1590K80159A8963a03158A0523
12455a96808b8721p9791a9051I0343J16305d5402A94587a91403m5839b3159k89998
12444c13157g6767A1815K76825i8771c0870j59581C4461b45692B3795J10332J23931
12433B58058e823n2737B20146a86810A12660O113A8273J72420c76667B6069F158
12421H94M3147K2375g6704I3596a3102j85271A57661b91062I4530b8817j39480
12410a68297B02444A9023b34470B14407D8889b88757J39244D73112h3119A78142
12399a64089I5833a89128e8566G7005a01861B76346B7067J6523M1656J51714A05335
12387C293c12611b8056j24576c3810A26828b4723P022j14465R998C67565b07745
$$ plain form
12466 324979 -299857 -85716 353440 -121224 -40463 21590 301749 18963 -103158 10523
12455 -196808 -28721 -108512 -19051 90343 206648 -45402 194587 -191403 -237242 -23159 -313157
12444 -313157 -76767 11815 288640 -98771 -30870 -190451 34461 -245692 23795 134127 258058
12433 258058 -5823 -58560 220146 -186810 112660 118773 18273 190693 -376667 26069 6158
12421 894 44041 66416 -76704 93596 -13102 -198373 157661 -291062 94530 -28817 -168297
12410 -168297 202444 19023 -234470 214407 48889 -288757 -149513 473112 -83119 178142
12399 -164089 95833 -189128 -58566 77005 -101861 276346 27067 43590 85246 236960 105335
12387 3293 -312611 -28056 -152632 -33810 126828 -24723 -17701 -132166 -122168 367565 -207745
12375A32224J29292a13890J5722M5768B29325r5951I508a75315A76492D4540b04664
12363C8254R5557g6370B25329a2108j15477B47915j18820R1292N3113h026G68
12351a52762A72057F7733q665K76952j47809M2345p5000j3752b06707P942g5132
12339D5984J82981H3991g381B13218e6339H5872F124J17165a88827j6078B88152
12327A97640e04743a29358o7626P7797A65578e5829l4949A11610d0815D16532
12316i6496l70393I8773O7485b22744H4311m2097A5694a39686D613M8287g7287
12304b29601A61401o2137B063J8996J0922b15489K3577R5682K6010o5596D6467
12292A1498h4517j04898J0298h8026E0137o699K27058b8620k25866A77466L116
$$ plain form
12375 132224 261516 -113890 -98168 -52400 229325 133374 9508 -175315 176492 44540 -204664
12363 38254 133811 -76370 225329 -12108 -127585 247915 129095 220387 273500 -8026 768
12351 -152762 172057 67733 59068 336020 188211 230556 155556 141804 -206707 -198765 -75132
12339 45984 228965 83991 -7381 213218 -56339 85872 6124 123289 -188827 -204905 288152
12327 197640 -504743 -129358 -196984 -119187 165578 -55829 -90778 111610 -40815 416532
12316 -96496 -466889 98773 166258 -222744 84311 42214 15694 -139686 4613 52900 -77287
12304 -229601 161401 99264 2063 21059 31981 -215489 -191912 -96230 -70220 -135816 46467
12292 11498 -84517 -189415 -179117 -88026 50137 43438 270496 -28620 -254486 177466 180582
12281A80582H4575a13442B93341H8748O9704K96355A48665n0444J40197K41823
12271D80241j50767f3856B8463a16906D90734j21213f5705A73455E6928d613A92236
12259b38257B25766I4289J01168I5339a86425F1987K53515j39003J34851g6690
12248E0648B3564c10218I3085N3381c3474E1376J92759A20266N3305b2797B46694
12236a45797M3367H2341J32846k4318M2514K88242D0071K02506A08863L6114a82605
12224C1400e0581K2134B13860k3735D6346K20650j30703J05373A6777K48006L168
12213B67951d2497F1005J38003b37677B79011j23347a8615A65994G3846J52272
12203B26118e0206B541a10423B45168h0694B00878M22330C8244J10098C0637L58762
$$ plain form
12281 180582 84575 -113442 293341 88748 158452 454807 148665 98221 238418 480241
12271 480241 329474 -63856 28463 -116906 490734 369521 -65705 173455 56928 -4613 192236
12259 -238257 225766 94289 195457 95339 -186425 61987 315502 176499 311350 -76690
12248 50648 23564 -310218 93085 146466 -33474 51376 244135 120266 173571 -22797 246694
12236 -145797 -102430 82341 215187 190869 233383 521625 40071 242577 108863 144977 -182605
12224 31400 -50581 -28447 213860 190125 46346 266996 136293 241666 16777 264783 267951
12213 267951 -42497 61005 199008 -237677 279011 155664 -18615 165994 73846 226118
12203 226118 -50206 2541 -110423 245168 -80694 200878 623208 38244 148342 30637 389399
12192C89399l9021J13760a60832M3421D28975g857A38406M0375J146j1338P2529
12181B41118G8695l2056J53658R2401P2876n8656A19017a33161I3419J23775f6361
12169A29155C5692h1126E15285H5846a29719B31250G1436J65489A04065j8929
12159H5136M927M66903a51325k29415A34674i4395B05271d5851B05718b38672
12148B21142n649e3251A41006n9315k6743j140J38192O6524c7338F3613K71023
12137C34636I7737j7118J52006i0016M2930A07162J44818e1105A91574C0845c03988
12125d34489J96741D1572h2397K7590q4065O2419b7826J1069k69732a33221I7114
12113A66296e7265B3756c20138G9906d3268j81754J02959B60578a25806d872C9473
$$ plain form
12192 389399 350378 464138 -160832 -117411 428975 -7857 138406 178781 179927 168589 241118
12181 241118 78695 46639 200297 292698 365574 306918 119017 -133161 93419 217194 -66361
12169 129155 35692 -81126 515285 85846 -129719 231250 71436 236925 104065 85136
12159 85136 90063 556966 -151325 -380740 134674 -94395 205271 -45851 205718 -238672
12148 221142 215493 -53251 141006 81691 54948 53808 192000 258524 -37338 63613 334636
12137 334636 97737 80619 232625 -90016 -47086 107162 251980 -51105 191574 30845 -303988
12125 -434489 -237748 41572 -82397 -54807 -138872 -76453 -27826 -16757 -286489 -133221 97114
12113 166296 -57265 23756 -320138 79906 -43268 -225022 -122063 260578 -125806 -4872 39473
12101g6894B82147m0047a76866N6286H9929e1877B18612A03819h1765A42333e5632
12089D51870B05852j01955a04481k0953B68981j20728L30684A27294E4686a06383
12078a66007A57454f0070j45986F07945J77537R47553k44340F99242C36114L6227
12068C72341a33613E05J44008D7929J45566E0682K34734A35068c13849B16769
12057E7205b26651H5571A7583a12378c6656j23902C6453b61441C22301A13917
12046a89239M1273A8583a4259l94711J05909A32802a90745C8822a68359A8513
12035d2422r5088G8234J84616F4085b8323o1697B18094E5092J18988Q0692c9618
12023E3158a10196k38692j72456A25132R1533C4246b16666a8621j61257A47675
$$ plain form
12101 -76894 282147 242100 -176866 -120580 89929 -51877 218612 103819 -81765 142333 -55632
12089 451870 205852 103897 -104481 -125434 268981 148253 478937 127294 54686 -106383
12078 -166007 157454 -60070 -206056 607945 785482 1733035 1488695 699242 336114 372341
12068 372341 -133613 505 144513 47929 193495 50682 285416 135068 -313849 216769
12057 57205 -226651 85571 17583 -112378 -36656 -160558 36453 -261441 322301 113917
12046 -189239 -147966 18583 -14259 -408970 -303061 132802 -190745 38822 -168359 18513
12035 -42422 -137510 78234 262850 64085 -28323 -90020 218094 55092 174080 254772 -39618
12023 53158 -110196 -348888 -521344 125132 216665 34246 -216666 -18621 -179878 147675
12012F5970c15397B16861J12513a31193O5161A49577c8139b699C7602J09700b80397
12000a5346j12577B02871a07662l3513J0373H4896a91807B75727D4644J22730
11990A67374a62506C09541a24988I6384i4225d3175o6883A11418c055j29007C0599
11978A25307c28681A14273L0316q286j4001b4698A55737R4088a59063b9822p5261
11967a05083l61843A5872J30957b20218n7778j18363B31473a8171j703C2518h204
11955b82546g507p2982j82391C1078P4814J13638a6797q9344I6962K5974e8936
11943a49837D8965A9179b50735A83810b92930G051b297j46988d1231a241A1598
11931A20265c18813C9170r830a55335A26616E0804c68286J71723K4544j51457
$$ plain form
12012 65970 -315397 216861 329374 -131193 -66032 149577 -38139 -2699 37602 147302 -280397
12000 -15346 -127923 202871 -107662 -141175 -130802 84896 -191807 275727 44644 167374
11990 167374 -162506 309541 -124988 96384 -94225 -43175 -110058 111418 -3055 -132062 30599
11978 125307 -328681 114273 144589 136303 122302 -24698 155737 249825 -159063 -29822 -105083
11967 -105083 -466926 15872 146829 -220218 -277996 -396359 231473 -18171 -19874 32518 -8204
11955 -282546 -7507 -80489 -262880 31078 105892 219530 -16797 -106141 96962 122936 -58936
11943 -149837 48965 19179 -250735 183810 -292930 7051 -2297 -149285 -41231 -1241 11598
11931 120265 -318813 39170 29340 -155335 126616 50804 -368286 -196563 -172019 -323476
11921c23476a24535A26196n6779M2814b05907d5017A6174K28842B422N2792g6148
11909B40469a99351K5801C24987p2913a0476h39G7128a36666K3065a4212B11534
11897b44328J11563q8043A44803j5973a80720A88811B3925K7244i2359j50878
11887b43237b3161A77058c2241j90813e8741B74844m2828a91464A53956a2399
11876B8085J17273a23120d8857a1527q6005B35653A4795c14054a673m21012a45298
11864a95479A47698a6249j59807A36248b8842k99677a54418f7318I8204P7492
11854A75696C8891c2009A82834A6820a56594D7055b02266I1965a33629M8673q3206
11843a68162G9181i8488d4856j16824c6480L070m27480F1164a51942B3990M228
$$ plain form
11921 -323476 -124535 126196 69417 112231 -205907 -45017 16174 245016 2422 55214 -76148
11909 240469 -199351 -173550 324987 252074 -10476 -839 77128 -136666 -113601 -14212 211534
11897 -244328 -132765 -220808 144803 128830 -180720 188811 23925 51169 -92359 -243237
11887 -243237 -23161 177058 -32241 -223054 -58741 274844 232016 -191464 153956 -12399
11876 28085 145358 -123120 -48857 -11527 -97532 235653 14795 -314054 -1673 -422685 -145298
11864 -195479 147698 -16249 -176056 136248 -28842 -328519 -154418 -67318 98204 175696
11854 175696 38891 -32009 182834 16820 -156594 47055 -202266 91965 -133629 -84956 -168162
11843 -168162 79181 -98488 -44856 -161680 -36480 -33410 -460890 61164 -151942 23990 28218
11832B8218P7644k7083J71545b92931L6579B52177A05990a81358A20916O3259
11822A84175B6045a07745j6455j55203f5254j49457A64325p7890L5445b41469
11811B09815A198a41247H2519b70172j79188A86104M3511a06317j34596c3300
11800a16166A57780b4616D6721l25n587N5550L288b08582B17362a27054K3851
11789a03203m8219A09306O7465f5785j85442b1720A11656f4229m32202C6891a18531
11777b70094J24057O2697b3739E4880K59317A27880P6453a36712B53021l7285
11767B15736b27851B52741c91899B47272b2669B47260n9672l6113D2868J39897
11757A82765K5123J34674Q474i8503M7292r4671M697A40270A9070e1538G3850
$$ plain form
11832 28218 105862 78779 250324 -292931 -256352 252177 105990 -181358 120916 184175
11822 184175 26045 -107745 -124200 -279403 -65254 -214711 164325 86435 121880 -241469
11811 209815 1198 -141247 82519 -270172 -449360 186104 229615 -106317 -240913 -33300
11800 -116166 157780 -24616 46721 46396 40809 96359 99647 -208582 217362 -127054 -103203
11789 -103203 -151422 109306 176771 -65785 -251227 -21720 111656 -64229 -496431 36891 -118531
11777 -270094 -146037 -83340 -23739 54880 314197 127880 204333 -136712 253021 215736
11767 215736 -227851 252741 -391899 247272 -22669 247260 187588 151475 42868 182765
11757 182765 207888 342562 351036 -98503 -51211 -145882 -141185 140270 19070 -51538 73850
11745C22001c03273D2957a2300j82693O9963b1182r7741H8618i0776A46139G1915
11733b57068a7967k5184E7970b4684A05443h5514B35119c561F1363K4918h6759
11721A63039p4149g2824H2083L08700i9971D5692K13822d3880j09344G564J26257
11710A33821k1297M1898E3272J75694j10292c2480A25197E2433A0401h2368A29344
11698b3407m76367a90289g1278m14441a40276G0953p801A4048J21667b46055f0939
11686E4645a05734C5721c18613R6519J7633B949K76741e1867b5573j11027r2526
11675b29126J07665A26203L3457j8756A5751d4044H7304i7338n9111D1648J23996
11664A65644p2379J17129c58903B95327j00206i7481C3448i2573D7067O8178j3747
$$ plain form
11745 322001 -303273 42957 -12300 -194993 -125030 -21182 -118923 88618 -90776 146139 71915
11733 -257068 -17967 -43151 57970 -24684 105443 -85514 235119 -3561 61363 86281 -86759
11721 163039 88890 -72824 82083 390783 -99971 45692 259514 -43880 -153224 7564 133821
11710 133821 112524 154422 53272 228966 118674 -32480 125197 52433 10401 -82368 129344
11698 -23407 -499774 -190289 -71278 -485719 -140276 70953 63152 14048 135715 -246055 -60939
11686 54645 -105734 35721 -318613 -222094 -204461 2949 279690 -51867 -25573 -136600 -229126
11675 -229126 -121461 126203 159660 140904 15751 -44044 87304 -97338 -156449 41648 165644
11664 165644 93265 210394 -358903 295327 195121 -97481 33448 -92573 47067 115245 101498
11653A01498L01383E7123d8392A00406a51026p6055a07248A01081O6959b86891
11642D3550K26305E1412b07056q134i5555A8158a82500P1433j49949k57g4761
11630a50339k5414A17917D480a24700H6958N7927m5426a4645k9814J8878A30443
11618c3111E4000J05319J39493I2113g7981B80990F7599P9630k0559a01030A7859
11606i188k69418B86712p7219h6872A52187a29474A48198b00071C08743D5189
11595I900a15722j39311F7342h1422B0237K15751n9789D4811J33610i3073J0241
11584h2832h615c086A07297K62614G0182a02257B14682c96061J90372k1400I3880
11572d4816J6818n1854j3567G0063M772K06674m1878K58190C0398K78821K3966
$$ plain form
11653 101498 402881 57123 -48392 100406 -151026 -227081 -107248 101081 168040 -286891
11642 43550 269855 51412 -207056 -215190 -95555 18158 -182500 -111067 -261016 -261273 -74761
11630 -150339 -175753 117917 4480 -124700 86958 144885 99459 -14645 -44459 -25581 130443
11618 -33111 54000 159319 298812 92113 -77981 280990 67599 147229 126670 -101030 17859
11606 -9188 -278606 286712 209493 -86872 152187 -129474 148198 -200071 308743 45189
11595 9900 -115722 -255033 67342 -81422 20237 235988 176199 44811 178421 -93073 -82832
11584 -82832 -8615 -3086 107297 369911 70182 -102257 214682 -396061 -205689 -227089 93880
11572 -44816 -27998 -79852 -93419 70063 74835 281509 239631 497821 30398 309219 333185
11561C33185I8709M7670n2620i7665A79103m1347l6072J78322a21253k46225C66200
11549a48739j5192G0244A2863c83847A65936C9067J71482E3122L60771A28212
11538A38662F2908e500j1990A53865A7653K99093A21941J56589C7521O8390n0754
11527E5157Q3802K75488A06867A5201c3447A98253A0445P4134H356a2100G8335
11515B38802J31647A09737C1184A2718O3281K34668I4994L89417F3721L09947
11505C73668A77382p8908J75726b32852A21055Q0970D4234i3460C53251C8354
11494h4964F4972L39255j81690A7739K37311A19468a9238C96113a7390B74966
11483C39947A25988J0067J0138B8164m674J79624q6080n7708j4641K82969m9024
$$ plain form
11561 333185 98709 146379 93759 -97665 179103 137756 101684 280006 -121253 -367478 366200
11549 -148739 -163931 70244 12863 -383847 165936 39067 210549 53122 413893 128212
11538 138662 62908 -5500 -17490 153865 17653 316746 121941 278530 37521 105911 55157
11527 55157 138959 414447 106867 15201 -33447 198253 10445 84579 8356 -12100 78335
11515 238802 370449 109737 31184 12718 75999 310667 94994 484411 63721 373668
11505 373668 177382 98474 274200 -232852 121055 202025 44234 -93460 353251 38354
11494 -84964 64972 404227 222537 17739 255050 119468 -19238 396113 -17390 274966
11483 339947 125988 136055 146193 28164 23490 203114 117034 59326 44685 327654 278630
11472B78630J9325g8104A51996e7116A43501C3642K71418A28169b3671A45027
11461A10607K5212J18850p4716b03904C29159E1364a41390A82735N3276a84924
11450A12595M6776F4210o987e0331j86002B16493L7487g1914B26234A2133b16280
11438G8421c6074j41604A26859a924r7957A21028A5440P7187K03587e6601G7254
11426b08796R7362A34575M9339b24694E4234A3472K01277J7086a6619A47273h5212
11414B42736a24843D8523O2958P4706p8600b11883A97256a42203H5141a69571
11403G0720a32354B97121F3534d6871c549p0126G803L45859A23500k4749K27047
11392C25798f7236A83304k4617d3719A95793b2985n4093o0216B02472p2226n6104
$$ plain form
11472 278630 297955 -78104 151996 -57116 143501 33642 305060 128169 -23671 145027
11461 110607 135819 254669 179953 -203904 329159 51364 -141390 182735 236011 -184924
11450 112595 159371 64210 57223 -50331 -236333 216493 253980 -71914 226234 12133 -216280
11438 78421 -36074 -177678 126859 -1924 -99881 121028 15440 92627 296214 -56601 77254
11426 -208796 -111434 134575 183914 -224694 54234 13472 214749 231835 -16619 147273 -85212
11414 242736 -124843 48523 111481 186187 107587 -211883 197256 -142203 85141 -169571
11403 70720 -132354 297121 63534 -46871 -3549 -73675 7803 353662 123500 98751 325798
11392 325798 -67236 183304 158687 -43719 195793 -22985 -77078 -137294 202472 130246 74142
11381G4142d3189E0390L7698J19179d5757n5253H7477c01144d1471A15256h4724
11369b26933A09106l0972f2785j63706k8430N9964A5281K49944q8919a5429A4963
11357a47460D8685J6485b08931J02500j25241D1071a68055O0144E3640H687P3475
11346H2162a09531N1011m02481d7088A95198o6514a38196j54303C150L80316a18582
11334i7410C23827a7537A78591c27662b4439q5619E2869a60910C1351c28890R3096
11323b35794C4996i5439A4289b3604A87079a9107k9728D3380j951a74352A21644
11311a88194k0733N5393e8801j40979k8472P7990n0883E2602d0543E6129O2945
11300A19074c11497J18306E6883a79234c9272D8545K5486c533C36037F0675d14734
$$ plain form
11381 74142 -43189 50390 88088 207267 -45757 -101010 87477 -301144 -41471 115256 -84724
11369 -226933 109106 78134 -62785 -226491 -254921 -194957 15281 265225 176306 -15429 14963
11357 -147460 48685 65170 -208931 -106431 -231672 41071 -168055 -107911 53640 8687 82162
11346 82162 -109531 -58520 -461001 -47088 195198 128684 -138196 -292499 3150 383466 -118582
11334 -97410 323827 -17537 178591 -327662 -24439 -110058 52869 -160910 31351 -328890 -235794
11323 -235794 34996 -95439 14289 -23604 187079 -19107 -48835 43380 41429 -174352 121644
11311 -188194 -208927 -153534 -58801 -199780 -228252 -150262 -201145 52602 -40543 56129 119074
11300 119074 -311497 -193191 56883 -179234 -39272 48545 74031 -3533 336037 60675 -414734
11288a59410C17255a67062A17646b46156a19271k2803B16301a05580I5836b77413
11277b13306K5088B81999g1986C8926a09456I8351b4422B77119b6001r9242k53908
11266c79151E388K1392J11569b56911J20917n8182A82864B5246a39329L5988l01266
11255d04607A34259J32819A0220K2663J08269D5074a39467o4395f380k47155J26082
11244a27453G6454b8575j07639o2047A16656l7565a752j5980l3560B77652C0983
11232c8094A51309N7036d0942A21987b3774q128G1732a19784j99798c575B08828
11220E1097c54956F2011M6504f9737C5669a6231j65577M2541j7383n4572A1428
11208A94515j9167J38254b23377I5168k9020e5061C2513j1121a34319j40503C42273
$$ plain form
11288 -159410 317255 -167062 117646 -246156 -119271 -142074 216301 -105580 95836 -277413
11277 -213306 -188218 281999 -71986 38926 -109456 98351 -24422 277119 -26001 -125243 -379151
11266 -379151 5388 26780 138349 -256911 -135994 -194176 182864 25246 -139329 -103341 -404607
11255 -404607 134259 267078 10220 32883 141152 45074 -139467 -203862 -6380 -253535 -127453
11244 -127453 76454 -28575 -136214 -198261 116656 79091 -1752 -17732 -51292 277652 30983
11232 -38094 151309 208345 -40942 121987 -23774 -31902 71732 -119784 -319582 -3575 208828
11220 51097 -354956 62011 108515 -69737 35669 -16231 -181808 -139267 -156650 -211222 11428
11208 194515 175348 313602 -223377 95168 66148 -55061 32513 21392 -134319 -274822 342273
11196A17391i9544C93943b97072B7850L02235f8039C69076a51608J8412j92384
11186c25580J23491b7277B03446E4332b63807f7226K6928j6197m2970A38432P0507
11175B08939q1063M5257d7568H6960K33518b5642k30462E9175A8476f0725j17813
11164a78538N1929k22880B8512J83207i7720j77898p679I619L9812a82979j19581
11153c02560a2078A96058f1761B51919A4944b01428C792c4132F2630a17788b4109
11141a39106A32905a97578A23406J05639h8714C46868A62954a25286A31280A7552
11130f780A61971D7686P6659g4002j55488K6885B87893j31934K55215A61598a09175
11118b11646m1887F9400a23786N9233A76799J0567I2599L83259A83538q2117C9485
$$ plain form
11196 117391 -99544 393943 -297072 27850 330085 -68039 369076 -151608 -133196 -325580
11186 -325580 -202089 -27277 203446 54332 -263807 -67226 -40298 -56495 -99465 138432 208939
11175 208939 127876 173133 -47568 86960 320478 -25642 -256104 59175 18476 -60725 -178538
11164 -178538 -126609 -349489 28512 211719 -97720 -275618 -283297 9619 49431 -182979 -302560
11153 -302560 -12078 196058 -61761 251919 14944 -201428 3792 -34132 62630 -117788 -24109
11141 -139106 132905 -197578 123406 229045 -88714 346868 162954 -125286 131280 17552
11130 -6780 161971 47686 124345 -74002 -229490 -202605 287893 155959 411174 161598 -109175
11118 -211646 -253533 69400 -123786 -64553 176799 187366 92599 475858 183538 101421 39485
11106B10828j7087G2157N8210J25041A26836K14598c8649E46876b51005f0023
11095B98890P2697j72132a09700b3918e513E2300J63714R6817I4715J87978K36570
11084E19263N368A02662K08177A54540K39026A14932M62813A96486n8375K7863
11074A65974A8514L17937J46571j64613l9694j25375F1062M33533j03295j71499
11064B19801J70578q8086P2939J53195k40195J99778k7572N60551l77738J13880
11054G57131j42497p9515O7309L34757D29031Q0268J26155K48082k48398n1416
11044E83722L56398J42709j03625k24228q4266R6095r5665J46547j97794J73157
11034G93050J20690r8124j16681K01702q3785k79894L67459l38961J26505L41868
$$ plain form
11106 210828 193741 72157 130367 255408 126836 341434 -38649 546876 -251005 -60023
11095 298890 371587 199455 -109700 -23918 -5513 52300 216014 312831 94715 282693 519263
11084 519263 524631 102662 310839 154540 393566 114932 577745 196486 138111 165974
11074 165974 18514 336451 483022 318409 278715 153340 61062 494595 391300 219801
11064 219801 390379 302293 375232 528427 288232 488010 460438 1020989 643251 757131
11054 757131 614634 535119 602428 937185 429031 509299 635454 883536 635138 583722
11044 583722 940120 1082829 979204 754976 670710 766805 671140 817687 619893 793050
11034 793050 913740 815616 698935 900637 816852 536958 904417 565456 691961 1033829
11024A033829j76206k60352M2499k84441L88298M52341D28231J03668J54749l1256
11014F55392B73741L68144r4680L3054r931J88745k69533n9133l6764J88026L85625
11003I67294m56810J98533R0788j71775Q6517J0886J44100l60495B39439O06769
10993H46208k08879K13374r2985j99657K53255P3181l7425j03939K27416k32889
10983G37660J98665L35723j10964J36221J56262o3140L81964N93438m2662J24702
10973B447869K44620K33391p872j7858l01374l53244K80738k27417l93108J82004
10963B087749m63855L33439j67790k16188K01880j25052J05074j00783L37727
10954A992201n98051P3298j95784k60555m5766C73917J83601A69970J26467J48895
$$ plain form
11024 1033829 857623 597271 639770 355329 743627 1195968 428231 531899 686648 655392
11014 655392 273741 641885 547205 580259 570328 759073 489540 430407 393643 581669 967294
11003 967294 510484 709017 799805 628030 714547 725433 869533 509038 239439 846208
10993 846208 637329 850703 757718 558061 811316 884497 847072 743133 970549 737660
10983 737660 936325 1272048 1161084 1297305 1453567 1390427 1772391 2365829 2323167 2447869
10973 2447869 2692489 2925880 2918008 2900150 2598776 2245532 2526270 2298853 1905745 2087749
10963 2087749 1623894 1957333 1789543 1573355 1775235 1650183 1755257 1654474 1992201
10954 1992201 1394150 1467448 1271664 1011109 965343 373917 557518 169970 296437 445332
10944D45332j31269A04320P7169b61214D46702a2761A25579A7945d6416j03758
10934a50174I7576d6221C55473m1461q2807a59503M0747o0748c1400F3472a82155
10922A96357J01206q4575A4116K63178E738K01898B5128J28139p2731L6396B9170
10910B75818C3992J27064R2344D9924J72082k3511G9957e84108A87624D3150a37595
10898c00539J47932n7314A70280c07696A72745H5109d2281A74442M626e9093A93627
10886e7545l7402A31762b73087J24098A17627d4929B05616I033a12254l4325O4633
10875h1946B75511A01803b95283a26527d5446j18426j10842A71360c004H0228
10864c3376j22234d4272p5718A87861a01173j95957B04094P6144g8330l0942B21965
$$ plain form
10944 445332 314063 104320 181489 -261214 446702 -12761 125579 17945 -46416 -150174
10934 -150174 97576 -46221 355473 314012 231205 -159503 -118756 -179504 -31400 63472 -182155
10922 196357 297563 212988 14116 277294 5738 207636 25128 153267 80536 116932 29170
10910 275818 33992 161056 253400 49924 222006 198495 79957 -584108 187624 43150 -137595
10898 -300539 -152607 -209921 170280 -307696 172745 85109 -42281 174442 179068 -59093 193627
10886 -57545 -94947 131762 -273087 -148989 117627 -44929 205616 9033 -112254 -146579 -81946
10875 -81946 275511 101803 -295283 -126527 -45446 -163872 -274714 171360 -3004 80228
10864 -33376 -155610 -44272 -119990 187861 -101173 -297130 204094 280238 -78330 -109272 221965
10852c1354E0821L17960F3727r99K27411H0170b75252B16844I5224Q0906q1329
10841I4801K03870b36188P0956A92924J03534I709d5352p15o154A28823h1842
10829A54906a8908A87431D1167K04017a18188k9816d9653j03670l5551D80940
10818a55070j8247H923b22056B66481I6643b65272c9515A70231c146q3965E9626
10806a81968F3888b16196A50760J61196b96731B37547G9144i0347B75517A11219
10795e31805a99670e4385j62015j81044a84588o6223A80132b52811A230a77020
10784a34518e6489B20248e2733E9324M106J3832J35419h363n431j0526E4724b6554
10771D4818c4170n3637F7848b15610q2457d9241F5151d0757A30141c25162a31881
$$ plain form
10852 -31354 50821 368781 63727 62728 290139 80170 -275252 216844 95224 176130 94801
10841 94801 298671 -236188 -165232 192924 296458 9709 -45352 -46067 -52221 128823 -81842
10829 154906 -18908 187431 41167 245184 -118188 -148004 -49653 -153323 -188874 480940
10818 -155070 -173317 8923 -222056 266481 96643 -265272 -39515 170231 -3146 -87111 59626
10806 -181968 63888 -216196 150760 311956 -296731 237547 79144 -90347 275517 111219
10795 -531805 -199670 -54385 -216400 -397444 -184588 -250811 180132 -252811 1230 -177020
10784 -134518 -56489 220248 -52733 59324 63430 77262 212681 -8363 -13794 -24320 54724 -26554
10771 44818 -34170 -87807 67848 -215610 -298067 -49241 65151 -40757 130141 -325162 -131881
10759A50990a94624N9245H0277K02459p973D9139a58200o2665B8812K26731a4423
10747b45919A44478m8633J89864H4463J33472a10061q9869A33209l674J16465
10737B46000m323a07952j64263C4913f6116j7767J7826D1874Q2312h5354B54674
10725c47315A57965G1315J65481F9324a07778k24555a53532o1861a04248o586
10715a10834l2998A7923M2537b2122n0810L0365J0627A72728b21410A81396g8244
10703a26017G4970K8357R4473C4914N3217d0431j31919j82744A59292d945j38245
10692a43190b7244j59335D8364d28688B152J96481a7780m4119k757b9835A2579
10680D2689Q7551b5919A78784e3304l58628a41974d9845M688A12563L2956b33437
$$ plain form
10759 150990 -194624 -135379 80277 282736 274763 49139 -158200 -220865 28812 255543 -14423
10747 -245919 144478 95845 285709 84463 217935 -110061 -199930 133209 129535 246000
10737 246000 241677 -107952 -272215 34913 -66116 -83883 -66057 41874 124186 -85354 254674
10725 -347315 157965 71315 236796 69324 -107778 -332333 -153532 -215393 -104248 -110834
10715 -110834 -143832 17923 60460 -22122 -72932 -42567 -31940 172728 -221410 181396 -78244
10703 -126017 74970 103327 197800 34914 88131 -40431 -172350 -355094 159292 -4945 -143190
10692 -143190 -27244 -186579 48364 -428688 2152 198633 -17780 -61899 -64656 -29835 12579
10680 42689 130240 -25919 178784 -53304 -411932 -141974 -49845 -45157 112563 145519 -233437
10668c6946l3623A62003b479j7462A07331b2949I0151a98154A8327a57039R805
10657a47234D0470h5489k3859r388a6809l90762J63155i2492k3437m17999a36578
10645d30674J45285i9825q0579L8913j93874a47162c8776j58212O0144A50761
10634b00655j1888j14476F3365J57077i6327D09373b9790B0916J72262q611k1980
10623A62587D5183i9429j47974J8646d7473j20699b7871j252C0762a18208j63056
10612b81264B07261p6850e9398k83351J0812B16592I5264c4412B900i6338C0882
10600A37516b72171G6459A5136L19934D7714d93021b06296d3479C7782N8239M7980
10589A44001a03982d7629n6942B04434f8213a4054k41787J22729F6519b76209
$$ plain form
10668 -36946 -70569 162003 -2479 -19941 107331 -22949 90151 -198154 18327 -157039 -147234
10657 -147234 40470 -85489 -109348 -118736 -16809 -407571 -244416 -92492 -115929 -533928 -136578
10645 -430674 -285389 -99825 -180404 -141491 -335365 -147162 -38776 -196988 -136844 150761
10634 -200655 -212543 -327019 63365 220442 -96327 409373 -29790 20916 193178 184567 162587
10623 162587 45183 -99429 -247403 -228757 -47473 -168172 -27871 -29123 30762 -118208 -281264
10612 -281264 207261 130411 -59398 -342749 -331937 216592 95264 -34412 2900 -96338 30882
10600 137516 -272171 76459 15136 335070 47714 -493021 -206296 -43479 37782 96021 144001
10589 144001 -103982 -47629 -104571 204434 -68213 -14054 -255841 -133112 66519 -276209
10578a12921j06885A45984M1058d3999A39132a38351l2107k33059E8793a38531
10567g2329n3225K1423M6240l13134I0699c11216A20168a2317n7650A22427a08745
10555A56844J3965D9754b43956I8673a99207j3048c3937B65986A02888Q3846a61754
10543a4991H0385a34669A58799h8738l20659i6207p6148e9075B29068d74869a21280
10531D210J3062J25870o5709f6769J8056J6679A82112c04296B47759j01471m2556
10520A03732B293c8317j72390C893M5911A3274i9213A2629a67611Q2676c1362
10508E2632b84297A03758g5563A75650a74261C3488h9521L2171b6115E4661c33839
10496a5479G5592a12386b907B27183a11652n1304j7219Q7036q5565H8134K28012
$$ plain form
10578 -112921 -219806 145984 187042 -43999 139132 -138351 -170458 -403517 58793 -138531
10567 -72329 -125554 -104131 -57891 -371025 90699 -311216 120168 -12317 -69967 122427 -108745
10555 156844 170809 49754 -243956 98673 -199207 -212255 -33937 265986 102888 186734 -161754
10543 -14991 80385 -134669 158799 -88738 -409397 -96207 -172355 -59075 229068 -474869 -121280
10531 4210 17272 143142 77433 -66769 -48713 -32034 182112 -304296 247759 146288 103732
10520 103732 2293 -38317 -210707 3893 49804 13274 -99213 12629 -167611 -84935 -31362
10508 52632 -284297 103758 -75563 175650 -174261 33488 -89521 -57350 -26115 54661 -333839
10496 -15479 75592 -112386 -2907 227183 -111652 -162956 -180175 -93139 -178704 88134 316146
10485C16146i3110A18277J35308i5258H8400K68569o7614O0158F0308L0138f3922
10473C42085j20837d18997A81511a98642A99396n9917a69966B8207a81352A83512
10462F0789Q380b16836E844a1144A03946A7349b98991A93904a12505B13485e2594
10450a43747a0055j83311Q9516k4878B47517g0480p0214r042b4580D8360L6945
10439H5305b3665l6739j11454B38718k9172J11374a01925G6891J10551K8414i2370
10427E4265b3567F1665A9201O0497a66575j05608B50609h5813C36324C2020K08506
10416B40526a06528j24613B3851g2226j01427f2390J5166k37545C6632c13582
10405b41672k34768a0756j83312A75831a3372B7972f9707L2070k39081A60179
$$ plain form
10485 316146 -93110 118277 253585 -95258 88400 356969 289355 349513 60308 90446 -63922
10473 342085 221248 -418997 181511 -198642 199396 139479 -169966 28207 -181352 183512
10462 60789 69169 -216836 5844 -11144 103946 17349 -298991 193904 -112505 213485 -52594
10450 -143747 -10055 -193366 -103850 -128728 247517 -70480 -140694 -149736 -24580 48360 85305
10439 85305 -23665 -60404 -171858 238718 209546 320920 -101925 76891 187442 215856 -92370
10427 54265 -23567 61665 19201 79698 -166575 -272183 250609 -85813 336324 32020 240526
10416 240526 -106528 -231141 23851 -72226 -173653 -62390 -47224 -284769 36632 -313582
10405 -241672 -476440 -10756 -194068 175831 -13372 27972 -69707 -37637 -276718 160179
10394C13069j44359c6129C11230A45346M6113f0668C5812J0546L39028d6448B04126
10382A26325g5384B61105Q7619e7054D73749E2893J61494P765M4033J69641B03962
10370c6766A13155M64130B60944J36589M4823J46150k72887j6229O3882O3607
10360D26879a14645C2479J93732a24610C82804A63156D4985L51525J60190m974
10350E51726K6777k01154j40407j02387N919K55055M7392J444j55017j1967J26107
10339D03488A14829O9002e7377C05689j20942f0936C97758H5926j938a54037B52048
10327a77087A47107a69928A56242P5826I0100J54320I9989k7931K1278O8599J2867
10316A74802J74853A20084R0724g0854b3066F9374M5610a70927A47412J32364
$$ plain form
10394 313069 168710 -36129 311230 145346 191459 -60668 35812 46358 385386 -46448 204126
10382 126325 -75384 261105 348724 -57054 473749 52893 214387 222152 266185 435826 203962
10370 -36766 113155 577285 260944 397533 442356 588506 315619 299390 363272 426879
10360 426879 -114645 32479 226211 -124610 382804 163156 44985 396510 556700 551726
10350 551726 578503 377349 236942 134555 140474 395529 442921 444365 289348 277381 403488
10339 403488 114829 183831 -57377 305689 184747 -60936 397758 85926 83988 -154037 252048
10327 -177087 147107 -169928 156242 232068 90100 244420 99989 72058 93336 161935 174802
10316 174802 349655 120084 210808 -70854 -23066 69374 114984 -170927 147412 279776
10306B79776e49709A45102b33270D9720o185a53322A58475K1219b10257h8016
10295B41759b22184A71483B0809l446L3092a1036j1074k17480g2003j59920h2234
10283A9938a47668A56880m0333d06087a26643j80944F7020b91284h9279L3100
10273e6179B81768F4473k5762A8271Q7463Q3123b97933F9279a41358g876q8471
10262i6347a3565B69501H9118J67175L82545j73496k09676P1654E0599L75830
10252D26429a33298A66635K38960I1802N337b7895j54639d9104J1113C18660a5513
10240H8768l963j3937g5261m6592A43664k9458a39241M8949J9158H720P1211j3568
10228F6363b05446h0199N868C1741J0134L04960a32279I9818B8268L28965a41617
$$ plain form
10306 279776 -549709 145102 -233270 49720 43535 -153322 158475 179694 -210257 -88016
10295 241759 -222184 171483 20809 17363 50455 -11036 -22110 -239590 -72003 -231923 -82234
10283 19938 -147668 156880 116547 -406087 -126643 -307587 67020 -291284 -89279 -56179
10273 -56179 281768 64473 38711 18271 105734 188857 -297933 69279 -141358 -7876 -96347
10262 -96347 -13565 269501 89118 256293 638838 465342 255666 327320 50599 426429
10252 426429 -133298 166635 405595 91802 97139 -27895 -182534 -49104 -37991 318660 -15513
10240 88768 84805 70868 -75261 -121853 143664 114206 -139241 -90292 -71134 8720 79931 66363
10228 66363 -205446 -80199 -74331 31741 41875 346835 -132279 99818 28268 357233 -141617
10216g1484I2769c33160A54307b64272G0759q034L3114m1557i1885J6646A90359
10204i6917k4472d9096E9051g3815m4630Q715d1965q7846D6536L1543M5183a2481
10191h9643l30160J25378G284P4879a08611p6510G9417b80594P5439g6846C12770
10179c09512C2843d7523l03243i0194B9517J8426a50668f2093F7430b04016A2708
10167a3634n1369D695f9079A28857g7493A62169a84415j53574R0483A16325K4822
10156A41147b74619A19538E2557R4204c55995A4887J35661B1970a29336b9684
10145C17240b32506C8462a097G515a43454g1684l6718k02066r7865a83111j80468
10134c63579C1549g0600k33481f7947c3117p3983c568C9215J43755b1762k33225
$$ plain form
10216 -71484 92769 -333160 154307 -264272 70759 62725 95839 54282 -91885 -75239 190359
10204 -96917 -121389 -49096 59051 -73815 -118445 -109730 -41965 -129811 46536 78079 123262 -12481
10191 -89643 -419803 -294425 7284 82163 -108611 -185121 79417 -280594 -205155 -76846 312770
10179 -309512 32843 -47523 -350766 -90194 29517 47943 -150668 -62093 67430 -204016 12708
10167 -13634 -65003 4695 -69079 128857 -77493 162169 -184415 -337989 -247506 116325 141147
10156 141147 -274619 119538 52557 146761 -355995 14887 150548 21970 -129336 -29684
10145 317240 -232506 38462 -1097 7515 -143454 -71684 -108402 -310468 -408333 -183111 -363579
10134 -363579 31549 -70600 -304081 -67947 -33117 -107100 -3568 39215 182970 -21762 -254987
10123b54987J02244a1139j06595r3655a05492a9392j41577j2132g3919a8024k38313
10112b56337K0193B72653D4656f4945j55316d249o6377l70303A00215e604D5908
10100b66276J22124j37391b3942l15972B145R3335P503a77490C36052F9496b19435
10088B80660a41923k61208J90845i7890a1152o0638j38752q3200A18656C5297
10077C7607K30121a16331A30753b43319b3024k07233a09622K3561I326a9782A5939
10065A35310n9988a16855b6663H3764B4897M737K5906a139B94347a62671m2499
10054b05170a1082A57751C0305f0350B3238K97523b34663a12373q2868K8890O8097
10043i8254L9860j12712C4506J22031b52942O1847o8725M6370A64049b54761k05006
$$ plain form
10123 -254987 -152743 -11139 -117734 -211389 -105492 -19392 -160969 -173101 -73919 -18024 -256337
10112 -256337 -236144 272653 44656 -64945 -220261 -4249 -70626 -440929 100215 -5604 45908
10100 -266276 -144152 -281543 -23942 -339914 2145 95480 102983 -177490 336052 69496 -219435
10088 280660 -141923 -403131 -212286 -97890 -11152 -71790 -210542 -293742 118656 35297
10077 37607 267728 -116331 130753 -243319 -23024 -230257 -109622 -86061 9326 -19782 15939
10065 135310 75322 -116855 -26663 83764 24897 29634 55540 -1139 294347 -162671 -205170
10054 -205170 -11082 157751 30305 -60350 23238 320761 -234663 -112373 -195241 -166351 -98254
10043 -98254 -58394 -171106 34506 156537 -252942 -191095 -259820 -213450 164049 -254761 -459767
10032d59767B8648j0734L905L37098a176j98355K1736C79169b03534n2707a0075
10020b41031j34429h2651Q613A77598D8998h4303B61626a13464B5018M38095E0736
10008F043a12307d0152p577A38024J35837m5941d18308d1404q5464E5270a87120
9996a11259A85738c54701E0350b66646r2387b3996l118j01274r1873A92498k2992
9985A69506L7481c62208O1165D4907a03986p8952C0300a23702M2884m71585b25842
9973B01730a22149A1980i0200B74931B7199a50233o7210g5630m3121b4946o3270
9962h8216J9773J9677j17094N2729A6889P8126b4777q8173l2870j48466h5742
9950c25964K6241c9317B0096J79356c30873e713k05000H1195b2551j02816b6600
$$ plain form
10032 -459767 28648 17914 21819 358917 -1176 -199531 -177795 379169 -203534 -256241 -10075
10020 -241031 -375460 -82651 -74038 177598 48998 -84303 261626 -113464 25018 463113 50736
10008 6043 -112307 -40152 -47729 138024 273861 227920 -418308 -41404 -126868 55270 -187120
9996 -111259 185738 -354701 50350 -266646 -359033 -23996 -27114 -128388 -220261 192498 169506
9985 169506 206987 -362208 -301043 44907 -103986 -182938 30300 -123702 -80818 -552403 -225842
9973 201730 -122149 11980 -90200 274931 27199 -150233 -217443 -75630 -118751 -24946 -88216
9962 -88216 -68443 -48766 -165860 -113131 16889 95015 -24777 -112950 -145820 -294286 -85742
9950 -325964 -299723 -39317 20096 199452 -330873 -5713 -210713 81195 -22551 -125367 -26600
9938e5051o4429C70631A00314J20761a7218j65318B44274a60895r9788E2506b34764
9926b31546k19287J71233a02144j54996A05552c1560G9987C8930J8148a01503
9915a87180C31931A40556c7507B06556b13848A72032a02638d8959n8276c8897
9904c09140g4678H8575a23467L1945D6413a33121l1278d9103A9177a33786N8772
9893g5014j13073r5745K3399l4899J02362f0451j38807f2147o5295b777I852O6782
9881G6634a02657B13451A3612c61158O8715A5455R5190h9183o0697g303F2085
9869b19655R5796L1750j48428a6210A43105m0072b42799f7169B78269c39544j275
9858c40819a8579D8860g6092j43978B35713a12857G4893a06773n8833d5942k44834
$$ plain form
9938 -55051 -119480 370631 100314 221075 -17218 -182536 244274 -160895 -260683 52506 -234764
9926 -231546 -450833 -279600 -102144 -257140 105552 -31560 79987 38930 57078 -101503
9915 -187180 331931 140556 -37507 206556 -213848 172032 -102638 -48959 -107235 -38897
9904 -309140 -74678 88575 -123467 -91522 46413 -133121 -164399 -49103 19177 -133786 -75014
9893 -75014 -188087 -283832 -260433 -295332 -192970 -60451 -199258 -62147 -127442 -2777 9852 76634
9881 76634 -102657 213451 13612 -361158 -292443 15455 110645 -89183 -149880 -7303 62085
9869 -219655 -123859 -92109 -240537 -16210 143105 103033 -242799 -67169 278269 -339544 -340819
9858 -340819 -18579 48860 -76092 -220070 235713 -112857 74893 -106773 -165606 -45942 -290776
9847b90776B90177j12583f5101A3720g568j65663D006a0819j7830j13137q2588
9836b24374L5821B60989a50109l03918i9352k4837A17398e7615I2368a83421H0394
9824b3416j49515n2060g5569E9612K9568k409e5610K6815l23686a9291j33245
9813a52536e2193k21093f3052A71513F2908a37979k28484A15382b46600L0114
9803b16486j02124a19370j00448E8711q459J8846d00911e595B71438c71626a8112
9791b22657m4624j76202H343K06341a49602g0806A01016g4801A51934a15487l9435
9780a54922B34167b43782m9631N6087R5731g859q8111E5663a48426g2199E3243
9768A42354J82924c8670r138k45844G7885a36922o440b3266m2326A34610c1018
$$ plain form
9847 -290776 290177 177594 -65101 13720 -7568 -173231 4006 -10819 -28649 -141786 -224374
9836 -224374 -188553 260989 -150109 -454027 -99352 -124189 117398 -57615 92368 -183421 80394
9824 -23416 -172931 -224991 -75569 59612 89180 86771 -55610 -28795 -352481 -19291 -152536
9813 -152536 -52193 -273286 -63052 171513 62908 -137979 -366463 115382 -246600 -216486
9803 -216486 -318610 -119370 -219818 58711 50252 69098 -400911 -5595 271438 -371626 -18112
9791 -222657 -267281 -443483 8343 214684 -149602 -70806 101016 -74801 151934 -115487 -154922
9780 -154922 234167 -243782 -293413 -237326 -141595 -7859 -95970 55663 -148426 -72199 53243
9768 142354 325278 -38670 -47808 -293652 77885 -136922 -143362 -23266 -65592 134610 -31018
9756b87939N1629I8779Q4865a19023n0372a7091B50144b46779A63631B1078a26552
9744a02368a3491B03168b82830h5667c3823k32065f3477C73640j73023b24978
9733I2628b16497M6900C36839h1088B20958I2295B3862b56213O2537j8811R8831
9722a13656n6266O0692p9431L5432h656l27953c7068A10600D0664b05906e1294
9710a38373j35513B23748o0321G2083b59651A49370L9594a21782m13406A49606
9699d4281B4562c05695K1603b7190A57210h9373k91581f5246l70240A83301f1774
9687c4133C0685J39175a76683G8569a66165j26122D7562e1604a7836m6796b0015
9675a53373e2881H040P0713a91882b4559G5339a57518A42638a16407F8116B7937
$$ plain form
9756 -287939 -236310 98779 183644 -119023 -169395 -17091 250144 -246779 163631 21078 -126552
9744 -102368 -13491 203168 -282830 -85667 -33823 -265888 -63477 373640 200617 -224978
9733 92628 -216497 -169597 336839 -81088 220958 92295 23862 -256213 -193676 -212487 -113656
9722 -113656 -169922 -109230 -188661 -153229 -8656 -336609 -37068 110600 40664 -205906 -51294
9710 -138373 -273886 223748 163427 72083 -259651 149370 188964 -121782 -535188 149606
9699 -44281 24562 -305695 -284092 -27190 157210 -89373 -380954 -65246 -435486 183301 -61774
9687 -34133 30685 169860 -176683 78569 -166165 -292287 47562 -51604 -17836 -64632 -20015
9675 -153373 -52881 8040 78753 -191882 -24559 75339 -157518 142638 -116407 68116 27937
9663f8687A55752j416J4572a68258g72o4841K8216p7300l4858c7116B7897P3163
9651A01060a77656b173j95051l10286g3846I2327l7779b59427A1906h6085j06694
9640a92779r9811j3263J49680I4447d11530a9439B22333B4354b64348J03393B64818
9628c0086j98563G5048a14346p4033j45532J7815j4702D1968J01489d3656j59266
9617b02922i7436j27137k24109a5715G8126r106b62711b2585j59436J1148A44255
9605c8133A7548a0858p8139B20028n2970b39184j40970a48642F8440h2042H4758
9593C01329j36425p0159J96619a74127r7509O2766i1266B1423o989Q0789a07857
9581i5467k69196a36160A68639a29972D3600a33868D2447P0338A0374a03024j90855
$$ plain form
9663 -68687 155752 154336 168908 -168258 -772 -65613 -37397 -114697 -149555 -37116 27897 101060
9651 101060 -177656 -2173 -197224 -507510 -73846 92327 54548 -259427 11906 -86085 -192779
9640 -192779 -292590 -305853 -156173 94447 -411530 -19439 222333 24354 -264348 -160955 264818
9628 -30086 -228649 75048 -114346 -188379 -333911 -316096 -330798 41968 143457 -43656 -202922
9617 -202922 -97436 -224573 -448682 -15715 78126 69020 -262711 -22585 -182021 -170873 144255
9605 -38133 17548 -10858 -88997 220028 167058 -239184 -380154 -148642 68440 -82042 84758
9593 301329 164904 94745 291364 -174127 -271636 -208870 -91266 21423 14434 95223 -107857
9581 -95467 -364663 -136160 168639 -129972 43600 -133868 42447 112785 10374 -103024 -293879
9570b93879A39668D6251b73066O4984e6286n4899D62560b44975d8840p5569B87776
9558i9086Q476n822b8554l70191E1404L03566c7351G9088P0737B0474b02828A3890
9545a59709G5931a73421j15619l3238F2086M384J5534k5991d63546A84102g96
9533d573k90602b5815A14865b3595E0166i096k80052F5333b15198N7309M4396
9522a13493f707m37195A172g0813n7454l58441i3933G1628c31754P9609I5093
9510B55973A9272d1608j21082B14637c00431G5448K03794a3918G3638c69580J06081
9499b63499a15144N1701j47427D470h3190L1351k2435I1565e9984j39764j85606
9488c85354G1585a08011A12053a55762P6124F5539a4641o8374m15993E2448R16
$$ plain form
9570 -293879 139668 46251 -273066 -208082 -56286 -111185 462560 -244975 -48840 -124409 287776
9558 -99086 -90610 -96432 -28554 -398745 51404 354970 -37351 79088 149825 20474 -202828 13890
9545 -159709 75931 -173421 -289040 -322278 62086 66470 82004 56013 -463546 184102 -796
9533 -4573 -295175 -25815 114865 -23595 50166 -9096 -289148 65333 -215198 -157889 -113493
9522 -113493 -6707 -443902 1172 -70813 -128267 -486708 -93933 71628 -331754 -252145 95093
9510 255973 19272 -41608 -162690 214637 -300431 75448 279242 -13918 73638 -369580 -263499
9499 -263499 -115144 -63443 -210870 4470 -83190 -51839 -74274 91565 -59984 -199748 -385354
9488 -385354 71585 -108011 112053 -155762 -79638 65539 -14641 -83015 -499008 52448 53364
9477E3364h6208D7519j0253P8262J45677h9039j8680A95801a35976C1861A2916
9465A42412c5344m0944k741B6876o647a24023B5375b48651A58310b30306A72079
9453f9731A04399a00646A50885B245i6321D3310h7432B18658b69485i2062J8017
9442g4045H4626j1174f8692j29766i1787G4183P693m464a39029j76121a26952
9430a71769A67578b39578B62308a59293A24941k7860b16963n9481g1633l50091
9420d21724a49483O4646j92937I1742Q3788b3942j50111e1760e088A3156J28494
9409A41650E1307f2922j62739B0604c2002m0011C1111a30309M9894k702b7039
9397f0045k33932a0823A65325n6602l0883c43684C12662b54952b375j63810l5308
$$ plain form
9477 53364 -86208 47519 37266 115528 261205 -89039 -107719 195801 -135976 31861 12916
9465 142412 -35344 -76288 -79029 26876 20229 -124023 25375 -248651 158310 -230306 172079
9453 -69731 104399 -100646 150885 2245 -96321 43310 -87432 218658 -269485 -92062 -74045
9442 -74045 84626 73452 -68692 -198458 -91787 74183 81876 77412 -139029 -315150 -126952
9430 -171769 167578 -239578 262308 -159293 124941 97081 -216963 -276444 -71633 -421724
9420 -421724 -149483 -84837 -277774 91742 175530 -23942 -174053 -51760 -5088 13156 141650
9409 141650 51307 -62922 -225661 20604 -32002 -72013 31111 -130309 -80415 -83117 -27039
9397 -60045 -293977 -10823 165325 108723 77840 -343684 312662 -254952 -2375 -166185 -201493
9386b01493o9082E9376b63212g0374A10366e6310j29902d6678k42561B24104B9903
9374a67212K4915a0120l3363n88581F3750a23664N9337k03334J8950e3807B53791
9362a07382k5739G6969p405N17l3943a28378A54571d2963j71343e634k08170d8813
9349a17498j06778e4383m650A3473b0277k04260f5023j59088g6234p3645j4288
9338a64167i17A09561c2081j1600A10804b45057B28727j8740R8679a66920A8352
9326b29663e4844j84247a7956l06492j4186n2396J57933O1683j17523I6273A9468
9314A03654a95744d0373A64572a04054C0856a00606A25687j619a14076k47991
9304c62067F7563K0890a25124H7140c39080C35122r7837a86847A61989e6298G353
$$ plain form
9386 -201493 -270575 59376 -263212 -70374 110366 -56310 -186212 -46678 -289239 224104 29903
9374 -167212 -142297 -10120 -43483 -632064 63750 -123664 -64327 -267661 -248711 -53807 253791
9362 -107382 -133121 76969 69564 70081 36138 -128378 154571 -42963 -214306 -5634 -213804 -48813
9349 -117498 -224276 -54383 -59033 13473 -20277 -224537 -65023 -224111 -76234 -149879 -164167
9338 -164167 -917 109561 -32081 -43681 110804 -245057 228727 209987 308666 -166920 18352
9326 -229663 -54844 -239091 -17956 -324448 -338634 -391030 -233097 -171414 -288937 96273 19468
9314 103654 -195744 -40373 164572 -104054 30856 -100606 125687 124068 -114076 -362067
9304 -362067 67563 88453 -125124 87140 -339080 335122 237285 -186847 161989 -56298 7353
9292a22515k28265c8863B7206b91761R2402A99568E9530a5165C81869b16753M8502
9281a68251j31343J48940G1866a42018B1615h9580A55790D8291g0838F3657b5908
9269i975A00121k9849a43543L3730d7842A66619f4388p7342a9316B12031e4885
9257A30425b84966F8954l1016h9572B69421a22265A970c58096a50522p0283h3868
9245A9345M7520c25916f63m23190N2729E7240d25720J76521b2089j59564j14552
9234b96205B59974d08832F0003a983B8010L011j2610f5067A69244b17388k9449
9223b46837A10891f9968k18137g0980k1351f655j53288n3153n550B09321a83327
9211h7859f235A11567j489J1536J13635H1182b49323g2506j26039B13963F4390
$$ plain form
9292 -122515 -350780 -38863 27206 -291761 -199359 199568 59530 -15165 381869 -216753 -168251
9281 -168251 -299594 -150654 71866 -142018 21615 -89580 155790 48291 -70838 63657 -25908
9269 -9975 100121 70272 -143543 -109813 -47842 166619 -64388 -141730 -19316 212031 -54885
9257 130425 -284966 68954 37938 -89572 269421 -122265 1970 -358096 -150522 -220805 -83868
9245 19345 66865 -325916 -663 -423853 -371124 57240 -425720 -249199 -22089 -181653 -296205
9234 -296205 259974 -408832 60003 -1983 28010 31021 18411 -65067 169244 -217388 -246837
9223 -246837 110891 -69968 -288105 -70980 -92331 -6655 -159943 -213096 -218646 209321 -183327
9211 -87859 -6235 111567 110078 121614 235249 81182 -249323 -72506 -198545 213963 64390
9199c57398i0270p9322j66805D15356c15287q5928B35455B545a81098Q5064B32355
9187C9285r195f5013l9061A71127f8989G1079J23591b27078L0878D0211j0645
9176B9566d30563A63675d5271F3549J1998J11886p6755K02276G3891c1437B82465
9164b45516j25441q4644h6278A22221j681D0684a66459A09446R545A9854M7376
9153F7230a58960C55150a80121c6087j23025F0419b5423G4039a62028b9282C7145
9141a46607k623A06374b12712N3672A49338a17678A24578a99811a7168j15985
9131a33153F6007b88285r358Q6541B51837i4733B70378c2969k50596L3779i4588
9119b33786L6615h3603k25441A05989f1039j80912e9776b0650l134F4454e9571
$$ plain form
9199 -357398 -90270 -169592 -336397 415356 -315287 -401215 235455 2545 -181098 -96034 232355
9187 39285 30090 -65013 -104074 171127 -68989 71079 194670 -227078 -196200 40211 29566
9176 29566 -430563 163675 -45271 63549 75547 187433 110678 312954 73891 -31437 282465
9164 -245516 -370957 -455601 -86278 122221 120540 40684 -166459 109446 118991 19854 67230
9153 67230 -158960 355150 -180121 -36087 -159112 60419 -25423 74039 -162028 -29282 37145
9141 -146607 -149230 106374 -212712 -159040 149338 -117678 124578 -199811 -17168 -133153
9131 -133153 66007 -288285 -297643 -211102 251837 -94733 270378 -32969 -283565 -249786 -94588
9119 -233786 -197171 -83603 -309044 105989 -61039 -241951 -59776 -20650 -23784 64454 -59571
9107B9194G017a24342N1126k7455j99846j31279a04319k7878o2172r7263A31907
9095B93690F0451a28741D5911b34625D7203c3418m6717l2269k828A86147c3133
9083D13754g6292p6823j50961j30305D830K80735A675a76544j42548J42263K2030
9072a54799C0934j5383L1168a46327F1116Q5708i5828m71683B78232b28919g1935
9060a90624J6326F9385L0896J59437f648j41387B7611L8870d9218j26315B95001
9048a9053m9340A4591b5309D5070h5348L5407b1251m03187B08998i5506A79556
9036B20122d22313J68514e2124r0407O3967l39930J45247k870A36034b71232a6435
9024a13325C64805a18397A39077C2199i2017q1801C23715E0576d56594d8736m0547
$$ plain form
9107 29194 7017 -124342 -73216 -100671 -300517 -431796 -104319 -132197 -194369 -291632 131907
9095 293690 60451 -128741 45911 -234625 47203 -33418 -80135 -112404 -115232 186147 -33133
9083 413754 -76292 -153115 -304076 -434381 4830 285565 1675 -176544 -319092 -176829 -154799
9072 -154799 30934 15551 46719 -146327 61116 146824 -95828 -567511 278232 -228919 -71935
9060 -190624 -174298 69385 100281 259718 -6648 -148035 27611 66481 -49218 -175533 295001
9048 -19053 -68393 14591 -25309 45070 -85348 -49941 -21251 -424438 208998 -95506 179556
9036 220122 -422313 -253799 -52124 -142531 -78564 -418494 -273247 -276117 136034 -271232 -16435
9024 -113325 364805 -118397 139077 32199 -92017 -173818 323715 50576 -456594 -48736 -89283
9013h9283g493n7148B2881a62520p6713D4145P7186c67419c5195B5911P7919a72102
9000a63111j06992p9641c3295B902N9741M5046a91863K8233d3509k1737C06807
8988F0621J08160b65108L8457E2761L7522i7092B44706E813P2369a22864G0417
8976C8885J20179b79572c4306j89382d556j06835j33995k16784i7172j63217K6068
8965b34321k93614A24204e0327K804A02135J16467a05079J1225A46418c02561
8954B20778m1291c4703j10248E183b36999k3957h2067D6181d4483e769k22702
8943b28471g1320C45319a8097D4698f7846J3385B99648b1040B86806J7442a21071
8931b07372C10008F5639b02409E07489A82844L75357K69871Q22010L447056P045196
$$ plain form
9013 -89283 -7493 -64641 22881 -162520 -239233 44145 121331 -367419 -35195 25911 103830 -172102
9000 -163111 -270103 -349744 -33295 2902 62643 107689 -191863 -163630 -43509 -65246 306807
8988 60621 168781 -265108 -226651 52761 90283 -97092 244706 5813 78182 -122864 70417
8976 38885 159064 -279572 -34306 -223688 -4556 -111391 -245386 -462170 -97172 -260389 -234321
8965 -234321 -527935 124204 -50327 -47523 102135 218602 -105079 -93854 146418 -302561
8954 220778 179487 -34703 -144951 5183 -236999 -260956 -82067 46181 -44483 -5769 -228471
8943 -228471 -71320 345319 -18097 44698 -67846 -54461 299648 -21040 286806 304248 -121071
8931 -207372 310008 65639 -202409 507489 182844 558201 828072 1650082 5097138 12142334
8921A2142334J939949D858500A389429o39203B69056J12188h3666A83568q8474
8912I5094a54961m7842B88950a2370A60628K19345a78061f7238k37507J33981
8902a70764N4383c9444A17077a37704M8002m0051j3444E5905h1263c0987n9932
8891i0919j40868g4974A3791d6026r1400j28319P1810B02868d6245j79177B19661
8879c5844j39579a9204G9258L824i1592r8763f4327j62640k43998a36047B5161
8867b27502r055E8308i0451j041r2644D7808J24787i5796F6637b02879A40827
$$ plain form
8921 12142334 14082283 4858500 1389429 750226 269056 381244 -83666 183568 95094
8912 95094 -154961 -202803 288950 -12370 160628 379973 -178061 -67238 -304745 -170764
8902 -170764 -116381 -39444 117077 -137704 -89702 -129753 -143197 55905 -81263 -30987 -90919
8891 -90919 -231787 -74974 13791 -46026 -137426 -265745 -193935 202868 -46245 -225422 219661
8879 -35844 -175423 -19204 79258 83082 -91592 -190355 -64327 -226967 -470965 -136047 25161
8867 -227502 -236557 58308 -90451 -91492 -184136 47808 172595 -95796 66637 -202879 140827
$$ [...]
##END NTUPLES=NMR SPECTRUM
##END=
