##TITLE=AC1504_CUNCR13311_8126415_M5UcxKlBcI
##JCAMPDX= 6.0         $$ Bruker NMR JCAMP-DX V2.0
##DATA TYPE= NMR SPECTRUM
##DATA CLASS= NTUPLES
##ORIGIN= BRUKER
##OWNER= Administrator
$$ 1.72 TOPSPIN		Version 2.1
$$ 2013-08-16 18:32:33.155 -0700  Administrator@X
$$ Compression mode = diff/dup
##.OBSERVE FREQUENCY= 400.02188249412
##.OBSERVE NUCLEUS= ^1H
##.ACQUISITION MODE= SIMULTANEOUS (DQD)
##.ACQUISITION SCHEME= undefined
##.AVERAGES= 8
##.DIGITISER RES= 22
##SPECTROMETER/DATA SYSTEM= spect
##.PULSE SEQUENCE= zg30
##.SOLVENT NAME= COFFEE_meoh
##.SHIFT REFERENCE= INTERNAL, COFFEE_meoh, 1, 14.98509
##AUDIT TRAIL= $$ (NUMBER, WHEN, WHO, WHERE, PROCESS, VERSION, WHAT)
$$ ##TITLE= Audit trail, TOPSPIN		Version 2.1
$$ ##JCAMPDX= 5.01
$$ ##ORIGIN= Bruker BioSpin GmbH
$$ ##OWNER= Administrator
$$ $$ E:\/data/COFFEE/nmr/AC1504_CUNCR13311_8126415_M5UcxKlBcI/20/pdata/1/auditp.txt
$$ ##AUDIT TRAIL=  $$ (NUMBER, WHEN, WHO, WHERE, PROCESS, VERSION, WHAT)
(   1,<2013-08-16 18:32:26.655 -0700>,<Administrator>,<X>,<go>,<TOPSPIN 2.1>,
      <created by zg
	started at 2013-08-16 18:31:21.014 -0700,
	POWCHK enabled, PULCHK disabled,
       configuration hash MD5:
       C8 4E 4E 5D D3 5C D8 9E 9F 52 82 E0 59 8A DE 15
       data hash MD5: 64K
       97 99 BA C9 D0 6C CC 6D 39 FF 63 58 9B 1C 06 82>)
(   2,<2013-08-16 18:32:29.545 -0700>,<Administrator>,<X>,<proc1d>,<TOPSPIN 2.1>,
      <Start of raw data processing
       efp LB = 0 FT_mod = 6 PKNL = 1 PHC0 = 0 PHC1 = 0 SI = 32K 
       data hash MD5: 32K
       48 83 DE 45 04 89 EC FB 1B 14 B9 C4 A8 6B 64 4A>)
(   3,<2013-08-16 18:32:29.842 -0700>,<Administrator>,<X>,<proc1d>,<TOPSPIN 2.1>,
      <pk PHC0 = 99.38232 PHC1 = 0 
       data hash MD5: 32K
       0E CE 8B D0 CC 41 84 41 77 2E AD EA 89 2E B7 EC>)
(   4,<2013-08-16 18:32:29.967 -0700>,<Administrator>,<X>,<proc1d>,<TOPSPIN 2.1>,
      <abs ABSG = 1 
       data hash MD5: 32K
       04 9B 47 10 C0 FC 7E A5 62 23 2A 5F 0B CC 20 CB>)
(   5,<2013-08-16 18:32:30.014 -0700>,<Administrator>,<X>,<proc1d>,<TOPSPIN 2.1>,
      <abs ABSG = 2 
       data hash MD5: 32K
       60 BF 61 ED EA 1C 4E 3A BD 3D DA 84 89 75 1D AB>)
(   6,<2013-08-16 18:32:30.077 -0700>,<Administrator>,<X>,<proc1d>,<TOPSPIN 2.1>,
      <abs ABSG = 3 
       data hash MD5: 32K
       CE BD A2 65 B7 7C 7A 15 DD D4 ED 39 F7 15 83 00>)
(   7,<2013-08-16 18:32:30.139 -0700>,<Administrator>,<X>,<proc1d>,<TOPSPIN 2.1>,
      <abs ABSG = 4 
       data hash MD5: 32K
       E0 AB F3 E7 4F 3D CB 76 00 DB CA A3 2B A2 C2 CD>)
(   8,<2013-08-16 18:32:30.202 -0700>,<Administrator>,<X>,<proc1d>,<TOPSPIN 2.1>,
      <abs ABSG = 5 
       data hash MD5: 32K
       44 6A 5F 47 96 67 39 02 DF 2D 7B 65 BB 96 0F 68>)
$$ ##END=
$$ 
$$ $$ hash MD5
$$ $$ 64 FF 2E 41 C1 0F AC 71 4C F5 9B 02 E9 47 73 D0
##$RELAX= 
##$RELAX= 
##$RELAX= 
##$RELAX= 
##$RELAX= 
##$RELAX= 
##$RELAX= 
$$ Bruker specific parameters
$$ --------------------------
##$DU= <E:\>
##$EXPNO= 20
##$NAME= <AC1504_CUNCR13311_8126415_M5UcxKlBcI>
$$ [...]
150 150 150 150 150 150 150 150
##$TP07= 0
##$TPNAME0= <>
##$TPNAME1= <>
##$TPNAME2= <>
##$TPNAME3= <>
##$TPNAME4= <>
##$TPNAME5= <>
##$TPNAME6= <>
##$TPNAME7= <>
##$TPOAL= (0..7)
0.5 0.5 0.5 0.5 0.5 0.5 0.5 0.5
##$TPOFFS= (0..7)
0 0 0 0 0 0 0 0
##$TUNHIN= 0
##$TUNHOUT= 0
##$TUNXOUT= 0
##$USERA1= <user>
##$USERA2= <user>
##$USERA3= <user>
##$USERA4= <user>
##$USERA5= <user>
##$V9= 5
##$VALIST= <valist>
##$VCLIST= <CCCCCCCCCCCCCCC>
##$VD= 0
##$VDLIST= <DDDDDDDDDDDDDDD>
##$VPLIST= <PPPPPPPPPPPPPPP>
##$VTLIST= <TTTTTTTTTTTTTTT>
##$WBST= 2048
##$WBSW= 25
##$XGAIN= (0..3)
0 0 0 0
##$XL= 0
##$YL= 0
##$YMAX_a= 652421
##$YMIN_a= -556265
##$ZGOPTNS= <>
##$ZL1= 120
##$ZL2= 120
##$ZL3= 120
##$ZL4= 120
##$ABSF1= 14.98509
##$ABSF2= -5.573092
##$ABSG= 5
##$ABSL= 3
##$ALPHA= 0
##$AQORDER= 0
##$ASSFAC= 0
##$ASSFACI= 0
##$ASSFACX= 0
##$ASSWID= 0
##$AUNMP= <proc_prof1d_extract_pilot.lims>
##$AXLEFT= 0
##$AXNAME= <>
##$AXNUC= <1H>
##$AXRIGHT= 0
##$AXTYPE= 0
##$AXUNIT= <>
##$AZFE= 0.1
##$AZFW= 0.1
##$BCFW= 0
##$BC_mod= 0
##$BYTORDP= 0
##$COROFFS= 0
##$CY= 15
##$DATMOD= 1
##$DC= 0
##$DFILT= <>
##$DTYPP= 0
##$F1P= 0
##$F2P= 0
##$FCOR= 0.5
##$FTSIZE= 32768
##$FT_mod= 6
##$GAMMA= 0
##$GB= 0
##$INTBC= 1
##$INTSCL= 1
##$ISEN= 128
##$LB= 0
##$LEV0= 0
##$LPBIN= 0
##$MAXI= 10000
##$MC2= 0
##$MEAN= 0
##$ME_mod= 0
##$MI= 0
##$NCOEF= 0
##$NC_proc= -8
##$NLEV= 6
##$NOISF1= 0
##$NOISF2= 0
##$NSP= 0
##$NTH_PI= 0
##$NZP= 0
##$OFFSET= 14.98509
##$PC= 1
##$PHC0= 99.38232
##$PHC1= 0
##$PH_mod= 1
##$PKNL= yes
##$PPARMOD= 0
##$PPDIAG= 0
##$PPIPTYP= 0
##$PPMPNUM= 2147483647
##$PPRESOL= 1
##$PSCAL= 4
##$PSIGN= 0
##$PYNMP= <proc.py>
##$REVERSE= no
##$SF= 400.02
##$SI= 32768
##$SIGF1= 0
##$SIGF2= 0
##$SINO= 400
##$SIOLD= 32768
##$SPECTYP= <>
##$SREGLST= <1H.CDCl3>
##$SSB= 0
##$STSI= 32768
##$STSR= 0
##$SW_p= 8223.68421052631
##$SYMM= 0
##$S_DEV= 0
##$TDeff= 65536
##$TDoff= 0
##$TI= <>
##$TILT= no
##$TM1= 0
##$TM2= 0
##$TOPLEV= 0
##$USERP1= <user>
##$USERP2= <user>
##$USERP3= <user>
##$USERP4= <user>
##$USERP5= <user>
##$WDW= 1
##$XDIM= 32768
##$YMAX_p= 458758981
##$YMIN_p= -699201
##$CURPLOT= <Network HP LaserJet P1505>
##$CURPRIN= <$Network HP LaserJet P1505>
##$DFORMAT= <normdp>
##$LAYOUT= <+/1D_H.xwp>
##$LFORMAT= <normlp>
##$PFORMAT= <normpl>
##$SURQMSG= 1
$$ End of Bruker specific parameters
$$ ---------------------------------
##NTUPLES= NMR SPECTRUM
##VAR_NAME=  FREQUENCY,     SPECTRUM/REAL,   SPECTRUM/IMAG
##SYMBOL=    X,             R,               I
##VAR_TYPE=  INDEPENDENT,   DEPENDENT,       DEPENDENT
##VAR_FORM=  AFFN,          ASDF,            ASDF
##VAR_DIM=   32768,         32768,           32768
##UNITS=     HZ,            ARBITRARY UNITS, ARBITRARY UNITS
##FACTOR=    0.250966925370066, 1,           1
##FIRST=     8223.43324360094, -197844,      19042
##LAST=      0,             -97989,          -167128
##MIN=       0,             -699201,         0
##MAX=       8223.43324360094, 458758981,    0
$$ Real data points
##PAGE= N=1
##DATA TABLE= (X++(R..R)), XYDATA
$$ [...]
19542c4588A41742B5497J15054A187N6630K21977A15828K17495A0750a18497B51253
19530a12543r0245c4362j5575k5271k0841l09419i0598r3573h3747j97749c8339
19518B38743a24635N6320j10120L8728e7756C36495H251J04084a28354j69807
19508b98161i6283l76303B7131J27872a2373A52399E8634K36142G219a29792K9874
19497i9918l46876c0041P736j00164c4361I7174a94704P5748L4644n5754A4774
19485d2029A39349B875R4898A8331K7373L8249b19394a00530j91727I7581a12515
19473H438b21486q0681r1522C10140b11555d0768B1276a04717L676E3652a59659
19461a76709P4984B07496e3543j30763A99713a29137j26059C7493b97637Q3763
$$ y = [-34588, 141742, 25497, 140551, 1187, 57817, 279794, 115828, 333323, 10750, -118497, 251253, -112543, -202788, -34362, -49937, -75208, -96049, -405468, -90598, -184171, -83747, -281496, -38339, 238743, -124635, -68315, -178435, -139707, -57756, 336495, 8251, 112335, -128354, -298161, -96283, -472586, 27131, 155003, -12373, 152399, 58634, 294776, 7219, -129792, -99918, -446794, -30041, -22305, -122469, -34361, 97174, -194704, -118956, -84312, -140066, 14774, -42029, 139349, 2875, 97773, 18331, 45704, 83953, -219394, -100530, -292257, 97581, -112515, 8438, -221486, -302167, -393689, 310140, -211555, -40768, 21276, -104717, -101041, 53652, -159659, -176709, -101725, 207496, -53543, -184306, 199713, -129137, -255196, 37493, -297637, -213874]
19451b13874B42268a34933q9019O876H2818J37176a65997J7648j77923A23848
19440a47848D8479J36667D7330a58851I3875c07072A18919c02515a19150A00752
19429d5079o7684G5283a67644r9558H69h6528k6466k97036B01870A6625a68655
19417f4553j32521D8133b67188a31399j25181A6560b35754A20839b2915j68717
19407a91632g5012j19528k2206O9139a4317B6091a57706B10157a8240A59009a5653
19395a55723C7761j5611a66665Q859d9957C1007d889A41377g3873j06494G3296
19383G322R2037b27755J08026k01359b957D5673b15737G5805c9004q3000o335
19372a28339A87615I55J43880o710J53762b28182Q7574M6482l5479a2604j9703
$$ y = [-213874, 242268, -134933, -223952, -217076, 82818, 219994, -165997, -148349, -326272, 123848, -147848, 48479, 185146, 47330, -158851, 93875, -307072, 118919, -302515, -119150, 100752, -45079, -112763, 75283, -167644, -267202, 869, -86528, -112994, -410030, 201870, 16625, -168655, -64553, -197074, 48133, -267188, -131399, -256580, 16560, -235754, 120839, -22915, -191632, -75012, -194540, -216746, -147607, -14317, 26091, -157706, 210157, -18240, 159009, -15653, -155723, 37761, 22150, -166665, -157806, -49957, 31007, -4889, 141377, -73873, -180367, 73296, 7322, 99359, -227755, -119729, -321088, -2957, 45673, -215737, 75805, -39004, -122004, -128339, 187615, 955, 144835, 138125, 291887, -228182, -140608, -94126, -129605, -12604, -32307]
19361c2307o7887D7358c8758A01203c66736e4615j27318B92379A30106c9966j51856
19350a91822G2719Q2156k7543G914L26113b20744C4109K0851g2059B61381A03851
19338c56690J15109a05704g366l5085l7069A31655g8633B9294a33617j7574m1509
19327a92700h1312k16537b7653A62902n2082m8272k0488J09555c74325O7729c3978
19315f9739B4060b43846l9302J19768O661F0199a4183A59350a28783N8119B4099
19303a77373k20079a00209c4899H7172c85231B03266a60404O8781C7768b58739
19292f1212A17074c62935g7621G9724L7653b25908f4212k8898J0224G8619a90414
19280b60103B8061c7585k44601R5966j9968C29891m1038A8143b940B7966A3663
$$ y = [-32307, -100194, 47358, -38758, 101203, -366736, -54615, -181933, 292379, 130106, -39966, -191822, 72719, 154875, 127332, 7914, 334027, -220744, 34109, 54960, -72059, 261381, 103851, -356690, -241581, -105704, -7366, -42451, -79520, 131655, -78633, 29294, -133617, -151191, -192700, -81312, -297849, -27653, 162902, 110820, 62548, 42060, 151615, -374325, -306596, -33978, -69739, 24060, -243846, -283148, -163380, -156719, 60199, -14183, 159350, -128783, -70664, 24099, -177373, -397452, -100209, -34899, 87172, -385231, 203266, -160404, -91623, 37768, -258739, -61212, 117074, -362935, -77621, 79724, 117377, -225908, -64212, -93110, -82886, 78619, -190414, -260103, 28061, -37585, -282186, -186220, -206188, 329891, 288853, 18143, -2940, 27966, 13663]
19268i7952h712A9475c17232c7395j0331E6762c48915B03378p0466a02897J0826
19257i2071A39450d26983B61787b20569g4126j63708D5547J7608a74035A48401
19246e8082l3396L4924I3855k0314J65066I8432c08530J33936a8428I093h4861
19234H3646d9330K0807l34755a36384F281J2429c23036a639l63338A14953b20630
19222b41416a1108j88236B44997A13558l8888M9974a1193j44937C65162b8253
19211A6433a63586e1466q541j3208A36842b09846i7640L5428m1869k61283g7803
19199A09695b00254l1026k42710B16747l1598F0296b83698m3501d5458l7483l5410
19188a18351a1900B9065a46487b2128q2798I836J17563a90939A92083c43842C6918
$$ y = [-97952, -8712, 19475, -317232, -37395, -47726, 56762, -348915, 203378, 132912, -102897, -92071, 139450, -426983, 261787, -220569, -74126, -237834, 45547, 63155, -174035, 148401, -58082, -91478, -56554, 93855, 73541, 238607, 98432, -308530, -174594, -18428, 9093, -84861, 83646, -49330, -28523, -363278, -136384, 6281, 18710, -323036, -1639, -364977, 114953, -220630, -241416, -11108, -199344, 244997, 113558, 74670, 124644, -11193, -156130, 365162, -28253, 16433, -163586, -51466, -60007, -73215, 136842, -209846, -97640, -62212, -104081, -365364, -77803, 109695, -200254, -231280, -473990, 216747, 185149, 60296, -283698, -327199, -45458, -82941, -118351, -11900, 29065, -146487, -22128, -104926, 9836, 127399, -190939, 192083, -343842, 36918]
19176a719D1960f7168k6020A10371b96965A8629K42013b5422l87962b4742A30219
19164G8848b16178i3877K2615l1542k71835B14296a2068k97661J15282J6411O3519
19153a14517A11706b02450e8776j07215C2188a50959C37594g8247B35766a25654
19142b04347j4636j10294a34980L2932J5151m5451j81381A37333a26824A4034
19131a76020a886A98221B0451a45696A69477Q717q5842a3392G2802F73b6388E4021
19118b12721l2073q5938h0252A64779B7835a96586O8390c6551B65600a61791D88
19106I5431b4399A7940J16242C0676c9534j78852G845d7924C32005a28322b0360
19094A59912b3667k8136k40271N6977C7441J75153b80091G2202b94245A30794
$$ y = [-1719, 41960, -67168, -93188, 110371, -296965, 18629, 260642, -25422, -413384, -24742, 130219, 78848, -216178, -93877, -71262, -102804, -374639, 214296, -12068, -309729, -194447, -178036, -114517, 111706, -202450, -58776, -165991, 32188, -150959, 337594, -78247, 235766, -125654, -204347, -218983, -329277, -134980, -102048, -86897, -132348, -313729, 137333, -126824, 14034, -176020, -1886, 198221, 20451, -145696, 169477, 178194, 92352, -13392, 72802, 673, -26388, 54021, -212721, -244794, -330732, -80252, 164779, 27835, -196586, -128196, -36551, 265600, -161791, 488, 95431, -24399, 17940, 134182, 30676, -39534, -218386, 7845, -47924, 332005, -128322, -20360, 159912, -23667, -51803, -292074, -235097, 37441, 212594, -280091, 72202, -294245, 130794]
19083A59265a34301N7568l7094B29372h4304B7145a66050O1378J0731k88773e212
19071A54286k8520a13256e0605B90830l4067a38523j53583A6754b18778D9238
19060a15311m3051j48731I7025b6248A87179b16598n253Q9273e5304l0279L4250
19049e1333J9275E2536N8013a35023J5553j31861e4226A26050a50683j63987J24868
19038a89802f6639A75418c7976j19279j60213A64652b9406c887A75545A7134J83395
19027B00529h9203j00106Q7469B6242K33147j903a9212j51868A29441J43577d625
19015C4610b74726c5899j66675b9967H7571b1256B53977B2082L3949d0186l88902
19004d29088C03610a28120c4396A09125I514a31458B01051c04575K6253a13631
$$ y = [159265, -134301, -76733, -113827, 229372, -84304, 27145, -166050, -104672, -93941, -382714, -5212, 154286, 125766, -113256, -50605, 290830, 256763, -138523, -292106, 16754, -218778, 49238, -115311, -158362, -307093, 97025, -26248, 187179, -216598, -221851, -132578, -55304, -85583, -51333, -32058, 52536, 110549, -135023, -119470, -251331, -54226, 126050, -150683, -314670, -189802, -66639, 175418, -37976, -157255, -317468, 164652, -29406, -3887, 175545, 17134, 200529, -89203, -189309, -101840, 26242, 259389, 257486, -19212, -171080, 129441, 273018, -4625, 34610, -274726, -35899, -202574, -29967, 87571, -21256, 253977, 22082, 56031, -40186, -429088, 303610, -128120, -34396, 109125, 9514, -131458, 201051, -304575, -278322, -113631]
18993a02060A11865b2206p9237E4442b78037h176m4405r2157C48811a1066A13393
18981A4084J05574b34944A49971f3776A62666m127k8863J1300j2686c13498a26423
18969A29580J9660j8491b76723C36952A8682a64754N0437C17377A34583a20726
18958a03689B2080c13529A14829Q1452c0174j08788C96287h8117A63444c46692
18947d2710E638a29320b2973C4006c754k8562n7015j45636n9469B06378a799l8520
18935d0319m7739A81906l2948a61046c111B7617c9022A398b69765B2941a34045
18923b28746h6961p9366A49258J36706a51662O6749j00186G5078b18448d7003
18912A26379b26503L4337H9651j2766k6936c9055A44631i7966A34601D1041b21252
$$ y = [-102060, 111865, -22206, -101443, 54442, -278037, -8176, -52581, -144738, 348811, -11066, 113393, 14084, 119658, -234944, 149971, -63776, 162666, 158539, 129676, 140976, 128290, -313498, -126423, 129580, 149240, 130749, -276723, 336952, 18682, -164754, -114317, 317377, 134583, -120726, -103689, 22080, -313529, 114829, 196281, -30174, -138962, 396287, -88117, 163444, -346692, -42710, 5638, -129320, -22973, 34006, -3754, -32316, -89331, -234967, -294436, 206378, -1799, -40319, -88058, 181906, 148958, -161046, -3111, 27617, -39022, 1398, -269765, 22941, -134045, -228746, -86961, -166327, 149258, 285964, -151662, -84913, -185099, 75078, -218448, -47003, 126379, -226503, -192166, 89651, 76885, 49949, -39055, 144631, -97966, 134601, 41041, -221252]
18900h7368j83739G3995d2849j24200I553b49177G3215h1351E5550M9827c5169
18888b37913A79191j5998a84991A38388J5180K662J45264a46717j4920A2087J48936
18877A61023J65495I0392d9108I3407b12013e9325J2672H1205k6907M2354B4871
18865a16630J1213f635m52630c8088j89604B26244b37278M377B4274b37659j1510
18854b49169B24759a4422H3365h6257c7917p6963B14554k5055f3976F6614R4110
18843A60724b44760g5980A24812e0860j42323A53764a18688H296c6053A05432
18832A17222a67431C66868b4065j41552N3363B61166c8207r2011j27101k3413
18822b80732c1704l74420B58623c18909D4625g6244p4996l9417C8423J14003h2101
$$ y = [-87368, -271107, 73995, -42849, -167049, 9553, -249177, 73215, -81351, 55550, 105377, -35169, -237913, 179191, 163193, -184991, 138388, 153568, 156230, 301494, -146717, -161637, 12087, 161023, 326518, 90392, -49108, 93407, -212013, -59325, -46653, 81205, 54298, 96652, 24871, -116630, -105417, -6635, -459265, -38088, -227692, 226244, -237278, -232901, 24274, -237659, -249169, 224759, -14422, 83365, -86257, -37917, -114880, 214554, 189499, -63976, 66614, 160724, -244760, -75980, 124812, -50860, -193183, 153764, -118688, 8296, -36053, 105432, 117222, -167431, 366868, -24065, -165617, -112254, 261166, -38207, -130218, -257319, -280732, -31704, -406124, 258623, -318909, 44625, -76244, -151240, -190657, 38423, 152426, -82101]
18810a81816D25028E5169g4873c1985l24968f3041j55594D7914M9926a6180B47958
18798A7602g5278j20894J7907F152c95078a23579A87100l1338d9993j06919A65680
18786a62924D6336K29638a56270k10604a77477D071a30317J3672j0266B70852
18775b7019I1181e6356n7126p9274j15017H4326j9805b09966R7458A49252f8079
18763c3538F8521h5672A20281a86390B34354A12323a52230b3666J1787A04910
18752A33333J71293A0927a14219A6755R062a78715e5559K337C4902c4745j11853
18741a46598P2719k60949e4096P289n10887d8173j98497H5029a02157H8629a32773
18729d0481n9172b473j7345j26387B23518h4111C85013m9420c8218O663j23759
$$ y = [-181816, 425028, 55169, -74873, -31985, -356953, -63041, -218635, 47914, 97840, -16180, 247958, 17602, -75278, -196172, -178265, 6152, -395078, -123579, 187100, 155762, -49993, -156912, 165680, -162924, 46336, 275974, -156270, -366874, -177477, 4071, -130317, -116645, -126911, 270852, -27019, 91181, -56356, -113482, -192756, -307773, 84326, 64521, -209966, -112508, 149252, -68079, -33538, 68521, -85672, 120281, -186390, 234354, 112323, -152230, -23666, -11879, 104910, 133333, 304626, 10927, -114219, 16755, 25817, -178715, -55559, -53222, 34902, -34745, -146598, -73879, -334828, -54096, -46807, -557694, -48173, -246670, 85029, -102157, 88629, -132773, -40481, -99653, -2473, -19818, -146205, 223518, -84111, 385013, 335593, -38218, -31555, -155314]
18718a55314k46458B08109h3957l13595J51430K3627A19049G442L72816k4252
18708C56006c4984a0986p2956j12485B98432E1189K9269N0186J53408a14609j01471
18697b16080a02984p463E3852b47360f0594b3445j3099A07546O3389a03840A96166
18685a40125J1385A7146g6745j75854K6968B32515F0207c8814j44011d0658J1795
18674b8863r5676r3276N5084l7875A30412a37751B75283b01283D7344J90943P868
18663B46155j00122J503b67047A9527J40845c01682J42472j62994o2285B1875
18652d95894A27433i3495k21416E6617i6395C28290F722J93138d5883k53138A32972
18640c26664a43853g0469A07300a20547A42591F6870d3593r2631l02781a04090
$$ y = [-155314, -401772, 208109, -83957, -397552, -246122, -222495, 119049, 7442, 380258, 356006, -34984, -10986, -83942, -196427, 298432, 51189, 80458, 130644, 284052, -114609, -216080, -102984, -110447, 53852, -247360, -60594, -23445, -36544, 107546, 170935, -103840, 196166, -140125, -128740, 17146, -76745, -252599, -225631, 232515, 60207, -38814, -182825, -40658, -28863, -124539, -217815, -162731, -200606, 130412, -137751, 275283, -201283, 47344, 238287, 246155, 146033, 147536, -267047, 19527, 160372, -301682, -159210, -322204, -384489, 21875, -495894, 127433, -93495, -314911, 56617, -96395, 328290, 6722, 199860, -45883, -299021, 132972, -326664, -143853, -70469, 107300, -120547, 142591, 66870, -43593, -136224, -439005, -104090]
18629c36746a20386L1317B48387c6799G9637a00851j19344C9582J84570D2943
18618d08592a94872I4623b93878J8283B73287b05752P6878A66959E7565a39867
18607G3626a23853B7291h9395j1508M5531A29533M4469a05253H0117a36497d5692
18595h6901a9425M003p1616L9418p4338C0591G034b60085j32010a91932C46285
18583h1302j22129I1700l8499e5634m9923q8310O3259B8194O195b30151B636g1251
18570g7478j08004i0453K99K034A08991K10219a85583q2m004e0249k72916a7641
18557f2599r7345N9920q0166p5085b4867j73968O1565n7980A49567k1965E0673
18545E1845a38588A12229J7282b57314a12836k74872o4057A96964l2310J6537
$$ y = [-336746, -120386, -89069, 248387, -36799, 79637, -100851, -220195, 39582, 224152, 42943, -408592, -194872, 94623, -293878, -275595, 273287, -205752, -128874, 166959, 57565, -139867, 73626, -123853, 27291, -89395, -100903, -55372, 129533, 174002, -105253, 80117, -136497, -45692, -86901, -19425, -15422, -87038, -47620, -121958, 30591, 7034, -260085, -392095, -191932, 346285, -81302, -203431, 91700, 53201, -55634, -105557, -193867, -130608, 28194, 34389, -230151, 2636, -71251, -77478, -185482, -90453, -90154, -88120, 108991, 319210, -185583, -185665, -189669, -50249, -323165, -17641, -62599, -159944, -100024, -180190, -255275, -24867, -198835, -137270, -195250, 149567, 127602, 50673, 51845, -138588, 112229, 129511, -257314, -112836, -387708, -451765, 196964, 164654, 181191]
18535A81191i6219A53840a89225k46205a40568k3976d0314l42626i0015a0214
18524b47805c7906n3313A19450A5981J65415d2857l12425B37178b40563a04505
18513c1161m62289d1568k45176J04825k73912F9182b54960a00277m7031m2646
18503a89954A39949a14883n6960A03829f9983B38214b62008G3897h8932B71710
18492A83320c9099l3585A12583b71532B41037a9843j07364H582a67828K9850M0373
18481i7605D1395a65570k21935a48269A52212c48560A9952b7171j4103I4391d15400
18469h0160A10801c09129a48035l456c4076n2758j77048K3112O8445A39318L28156
18458D67474r2260H4614a91297p5549p928e1472D6046d17182l8386B01817J1662
$$ y = [181191, -96219, 153840, -189225, -435430, -140568, -164544, -40314, -382940, -90015, -10214, -247805, -37906, -91219, 119450, 15981, 181396, -42857, -355282, 237178, -240563, -104505, -31161, -493450, -41568, -286744, -181919, -455831, 69182, -254960, -100277, -147308, -189954, 139949, -114883, -171843, 103829, -69983, 238214, -262008, 73897, -88932, 271710, 183320, -39099, -72684, 112583, -271532, 241037, -19843, -127207, 8582, -167828, -137978, -97605, 41395, -165570, -387505, -148269, 152212, -348560, 19952, -27171, -41274, 94391, -415400, -80160, 110801, -309129, -148035, -151491, -34076, -86834, -263882, -240770, -172325, 139318, 467474, 375214, 84614, -191297, -266846, -274774, -51472, 46046, -417182, -455568, 201817, 213479]
18447B13479a67655l2386o7188e4980k18224B14217a2821A46469c3959k32992
18437b66951A77824b17095D4253a5423l19168A58888o6210a52702d7122B5344
18426E9270K01925A21552J17793b74848B41443a11731f529j38749C6338c2414
18415a34953C35953D1365k389P4774b62345A04774a46459B40634E2690J19443
18405A72133b41665M8783O5737j74321o5527A35459J60801A6158R7335B4430M8989
18394G3419g0988B8692a78395H2151b55452d1450r0248A05054a2587B6687J26192
18383A52879k5731B2073b09600j70606D9153k2887a38538M8307I6702a41936B36767
18371A54155a23256j40810A20011J40156C9753c1260H2903l3754O2629a26615
$$ y = [213479, -167655, -200041, -267229, -54980, -273204, 214217, -12821, 146469, -33959, -266951, 177824, -217095, 44253, -15423, -334591, 158888, 92678, -152702, -47122, 25344, 59270, 261195, 121552, 239345, -274848, 241443, -111731, -6529, -145278, 36338, -32414, -134953, 335953, 41365, 38976, 113750, -262345, 104774, -146459, 240634, 52690, 172133, -241665, -192882, -127145, -301466, -366993, 135459, 296260, 16158, 113493, 24430, 73419, -70988, 28692, -178395, 82151, -255452, -41450, -131698, 105054, -12587, 26687, 152879, 127148, 22073, -209600, -380206, 49153, 26266, -138538, -90231, 96702, -141936, 236767, 154155, -123256, -264066, 120011, 260167, 39753, -31260, 82903, 49149, 111778, -126615]
18360F0873d6979m5899C3167g7445o3499q865b8253A04388D4727a2808H5014J1337
18348I6351a11147M4149A11622C8679L2745J41752e8541b8137G9965J64532b99447
18336D8409b48232P9846C08184b69461D5551g9115j25926n4827A12004g2006B88123
18324i6149m7387a4914n3104I4506a64354b7554G6172a93937A34114E8313d73044
18312h8519j26872e0746j944A15863b85874C05855b30510C4082L64021l0644a31306
18300A28077J0812o2367c54875M0396D7077Q1877J23635f0512F7759d8637k12898
18289b61535b5541j72038P8153C5158h2463B43117a01438j30463A62555i4700
18278c02703f7294j25574j24780R9911A50857F3835d7324j97028A02988K44882
$$ y = [60873, -46979, -92878, 33167, -77445, -140944, -149809, -28253, 104388, 44727, -12808, 85014, 96351, -111147, -66998, 111622, 38679, 71424, 213176, -58541, -28137, 79965, 244497, -299447, 48409, -248232, -168386, 308184, -269461, 45551, -79115, -205041, -259868, 112004, -72006, 288123, -96149, -143536, -14914, -68018, 94506, -164354, -27554, 76172, -193937, 134114, 58313, -473044, -88519, -215391, -50746, -52690, 115863, -285874, 305855, -230510, 34082, 398103, 367459, -131306, 128077, 138889, 76522, -354875, -314479, 47077, 128954, 252589, -60512, 67759, -48637, -261535, -25541, -197579, -119426, 35158, -82463, 243117, -101438, -231901, 162555, -94700, -302703, -67294, -192868, -317648, -217737, 150857, 63835, -47324, -244352, 102988, 347870]
18268C47870j63360b53653C14334D3227d13918G0777a55796k6550d5392j32851
18258a78243h1940A52951f5308j93397g0070K6132j26253k28964A75533b01667
18247e1601j76312j51249J07557F4041a47566H0017E098N9856b15163n2504F9323
18235c9578k20950K6592A65077Q107n5767a86389I0533i9162m5536A18537d4791
18223D31954c60374G754b34380j7328N4467A52729a36476d5560C4191a35487I0746
18211B11729b09911a02963c8798E4776a86652m0674O0933C4887a158k25055J04670
18200a21543M5841B9939g5883I4473P5004e2583A50346C8044J11104a57732B2512
18188a00700m5370e822G1474J35600a42292I4433b11887R4320A53167c1869p1838
$$ y = [347870, 184510, -253653, 314334, 43227, -413918, 70777, -155796, -182346, -45392, -178243, -81940, 152951, -65308, -258705, -70070, -43938, -170191, -399155, 175533, -201667, -51601, -227913, -379162, -271605, 64041, -147566, 80017, 5098, 64954, -215163, -267667, 69323, -39578, -260528, -233936, 165077, 173184, 117417, -186389, 90533, -99162, -144698, 118537, -44791, 431954, -360374, 7754, -234380, -251708, -197241, 152729, -136476, -45560, 34191, -135487, 90746, 211729, -209911, -102963, -38798, 54776, -186652, -227326, -166393, 34887, -1158, -226213, -121543, -75702, 29939, -75883, 94473, 169477, -52583, 150346, 38044, 149148, -157732, 22512, -100700, -146070, -5822, 71474, 207074, -142292, 94433, -211887, -117567, 153167, -31869, -103707]
18177a03707a3963I3379C6618M82g8534m64130A00998K40828D4109Q7271m5921
18166H5459c7593q1112j33048A42141a68838G4752K32933C1787a43080A52420
18155C2416L09203G2608a40567q7616O5933M1957e1303E911K69532E1691O9905
18144A21596a25635p9712A99105e2575b5146F5297a06239j20225B92736I5349
18133a05546B63285A0665a13532E1404b89047g8788k76685a1480A4529g0654j51378
18122b22032A99339a82567f6972j98684J10613f8613B4581b8980j30561a175j79008
18111a80183g148j77857P1543D54806G4047c0300j24293I8822f8494j0143K7032
18100e1605k5717o6426f1872B90240b5985j64579B48089a28476O2665A97302a71429
$$ y = [-103707, -13963, 93379, 36618, 37100, -78534, -542664, 100998, 341826, 44109, 131380, 85459, -37593, -118705, -251753, 142141, -168838, 74752, 307685, 31787, -143080, 152420, 32416, 341619, 72608, -140567, -228183, -162250, -120293, -51303, 5911, 275443, 51691, 121596, -125635, -205347, 199105, -52575, -25146, 65297, -106239, -226464, 292736, 95349, -105546, 263285, 10665, -113532, 51404, -289047, -78788, -355473, -11480, 14529, -70654, -222032, 199339, -182567, -66972, -265656, -155043, -68613, 24581, -28980, -159541, -1175, -180183, -7148, -185005, -113462, 454806, 74047, -30300, -154593, 98822, -68494, -78637, -51605, -77322, -143748, -61872, 290240, -25985, -190564, 248089, -128476, -65811, 197302, -171429]
18088f2352A23297j7577B8735a52579O0149E16963d05092C52855a32267e5670
18077G3128d1494j73565O4876E2942J835b57442G5645a07634j53701E7663R8339
18066A56002b43007O8875B23076b32G9181e03557a34474k16498F8753a01285q7136
18055a88421A0611J22307d1534n3835j57183e8649I7196a0702k71012a8563F209
18043E8811f0844H0739K23815a24135j43044F6162c76822i9539j79125C56006
18032a3995B68423h6282e648k62442A44348J05058g3953b5845D5548a0345n07777
18021e18122H3904b3406J202I1823P998M7831J26707b5188p1513m898j43397j25331
18009c70327A6726c48143F4796i9209E16371a4178l08588C54336q5305a69146
$$ y = [-62352, 123297, 105720, 28735, -152579, -92430, 516963, -405092, 352855, -132267, -55670, 73128, -41494, -215059, -150183, 52942, 54777, -257442, 75645, -107634, -261335, 57663, 156002, -243007, -174132, 223076, -232, 79181, -503557, -134474, -350972, 68753, -101285, -188421, 10611, 132918, -41534, -95369, -252552, -58649, 97196, -10702, -281714, -18563, 6209, 58811, -60844, 80739, 304554, -124135, -267179, 66162, -376822, -99539, -278664, 356006, -13995, 268423, -86282, -5648, -268090, 144348, 249406, -73953, -25845, 45548, -10345, -518122, 83904, -23406, -22204, 91823, 99821, 147652, 274359, -25188, -96701, -101599, -244996, -370327, 16726, -348143, 64796, -99209, 516371, -14178, -322766, 354336, 269031, -169146]
17998A81942i3095j54005R6122e9177B13934m4821a57397p6606B04715C5650h1937
17986a27682A68546i3763c8266J7819A14782J05262G6786a096j53815a3488j58150
17975a71638e2138B8946a78409l0234M9903f1064a3955A25276b8789j4563k04689
17964b48041f080E5498a22479j66555A923c15469c8394k86938a38948C3051b45789
17952b30876O0301d7129E4912J84805j17767a4680B03269e7368k58767A12709
17941C3725e2896j29155B671J88543a7918j35810j0774C7186i7079B30663I3357
17929a14159n5147A91924b57201O8662f0340B26009e20753b13808M1201B00514
17918a04405j18054k01318a82657F6349a21414A91558H2461J22558A4015J68451
$$ y = [181942, -93095, -247100, -150978, -59177, 213934, 169113, -157397, -234003, 204715, 35650, -81937, -127682, 168546, -93763, -38266, -20447, 114782, 220044, 76786, -1096, -154911, -13488, -171638, -52138, 28946, -178409, -208643, -158740, -61064, -13955, 125276, -28789, -43352, -248041, -6080, 55498, -122479, -289034, 1923, -315469, -38394, -325332, -138948, 33051, -245789, -230876, -170575, -47129, 54912, 239717, 121950, -14680, 203269, -57368, -316135, 112709, 33725, -52896, -182051, 2671, 191214, -17918, -153728, -164502, 37186, -97079, 230663, 93357, -114159, -169306, 191924, -257201, -188539, -60340, 226009, -520753, -213808, -172607, 200514, -104405, -222459, -423777, -182657, 66349, -121414, 191558, 82461, 205019, 14015, 182466]
17908A82466L02194B00508b84640E5552O0454d7474R379B62545n9238J12371a52509
17896H3846K69818B729J3811O5273H587b9342k46679q5226P8535H1190k7797b30136
17883B15516H9675i4033j70461k419A3437L7168g1535r4028a6531A46453E1988
17871d6727Q622k5078E0241h5178q0082g6183C67724e11561A81355m867c2539
17859A49007g0059n2423j2204o8681c7722m233j01726e7208B79249a77285g6896
17847A14339g1931c2123j02827A58742J28172a450A44006J99950r7638q0154d2922
17835H1505b29516G2960l3686J74028l562i0150N306A61302B9428J71408N6862
17824B57698a45392A39023b73389J32124o6444A26435K4351a64573b3584k56529
$$ y = [182466, 484660, 200508, -284640, 55552, 116006, -47474, -38095, 262545, 203307, 315678, -152509, 83846, 353664, 2729, 16540, 81813, 8587, -29342, -276021, -361247, -282712, 81190, 53393, -230136, 215516, 89675, -94033, -264494, -266913, 13437, 50605, -71535, -165563, -16531, 146453, 51988, -46727, -38105, -63183, 50241, -85178, -165260, -76183, 367724, -511561, 181355, 176488, -32539, 149007, -70059, -122482, -134686, -203367, -37722, -41955, -143681, -57208, 279249, -177285, -76896, 114339, -71931, -32123, -134950, 158742, 286914, -1450, 144006, 343956, 246318, 166164, -42922, 81505, -229516, 72960, 39274, 213302, 209740, -90150, -84844, 161302, 29428, 200836, 257698, -145392, 139023, -273389, -141265, -207709, 126435, 150786, -164573, -23584, -280113]
17814b80113e8213r8876D11796H4224c6959a8328j91369j300H1025I693b83727
17802C669J14982K12501A15693O810e2214J1457A56806a28956A25047a94619A85782
17790a49932M2901L2261l7374F922J59325Q9805f7354j09671f8741c0980j84814
17779b15794B4005O5044K3480a05608I4950m1544K3573d08489d4713j32046l54739
17768e31498C3842K1751a69941F6738a74347p6151j47528a65027B1234I516a17715
17756B8758e4700A08949J68037F2630a75841d7318k02828B23236C5263e7163B06274
17744b12388j36856h3777p8196M2540r4673d0489R546A69910m1090n4018a8697
17732E0547K04641a19240J201B05027k1666G4724J7467f5917a8720C07591F1398
$$ y = [-280113, -58213, -157089, 411796, 84224, -36959, -18328, -209697, -210997, 81025, 9693, -283727, 3669, 118651, 331152, 115693, 122503, -52214, -40757, 156806, -128956, 125047, -194619, 185782, -149932, -107031, -74770, -112144, 6922, 166247, 256052, -67354, -177025, -68741, -30980, -215794, 24005, 89049, 112529, -105608, 94950, 53406, 76979, -408489, -44713, -176759, -531498, 33842, 55593, -169941, 66738, -174347, -250498, -398026, -165027, 21234, 9516, -117715, 28758, -54700, 108949, 276986, 62630, -175841, -47318, -250146, 223236, 35263, -57163, 206274, -212388, -349244, -83777, -161973, -119433, -214106, -40489, -30943, 169910, 128820, 74802, -18697, 50547, 255188, -119240, -118039, 205027, 183361, 74724, 92191, -65917, -18720, 307591, 61398]
17720h4805A10227e6706E68073I7631L8880O6336J10204g6643m9047c4191G4924
17708B06938a7921A36749K78864b8901B22993J14417a00290g17I9710I771B343
17696f5148D7486c56489d9862A63856b98238A68843b7656l1801j23054C05783
17685A81571h9803G48L5158d0851C05458q8087l8487D5008Q399N5011P6840k6945
17673A58313b73288B09626I6737k1124M8141f9969G6767j9196h8773F1647J06843
17662A68490j4597k4573C5340a98915Q9965A0516R7215b03940A09461b10130D9847
17650H5383J67382C5989J86084H840a69621F9545b9864B9013M8656M6456g8187
17638a34992d9124j13533R094L2694B17719F2821J5643f2093R953A37072h1980
$$ y = [-84805, 110227, -56706, 568073, 97631, 136511, 202847, 313051, -76643, -125690, -34191, 74924, 206938, -17921, 136749, 415613, -28901, 222993, 337410, -100290, -717, 99710, 9771, 2343, -65148, 47486, -356489, -49862, 163856, -298238, 168843, -27656, -59457, -182511, 305783, 181571, -89803, 748, 35906, -40851, 305458, 217371, 178884, 45008, 53407, 108418, 185258, 158313, -273288, 209626, 96737, 75613, 123754, -69969, 76767, 57571, -88773, 61647, 168490, 153893, 129320, 35340, -198915, -108950, 10516, 107731, -203940, 109461, -210130, 49847, 85383, 252765, 35989, 222073, 8840, -169621, 69545, -29864, 29013, 77669, 124125, -78187, -134992, -49124, -162657, -153563, -120869, 217719, 62821, 78464, -62093, -52140, 137072, -81980]
17626e0837l1999D905J48096A3616b8401B34142A09558J19839a66422D1145K33482
17615B74627f6833j35679A18367a11612D44318i4105K4202A91612c1272k19045
17605b50317a16379M77j4056A17135b62891A95999b86569B49134A17495J2782
17595A30277i3637A7535a08245f362l3654C0722f639E833L33116b58142h2600
17583A67954a70984A94367J5513b27526C22676j49414b06640A96985h5647A46434
17572a34072D2487a30983O1036C1292J37073D5044O3945J40960n7280o6996m7445
17561G8228a826A40471E4747A6742a90579A92255a10218L4611r6354d8314C14337
17549B14406A7521P6820K46791A7712M20699b0381F6429B5200a39229d0573n1670
$$ y = [-50837, -82836, 4905, 153001, 13616, -28401, 234142, 109558, 229397, -166422, 41145, 274627, -66833, -202512, 118367, -111612, 444318, -94105, -69903, 191612, -31272, -250317, -116379, -115902, -129958, 117135, -262891, 195999, -286569, 249134, 117495, 130277, -93637, 17535, -108245, -6362, -40016, 30722, -6639, 5833, 338949, -258142, -82600, 167954, -170984, 194367, 209880, -227526, 322676, 173262, -206640, 196985, -85647, 146434, -134072, 42487, -130983, -69947, 31292, 168365, 45044, 108989, 249949, 192669, 125673, 78228, -1826, 140471, 54747, 16742, -190579, 192255, -110218, -75607, -171961, -48314, 314337, 214406, 17521, 94341, 341132, 17712, 438411, -20381, 66429, 25200, -139229, -40573, -92243]
17538i2243A2628K83435j1831c44271D28303G1027J4793b0897j84209C2020K0337
17527E2357a67191f7871l7431A02195g9621B16388b78303A65487F4059K05649
17517B69708g6038b0128E25062e6828A28234a24149B76755b31645D54592c38468
17506A88298a26043A88949d0314B8128a71274q5041d2322j65274B98576j26587
17496A71989k9251M4697g8203B14532E5794K136m725M425K17215g0995A97021
17484A91045i3684B67299M4050L0905g5494I2033D120a08621D99406j90198K8751
17473C37959j46699h5555A66391k7532k9623J86751m4739h5505M0864H9538g5209
17461A77952D5816b0571D69845A47834J37605j04935e758C63375K61734j99961
$$ y = [-92243, 12628, 296063, 284232, -344271, 428303, 71027, 85820, -20897, -205106, 32020, 52357, -167191, -67871, -105302, 102195, -79621, 216388, -278303, 165487, 64059, 269708, -76038, -20128, 525062, -56828, 128234, -124149, 276755, -231645, 454592, -338468, 188298, -126043, 188949, -40314, 28128, -171274, -256315, -42322, -207596, 298576, 171989, 142738, 187435, -78203, 214532, 55794, 57930, 53205, 57630, 274845, -70995, 197021, 191045, -93684, 267299, 311349, 342254, -75494, 92033, 4120, -108621, 499406, 309208, 337959, 191260, -85555, 166391, 138859, 109236, 295987, 251248, -85505, -44641, 89538, -75209, 177952, 45816, -20571, 469845, 147834, 285439, 180504, -5758, 363375, 625109, 425148]
17451D25148H5670K59548A1534L68120A29832A8067K22216L54499B27327j887
17441B25440d5581j6445F1577J47866J62858j5311b1422A01398J93594e6265a6414
17429A11554b85934A37463J51759j02639m7059K9794M1962K83508k45276K0113
17419B69625o6546R7452q9268C9487M34020J9541A49532J18574F7469b36191A22430
17407b04848A78783O7851I4571k0736C08J79068A4781K345c5289B34957j3431
17396B21526h8281C0038J27926D9375L51835q2909c3383D43944e0560B47607A06391
17384B78593F6742e5112A9170a27464C03440A27102a29554j8438e9153b6873D72203
17372B91306B7127J52596L6144H9867J56271H8074B0259J67226f0277A32752J7168
$$ y = [425148, 85670, 345218, 11534, 379654, 129832, 18067, 240283, 594782, 227327, 225440, -45581, -62026, 61577, 209443, 372301, 356990, -21422, 101398, 294992, -56265, -16414, 111554, -285934, 137463, 289222, 186583, 139524, 169318, 211280, 494788, 249512, 269625, 203079, 300531, 211263, 39487, 473507, 493048, 149532, 268106, 67469, -236191, 122430, -204848, 178783, 246634, 94571, 73835, 308, 179376, 14781, 17126, -35289, 234957, 221526, -88281, 30038, 157964, 49375, 401210, 318301, -33383, 443944, -50560, 247607, 106391, 278593, 66742, -55112, 19170, -127464, 303440, 127102, -129554, -147992, -59153, -26873, 472203, 291306, 27127, 179723, 215867, 89867, 246138, 88074, 20259, 187485, -60277, 132752, 149920]
17361A49920a9864C32579A09677O9823F261L85907L9335r0323A52671K03674d4441
17349c37577A22099E3134a67951B17308q7388D5977Q3733C0458J82539K56887
17339D69884j9848E6622J28587F3440a4228j83000d0863C81611F2837a07477b9074
17327A8490R7374K64424a98542d7536D9556b4762B725J35600I382M17716A60315
17315A29095P7897m7361b09443J02393A64565K14307j33989j1893I3537j9475
17305G4062M4436K38985f4058A49185K59238A33384a21215N7774m817G4232K64458
17294C38690r8604a98693A19468J7101K42858f6501B59372j08106b44772A20843
17283a06374j03729D16040a68405B39719K196C131K26216C507K30649K37377j10418
$$ y = [149920, -19864, 332579, 109677, 179500, 6261, 392168, 431503, 341180, 152671, 356345, -44441, -337577, 122099, 53134, -167951, 217308, 129920, 45977, 129710, 30458, 212997, 469884, 450036, 56622, 185209, 63440, -14228, -197228, -40863, 381611, 62837, -107477, -29074, 18490, 115864, 380288, -198542, -47536, 49556, -24762, 2725, 138325, 9382, 427098, 160315, 129095, 206992, 159631, -209443, -107050, 164565, 378872, 244883, 232990, 93537, 74062, 118498, 357483, -64058, 149185, 408423, 133384, -121215, -63441, -68258, 74232, 338690, 240086, -198693, 119468, 136569, 379427, -66501, 259372, 151266, -244772, 120843, -106374, -210103, 416040, -168405, 239719, 241915, 3131, 229347, 3507, 234156, 471533, 361115]
17272C61115a65933B49541J9105L01383b5011C50370A13621J29732F2954J19173
17262A82127d6779F992J37605p1187J11248J25571J68062B7284J30189b0999C51911
17250B48851A24282a39688A61878J67105A57833l757d1574D24475a62931D6683
17239g6781A90483Q7333A04998D4694B1024a5132C71930g085A06118K76309a52822
17227C90344P4535G3647J78258k5239J11998j59345H6233J63919p5993a9668D92485
17215C83399j48129a5276B34801P9727J05276f4320D59427j85558r0899E7K94986
17204B95043j6420k7237B6058J61312c7418D23492n4169j8797j20338h149A75272
17192B14816D6664J89998l6120j384J26790q4073J29636j54529q9250J0191f2617
$$ y = [361115, -165933, 249541, 268646, 570029, -25011, 350370, 113621, 243353, 62954, 182127, -46779, 6992, 144597, 73410, 184658, 310229, 478291, 27284, 157473, -20999, 351911, 248851, 124282, -139688, 161878, 328983, 157833, 154076, -41574, 424475, -162931, 46683, -76781, 190483, 277816, 104998, 44694, 21024, -15132, 371930, -7085, 106118, 382427, -152822, 390344, 464879, 73647, 251905, 226666, 338664, 179319, 86233, 250152, 174159, -19668, 492485, 383399, 235270, -15276, 234801, 314528, 419804, -64320, 459427, 273869, 182970, 57, 295043, 278623, 251386, 26058, 187370, -37418, 423492, 369323, 350526, 230188, -8149, 175272, 214816, 46664, 236662, 200542, 199158, 325948, 241875, 371511, 216982, 127732, 137923, -62617]
17180I9633K11730J8683d8373C62026j53398O3660J72435A18101R3682K69837
17170D81620j15809A46994A1197J90467E7545N60768q2393j00144A24637M5946
17160A70583J40364r0862a01141D03540A34863K55375C7849J86569H2402a23277
17149I9348M72539j09803A62138R1118K25526h4535A46521L94566A71175J68020
17139C39195o98j13939L7801j17804R386K48244J96465B85593B466L15815r3827
17128B24454J20661L9184j38556R7916J9755J14499j73375J26829A92083k7048
17118A65035L22959j02051K0744p6113O2127q3360J16898p4719q9898k7804m120
17107B29698O0675N6260K7433P5661p3281L57969C27793O9192K6170J17810j68936
$$ y = [99633, 311363, 330046, -48373, 362026, 208628, 272288, 444723, 118101, 211783, 481620, 365811, 146994, 11197, 201664, 57545, 618313, 535920, 435776, 124637, 170583, 310947, 220085, -101141, 403540, 134863, 390238, 37849, 224418, 82402, -123277, 99348, 571887, 462084, 162138, 253256, 478782, -84535, 146521, 541087, 171175, 339195, 338497, 224558, 262359, 144555, 153941, 402185, 598650, 285593, 2466, 318281, 224454, 345115, 384299, 245743, 343659, 363414, 477913, 304538, 431367, 192083, 165035, 487994, 385943, 406687, 330574, 392701, 309341, 426239, 351520, 261622, 233818, 229698, 290373, 346633, 374066, 449727, 376446, 734415, 327793, 396985, 423155, 540965, 372029]
17096C72029M8271B01755J56998K05430Q9093k7310B08122L05275j21649l2211
17086C59537K12983j36045J51032k00019J28349j08711j79076J8865k2995L30692
17076E54612L4285j09133r023J41104k32703K32151j21345r7290M25107l99658
17066D18107b6872B55733J98708A94663K82338L1580n899p8172J87253k39713
17056C72050n4631o0641o8333L30928j28450L03548k29206J33373k38226J20593
17046D81005J12426M5922j44338O8357M6840J01089k27334j72204O9422L44841
17036G26026j14360j13498p5596M8473r2127A04655O07829K3607j89088j4906
17026E32097j62038L63013j65679P9974o7083j22762p9535K94901j9726j71075
$$ y = [372029, 420300, 201755, 358753, 564183, 653276, 625966, 208122, 513397, 391748, 359537, 572520, 436475, 587507, 387488, 515837, 407126, 228050, 246915, 223920, 554612, 588897, 479764, 470741, 611845, 379142, 611293, 489948, 392658, 817765, 418107, -26872, 255733, 454441, 194663, 477001, 508581, 502682, 424510, 611763, 372050, 317419, 256778, 188445, 519373, 390923, 694471, 465265, 598638, 360412, 481005, 593431, 639353, 495015, 563372, 610212, 711301, 483967, 311763, 381185, 726026, 611666, 498168, 422572, 471045, 378918, 104655, 712484, 736091, 547003, 532097, 370059, 733072, 567393, 647367, 580284, 457522, 377987, 672888, 653162, 482087]
17016D82087L5109J80832j84990N3932L38179l31689K48999j53082j82482J58221
17006F45116r9160K32624N5472I8752L91588M46948k09265j87850l3273K23734
16996G30634K31488k68461o6151R7173k43333M97398l6186m31360K76816j05036
16986F82982k52268P0784N78947k57661J40247R683l41075K87492k20624M2917
16976G41424J85406j86038O996J7192J46251Q347j74013J0791K92984l66240J97779
16965H80879N9190j09374M428K27618L4090p91n3616N7271q9180l71235M75975
16954A115255j21014k42367K56851k9275L82930j48381L45429m20257k98411J63299
16944A004059r1282K35731N6279l03028J99916j40650K77113k84075J66817j9723
$$ y = [482087, 517196, 698028, 513038, 566970, 905149, 573460, 822459, 669377, 486895, 645116, 545956, 778580, 834052, 98752, 490340, 937288, 728023, 540173, 506900, 730634, 962122, 693661, 627510, 724683, 481350, 978748, 942562, 511202, 788018, 682982, 430714, 501498, 1080445, 822784, 963031, 972714, 631639, 919131, 698507, 741424, 926830, 740792, 747788, 764980, 911231, 919578, 745565, 756356, 1049340, 683100, 880879, 940069, 830695, 835123, 1062741, 1096831, 1096040, 1042424, 1099695, 1010515, 639280, 1115255, 994241, 751874, 1008725, 979450, 1362380, 1213999, 1559428, 1139171, 840760, 1004059, 912777, 1148508, 1204787, 901759, 1101675, 961025, 1238138, 954063, 1120880, 1101157]
16934A101157N9233K92197m77105j52749J12441J85460l3448K64682n32693K36925
16924A056100M96504l47702j55864K57635k00325N27738l15497K42794m02212
16915A159171L04469j87492l954M10425m0482k28881J51165l72086K25248m6540
16905A371043J38094j28371k73909N36201J66157k87070K66798k23474M12903
16896A978372k45895Q982j63006L0153K39677r5095L6798j11441j86720O46342
16886B138167k33567P4928k44321k68909O09145J40263j86151J73404j07904K10211
16876B305266k77823k55936J44275L39836m6138j05510L51747k23190L7889L63131
16866B633547k48629J5642J12076o5200r2L6765m13989L73466K60095K1284Q2651
$$ y = [1101157, 1160390, 1452587, 975482, 822733, 935174, 1120634, 1087186, 1351868, 819175, 1056100, 1552604, 1204902, 1049038, 1306673, 1106348, 1634086, 1318589, 1561383, 1159171, 1463640, 1276148, 1272194, 1682619, 1642137, 1413256, 1564421, 1192335, 1417583, 1371043, 1509137, 1380766, 1106857, 1643058, 1809215, 1522145, 1788943, 1565469, 1978372, 1732477, 1741459, 1578453, 1608606, 1848283, 1753188, 1789986, 1678545, 1491825, 2138167, 1904600, 1979528, 1735207, 1466298, 2075443, 2215706, 2029555, 2202959, 2095055, 2305266, 2027443, 1771507, 1915782, 2255618, 2209480, 2103970, 2455717, 2232527, 2270416, 2633547, 2384918, 2400560, 2512636, 2447436, 2447344, 2484109, 2070120, 2443586, 2703681, 2724965, 2807616]
16855B807616j17035j50106L75100L6287k08744K91857j46714M52511n14983N38916
16845C364705r9187k79575J93633J44341M1904j18199K52215m12914N48913o9278
16835C566558O56575o45239J98192M09802m11950L38856J03102J8349K36902j84335
16825D286812J07616J48469j46054K85749K42682k70687L75585j24488J51342
16816E057026L17264k47326j07449O34551K09748j09050J40638k09226M13715
16807F099891j58697P95768k30926p3396J33817N73720r9858J46320K51408M1894
16797G479941L48267N0277M2148M07142L99232R0619J36750K42414J36506O93889
16787A0027185J26841P4725J44219N70559P8633O34604J16284N72745L19890M82464
$$ y = [2807616, 2690581, 2540475, 2915575, 2951862, 2743118, 3034975, 2888261, 3340772, 2825789, 3364705, 3265518, 2985943, 3179576, 3323917, 3365821, 3247622, 3499837, 3086923, 3635836, 3566558, 4223133, 3577894, 3776086, 4185888, 3773938, 4112794, 4215896, 4234245, 4471147, 4286812, 4394428, 4542897, 4396843, 4682592, 4925274, 4654587, 5030172, 4905684, 5057026, 5374290, 5126964, 5019515, 5654066, 5863814, 5754764, 5895402, 5686176, 6099891, 5941194, 6736962, 6506036, 6432640, 6566457, 7140177, 7040319, 7186639, 7438047, 7479941, 7828208, 7878485, 7920633, 8327775, 8727007, 8817626, 8954376, 9196790, 9333296, 10027185, 10154026, 10228751, 10372970, 10943529, 11022162, 11656766, 11773050, 12345795, 12665685, 13148149]
16777A3148149M23170L33210K71656O0112Q55600M52136P99227J12897N39992
16768A6996149P66002Q36341N36371Q14154O69516M98852Q38014J165589Q34868
16759B3955856J009665R37315J264541J103823J187647J320293J155097J761019
16751C3695256J600782J872045J638508K037311K082948K287588K071712L012336
16743E0298486K631429K817943L233086L526020L798783M155040M171651M917216
16735G9549654M949964N295007N903153N990670O943628O996836P265868P739203
16727A30633983Q192103Q082398Q655224Q393719Q812073P820227P437275O835016
16719A94862018N665213M115149K731651J405582l00033k045941l476589n217691
$$ y = [13148149, 13571319, 13904529, 14176185, 14236297, 15091897, 15544033, 16343260, 16456157, 16996149, 17762151, 18598492, 19134863, 19949017, 20618533, 21117385, 21955399, 23120988, 23955856, 24965521, 25902836, 27167377, 28271200, 29458847, 30779140, 31934237, 33695256, 35296038, 37168083, 38806591, 40843902, 42926850, 45214438, 47286150, 50298486, 52929915, 55747858, 58980944, 62506964, 66305747, 70460787, 74632438, 79549654, 84499618, 89794625, 95697778, 101688448, 108632076, 115628912, 122894780, 130633983, 138826086, 146908484, 155563708, 163957427, 172769500, 180589727, 188027002, 194862018, 200527231, 204642380, 207374031, 208779613, 208479580, 206433639, 202957050, 197739359]
16711A97739359n748823p348857p513757q723712q170098r289920q372307q977750
16703A33594135p684993p761899p742518p088102o494118o179427n770520n384913
16695G9487645n142933l952072m336306l632384m061098l306582l039229k555431
16687D9461610k895077l038567j960427k183571j935763j817397j612828j678593
16679C2339387j413859j721324j153364j374445j345176q91640r60350j213705
16671B2265524o86556j083854m51436r92795o89419o90356o63309n07344o45398
16662A5855057j130178l56877k47085m61021k20371l13964o87092n61763j38827
16653A1737879n92235k18029j32512m26743n46297q4731k02191m62410k48344
$$ y = [197739359, 191990536, 184641679, 177127922, 168404210, 160234112, 150944192, 142571885, 133594135, 125909142, 118147243, 110404725, 103316623, 96822505, 90643078, 84872558, 79487645, 74344712, 70392640, 66056334, 62423950, 58362852, 55056270, 52017041, 49461610, 46566533, 43527966, 41567539, 39383968, 37448205, 35630808, 34017980, 32339387, 30925528, 29204204, 28050840, 26676395, 25331219, 24439579, 23479229, 22265524, 21578968, 20495114, 20043678, 19050883, 18361464, 17671108, 17007799, 16500455, 15855057, 14724879, 14368002, 14120917, 13659896, 13439525, 13125561, 12438469, 11876706, 11737879, 11145644, 10927615, 10795103, 10368360, 9822063, 9737332, 9535141, 9072731, 8824387]
16644H824387m72608L97322l11569m24402l20007O2487k28378j93900k43020k76387
16634F813925k70290J35235j96473l08304R5699k33176j69939k00465l32137J08121
16624E442196p0735k69394j72858j4419J2804j24142j00792l00759J88765m5858
16614D544808p4832j97726j46535j18228l33321k16861M41842l06642j57309k22600
16604C212596M01704n95129M19900k8120k69523J70204n50202N3605j24631L7185
16594B727589K18665K89131k85685J4412l30623K2215k09184j0802k22944J37691
16584B350465K44717m61201L52842J37751n37446O1827J68646k45749J09501l1558
16574B149795n0888o7499j62420j58180L09637k13144j41869M27697k99403Q3979
$$ y = [8824387, 8351779, 8749101, 8437532, 8013130, 7693123, 7755610, 7527232, 7333332, 7090312, 6813925, 6543635, 6678870, 6482397, 6174093, 6269792, 6036616, 5866677, 5666212, 5334075, 5442196, 5371461, 5102067, 4929209, 4914790, 4927594, 4803452, 4702660, 4401901, 4590666, 4544808, 4469976, 4272250, 4125715, 4007487, 3674166, 3457305, 3899147, 3592505, 3435196, 3212596, 3614300, 3019171, 3439071, 3410951, 3141428, 3311632, 2761430, 2815035, 2690404, 2727589, 2946254, 3235385, 2949700, 2964112, 2633489, 2655704, 2446520, 2435718, 2212774, 2350465, 2595182, 2133981, 2486823, 2624574, 2087128, 2148955, 2317601, 2071852, 2181353, 2149795, 2098907, 2031408, 1868988, 1710808, 2020445, 1807301, 1665432, 2093129, 1793726, 1877705]
16564A877705k77573J27510J21897l94428K85964J41321m80315L16077R373p9363
16554A648168K01959m18797K98876n7867m48927N53536l09847l73238P7923K9969
16544A201755J35257J492k15754K04622j37751K68843j62504J47886k83857j1961
16534A148028m4428k33065N20446k83717j30524L7078l04646K59065L33607j89748
16524A112096j56669J92983M9307k78250J34521k93036J92400j52191K74731k07376
16514H68516p1780n015j25086J74375k87805N35300J9962j99063L1213j1303q7024
16503H42290q2865r3511m0557K7183J10853k33010J19405k1354R7304P8938r6387
16492G08289m2523q7441M9316L15542j75002Q2427j89908J26450l6560r197r0822
$$ y = [1877705, 1600132, 1727642, 1849539, 1455111, 1741075, 1882396, 1402081, 1718158, 1727531, 1648168, 1850127, 1431330, 1730206, 1672339, 1223412, 1776948, 1467101, 1093863, 1171786, 1201755, 1337012, 1338504, 1122750, 1327372, 1189621, 1458464, 1295960, 1443846, 1159989, 1148028, 1103600, 870535, 1390981, 1107264, 976740, 1013818, 709172, 968237, 1301844, 1112096, 955427, 1148410, 1197717, 919467, 1053988, 760952, 953352, 801161, 1075892, 868516, 796736, 791721, 666635, 841010, 553205, 1088505, 1108467, 909404, 940617, 929314, 842290, 759425, 665914, 625357, 652540, 763393, 530383, 649788, 628434, 725738, 804676, 708289, 665766, 578325, 627641, 943183, 768181, 850608, 660700, 787150, 750590, 741393, 650571]
16481F50571j04734J55713J50096k64594R6881A45136N76626j3527B95184J22919
16471D18103L07461M1433k56026J27323B59845K49208K26825o5202j91322p7368
16461D01986o091k3288K03186o1597R3985k99750J37274j53930K27538O5005J89615
16450G73933j00691M3192A98525K91079J05855A94694J12827J2721O2043A41013
16439D05038q4993L48831m5441K84203k34980k3327j05831k8279J1826A95652
16428D14043L14431k29113B42550J77090l3909R6683Q5777k60584J70832j77668
16418C00771Q5283j01084l1795b2034B49467m5172Q7440j32830K25721A36469
16407D05817H7222M7639O751J37653K20259j08332C8333M20739j45869R8291k8594
$$ y = [650571, 545837, 701550, 851646, 587052, 683933, 145136, 721762, 708235, 295184, 418103, 725564, 766997, 510971, 638294, 259845, 509053, 735878, 670676, 479354, 401986, 395895, 372607, 575793, 514196, 608181, 308431, 445705, 291775, 519313, 584318, 773933, 673242, 716434, 198525, 489604, 595459, 194694, 307521, 320242, 382285, 141013, 405038, 320045, 668876, 623435, 907638, 672658, 649331, 543500, 515221, 527047, 195652, 414043, 728474, 499361, 242550, 419640, 385731, 482414, 568191, 307607, 478439, 300771, 386054, 284970, 253175, -22034, 249467, 204295, 291735, 158905, 384626, 136469, 405817, 87222, 134861, 141612, 279265, 499524, 391192, 38333, 459072, 313203, 411494, 382900]
16396C82900j47337Q2108K37369B21407K48988A51753a79408C09849J97110j94638
16386C12321O5275K1815j11906J00562j39234r382Q7242O4222j11203A5650K85246
16375C00896M3873A15809i6216C74137BK72371b6503F1442b07902F32837B16381
16363E6117G149K29157R2295A08731J82261J22272A4976P7049l3536L53802m6367
16352C65924E3211R8058a48096M3769B52060J61877H5384a6885C62830n3188j48841
16341A60801K8895q5826c87808B31393I9190D1267R9354R8296l4428A8359f121
16329E5579J18599h5865B57298A2066K28997a51862C2619J10828J02757n8546
16319A87658C57h5322B83164a09412D43925b03378f7774L1118D5636K28914K92346
$$ y = [382900, 235563, 317671, 555040, 221407, 470395, 151753, -179408, 309849, 506959, 312321, 377596, 399411, 287505, 388067, 248833, 239451, 326693, 390915, 279712, 15650, 300896, 344769, 115809, -96216, 374137, 2, 272373, -26503, 61442, -207902, 632837, 216381, 56117, 7149, 236306, 328601, 108731, 290992, 413264, 14976, 92025, 58489, 412291, 365924, 53211, 151269, -148096, -104327, 252060, 413937, 85384, -16885, 362830, 309642, 160801, 189696, 103870, -387808, 231393, 99190, 41267, 140621, 238917, 204489, 18359, -6121, 55579, 174178, -85865, 257298, 12066, 241063, -151862, 32619, 143447, 246204, 187658, 357, -85322, 283164, -109412, 443925, -203378, -67774, -36656, 45636, 274550, 566896]
16308E66896F8400M08373k29858j13797l0019O9424m4808P101b03634A26284n622
16297A20662e0572D21538j89918f2302B07468A8095J38269K4339H5906B9241M39039
16286D68280a45179g2567C2712M73358b504D70941A83381a15486A08420a8078
16275D6010b86495A64009a61061F0189J55270d6442B93152d5739E0803c5886m1856
16264g7742l3218C17178j18940J46659a60912p4833A46700h5223A65325K5242
16254A90567a41069M3043a1246j86454B79299j07506G9879J80910l9420l3536
16244A87833a70112H4417M2970b7439A23039R5058a11390H725a90300d6525G4247
16232g7134A26909a12011C98286c4762G4292d66G736K36156r1399a83573g7772
$$ y = [566896, 68400, 476773, 246915, 133118, 103099, 172523, 127715, 134816, -203634, 126284, 120662, -50572, 421538, 231620, -62302, 207468, 18095, 156364, 180703, 85906, 29241, 468280, -145179, -72567, 32712, 506070, -2504, 470941, 183381, -115486, 108420, -18078, 46010, -286495, 164009, -161061, 60189, 215459, -46442, 293152, -45739, 50803, -35886, -77742, -110960, 317178, 198238, 344897, -160912, -235745, 146700, -85223, 165325, 190567, -141069, -98026, -11246, -197700, 279299, 171793, 79879, 260789, 221369, 187833, -170112, 84417, 127387, -27439, 123039, 218097, -111390, 8725, -190300, -46525, 74247, -77134, 126909, -112011, 398286, -34762, 74292, -466, 7736, 243892, 152493, -183573, -77772]
16220A87455J88853I8349R7029L85934E0925J85767Q7081b50965F4491P0824g8284
16208A88051c0669B32938c19682J11108M1322A89491B8636K15327a98087D4474
16197G6288a15062H7876a94759M5056d8867H9589a0064B08313j3724E4268f2989
16185a01501k30226E1916J99438p371b79100A40069J12532a34453A70904m3431
16175A27473J01730g8245j72963H4777R0294q1383K85174j9987A33162j6593a08751
16163h2482C0537a34403e8772B40077d03467H0880k8638P8266R5382q8982j0029
16152A26879A5204d01694F090N8778a79616P6797J9965H1385P7291f3669i621
16140d4248K1403j31538F5529a6203B10849a73991A57538M6119K16958a92100
$$ y = [187455, 376308, 98349, 195378, 581312, 50925, 236692, 323773, -250965, 64491, 135315, -78284, 188051, -30669, 232938, -319682, -208574, -167252, 189491, 28636, 243963, -198087, 44474, 76288, -115062, 87876, -194759, -149703, -48867, 89589, -10064, 208313, 194589, 54268, -62989, -101501, -331727, 51916, 251354, 243983, -279100, 140069, 252601, -134453, 170904, 127473, 229203, -78245, -251208, 84777, 175071, 93688, 378862, 358875, 133162, 116569, -108751, -82482, 30537, -134403, -58772, 240077, -403467, 80880, 52242, 130508, 225890, 136908, 126879, 15204, -401694, 6090, 64868, -179616, -102819, -82854, 81385, 158676, -63669, -9621, -44248, -22845, -154383, 65529, -16203, 210849, -173991, 157538, 203657, 420615, -192100]
16129C8343J8618b778k60429c555A87853b88248A66403M1591a56908d0098j47020
16118a87118K8007C8422L5222b39347A17239B5953a27500A02571R9609g9669A32834
16106G5372i9118A18662a86994A27430K0275o154K80117o3804g305j31098B78795
16094c8819G2132d2391k9410a2299j50517M8766j66667d9997H0379b0428D5444
16082b22797I9627c29434a20330b4456H5703b68164J03330c2001I8202C5081J81915
16071B16996G7663a26212k54204a03348j3996A48753o2873k9720e6422E4622c953
16059e7372j32241H3256a42381o408b0973C6468J27783l3715n5388g2885E0193
16047a3756k61833A08499C5985b2304C21975a15450q0473Q9986q411G7363Q5536
$$ y = [38343, 56961, -2778, -263207, -3555, 187853, -288248, 166403, 207994, -156908, -40098, -187118, -159111, 38422, 73644, -239347, 117239, 25953, -127500, 102571, 202180, -79669, 132834, 75372, -99118, 118662, -186994, 127430, 147705, 141551, 421668, 357864, -7305, -138403, 278795, -38819, 72132, -42391, -71801, -12299, -162816, -114050, -280717, -49997, 80379, -20428, 45444, -222797, 99627, -329434, -120330, -24456, 85703, -268164, -164834, -32001, 98202, 35081, 216996, 77663, -126212, -380416, -103348, -117344, 148753, 85880, 56160, -56422, 54622, -3953, -57372, -189613, 83256, -142381, -148789, -20973, 36468, 164251, 130536, 75148, -72885, 50193, -13756, -275589, 108499, 35985, -22304, 321975, -115450, -195923, -105937, -114348, 77363, 162899]
16036A62899b25768e1686j13957c5591C0922h8814A52037a47286I8592d7302a1439
16024C4865J46719b04314A23674c83179A34359J69512b58161J13373m25963A67597
16013b194n6926m687j07254M1753r6496M7662O3629G5525a03381A20483a23868
16001c67936A59689c46794E9228K5268M7463m8723a39701I7106A5257b62710A1346
15989B17892b09288A07257A6199b20756e0161A29451P9824F6252J55072a65765
15978E8252K43772b09258G9440P5598G6816E891K12611D0928a89091a1398C80484
15966h1516E0819e2158j56316B17020b16479F4043d10001A66430c8608A37437
15955h3239A06818a05230j15977l86465i1241c0724k3816k68123k9955A70005
$$ y = [162899, -225768, -51686, -165643, -35591, 30922, -88814, 152037, -147286, 98592, -47302, -11439, 34865, 181584, -204314, 123674, -383179, 134359, 303871, -258161, -144788, -570751, 167597, -2194, -59120, -63807, -171061, -129308, -225804, -178142, -114513, 75525, -103381, 120483, -123868, -367936, 159689, -346794, 59228, 84496, 131959, 83236, -139701, 97106, 15257, -262710, 11346, 217892, -209288, 107257, 16199, -220756, -50161, 129451, 209275, 66252, 221324, -165765, 58252, 302024, -209258, 79440, 155038, 76816, 5891, 218502, 40928, -189091, -11398, 380484, -81516, 50819, -52158, -208474, 217020, -216479, 64043, -410001, 166430, -38608, 137437, -83239, 106818, -105230, -221207, -607672, -91241, -30724, -54540, -322663, -352618, 170005]
15944d48823C74788j71176b28854A77566d7057b0822k15443a05793j60839l3896
15934c00528G4984n532a09674n85013e1726B03148h7407e418F5538a16412C2215
15922i3280I8668a74215e9960A46032a2872I6403O4708a07239m005j11876d7755
15910b36819m5459C35350i190E0561K12490a5980B68459H8857d0678G9841k335
15899G7506J15886a67280f1462A36635o5413a77462r5704A92970C8746J67032
15889B05778E6016c62990J1353C75785C0173D149c5151p5080A7881o309a76712
15877a78141E8551P139a73310E2097a10357k01937A31690B8934b03311L6188B34113
15865d53254g7274c5707G2778g1246F4976b86262E703R3763g9166j9042a2999
$$ y = [-448823, 374788, 203612, -228854, 177566, -47057, -20822, -236265, -105793, -266632, -300528, 74984, 69452, -109674, -694687, -51726, 203148, -87407, -5418, 65538, -116412, 32215, -93280, 98668, -174215, -59960, 146032, -12872, 96403, 161111, -107239, -111244, -223120, -47755, -236819, -282278, 335350, -9190, 50561, 263051, -15980, 268459, 88857, -40678, 79841, 77506, 193392, -167280, -61462, 136635, 71222, -177462, -273166, 192970, 38746, 205778, 56016, -362990, -351637, 375785, 30173, 4149, -35151, -110231, 17881, 11572, -176712, -178141, 58551, 65690, -173310, 52097, -110357, -312294, 131690, 28934, -203311, -167123, 234113, -453254, -77274, -35707, 72778, -71246, 64976, -286262, 5703, 99466, -79166, -98208, -12999]
15853A09716k0949j253l891a24236N7464a081j30443I4900g4725B08833b35593
15841b49621J02616A92454G6211J04926E9599L2287C4449a56106J3177b7955j74469
15830b02424A62272o7781n004d65183C35414a22033B18755b28273J05994l40010
15820d62289d3247j504H7842b23424K8542m8105A6393g9281m0439J9837k81193
15809c81076A48956j168D8488a16609C48570B0021b9545l2372b5665A0515J7580
15798B8095a89021f3688B53434c24378A64728N4504F4790b13634a6574k24566
15788b41140F664A648a13498G0857J08431b00598a5237A23731i0432a0020l05689
15777c15709b6993j79297B42174g0336a2696m00616h147C7699a32240R410L4411
$$ y = [109716, 88767, 87514, 83623, -124236, -66772, -1081, -131524, 94900, -74725, 208833, -235593, -249621, -147005, 192454, 76211, 181137, 59599, 91886, 34449, -156106, -142929, -27955, -202424, 162272, 94491, 89487, -465183, 335414, -122033, 218755, -228273, -122279, -462289, -43247, -44751, 87842, -223424, -194882, -242987, 16393, -79281, -119720, -99883, -381076, 148956, 147788, 48488, -116609, 348570, 20021, -29545, -61917, -25665, 10515, 28095, -189021, -63688, 253434, -324378, 164728, 219232, 64790, -213634, -16574, -241140, 6664, 1648, -113498, 70857, 179288, -200598, -15237, 123731, -90432, -10020, -315709, -26993, -206290, 242174, -70336, -12696, -413312, -8147, 37699, -132240, -122830, -88419]
15766h8419k9607B32426f8554m6789C9774a63187Q0514A00764a11162r230A21014
15754A55997k0391C034h9251c8659k46556c4277p441A19297l1169a93692B03092
15742b5234A06709i1702B6571J80146i3496C9229K55743b41802A53298J08221
15732B61519a10151o5599A09909e8587C1754a59590C810b94510B09083b44135
15721I7285e3886k1164A38284a64996D5799b13318f9134C34756b04407o8623e6774
15709h8361n227B7985a80052g7839I3652g1048j84217A62841a52548P4138K0714
15698e7696k51264a26470j23665k0695A62040a35376C7676O1529f4533A94061
15687b2968k65385C65919D7822f1716p4355k74058h5030k49204A44987b5177C1097
$$ y = [-88419, -118026, 232426, -68554, -115343, 39774, -163187, -82673, 100764, -111162, -120392, 121014, 155997, 135606, 3034, -89251, -38659, -285215, -34277, -41718, 119297, 88128, -193692, 203092, -25234, 106709, -91702, 26571, 206717, -93496, 39229, 294972, -241802, 153298, 261519, -110151, -175750, 109909, -58587, 31754, -159590, 3810, -294510, 209083, -244135, 97285, -53886, -75050, 138284, -164996, 45799, -213318, -69134, 334756, -204407, -273030, -56774, -88361, -93588, 27985, -180052, -77839, 93652, -71048, -255265, 162841, -152548, -78410, -57696, -308960, -126470, -250135, -270830, 162040, -135376, 37676, 99205, -64533, 194061, -22968, -288353, 365919, 47822, -61716, -136071, -410129, -85030, -334234, 144987, -25177, 31097]
15675a91057d0466l146G1910M1684k0548a41717C00626c45497A34978m9234K63248
15664C48992a84802m1324P4807f4097C30639b61273a8211j53384C5769i885n1179
15653f1064G1096a0824k44320g567k40330m8182f0245I6342d3638A21678F856
15641c12093b8736G4831N6233b26779B14577a8701j03057j35749I0809M0973a1582
15629I2179e8750r8857b6104B73286a8849o8502B24773g934k3740A33705N265
15618A38970K17070j33538h4653B17847a19817j3272C0604e235B78265a25457
15607A78089c9903A1318i6629C28385e2681A30240b27997g02k83065P8127H1806
15595A38435a35016k85513a202G6331a45174B11740F0775b06977A25857K32802
$$ y = [-191057, -40466, -43612, 71910, 113594, 93046, -141717, 300626, -345497, 134978, 85744, 348992, -184802, -226126, -151319, -64097, 330639, -261273, -18211, -171595, 35769, -9885, -61064, 71096, -10824, -255144, -7567, -247897, -296079, -60245, 96342, -43638, 121678, 6856, -312093, -28736, 74831, 131064, -226779, 214577, -18701, -121758, -257507, 90809, 131782, -11582, 92179, -58750, -157607, -26104, 273286, -18849, -87351, 224773, -7934, -31674, 133705, 138970, 356040, 222502, -84653, 217847, -119817, -133089, 30604, -5235, 278265, -125457, 178089, -39903, 11318, -96629, 328385, -52681, 130240, -227997, -702, -283767, -205640, 81806, 138435, -135016, -420529, -1202, 76331, -145174, 211740, 60775, -206977, 125857, 358659]
15585C58659E6744a51820k6733d7700C49442G8947K92775a69906C9650K63768
15575C03418c09061h3849B962e41855a09845C9858a07120D39656c881E3476a72068
15563A81890e5975G2881d63851G0817L1020C3757a52061B56642a9333j31470F80
15551b85526Q5782h8563B00591a80958C0023a3384o0207k26210R7072B77879A03364
15539b40218J09200R510C0258b12049C67583c7498B32128A14264b3180m9079k66119
15528c38378A90373p9790b85455A62844E3620M69356h5283H6075a63084A68450
15517F6631K57933D4815h1245B97552G6498a09905p7672B67436g6455k67916a19741
15505d39450J3142f0268j71152e6488H7199a29645a6104j83496e6842K425j35821
$$ y = [358659, 56744, -151820, -178553, -47700, 349442, 78947, 371722, -169906, 39650, 303418, -309061, -83849, 2962, -541855, -109845, 39858, -107120, 439656, -3881, 53476, -172068, 181890, -55975, 72881, -463851, 70817, 101837, 33757, -152061, 256642, -19333, -150803, 680, -285526, -199744, -88563, 200591, -180958, 30023, -13384, -73591, -299801, -202729, 277879, 103364, -240218, -131018, -121508, 30258, -212049, 367583, -37498, 232128, 114264, -23180, -72259, -338378, 190373, 110583, -285455, 162844, 53620, 522976, -85283, 86075, -163084, 168450, 66631, 324564, 44815, -81245, 297552, 76498, -109905, -187577, 267436, -76455, -344371, -119741, -439450, -426308, -60268, -231420, -56488, 87199, -129645, -16104, -199600, -56842, -54417, -190238]
15494a90238O3815j21619A04061d6212j29120d2033A94434P4477b61276q96h2110
15482C5895e5941k4032C8483A0631a84762P1112k05698b975j39993e5423k33968
15471b89391a11996m7451e7874o9708F2868a50962L0634d0873A33221A8443c8379
15459b09627C57722C18M7049J96696E1719L9205a21544B3105K36291f0291i454
15447B80258B8053J11627b00825F4150b12889B02249m5921d921A01025Q5876C8265
15435A38717c06969N2900g0621l7203j3381D12110E6586M6098M14440b28710C33250
15423b25869q1253G4662J79399k5025F5977J45781G8112i23B59224r5247i2087
15411A44463b944k72453J1575B3824b81292C0414P5678c58591G7916J04036e4822
$$ y = [-190238, -126423, -248042, 104061, -46212, -175332, -42033, 194434, 268911, -261276, -262172, -82110, 35895, -55941, -79973, 38483, 10631, -184762, -113650, -319348, -2975, -142968, -55423, -289391, -111996, -159447, -57874, -127582, 62868, -150962, -120328, -40873, 133221, 18443, -38379, -209627, 357722, 318, 47367, 244063, 51719, 90924, -121544, 23105, 259396, -60291, -9454, 280258, 28053, 139680, -200825, 64150, -212889, 202249, 156328, -4921, 101025, 186901, 38265, 138717, -306969, -254069, -70621, -107824, -121205, 412110, 56586, 102684, 517124, -228710, 333250, -225869, -307122, 74662, 254061, 229036, 65977, 211758, 78112, -923, 259224, 163977, -92087, 144463, -2944, -275397, -263822, 23824, -281292, 30414, 106092, -358591, 77916, 181952, -54822]
15399D9115K58800a47066A75473h3550p6374C23360a3896k31016J20007H542L05163
15388C13705h963A746J94671a01486a9318l13612H5437J25750L9069A23505b1169
15376I7186Q3160b66454B79407A19643j6848q454K32956c2978B87940a49477a6583
15364H4772K05620C461J04371a2235j06196K8603B21222a84900F0646b14934p860
15353b22794A82477a73200E8539a17163A06729h3131B36840G5006A3808h1254
15342I3132C5063i4684J1818l27581J6254A38323c08210O9768j2394B27418b77324
15330b1329A4643b20260B3037J49717h3795B99501A05985K54769b5158k28190
15320b53348F5415K40606I4005e044F559J09640R1053D7033J41769f0595D5793
$$ y = [49115, 307915, -147066, 175473, -83550, -159924, 323360, -13896, -244912, -124905, 8542, 313705, -8963, 1746, 196417, -101486, -19318, -332930, 85437, 211187, 250256, 123505, -21169, 97186, 180346, -266454, 279407, 119643, 102795, 94341, 327297, -32978, 287940, -149477, -16583, 84772, 290392, 3461, 107832, -12235, -118431, -89828, 221222, -184900, 60646, -214934, -222794, 182477, -173200, 58539, -117163, 106729, -83131, 236840, 75006, 13808, -81254, 93132, 35063, -94684, -82866, -410447, -394193, 138323, -308210, -238442, -250836, 227418, -277324, -21329, 14643, -220260, 23037, 172754, -83795, 299501, 105985, 360754, -25158, -253348, 65415, 306021, 94005, -5044, 6559, 116199, 207252, 47033, 188802, -60595, 45793]
15308i50F8962k1556g8306A06516b25979C2920M9455N1199a02859k2846j39644
15297b65349E8482j0261A5859P394K09253H733L50130e6685A9475M33171b85367
15285A67399a99203A46503a24085F1148e6574A33725a0879A07379Q3409R7954
15275B88742j38153a49007C2953a38782A94814b76365J23041I9668D5675f0197
15264B38623F2135L3304f7319B58169a09719I3924J20300J88546A16846g7093
15253F16J47265J7488Q5881K74773K78404M50028m81636J74358j19079l02978
15243E25120k26030N6703l4876G6539P2442L23894A17256J39924J53582G7912
15232g2942B56023K01941a75644b6710j65996O249D12559q1195h6531H24i06H3693
$$ y = [-950, 68962, 47406, -78306, 106516, -225979, 32920, 82375, 133574, -102859, -125705, -265349, 58482, 48221, 15859, 23253, 232506, 8733, 358863, -56685, 19475, 452646, -285367, 167399, -199203, 146503, -124085, 61148, -56574, 133725, -10879, 107379, 190788, 288742, 150589, -149007, 32953, -138782, 194814, -276365, -153324, 99668, 45675, -60197, 238623, 62135, 95439, -67319, 258169, -109719, 93924, 214224, 402770, 116846, -77093, 616, 147881, 165369, 251250, 526023, 804427, 1254455, 772819, 947177, 828098, 525120, 299090, 355793, 320917, 76539, 148981, 472875, 117256, 257180, 410762, 77912, -72942, 256023, 457964, -175644, -26710, -192706, -186457, 412559, 331364, -86531, 824, -906, 83693]
15219C2446e2532B34165a75802A08411a39536B3599K41372A12250n2477b7093
15208C58544l7037a01622A73677J11865q0989a54B43581q7778g0247l4032C15649
15196A85895c4598B28208c5612I2163m1591d3241a5816j19121C37898a48855B92648
15184A31308b06475i5215B29468b9404B81050I5905Q634b09385B1987a18971A33404
15172h079o4805C08521j24081A6077J04621A8058b6679D3812a08660b1397A15668
15160B14125J23587c5609C96358B5010a61590B1401J35786E5327L03498j66483
15150A92342q1325f7442A77442b8831A43493L52811a55292B97720A48331a41800
15139C68368e7086b275A50126k392l0616b205G3085L3022k382K64304D3208R5400
$$ y = [32446, -52532, 234165, -175802, 108411, -139536, 23599, 264971, 112250, 59773, -27093, 358544, 321507, -101622, 173677, 285542, 204553, -154, 243581, 155803, -70247, -104279, 315649, 185895, -34598, 228208, -35612, 92163, 50572, -43241, -15816, -134937, 337898, -148855, 292648, 131308, -206475, -95215, 229468, -29404, 281050, 95905, 104539, -209385, 21987, -118971, 133404, -8079, -72884, 308521, 184440, 16077, 120698, 18058, -26679, 43812, -108660, -21397, 115668, 214125, 337712, -35609, 396358, 25010, -161590, 21401, 157187, 55327, 358825, 192342, 111017, -67442, 177442, -28831, 143493, 496304, -155292, 297720, 148331, -141800, 368368, -57086, -2275, 150126, 147734, 117118, -2205, 73085, 106107, 103725, 368029, 43208, 138608]
15127A38608O2720o3837J42665H838J38298L56662F9292b15758o0862A82492K11523
15116C94015H3375J50231K00515A75231a73541C58672O1807C3265e7594E8158
15105C8506J05092a14639j1028C76848A54286N6248r2798J45398C9826J63763
15095B03589q1438J28175A24460D025K34191R3501n5352d2276A68393a1844C45620
15083A03376L7763J45662H6881L66003c92650B63325O5952A03849j619O0266J53657
15072C16153B5605O9299j7631P3027D4134P6051m2862J319i8809C36342r3437
15061B42905j8138J47522A69101K859a12282F6158K19464j39167n7440J06298
15051A95313K4801k5559O1977E8805J56136M2030B4113J12234D3524Q5862F2804
$$ y = [138608, 201328, 137491, 280156, 8838, 147136, 503798, 69292, -215758, -276620, 182492, 394015, 83375, 233606, 434121, 175231, -173541, 358672, 420479, 33265, -57594, 58158, 38506, 143598, -114639, -125667, 376848, 154286, 210534, 117736, 263134, 39826, 203589, 122151, 250326, 124460, 4025, 238216, 331717, 276365, -42276, 168393, -11844, 345620, 103376, 141139, 286801, 86881, 452884, -392650, 263325, 329277, 103849, 102230, 162496, 316153, 25605, 94904, 77273, 150300, 44134, 120185, 77323, 78642, -98809, 336342, 242905, 224767, 372289, 169101, 171960, -112282, 66158, 285622, 146455, 89015, 195313, 220114, 194555, 256532, 58805, 214941, 256971, 24113, 136347, 43524, 129386, 62804]
15039A92248a5467B06588c0137D40621k15535K13280a62799B12692n3687O0986
15029B19991J93442j14651C1334K25099J93536j33689p8038a40564e6903E29709
15018C6672J762K07627q0425i2374n8805C51321K01999B63692A21091i3263I6712
15006D00776c4397H1645j9416K14657A11870L0959N6364K86131j45111N8786B6515
14994C73559J09301J03731B31441Q6941A58402M3488I4081A585L01085j32630
14984A70040J26435c8921A64372N4986F4284K17024j32691R4815k5855a71087
14973D34696H8717e2725a8925B92367g0183E5920L5793J89602r8873d266E580
14961B26936J23599o5633J1918r0422D0767J55083J60996K51280B97620O0427
$$ y = [192248, -15467, 206588, -30137, 440621, 225086, 438366, -162799, 212692, 159005, 219991, 413433, 298782, 31334, 256433, 449969, 316280, 238242, -140564, -56903, 529709, 36672, 38434, 246061, 165636, -92374, -151179, 351321, 553320, 263692, 121091, -93263, 96712, 400776, -34397, 81645, 62229, 276886, 111870, 142829, 199193, 485324, 340213, 398999, 26515, 373559, 482860, 586591, 231441, 318382, 158402, 201890, 94081, 1585, 302670, 170040, 296475, -38921, 164372, 219358, 64284, 281308, 148617, 243432, 217577, -171087, 434696, 88717, -52725, -18925, 292367, -70183, 55920, 91713, 281315, 182442, -4266, 5580, 226936, 350535, 284902, 296820, 206398, 40767, 195850, 356846, 608126, 297620, 358047]
14951C58047H5262L11992J4279K0729F9239J85635j04246F9735L2351M72495j22769
14940D51812j62860A19664k5651N37963k72447M1410j09129a39175p3154B77008
14929B47280l5565O9208m857P4248K2947j05541l4514D3329L09669J09448F6095
14917B36673L25711B78955j3562K36816l3394n5936n7899k8655K36248o3469Q9227
14906E88331B11447K86616H9574J12228N321M770J61751j53507K35644k27367
14896B28414R6786j36308L15192A56986k0470K97697A20175L14646r944J38671
14886E63548R9882A3368K74831N7865P0967j72028m2262M33033k1917C4042J98100
14875B32142J96590A87696o5632K98710J35663B59329Q1144A65998J08418J30360
$$ y = [358047, 85262, 397254, 411533, 432262, 69239, 254874, 150628, 69735, 102086, 574581, 451812, 288952, 119664, 94013, 631976, 359529, 400939, 291810, -139175, -212329, 277008, 247280, 211715, 280923, 276066, 350314, 373261, 267720, 233206, 43329, 352998, 462446, 66095, 236673, 562384, 278955, 265393, 502209, 468815, 412879, 354980, 326325, 562573, 499104, 588331, 211447, 498063, 89574, 201802, 207123, 211893, 373644, 220137, 455781, 228414, 325200, 188892, 504084, 156986, 136516, 434213, 120175, 434821, 424877, 563548, 663430, 13368, 288199, 346064, 417031, 245003, 202741, 635774, 613857, 34042, 232142, 428732, 187696, 122064, 420774, 556437, 259329, 340473, 165998, 274416, 404776]
14865D04776n4513j74741J62888o8833K96221o8886o4652J1219A36393M1005m184
14854A73214J21781J73561j99894J64059K50534K880C40462K54364k68891l9723
14844B86212A17166M69820j44125a6425B42007L15332k66842L45908B16296M51985
14834F68281q9210j73089q9838L12100p9980J49186p7530q0752L2484j54151m1973
14823C75528g7774B71542J21668A41134L45227K01846k77379j17004K84726j76110
14813D02440n9910L32511j30274J06158K1160A44854J43726J67842J04070k72154
14803B88338o9859K37943j53177K24438j10173K79610k67431J66833K6713M5181
14793F68416k23471J51648B95200K28767j41866J64024K5411M4371J69968j18963
$$ y = [404776, 350263, 175522, 338410, 269577, 565798, 496912, 432260, 443479, 136393, 177398, 173214, 294995, 468556, 268662, 432721, 683255, 686135, 340462, 594826, 325935, 286212, 117166, 586986, 442861, -16425, 242007, 557339, 290497, 636405, 216296, 668281, 579071, 405982, 316144, 628244, 548264, 697450, 619920, 539168, 571652, 417501, 375528, -77774, 271542, 393210, 141134, 486361, 688207, 410828, 293824, 578550, 402440, 342530, 675041, 544767, 650925, 672085, 144854, 288580, 456422, 560492, 288338, 218479, 456422, 303245, 527683, 417510, 697120, 429689, 596522, 623235, 668416, 444945, 596593, 295200, 523967, 382101, 546125, 571536, 615907, 785875, 666912]
14783F66912K30109B39081o3591N24847k33578j2200N08178m12090k3969j7530
14773E09148J64757L4847R0177l31250J16289J95879J80956k33256q1278R4328
14763G40597M92J9705A49752L60304J61815J8844q0311m36M8671K71943j02435
14752H28147P4752k45882j88557J64256N3910l30319J27394M06878l03439n4335
14742E32805p855P728K06780O0533C42725N24259J07796K6489N2784D75262L20599
14731G95861J48426j02872q6087QK02847l45401Q8436K9489j71016O4131J58259
14720G82081L23522j50003k61881k07353M38924l40903K28599O8941k23360J60342
14710H18909j87030K73051j16594J61445p3397L451J13602j0805J81773k61771
$$ y = [666912, 897021, 239081, 175490, 700337, 466759, 454559, 962737, 550647, 526678, 509148, 673905, 708752, 798929, 467679, 583968, 779847, 960803, 727547, 646269, 740597, 741089, 760794, 149752, 510056, 671871, 690715, 610404, 609968, 658639, 930582, 828147, 902899, 657017, 468460, 632716, 686626, 356307, 483701, 890579, 587140, 532805, 524950, 532678, 739458, 799991, 342725, 866984, 974780, 1001269, 1054053, 475262, 795861, 944287, 841415, 755328, 755336, 958183, 612782, 701218, 730707, 559691, 623822, 782081, 1105603, 955600, 693719, 486366, 925290, 584387, 812986, 881927, 658567, 818909, 631879, 904930, 788336, 949781, 876384, 879835, 993437, 982632, 1164405, 902634]
14700I02634k84473K22109K6212L56793m97131J28651J10993K40193k07568m15830
14690E82583L95247L3044L0459Q1501j55648m5672K64189n70703M1038M52736
14680A108774r6524l91899J70813L34911k3604l23015J04324J15348K1634L06161
14670A326923k63969Q2155j84152j27970K57687l26697L55486O2366n369J73498
14660A349958n68729J34884K46208K7111k3754o7212l91727K75399K13930m6037
14650A150031Q2623k91534K12732k49840M37417r2646r0144K01752m5552j528
14640A313311J40396l80364P5980J67473n0310J8875m22929O55006R5285l49043
14630A263680J62138m8473J50269k2341k04235n9107M3284j86109J33858J56967
$$ y = [902634, 618161, 840270, 866482, 1223275, 726144, 854795, 965788, 1205981, 998413, 582583, 977830, 1010874, 1041333, 1122834, 967186, 921514, 1185703, 615000, 656038, 1108774, 1012250, 620351, 791164, 1126075, 1102471, 779456, 883780, 999128, 1020762, 1326923, 1062954, 1145109, 960957, 832987, 1090674, 763977, 1119463, 1181829, 1176460, 1349958, 781229, 916113, 1162321, 1189432, 1165678, 1098466, 706739, 982138, 1196068, 1150031, 1232654, 941120, 1153852, 904012, 1341429, 1248783, 1158639, 1360391, 1314839, 1313311, 1453707, 1073343, 1149323, 1316796, 1266486, 1285361, 862432, 1517438, 1612723, 1263680, 1425818, 1377345, 1527614, 1505273, 1301038, 1241931, 1285215, 1099106, 1232964, 1389931]
14620A389931K90745j44742L7407L3572k47119K9713K36444k12488J83745Q5962
14610A683170J57205m44373Q0782j7177J80949R5088k58770L4475m4444J62764
14600A629669O3113k85218L4991J36459K07426j94100K9237J75040q8474p9507
14590A628636P3562K39970L4829l73732q1619M09224k227o8234M4275j3517j59256
14579A731911K75988O7463L0508j18421K93547k85427N143J14443Q1663j37603
14569B059215J55020o6588L58898j06646k7999q5225J46424j294K85961r4715
14559B623051k91085N56726j04842M27673n4821J68370M19517O99393M35706J221015
14549F100703J821757L855629R237516K0647957K847172B0294958I371564m428603
$$ y = [1389931, 1680676, 1535934, 1573341, 1606913, 1359794, 1389507, 1625951, 1413463, 1597208, 1683170, 1840375, 1396002, 1476784, 1459607, 1640556, 1735644, 1476874, 1511349, 1466905, 1629669, 1692782, 1407564, 1442555, 1579014, 1786440, 1592340, 1621577, 1796617, 1708143, 1628636, 1702198, 1942168, 1976997, 1603265, 1521646, 1930870, 1928643, 1860409, 1904684, 1891167, 1731911, 2007899, 2075362, 2105870, 1987449, 2280996, 1995569, 2000712, 2115155, 2196818, 2059215, 2214235, 2147647, 2506545, 2399899, 2371900, 2286675, 2433099, 2431805, 2717766, 2623051, 2331966, 2888692, 2783850, 3211523, 3156702, 3325072, 3744589, 4443982, 4879688, 6100703, 7922460, 11778089, 21015605, 41663562, 44510734, 20294958, 9371564, 4942961]
14541D942961j859460l67683n04919M37144m00254M922n9273K4589l33392M69129
14531B353764j9285j16609J60911m03301L63226k0949j11166j65392M58945l33253
14521B166891L70857l31562J32883J8391L25579j24341R0406k06469N32407k24297
14511B750745L85005n16308L74280j62481J11661j16639K50692m14992K76543
14502B938506J86343J44472k00175k39345N90594J47784k42823m6931j8021Q7531
14492C347935j48836K3052L63421j76011L08251L9971j06128L25447l97818P6900
14482C656184K51348j44707J82279J68695m32025K74562j57142J51315m0089L21718
14472D232138k89165J06480L40904M18O7806r0806Q6178j96537M06689k66255
$$ y = [4942961, 3083501, 2715818, 2210899, 2648043, 2247789, 2252711, 2193438, 2218027, 1884635, 2353764, 2334479, 2217870, 2378781, 1975480, 2338706, 2317757, 2206591, 2041199, 2500144, 2166891, 2537748, 2206186, 2339069, 2357460, 2683039, 2558698, 2649104, 2442635, 2975042, 2750745, 3135750, 2619442, 2993722, 2831241, 2942902, 2826263, 3076955, 2661963, 2938506, 3124849, 3269321, 3069146, 2829801, 3420395, 3568179, 3325356, 3278425, 3260404, 3347935, 3199099, 3222151, 3585572, 3409561, 3717812, 3757783, 3651655, 3977102, 3579284, 3656184, 3907532, 3762825, 3945104, 4113799, 3681774, 3956336, 3799194, 3950509, 3910420, 4232138, 3942973, 4049453, 4390357, 4390775, 4458581, 4367775, 4453953, 4257416, 4664105, 4397850]
14462D397850J83559Q8726M74016M4703l43006j47768L69119J5974O339J193J98629
14451E289334k0079K5490M24149j94121M32594j52533j98876K51892L69913j17808
14441F109955J95586J44128j13203N6045N4001q7207J48720J42046K44216J0100
14431F904387j36236j21981M01410K39036K22588K15991l78138J68721J23990
14422G639768O2731M8946J57602K22503K69789K99946k11206M6135K76624j08886
14412H703952o504K29733L34285k10248K76031K08604K47785M4893J73153K12352
14402A0214036N18196j13274k18967M02451J864K89824K56054j54022N22678L85484
14392A2104324l7756N850L11618L49387K68700n6479L96528N22607j71277L67681
$$ y = [4397850, 4581409, 4670135, 5144151, 5188854, 4845848, 4698080, 5067199, 5083173, 5089512, 5090705, 5289334, 5269255, 5294745, 5718894, 5524773, 5957367, 5804834, 5605958, 5857850, 6227763, 6109955, 6305541, 6449669, 6336466, 6392511, 6446512, 6359305, 6508025, 6650071, 6894287, 6904387, 6768151, 6646170, 7047580, 7286616, 7509204, 7725195, 7347057, 7515778, 7639768, 7702499, 7751445, 7909047, 8131550, 8401339, 8701285, 8490079, 8536214, 8812838, 8703952, 8697448, 8927181, 9261466, 9051218, 9327249, 9535853, 9783638, 9828531, 10001684, 10214036, 10732232, 10618958, 10399991, 10802442, 10804306, 11094130, 11350184, 11196162, 11718840, 12104324, 12066568, 12072418, 12384036, 12733423, 13002123, 12945644, 13342172, 13864779, 13693502, 14061183]
14382A4061183N33220j86795L15327K94990K98270J35514O37998K12958k5336
14373A6277329N28045M92823J77397K62145M49655M62736K76636N09760O18648
14364B0055174K64060O24367M0630M01031O45323M42934P47771J45532O56862
14355B4023684O54791L98943P08499N46158N97764P07271P91415J84803J303029
14346B9916357P37457O29984P47192P15210R59593N40351J369092J376291Q43511
14337C7835038Q36664J100286Q28330J061549J781561J457254P79903J676772
14329D7357357J256698J595391J789663J737507J375650K223954J995503J890487
14321F1222210K136467K677462J984902K067426K755639K866798K912782L248404
$$ y = [14061183, 14594403, 14407608, 14722935, 15017925, 15316195, 15451709, 16089707, 16302665, 16277329, 16805374, 17298197, 17475594, 17737739, 18187394, 18650130, 18926766, 19436526, 20055174, 20319234, 20943601, 20984231, 21385262, 22030585, 22473519, 23221290, 23366822, 24023684, 24678475, 25077418, 25785917, 26332075, 26929839, 27637110, 28428525, 28613328, 29916357, 30653814, 31283798, 32030990, 32746200, 33705793, 34246144, 35615236, 36991527, 37835038, 38671702, 39771988, 40600318, 41661867, 43443428, 44900682, 45680585, 47357357, 48614055, 50209446, 51999109, 53736616, 55112266, 57336220, 59331723, 61222210, 63358677, 66036139, 68021041, 70088467, 72844106, 75710904, 78623686, 81872090]
14313H1872090K793654L457382L330363L910799M066390L877477M594029M609771
14305A12511955M890746N020470N833277N884854O098347O604072O827246P503265
14297A61174232P450063Q326192Q846840R415548R642630J0335312J0948358J1120391
14289B37259566J2143460J2863036J2840548J3740478J3758937J4529355J4516683
14282C31652063J4708455J4594839J4618440J4115910J3478156J2900928J1555944
14275D27624735J0612205Q658123O099460L386886J332017J045555n55578k614422
14267D55588981l539189m179112p749185r785119j1917073j3445651j3993569
14260C90980083j5040603j5076913j5402327j5320305j5121805j4292106j3661334
$$ y = [81872090, 84665744, 88123126, 91453489, 95364288, 99430678, 103308155, 107902184, 112511955, 117402701, 122423171, 128256448, 134141302, 140239649, 146843721, 153670967, 161174232, 168624295, 176950487, 185797327, 195212875, 204855505, 215190817, 226139175, 237259566, 249403026, 262266062, 275106610, 288847088, 302606025, 317135380, 331652063, 346360518, 360955357, 375573797, 389689707, 403167863, 416068791, 427624735, 438236940, 446895063, 452994523, 456381409, 457713426, 458758981, 458203403, 455588981, 452049792, 447870680, 440121495, 430336376, 418419303, 404973652, 390980083, 375939480, 360862567, 345460240, 330139935, 315018130, 300726024, 287064690]
14253B87064690j3975937j3161327j2942857j1632772j1640360j1076693j0314377
14246B02320367r948197q988682q218823q478864q007437p346046o592876o643449
14238A38095993n714371n723689n874268n442304m544399m529374m356094l378911
14230I8532583m260749l816933l489212l235121l146587l120444k618784k897017
14222G1947736k470167k410086k173253k329159k123751k246045j442996j850302
14214E4901977j641232j078908k056932j554463j610079j491296j365331o87856
14206D3415880j006858j549838j049053j309697r47889q40646p92732q01760j096520
14197C4020887j280019o44014p89273l12877r33068j010740m39650q02589n00034
$$ y = [287064690, 273088753, 259927426, 246984569, 235351797, 223711437, 212634744, 202320367, 192372170, 183383488, 175164665, 166685801, 158678364, 151332318, 144739442, 138095993, 132381622, 126657933, 120783665, 115341361, 110796962, 106267588, 101911494, 98532583, 94271834, 90454901, 86965689, 83730568, 80583981, 77463537, 74844753, 71947736, 69477569, 67067483, 64894230, 62565071, 60441320, 58195275, 56752279, 54901977, 53260745, 52181837, 50124905, 48570442, 46960363, 45469067, 44103736, 43415880, 42409022, 40859184, 39810131, 38500434, 37552545, 36711899, 35919167, 35117407, 34020887, 32740868, 32096854, 31307581, 30994704, 30061636, 29050896, 28611246, 27808657, 27308623]
14188B7308623r00487q44039l81471j008550O9617q38938m21890m37536n45055
14179B2000274m69275m64396l04905o49693l58293l95157l98008k2472n69691
14170A8368384m74850j10667n09449m58347l47930l227m60692n16774N9604r8386
14160A5447666l13168m80790J23728n71765n0376l28702k20706n06433J17927
14151A3217381j83861l08900r824n93566L5130m57098j1554m20017K4269q6744
14141A1205216l42821L7631k54928j03110J25600n61532k04180k17035J75934
14132I860775j93217m95157J69793k87911p657k27803m1268l00054J04037k87528
14122H294010L36843o29831R4185J29034m87365J77310j51532l60825j53049L8070
$$ y = [27308623, 26408136, 25564097, 25182626, 24174076, 24243693, 23404755, 22982865, 22545329, 22000274, 21530999, 21066603, 20761698, 20112005, 19753712, 19358555, 18960547, 18938075, 18368384, 17893534, 17782867, 17273418, 16815071, 16467141, 16463914, 16003222, 15486448, 15546052, 15447666, 15134498, 14653708, 14777436, 14205671, 14155295, 13826593, 13605887, 13099454, 13217381, 13033520, 12724620, 12714796, 12121230, 12156360, 11699262, 11687708, 11267691, 11291960, 11205216, 10862395, 10900026, 10645098, 10541988, 10667588, 10106056, 9901876, 9684841, 9860775, 9667558, 9172401, 9342194, 9054283, 9046626, 8818823, 8777555, 8477501, 8581538, 8294010, 8630853, 8001022, 8095207, 8224241, 7736876, 7914186, 7762654, 7401829, 7248780, 7286850]
14112G286850k84328N85090o00784q4688j01729K65268k02543m08067K33873n0436
14102F638506j11875j79166K3250J29832k69523l42616J82385o37065N24944l17720
14092E640952L0178m5023m9531k01975M3856K37272l32256k0815j55812K57383
14082E404229m63226L23221j03837m5796k67113J52618l83721L43373r2316k79360
14072D588072j08517L33466n4983n23929L67115j53952J06294j87096l79193L54246
14062D341523J01777j02639P9193j38184J72388o848k79790j27151m8166j02879
14052C889224j17914J27798P0710l77631J46959N1050k4889j79742K76565o3687
14042C798443k68008j43334k24289K29604J09590L9980j77452P2057k4624k15742
$$ y = [7286850, 7002522, 7587612, 6986828, 6902140, 6800411, 7065679, 6863136, 6455069, 6688942, 6638506, 6526631, 6347465, 6370715, 6500547, 6231024, 5888408, 6070793, 5433728, 5958672, 5640952, 5671130, 5626107, 5576576, 5374601, 5418457, 5655729, 5323473, 5302658, 5146846, 5404229, 4941003, 5264224, 5160387, 5114591, 4847478, 5000096, 4616375, 4959748, 4867432, 4588072, 4479555, 4813021, 4758038, 4234109, 4601224, 4447272, 4553566, 4366470, 3987277, 4341523, 4443300, 4340661, 4419854, 4281670, 4454058, 4447210, 4167420, 4040269, 3992103, 3889224, 3771310, 3899108, 3969818, 3592187, 3739146, 3790196, 3765307, 3585565, 3862130, 3798443, 3530435, 3387101, 3162812, 3392416, 3502006, 3541986, 3364534, 3436591, 3411967, 3196225]
14032C196225k33134O9009K69778k62802O7587q8798p4799j76467m1172j57528
14022B567899L26444k30103M52044o61922j28806L69165J73420l52302k75795
14013B240044J69448p3663L11677K19472p39707J68897J95467J43894j4791k33648
14003B387090P8200k06989O0449J96347l21224l41411J89328L06441M0982m75302
13993A913911M56899J86751J31544M48227R13178K818373P427391K0143533J2601462
13984D7041269k2407971j1384308n046778k257207j034229r38233Q3897j014747
13976C041693J75660k51374m52606N55150l60859k64430K33458j21078k01323
13967B354291n7180N2356K2019O3983j64190L58796l87459m453j81765J82259
$$ y = [3196225, 2963091, 3032100, 3301878, 3039076, 3106663, 3017865, 2943066, 2766599, 2725427, 2567899, 2894343, 2664240, 3116284, 2454362, 2325556, 2694721, 2868141, 2515839, 2240044, 2409492, 2335829, 2647506, 2866978, 2127271, 2296168, 2491635, 2635529, 2620738, 2387090, 2465290, 2258301, 2318750, 2515097, 2193873, 1852462, 2041790, 2348231, 2389213, 1913911, 2370810, 2557561, 2689105, 3137332, 4050510, 6868883, 14296274, 34439807, 47041269, 24633298, 13248990, 8202212, 5945005, 4910776, 3972543, 4056440, 3041693, 3217353, 2965979, 2513373, 3068523, 2707664, 2443234, 2676692, 2555614, 2354291, 2297111, 2349467, 2371486, 2435469, 2271279, 2630075, 2242616, 2238163, 2056398, 2238657]
13957B238657k05117P3249J39275m51037K91517o2137j23422l81547L69904j22275
13947A767067L20739j54097K61197l03174J74489l78419L6320O3538J01802j52948
13937A736514R620J56921n5751P4493j50070j76391J06677K02316k96270j25540
13927A482519L14618L58151l30309k85278L09734k35813P8152j08532n5370J54956
13917A682828k35723J94786o5412l74671M82347l11976J82039J87379m903N0087
13907A786781l59473l088k47131J79640J21978k55094L21958J18215l08905J38365
13897A493246r6963K8603l0772l33381L99653q2155k0137M94533q53932M56924
13887A455619M38915l33273n73019L48087J74190r3442k80486M03082j34730K64047
$$ y = [2238657, 2033540, 2106789, 2246064, 1795027, 2086544, 2024407, 1900985, 1519438, 1889342, 1767067, 2087806, 1933709, 2194906, 1891732, 2066221, 1687802, 1724122, 1787660, 1889462, 1736514, 1746134, 1903055, 1847304, 1921797, 1771727, 1595336, 1702013, 1904329, 1608059, 1482519, 1797137, 2155288, 1824979, 1539701, 1849435, 1613622, 1691774, 1583242, 1527872, 1682828, 1447105, 1641891, 1576479, 1201808, 1684155, 1372179, 1554218, 1741597, 1736694, 1786781, 1427308, 1424220, 1177089, 1356729, 1478707, 1223613, 1545571, 1663786, 1354881, 1493246, 1396283, 1424886, 1394114, 1060733, 1460386, 1378231, 1358094, 1852627, 998695, 1455619, 1894534, 1561261, 988242, 1336329, 1510519, 1417077, 1136591, 1539673, 1404943, 1668990]
13877A668990n42342j37097L84349j16433J26521j62856p6132K43703l47103Q3545
13867A125145J47027m0618m6049J04960k21379R1723j05243N03662n64416L22050
13857A316862m31270M83369k90625N24795n20883J88374l71939K40364p4433j90449
13847H74165J24183l11084N70411m09313K53025J48452k03753j9426M929L32287
13837A363876m28401N2816K5951o3964r1624j3396J46820o2667k27980J64137
13827H65568j29014M27453k41805J68194k49026r3026L1866N53031j72593k59002
13817I01646j50472K07864k28685J29522j39884O8057j11036N2638K04006q0620
13807H53036k71295K62475C53227Q37330m71170o8362k849J84191J50955k15765
$$ y = [1668990, 1126648, 989551, 1373900, 1257467, 1383988, 1221132, 1145000, 1388703, 1041600, 1125145, 1272172, 1231554, 1185505, 1290465, 1069086, 1160809, 1055566, 1559228, 994812, 1316862, 885592, 1368961, 1078336, 1603131, 1082248, 1270622, 898683, 1139047, 1064614, 874165, 998348, 687264, 1257675, 848362, 1101387, 1249839, 1046086, 1026660, 1031589, 1363876, 935475, 988291, 1014242, 950278, 858654, 845258, 992078, 929411, 701431, 865568, 736554, 1164007, 922202, 1090396, 841370, 748344, 780210, 1333241, 1160648, 901646, 751174, 959038, 730353, 859875, 719991, 788048, 677012, 729650, 933656, 853036, 581741, 844216, 353227, 1190557, 719387, 651025, 648176, 832367, 983322, 767557]
13797G67557K32012j25788P9038q8615n6730C86548M59650J57373l26344K28206
13787I05433m5763J63230j25454j7945O4940p7727j00578j31912J8472J90797
13777H43493n9501J226C59535L57296P3152N4410J14755m63858O2758q8484L51875
13766H21439J40743l12790J5769r1044K85371k88719J51360j35310k28437M2139
13756D00521L20371n5636l09824M53878q6282L2348j45643R3295Q9816l72496
13746D20348J05515m6132j66448K20977n8502Q4843r4323Q6400P9580N423J00246
13735G37927j87181j40462J73193K36323k62635o2165J86516k35801J37897L17228
13725I00840m9327J79787k97135j10297J24222j41803l1885m814L24489m39521
$$ y = [767557, 999569, 873781, 952819, 864204, 807474, 386548, 846198, 1003571, 677227, 905433, 859670, 1022900, 897446, 879501, 944441, 866714, 766136, 634224, 652696, 843493, 783992, 785218, 359535, 716831, 789983, 844393, 959148, 495290, 558048, 469564, 821439, 962182, 649392, 665161, 574117, 859488, 570769, 722129, 586819, 358382, 400521, 720892, 665256, 355432, 809310, 723028, 755376, 609733, 703028, 792844, 420348, 525863, 479731, 313283, 534260, 475758, 560601, 466278, 552678, 632258, 637681, 737927, 550746, 410284, 583477, 819800, 557165, 495000, 681516, 445715, 583612, 900840, 851513, 1031300, 734165, 623868, 748090, 606287, 574402, 569588, 894077, 454556]
13715D54556j5026L83740p3807k28789K12808J03669C56729J41827J54240k53842
13705C98954L9524K6917L07890j82198j65763K69110r5494n9844R9488k07426
13695D31158j12893L66861j56574L8638r2518Q440K5425k0648o7422J59279k24861
13684C54885J01179K72019K30292m34153P6800j02175k0907M4987j82825K75155
13674F15257j49944L44620C05337J61375K11495l20677J41634L79477l69416j73779
13664C35446L00978n0187K3619k01245L42573B70711J38796K44093B99623K85789
13654E85412K8254l05805M62432g2762E83770p449j45815k4353K31664k07925
13644D29892l56J4760J23576n888k20287N32792m11330j52910J91962p516o4272
$$ y = [454556, 439530, 823270, 749463, 520674, 733482, 837151, 356729, 498556, 652796, 398954, 438478, 465395, 773285, 591087, 425324, 694434, 598940, 539096, 638584, 431158, 318265, 685126, 528552, 567190, 474672, 483112, 508537, 487889, 420467, 579746, 354885, 456064, 728083, 958375, 524222, 601022, 498847, 477940, 522927, 340102, 615257, 465313, 809933, 305337, 466712, 678207, 357530, 499164, 878641, 509225, 335446, 636424, 586237, 609856, 408611, 751184, 270711, 409507, 653600, 299623, 585412, 613666, 307861, 770293, -72762, 583770, 576321, 430506, 406153, 637817, 429892, 429536, 444296, 567872, 561984, 341697, 874489, 463159, 310249, 502211, 494695, 430423]
13633D30423j53062L92079k36495j29183l1735J87536j43827J57688J42094A04964
13622E46263L20385A54437J93902R3642F2063K72070p8989r27K97413j03655J18791
13611E66766A56085L11097A87347n1414O3780J80248J32208L707k21933J5215
13601C09158Q3582j03973n0560R9631A02619M68095A46791M0304J63604J64434
13591E15133A36054M61545k32866J12680j61801i95D14567K64217k62406j36923
13581B79455J975o7492J2190k8444J90575j02899J39305p667j95013M83919B70355
13569C16635P1908r9789o9686J17933I4966O5896N8938A06459L19595A49980K74823
13558D24803r4140r6678I9910M22382O6460B18173p9770K62246j27116N116J03915
$$ y = [430423, 277361, 669440, 432945, 303762, 272027, 459563, 315736, 473424, 615518, 104964, 546263, 866648, 154437, 348339, 441981, 62063, 334133, 255144, 254217, 551630, 447975, 566766, 156085, 467182, 187347, 135933, 199713, 379961, 512169, 515876, 293943, 309158, 392740, 288767, 238207, 337838, 102619, 570714, 146791, 187095, 350699, 515133, 136054, 597599, 364733, 477413, 315612, -995, 414567, 678784, 416378, 279455, 281430, 213938, 226128, 197684, 388259, 285360, 424665, 416998, 221985, 705904, 270355, 316635, 388543, 288754, 219068, 337001, 94966, 160862, 219800, 106459, 426054, 149980, 424803, 330663, 233985, 99910, 522292, 588752, 218173, 138403, 400649, 273533, 278649, 382564]
13547C82564J31257I8325L05862j5455j6909A35382J07803J41991k4550J3469
13537C74095j17510K07406B21066L7504L98436k09036i9838A35365c2500B95140
13526C99667A25521L15020F5332K82543j8646A28257L02644J38106p1809A12257
13515A78401K31092r0099a0628C7076K15029K77713r5709j4796a53066B84571
13504D38808A31273E6041K69729n1777R4886o3894I5511a57143B92569P295l3500
13493B66364N3828A24556M37548k52716n4774d7603B52039M23047j3020a0713
13482A90148B7312Q1785K54998o278A21309i1564D02333E8513L0294O2122N01618
13471F52547B0313K17819A1903L15564q7967O205h1729B60115O9883I8234L08186
$$ y = [382564, 513821, 98325, 404187, 388732, 371823, 135382, 243185, 385176, 360626, 374095, 256585, 463991, 221066, 258570, 657006, 447970, -99838, 135365, -32500, 295140, 399667, 125521, 440541, 65332, 347875, 329229, 128257, 430901, 569007, 497198, 112257, 178401, 409493, 319394, -10628, 37076, 252105, 529818, 434109, 419313, -153066, 284571, 438808, 131273, 56041, 325770, 273993, 368879, 304985, 95511, -157143, 292569, 299864, 266364, 320192, 124556, 562104, 309388, 254614, -47603, 252039, 675086, 662066, -10713, 190148, 27312, 109097, 364095, 357817, 121309, -91564, 402333, 58513, 88807, 150929, 652547, 20313, 238132, 11903, 327467, 239500, 245705, -81729, 260115, 329998, 98234, 406420]
13460D06420j67251q8615J81895r0530J10391j70725P3915a1582A84482o0666
13450A23816B6003J83735r611J27929J31376q0071Q1786A99173I3161J21354o9211
13439A45304K23233A59173J19217J27193p0736j12529E0374J66020i4101C25975
13428D42208H6423J25755K07783q9174k0507c1116A1912J75079J02176A44058
13417C86466r7647A38257g6377C48872I6441J47729n5149J90113j09031A10450
13406D01078A04651A2996M26545j1543k00441M7862j16708a05808O373D38896
13395B28030A10809j6946h1267a1783C07998A3657K12423c3162A14442K38594
13385C53036A00408m9754a41866F6680J20570l0406l6213h9337F01892k99561
$$ y = [406420, 239169, 150554, 332449, 241919, 352310, 181585, 255500, -11582, 184482, 123816, 26003, 209738, 200127, 328056, 459432, 379361, 461147, 199173, 93161, 214515, 145304, 368537, 159173, 278390, 405583, 334847, 222318, 50374, 216394, -94101, 325975, 442208, 86423, 212178, 419961, 330787, 310280, -31116, 11912, 186991, 289167, 144058, 386466, 288819, 138257, -76377, 348872, 96441, 244170, 189021, 379134, 270103, 110450, 401078, 104651, 12996, 439541, 427998, 227557, 275419, 158711, -105808, -99435, 438896, 228030, 110809, 93863, -81267, -11783, 307998, 13657, 226080, -33162, 114442, 353036, 100408, 50654, -141866, 66680, 187250, 156844, 120631, -89337, 601892, 302331]
13375C02331G2201L64156A82571J7929o9938R2128j7163K6196p2770E1883J55178
13364B07061h4605D46892B1690b05877C2159a5571D66587j59801j251A20459B473
13352E45568I5220j6789K61570j33773R5248J15452j91425N6996C8302L13386
13342C51688K56944A94078J89966J25037k10354K50619B33071C5861J87728j08997
13332A14592m5082J64541a6217m5884A31491b7607A90194K05738p0643n4210J69871
13321D40950n8060o9766L24664j35006j57910j71052q2384g802B76481J8038J48745
13310D43264j71403p1030K82391N0649B53221L5031o1137b20989A30513e6909
13299A55993J23597j27083D2634N862J31352J26227F2684b7036C78094B0794J73530
$$ y = [302331, 72201, 436357, 182571, 200500, 130562, 222690, 205527, 231723, 158953, 51883, 207061, -84605, 446892, 21690, -205877, 32159, -15571, 466587, 306786, 305535, 120459, 2473, 545568, 95220, 78431, 340001, 206228, 301476, 416928, 225503, 282499, 38302, 351688, 608632, 194078, 384044, 509081, 298727, 549346, 233071, 35861, 223589, 114592, 69510, 234051, -16217, -62101, 131491, -27607, 190194, 395932, 325289, 271079, 440950, 382890, 313124, 637788, 502782, 344872, 173820, 91436, -7802, 276481, 294519, 443264, 271861, 200831, 483222, 533871, 253221, 288252, 227115, -220989, 130513, -56909, 155993, 279590, 152507, 42634, 48496, 179848, 306075, 62684, -27036, 378094, 20794, 194324]
13288A94324J56704A66084O1568o6667F3113J39787b15809A39989j2982j6990
13278A10017L39908E3436B871d853A26977O5027J5568C4619a64339B85107m0109
13267B44998f1405b5640F8025J61182I5017L94598j46055e6937A17532K86394
13257D03926A57518a40708B71287l168b533B39704l465l8883k8239a17600A38977
13245A36277b87295F6182Q7016O188J50408A24899m7525L3412J71429j0889A8763
13233E0194K28398h3439c7474Q926N700B08773a10322B89129e3858F5978h6824
13221C95707b5494A68541r630m1191d9399B90897a58732B56667o0945E1744b641
13209b1562B23677E1404J74433q7072o8569a4673E77883A71924Q1979M3562G1719
$$ y = [194324, 351028, 166084, 227652, 160985, 63113, 202900, -215809, 139989, 127007, 110017, 449925, 53436, 2871, -4853, 126977, 192004, 207572, 34619, -164339, 285107, 244998, -61405, -25640, 68025, 229207, 95017, 489615, 343560, -56937, 117532, 403926, 157518, -140708, 271287, 268119, -2533, 239704, 236239, 197356, 169117, -117600, 138977, 136277, -287295, 66182, 153198, 159386, 309794, 124899, 77374, 110786, 282215, 271326, 18763, 50194, 278592, -83439, -37474, -28548, -22848, 208773, -110322, 289129, -53858, 65978, -86824, 395707, -25494, 168541, 158911, 117720, -49399, 290897, -158732, 256667, 195722, 51744, -2641, -21562, 223677, 51404, 225837, 138765, 70196, -14673, 577883, 171924, 253903, 297465, 71719]
13197B04113A971K54685I2327i3955B08287m5447J45467E7344a50738D45370A24327
13185a00202I6811N4367c2246j27238A18195e8135C17358E9352K15468A24423
13174A92848q8298J1020Q7667D6757k719K34486g6162C81975A79062i3423a2644
13162a34488A52365J08647I4367K24400G1957A5157a31148c8084k18005A13603
13151A71809K02586D8736c8449E11787B1882J60890e1109i71B15415j00128O3471
13140A78758D3237A0962K69972H1066K09453d3715J4156B30679m7321N6159r7561
13129A41956K8479F5228M1345a62548C03143A12342q231i0572A16776a216j4334
13118a5550H5836J09703o3241l0877R6725b21806B32014b37986A72719q5174c624
$$ y = [204113, 1971, 256656, 92327, -93955, 208287, 162840, 308307, 57344, -150738, 445370, 124327, -100202, 96811, 151178, -32246, -159484, 118195, -58135, 317358, 59352, 274820, 124423, 192848, 104550, 115570, 203237, 46757, 44038, 278524, -76162, 381975, 179062, -93423, -12644, -134488, 152365, 261012, 94367, 318767, 71957, 15157, -131148, -38084, -256089, 113603, 171809, 374395, 48736, -38449, 511787, 21882, 182772, -51109, -971, 215415, 115287, 178758, 43237, 10962, 280934, 81066, 290519, -43715, -29559, 230679, 183358, 239517, 141956, 170435, 65228, 106573, -162548, 303143, 112342, 104111, -90572, 116776, -1216, -15550, 85836, 195539, 132298, 101421, 198146, -221806, 232014, -237986, 172719, 87545, -3624]
13106a86988I7626E066J12795L195C6808F50K43547F2663a06995B53774a21699
13094a4885j30893A49104d36556A67781d6238j0335a746G9266a28680i55B03294
13082A52318b28016h6118A98568K14978E1800j2332c633A91335N5932G6223M4854
13071A21077P6208f5717j31093B9533L20768L818b629p236B68936A10627a15788
13059A54536D1703P0360a44140p2283B73437a4792B22720K9244G8105J04434b7053
13047A24350a49152C29212g4062a5470H0556c9468A17462R8040A03757O6045J36470
13036C06272p2446M7201F2314J4295K00084G7720L00317C4494M51504h3146D55519
13024C56353k7897I7572L56931A01653b16732E8918K8437K4073H471J6772J49362
$$ y = [-186988, 97626, 5066, 117861, 121056, 36808, 650, 244197, 62663, -106995, 253774, -121699, -14885, -145778, 149104, -436556, 167781, -46238, -56573, -1746, 79266, -128680, -955, 203294, 152318, -228016, -86118, 198568, 413546, 51800, 39468, -3633, 191335, 247267, 76223, 121077, 197285, -65717, -196810, 29533, 350301, 354119, -2629, -9865, 268936, 110627, -115788, 154536, 41703, 112063, -144140, -216423, 273437, -14792, 222720, 251964, 78105, 182539, -27053, 124350, -149152, 329212, -74062, -15470, 80556, -39468, 117462, 215502, 103757, 169802, 306272, 233826, 281027, 62314, 76609, 276693, 77720, 378037, 34494, 485998, -83146, 455519, 356353, 328456, 97572, 454503, 101653, -216732, 58918, 87355, 111428, 8471, 25243, 174605]
13013A74605K8568J50059A00476K03976h7385B29032a62978A17072J27327a80661
13002f8119b9119j18739D21347I9591J21956G2761J98854H5969m0741c3692E7950
12990a155l1987B27663l4935F3820A8849N9010J2569a40628G671J15889m8566
12979G4994c04030a18903l187C11830N9006e0766B91136a46700j69736a05155
12968f4874A02201l935k1242d8874A15371a01890B23529A8306h1480I133a29061
12956A2057J03254D0789P8428a71118C1913J29294a87115c3735D4492J19563J19670
12945B83725G1702N6033J19196J52189A86200c8105I1206J76624G5685a29917
12934B72466A1235a48413C78153A74650a49472D036L38856g355B50463q3909J03679
$$ y = [174605, 203173, 353232, 100476, 304452, -87385, 229032, -162978, 117072, 244399, -180661, -68119, -29119, -147858, 421347, 99591, 221547, 72761, 271615, 85969, 45228, -33692, 57950, -1155, -33142, 227663, 192728, 63820, 18849, 77859, 90428, -140628, 7671, 123560, 74994, -304030, -118903, -122090, 311830, 370836, -50766, 291136, -146700, -316436, -105155, -64874, 102201, 98266, 77024, -48874, 115371, -101890, 223529, 18306, -81480, 9133, -129061, 12057, 115311, 40789, 119217, -171118, 31913, 161207, -187115, -33735, 44492, 164055, 283725, 71702, 127735, 246931, 399120, 186200, -38105, 91206, 267830, 75685, -129917, 272466, 11235, -148413, 378153, 174650, -149472, 4036, 342892, -7355, 250463, 166554, 270233]
12923B70233E2078a21639A41463b5566o9182B8424K1649K11497c6246A84220l8224
12912A45996A5297b69490A49503F1098C808J39771a04621L7667m2234A48010E7701
12900b50380a8739j03205e3298G4111a9610j63774A8437K9737f7996G3455K2124
12889I5579b03338A44656K06283j51242C2843a03173B38144q8016a46206g582
12878a4754k07816G7853L9488a83026A53128f1151B57274F5293J29927b27042
12867B0261J63121J02406a10196A6306d4168B8932K30115O40b62342L6234m1365
12856b67473B49601h5102n4736H9776K78495A4267g1034J5362a1452j03976B42336
12844A07262Q5294e3538I4640N397m8995J22230H5495c34532C67399A66413E6483
$$ y = [270233, 52078, -121639, 141463, -25566, -94748, 28424, 50073, 261570, -36246, 184220, 145996, 15297, -269490, 149503, 61098, 3808, 143579, -104621, -66954, -109188, 148010, 57701, -250380, -18739, -121944, -53298, 74111, -19610, -183384, 18437, 48174, -67996, 73455, 95579, -203338, 144656, 350939, 199697, 32843, -103173, 238144, 150128, -146206, -7582, -14754, -222570, 77853, 117341, -183026, 153128, -61151, 257274, 65293, 195220, -227042, 20261, 183382, 285788, -110196, 16306, -44168, 28932, 259047, 259687, -262342, -226108, -267473, 249601, -85102, -139838, 89776, 368271, 14267, -71034, -55672, -11452, -115428, 242336, 107262, 192556, -53538, 94640, 100037, 51042, 173272, 85495, -334532, 367399, 166413, 56483]
12832B11770D3534J76262k9621e0462j2289j15153j41225A46719J67002A56063
12821A74479h93q8505A09422b50623C52959A49171G0903J91897D7465H935e9211
12809g4193q495b6354o0016I8945b0719D3765J76047f8294a8114k9937I7787a2402
12796C24812a60480c7824n9665F3557O7749e7113A68546a25246I4342a01433A25356
12784b08118k5160K7047A79364b2063A16722b5430r2005B36882J08585E0613a43265
12772A3294a28487E3771b34874A02596b3273j03934G3715c4939C8711a38263K0199
12761a18064e3109A87091p8480A3533d1158J5505k41181I2197P773N8332a59596
12749C5281J72819E0530F749f5963q2361F5108e9944J922k41014A06876j0335
$$ y = [211770, 43534, 219796, 190175, -50462, -62751, -177904, -319129, 146719, 313721, 156063, 174479, -893, -89398, 109422, -250623, 352959, 149171, 70903, 262800, 47465, 8935, -59211, -74193, -82688, -26354, -86370, 98945, -20719, 43765, 219812, -68294, -18114, -48051, 97787, -12402, 324812, -160480, -37824, -97489, 63557, 131306, -57113, 168546, -125246, 94342, -101433, 125356, -208118, -233278, -206231, 179364, -22063, 116722, -25430, -117435, 236882, 345467, 50613, -143265, 13294, -128487, 53771, -234874, 102596, -23273, -127207, 73715, -34939, 38711, -138263, -118064, -53109, 187091, 108611, 13533, -41158, -25653, -266834, 92197, 99970, 158302, -159596, 35281, 208100, 50530, 6749, -65963, -148324, 65108, -59944, -58022, -299036, 106876, 96541]
12738I6541d1539A78088M4621E9991J21666b66956A95330n578K4736A6426K8914
12727D5340a32295D4393J71009m4918J72160n0344q3569a0766E2067K08539o8518
12716A92088F3789O2029a40296A05604a4885A30624J36701H1262P0612Q0891I8299
12704B18426J31367j22088j9762J43873K237B2423J55837J60821a35239D42861
12693C44910I2634g9021C7470b71470j29746C25452D9288b3943C42599k7097q5155
12682B30347c27290A54285J87010A35991A4611L90012E7163P2121a39026A65364
12671A35466d317B2595d68339a81853I4204h9121n4505d4460B0851L17259e4323
12659A27243J3396E0933A5998L27614F1722R7874a723A36268Q5297H5237L65410
$$ y = [96541, -41539, 178088, 222709, 59991, 181657, -266956, 195330, 189752, 214488, 16426, 45340, -132295, 44393, 215402, 170484, 342644, 292300, 208731, -10766, 52067, 260606, 192088, 63789, 125818, -140296, 105604, -14885, 130624, 267325, 81262, 151874, 232765, 98299, 218426, 349793, 227705, 207943, 351816, 354053, 22423, 178260, 339081, -135239, 442861, 344910, 92634, -79021, 37470, -271470, -401216, 325452, 49288, -23943, 342599, 315502, 230347, -327290, 154285, 341295, 135991, 14611, 404623, 57163, 129284, -139026, 165364, 135466, -4317, 22595, -468339, -181853, 94204, -89121, -143626, -44460, 20851, 338110, -54323, 127243, 140639, 50933, 15998, 343612, 61722, 159596, -1723, 136268, 221565, 85237, 450647]
12648D50647A32361k6449L7022b92513A46747b99833A88468j8225F2116d3072
12637B95383F8072J92598f5900j34857A31784J11654l6428J14428J0655J63496
12627D95589k04378r5933p3920L43533e1666J3283C12370k8714D3458P2746L0547
12616A46751a7224A2034J94542a04546b2215m465k75780J36079O9266A76507J29292
12605C05799o9053m8291G6527M7774g926A86529Q848a39427A71346b48887A18999
12593a62115O2642l998B3842q633a63658M4183j51963A27812K35163c4277q2624
12582a16901A77591c5795r1303C99467g231j83788A60235N9161C8073f5598j4582
12571h0180k1576K6967r9180f8129m7771A23681B6233L10241O6498j89156p1084
$$ y = [450647, 132361, 105912, 142934, -292513, 146747, -299833, 188468, 170243, 62116, -43072, 295383, 68072, 260670, -65900, -200757, 131784, 243438, 207010, 321438, 332093, 495589, 291211, 195278, 121358, 464891, -51666, -38383, 312370, 283656, 43458, 116204, 146751, -17224, 12034, 206576, -104546, -22215, -26680, -302460, -166381, -97115, 176507, 305799, 236746, 188455, 76527, 124301, -7926, 186529, 195377, -139427, 171346, -248887, 118999, -162115, -99473, -103471, 23842, 15209, -163658, -119475, -271438, 127812, 362975, -34277, -116901, 177591, -35795, -127098, 399467, -7231, -191019, 160235, 219396, 38073, -65598, -80180, -101756, -74789, -173969, -68129, -115900, 123681, 26233, 336474, 402972, 213816, 142732]
12560A42732l8159Q3677p6688l4055A4518I83P0195g3746A61872b50819F512b0271
12547h5865C18158c34410J34115D5583J81576o5624d73524b1153B31647k4139
12537B07508a89190D0784c2443G2173d9912j57422i8935F7590N2536J77414C3061
12525c57068E873J05506E425a03163a0913I6488L12D3362b21964C7207A8366c43011
12512a56336F997L24200A38197D3500f3796A62168k871a40374j37714h8626l46384
12501d35010A48787L0284e0948G3548f0345J1721J0501C04575A5906J64099h5286
12489f7348j63367A77436R168Q261f7030m1859D8285c26550B48594a83996J4149
12478a69847d1922A21293c23454A30887a4748k73723I8582J7115a3002L225l22375
$$ y = [142732, 104573, 188250, 111562, 77507, 14518, 983, 71178, -73746, 161872, -250819, 6512, -20271, -85865, 318158, -334410, -200295, 45583, 227159, 161535, -473524, -21153, 231647, 207508, -189190, 40784, -32443, 72173, -49912, -207334, -98935, 67590, 120126, 297540, 33061, -357068, 5873, 111379, 5425, -103163, -10913, 96488, 96800, 43362, -221964, 37207, 18366, -343011, -156336, 6997, 331197, 138197, 43500, -63796, 162168, 159297, -140374, -278088, -88626, -435010, 148787, 179071, -50948, 73548, -60345, -48624, -38123, 304575, 15906, 180005, -85286, -67348, -230715, 177436, 186604, 194865, -67030, -108889, 48285, -326550, 248594, -183996, -169847, -41922, 121293, -323454, 130887, -14748, -288471, 98582, 115697, -13002, -9777, -332152]
12467c32152B78091r2535j9100j5404F3294K55095i2378h990F7237b14504A32761
12455A57154A4414c5996R007A08235a78846f9847o5206H6531N8709o1672J41510
12444B25078g9265c5994B2418n448f5242j92397k9069a14816b8372A60944a8553
12432a55691f0188q8648H0808J02753d7738B67625e4r8392j98106A7399j004Q1091
12420I7486F260P2513M5950c9150C3606a80654A0812K94819D1428r617a42748
12408C58760a94594n5668B34534A9456J30035l8492P7756A6686b62253C5894g7750
12396A23663c3728A21636J00224g0771k71525A58572R0123j0412A2908M4470a31210
12384A20757D247J19635P3220a46529H8062a05563F083b3819B69089c72820J03061
$$ y = [-332152, 278091, 185556, 166456, 151052, 63294, 318389, -92378, -8990, 67237, -214504, 132761, 157154, 14414, -35996, -26989, 108235, -178846, -69847, -135053, 86531, 145240, 83568, 225078, -79265, -35994, 22418, 16970, -65242, -257639, -286708, -114816, -28372, 160944, -18553, -155691, -60188, -148836, 80808, 183561, -47738, 267625, -54, -98446, -296552, 17399, 16395, 97486, 6260, 78773, 124723, -39150, 33606, -180654, 10812, 305631, 41428, 31811, -142748, 358760, -194594, -250262, 234534, 19456, 149491, 110999, 188755, 16686, -262253, 35894, -77750, 123663, -33728, 121636, 221860, -70771, -342296, 158572, 248695, 238283, 12908, 57378, -131210, 120757, 4247, 123882, 197102, -146529, 88062, -105563, 6083, -23819, 269089, -372820, -269759]
12373b69759f7496F5578a84472P1983q605a7557A12349a19289A59563b15505I2129
12361A16416R2024a41192A73732B3328P144C675L9702Q9112m4528c17243D79622
12349I6872P9847a12112J5327d6575m8631B62255n6613c41195C20971K4889j41244
12338B04616C4853b7156L905A00369a76288a5038E521J03285N6655Q389R3913
12327B67763D0702L8702a88105d8908D7567a84853P7750A8290J15273c26163a50700
12315A10817a82804B9048L11250a02127j92661N9881P6514b5982A39893b4316
12304A92850p9690a63240A89341g6159J8351A85050a50348j21617c6252k09795
12294b46047A09606J83971P4985j36971a22779H2050j0083a1948I8246E069d6487
$$ y = [-269759, -67496, 65578, -184472, -112489, -121094, -17557, 112349, -119289, 159563, -215505, 92129, 116416, 208440, -141192, 173732, 23328, 30472, 3675, 43377, 132489, 87961, -317243, 479622, 96872, 176719, -112112, -96785, -46575, -95206, 262255, 205642, -341195, 320971, 345860, 204616, 34853, -27156, -23251, 100369, -176288, -15038, 5521, 108806, 165461, 173850, 267763, 40702, 79404, -188105, -48908, 47567, -184853, -107103, 18290, 133563, -326163, -150700, 110817, -182804, 29048, 340298, -102127, -294788, -234907, -158393, -25982, 139893, -24316, 192850, 113160, -163240, 189341, -76159, -57808, 185050, -150348, -271965, -36252, -246047, 109606, 293577, 368562, 231591, -122779, 82050, 71967, -11948, 98246, 5069, -46487]
12282B52387h2043L0425A29861B8401K97098l1864H1389e8111A40827f1727C52156
12270A78010A5813K09260b97495A44885c1339C1263J25893K572F8751M4004L4080
12259A46835a676F2943d7858I2848L46266A24581b9108B40141I247N0516J86163
12248B45926m462G4545N2460m379l5032J21605q4650P4878M7060f887A07950K0054
12236A28004F3766K38794a11792C33564J04291B9120J34156K35668j66575L28362
12226E60731j65682R6691k0739A89851L13257A53985J98344j46618k8411C549
12215B07089D4411J23203L6849m6210G4048K44773c7129D79989D994K9879b09540
12203A81708A1982h3764b8169B16820k863N5112J80552C1130L08813h615C26566
$$ y = [252387, -82043, -51618, 129861, 28401, 325499, 293635, 81389, -58111, 140827, -61727, 352156, 178010, 15813, 225073, -297495, 144885, -31339, 31263, 157156, 159728, 68751, 112755, 146835, -1676, 62943, -47858, 92848, 439114, 124581, -29108, 240141, 9247, 59763, 245926, 241464, 74545, 127005, 122626, 87594, 209199, 124549, 199427, 246487, -6887, 107950, 128004, 63766, 302560, -111792, 333564, 437855, 29120, 163276, 398944, 232369, 560731, 395049, 491740, 471001, 189851, 503108, 153985, 352329, 205711, 177300, 3549, 207089, 44411, 167614, 204463, 158253, 74048, 318821, -37129, 479989, 4994, 34873, -209540, 181708, 11982, -83764, -28169, 216820, 213957, 269069, 449621, 31130, 339943, -8615, 326566]
12191A68812n242K40375A40930K21982n6123A09973P1605c20365F0563J30062
12181A90625M1510K3060A8405h2927A52740a08820A75909C2720J16349n49J73953
12170C22473a84528A73208l0582G422K8609a65799O7036b7175B87124I5689P3533
12159A69222b87833a20930k46206B12308h3633B62110K4356q7335a64285D75521
12148D67075A37260a43762E4635b27628A87752C9894d2704j5249j80741A84704
12137a10750a8893r1379B47547A14687d7295A51176K16711A52411b0686m4326
12127f5012j84073m3153r6028E0849a85154l4528B2771J84103F0481K32021r2676
12116A99826b00810B20693F3834A0224O5471K291L38093k3828P7239B23486F5264
$$ y = [168812, 163570, 403945, 140930, 362912, 306789, 109973, 181578, -320365, 60563, 190625, 232135, 255195, 18405, -82927, 152740, -108820, 175909, 32720, 149069, 148520, 322473, -184528, 173208, 142626, 7422, 36031, -165799, -98763, -27175, 287124, 95689, 169222, -287833, -120930, -367136, 212308, -83633, 262110, 286466, 199131, -164285, 475521, 467075, 137260, -143762, 54635, -227628, 187752, 39894, -42704, -57953, -238694, 184704, -110750, -18893, -110272, 247547, 114687, -47295, 151176, 367887, 152411, -20686, -65012, -249085, -292238, -388266, 50849, -185154, -219682, 22771, 206874, 60481, 292502, 199826, -200810, 220693, 63834, 10224, 75695, 77986, 416079, 392251, 469490, 223486, 65264]
12104d4837B94067a14478B46531p6538D2103b75409B6270J31156E9456R5468c43718
12092A04227m1716c16095E6725J26636f8005j15342B0660K6964b18875a5181C88018
12080f0091A29605a97058A42075l9623N116J66144K00050J420214n66902A13252
12069D17927B6298b00806B43017H9176J19480p2183L6944b8467n475j16412B897
12057A00700c5027D11872a22405a3319I0934b3348j74885B93000q6294o7453C437
12045A85998K8266a88079B80356f1105B57028H1727b02327B47592g6872j60267
12035b37139f3106c03o6249A57096b10649A24582J79376A0653e0177J4986B64456
12023e4299o8747A46020a20492B66308i773C03057E8213J09173c12508h9445H1814
$$ y = [-44837, 294067, -114478, 246531, 169993, 42103, -275409, 26270, 157426, 59456, 154924, -343718, 104227, 62511, -316095, 56725, 183361, -68005, -183347, 20660, 47624, -218875, -15181, 388018, -60091, 129605, -197058, 142075, 102452, 107568, 273712, 473762, 1893976, 1327074, 113252, 417927, 26298, -200806, 243017, 89176, 208656, 136473, 173417, -28467, -33942, -150354, 2897, 100700, -35027, 411872, -122405, -13319, 90934, -23348, -198233, 293000, 206706, 139253, 3437, 185998, 214264, -188079, 280356, -61105, 257028, 81727, -202327, 247592, -76872, -237139, -63106, -303, -66552, 157096, -210649, 124582, 303958, 10653, -50177, -35191, 264456, -54299, -123046, 146020, -120492, 266308, -9773, 303057, 58213, 167386, -312508, -89445, 81814]
12011a4093B11146c3984m9379l108A18094b32616M7201P3958C76264H4404q844
12000G5560c03985a46021G7899a89837N1104C952J12568B9541a42654A30231a6447
11988D0657J97682q6652b271p9896C00135b57485P7538c8917o4499A5652M56546
11977D72198j87749a06404m0404C52409d59669h6692D3829b3125j40093j74518
11967c37736a7782l03560H3917K2683K9128e3165j07415m4486B58113G1280j607
11956F9673e4336j3109A31415E7099R2723K0930a99922b6302A0602L23187a62237
11944E7155J19953l0686e7939J5794E41699H7491P9689A995O8185a31374D6062
11932B32229a54681A71981N4631d085E0355f3396B9012g499q8430I8468b2942
$$ y = [-14093, 211146, -33984, -83363, -86471, 118094, -232616, -185415, -111457, 376264, 84404, 75560, -303985, -146021, 77899, -189837, -138733, 3952, 116520, 29541, -142654, 130231, -16447, 40657, 238339, 151687, -2271, -82167, 300135, -257485, -179947, -38917, -103416, 15652, 472198, 284449, -106404, -146808, 352409, -459669, -86692, 43829, -23125, -163218, -337736, -17782, -321342, 83917, 106600, 135728, -53165, -160580, -205066, 258113, 71280, 69673, -54336, -67445, 131415, 57099, 149822, 170752, -199922, -26302, 10602, 333789, -162237, 57155, 177108, 146422, -57939, -42145, 541699, 87491, 167180, 1995, 70180, -131374, 46062, 232229, -154681, 171981, 226612, -4085, 50355, -63396, 29012, -7499, -95929, 98468, -22942]
11920a3938l0417B26938b28030E2368K8347J12211G8221M950J58139b52283D084
11908I343c37930J63096M3897j4548j73731A64580b55289G3813J49808a1884q7257
11897i9141l1169E9265J74514D597a32478f0202F24295b81761B16154d06202d4543
11885c1978l01476I0357Q8259a78762a5943l79594B9215c10184B24883a72158
11874c9916m87245a0095l06776i4096j30382B1122i2370A22941H391a0478j97149
11863b07627c5917C38045a34038e6208B6001K15899d0883A53744E2700Q9105a02933
11851a45407D6417g1161A86175e3317A14480d4843k12730c5493j55916g7919A09281
11839H5195A8410L18692e6615A67631O6850b34062A61048h0774A17782D5818J60716
$$ y = [-13938, -44355, 226938, -228030, 52368, 80715, 192926, 78221, 83171, 241310, -252283, 4084, 9343, -337930, -174834, -130937, -145485, -319216, 164580, -255289, 73813, 223621, -11884, -99141, -130310, 59265, 233779, 4597, -132478, -60202, 624295, -281761, 216154, -406202, -44543, -31978, -333454, 90357, 178616, -178762, -15943, -395537, 29215, -310184, 224883, -172158, -39916, -527161, -10095, -316871, -94096, -224478, 21122, -92370, 122941, 8391, -10478, -207627, -35917, 338045, -134038, -56208, 26001, 241900, -40883, 153744, 52700, 141805, -102933, -145407, 46417, -71161, 186175, -53317, 114480, -44843, -257573, -35493, -191409, -77919, 109281, 85195, 18410, 337102, -56615, 167631, 234481, -234062, 161048, -80774, 117782, 45818, 206534]
11828B06534c21399H353b8963D6304e6850j05120C5004J62375f1755j52772C863
11816c5754r453j27068A80270h4559a4282l79086b0963F2646J04246Q3477A5609
11804A49307B513J3024a61102P614L9772B34812i4882L4487I9551a12188K7815
11793h4373G9110a10231c6790C2305b38559A53533a46262b3369A53039C6878b11043
11781a22350G1852b07955n1698I5452e5785k16618a19516k7754A96449H5758b5304
11769A98663d9459I7916N2667N5804b8479r5112I6182K22207a10477j42164e488
11757a37763A99710a81450C69632A17564a33959c0500j99879Q3126E8476a51538
11746B28680h5111r0280j26074I7334O4715b97727I691g7584l49730J46092J17404
$$ y = [206534, -321399, 8353, -28963, 46304, -56850, -161970, 35004, 197379, -61755, -214527, 3863, -35754, -45207, -172275, 180270, -84559, -14282, -393368, -20963, 62646, 166892, 250369, 15609, 149307, 2513, 15537, -161102, -153488, -113716, 234812, -94882, -60395, 99551, -112188, -84373, 79110, -110231, -36790, 32305, -238559, 153533, -146262, -23369, 153039, 36878, -211043, -122350, 71852, -207955, -259653, 95452, -55785, -272403, -119516, -147270, 196449, 85758, -25304, 198663, -49459, 97916, 150583, 206387, -28479, -123591, 96182, 318389, -110477, -252641, -5488, -137763, 199710, -181450, 369632, 117564, -133959, -30500, -230379, -147253, 58476, -151538, 228680, -85111, -175391, -301465, 97334, 162049, -297727, 9691, -77584, -427314, -281222, -163818]
11735a63818A04477M0799N0518m3858a42997C2204L74313I0269b11869c2740l9450
11724g2190B8769b83121A28643a91468C8596d2509D82051i0260j42409A62531
11713g0637b0818A88699F5772B7236K27446a01880j23256M0159A25477j9067C4340
11701a08058I8089L439K3293C2275K5223d90748a52890D86427D4362d5216D7642
11689I2922k0842J39775n4702K80991B13682K4109J5724M59f2530J7163D5862
11677b3252j81422C38659D0838P610c81573B68019C4917b00716g7033I3928i5321
11665C5127c52551B89464F7809K864J86252D2469b24578B51526a36539A42385
11654g3291I9860a98414A9587g291D6111A1516a98329R8911K2556j25743A36179
$$ y = [-163818, 104477, 145276, 195794, 151936, -142997, 32204, 406517, 90269, -211869, -32740, -72190, 28769, -283121, 128643, -191468, 38596, -42509, 482051, -90260, -232669, 162531, -70637, -20818, 188699, 65772, 27236, 254682, -101880, -225136, -184977, 125477, 106410, 34340, -108058, 98089, 101528, 124821, 32275, 57498, -490748, -152890, 486427, 44362, -45216, 47642, 92922, 72080, 211855, 157153, 438144, 213682, 237791, 253515, 253974, -62530, -45367, 45862, -23252, -204674, 338659, 40838, 48448, -381573, 268019, 34917, -200716, -77033, 93928, -95321, 35127, -352551, 289464, 67809, 70673, 256925, 42469, -224578, 251526, -136539, 142385, -73291, 99860, -198414, 19587, -7291, 46111, 11516, -198329, -99418, -76862, -202605, 136179]
11642i693A2769J9418e4296l114k9199j96390R8668A03580a79615D9088a9532
11630a09909B39212B3334K3656l998O5887h8223F7008g5375I8798e0879b3177
11618i1836a5930B04730C6922q246L32952I7022P5284K93350a09985j4449k76770
11607d01204C40732b3715l5034G2176a57465A6245b05860L7365C31344I8972O093
11596A05065c29911F6733K21147j30064Q9787a57244D08493o5005b7992A93681
11585B70497j33205a26804l4086f3529C15843I1853J16586d1402A75621h8666
11574b50279e6261p5581I1109C7184a899D7304A7513R8567K0703a86167b8243
11562A37100k3044J40508q0864A1756J31376a43324I4921H036P8371a41614O5069
$$ y = [-9693, 12769, 32187, -54296, -57410, -86609, -282999, -184331, 103580, -179615, 49088, -19532, -109909, 239212, 23334, 46990, 42992, 108879, -88223, 67008, -75375, 98798, -50879, -23177, -91836, -15930, 204730, 36922, 28676, 361628, 97022, 172306, 465656, -109985, -124434, -401204, 340732, -23715, -58749, 72176, -157465, 16245, -205860, -168495, 331344, 98972, 105065, -329911, 66733, 287880, 157816, 247603, -157244, 408493, 343488, -27992, 193681, 270497, 137292, -126804, -160890, -63529, 315843, 91853, 208439, -41402, 175621, -88666, -250279, -56261, -131842, 91109, 37184, -1899, 47304, 17513, 116080, 136783, -186167, -28243, 137100, 114056, 254564, 173700, 11756, 143132, -143324, 94921, 8036, 86407, -141614, -76545]
11551g6545C5303c76870G8611c33394C03182A09181B0301K39373F2483O3043J80589
11540C06115a53589B79442b6586H4482K66340j23323K87339e2678C21178A48458
11529A75795E2014J11882B8174P0258a6511j59945A52266N5378J5258h8900A19168
11517F0158A9279L1143B4326c30395F5870j6805a16116d9640B67485F3073K27831
11506B90904b7454A0074i2267B69115j23419D140M2187h2782C06353b79925A17378
11494B03876G4928J29151a35268C40351p127H0181N06277A79749R4034J20234
11484C94017j07218p1279d6097B84386C7212J71922J05960N1512A1431L26714
11474C38145b1780j35661F8784C4386J76378H0579c22274B39978J45102j41765
$$ y = [-76545, 35303, -376870, 78611, -333394, 303182, 109181, 20301, 259674, 62483, 125526, 306115, -153589, 279442, -26586, 84482, 350822, 227499, 514838, -52678, 321178, 148458, 175795, 52014, 163896, 28174, 98432, -16511, -176456, 152266, 207644, 222902, -88900, 119168, 60158, 19279, 50422, 24326, -330395, 65870, 49065, -116116, -49640, 267485, 63073, 290904, -27454, 10074, -92267, 269115, 145696, 4140, 46327, -82782, 306353, -279925, 117378, 203876, 74928, 204079, -135268, 340351, 333224, 80181, 586458, 179749, 273783, 394017, 286799, 215520, -46097, 284386, 37212, 209134, 315094, 366606, 11431, 338145, -21780, -157441, 68784, 34386, 210764, 80579, -322274, 239978, 385080, 243315]
11464B43315M2725r6647f3010C6382j318J16288P2445H6219J62958I8227b29352
11452B35988a89381A94526C5160L5789K3330K108d4705A70016j0874C5437K82316
11441C17753i9649K8497A82502D9815K7304a18308M5824A65866l2464K19577a08802
11429D6253L37389A54540I834J75902a56616j5336N9363K0265F7466a84836M5672
11418a39164N2085K8416A85771a24206A48312a47700I0203d6753m2791C11525
11407C04845e6863b0750B45645b81372A4004h621D54564a534k21905a01353A42420
11395A69049b10472F9182K94256j48235b25752C97144a71500j2886Q8049r3700
11385a90037b4347q3470J9528L9212k0163j1529A45621a76717i621G3030J34425
$$ y = [243315, 286040, 189393, -63010, 36382, 35064, 151352, 223797, 86219, 249177, 98227, -229352, 235988, -189381, 194526, 35160, 70949, 94279, 96387, -44705, 170016, 159142, 35437, 317753, -99649, -71152, 182502, 49815, 77119, -118308, -72484, 165866, 133402, 352979, -108802, 46253, 383642, 154540, 9834, 185736, -156616, -171952, -112589, -92324, 67466, -184836, -139164, -87079, -58663, 185771, -124206, 148312, -147700, 90203, -46753, -89544, 311525, 304845, -56863, -20750, 245645, -281372, 14004, -8621, 454564, -1534, -223439, -101353, 142420, 169049, -210472, 69182, 363438, 215203, -225752, 397144, -171500, -184386, -96337, -190037, -24347, -107817, -88289, -49077, -69240, -80769, 145621, -176717, -9621, 73030, 207455]
11374B07455a6620j23784L3025B07754R6883b11152M6050E8819a92260c1950j1383
11363d3333r2129D043R6664c76629d8374j2129k47012g3648B16239C8264a12752
11351A88477C6554O1273C4161b04429A89926L5524a28732g564k78133A25739a82540
11339B72054b3757j69518q444P9651M654r1256i9211A69813B2106a57973G004
11327b51760a06880m879j0197c4701A27670E5885a78412M5319D9896Q3709B9287
11315b18159M8613J9437j83272A43298i2890B1431H176e4432K0452D06346q6865
11304C19481a38406d6031k44625j0796c1376A17314L0974b86580A03603j4548
11294H9055a36624D6062b06040k62598a14127p6232B1655a61356P1662A25819
$$ y = [207455, -16620, -140404, -107379, 207754, 304637, -211152, -165102, 58819, -192260, -31950, -43333, -135462, 4043, 100707, -376629, -48374, -60503, -307515, -73648, 216239, 38264, -112752, 188477, 36554, 97827, 34161, -204429, 189926, 225450, -128732, -7564, -285697, 125739, -182540, 272054, -23757, -193275, -201719, -122068, -117414, -208670, -99211, 169813, 22106, -157973, 7004, -251760, -106880, -111759, -121956, -34701, 127670, 55885, -178412, -133093, 49896, 133605, 29287, -218159, -169546, -150109, -333381, 143298, -92890, 21431, 8176, -54432, -33980, 406346, 319481, -138406, -46031, -290656, -301452, -31376, 117314, 148288, -286580, 103603, 89055, -136624, 46062, -206040, -468638, -114127, -190359, 21655, -161356, -89694, 125819]
11283A87830a17516A56767E824c767j37442E4164b47589c0801G803i9755d2640
11271b29568B37862k6306i5252A13057a5511j63866E4144b55440c820A06056a37547
11259c30915A29543f4857j38717A79487F5642c10795e6869B25302F070g4600r644
11248h4244j70571c4183A49593A5846K6816M2113P0277A9592J23803J12904C944
11236c02516a6230A103b34051i7378P127o6680I7902O2657J92269B2713a18471
11224b04918k3270f956D5180O3064b85898a32647f1148B97998E8712d0004q2439
11213a22443j08360j9713d1797j20368A404A29a63457C22739i2802r1317A87615
11201a71059J0868B56015h2060j43894c3814A01734k2759a38356A24749B8984
$$ y = [187830, -117516, 156767, 5824, -3767, -141209, 54164, -247589, -30801, 7803, -99755, -42640, -229568, 237862, 211556, -95252, 113057, -15511, -179377, 54144, -255440, -3820, 106056, -137547, -330915, 129543, -64857, -203574, 179487, 65642, -310795, -56869, 225302, 6070, -74600, -84244, -254815, -34183, 149593, 15846, 42662, 84775, 155052, 19592, 143395, 256299, 3944, -302516, -16230, 1103, -234051, -97378, -90251, -156931, 97902, 160559, 352828, 22713, -118471, -204918, -228188, -6956, 45180, 108244, -285898, -132647, -61148, 297998, 58712, -40004, -122443, -230803, -250516, -41797, -162165, 1404, 129, -163457, 322739, -92802, -184119, 187615, -171059, -160191, 256015, -82060, -225954, -33814, 101734, 78975, -138356, 124749, 28984]
11190g352A49151k038e1461A12499a79524f6776p1536j06467k59344D6935a84469
11178A03911a95998k169A8035M8262c5274o859n2838B013i0799k49111d1485k4345
11166f5830j16012j60607J10342a0875B8464L8541k1052J51283a31471A97743
11155C41453A7104J55835H1629J69223a75320G0197N1939b4402A0433J67584F4710
11143C2181J88148B0122K75409a49779B15010D4340d00402f9015l5139d5194E7668
11131h3739c0090m7252B69168j19994a67253I0893K27776A4108a0699A21530j6127
11120A05403a16410D1471J97293m1309b20133D5362b37549A52570J94233A37513
11109g2797C13252q0729a07536J2397c2723B08575j8088J6081J63804A36266i7684
$$ y = [-7352, 149151, 147113, -51461, 112499, -179524, -66776, -138312, -244779, -504123, 46935, -184469, 103911, -195998, -198167, 18035, 66297, -35274, -42133, -94971, 2013, -90799, -339910, -41485, -65830, -181842, -342449, -232107, -10875, 28464, 67005, 45953, 197236, -131471, 197743, 341453, 17104, 172939, 81629, 250852, -175320, 70197, 122136, -24402, 10433, 178017, 64710, 32181, 220329, 20122, 295531, -149779, 215010, 44340, -400402, -69015, -104154, -45194, 57668, -83739, -30090, -77342, 269168, 149174, -167253, 90893, 318669, 14108, -10699, 121530, 105403, -116410, 41471, 238764, 197455, -220133, 45362, -237549, 152570, 346803, 137513, -72797, 313252, 232523, -107536, -95139, -32723, 208575, 190487, 206568, 370372, 136266, -97684]
11097B34039b8479B1631L44447p2318j27845p2120K19519a18474A18577J97494
11087C16071J16414j70101d04044E45690I0245K20238K5883G7012M3449m4736
11077G5725l882L14742A41211K08775o89j58118J25101K1639J66046j64571A63729
11065D07114L8685A31039L19752o4592K09115j19615P6369j05623M07946j20484
11055G33907J14279l64750L49945j64596k32729K96453l29680j6994M80675p8160
11045G88350J77010m54025M45486k16209j5301J66661k5710k56203J01501j8029
11035F93531k6680N0053R7879J51012l65811J7273J26484B86654M04784K92001
11025I83439l01516K53920J6009l59777q260j5525J59895k39872K27075p039L0064
$$ y = [234039, -28479, 21631, 366078, 293760, 165915, 93795, 313314, -118474, 118577, 316071, 432485, 262384, -404044, 545690, 90245, 310483, 336366, 77012, 120461, 75725, 71843, 386585, 141211, 349986, 349297, 191179, 316280, 337919, 503965, 339394, 163729, 407114, 445799, 131039, 450791, 386199, 595314, 475699, 552068, 446445, 854391, 733907, 848186, 483436, 833381, 668785, 436056, 732509, 402829, 385835, 866510, 788350, 965360, 511335, 956821, 740612, 725311, 891972, 866262, 610059, 711560, 693531, 666851, 716904, 814783, 965795, 599984, 617257, 743741, 286654, 691438, 983439, 681923, 935843, 951852, 592075, 583815, 568290, 728185, 488313, 715388, 708349, 738413]
11014G38413n8257o3738P6673j6648p8950A89688M14640k68609K73113B61828
11003E75094K62439j87929k47171L8652J39220m5954Q8427k47884K07053L62112
10993I44059m54043L84295J9761j41712K86057m646k67566K09903j88524q6440
10983G01144L56470o5196M43677j55277O4926L17476m6888N54966k8522L37518
10973B480294M47223k22332J99960M3646j08459k24400m31723j03988j27066l05016
10963A648139q4294K32798Q7390l64267J14604J71186j71187K11522j27542o00866
10953A117483K52358m41653J04313L6257l96049j16089k40539L27306B54823n1059
10943B03764O7549m0283L2756A12650a51575K932F3703a85996B55810f014m7484
$$ y = [738413, 680156, 616418, 693091, 676443, 597493, 189688, 604328, 335719, 608832, 261828, 575094, 837533, 649604, 402433, 441085, 580305, 534351, 622778, 374894, 581947, 944059, 490016, 874311, 894072, 752360, 1038417, 1033771, 766205, 976108, 787584, 701144, 1057614, 992418, 1436095, 1280818, 1345744, 1663220, 1616332, 2171298, 2142776, 2480294, 2927517, 2705185, 2905145, 2948791, 2840332, 2615932, 2184209, 2080221, 1953155, 1648139, 1563845, 1796643, 1884033, 1519766, 1634370, 1805556, 1634369, 1845891, 1718349, 1117483, 1369841, 928188, 1032501, 1068758, 672709, 556620, 316081, 643387, 254823, 203764, 271313, 231030, 263786, 112650, -151575, -148643, 63703, -185996, 255810, -6014, -53498]
10932e3498C28766A28346J03254l1525H3631J9763c0225A01998d5413A35090a76992
10920E0067a4865C00652E7476c16167D36106B9724j3854a74028j06679A68315
10909A27659a20010B02538b96476b992o0811I7465a66219A38022m8209P9036a96369
10897A49081n263k8671a48480O6907A03421J74728D3240d4183G0509j2270d46439
10885a68931k8083j6618A17537i4868B4454d8289I3612C9033K7590f1110A45189
10873a21611K9926F5474Q6812a4057A94011c5762C1377L19570A48308j1393J61547
10862B98462f8930H5046c4800l5486J7414D2894a49851e2866m7206A01918A8815
10850G1411K06458b2519n1830j08142I8098J53311I5158B4248a67198A14134a80100
$$ y = [-53498, 328766, 128346, 231600, 200075, 83631, 103394, -30225, 101998, -45413, 135090, -176992, 50067, -14865, 300652, 57476, -316167, 436106, 29724, 15870, -174028, -280707, 168315, 127659, -120010, 202538, -296476, -2992, -63803, 97465, -166219, 138022, 89813, 168849, -196369, 149081, 143818, 115147, -148480, -81573, 103421, 278149, 43240, -44183, 70509, 58239, -446439, -168931, -197014, -213632, 117537, -94868, 24454, -48289, 93612, 39033, 66623, -61110, 145189, -121611, -91685, 65474, 152286, -14057, 194011, -35762, 31377, 350947, 148308, 136915, 298462, -68930, 85046, -34800, -70286, -52872, 42894, -149851, -52866, -100072, 101918, 18815, 71411, 277869, -22519, -74349, -182491, 98098, 251409, 95158, 24248, -167198, 114134, -180100]
10838a56451j48645A10604k5065b49202D2881J63749a558A24790a10863C1774
10827D0852K32280b3412A07220B957b17120m7193a05q6000j7541k45941d587j0740
10815a5327A11521E520h3744d1755B59477h7836E7371p187c4193j48137n8532
10804b40862R9844A6674J09907a08530d5485n924j35635l2383E9454k9157a62832
10792G9999b37126a13443A11853d9634G1643L8242L4084b6153R165r7716A40796
10780B7609M592N0571l1063K29216f9287B86564a40758G3972a33023A25108K6280
10769A51388j043M2062a8678G7612c44733h1464B3436J34354a03156L942J660
10758i7554a2492m65210a78913d4604j48752A20891a25645d1028l14080A71574
$$ y = [-156451, -305096, 110604, 85539, -249202, 42881, 206630, -1558, 124790, -110863, 31774, 40852, 273132, -23412, 107220, 2957, -217120, -264313, -105, -86105, -103646, -349587, -4587, -15327, 111521, 5520, -83744, -41755, 259477, -87836, 57371, 50184, -34193, -182330, -240862, -141018, 16674, 126581, -108530, -45485, -51409, -187044, -219427, 59454, 30297, -162832, 79999, -237126, -113443, 111853, -49634, 71643, 109885, 143969, -26153, -16988, -114704, 140796, 27609, 32201, 82772, 51709, 280925, -69287, 286564, -140758, 73972, -133023, 125108, 151388, 150345, 192407, -18678, 77612, -344733, -81464, 23436, 157790, -103156, -99214, -97554, -12492, -477702, -178913, -44604, -193356, 120891, -125645, -41028, -355108, 171574]
10747e1495A13594C1838o062Q9833m1683i2745L9444E4444J52565A2749a1137
10735A6788L7783a10230M8845J7076m4801j28898E1239L0582d2709A79013k8138
10724A50875a2459j51736C9061J32680a14769c2762A5363a30044A23651a16607
10713A21574a97884C26824A05479l1096b568q7252j61926q5857a07208k99441
10703d06649f8784A34464b65340H7707j5465h4123j32471l71048D5577J93554
10693B39131K41978D867a29230j29955A25551d6328J8496o9896j17244A0256P2666
10682H2922d646A77738B7756d28970i2344C9419a13804k9094C3955b90035j3326
10671c03361c7959q3725B89425i4596d4424l3312A51961E6350d40291d7893j4604
$$ y = [-51495, 113594, 31838, 25776, 115609, 73926, -92745, -53301, 54444, 207009, 12749, -11137, 16788, 54571, -110230, -61385, -44309, -89110, -218008, 51239, 81821, -42709, 179013, 150875, -12459, -164195, 39061, 171741, -114769, -32762, 15363, -130044, 123651, -116607, 121574, -197884, 326824, 105479, 74383, -2568, -89820, -251746, -337603, -107208, -406649, -68784, 134464, -265340, 87707, 72242, -84123, -216594, -587642, 45577, 239131, 481109, 4867, -129230, -259185, 125551, -46328, -27832, -97728, -214972, 10256, 82922, -4646, 177738, 27756, -428970, -92344, 39419, -113804, -142898, 33955, -290035, -303361, -37959, -121684, 289425, -94596, -44424, -77736, 151961, 56350, -440291, -47893, -62497]
10660f2497B04300Q0426a42863j16055F3454C648R0095e9821B6841a86124m8095
10649b34219a02671E7508D620Q3723l3291b90526J11180O7349E8146a09276p4676
10638a83952q0975O2358f0777b8080j89838d636E0701c9016C18656b55274M9317
10627b05957M6883n4098n5593K4422B43860a64517C567P317b06716A63130a80720
10615g2436j5890q0984C9277D345J24555f0368A5151K00422f5272l14580d9433
10603E8337a67129D85084b36923Q2828l74749e6671C1093k840a73415l6843j81544
10592c91802a53992j9586g840k39052I0377L1748R9848f2829E8769a36191D19473
10580A3577L4993j6380P6615m3937e3383k66769B03952a31922e2334j7914l2433
$$ y = [-62497, 204300, 284726, -142863, -258918, 63454, 3648, 93743, -59821, 26841, -186124, -234219, -102671, 57508, 4620, 88343, 55052, -290526, -179346, -111997, 58146, -109276, -183952, -264927, -202569, -60777, -28080, -217918, -4636, 50701, -39016, 318656, -255274, -205957, -159074, -213172, -268765, -244343, 243860, -164517, 3567, 10884, -206716, 163130, -180720, -72436, -88326, -169310, 39277, 4345, 128900, -60368, 15151, 215573, -65272, -379852, -49433, 58337, -167129, 485084, -236923, -154095, -528844, -56671, 31093, 28253, -173415, -210258, -391802, -153992, -173578, -7840, -246892, 90377, 122125, 221973, -62829, 58769, -136191, 419473, 13577, 48570, 32190, 108805, 64868, -53383, -320152, 203952, -131922, -52334, -70248, -102681]
10569a02681o0915K7747A6151a90212r6084a10884B89820c7748n0370n851A00124
10557a76666b6054j26832E2901d30993d2089m890A29448i103r0240K4918n4074
10546a28499A16969a04706c8679j62809B8015b53714C4975J62275b90427j11974
10536d02401B09839B4659J88250F3603b44059A30801a42044A69448a27087G7880
10525i5597m3613j54348J0607F8053e4252D7377g1725k07120A79777c34287B31000
10513a73648p4395B65335a63997R70j9241A22620a23686k24053a37006A93666
10502d2341k861A5347L55962e9164D8173a82605B54696f947p9077n5312d6862
10490c38680A06696G518d95224A70600B5905R734b15328c3627D21121j02663j06722
$$ y = [-102681, -163596, -135849, 16151, -190212, -286296, -110884, 289820, -37748, -88118, -93969, 100124, -176666, -26054, -152886, 52901, -430993, -42089, -46979, 129448, -9103, -99343, -74425, -128499, 116969, -104706, -38679, -201488, 28015, -253714, 34975, 197250, -290427, -402401, 209839, 24659, 212909, 63603, -244059, 130801, -142044, 169448, -127087, 77880, -95597, -139210, -293558, -282951, 68053, -54252, 47377, -71725, -278845, 179777, -334287, 231000, -173648, -248043, 265335, -163997, -163027, -182268, 122620, -123686, -347739, -137006, 193666, -42341, -45202, 15347, 371309, -59164, 48173, -182605, 254696, -6947, -86024, -141336, -46862, -338680, 106696, 7518, -495224, 170600, 25905, 35639, -215328, -33627, 421121, 318458, 211736]
10479B11736J72877B1199M22562A95500Q3872p4080p0458g1215B09908A5963b0973
10467B699b12197A06443m5248a63766A06686a58184O9669E656e9447k2233o9728
10456a51408D4028h5429I3786b8548j1251M455n5092A10396J8858b52998C9489
10444b85938B6538K72706g90o4740A32276a59041A44399c89644b0956j69202A32730
10432B48206h8816A54254A3363L8498f1530J689A33167e8217k00002g772j56606
10421a64378G0034c4548B22843B7562a16745E9720a7379m5679C02812j16086e59198
10409g23A1185a78367A27896J43174c1563C07965C0081a81359Q6258c4864B27220
10397C85635b86887A51113i2060m3102n4250H9637L6103f0071j2274D24018C712
$$ y = [211736, 384613, 21199, 443761, 195500, 279372, 205292, 134834, -71215, 209908, 15963, -20973, 2699, -212197, 106443, 61195, -163766, 106686, -158184, -88515, 5656, -59447, -81680, -151408, 44028, -85429, 93786, -28548, -39799, -35344, -90436, 110396, 129254, -252998, 39489, -285938, 26538, 299244, -790, -65530, 132276, -159041, 144399, -389644, -20956, -190158, 132730, 248206, -88816, 154254, 13363, 51861, -61530, -59841, 133167, -58217, -258219, -7772, -164378, 70034, -34548, 222843, 27562, -116745, 59720, -17379, -63058, 302812, 186726, -559198, -723, 11185, -178367, 127896, 271070, -31563, 307965, 30081, -181359, -95101, -34864, 227220, 385635, -286887, 151113, -92060, -135162, -189412, 89637, 125740, -60071, -72345, 424018, 3712]
10385g4401k23384C46147i1221L5476C08772D8346a31919b1963l7855C29041J27870
10374D56911B28349L4680D5223K44194K03911B31182N7517J45338Q1031l0448
10364D84620k17784K67408m132a23249G02686A19145J28147F3538L17237q9066
10354B91709l223a32400B68098J27405K01311l1857B51199l5833L6389H7146L51168
10343D38314B9205K9906J41829R4801k4919j05016a45886D27453F1353R3458N6724
10332B11535C9489M4273J04098a58698B40223a67975c1161I9200Q3584K97010
10322D79794j36602r1744F9038K77929j13790k4524c8643o9080C15865A41851
10311I0346B1790b47868a17727j64622a04055L8367m1434q448C33588a19431B02449
$$ y = [-74401, -297785, 346147, -91221, -55745, 308772, 48346, -131919, -21963, -59818, 329041, 456911, 228349, 263029, 45223, 289417, 493328, 231182, 288699, 434037, 515068, 484620, 266836, 534244, 530112, -123249, 702686, 119145, 247292, 63538, 380775, 291709, 288486, -132400, 268098, 395503, 596814, 564957, 251199, 215366, 251755, 87146, 438314, 29205, 59111, 200940, 295741, 270822, 165806, -145886, 427453, 61353, 154811, 211535, 39489, 83762, 187860, -158698, 240223, -167975, -31161, 99200, 182784, 479794, 343192, 251448, 69038, 346967, 233177, 208653, -38643, -107723, 315865, 141851, 90346, 21790, -247868, -117727, -282349, -104055, -65688, -107122, -115570, 333588, -119431, 202449]
10299a96435f5256A08435f9360k0187A4038o71J90553g0809o9593r2678B28209
10287A73380a56296L1072c408k64583m6967A8362a99248j19453d4464q7959B59479
10275A30095b86105g0665k0404A57278K687a39091n60110a39533A57938N1475
10265B09413a17804E5801J5055L18078R4848n7672j69853L625K07834j43228k7628
10254B96860j06814o9816a63808L9686J0043D6595R5486K0514p3878b0788j14809
10243a35597F5277B9929J14503a4789k02490F1942a0331A00186a27751N711A75675
10231F8451J62790a12971a3570r966l7668p6609m8838l60347B03528Q9073b18485
10219b54253C17317j56306D6168Q7185a45766B38157g3548j41865c2716B4441
$$ y = [-196435, -65256, 108435, -69360, -89547, 14038, 13367, 203920, -70809, -140402, -233080, 228209, 173380, -156296, -125224, -3408, -267991, -314958, 18362, -199248, -318701, -44464, -132423, 259479, 130095, -286105, -70665, -91069, 157278, 159965, -139091, -699201, -139533, 157938, 209413, -117804, 55801, 70856, 388934, 483782, 426110, 256257, 259882, 467716, 324488, 296860, 190046, 120230, -163808, -124122, -114079, 46595, 142081, 162595, 88717, -20788, -135597, 65277, 29929, 144432, -14789, -217279, 61942, -10331, 100186, -127751, -122040, 175675, 68451, 231241, -112971, -13570, -23536, -61204, -137813, -186651, -546998, 203528, 292601, -218485, -254253, 317317, 161011, 46168, 133353, -145766, 238157, -73548, -215413, -32716, 24441]
10208A5766K36014b58511A04153a3069k16495b9355B63390c29863A86091i6874
10197a43042q538j65893M7997B18541i8787j07246M4964j35586q0608g370o9768
10186g7138E9380a73561K3057F1243a08394J9364B34219a3051j4063k67823c7998
10174b83032i7117E814R8730m4421f5603l7971A18652a36116E7631f1118j21665
10163a82783B9899f4026p8086m3943A2215f2792C26895a88582g4684c6428j22055
10152a58483k0428D2136a42832A81916K9216a1931j06980d7258A1352N2685c23392
10140E0758R740L0943b04976n9559a09699b345k36033d7207l00326B64595a64960
10128C84106a2375A0962e43649K47041f2096p357G5330c45392J46718b7755j14566
$$ y = [15766, 251780, -258511, 104153, -13069, -229564, -29355, 263390, -329863, 186091, -96874, -143042, -151580, -317473, -269476, 218541, -98787, -206033, -161069, -296655, -377263, -7370, -77138, 59380, -173561, -150504, 61243, -108394, -89030, 234219, -13051, -27114, -294937, -37998, -283032, -97117, 5814, 104544, 60123, -65603, -103574, 118652, -136116, 57631, -61118, -182783, 29899, -64026, -142112, -186055, 12215, -62792, 326895, -188582, -74684, -36428, -158483, -178911, 42136, -142832, 181916, 211132, -11931, -118911, -47258, 11352, 64037, -323392, 50758, 60498, 91441, -204976, -264535, -109699, -2345, -238378, -47207, -347533, 264595, -164960, 384106, -12375, 10962, -543649, -296608, -62096, -69453, 75330, -345392, -198674, -27755, -142321]
10117a42321A1287e2583k03101R9481I7874b47670a0554k56084p0028A96090F9104
10105b30215I5580b58407A55504e5845A16066l1356g1094q0759L7939b9545o1114
10094i0659j59461D0844a05049o7450K0172C39518a69620G2441j6077b14261f9222
10082d3483l28501B31060B9994J01604a71639O3542c0013j7359A85612a51729
10071a9356l38371A98591q7077E0136h4126J546E5112d46398a49068r4595P9804
10060a63859A19452e932C6950b29225D7404K727G030B411a53712F4236c74474
10048b97050a07068l15246a44287j22729a6481k29793I1988c547k88811K2643
10038b69715e1756l0265q8949B6487a17283b8700k95643a00679k01166A04944
$$ y = [-142321, 11287, -52583, -255684, -156203, 97874, -247670, -10554, -266638, -336666, 196090, 69104, -230215, 95580, -258407, 155504, -55845, 116066, 84710, -71094, -151853, -113914, -29545, -90659, -250120, 40844, -105049, -172499, -152327, 339518, -169620, 72441, 56364, -214261, -69222, -43483, -371984, 231060, 29994, 131598, -171639, -108097, -30013, -47372, 185612, -151729, -19356, -357727, 198591, 111514, 50136, -84126, -82580, 55112, -446398, -149068, -243663, -163859, 119452, -5932, 36950, -229225, 47404, 50131, 7030, 2411, -153712, 64236, -374474, -297050, -107068, -422314, -144287, -267016, -16481, -246274, 91988, -3547, -292358, -269715, -51756, -82021, -170970, 26487, -117283, -28700, -324343, -100679, -301845, 104944]
10027a63613f5274G120a40218c782A64609a2564j44836m8774k200j63397a18118
10015a29657a6004o6451j41949i8855n5890Q659L5095M7207l0740I5888g8792
10003B19662A685J43733m4420a46958K8166M0136D0977b54338J10294B22396b2923
9991D4862E860a10609n6938B12656N7096A6424O3006a91115N8164b1053l08098
9980c29151A16633g3024q1132I7994a11722i554j06857q4501D5098b1172k74958
9969b96130M1419c4801J58A18475Q6069b94972D2309Q7811e929j04580I0143h6018
9956b27757h5936q5730A67762a68709j73938B4529J6587c27554A94128a088l0347
9945c1435n5246A37174J14105E4301O881d34356H8974c8199j38977k2636K505
$$ y = [-163613, -65274, 7120, -140218, -3782, 164609, -12564, -157400, -206174, -208374, -371771, -118118, -129657, -16004, -82455, -224404, -98855, -154745, -146086, -110991, -63784, -94524, 95888, -78792, 219662, 1685, 145418, 100998, -146958, -118792, -78656, 40977, -254338, -144044, 222396, -22923, 44862, 5860, -110609, -167547, 212656, 269752, 16424, 79430, -191115, -132951, -21053, -329151, 116633, -73024, -154156, 97994, -111722, -9554, -116411, -200912, 45098, -21172, -296130, -254711, -34801, -34643, 118475, 204544, -294972, 42309, 130120, -5929, -110509, 90143, -86018, -227757, -85936, -171666, 167762, -168709, -342647, 24529, 41116, -327554, 194128, -1088, -31435, -86681, 137174, 251279, 54301, 61182, -434356, 88974, -38199, -177176, -199812, -197307]
9934a97307c129B27326a44912l3370N1626A21257J07673a74099j14147d1028F8776
9922A72641a00093k52462b7711k12052A84929a28285B70027e2417n0175k24986
9912c27578J4865A01195c16091a10833B7517M3223e03558A84120c06999h421C3661
9900g5837m4890j46947K4350A02345c29409A026g183B57197B3509J03941A9868
9888c13512J48097n3092C4167a1081E5198d94700B06509a92363g4004D7162c85818
9876F2095b55632L8363g1950r0655d670A2032b2062k53060l7721a53698F349a66783
9863e9726A2181c6188n7986G9662i1344c4001A0754a01279d6652A4360J32994
9852A47354O6427d05197D2496M7262c21357b7872J674C03531A08838e0416j25725
$$ y = [-197307, -3129, 227326, -144912, -178282, -126656, 121257, 228930, -174099, -288246, -41028, 68776, 172641, -100093, -352555, -27711, -239763, 184929, -128285, 270027, -52417, -102592, -327578, -312713, 101195, -316091, -110833, 27517, 70740, -503558, 184120, -306999, -8421, 33661, -75837, -120727, -267674, -243324, 102345, -329409, 1026, -7183, 257197, 23509, 127450, 19868, -313512, -165415, -218507, 34167, -11081, 55198, -494700, 206509, -192363, -74004, 47162, -385818, 62095, -255632, -217269, -71950, -162605, -4670, 12032, -22062, -275122, -312843, -153698, 6349, -166783, -59726, 12181, -36188, -94174, 79662, -91344, -34001, 10754, -101279, -46652, 14360, 147354, 213781, -405197, 42496, 89758, -321357, -27872, -26198, 303531, 108838, -50416, -176141]
9841a76141e9166C3678J31103m1057D127f7846k32742B9742a40552j5740o3731
9830b20023P2504m3145A06302a77562c2703q3194j16561f3457C87181g062k49742
9819b56804A13145a71322m3529B82740c15271i5907j01349n2536E2032N0728m2779
9808E9981a32197A20693a46985F9281J63296a11233c7747m4882C22640c63074
9797f7010j37040f0384j33811e221p5527A1077d1952k60871C15946p7990h6427
9785b73155A88763C7976J7812a62047j04714J7222G2693B3060b21164Q7422j0213
9774a43955H2049b75951b4653k32791J22461l0901I8170a46565D18915b62016
9763B33690G029N7362O1798g9066o8465O7202B31967d4183j51890A42481i0813
$$ y = [-176141, -59166, 33678, 164781, 123724, 4127, -67846, -300588, 29742, -140552, -156292, -220023, -147519, -190664, 106302, -177562, -32703, -115897, -232458, -63457, 387181, -7062, -256804, 113145, -171322, -214851, 282740, -315271, -95907, -197256, -249792, 52032, 102760, 59981, -132197, 120693, -146985, 69281, 232577, -111233, -37747, -82629, 322640, -363074, -67010, -204050, -60384, -194195, -5221, -80748, 11077, -41952, -302823, 315946, 237956, -86427, -273155, 188763, 37976, 55788, -162047, -266761, -249539, 72693, 23060, -221164, -133742, -143955, 82049, -275951, -24653, -257444, -134983, -165884, 98170, -146565, 418915, -262016, 233690, 7029, 64391, 126189, -79066, -147531, -80329, 231967, -44183, -196073, 142481, -90813]
9751C66133f3073G5769d1009J350H3911F295b53643D2095b14249C21627b57865
9739A41641a84812p2951J22840A4796c06801g2906p1035A79609E3868J26102c21160
9727g0585A37467B4158a39274N8522J6310o7529b3180A50848J22230A9277a24787
9715e8059A47323d9792j7427G2450J2091a29060M5161j70007A54311c0326k03361
9704b33687A08041b52078G6387a67094N9263K8507E6153a13946A24960b74183
9693B24828a22469k643A46800m6759b6495a1160p2968b0626m61296b38735C5209
9681h3417l41680c9403k23390f8741e637A53726b865B71577A08778A7233b13329
9669a36832C6471a29930j26329a3179E9794K8381g7152m8852j51306B7064J68741
$$ y = [366133, -63073, 75769, -41009, -39659, 83911, 6295, -253643, 42095, -214249, 321627, -257865, 141641, -184812, -257763, -134923, 14796, -306801, -72906, -143941, 179609, 53868, 179970, -321160, -70585, 137467, 24158, -139274, -80752, -64442, -131971, -23180, 150848, 273078, 19277, -124787, -58059, 147323, -49792, -67219, 72450, 84541, -129060, -83899, -253906, 154311, -30326, -233687, 108041, -252078, 76387, -167094, -107831, -79324, 56153, -113946, 124960, -274183, 224828, -122469, -125112, 146800, 100041, -26495, -11160, -84128, -20626, -481922, -238735, 35209, -83417, -425097, -39403, -262793, -68741, -5637, 153726, -2865, 271577, 108778, 17233, -213329, -136832, 36471, -129930, -256259, -13179, 59794, 88175, -77152, -126004, -277310, 27064, 195805]
9658A95805c32306D1502F541f1892l10963g2817l5689j9036H0687i5278D2344
9646b2998r2745I9574b28460a8169F6924Q7531B1971h4812B10900b99667J25646
9635a74021a3655H6890p331a04193A02032g0701K7471k2728o9462o0550O4152
9624a31818f2208B29663d04059a3287l43429F7714a39689a4315j21627f2016D8002
9612d45805b5934j06352B0011L6443B7645c89187f1381q972C2904c70653j7622
9601c88275a05000r8697A33847a52706D8324a7982k33573p3281C3317J31506a28248
9589b00776e1607j10045A76501a61659a091D7111K52279C02J65375Q9441A12822
9577B49627a68483j48385a05839C2045c49235Q3384f9151D2149J75162p5053L7361
$$ y = [195805, -332306, 41502, 6541, -61892, -372855, -72817, -108506, -127542, 80687, -95278, 42344, -22998, -115743, 99574, -228460, -18169, 66924, 154455, 21971, -84812, 210900, -299667, -174021, -13655, 86890, 79559, -104193, 102032, -70701, -43230, -65958, -135420, -195970, -131818, -62208, 229663, -404059, -13287, -356716, 67714, -139689, -14315, -135942, -62016, 48002, -445805, -25934, -132286, 20011, 56454, 27645, -389187, -61381, -70353, 32904, -370653, -388275, -105000, -203697, 133847, -152706, 48324, -17982, -251555, -324836, 33317, 164823, -128248, -200776, -51607, -161652, 176501, -161659, -1091, 47111, 299390, 302, 165677, 255118, 112822, 249627, -168483, -316868, -105839, 32045, -349235, -265851, -69151, 42149, 217311, 142258, 179619]
9566A79619f7882o3921k99541a54721d8215A7164d4352C9414b12240h9563c3704
9554B02829i043B26946b66335J28172j8416A9895a46225b6257B03836f9026q8637
9543a57663K619g2555k44545R2985m1577I2379Q7038a60773A04769a63698A50494
9531A32894E9772b1379p9044A3618i1568F252b34098m712b2083A03454C6135b83760
9518B1319d63797f0578C05719b76246J30601I7756Q6692a83906h6521B07700A7120
9506a44187A28228I869O3837c4245p3509m05918a21742p6730O6202H1113a56164
9494e0871k95242C2742i7367o0766B5597e8435k25709A39218Q2791e404j37312
9483a42716N9939b7244j37692j1626j34738B0979P3938b17719B44400a93245H5437
$$ y = [179619, -67882, -131803, -431344, -154721, -48215, 17164, -44352, 39414, -212240, -89563, -33704, 202829, -9043, 226946, -266335, -138163, -156579, 19895, -146225, -26257, 203836, -69026, -157663, -155044, -72555, -317100, -224115, -265692, 92379, 179417, -160773, 104769, -163698, 150494, 132894, 59772, -21379, -100423, 13618, -91568, 6252, -234098, -238810, -22083, 103454, 36135, -283760, 21319, -463797, -60578, 305719, -276246, -145645, 97756, 184448, -183906, -86521, 207700, 17120, -144187, 128228, 9869, 73706, -34245, -107754, -513672, -121742, -198472, -132270, 81113, -156164, -50871, -346113, 32742, -97367, -158133, 25597, -58435, -284144, 139218, 222009, -5404, -142716, -82777, -27244, -164936, -176562, -311300, 20979, 94917, -217719, 244400, -193245, 85437]
9471i1412j15824a5595j90682e8472k17124N4047F6721a4662A75361g1875m9807
9460a21682K3248K5445k87010C2993K40222b04731h5457M1754j85238g1755k8701
9449a00456m06A38417a176l5113j05072b4255F8181g8954F3837j2742n380c25160
9436B8812d8802j66883c0786m57449C5904c90464i7996C48991A6311K5297h4212
9424c62614d7278B66716r9200i9209A22366a68537b2418m5289K2531D3588b38195
9412H5441a18823j44600j03402C152h7410d3468H6848e4099H1626c1315A12901
9400H6152b5198A66521a15841E2105c71825a46027R896q1796j11346a20086r0757
9389b10843d4344j74925R5626l2016r526n52j84550i1251D9208d26229J75498
$$ y = [-91412, -207236, -15595, -206277, -58472, -275596, -221549, 66721, -14662, 175361, -71875, -121682, -98434, -72989, -359999, 32993, 273215, -204731, -85457, -43703, -228941, -71755, -100456, -100862, 138417, -1176, -36289, -141361, -24255, 68181, -78954, 63837, 51095, 45715, -325160, 28812, -48802, -215685, -30786, -488235, 35904, -390464, -97996, 348991, 16311, 41608, -84212, -362614, -47278, 266716, 167516, -99209, 122366, -168537, -22418, -67707, -45176, 43588, -238195, 85441, -118823, -263423, -366825, 3152, -87410, -43468, 86848, -54099, 81626, -31315, 112901, 86152, -25198, 166521, -115841, 52105, -371825, -146027, -136131, -217927, -329273, -120086, -210843, -44344, -219269, -123643, -155659, -165185, -165737, -350287, -91251, 49208, -426229, -250731]
9378b50731L3664B82739d1514j20347k26845C9498f8703j7840B843J5056c54019
9366A12559A4202a44502k9128g5706H0456M7184b46452B82729a16280A72292d5305
9354a32086r0898H1082k4898e1881D147a82861j17993A41650M5031g4288L4825
9343c9463p0404c9712A46986e4317F9388g7792B80836a2466q886D4269f6122j52307
9331b18429c693o1594M800E3057J8436J8991a82228P8086e1233k9048G0171b67502
9318a48095D9927h7148j67181e9566k1642j4681b4418p7317k76069A67800h5733
9306A04463a18673G7869f5950k53145A6699J95845b4285F6786b8321j2965f931
9294b5026j96520A60240j7925M6079c7488A50493l3028a23322C835g7386F2927
$$ y = [-250731, -217067, 282739, -41514, -161861, -388706, 39498, -68703, -86543, 2843, 17899, -354019, 112559, 14202, -144502, -173630, -75706, 80456, 127640, -246452, 282729, -116280, 172292, -45305, -132086, -222984, 81082, 56184, -51881, 4147, -182861, -300854, 141650, 186681, -74288, -39463, -109867, -39712, 146986, -54317, 69388, -77792, 280836, -12466, -21352, 44269, -66122, -218429, -3693, -65287, -60487, 53057, 71493, 90484, -182228, -104142, -51233, -80281, 70171, -267502, -148095, 49927, -87148, -254329, -59566, -81208, -95889, -24418, -101735, -377804, 167800, -85733, 104463, -118673, 77869, -65950, -319095, 16699, 212544, -24285, 66786, -28321, -41286, -6931, -25026, -221546, 160240, 142315, 188394, -37488, 150493, 117465, -123322, 3835, -77386, 62927]
9282a30317e6606k18538n5898J55041I144B95e9651A60308C6723C694Q5253d7951
9269i7766j00540d7490j08689a8543H8890c4340A04311l2391d8823j62297A00534
9257a12109B925b23450A5465a91574c567l1057G2862b907r3108l29716i5562r8005
9245a93567Q4735r7167D5620J02031M8848J8224J04689c9549j56929C71131A0603
9233e6814n6029k72238J22123E45e4266k92319a66379c5624C1202j2231K0281
9222C9252a97822j4121o698R3901F2355R3473a58986g3835E6786c33297H0940
9210a38087A68303a6476j663C8625J3812R8250J00843d0285k57563a38041o0231
9199a98272l0246A73397b57339h2271A02192C9780a59445l739o3626N4560n7844
$$ y = [-130317, -56606, -275144, -331042, -176001, 9144, 295, -59651, 160308, 36723, 3694, 88947, -47951, -97766, -198306, -47490, -156179, -18543, 88890, -34340, 104311, 71920, -48823, -211120, 100534, -112109, 2925, -223450, 15465, -191574, -3567, -34624, 72862, -2907, -96015, -425731, -95562, -193567, -108832, -205999, 45620, 147651, 196499, 214723, 319412, -39549, -196478, 371131, 10603, -56814, -112843, -385081, -262958, 545, -54266, -346585, -166379, -35624, 31202, 18971, 39252, -197822, -211943, -218641, -124740, 62355, 155828, -158986, -73835, 56786, -333297, 80940, -138087, 168303, -16476, -18139, 38625, 52437, 150687, 251530, -40285, -297848, -138041, -198272, -228518, 173397, -257339, -82271, 102192, 39780, -159445, -163184, -226810, -172250, -230094]
9188b30094A13888B333d8190D1367j0410h2542n01012K55333M7710j8182I4754
9176a65906E781c6132p0548p3091d5608A24777a49080n6980h3580k73072a08657
9164b84350a13178o7271m4351B4580d5115m7912G4182f3973r9231c4130k32968
9153b67098f0317k27479Q4823A98989c04440J16318Q0623A5633J73652J23517
9143C12802D9071a67050q158A01923R2488a11088k5682r120k61506a32918K6518
9132a06400d6910j03428B44204I5576a31374A71972g7644A16844c88347E1868
9121f624k33798R7806A63028e50421a63368c5463l41879R7465b1219H1154a29706
9109a98061e1850B32751F7774a81290a1826I8141d7197l03700J62339j28341A03028
$$ y = [-230094, 113888, 2333, -48190, 41367, 30957, -82542, -583554, -328221, -280511, -298693, 94754, -165906, 5781, -36132, -106680, -179771, -45608, 124777, -149080, -206060, -83580, -356652, -108657, -284350, -113178, -180449, -224800, 24580, -45115, -93027, 74182, -63973, -163204, -34130, -267098, -60317, -287796, -202973, 198989, -304440, -188122, -107499, 15633, 189285, 312802, 49071, -167050, -175208, 101923, 194411, -111088, -136770, -145890, -407396, -132918, -106400, -46910, -150338, 244204, 95576, -131374, 171972, -77644, 116844, -388347, 51868, -6624, -240422, -142616, 163028, -550421, -163368, -35463, -377342, -279877, -21219, 81154, -129706, -198061, -51850, 232751, 67774, -181290, -11826, 98141, -47197, -350897, -188558, -316899, 103028]
9097c9977k52635A4960a46720c4542F32d5832k1805F7609K3450k036N2963b5187
9084d5751A8923d25537A33155b79824a5841A57152l1643b27110A07676b45180
9073A43354a55380l5866j67437L6112B0508a94877k6956g0288A07290E0936A4888
9061A11334e2077H8076q667a33977p4719a1073o8778j40503A94372a78153c3809
9049c00437e5338m2068j09083g7064j1642H1049a01036B17842c33178J24330A54072
9037D2802A0290J9587R3438e01857a97018Q8880o0135j07993J06943o1742j2393
9026b43458J14638B85046m2394l548H8352d59866K14637O3672N6440n9000n4055
9015b38172O7271b8020p5444k3665B94007a75211M9613B783O8033a3878B01307
$$ y = [-39977, -292612, 14960, -146720, -34542, 632, -45832, -67637, 67609, 91059, 89023, 141986, -25187, -45751, 18923, -425537, 133155, -279824, -15841, 157152, 125509, -227110, 107676, -245180, 143354, -155380, -191246, -358683, -322571, 20508, -194877, -221833, -70288, 107290, 50936, 14888, 111334, -52077, 88076, 79409, -133977, -208696, -11073, -79851, -220354, 194372, -178153, -33809, -300437, -55338, -97406, -206489, -77064, -88706, 81049, -101036, 217842, -333178, -208848, 154072, 42802, 10290, 29877, 123315, -501857, -197018, -108138, -168273, -276266, -169323, -231065, -243458, -128820, 285046, 242652, 239104, 88352, -459866, -245229, -181557, -125117, -184117, -238172, -170901, -28020, -103464, -127129, 294007, -175211, -125598, 2783, 70816, -13878, 201307]
9003a72349p0848N1542i271B3141J40565c15995a0916j46718P6947A89057E6395
8991g3649B1038b19270a2883A75852F8499a97561a7198B17002m3889d11382a05752
8979C09537h9753M2587k05330B73447B7270c90856a95288D6813A6329b04313h2860
8967B53092A20730f0918B28803a36180F7835a31556k45367E060M1942J7852b10806
8955c21057B47467D267a63747J9236A53463a21722j52450B50985a31934a7892
8944A81008a52950O2820j63318a04229K0277l670A39611a39795A73523L7756j05578
8933A05701j7746b64335f6323k20781J33623C11710A31498P93567l1544J546875
8923B440396L078156J8552309I687389B802187A087963l08810B28849K1139p6746
$$ y = [-172349, -243197, -191655, -9271, 23141, 163706, -315995, -10916, -157634, -80687, 189057, 56395, -73649, 21038, -219270, -12883, 175852, 68499, -197561, -17198, 217002, 173113, -411382, -105752, 309537, -89753, -47166, -252496, 273447, 27270, -390856, -195288, 46813, 16329, -204313, -82860, 253092, 120730, -60918, 228803, -136180, 67835, -131556, -376923, 5060, 47002, 64854, -210806, -321057, 247467, 4267, -163747, -144511, 153463, -121722, -274172, 250985, -131934, -17892, 181008, -152950, -90130, -253448, -104229, -83952, -87622, 139611, -139795, 173523, 211279, 105701, 87955, -264335, -66323, -287104, -153481, 311710, 131498, 925065, 893521, 2440396, 5518552, 24070861, 9687389, 2802187, 1087963, 779153, 228849, 249988, 173242]
8914A73242H16K12460r4500k8739I978L40951p3033p1715D4793a8114k7450l12858
8902c58422f5666C40049h7090k5967D76818H3393l5450A5427J47364a97829k1767
8891b19596j3528C2960a69293h2383c7947k10357R1276M5678k08096N0666A7963
8879b24514d4804B22626f2197F8515J21201f4562a6020j41997E2470c5520j12768
8868a48288M8877E608d39733a88544h3552L0594j26620A92259e0005I650b61147
$$ y = [173242, 816, 213276, 118776, 90037, 9978, 350929, 277896, 206181, 44793, -18114, -45564, -358422, -65666, 340049, -87090, -113057, 476818, 83393, 47943, 15427, 162791, -197829, -219596, -233124, 32960, -169293, -82383, -37947, -248304, -157028, -111350, -319446, -268780, 17963, -224514, -44804, 222626, -62197, 68515, 189716, -64562, -16020, -158017, 52470, -35520, -148288, -99411, 5608, -439733, -188544, -83552, -52958, -179578, 192259, -50005, 9650, -261147]
$$ [...]
##END NTUPLES=NMR SPECTRUM
##END=
