##TITLE=AC1504_CUNCR13311_8126415_M5UcxKlBcI
##JCAMPDX= 6.0         $$ Bruker NMR JCAMP-DX V2.0
##DATA TYPE= NMR SPECTRUM
##DATA CLASS= NTUPLES
##ORIGIN= BRUKER
##OWNER= Administrator
$$ 1.72 TOPSPIN		Version 2.1
$$ 2013-08-16 18:45:31.219 -0700  Administrator@X
$$ Compression mode = diff/dup
##.OBSERVE FREQUENCY= 400.02188249412
##.OBSERVE NUCLEUS= ^1H
##.ACQUISITION MODE= SIMULTANEOUS (DQD)
##.ACQUISITION SCHEME= undefined
##.AVERAGES= 64
##.DIGITISER RES= 22
##SPECTROMETER/DATA SYSTEM= spect
##.PULSE SEQUENCE= noesygpps1d.comp
##.SOLVENT NAME= COFFEE_meoh
##.SHIFT REFERENCE= INTERNAL, COFFEE_meoh, 1, 14.96064
##AUDIT TRAIL= $$ (NUMBER, WHEN, WHO, WHERE, PROCESS, VERSION, WHAT)
$$ ##TITLE= Audit trail, TOPSPIN		Version 2.1
$$ ##JCAMPDX= 5.01
$$ ##ORIGIN= Bruker BioSpin GmbH
$$ ##OWNER= Administrator
$$ $$ E:\/data/COFFEE/nmr/AC1504_CUNCR13311_8126415_M5UcxKlBcI/22/pdata/1/auditp.txt
$$ ##AUDIT TRAIL=  $$ (NUMBER, WHEN, WHO, WHERE, PROCESS, VERSION, WHAT)
(   1,<2013-08-16 18:45:26.297 -0700>,<Administrator>,<X>,<go>,<TOPSPIN 2.1>,
      <created by zg
	started at 2013-08-16 18:33:56.795 -0700,
	POWCHK enabled, PULCHK disabled,
       configuration hash MD5:
       C8 4E 4E 5D D3 5C D8 9E 9F 52 82 E0 59 8A DE 15
       data hash MD5: 64K
       BF 3D 03 41 1D C0 85 CD B7 CC A6 18 24 B7 09 77>)
(   2,<2013-08-16 18:45:29.203 -0700>,<Administrator>,<X>,<proc1d>,<TOPSPIN 2.1>,
      <Start of raw data processing
       efp LB = 0.3 FT_mod = 6 PKNL = 1 PHC0 = 0 PHC1 = 0 SI = 128K 
       data hash MD5: 128K
       D3 33 3D 16 09 79 29 86 92 0B 68 AE EE 1A 1B 43>)
(   3,<2013-08-16 18:45:30.203 -0700>,<Administrator>,<X>,<proc1d>,<TOPSPIN 2.1>,
      <pk PHC0 = -78.65112 PHC1 = 0 
       data hash MD5: 128K
       6B 83 C1 71 0C E9 F6 54 54 12 1E 8C D2 F3 2E 1F>)
(   4,<2013-08-16 18:45:30.641 -0700>,<Administrator>,<X>,<proc1d>,<TOPSPIN 2.1>,
      <abs ABSG = 1 
       data hash MD5: 128K
       E3 E4 B8 D9 65 B4 C8 E9 F6 57 6C 09 98 A2 84 30>)
(   5,<2013-08-16 18:45:30.750 -0700>,<Administrator>,<X>,<proc1d>,<TOPSPIN 2.1>,
      <abs ABSG = 2 
       data hash MD5: 128K
       3E 03 C1 BA 46 B4 D4 64 09 57 75 4A 51 91 0F 89>)
(   6,<2013-08-16 18:45:30.860 -0700>,<Administrator>,<X>,<proc1d>,<TOPSPIN 2.1>,
      <abs ABSG = 3 
       data hash MD5: 128K
       FF 67 A1 61 08 C6 3E 7C F0 63 5B 97 5C 0F A7 31>)
(   7,<2013-08-16 18:45:30.953 -0700>,<Administrator>,<X>,<proc1d>,<TOPSPIN 2.1>,
      <abs ABSG = 4 
       data hash MD5: 128K
       B4 DD CF 24 9A 86 2C 4B 6A 17 A2 AE DF 56 34 5E>)
(   8,<2013-08-16 18:45:31.031 -0700>,<Administrator>,<X>,<proc1d>,<TOPSPIN 2.1>,
      <abs ABSG = 5 
       data hash MD5: 128K
       37 37 AB BA 1D 1A 47 28 6A E8 4D 75 29 FB F0 00>)
$$ ##END=
$$ 
$$ $$ hash MD5
$$ $$ AC 04 42 55 05 C5 BE 9F 21 40 BF 87 B7 5C E3 82
##$RELAX= 
##$RELAX= 
##$RELAX= 
##$RELAX= 
##$RELAX= 
##$RELAX= 
##$RELAX= 
##$RELAX= 
$$ Bruker specific parameters
$$ --------------------------
##$DU= <E:\>
##$EXPNO= 22
$$ [...]
##$TP07= 0
##$TPNAME0= <>
##$TPNAME1= <>
##$TPNAME2= <>
##$TPNAME3= <>
##$TPNAME4= <>
##$TPNAME5= <>
##$TPNAME6= <>
##$TPNAME7= <>
##$TPOAL= (0..7)
0.5 0.5 0.5 0.5 0.5 0.5 0.5 0.5
##$TPOFFS= (0..7)
0 0 0 0 0 0 0 0
##$TUNHIN= 0
##$TUNHOUT= 0
##$TUNXOUT= 0
##$USERA1= <user>
##$USERA2= <user>
##$USERA3= <user>
##$USERA4= <user>
##$USERA5= <user>
##$V9= 5
##$VALIST= <valist>
##$VCLIST= <CCCCCCCCCCCCCCC>
##$VD= 0
##$VDLIST= <DDDDDDDDDDDDDDD>
##$VPLIST= <PPPPPPPPPPPPPPP>
##$VTLIST= <TTTTTTTTTTTTTTT>
##$WBST= 2048
##$WBSW= 25
##$XGAIN= (0..3)
0 0 0 0
##$XL= 0
##$YL= 0
##$YMAX_a= 6800571
##$YMIN_a= -13636191
##$ZGOPTNS= <>
##$ZL1= 120
##$ZL2= 120
##$ZL3= 120
##$ZL4= 120
##$ABSF1= 14.96064
##$ABSF2= -5.597542
##$ABSG= 5
##$ABSL= 3
##$ALPHA= 0
##$AQORDER= 0
##$ASSFAC= 0
##$ASSFACI= 0
##$ASSFACX= 0
##$ASSWID= 0
##$AUNMP= <proc_prof1d_extract.lims>
##$AXLEFT= 0
##$AXNAME= <>
##$AXNUC= <1H>
##$AXRIGHT= 0
##$AXTYPE= 0
##$AXUNIT= <>
##$AZFE= 0.1
##$AZFW= 0.1
##$BCFW= 0
##$BC_mod= 0
##$BYTORDP= 0
##$COROFFS= 0
##$CY= 15
##$DATMOD= 1
##$DC= 0
##$DFILT= <>
##$DTYPP= 0
##$F1P= 0
##$F2P= 0
##$FCOR= 0.5
##$FTSIZE= 131072
##$FT_mod= 6
##$GAMMA= 0
##$GB= 0
##$INTBC= 1
##$INTSCL= 1
##$ISEN= 128
##$LB= 0.3
##$LEV0= 0
##$LPBIN= 0
##$MAXI= 10000
##$MC2= 0
##$MEAN= 0
##$ME_mod= 0
##$MI= 0
##$NCOEF= 0
##$NC_proc= -2
##$NLEV= 6
##$NOISF1= 0
##$NOISF2= 0
##$NSP= 0
##$NTH_PI= 0
##$NZP= 0
##$OFFSET= 14.96064
##$PC= 1
##$PHC0= -78.65112
##$PHC1= 0
##$PH_mod= 1
##$PKNL= yes
##$PPARMOD= 0
##$PPDIAG= 0
##$PPIPTYP= 0
##$PPMPNUM= 2147483647
##$PPRESOL= 1
##$PSCAL= 4
##$PSIGN= 0
##$PYNMP= <proc.py>
##$REVERSE= no
##$SF= 400.020009781824
##$SI= 131072
##$SIGF1= 0
##$SIGF2= 0
##$SINO= 400
##$SIOLD= 131072
##$SPECTYP= <>
##$SREGLST= <1H.CDCl3>
##$SSB= 0
##$STSI= 131072
##$STSR= 0
##$SW_p= 8223.68421052631
##$SYMM= 0
##$S_DEV= 0
##$TDeff= 65536
##$TDoff= 0
##$TI= <>
##$TILT= no
##$TM1= 0
##$TM2= 0
##$TOPLEV= 0
##$USERP1= <user>
##$USERP2= <user>
##$USERP3= <user>
##$USERP4= <user>
##$USERP5= <user>
##$WDW= 1
##$XDIM= 131072
##$YMAX_p= 469443698
##$YMIN_p= -11854
##$CURPLOT= <Network HP LaserJet P1505>
##$CURPRIN= <$Network HP LaserJet P1505>
##$DFORMAT= <normdp>
##$LAYOUT= <+/1D_H.xwp>
##$LFORMAT= <normlp>
##$PFORMAT= <normpl>
##$SURQMSG= 1
$$ End of Bruker specific parameters
$$ ---------------------------------
##NTUPLES= NMR SPECTRUM
##VAR_NAME=  FREQUENCY,     SPECTRUM/REAL,   SPECTRUM/IMAG
##SYMBOL=    X,             R,               I
##VAR_TYPE=  INDEPENDENT,   DEPENDENT,       DEPENDENT
##VAR_FORM=  AFFN,          ASDF,            ASDF
##VAR_DIM=   131072,        131072,          131072
##UNITS=     HZ,            ARBITRARY UNITS, ARBITRARY UNITS
##FACTOR=    0.0627417313425164, 1,          1
##FIRST=     8223.62146879497, 1072,         -70693
##LAST=      0,             4356,            -71172
##MIN=       0,             -11854,          0
##MAX=       8223.62146879497, 469443698,    0
$$ Real data points
##PAGE= N=1
##DATA TABLE= (X++(R..R)), XYDATA
$$ [...]
$$ plain form
63928 2232390 2231798 2226399 2216280 2200850 2179668 2152987 2121340 2084962 2044057 1999503 1952824 1905317
63916 1905317 1857455 1809245 1760934 1713193 1666817 1622363 1579983 1539483 1500700 1463891 1429500
63905 1429500 1397389 1366544 1335874 1305230 1275426 1247393 1221542 1197793 1175793 1155001 1134812
63894 1134812 1114756 1094526 1073925 1052922 1031710 1010452 989057 967477 946059 925205 904741
63883 904741 884117 863318 843027 823695 805013 786660 769077 752940 738246 724501 711551
63872 711551 699564 688378 677621 667462 658442 650387 642321 633904 626242 620599 616769 613482 610109
63859 610109 607117 604856 602788 600225 597292 594700 592957 592185 592451 593776 595830 598013 599963 601789 603663
63844 603663 605325 606118 605589 603918 601608 598722 594601 588542 580614 571540 561835 551467 540451 529345
$$ packed form
63928B232390n92n399j0119j5430k1182k6681l1647l6378m0905m4554m6679m7507
63916A905317m7862m8210m8311m7741m6376m4454m2380m0500l8783l6809l4391
63905A429500l2111l0845l0670l0644k9804k8033k5851k3749k2000k0792k0189
63894A134812k0056k0230k0601k1003k1212k1258k1395k1580k1418k0854k0464
63883I04741k0624k0799k0291j9332j8682j8353j7583j6137j4694j3745j2950
63872G11551j1987j1186j0757j0159r020q055q066q417p662n643l830l287l373
63859F10109k992k261k068k563k933k592j743p72K66J325K054K183J950J826J874
63844F03663J662P93n29j671k310k886m121o059p928r074r705j0368j1016j1106
$$ plain form
63830 529345 518748 508585 498319 487811 477543 467972 459007 450307 441750 433409 425298 417442 410057
63817 410057 403377 397337 391677 386386 381734 377760 373958 369745 365166 360909 357608 355278 353469 351787
63803 351787 350168 348789 347814 347172 346461 345163 343076 340459 337694 334893 332012 329173 326601 324277 321966
63788 321966 319598 317323 315075 312444 309199 305780 302954 301065 299795 298624 297337 296094 295120 294356 293473
63773 293473 292333 291359 291076 291213 290634 288533 285388 282391 280147 278409 276903 275839 275469 275636 275913 275951
63757 275951 275592 275010 274785 275433 276659 277422 277017 275845 274858 274500 274459 274231 273600 272658 271659 270860 270367 270145
63739 270145 270246 270824 271873 273195 274762 276832 279451 282120 284329 286222 288300 290628 292787 294612 296517
63724 296517 299006 302220 306107 310630 315595 320534 325025 328957 332370 335200 337359 338871 339738 339817 339050
$$ packed form
63830E29345j0597j0163j0266j0508j0268r571q965q700q557q341q111p856p385
63817D10057o680o040n660n291m652l974l802m213m579m257l301k330j809j682
63803C51787j619j379r75o42p11j298k087k617k765k801k881k839k572k324k311
63788C21966k368k275k248k631l245l419k826j889j270j171j287j243r74p64q83
63773B93473j140r74k83J37n79k101l145k997k244j738j506j064l70J67K77L8
63757B75951l59n82k25O48J226P63m05j172r87l58m1k28o31r42r99p99m93k22
63739B70145J01N78J049J322J567K070K619K669K209J893K078K328K159J825J905
63724B96517K489L214L887M523M965M939M491L932L413K830K159J512Q67P9p67
$$ plain form
63709 339050 337663 335915 333733 330867 327411 323884 320752 318053 315644 313616 312240 311525 311057 310417 309663
63694 309663 309287 309699 310839 312266 313525 314405 315011 315726 316977 318858 320895 322305 322557 321764 320638 320086
63678 320086 320669 322232 324052 325491 326508 327465 328555 329650 330728 332119 334185 336964 340253 343879 347617
63663 347617 350953 353219 354030 353441 351782 349493 347098 344967 342963 340521 337267 333392 329333 325350 321696
63648 321696 318912 317404 316677 315550 313423 311037 309647 309695 310633 311835 313249 315170 317803 321176 325156
63633 325156 329454 333827 338333 343118 347952 352342 356258 360428 365635 371941 378778 385581 392195 398936
63619 398936 406495 415552 426149 437688 449815 463089 478422 496044 515494 536479 559288 584382
63607 584382 611998 642252 675155 710310 746814 783530 819127 851892 879953 902027 917786
$$ packed form
63709C39050j387j748k182k866l456l527l132k699k409k028j376p15m68o40p54
63694C09663l76M12J140J427J259Q80O06P15J251J881K037J410K52p93j126n52
63678C20086N83J563J820J439J017R57J090J095J078J391K066K779L289L626L738
63663C47617L336K266Q11n89j659k289k395k131k004k442l254l875m059l983l654
63648C21696k784j508p27j127k127k386j390M8R38J202J414J921K633L373L980
63633C25156M298M373M506M785M834M390L916M170N207O306O837O803O614O741
63619C98936P559R057J0597J1539J2127J3274J5333J7622J9450K0985K2809K5094
63607E84382K7616L0254L2903L5155L6504L6716L5597L2765K8061K2074J5759
$$ plain form
63596 917786 927394 931023 929111 922807 913810 903718 893597 883941 874699 865275 854681 841803 825728
63583 825728 806047 783013 757387 730149 702403 675377 650093 626980 606020 587297 571080
63572 571080 557322 545580 535615 527707 522094 518494 516541 516348 518141 521601 526097 531437 537857 545320
63558 545320 553397 561837 570750 580116 589790 600259 612840 628592 647322 668118 690682 715769
63546 715769 744510 777775 816099 859616 907689 958560 1009250 1055620 1092979 1117572 1128207
63535 1128207 1126530 1115798 1099553 1081142 1063410 1047893 1034345 1021576 1008752 995594 981521
63524 981521 965301 945678 921923 893692 860956 824473 785939 747278 709881 674668 642376
63513 642376 613247 586726 562028 538977 517919 498989 481961 466757 453565 442405 433010 425157
$$ packed form
63596I17786R608L629j912o304q997j0092j0121r656r242r424j0594j2878j6075
63583H25728j9681k3034k5626k7238k7746k7026k5284k3113k0960j8723j6217
63572E71080j3758j1742r965p908n613l600j953j93J793L460M496N340O420P463
63558E45320Q077Q440Q913R366R674J0469J2581J5752J8730K0796K2564K5087
63546G15769K8741L3265L8324M3517M8073N0871N0690M6370L7359K4593J0635
63535A128207j677j0732j6245j8411j7732j5517j3548j2769j2824j3158j4073
63524I81521j6220j9623k3755k8231l2736l6483l8534l8661l7397l5213l2292
63513F42376k9129k6521k4698k3051k1058j8930j7028j5204j3192j1160r395p853
$$ plain form
63501 425157 418611 412705 406574 400065 393954 388963 384955 381330 377766 374282 370963 368090 366201 365536
63487 365536 365640 365877 366123 366575 367180 367770 368569 369979 371933 374080 376574 380059 384641 389437 393453 396490
63471 396490 398877 400697 401693 401764 401103 399900 398188 396018 393530 390830 388037 385530 383913 383481 383780 383967
63455 383967 383726 383629 384402 385970 387565 388778 390155 392559 396268 400946 406236 411967 417944 424012 430439
63440 430439 437888 446826 457143 468446 480670 494403 510797 531155 556347 586489 621051 658961
63428 658961 698176 735292 766377 788879 802965 811049 816136 820530 825646 832515 842269 856167 875132
63415 875132 899364 928466 961931 999259 1039523 1080932 1120895 1156442 1184768 1203869 1213113 1213318
63403 1213318 1206242 1193995 1178736 1162478 1146703 1131945 1117643 1102435 1084773 1063543 1038314
$$ packed form
63501D25157o546n906o131o509o111m991m008l625l564l484l319k873j889o65
63487C65536J04K37K46M52O05N90P99J410J954K147K494L485M582M796M016L037
63471C96490K387J820R96P1o61j203j712k170k488k700k793k507j617m32K99J87
63455C83967k41r7P73J568J595J213J377K404L709M678N290N731N977O068O427
63440D30439P449Q938J0317J1303J2224J3733J6394K0358K5192L0142L4562L7910
63428F58961L9215L7116L1085K2502J4086Q084N087M394N116O869R754J3898J8965
63415H75132K4232K9102L3465L7328M0264M1409L9963L5547K8326J9101R244K05
63403A213318p076j2247j5259j6258j5775j4758j4302j5208j7662k1230k5229
$$ plain form
63392 1038314 1009092 976130 940143 902486 864615 827334 790878 755678 722607 692321 664850
63381 664850 640116 618424 600113 585040 572812 563248 556162 550938 546918 544233 543718 545877 550339
63368 550339 556483 564225 573921 585731 599387 614554 631259 649981 671323 695523 722229 750888
63356 750888 781372 814170 849929 888947 930981 975166 1019908 1063039 1102321 1135825 1161913
63345 1161913 1179245 1187263 1186719 1179501 1167832 1153679 1138647 1123856 1109557 1094994 1078955 1060539
63333 1060539 1039380 1015382 988523 958908 926754 892348 856323 820020 785199 753086 723951
63322 723951 697824 675278 657119 643519 634085 628700 627470 629286 630930 628284 618706 602215 580746
63309 580746 556715 532186 508666 487150 468211 452083 438625 427245 417137 407819 399445 392518
$$ packed form
63392A038314k9222l2962l5987l7657l7871l7281l6456l5200l3071l0286k7471
63381F64850k4734k1692j8311j5073j2228r564p086n224m020k685n15K159M462
63368E50339O144P742R696J1810J3656J5167J6705J8722K1342K4200K6706K8659
63356G50888L0484L2798L5759L9018M2034M4185M4742M3131L9282L3504K6088
63345A161913J7332Q018n44p218j1669j4153j5032j4791j4299j4563j6039j8416
63333A060539k1159k3998k6859k9615l2154l4406l6025l6303l4821l2113k9135
63322G23951k6127k2546j8159j3600r434n385j230J816J644k646r578j6491k1469
63309E80746k4031k4529k3520k1516j8939j6128j3458j1380j0108r318q374o927
$$ plain form
63297 392518 387225 383105 379351 375424 371376 367580 364273 361330 358436 355380 352246 349304 346627 343718
63283 343718 339874 335175 330948 328651 328268 328315 327652 326742 326732 327793 329023 329723 329962 329893 329385 328656 328626 330009
63265 330009 332370 334632 336381 338140 340383 342843 345013 346937 349145 351997 355403 359140 363121 367296
63251 367296 371548 375849 380379 385351 390754 396443 402415 408865 415957 423656 431842 440543 450048 460810
63237 460810 473164 487029 501951 517542 533871 551279 569837 589108 608452 627364 645606
63226 645606 663266 680793 698698 717089 735632 754087 772655 791699 811310 831290 851334
63215 851334 871056 889998 907834 924340 938879 950173 956988 959040 956905 951076 941451 927841
63203 927841 910621 890705 869082 846584 823988 802158 782000 764212 749046 736416 726345
$$ packed form
63297C92518n293m120l754l927m048l796l307k943k894l056l134k942k677k909
63283C43718l844m699m227k297l83M7o63r10j0J061J230P00K39o9n08p29l0J383
63265C30009K361K262J749J759K243K460K170J924K208K852L406L737L981M175
63251C67296M252M301M530M972N403N689N972O450P092P699Q186Q701R505J0762
63237D60810J2354J3865J4922J5591J6329J7408J8558J9271J9344J8912J8242
63226F45606J7660J7527J7905J8391J8543J8455J8568J9044J9611J9980K0044
63215H51334J9722J8942J7836J6506J4539J1294O815K052k135n829r625j3610
63203I27841j7220j9916k1623k2498k2596k1830k0158j7788j5166j2630j0071
$$ plain form
63192 726345 719178 715230 714343 716115 720535 728112 739267 753757 770734 789261 808789 829354 851322
63179 851322 874758 899012 923143 946786 970371 994387 1018648 1042426 1065033 1086114 1105494
63168 1105494 1123015 1138501 1151616 1161580 1167139 1167035 1160709 1148519 1131219 1109265 1082778 1052096
63156 1052096 1018030 981425 942837 902907 862743 823556 786050 750576 717657 687883 661352
63145 661352 637749 616997 599230 584040 570389 557569 545755 535304 526039 517661 510459 504958
63133 504958 501095 498252 496019 494410 493443 493000 493125 493916 495039 495797 495929 496019 496867 498705 501189 503936
63117 503936 506774 509629 512485 515452 518617 521750 524365 526229 527728 529541 531972 534700 537222 539335
63103 539335 541107 542574 543768 544937 546429 548251 549986 551299 552341 553516 555033 556858 558976 561532
$$ packed form
63192G26345p167l948q87J772M420P577J1155J4490J6977J8527J9528K0565K1968
63179H51322K3436K4254K4131K3643K3585K4016K4261K3778K2607K1081J9380
63168A105494J7521J5486J3115R964N559j04o326j2190j7300k1954k6487l0682
63156A052096l4066l6605l8588l9930m0164l9187l7506l5474l2919k9774k6531
63145F61352k3603k0752j7767j5190j3651j2820j1814j0451r265q378p202n501
63133E04958l863k843k233j609r67m43J25P91J123P58J32R0Q48J838K484K747
63117E03936K838K855K856K967L165L133K615J864J499J813K431K728K522K113
63103E39335J772J467J194J169J492J822J735J313J042J175J517J825K118K556
$$ plain form
63089 561532 564704 568532 572768 576875 580313 582928 584976 586773 588518 590461 592872 595676 598451 601084
63075 601084 604162 608330 613485 619049 624932 631680 639613 648312 657204 666374 676471 687997 700935
63062 700935 715068 730461 747530 766689 787987 811221 836393 863894 894034 926516 960660
63051 960660 996198 1033618 1073600 1116243 1160913 1206688 1252765 1298558 1343679 1388075 1432161
63040 1432161 1476621 1521841 1567472 1612701 1657025 1700668 1744157 1787534 1830065 1870586 1907980
63029 1907980 1941312 1969628 1991654 2005869 2011047 2006759 1993197 1970565 1939053 1899589 1854270 1805665
63017 1805665 1755755 1705698 1656305 1608383 1562799 1520707 1483682 1453277 1430348 1414977 1406900
63006 1406900 1405687 1410727 1421558 1438242 1460966 1489250 1522016 1558491 1598430 1641256 1685548 1729856
$$ packed form
63089E61532L172L828M236M107L438K615K048J797J745J943K411K804K775K633
63075F01084L078M168N155N564N883O748P933Q699Q892R170J0097J1526J2938
63062G00935J4133J5393J7069J9159K1298K3234K5172K7501L0140L2482L4144
63051I60660L5538L7420L9982M2643M4670M5775M6077M5793M5121M4396M4086
63040A432161M4460M5220M5631M5229M4324M3643M3489M3377M2531M0521L7394
63029A907980L3332K8316K2026J4215N178m288j3562k2632l1512l9464m5319m8605
63017A805665m9910n0057m9393m7922m5584m2092l7025l0405k2929j5371q077
63006A406900j213N040J0831J6684K2724K8284L2766L6475L9939M2826M4292M4308
$$ plain form
62994 1729856 1773644 1817019 1859898 1902012 1943520 1984925 2026181 2066259 2103769 2137727 2167445
62983 2167445 2191852 2209292 2218176 2217688 2207636 2187638 2156857 2114914 2062900 2003048 1937365 1867042
62971 1867042 1793217 1717703 1642432 1568570 1496720 1427819 1363217 1303741 1249111 1198486 1151352
62960 1151352 1107724 1067758 1031384 998217 967666 939212 912697 888309 866158 845896 826796
62949 826796 808214 789946 772198 755318 739542 724909 711333 698746 687188 676729 667268 658416
62937 658416 649696 640919 632305 624243 616944 610359 604291 598566 593195 588478 584799 582194 580288 578795
62923 578795 577837 577503 577270 576322 574396 571903 569207 566290 563258 560630 558771 557344 555693 553540 551001
62908 551001 548208 545330 542808 541022 539647 537738 534700 530993 527753 525773 524906 524398 523661 522732 521991
$$ packed form
62994A729856M3788M3375M2879M2114M1508M1405M1256M0078L7510L3958K9718
62983B167445K4407J7440Q884m88j0052j9998l0781m1943n2014n9852o5683p0323
62971A867042p3825p5514p5271p3862p1850o8901o4602n9476n4630n0625m7134
62960A151352m3628l9966l6374l3167l0551k8454k6515k4388k2151k0262j9100
62949H26796j8582j8268j7748j6880j5776j4633j3576j2587j1558j0459r461q852
62937F58416q720q777q614q062p299o585o068n725n371m717l679k605j906j493
62923E78795r58l34k33r48j926k493k696k917l032k628j859j427j651k153k539
62908E51001k793k878k522j786j375j909l038l707l240j980q67n08p37r29p41
$$ plain form
62893 521991 521581 521308 521054 520986 521198 521386 521181 520676 520310 520274 520278 519935 519182 518269 517567 517457 518272 520080 522426
62874 522426 524383 525097 524431 522978 521281 519224 516489 513455 511127 509980 509349 508241 506390 504206 502060
62859 502060 500108 498573 497572 496707 495331 493385 491628 490868 491140 491703 491704 490847 489556 488465 487674 486649
62843 486649 485018 483189 481870 481144 480455 479381 477970 476359 474594 472874 471578 470871 470622 470739 471227 471809
62827 471809 471990 471706 471597 472379 474189 476658 479310 481680 483446 484727 486096 488025 490466 493085 495715
62812 495715 498452 501538 505278 509802 514733 519368 523385 527161 531317 536282 542408 549972 558694 567703
62798 567703 576479 585566 595913 607729 620501 633864 647890 662637 678085 694575 712797 733241
62786 733241 756166 782141 812054 846296 884463 926216 972053 1022769 1078399 1138161 1201383
$$ packed form
62893E21991m10k73k54o8K12J88k05n05l66l6Ml43p53r13p02j10Q15J808K346
62874E22426J957P14o66j453j697k057k735l034k328j147o31j108j851k184k146
62859E02060j952j535j001q65j376j946j757p60K72N63Jq57j291j091p91j025
62843D86649j631j829j319p26o89j074j411j611j765j720j296p07k49J17M88N82
62827D71809J81k84j09P82J810K469K652K370J766J281J369J929K441K619K630
62812D95715K737L086L740M524M931M635M017L776M156M965O126P564Q722R009
62798E67703Q776R087J0347J1816J2772J3363J4026J4747J5448J6490J8222K0444
62786G33241K2925K5975K9913L4242L8167M1753M5837N0716N5630N9762O3222
$$ plain form
62775 1201383 1268045 1338227 1411272 1485678 1559682 1631732 1700247 1763060 1817413 1860791 1891768
62764 1891768 1909975 1915394 1907903 1887517 1854835 1811244 1758835 1699995 1636711 1570114 1500928 1430441
62752 1430441 1360670 1293352 1228978 1167104 1107466 1050566 997334 948500 904291 864460 828540
62741 828540 796194 767276 741512 718299 697131 678068 661432 647019 634029 622008 611447
62730 611447 603112 596935 591999 587622 584026 581843 581224 581734 582910 584674 587248 590984 596231 603119 611350
62715 611350 620413 630147 640955 653385 667696 684069 703044 725367 751315 780433 812149 846546
62703 846546 884435 926766 974071 1026388 1083561 1145545 1212466 1284456 1361444 1443101 1528764
62692 1528764 1617265 1706875 1795673 1881911 1963746 2038551 2103032 2154464 2191633 2214197 2221337
$$ packed form
62775A201383O6662P0182P3045P4406P4004P2050O8515O2813N4353M3378L0977
62764A891768J8207N419p491k0386l2682m3591n2409n8840o3284o6597o9186p0487
62752A430441o9771o7318o4374o1874n9638n6900n3232m8834m4209l9831l5920
62741H28540l2346k8918k5764k3213k1168j9063j6636j4413j2990j2021j0561
62730F11447q335o177m936m377l596k183o19N10J176J764K574L736N247O888Q231
62715F11350R063R734J0808J2430J4311J6373J8975K2323K5948K9118L1716L4397
62703H46546L7889M2331M7305N2317N7173O1984O6921P1990P6988Q1657Q5663
62692A528764Q8501Q9610Q8798Q6238Q1835P4805O4481N1432L7169K2564P140
$$ plain form
62681 2221337 2211771 2185191 2143040 2087537 2020478 1943516 1859116 1770380 1679892 1589402 1500627
62670 1500627 1415443 1334865 1258515 1185789 1117179 1053847 996229 943839 896298 853702 815798
62659 815798 781627 750403 722171 697134 674818 654519 636150 619989 605770 592723 580487
62648 580487 569224 558707 547970 536318 524250 513002 503392 495429 488748 482991 477904 473432 469789
62635 469789 467191 465602 464866 464930 465615 466281 466137 464992 463416 462047 460950 459709 457962 455724 453359 451307
62619 451307 449739 448440 447166 446110 445792 446522 448282 451144 455414 461078 467421 473564 479314 485225 491968
62604 491968 499913 509256 520186 532824 547111 562774 579415 596881 615766 637291 662328 690579
62592 690579 721071 753272 787230 822693 858676 894081 928181 960160 988682 1012353 1030416
$$ packed form
62681B221337r566k6580m2151n5503o7059p6962q4400q8736r0488r0490q8775
62670A500627q5184q0578p6350p2726o8610o3332n7618n2390m7541m2596l7904
62659H15798l4171l1224k8232k5037k2316k0299j8369j6161j4219j3047j2236
62648E80487j1263j0517j0737j1652j2068j1248r610p963o681n757n087m472l643
62635D69789k598j589p36O4O85O66j44j145j576j369j097j241j747k238k365k052
62619D51307j568j299j274j056l18P30J760K862M270N664O343O143N750N911O743
62604D91968P945R343J0930J2638J4287J5663J6641J7466J8885K1525K5037K8251
62592F90579L0492L2201L3958L5463L5983L5405L4100L1979K8522K3671J8063
$$ plain form
62581 1030416 1042621 1048638 1048024 1040648 1026874 1007407 983226 955472 925034 892368 858016 823171
62569 823171 789272 757067 726466 697330 670012 644994 622305 601497 582039 563710 546878
62558 546878 532351 520703 511581 503952 497041 490792 485390 480802 477009 474304 472954 472699 472876 472971 472866
62543 472866 472668 472541 472661 473125 473911 475057 476786 479279 482368 485627 488784 491880 495050 498340 501811
62528 501811 505721 510484 516478 523966 533209 544561 558287 574271 592078 611450 632641 656117
62516 656117 682049 710468 741923 777548 818134 863212 911336 961194 1012257 1064312 1116636
62505 1116636 1167820 1216266 1260535 1299039 1329759 1350921 1362178 1364778 1360248 1349166 1331555 1308103
62493 1308103 1280391 1250055 1218442 1187238 1158700 1134799 1116416 1103573 1096022 1093335 1095010 1101123
$$ packed form
62581A030416J2205O017o14p376j3774j9467k4181k7754l0438l2666l4352l4845
62569H23171l3899l2205l0601k9136k7318k5018k2689k0808j9458j8329j6832
62558E46878j4527j1648r122p629o911o249n402m588l793k705j350k55J77R5j05
62543D72866j98j27J20M64P86J146J729K493L089L259L157L096L170L290L471
62528E01811L910M763N994P488R243J1352J3726J5984J7807J9372K1191K3476
62516F56117K5932K8419L1455L5625M0586M5078M8124M9858N1063N2055N2324
62505A116636N1184M8446M4269L8504L0720K1162J1257K600m530j1082j7611k3452
62493A308103k7712l0336l1613l1204k8538k3901j8383j2843p551k687J675O113
$$ plain form
62481 1101123 1112634 1130456 1154246 1182581 1214270 1249034 1286745 1326298 1365345 1400945 1430456
62470 1430456 1452168 1465504 1470750 1468464 1458825 1441240 1414626 1378398 1333405 1281787 1225879 1167467
62458 1167467 1107981 1048858 991340 936273 884447 836861 794272 756680 723710 695384 672053
62447 672053 653574 638957 626984 617012 609149 603802 601047 600345 600916 602373 604805 608250 612406 616978
62433 616978 621816 626475 630134 632371 633504 633671 631981 627305 619638 610011 599301 587870 576165 564774
62419 564774 553797 542948 532385 522715 514102 506142 498775 492488 487341 482585 477633 472675 467917
62406 467917 462961 457595 452565 448832 446445 444772 443478 442566 441762 440597 439061 437608 436563 435987 436052
62391 436052 437073 439135 441972 445160 448094 450029 450647 450562 450849 452113 454360 457612 462085 467732 474102
$$ packed form
62481A101123J1511J7822K3790K8335L1689L4764L7711L9553L9047L5600K9511
62470A430456K1712J3336N246k286r639j7585k6614l6228m4993n1618n5908n8412
62458A167467n9486n9123n7518n5067n1826m7586m2589l7592l2970k8326k3331
62447F72053j8479j4617j1973r972p863n347k755p02N71J457K432L445M156M572
62433F16978M838M659L659K237J133J67j690m676p667r627j0710j1431j1705j1391
62419E64774j0977j0849j0563r670q613p960p367o287n147m756m952m958m758
62406D67917m956n366n030l733k387j673j294r12q04j165j536j453j045n76O5
62391D36052J021K062K837L188K934J935O18q5K87J264K247L252M473N647O370
$$ plain form
62376 474102 480810 487761 494824 501767 508766 516588 525881 536463 547719 559635 573097 588973 607189
62363 607189 627051 648397 672014 698710 728414 760658 795765 834963 879314 929093 984156
62352 984156 1044064 1107404 1171673 1234490 1294494 1350519 1400450 1441814 1473311 1494918 1506733
62341 1506733 1508707 1501636 1487304 1467010 1440582 1407422 1368089 1324374 1278191 1230994 1184017 1138430
62329 1138430 1095171 1054999 1018672 986638 958482 933091 909572 887784 867847 849415 831719
62318 831719 814177 796584 778713 760082 740340 719680 698680 677946 658132 640081 624361
62307 624361 610610 597769 585178 573163 562435 553251 545401 538637 532737 527406 522498 518219 514779
62294 514779 512043 509823 508269 507564 507393 507225 507029 507249 508127 509523 511396 513925 517054 520457 524086 528334
$$ packed form
62376D74102O708O951P063O943O999P822R293J0582J1256J1916J3462J5876J8216
62363F07189J9862K1346K3617K6696K9704L2244L5107L9198M4351M9779N5063
62352I84156N9908O3340O4269O2817O0004N6025M9931M1364L1497K1607J1815
62341A506733J974p071j4332k0294k6428l3160l9333m3715m6183m7197m6977m5587
62329A138430m3259m0172l6327l2034k8156k5391k3519k1788j9937j8432j7696
62318H31719j7542j7593j7871j8631j9742k0660k1000k0734j9814j8051j5720
62307F24361j3751j2841j2591j2015j0728r184p850o764n900n331m908m279l440
62294E14779k736k220j554p05j71j68j96K20Q78J396J873K529L129L403L629M248
$$ plain form
62278 528334 533401 538937 544503 550016 555521 560945 566419 572522 579853 588565 598573 609928 622627
62265 622627 636408 651196 667625 686658 708781 734014 762640 795362 832622 874292 920318
62254 920318 971261 1027761 1089616 1155725 1224713 1295149 1365090 1431858 1492610 1544997 1587285
62243 1587285 1618248 1637453 1645531 1643727 1633005 1613754 1586290 1551232 1509265 1460936 1407011 1348776
62231 1348776 1287720 1225149 1162427 1101289 1043461 989936 940928 896472 856721 821710 791190
62220 791190 764719 741633 720965 701836 684065 668083 654096 641608 629899 618721 608319
62209 608319 598928 590450 582640 575518 569565 565335 562748 560996 559446 558419 558640 560003 561463 562258 562747
62194 562747 563809 565840 568682 572242 576825 582928 590809 600133 610020 619751 629523 640179 652095 664703
$$ packed form
62278E28334N067N536N566N513N505N424N474O103P331Q712J0008J1355J2699
62265F22627J3781J4788J6429J9033K2123K5233K8626L2722L7260M1670M6026
62254I20318N0943N6500O1855O6109O8988P0436O9941O6768O0752N2387M2288
62243A587285L0963J9205Q078j804j0722j9251k7464l5058m1967m8329n3925n8235
62231A348776o1056o2571o2722o1138n7828n3525m9008m4456l9751l5011l0520
62220G91190k6471k3086k0668j9129j7771j5982j3987j2488j1709j1178j0402
62209F08319r391q478p810p122n953m230k587j752j550j027K21J363J460P95M89
62194E62747J062K031K842L560M583O103P881R324R887R731R772J0656J1916J2608
$$ plain form
62180 664703 677204 689294 700906 711708 721265 729452 736361 742193 747592 753766 761784 771908 784057
62167 784057 798686 816728 838847 865259 896240 932191 973006 1017677 1064639 1112299 1159155
62156 1159155 1203597 1243703 1277266 1302345 1318179 1325500 1325757 1320110 1309257 1293689 1273528 1248347
62144 1248347 1217859 1182892 1145194 1106280 1066981 1028187 991356 957942 928668 903576 882411
62133 882411 864729 850018 838144 829447 824030 820996 818667 815645 811682 807684 804825 803427 802641 801446
62119 801446 799868 798851 798917 799536 799967 800136 800249 800063 799158 797628 795810 793412 789559 783816 776646 768732
62103 768732 760300 751367 742306 733777 726211 719610 713849 708952 705048 702145 700098 698922 699077 701143
62089 701143 705037 709758 714260 718471 723204 729098 736053 743737 752202 761797 772755 785157 799132
$$ packed form
62180F64703J2501J2090J1612J0802R557Q187O909N832N399O174Q018J0124J2149
62167G84057J4629J8042K2119K6412L0981L5951M0815M4671M6962M7660M6856
62156A159155M4442M0106L3563K5079J5834P321K57n647j0853j5568k0161k5181
62144A248347l0488l4967l7698l8914l9299l8794l6831l3414k9274k5092k1165
62133H82411j7682j4711j1874q697n417l034k329l022l963l998k859j398p86j195
62119H01446j578j017O6O19M31J69J13j86r05j530j818k398l853n743p170p914
62103G68732q432q933r061q529p566o601n761m897l904k903k047j176J55K066
62089G01143L894M721M502M211M733N894O955P684Q465R595J0958J2402J3975
$$ plain form
62076 799132 814821 832181 850970 870848 891435 912374 933464 954644 975780 996710 1017610
62065 1017610 1039099 1061789 1085943 1111774 1139777 1170365 1203257 1237581 1272393 1306602 1338395
62054 1338395 1365382 1385731 1398972 1405575 1406056 1400750 1390103 1374682 1354867 1330721 1302158 1269084
62042 1269084 1231502 1189692 1144400 1096819 1048465 1000972 955663 913113 873306 836331 802653
62031 802653 772469 745288 720579 698554 679682 663533 648817 634692 621464 609753 599493
62020 599493 590060 580903 571611 561756 551279 540861 531363 522911 514924 507034 499526 492817 486975 481958
62006 481958 477949 475097 473169 471811 471095 471508 473361 476441 480259 484382 488409 491856 494377 496136 497776
61991 497776 499838 502199 504067 504541 503234 500493 497085 493623 490247 486784 483088 479042 474342 468591
$$ packed form
62076G99132J5689J7360J8789J9878K0587K0939K1090K1180K1136K0930K0900
62065A017610K1489K2690K4154K5831K8003L0588L2892L4324L4812L4209L1793
62054A338395K6987K0349J3241O603M81n306j0647j5421j9815k4146k8563l3074
62042A269084l7582m1810m5292m7581m8354m7493m5309m2550l9807l6975l3678
62031H02653l0184k7181k4709k2025j8872j6149j4716j4125j3228j1711j0260
62020E99493r433r157r292r855j0477j0418r498q452p987p890p508o709n842n017
62006D81958m009k852j928j358p16M13J853L080L818M123M027L447K521J759J640
61991D97776K062K361J868M74j307k741l408l462l376l463l696m046m700n751
$$ plain form
61977 468591 461825 454792 448467 443299 439037 435264 431918 429250 427391 426048 424653 422850 420779 418791
61963 418791 416970 415121 413224 411575 410371 409490 408868 408779 409380 410304 411141 412095 413720 416093 418817 421794
61947 421794 425433 429998 435195 440636 446322 452529 459479 467285 475944 485393 495795 507623 520922
61934 520922 534602 547204 558569 570003 582484 595377 607360 617937 627397 635861 643158 649303
61922 649303 654327 657779 659075 658263 655864 652126 647112 641432 636127 631691 627858 624530 622346 622067 623888
61907 623888 627658 633362 641021 650420 661268 673427 686591 699777 711481 720487 726507 730023 731526
61894 731526 730969 727986 722488 714908 705924 696241 686636 677771 669718 661965 654133 646395 638984 631749
61880 631749 624478 617185 609627 601047 591110 580703 571057 562318 553780 545279 537378 530237 523414 517019
$$ packed form
61977D68591o766p033o325n168m262l773l346k668j859j343j395j803k071j988
61963D18791j821j849j897j649j204q81o22q9O01R24Q37R54J625K373K724K977
61947D21794L639M565N197N441N686O207O950P806Q659R449J0402J1828J3299
61934E20922J3680J2602J1365J1434J2481J2893J1983J0577R460Q464P297O145
61922F49303N024L452J296q12k399l738n014n680n305m436l833l328k184k79J821
61907F23888L770N704P659R399J0848J2159J3164J3186J1704R006O020L516J503
61894G31526n57k983n498p580q984r683r605q865q053p753p832p738p411p235
61880F31749p271p293p558q580r937j0407r646q739q538q501p901p141o823o395
$$ plain form
61866 517019 512036 509050 507470 506499 506120 506591 507768 509659 513087 518943 527064 536517 546777 558037
61852 558037 570639 584873 601211 619963 640637 662146 683767 705462 727253 748721 769323
61841 769323 788780 806896 823156 836704 846676 852525 854148 851850 846234 838184 828801 819161 810077
61828 810077 802232 796393 793123 792299 793379 796244 801364 808895 818145 828204 838487 848144 855459 858706
61814 858706 857439 852284 843573 830977 814569 795473 775116 754287 733246 712361 692181 673074
61802 673074 655133 638366 622824 608548 595519 583657 572852 563043 554199 546176 538701 531693
61790 531693 525424 520062 515116 509708 503560 497463 492591 489447 487561 486067 484431 482656 480970 479413
61776 479413 477765 475842 473656 471256 468666 466112 464088 462862 462080 461189 460235 459838 460286 461018 461247 460882
$$ packed form
61866E17019m983k986j580r71l79M71J177J891L428N856Q121R453J0260J1260
61852E58037J2602J4234J6338J8752K0674K1509K1621K1695K1791K1468K0602
61841G69323J9457J8116J6260J3548R972N849J623k298n616q050r383r640r084
61828H10077p845n839l270q24J080K865N120P531R250J0059J0283R657P315L247
61814H58706j267n155q711j2596j6408j9096k0357k0829k1041k0885k0180j9107
61802F73074j7941j6767j5542j4276j3029j1862j0805r809q844q023p475p008
61790E31693o269n362m946n408o148o097m872l144j886j494j636j775j686j557
61776D79413j648j923k186k400k590k554k024j226p82q91r54l97M48P32K29l65
$$ plain form
61760 460882 460524 460650 461142 461754 462773 464835 467958 471105 473074 473714 473883 474242 474544 474208 473071 471291
61744 471291 469036 466700 465006 464269 463802 462655 460769 458740 456634 453902 450601 447828 446514 446398 446696
61729 446696 447232 448297 449777 451126 452199 453461 455302 457534 459711 461624 463357 465141 467287 470029
61715 470029 473185 476092 478079 479045 479391 479397 478836 477287 474721 471647 468699 466176 463912 461395 458036 453618
61699 453618 448580 443722 439547 436032 433019 430387 427689 424168 419634 415023 411478 409008 406634 403812
61685 403812 400988 398644 396526 394212 391873 389941 388331 386551 384388 382027 379621 377187 374959 373413
61671 373413 372776 372703 372581 372063 371283 370645 370465 370742 371241 371742 372143 372403 372571 372935 373896 375524 377386 378931
61653 378931 379932 380426 380482 380257 380101 380334 380959 381862 383204 385314 388189 391403 394572 397644 400650 403411
$$ packed form
61760D60882l58J26M92O12J019K062L123L147J969O40J69L59L02l36j137j780
61744D71291k255k336j694p37m67j147j886k029k106k732l301k773j314j16K98
61729D46696N36J065J480J349J073J262J841K232K177J913J733J784K146K742
61715D70029L156K907J987R66L46On61j549k566l074k948k523k264k517l359m418
61699D53618n038m858m175l515l013k632k698l521m534m611l545k470k374k822
61685D03812k824k344k118k314k339j932j610j780k163k361k406k434k228j546
61671C73413o37p3j22n18p80o38j80K77M99N01M01K60J68L64R61J628J862J545
61653C78931J001M94N6k25j56K33O25R03J342K110K875L214L169L072L006K761
$$ plain form
61637 403411 405699 407487 408808 409448 409059 407602 405507 403289 401141 399011 396887 394787 392545 389934 387143
61622 387143 384850 383566 383015 382417 381284 379712 378039 376585 375677 375451 375427 374707 372877 370466 368178 365944
61606 365944 363118 359402 355156 350783 346312 341732 337442 334075 331960 330865 330230 329638 329109 328947 329163
61591 329163 329080 327771 325014 321653 318806 316793 314997 312770 310264 308292 307495 307808 308703 309654 310253 310086
61575 310086 308891 306918 304872 303289 302072 300768 299216 297743 296812 296658 297203 298138 299054 299611 299682 299317
61559 299317 298650 297943 297604 297958 299005 300571 302672 305475 308855 312258 315156 317445 319283 320744 321894
61544 321894 322989 324233 325320 325580 324659 322835 320631 318444 316698 315983 316625 318252 320115 321836 323529
61529 323529 325243 326675 327502 327660 327170 326060 324637 323502 322967 322764 322603 322709 323340 324035 324011 323280 322764
$$ packed form
61637D03411K288J788J321O40l89j457k095k218k148k130k124k100k242k611k791
61622C87143k293j284n51n98j133j572j673j454r08k26k4p20j830k411k288k234
61606C65944k826l716m246m373m471m580m290l367k115j095o35n92n29j62K16
61591C29163q3j309k757l361k847k013j796k227k506j972p97L13Q95R51N99j67
61575C10086j195j973k046j583j217j304j552j473r31j54N45R35R16N57P1l65
61559B99317o67p07l39L54J047J566K101K803L380L403K898K289J838J461J150
61544C21894J095J244J087K60r21j824k204k187j746p15O42J627J863J721J693
61529C23529J714J432Q27J58m90j110j423j135n35k03j61J06O31O95k4p31n16
$$ plain form
61512 322764 323118 323975 324614 324895 325171 325594 325975 326136 326035 325625 324875 323915 322924 321975 321163 320668 320432 319938 318809
61493 318809 317505 316926 317225 317486 316785 315259 313832 313173 313234 313616 314025 314387 314827 315601 316828 318248 319427
61476 319427 320309 321359 323066 325391 327835 329939 331561 332775 333758 334798 336123 337512 338269 337871 336648
61461 336648 335605 335488 336165 336918 337156 336812 336249 336014 336481 337550 338684 339429 339869 340441 341382 342564 343869
61444 343869 345366 346999 348374 349196 349778 350755 352262 353791 355019 356387 358467 361032 363251 364727 365784
61429 365784 366651 367099 367172 367598 368773 369804 369509 368255 367854 369369 371840 373614 374254 374568 375319 376689 378639
61412 378639 380908 382668 382982 381886 380463 379520 378671 377037 374507 371862 369824 368370 366959 365156 362959
61397 362959 360747 358993 357948 357526 357477 357587 357673 357518 357068 356688 357036 358485 360709 362972 364809 366326 367885
$$ packed form
61512C22764L54Q57O39K81K76M23L81J61j01m10p50r60r91r49q12m95k36m94j129
61493C18809j304n79K99K61p01j526j427o59O1L82M09L62M40P74J227J420J179
61476C19427Q82J050J707K325K444K104J622J214R83J040J325J389P57l98j223
61461C36648j043j17O77P53K38l44n63k35M67J069J134P45M40N72R41J182J305
61444C43869J497J633J375Q22N82R77J507J529J228J368K080K565K219J476J057
61429C65784Q67M48P3M26J175J031k95j254m01J515K471J774O40L14P51J370J950
61412C78639K269J760L14j096j423r43q49j634k530k645k038j454j411j803k197
61397C62959k212j754j045m22m9J10Q6j55m50l80L48J449K224K263J837J517J559
$$ plain form
61380 367885 369660 371544 373361 374958 376256 377330 378413 379665 381016 382395 384000 386033 388266 390216
61366 390216 391823 393526 395508 397251 398199 398527 398902 399618 400390 400919 401306 401871 402891 404499 406607 408925
61350 408925 411293 414052 417801 422705 428186 433398 437902 441960 446314 451643 458037 465009 472103 479344
61336 479344 486818 494033 500144 504890 508877 512812 516825 520663 524110 526921 528667 529139 528831 528620 528863
61321 528863 529072 528588 527417 526261 525804 526182 527269 529315 532932 538351 544981 552015 559247 566950 575129
61306 575129 583406 591709 600541 610358 620981 631821 642325 652036 660628 668185 675120 681420 686257
61293 686257 688780 689059 687748 684948 680020 672624 663462 653722 644127 634793 625735 617085 608846 600749
61279 600749 592564 584474 576998 570511 564959 560155 556247 553556 551953 550719 549296 547929 547294 547623 548565
$$ packed form
61380C67885J775J884J817J597J298J074J083J252J351J379J605K033K233J950
61366C90216J607J703J982J743R48L28L75P16P72N29L87N65J020J608K108K318
61350D08925K368K759L749M904N481N212M504M058M354N329O394O972P094P241
61336D79344P474P215O111M746L987L935M013L838L447K811J746M72l08k11K43
61321E28863K09m84j171j156m57L78J087K046L617N419O630P034P232P703Q179
61306E75129Q277Q303Q832R817J0623J0840J0504R711Q592P557O935O300M837
61293F86257K523K79j311k800m928p396r162r740r595r334r058q650q239q097
61279F00749q185q090p476o487n552m804l908k691j603j234j423j367o35L29R42
$$ plain form
61264 548565 549856 551710 554417 557804 561230 564056 566132 568052 570920 575560 581806 588782 595919 603398
61250 603398 611425 619449 626520 632280 637174 641673 645672 648785 650810 651684 651257 649564 647204 644943 642837
61235 642837 640211 636766 633324 631095 630446 630938 632401 635279 639759 645204 650807 656408 662280 668585 675512
61220 675512 683576 693101 703545 713941 723943 733843 743646 752899 761536 770154 779017 787464 794738
61207 794738 800955 806782 812533 818111 823445 828433 832698 836071 839149 842758 846957 851233 855667 861163
61193 861163 868213 876004 883102 888747 893272 897589 902457 907853 912761 915873 916746 916117 914939 913503 911665
61178 911665 909446 906957 904075 900736 897389 894637 892533 890635 888642 886504 883982 880687 876611 872092
61164 872092 867073 860900 853145 844252 834993 825535 815436 804421 792794 781074 769465 757790 745842
$$ packed form
61264E48565J291J854K707L387L426K826K076J920K868M640O246O976P137P479
61250F03398Q027Q024P071N760M894M499L999L113K025Q74m27j693k360k261k106
61235F42837k626l445l442k229o49M92J463K878M480N445N603N601N872O305O927
61220F75512Q064R525J0444J0396J0002R900R803R253Q637Q618Q863Q447P274
61207G94738O217N827N751N578N334M988M265L373L078L609M199M276M434N496
61193H61163P050P791P098N645M525M317M868N396M908L112Q73o29j178j436j838
61178I11665k219k489k882l339l347k752k104j898j993k138k522l295m076m519
61164H72092n019o173p755q893r259r458j0099j1015j1627j1720j1609j1675j1948
$$ plain form
61151 745842 733754 722059 711372 702029 694037 687212 681182 675418 669629 664185 659829 656833 654743
61138 654743 653098 652066 652142 653465 655721 658512 661563 664772 668323 672616 677841 683808 690477 698383 708127
61123 708127 719597 732195 745737 760647 777212 795176 814252 834601 856524 879949 904444
61112 904444 929522 954780 979958 1005026 1029967 1054317 1077232 1098277 1117945 1137006 1155421
61101 1155421 1172184 1186222 1197172 1205254 1210689 1213479 1213637 1211325 1206607 1199246 1189080 1176678 1163206
61088 1163206 1149355 1134612 1118050 1099698 1080647 1061871 1043583 1025897 1009346 994222 979952
61077 979952 965874 952371 940559 930985 923299 917160 912700 909882 908045 906578 905671 905991 907826 910885
61063 910885 914786 919476 925261 932680 942171 953604 966196 979152 992394 1006523 1022204 1039820
$$ packed form
61151G45842j2088j1695j0687r343p992o825o030n764n789n444m356k996k090
61138F54743j645j032P6J323K256K791L051L209L551M293N225N967O669P906R744
61123G08127J1470J2598J3542J4910J6565J7964J9076K0349K1923K3425K4495
61112I04444K5078K5258K5178K5068K4941K4350K2915K1045J9668J9061J8415
61101A155421J6763J4038J0950Q082N435K790J58k312m718p361j0166j2402j3472
61088A163206j3851j4743j6562j8352j9051j8776j8288j7686j6551j5124j4270
61077I79952j4078j3503j1812r574p686o139m460k818j837j467r07L20J835L059
61063I10885L901M690N785P419R491J1433J2592J2956J3242J4129J5681J7616
$$ plain form
61051 1039820 1059522 1081168 1104142 1127734 1152056 1178362 1208067 1241359 1277045 1313879 1351862
61040 1351862 1392066 1435337 1481473 1529753 1579927 1632396 1687515 1745149 1805080 1867565 1933239
61029 1933239 2002578 2075731 2152826 2234142 2319918 2410306 2505710 2607052 2715431 2831566 2955819
61018 2955819 3088854 3232144 3387693 3557393 3742927 3946315 4170342 4418217 4693005
61009 4693005 4997733 5336046 5712374 6131215 6596434 7111543 7680418 8307109 8994464
61000 8994464 9742649 10548420 11404907 12301325 13222666 14149659 15059044 15924319 16717378
60991 16717378 17410951 17980821 18407027 18674444 18773502 18700862 18459454 18058106 17511435 16839690
60981 16839690 16067520 15221653 14328750 13414192 12501144 11609227 10753326 9943358 9185008
$$ packed form
61051A039820J9702K1646K2974K3592K4322K6306K9705L3292L5686L6834L7983
61040A351862M0204M3271M6136M8280N0174N2469N5119N7634N9931O2485O5674
61029A933239O9339P3153P7095Q1316Q5776R0388R5404J01342J08379J16135J24253
61018B955819J33035J43290J55549J69700J85534K03388K24027K47875K74788
61009D693005L04728L38313L76328M18841M65219N15109N68875O26691O87355
61000H994464P48185Q05771Q56487Q96418R21341R26993R09385Q65275P93059
60991A6717378O93573N69870M26206K67417R9058p2640k41408m01348n46671o71745
60981A6839690p72170q45867q92903r14558r13048q91917q55901q09968p58350
$$ plain form
60972 9185008 8480890 7831795 7237511 6696697 6206230 5761464 5357761 4991712 4660637
60963 4660637 4361351 4090128 3843795 3620232 3417668 3234003 3066981 2914592 2775028
60954 2775028 2646606 2528011 2418339 2316690 2221965 2133282 2050395 1973395 1902094 1835884
60944 1835884 1774082 1716223 1662083 1611520 1564208 1519381 1476052 1433655 1392356 1352593 1314488
60933 1314488 1277848 1242564 1208733 1176402 1145434 1115663 1087093 1059994 1034795 1011712 990384
60922 990384 970044 950208 931036 912943 896120 880618 866582 854032 842555 831572 820844
60911 820844 810436 800367 790714 781935 774559 768462 762923 757527 752505 748034 743693 739041 734358 730278
60897 730278 726842 723401 719468 715245 711236 707630 704214 700616 696531 691951 687272 682929 678710 673642
$$ packed form
60972I185008p04118o49095n94284n40814m90467m44766m03703l66049l31075
60963D660637k99286k71223k46333k23563k02564j83665j67022j52389j39564
60954B775028j28422j18595j09672j01649r4725q8683q2887p7000p1301o6210
60944A835884o1802n7859n4140n0563m7312m4827m3329m2397m1299l9763l8105
60933A314488l6640l5284l3831l2331l0968k9771k8570k7099k5199k3083k1328
60922I90384k0340j9836j9172j8093j6823j5502j4036j2550j1477j0983j0728
60911H20844j0408j0069r653q779p376o097n539n396n022m471m341m652m683m080
60897G30278l436l441l933m223m009l606l416l598m085m580m679m343m219n068
$$ plain form
60883 673642 666861 658550 649740 641284 633269 625412 617623 610009 602659 595651 589130 583093 577242 571302
60869 571302 565413 559950 555075 550732 546960 543834 541094 538300 535411 532835 530775 528962 527325 526474
60855 526474 527047 528785 530622 531637 531604 530805 529699 528724 528052 527506 526944 526649 527078 528311 530035 531903 533501
60838 533501 534080 533008 530610 527948 525439 522238 517479 511689 506314 502028 498300 494726 491958 490744
60824 490744 490497 489645 487453 484822 482974 481843 480294 477679 474504 471534 468893 466313 463745 461252 458629
60809 458629 455650 452571 449898 447708 445540 442943 439839 436416 433016 429976 427177 423874 419541 414918
60795 414918 411601 410317 410073 409278 407283 404586 401998 400055 398960 398558 398349 397858 396944 395683 394156 392589
60779 392589 391477 391160 391353 391396 391015 390586 390703 391652 393292 395257 397266 399380 401943 405251 409305 413888
$$ packed form
60883F73642o781q311q810q456q015p857p789p614p350p008o521o037n851n940
60869E71302n889n463m875m343l772l126k740k794k889k576k060j813j637q51
60855E26474N73J738J837J015l3p99j106r75o72n46n62k95M29J233J724J868J598
60838E33501N79j072k398k662k509l201m759n790n375m286l728l574k768j214
60824D90744k47q52k192k631j848j131j549k615l175k970k641k580k568k493k623
60809D58629k979l079k673k190k168k597l104l423l400l040k799l303m333m623
60795D14918l317j284k44p95j995k697k588j943j095m02k09m91r14j261j527j567
60779C92589j112l17J93M3l81m29J17R49J640J965K009K114K563L308M054M583
$$ plain form
60763 413888 418679 423201 426948 429736 431817 433433 434465 434708 434273 433461 432374 430912 429072 426992 424805
60748 424805 422720 421142 420416 420472 420973 421708 422577 423278 423360 422600 421036 418614 415115 410525 405227 399750 394483
60731 394483 389602 385058 380602 376073 371702 367965 365153 363281 362330 362216 362508 362581 362226 361839 361791 361826 361334
60714 361334 360095 358572 357511 357314 357730 358090 357949 357554 357618 358627 360424 362366 363709 363950 363191 362255 362169
60697 362169 363342 365351 367522 369480 371154 372681 374487 377104 380548 384062 386805 388697 390385 392438
60683 392438 394780 396861 398189 398735 398988 399569 400675 401973 403068 403920 404698 405474 406297 407357 408733 410057
60667 410057 410730 410459 409358 407501 404725 401000 396800 392894 389795 387534 385900 384819 384338 384300 384281 384077
60651 384077 384183 385406 387941 391084 394033 396614 398981 400912 401895 401768 400903 399705 398294 396663 394838
$$ packed form
60763D13888M791M522L747K788K081J616J032K43m35q12j087j462j840k080k187
60748D24805k085j578p26N6N01P35Q69P01Q2p60j564k422l499m590n298n477n267
60731C94483m881m544m456m529m371l737k812j872r51j14K92P3l55l87m8L5m92
60714C61334j239j523j061j97M16L60j41l95O4J009J797J942J343K41p59r36q6
60697C62169J173K009K171J958J674J527J806K617L444L514K743J892J688K053
60683C92438K342K081J328N46K53N81J106J298J095Q52P78P76Q23J060J376J324
60667D10057O73k71j101j857k776l725m200l906l099k261j634j081m81l8j9k04
60651C84077J06J223K535L143K949K581K367J931R83j27q65j198j411j631j825
$$ plain form
60636 394838 392806 390576 388375 386554 385197 384068 382964 381884 380830 379778 378935 378688 379075 379593 379740
60621 379740 379582 379530 379750 380036 380186 380208 380202 380207 380217 380196 380123 380103 380365 381044 382052 383189 384255 384972 385044 384589 384362
60600 384362 385159 386928 388716 389583 389380 388622 387917 387703 388320 389923 392263 394683 396533 397610 398199 398706
60584 398706 399210 399448 399247 398877 398848 399365 400205 401215 402704 405021 407847 410358 412341 414797 419014 425137
60568 425137 432111 439032 446028 453553 461403 468995 476259 483438 490038 494777 496919 497113 496577 495916 495129
60553 495129 494239 493314 492156 490661 489345 488940 489512 490607 492236 494981 498910 503093 506634 509766 513496
60538 513496 518481 524676 531780 539543 547694 555961 564173 572157 579589 586124 591561 595745 598496 599855
60524 599855 600149 599586 598073 595745 593358 591640 590422 588949 586995 585106 583746 582802 582107 581891 582356 583292
$$ packed form
60636C94838k032k230k201j821j357j129j104j080j054j052q43k47L87N18J47
60621C79740j58n2K20K86J50K2oNJ0k1p3k0K62O79J008J137J066P17P2m55k27
60600C84362P97J769J788Q67k03p58p05k14O17J603K340K420J850J077N89N07
60584C98706N04K38k01l70k9N17Q40J010J489K317K826K511J983K456M217O123
60568D25137O974O921O996P525P850P592P264P179O600M739K142J94n36o61p87
60553D95129q90r25j158j495j316m05N72J095J629K745L929M183L541L132L730
60538E13496M985O195P104P763Q151Q267Q212P984P432O535N437M184K751J359
60524E99855K94n63j513k328k387j718j218j473j954j889j360r44o95k16M65R36
$$ plain form
60508 583292 584496 586325 589413 594055 600179 607685 616481 626271 636769 648219 661448 677276 695876
60495 695876 716679 738766 761424 784373 807393 829727 850055 867188 880636 890340 896108 897591
60483 897591 894766 888164 878592 866672 852585 836150 817282 796436 774465 751923 728818 705254
60471 705254 682025 660194 640218 621839 604666 588490 573162 558678 545357 533548 523124
60460 523124 513655 504976 497095 489607 481928 474270 467625 462382 457636 452480 447434 443807 441949 440968
60446 440968 440008 438901 437434 434920 431073 426779 423382 421383 420286 419516 419004 418831 418742 418206 416863 414840
60430 414840 412730 411184 410373 409776 408672 406889 404973 403603 402981 402879 403026 403277 403481 403501 403429 403571 404136
60413 404136 405067 406275 407813 409631 411355 412624 413611 414863 416598 418451 420059 421544 423105 424395 424791
$$ packed form
60508E83292J204J829L088M642O124P506Q796R790J0498J1450J3229J5828J8600
60495F95876K0803K2087K2658K2949K3020K2334K0328J7133J3448R704N768J483
60483H97591k825o602r572j1920j4087j6435j8868k0846k1971k2542k3105k3564
60471G05254k3229k1831j9976j8379j7173j6176j5328j4484j3321j1809j0424
60460E23124r469q679p881p488p679p658o645n243m746n156n046l627j858r81
60446D40968r60j107j467k514l847m294l397j999j097p70n12j73q9n36j343k023
60430D14840k110j546q11n97j104j783j916j370o22j02J47K51K04K0p2J42N65
60413D04136R31J208J538J818J724J269R87J252J735J853J608J485J561J290L96
$$ plain form
60398 424791 424318 423921 424522 426078 427841 429462 431393 434063 437037 439469 441296 443419 446521 450153 453367
60383 453367 455907 458242 460630 462794 464585 466322 468271 470253 472035 473688 475305 476815 478393 480540
60369 480540 483353 486107 488122 489672 491491 493716 495995 498341 501069 503963 506362 508160 510015 512462
60355 512462 515557 519558 525089 532197 539997 547753 555751 564562 573987 583311 592072 599873 605839 609093
60341 609093 609685 608381 605640 601403 595782 589296 582343 574996 567437 560081 553211 546874 541188 536335
60327 536335 532160 528266 524592 521491 519133 517243 515491 513719 511752 509502 507461 506550 507164 508771 510699
60312 510699 512937 515887 519798 524848 531407 539739 549691 561121 574411 590164 608420 628375 648554
60299 648554 666940 681358 690477 694427 693992 689299 679817 665551 647640 627693 607141 587459 570333
$$ packed form
60398D24791m73l97O01J556J763J621J931K670K974K432J827K123L102L632L214
60383D53367K540K335K388K164J791J737J949J982J782J653J617J510J578K147
60369D80540K813K754K015J550J819K225K279K346K728K894K399J798J855K447
60355E12462L095M001N531P108P800P756P998Q811R425R324Q761P801N966L254
60341F09093N92j304k741m237n621o486o953p347p559p356o870o337n686m853
60327E36335m175l894l674l101k358j890j752j772j967k250k041r11O14J607J928
60312E10699K238K950L911N050O559Q332R952J1430J3290J5753J8256J9955K0179
60299F48554J8386J4418R119L950m35m693r482j4266j7911j9947k0552j9682j7126
$$ plain form
60286 570333 556949 547166 539722 533273 527227 521836 517674 514915 512964 510949 508607 506366 504408 502029
60272 502029 498337 493428 488400 484227 480968 478150 475515 473094 470764 468131 465026 461936 459692 458609
60258 458609 458048 457035 455319 453639 452849 453020 453566 454061 454566 455235 455969 456538 456774 456501 455607 454455 453943
60241 453943 454758 456606 458474 459693 460419 461083 461746 462232 462644 463365 464608 466184 467763 469262 470947 473186
60225 473186 476067 479194 481987 484228 486185 488091 489765 491066 492544 495183 499351 504376 509359 514145
60211 514145 519199 524740 530413 535909 541564 548089 555735 563963 571968 579365 586222 592604 598442 603899
60197 603899 609414 615117 620413 624525 627320 629274 630772 631845 632522 632885 632754 631861 630434 629031 627549
60182 627549 625038 620941 615982 611198 606571 601335 595368 589426 583975 578620 572980 567482 562887 559413
$$ packed form
60286E70333j3384r783p444o449o046n391m162k759j951k015k342k241j958k379
60272E02029l692m909n028m173l259k818k635k421k330k633l105l090k244j083
60258D58609n61j013j716j680p90J71N46M95N05O69P34N69K36k73q94j152n12
60241D53943Q15J848J868J219P26O64O63M86M12P21J243J576J579J499J685K239
60225D73186K881L127K793K241J957J906J674J301J478K639M168N025M983M786
60211E14145N054N541N673N496N655O525P646Q228Q005P397O857O382N838N457
60197F03899N515N703N296M112K795J954J498J073O77L63j31q93j427j403j482
60182F27549k511m097m959m784m627n236n967n942n451n355n640n498m595l474
$$ plain form
60168 559413 556674 554254 552026 550113 548713 547839 547092 545930 544254 542524 541067 539566 537511 535031 533023
60153 533023 532455 533609 535902 538313 540095 541202 542066 543057 544338 546157 548856 552427 556331 560038 563625
60138 563625 567689 572871 579580 587853 597214 606798 615932 624439 632245 638976 644341 648741 652970 657294
60124 657294 661191 664066 665850 666826 667275 667484 667775 668233 668649 668985 669681 671133 673007 674494 675289 675958 677187
60107 677187 678973 680799 682318 683469 684028 683503 681645 678788 675487 672003 668361 664711 661351 658427 655846
60092 655846 653522 651564 650227 649759 650210 651224 652176 652688 652894 653027 653000 652756 652750 653428 654274 654105 652563 650668
60074 650668 649506 648895 647764 645323 641263 635335 627621 619116 611140 604010 596876 589071 581031 573646
60060 573646 567218 561445 556067 551126 546772 543151 540320 538007 535585 532624 529433 526870 525588 525608 526520
$$ packed form
60168E59413k739k420k228j913j400q74p47j162j676j730j457j501k055k480k008
60153E33023n68J154K293K411J782J107Q64R91J281J819K699L571L904L707L587
60138E63625M064N182O709Q273R361R584R134Q507P806O731N365M400M229M324
60124F57294L897K875J784R76M49K09K91M58M16L36O96J452J874J487P95O69J229
60107F77187J786J826J519J151N59n25j858k857l301l484l642l650l360k924k581
60092F55846k324j958j337m68M51J014R52N12K06J33k7k44oO78Q46j69j542j895
60074F50668j162o11j131k441m060n928p714q505p976p130p134p805q040p385
60060E73646o428n773n378m941m354l621k831k313k422k961l191k563j282K0R12
$$ plain form
60045 526520 527924 529655 531788 534597 538394 543304 549066 555099 560908 566482 572158 577937 583079 586672
60031 586672 588554 589448 590133 590707 590705 589640 587352 584057 580181 575982 571198 565307 558243 550624 543099 535745
60015 535745 528302 520741 513290 506086 499185 492777 487026 481760 476737 472211 468797 466640 465099 463457
60001 463457 461662 460165 459303 459054 459147 459118 458487 457283 456288 456387 457701 459650 461845 464485 467779 471413 474882
59984 474882 478059 481136 484205 487187 490019 492579 494479 495231 494682 493096 490884 488444 486104 483866 481284
59969 481284 478037 474648 472244 471457 471929 472969 474261 475739 477303 479041 481327 484198 486914 488608 489209
59954 489209 489343 489599 490397 492204 495093 498101 499781 499593 498229 496498 494567 492512 490813 489751 488837
59939 488837 487419 485565 483833 482432 481090 479641 478259 477163 476434 476074 476044 476397 477574 480258 484597
$$ packed form
60045E26520J404J731K133K809L797M910N762O033N809N574N676N779N142L593
60031E86672J882Q94O85N74kj065k288l295l876m199m784n891p064p619p525p354
60015E35745p443p561p451p204o901o408n751n266n023m526l414k157j541j642
60001D63457j795j497q62k49R3k9o31j204r95R9J314J949K195K640L294L634L469
59984D74882L177L077L069K982K832K560J900P52n49j586k212k440k340k238k582
59969D81284l247l389k404p87M72J040J292J478J564J738K286K871K716J694O01
59954D89209J34K56P98J807K889L008J680j88j364j731j931k055j699j062r14
59939D88837j418j854j732j401j342j449j382j096p29l60l0L53J177K684M339
$$ plain form
59924 484597 489816 495052 500254 505793 511493 516789 521739 527037 532833 538278 542595 545974 549012 551738
59910 551738 553752 555029 556049 557221 558597 560067 561525 562863 564092 565420 567010 568748 570434 572020
59896 572020 573386 574083 573786 572940 572506 572905 573612 574053 574614 576392 580014 584994 590263 595132 599615 604028
59880 604028 608495 612911 617239 621710 626648 632086 637533 642190 645481 647431 648389 648385 647004 644102 640423
59865 640423 637102 634582 632403 630127 628005 626491 625507 624620 623635 622573 621260 619502 617688 616679 616889
59850 616889 617865 618927 619979 621479 623872 627192 630961 634275 636220 636503 635619 634262 632725 630975 629072
59835 629072 627171 625193 622748 619455 615232 610409 605752 602253 600553 600437 601015 601453 601458 601137 600628 599909
59819 599909 598774 596786 593385 588250 581715 574788 568622 563812 560155 557069 554229 551711 549642 547923
$$ packed form
59924D84597N219N236N202N539N700N296M950N298N796N445M317L379L038K726
59910E51738K014J277J020J172J376J470J458J338J229J328J590J738J686J586
59896E72020J366O97k97q46m34L99P07M41N61J778L622M980N269M869M483M413
59880F04028M467M416M328M471M938N438N447M657L291J950R58mj381k902l679
59865F40423l321k520k179k276k122j514r84q87r85j062j313j758j814j009K10
59850F16889R76J062J052J500K393L320L769L314J945K83q84j357j537j750j903
59835F29072j901j978k445l293m223m823m657l499j700j16N78M38Nl21n09p19
59819E99909j135j988l401n135o535o927o166m810l657l086k840k518k069j719
$$ plain form
59805 547923 546415 545200 544483 544189 543808 542712 540714 538348 536441 535239 534027 531852 528587 524998 521810
59790 521810 519105 516681 514437 512185 509584 506770 504639 503918 504120 503990 502882 501237 499820 499004 498762
59775 498762 498803 498664 498207 498030 498902 500682 502399 503521 504609 506480 509275 512616 516127 519482 522438 525246
59759 525246 528585 532723 537192 541700 546842 553253 560441 567216 573125 578825 585112 592165 599755 607609
59745 607609 615444 623064 630513 637825 644635 650353 654707 657794 659681 660402 660253 659624 658521 656739 654510
59730 654510 652463 650865 649346 647522 645371 642889 639906 636495 633045 629692 626151 622445 619294 617247
59716 617247 615790 613859 611057 607879 604908 602295 599953 597793 595768 594081 593342 594006 595536 596519 595941
59701 595941 594172 592512 591986 592753 594500 597022 600337 604352 608603 612404 615340 617582 619595 621484 622742
$$ packed form
59805E47923j508j215p17k94l81j096j998k366j907j202j212k175l265l589l188
59790E21810k705k424k244k252k601k814k131p21K02j30j108j645j417q16k42
59775D98762M1j39m57j77Q72J780J717J122J088J871K795L341L511L355K956K808
59759E25246L339M138M469M508N142O411P188O775N909N700O287P053P590P854
59745F07609P835P620P449P312O810N718M354L087J887P21j49o29j103j782k229
59730F54510k047j598j519j824k151k482k983l411l450l353l541l706l151k047
59716F17247j457j931k802l178k971k613k342k160k025j687p39O64J530R83n78
59701E95941j769j660n26P67J747K522L315M015M251L801K936K242K013J889J258
$$ plain form
59686 622742 622784 621676 620169 619038 618540 618533 618829 619181 619085 617992 615832 613147 610526 608024 605209 601662 597328
59669 597328 592527 587757 583449 579773 576707 574270 572474 571019 569345 567190 564915 563047 561747 561050
59655 561050 561374 563253 566500 570080 573026 575301 577629 580663 584362 588023 590759 592031 591783 590216 587658
59640 587658 584666 581818 579124 575999 572210 568509 565753 563750 561664 559440 557904 557332 556882 555836 554614
59625 554614 553955 553707 553137 552057 550924 550009 549102 547939 546340 543994 540639 536575 532594 529307 526800
59610 526800 524940 523683 523069 523144 523947 525301 526634 527273 527055 526450 526074 526212 526815 527698 528592 529136 529030 528315
59592 528315 527465 527055 527196 527360 526937 525906 524718 523635 522530 521380 520499 520090 519935 519769 519570 519223 518292
59575 518292 516565 514505 512732 511265 509717 508084 506849 506387 506637 507302 508016 508405 508351 508147 508082 508005 507657
$$ packed form
59686F22742M2j108j507j131m98pK96L52r6j093k160k685k621k502k815l547m334
59669E97328m801m770m308l676l066k437j796j455j674k155k275j868j300o97
59655E61050L24J879L247L580K946K275K328L034L699L661K736J272k48j567k558
59640E87658k992k848k694l125l789l701k756k003k086k224j536n72m50j046j222
59625E54614o59k48n70j080j133r15r07j163j599k346l355m064l981l287k507
59610E26800j860j257o14P5Q03J354J333O39k18o05l76J38O03Q83Q94N44j06p15
59592E28315q50m10J41J64m23j031j188j083j105j150q81m09j55j66j99l47r31
59575E18292j727k060j773j467j548j633j235m62K50O65P14L89n4k04o5p7l48
$$ plain form
59558 507657 507184 506879 506582 505872 504833 504024 503663 503401 503002 502727 502864 503331 503929 504671 505792 507882 511960
59541 511960 518707 527384 536186 544209 552712 564115 580206 601474 627069 654109 677350 691191
59529 691191 693136 685314 672469 658752 646343 636167 628795 624449 622690 622613 623351 624347 625292 626016 626436
59514 626436 626415 625688 624044 621568 618409 614245 608298 600182 590567 580723 571553 563377 556402 550803 546290
59499 546290 542164 538096 534496 531856 530063 528679 527569 526814 526222 525441 524546 524098 524497 525611 527127 528979
59483 528979 531180 533479 535511 537280 539296 542141 546012 550708 555940 561527 567364 573403 579693 586280
59469 586280 592890 598798 603207 605872 607315 608413 609726 611144 612163 612570 612900 614031 616326 619429 623076
59454 623076 627717 633914 641313 648793 655658 662193 668957 676079 683493 691290 699294 706558 711768 714104
$$ packed form
59558E07657m73l05k97p10j039q09l61k62l99k75J37M67N98P42J121K090M078
59541E11960O747Q677Q802Q023Q503J1403J6091K1268K5595K7040K3241J3841
59529F91191J945p822j2845j3717j2409j0176p372m346j759p7P38R96R45P24M20
59514F26436k1p27j644k476l159m164n947q116r615r844r170q176o975n599m513
59499E46290m126m068l600k640j793j384j110p55n92p81q95m48L99J114J516J852
59483E28979K201K299K032J769K016K845L871M696N232N587N837O039O290O587
59469E86280O610N908M409K665J443J098J313J418J019M07L30J131K295L103L647
59454F23076M641O197P399P480O865O535O764P122P414P797Q004P264N210K336
$$ plain form
59440 714104 713421 709847 703684 695639 686674 677473 668365 659706 651903 645013 638716 632911 627992 624317
59426 624317 621744 620027 619483 620853 624519 630122 636998 644848 654007 665182 678918 695161 713345
59413 713345 732984 754251 778128 806148 839547 877510 915473 945767 961399 960170 945405 923130
59401 923130 898985 877151 860501 850769 848994 856091 871818 892205 908976 913536 902389 878467
59389 878467 847588 814637 782784 754289 730482 711269 695661 682878 672676 664897 659125 654701
59377 654701 650882 647290 644319 642722 642504 642647 642222 641356 640785 640939 641890 643713 646299 649070 651440 653390
59361 653390 655286 657417 660102 663852 668877 674751 681074 688101 696150 704786 713343 721995 731560 742450
59347 742450 754550 767908 782619 798066 813230 827880 842649 857753 872426 885756 897264
$$ packed form
59440G14104o83l574o163q045q965r201r108q659p803o890o297n805m919l675
59426F24317k573j717n44J370L666N603O876P850R159J1175J3736J6243J8184
59413G13345J9639K1267K3877K8020L3399L7963L7963L0294J5632j229j4765k2275
59401I23130k4145k1834j6650r732j775P097J5727K0387J6771M560j1147k3922
59389H78467l0879l2951l1853k8495k3807j9213j5608j2783j0202p779n772m424
59377F54701l819l592k971j597k18J43m25q66n71J54R51J823K586K771K370J950
59361F53390J896K131K685L750N025N874O323P027Q049Q636Q557Q652R565J0890
59347G42450J2100J3358J4711J5447J5164J4650J4769J5104J4673J3330J1508
$$ plain form
59336 897264 906413 912445 915168 915218 913136 908755 901902 893094 882990 871675 858901 844660 829180
59323 829180 812815 796315 780649 766133 752239 738655 726027 715135 705870 697617 690164 683579
59311 683579 677599 671913 666819 662892 660120 658016 656485 656012 657102 660082 665321 672941 682210 691831
59297 691831 700948 709375 716695 721678 722933 719914 713158 703799 693013 681670 670307 659394 649516
59284 649516 641080 633938 627655 622237 618351 616695 617282 619474 622658 626762 632043 638383 645101 651783
59270 651783 659161 668581 680348 693102 705186 716192 726713 736985 746395 754122 759596 762421 762560
59257 762560 760645 757515 753297 747463 740007 731968 724538 718070 712285 707049 702532 698837 695878 693541
59243 693541 691736 690436 689858 690413 692183 694632 697197 700078 704033 709359 715431 721420 727117 732738 738069
$$ packed form
59336H97264R149O032K723N0k082m381o853q808j0104j1315j2774j4241j5480
59323H29180j6365j6500j5666j4516j3894j3584j2628j0892r265q253p453o585
59311F83579n980n686n094l927k772k104j531m73J090K980N239P620R269R621
59297F91831R117Q427P320M983J255l019o756r359j0786j1343j1363j0913r878
59284F49516q436p142o283n418l886j656N87K192L184M104N281O340O718O682
59270F51783P378R420J1767J2754J2084J1006J0521J0272R410P727N474K825J39
59257G62560j915l130m218n834p456q039p430o468n785n236m517l695k959k337
59243F93541j805j300n78N55J770K449K565K881L955N326O072N989N697N621N331
$$ plain form
59228 738069 742238 744449 744713 743689 741912 739298 735315 729477 721702 712364 702073 691387 680721 670467
59214 670467 660991 652395 644492 637218 630862 625593 620955 616300 611698 607895 605256 603224 601079 598789
59200 598789 596729 594941 593128 591212 589485 588271 587772 588126 589210 590404 590994 590927 590945 591812 593572 595670
59184 595670 597713 599938 602962 607130 612164 617404 622242 626286 629328 631515 633485 635936 638946 641992
59170 641992 644746 647479 650601 654202 658321 663188 668789 674448 679338 683278 686643 689584 691730 692629
59156 692629 692121 690253 687086 682663 677016 670227 662574 654511 646323 638000 629620 621614 614285 607260
59142 607260 599883 592165 584938 578923 573921 569089 563855 558459 553668 550050 547529 545639 544152 543276
59128 543276 543231 543890 544972 546393 548267 550723 553830 557518 561502 565572 570060 575654 582536 590068 597559
$$ packed form
59228G38069M169K211K64j024j777k614l983n838p775r338j0291j0686j0666j0254
59214F70467r476q596p903p274o356n269m638m655m602l803k639k032k145k290
59200E98789k060j788j813j916j727j214m99L54J084J194N90o7J8Q67J760K098
59184E95670K043K225L024M168N034N240M838M044L042K187J970K451L010L046
59170F41992K754K733L122L601M119M867N601N659M890L940L365K941K146Q99
59156F92629n08j868l167m423n647o789p653q063q188q323q380q006p329p025
59142F07260p377p718p227o015n002m832n234n396m791l618k521j890j487q76
59128E43276m5O59J082J421J874K456L107L688L984M070M488N594O882P532P491
$$ plain form
59113 597559 604924 612249 619218 625559 631726 638480 645927 653497 660680 667200 672620 676613 679748 683331
59099 683331 688109 693536 698457 702140 704485 705739 706368 706867 707328 707370 706739 705832 705320 705333 705216 704122 701752
59082 701752 698449 694630 690216 684773 678131 670678 662928 655078 647163 639374 631948 624895 618132 611790
59068 611790 606160 601431 597627 594617 591982 589129 585910 582917 580795 579398 577956 575955 573557 571327
59054 571327 569849 569364 569364 568837 567373 565836 565344 565830 566266 566190 566160 566572 566831 566100 564354 562289 560552 559406
59036 559406 558912 559115 560113 562021 564788 568080 571573 575337 579662 584569 589802 595316 601479 608846 617958
59021 617958 629115 641916 655202 667974 680255 692541 704590 715461 724652 732312 738151 741117
59009 741117 740672 737770 734000 730207 726461 722920 720046 718109 717065 716987 718266 721225 725705 731092 736766
$$ packed form
59113E97559P365P325O969O341O167O754P447P570P183O520N420L993L135L583
59099F83331M778N427M921L683K345J254O29M99M61M2o31r07n12J3j17j094k370
59082G01752l303l819m414n443o642p453p750p850p915p789p426p053o763o342
59068F11790n630m729l804l010k635k853l219k993k122j397j442k001k398k230
59054E71327j478m85%n27j464j537m92M86M36p6l0M12K59p31j746k065j737j146
59036E59406m94K03R98J908K767L292L493L764M325M907N233N514O163P367R112
59021F17958J1157J2801J3286J2772J2281J2286J2049J0871R191P660N839K966
59009G41117m45k902l770l793l746l541k874j937j044p8J279K959M480N387N674
$$ plain form
58994 736766 742481 748205 753573 757834 760675 762775 764991 767152 768302 768126 767400 766836 766192 764922 763169
58979 763169 761621 760719 760421 760565 761187 762674 765760 771027 778162 786029 793772 801604 810237 819783 829534
58964 829534 838718 847220 855580 864331 873218 881111 886926 890589 892852 894191 894269 892429 888251 881604 872664
58949 872664 862062 850596 838640 826164 813426 801140 789873 779742 770798 763142 756511 750407
58937 750407 744915 740832 738583 737593 737067 736809 736781 736429 735155 733132 731065 729378 728106 727314 727018 726854
58921 726854 726288 725144 723542 721537 719220 717027 715523 714894 714960 715531 716499 717747 719303 721481 724572 728480
58905 728480 732976 738148 744377 751958 761049 771857 784542 798929 814440 830278 845610 859822
58893 859822 872817 884952 896607 907977 919337 931152 943719 956917 970521 984544 999100
$$ packed form
58994G36766N715N724N368M261K841K100K216K161J150j76p26n64o44j270j753
58979G63169j548r02k98J44O22J487L086N267P135P867P743P832Q633R546R751
58964H29534R184Q502Q360Q751Q887P893N815L663K263J339P8j840m178o647q940
58949H72664j0602j1466j1956j2476j2738j2286j1267j0131q944p656o631o104
58937G50407n492m083k249r90n26k58k8l52j274k023k067j687j272p92k96j64
58921G26854n66j144j602k005k317k193j504o29O6N71R68J248J556K178L091L908
58905G28480M496N172O229P581R091J0808J2685J4387J5511J5838J5332J4212
58893H59822J2995J2135J1655J1370J1360J1815J2567J3198J3604J4023J4556
$$ plain form
58882 999100 1014105 1029172 1043556 1056117 1065817 1072459 1076640 1078740 1078298 1074587 1067428 1057204 1044563
58869 1044563 1030523 1016460 1003418 991477 980120 969063 958372 947982 937610 927204 917149
58858 917149 907851 899151 890225 880157 868779 856896 845515 834956 825000 815689 807458 800480 794419
58845 794419 788897 783711 778510 772825 766630 760315 753926 747019 739502 732047 725267 718979 712668 706281
58831 706281 700220 694876 690378 686495 682716 678892 675732 674008 673241 672095 670248 668893 668986 669989 670914
58816 670914 671582 672148 672368 672280 672774 674412 676326 677335 677554 677813 678047 677555 676543 676026 676179 675898 674199
58799 674199 671163 667399 663463 659989 657526 655854 653950 650865 646368 640855 635133 630208 626702 624459
58785 624459 623079 622612 623208 624413 625582 626882 629161 632820 637463 642623 648158 653820 658999 663060 665480
$$ packed form
58882I99100J5005J5067J4384J2561R700O642M181K100m42l711p159j0224j2641
58869A044563j4040j4063j3042j1941j1357j1057j0691j0390j0372j0406j0055
58858I17149r298q700q926j0068j1378j1883j1381j0559r956r311q231o978o061
58845G94419n522n186n201n685o195o315o389o907p517p455o780o288o311o387
58831G06281o061n344m498l883l779l824l160j724p67j146j847j355R3J003R25
58816F70914O68N66K20q8M94J638J914J009K19K59K34m92j012n17J53k81j699
58799F74199l036l764l936l474k463j672j904l085m497n513n722m925l506k243
58785F24459j380m67N96J205J169J300K279L659M643N160N535N662N179M061K420
$$ plain form
58770 665480 665740 663564 659258 653393 646265 638093 629565 621566 614427 608014 602444 598099 594951 592493
58756 592493 590436 589001 588493 589035 590687 593356 596603 599912 603103 606146 608804 610983 613183 615992 619214
58741 619214 622119 624440 626560 628812 631200 633832 637032 640934 645358 650036 654616 658595 661781 664720
58727 664720 668228 672617 677721 683341 689162 694622 699526 704482 710047 715753 720753 725148 729780 734892
58713 734892 739984 744926 750191 755809 760919 764653 766769 767289 766230 763927 760979 757553 753083 746749
58699 746749 737972 726652 713469 699804 686678 673819 660337 646173 632187 619037 606852 595991
58687 595991 587216 580820 576208 572433 568591 563884 558156 552471 548287 545816 543805 541062 537563 534039
58673 534039 531223 529660 529552 530518 532014 534060 537052 540998 545713 551755 560226 571341 583833 595982
$$ packed form
58770F65480K60k176m306n865p128q172q528p999p139o413n570m345l148k458
58756E92493k057j435n08N42J652K669L247L309L191L043K658K179K200K809L222
58741F19214K905K321K120K252K388K632L200L902M424M678M580L979L186K939
58727F64720L508M389N104N620N821N460M904M956N565N706N000M395M632N112
58713G34892N092M942N265N618N110L734K116N20j059k303k948l426m470o334
58699G46749q777j1320j3183j3665j3126j2859j3482j4164j3986j3150j2185j0861
58687E95991q775o396m612l775l842m707n728n685m184k471k011k743l499l524
58673E34039k816j563j08R66J496K046K992L946M715O042Q471J1115J2492J2149
$$ plain form
58659 595982 606630 615001 620286 621870 619790 614808 608248 601492 595172 588978 582601 576511 571292 566775
58645 566775 562568 558930 556137 553476 550088 546514 544146 543256 542862 542462 542545 543375 544681 546712 550168 554665
58629 554665 558629 561205 563058 564809 565899 565742 564894 564313 564305 564801 565860 567280 568478 569394 570859 573614
58613 573614 577595 582522 588400 595028 601730 607952 613455 617726 620171 621187 622152 623870 625844 627342
58599 627342 628253 628549 627936 626503 624831 623021 620593 617730 615600 614915 615133 615598 616560 618576 621860 626671
58583 626671 633321 641277 649287 656961 665128 674098 682842 690592 698086 706279 714919 723357 731786 740716
58569 740716 750112 760011 771224 784436 799406 815892 834501 855608 878253 901210 924557 949106
58557 949106 974718 1000059 1023629 1044318 1061456 1075066 1085625 1093095 1096792 1096669 1093901 1089637 1084101
$$ packed form
58659E95982J0648Q371N285J584k080m982o560o756o320o194o377o090n219m517
58645E66775m207l638k793k661l388l574k368q90l94m00Q3Q30J306K031L456M497
58629E54665L964K576J853J751J090j57q48n81qM96J059J420J198R16J465K755
58613E73614L981M927N878O628O702O222N503M271K445J016R65J718J974J498
58599F27342R11K96o13j433j672j810k428k863k130o85K18M65R62K016L284M811
58583F26671O650P956Q010P674Q167Q970Q744P750P494Q193Q640Q438Q429Q930
58569G40716R396R899J1213J3212J4970J6486J8609K1107K2645K2957K3347K4549
58557I49106K5612K5341K3570K0689J7138J3610J0559P470L697j23k768m264n536
$$ plain form
58544 1084101 1077492 1070710 1064215 1057053 1047930 1036475 1022727 1006347 987283 966382 944389 921274
58532 921274 897501 874874 854918 837262 820842 805875 793307 783104 774584 767906 763675 761359
58520 761359 759417 756916 753953 750726 747240 743759 740561 737377 733830 730138 726713 723503 720496 718263
58506 718263 717164 716534 715556 714426 713747 713358 712689 711715 710622 709126 707154 705641 705575 706757 708439 710646
58490 710646 713763 717377 720644 723493 726471 729860 733869 739142 746042 753961 762353 771869 783447 796908
58476 796908 811496 827085 843583 859781 874169 886387 896611 904093 907788 907997 905915 901893 895620
58463 895620 887781 880028 873393 868023 864337 863017 863896 866153 869639 874825 881521 888894 896747 905582
58449 905582 915252 924610 932522 938268 941049 940189 935947 929262 920722 910579 899559 888689 878434
$$ packed form
58544A084101o609o782o495p162r123j1455j3748j6380j9064k0901k1993k3115
58532I21274k3773k2627j9956j7656j6420j4967j2568j0203q520o678m231k316
58520G61359j942k501k963l227l486l481l198l184l547l692l425l210l007k233
58506G18263j099o30r78j130o79l89o69r74j093j496j972j513o6J182J682K207
58490G10646L117L614L267K849K978L389M009N273O900P919Q392R516J1578J3461
58476G96908J4588J5589J6498J6198J4388J2218J0224P482L695K09k082m022o273
58463H95620p839p753o635n370l686j320Q79K257L486N186O696P373P853Q835
58449I05582R670R358P912N746K781q60m242o685q540j0143j1020j0870j0255
$$ plain form
58436 878434 868898 860709 854771 851298 849873 850243 852207 855052 858094 861582 866307 872534 880021 888550
58422 888550 897636 906241 913730 920568 927181 932754 936112 937129 936202 933136 927773 921090 914326 907547
58408 907547 900246 892743 885626 878464 870498 862142 854467 847674 841430 836174 832719 830988 830398 830949 832759
58393 832759 835282 838300 842775 849132 855611 860074 862720 865173 867655 869127 869646 870415 871772 873109 874512
58378 874512 876591 878975 880902 883089 887079 892975 899625 906742 914888 923673 932072 940370 949776 960235
58364 960235 970588 980818 992119 1004825 1018189 1032075 1046852 1061735 1075344 1087851 1100588
58353 1100588 1113538 1125259 1135164 1143806 1150963 1155687 1158384 1160767 1163574 1166315 1169242 1173526 1179397
58340 1179397 1186076 1193559 1202532 1212720 1223351 1234984 1248723 1263928 1279027 1294208 1310742 1328019
$$ packed form
58436H78434r536q189n938l473j425L70J964K845L042L488M725O227P487Q529
58422H88550R086Q605P489O838O613N573L358J017r27l066n363o683o764o779
58408I07547p301p503p117p162p966q356p675o793o244n256l455j731n90N51J810
58393H32759K523L018M475O357O479M463K646K453K482J472N19P69J357J337J403
58378H74512K079K384J927K187L990N896O650P117Q146Q785Q399Q298R406J0459
58364I60235J0353J0230J1301J2706J3364J3886J4777J4883J3609J2507J2737
58353A100588J2950J1721R905Q642P157M724K697K383K807K741K927M284N871
58340A179397O679P483Q973J0188J0631J1633J3739J5205J5099J5181J6534J7277
$$ plain form
58328 1328019 1344016 1358645 1373705 1389445 1404046 1416716 1428420 1439223 1447842 1454322 1460378 1466595
58316 1466595 1472042 1477046 1483432 1491426 1499206 1506224 1514176 1523989 1534673 1545892 1558892 1573989 1589748
58303 1589748 1605513 1622226 1640111 1658134 1676321 1695897 1716584 1736554 1755592 1775435 1796475
58292 1796475 1817210 1837583 1859662 1884203 1909625 1935261 1962492 1991917 2022582 2054934 2091244
58281 2091244 2132147 2175905 2221868 2271310 2323986 2377424 2430714 2485434 2541718 2596928 2649444
58270 2649444 2700295 2749977 2797396 2843191 2890416 2940562 2992466 3046206 3104121 3166723 3231561
58259 3231561 3297503 3366210 3438140 3511316 3585377 3662461 3742644 3823047 3903088 3986088 4074029
58248 4074029 4165348 4259591 4359328 4465626 4576520 4691987 4815515 4948807 5089937 5238557
$$ packed form
58328A328019J5997J4629J5060J5740J4601J2670J1704J0803Q619O480O056O217
58316A466595N447N004O386P994P780P018P952R813J0684J1219J3000J5097J5759
58303A589748J5765J6713J7885J8023J8187J9576K0687J9970J9038J9843K1040
58292A796475K0735K0373K2079K4541K5422K5636K7231K9425L0665L2352L6310
58281B091244M0903M3758M5963M9442N2676N3438N3290N4720N6284N5210N2516
58270B649444N0851M9682M7419M5795M7225N0146N1904N3740N7915O2602O4838
58259C231561O5942O8707P1930P3176P4061P7084Q0183Q0403Q0041Q3000Q7941
58248D074029R1319R4243R9737J06298J10894J15467J23528J33292J41130J48620
$$ plain form
58238 5238557 5397568 5567773 5746496 5933626 6133283 6347437 6573953 6813076 7069437
58229 7069437 7345356 7638884 7950932 8287278 8650909 9039817 9455274 9904589 10392715
58220 10392715 10919340 11487443 12106214 12782201 13516796 14316056 15193446 16159532 17219990
58211 17219990 18388179 19688480 21143202 22769436 24594680 26662643 29018645 31704949
58203 31704949 34778130 38316423 42404746 47133331 52624035 59045165 66599432 75526969
58195 75526969 86136305 98813818 114003180 132221365 154119671 180488760 212144197
58188 212144197 249700251 293115298 340833903 388845948 430691089 459216901 469443698
58181 469443698 460625028 436081898 401216209 361328244 320433518 281100207 244744877
$$ packed form
58238E238557J59011J70205J78723J87130J99657K14154K26516K39123K56361
58229G069437K75919K93528L12048L36346L63631L88908M15457M49315M88126
58220A0392715N26625N68103O18771O75987P34595P99260Q77390R66086J060458
58211A7219990J168189J300301J454722J626234J825244K067963K356002K686304
58203C1704949L073181L538293M088323M728585N490704O421130P554267Q927537
58195G5526969J0609336J2677513J5189362J8218185K1898306K6369089L1655437
58188B12144197L7556054M3415047M7718605M8012045M1845141K8525812J0226797
58181D69443698q818670k4543130l4865689l9887965m0894726l9333311l6355330
$$ plain form
58174 244744877 211998400 183026872 157751724 135948088 117289997 101409917 87951086
58167 87951086 76576829 66966696 58834654 51944946 46098308 41115277 36844351 33171657
58159 33171657 30006540 27264588 24872695 22778008 20938581 19311888 17860743 16561530
58151 16561530 15396871 14346702 13393749 12529805 11748282 11036812 10383976 9786554 9243091
58142 9243091 8746364 8288652 7868364 7484749 7131359 6800771 6490739 6200126 5923994
58133 5923994 5658488 5405882 5169342 4946951 4735745 4537034 4352575 4179715 4015264
58124 4015264 3860297 3716430 3581187 3451587 3328659 3213967 3105152 2999222 2897016
58115 2897016 2800444 2708534 2619921 2535927 2457386 2381699 2306624 2233793 2165011 2098481 2032337
$$ packed form
58174B44744877l2746477k8971528k5275148k1803636j8658091j5880080j3458831
58167H7951086j1374257r610133q132042o889708n846638m983031m270926l672694
58159C3171657l165117k741952k391893k094687j839427j626693j451145j299213
58151A6561530j164659j050169r52953q63944p81523p11470o52836n97422n43463
58142I243091m96727m57712m20288l83615l53390l30588l10032k90613k76132
58133E923994k65506k52606k36540k22391k11206j98711j84459j72860j64451
58124D015264j54967j43867j35243j29600j22928j14692j08815j05930j02206
58115B897016r6572r1910q8613q3994p8541p5687p5075p2831o8782o6530o6144
$$ plain form
58104 2032337 1968494 1909057 1851926 1793829 1735021 1677532 1621638 1567682 1518636 1477181 1442526
58093 1442526 1413174 1390138 1374226 1362944 1353484 1346159 1341632 1337522 1331297 1323856 1316663 1307818 1294684
58080 1294684 1278045 1260008 1240003 1216733 1192122 1169366 1148546 1127680 1106623 1086442 1066381
58069 1066381 1045052 1023530 1004004 986388 969304 953225 939537 927535 915406 903319 892687
58058 892687 883202 873341 862971 852866 842465 830658 818038 806024 794529 782749 771340 761567
58046 761567 753148 745076 737630 731524 726083 720268 714400 708868 702455 694123 685222 677706 671397 665216
58032 665216 659652 655403 650808 643397 633284 622532 611928 600839 589568 579368 570415 561893 553709
58019 553709 546299 539261 531952 524800 518487 512685 507124 502724 499962 497398 493778 490258 488515 487948
$$ packed form
58104B032337o3843n9437n7131n8097n8808n7489n5894n3956m9046m1455l4655
58093A442526k9352k3036j5912j1282r460p325m527m110o225p441p193q845j3134
58080A294684j6639j8037k0005k3270k4611k2756k0820k0866k1057k0181k0061
58069A066381k1329k1522j9526j7616j7084j6079j3688j2002j2129j2087j0632
58058H92687r485r861j0370j0105j0401j1807j2620j2014j1495j1780j1409r773
58046G61567q419q072p446o106n441n815n868n532o413q332q901p516o309o181
58032F65216n564m249m595p411j0113j0752j0604j1089j1271j0200q953q522q184
58019E53709p410p038p309p152o313n802n561m400k762k564l620l520j743n67
$$ plain form
58005 487948 486980 485791 485359 484999 483402 481152 479706 478830 477556 476706 477760 479989 481461 482206 483624 485328
57989 485328 485499 484123 483063 482943 482553 481328 479904 478102 474819 470117 465180 460115 454009 447270 441635
57974 441635 437602 433957 430154 427094 425204 423687 421977 420216 418123 415215 412294 410887 411046 411485 411924
57959 411924 413328 415604 417096 416839 415546 413923 411631 408424 404759 400866 396595 392420 389194 386752
57945 386752 384244 381931 381031 381567 382100 381993 382316 383971 386375 388610 390645 392902 395659 399222 403611
57930 403611 407856 410622 411704 411882 411336 409396 405914 401620 397062 392357 388020 384761 382352 379905 377363
57915 377363 375600 375010 375157 375753 376781 377761 378191 378713 380603 384121 388451 392959 397217 400184 401049 400735
57899 400735 400864 401310 400513 398239 396128 395213 394697 393710 392612 391882 391126 389840 388022 385642 382611 379513
$$ packed form
58005D87948r68j189m32l60j597k250j446q76j274q50J054K229J472P45J418J704
57989D85328J71j376j060j20l90j225j424j802l283m702m937n065o106o739n635
57974D41635m033l645l803l060j890j517j710j761k093k908k921j407J59M39M39
57959D11924J404K276J492k57j293j623k292l207l665l893m271m175l226k442
57945C86752k508k313r00N36N33j07L23J655K404K235K035K257K757L563M389
57930D03611M245K766J082J78n46j940l482m294m558m705m337l259k409k447k542
57915C77363j763n90J47N96J028R80M30N22J890L518M330M508M258K967Q65l14
57899D00735J29M46p97k274k111r15n16r87j098p30p56j286j818k380l031l098
$$ plain form
57883 379513 377143 375150 372483 369368 367359 367053 367169 366351 364549 362275 359840 357848 357088 357381 357555 356936
57867 356936 355782 354106 351499 348394 346064 344879 343934 342870 342598 343656 345255 346653 348145 349913 351185
57852 351185 351422 351352 352011 353609 355906 358685 361310 362805 363063 363132 363760 364569 365090 365586 366229 366442 365745 364483
57834 364483 363172 361809 360241 358484 356378 353721 350946 348777 347069 345035 342738 341131 340374 339453 337858
57819 337858 336305 335327 334495 333645 333521 334428 335420 335649 335381 334912 333587 330804 327036 323016 318782 314311
57803 314311 310158 306691 303533 300512 298249 297057 296139 294715 293170 292229 291760 291189 290505 290073 290006 290305
57787 290305 291036 291909 292418 292802 294032 296397 299034 301291 303518 305936 307940 309252 310655 312678 314619
57772 314619 315795 316707 317945 318972 319225 319525 320966 323053 324301 324306 323965 323903 323853 323473 322723 321459 319551
$$ packed form
57883C79513k370j993k667l115k009l06J16q18j802k274k435j992p60K93J74o19
57867C56936j154j676k607l105k330j185r45j064k72J058J599J398J492J768J272
57852C51185K37p0O59J598K297K779K625J495K58O9O28Q09N21M96O43K13o97j262
57834C64483j311j363j568j757k106k657k775k169j708k034k297j607p57r21j595
57819C37858j553r78q32q50j24R07R92K29k68m69j325k783l768m020m234m471
57803C14311m153l467l158l021k263j192r18j424j545r41m69n71o84m32o7K99
57787B90305P31Q73N09L84J230K365K637K257K227K418K004J312J403K023J941
57772C14619J176R12J238J027K53L00J441K087J248Nl41o2n0l80p50j264j908
$$ plain form
57755 319551 317437 315858 314998 314377 313507 312279 310932 310022 310133 311251 312699 313929 314999 316056 316958 317645
57739 317645 318249 318545 318081 317227 317227 318666 320704 322395 323887 325651 327404 328679 329731 330947 331947 332189
57723 332189 331998 332097 332480 332546 332014 331068 329936 328900 328270 327814 326740 324807 322821 321417 320026 317775 314739
57706 314739 311464 307873 303640 299174 295205 291687 287975 283872 279776 276095 273185 271510 271054 270881 270039
57691 270039 268634 267393 266503 265593 264549 263536 262470 261211 260156 260035 261191 263534 266946 271322 276518
57676 276518 282786 290953 301769 315431 332117 352474 377144 406418 440900 481704 528893 579653
57664 579653 628299 667842 691748 695872 680351 649703 610322 567685 525549 486285 450764 418649
57652 418649 389859 365329 345613 329555 315480 303119 293210 285726 279781 274939 271340 268633 266023
$$ packed form
57755C19551k114j579q60o21q70j228j347r10J11J118J448J230J070J057R02O87
57739C17645O04K96m64q54%J439K038J691J492J764J753J275J052J216J000K42
57723C32189j91R9L83O6n32r46j132j036o30m56j074j933j986j404j391k251l036
57706C14739l275l591m233m466l969l518l712m103m096l681k910j675m56j73q42
57691B70039j405j241q90r10j044j013j066j259j055j21J156K343L412M376N196
57676B76518O268Q167J0816J3662J6686K0357K4670K9274L4482M0804M7189N0760
57664E79653M8646L9543K3906M124j5521l0648l9381m2637m2136l9264l5521l2115
57652D18649k8790k4530j9716j6058j4075j2361r909p484n945m842l599k707k610
$$ plain form
57639 266023 263309 260907 258885 256983 255469 254911 255111 255225 255025 255060 255508 255782 255436 254605 253437 251852 250041
57622 250041 248470 247193 245762 243939 241921 239806 237468 235137 233575 233391 234398 235672 236116 235263 233793
57607 233793 232908 232839 232494 231062 229275 228295 227914 226918 224997 223193 222432 222494 222498 221718 219858 217165 214397 212173
57589 212173 210371 208509 206447 204372 202450 201003 200507 200771 200729 199793 198808 198735 199033 198534 197381 196614 196088
57572 196088 194446 191333 188156 186170 185036 183787 182234 180812 179829 179381 179434 179609 179428 179012 179020 179779 180989
57555 180989 182313 183587 184525 185098 186247 189176 193592 197511 199274 198997 197685 195789 193325 190735 188777
57540 188777 187680 186994 186229 185409 185033 185649 187344 189605 191712 193124 193394 192204 189967 188015 187448 187897
57524 187897 188042 187256 186140 185551 185799 186789 188250 189758 191090 192598 194688 196995 198596 198937 198026 196064
$$ packed form
57639B66023k714k402k022j902j514n58K00J14k00L5M48K74l46q31j168j585j811
57622B50041j571j277j431j823k018k115k338k331j562j84J007J274M44q53j470
57607B33793q85o9l45j432j787r80l81r96j921j804p61O2Mp80j860k693k768k224
57589B12173j802j862k062k075j922j447m96K64m2r36r85p3K98m99j153p67n26
57572A96088j642l113l177j986j134j249j553j422r83m48N3J75j81m16QP59J210
57555A80989J324J274R38N73J149K929M416L919J763k77j312j896k464k590j958
57540A88777j097o86p65q20l76O16J695K261K107J412K70j190k237j952n67M49
57524A87897J45p86j116n89K48R90J461J508J332J508K090K307J601L41r11j962
$$ plain form
57508 196064 193668 192158 192519 194043 194963 194608 194025 194363 195619 197211 198732 199616 198982 196537 193179 190197
57492 190197 188163 186897 186064 185426 184900 184605 184608 184565 184013 183013 182074 181461 181111 181202 182115 183739 185471 186972
57474 186972 188323 189318 189310 187983 185672 182752 179312 175671 172635 170886 170439 170797 171278 171243 170511 169588 169067
57457 169067 168890 168639 168292 168040 167649 166820 166017 166024 166754 167397 167692 168093 168765 169427 170217 171576 173146 173906 173658
57438 173658 173322 173548 174095 174780 175841 177020 177511 177249 177081 177174 176547 174855 173368 173331 174478 176021 177950
57421 177950 180280 181986 182044 180918 179911 179484 179237 179040 179132 179392 179486 179594 180232 181500 183112 184852 186462
57404 186462 187488 187868 188252 189094 189896 190048 189954 190464 191509 192194 192156 192091 192892 194763 197150 199205 200516 201699
57386 201699 203982 207876 212640 217330 221789 226092 229675 231805 232583 232763 232801 232668 232346 231867 231031 229598
$$ packed form
57508A96064k396j510L61J524R20l55n83L38J256J592J521Q84o34k445l358k982
57492A90197k034j266q33o38n26k95Lm3n52j000r39o13l50R1R13J624J732J501
57474A86972J351R95qj327k311k920l440l641l036j749m47L58M81l5p32r23n21
57457A69067j77k51l47k52l91q29q03PP30O43K95M01O72O62P90J359J570P60k48
57438A73658l36K26N47O85J061J179M91k62j68R3o27j692j487l7J147J543J929
57421A77950K330J706N8j126j007m27k47j97R2K60R4J08O38J268J612J740J610
57404A86462J026L80L84Q42Q02J52r4N10J045O85l8o5Q01J871K387K055J311J183
57386B01699K283L894M764M690M459M303L583K130P78J80L8j33l22m79q36j433
$$ plain form
57370 229598 227619 225212 222367 219392 217126 216152 216089 216156 216114 216148 216250 216263 216215 216059 215535 214844 215039 216983 220225
57351 220225 223572 226447 229030 231435 233602 235809 238421 241095 242965 243631 243462 242974 242522 242498 243195 244345
57335 244345 245288 245676 245633 245309 244755 244221 244138 244702 245711 246806 247703 248314 248775 249226 249533 249595 249975 251579 254400
57316 254400 257228 259094 260425 262170 264380 266350 267704 268577 269068 269279 269662 270539 271464 271759 271585 271826
57300 271826 273033 275072 277655 280612 283684 286618 289422 292167 294764 297331 300375 304002 307365 309606
57286 309606 311106 313032 315853 319060 322231 325515 329042 332563 335832 338896 341942 345231 348957 352820
57272 352820 356043 358354 360602 363841 368148 372984 378267 384212 390472 396398 402009 407796 413727 419326
57258 419326 424598 429964 435411 440727 446438 453340 461059 468286 474718 481588 489867 499036 508156 517161
$$ packed form
57370B29598j979k407k845k975k266r74o3O7m2L4J02J3m8j56n24o91J95J944L242
57351B20225L347K875K583K405K167K207K612K674J870O66j69m88m52k4O97J150
57335B44345R43L88m3l24n54n34q3N64J009J095Q97O11M61M51L07O2L80J604K821
57316B54400K828J866J331J745K210J970J354Q73M91K11L83Q77R25K95j74K41
57300B71826J207K039K583K957L072K934K804K745K597K567L044L627L363K241
57286C09606J500J926K821L207L171L284L527L521L269L064L046L289L726L863
57272C52820L223K311K248L239M307M836N283N945O260N926N611N787N931N599
57258D19326N272N366N447N316N711O902P719P227O432O870Q279R169R120R005
$$ plain form
57244 517161 526413 535772 544906 554034 563668 573939 584573 595244 605716 616082 627058 639445
57232 639445 653010 666511 679158 691429 704075 717056 730079 743538 758125 773780 789682
57221 789682 805163 820086 834449 848174 861340 874304 887472 901012 914731 928246 941526
57210 941526 955313 970635 987775 1006016 1024528 1043106 1061891 1080816 1099641 1118182 1136152
57199 1136152 1153112 1168943 1184156 1199366 1214661 1229816 1245030 1261079 1278780 1298460 1319815
57188 1319815 1342093 1364506 1386739 1409065 1431873 1455188 1478783 1502630 1526971 1551922 1577250
57177 1577250 1602651 1628158 1654124 1680838 1708307 1736511 1765677 1796110 1827868 1860794 1894713
57166 1894713 1929242 1963585 1997156 2030431 2064499 2099475 2134061 2167144 2199221 2231669 2265162
$$ packed form
57244E17161R252R359R134R128R634J0271J0634J0671J0472J0366J0976J2387
57232F39445J3565J3501J2647J2271J2646J2981J3023J3459J4587J5655J5902
57221G89682J5481J4923J4363J3725J3166J2964J3168J3540J3719J3515J3280
57210I41526J3787J5322J7140J8241J8512J8578J8785J8925J8825J8541J7970
57199A136152J6960J5831J5213J5210J5295J5155J5214J6049J7701J9680K1355
57188A319815K2278K2413K2233K2326K2808K3315K3595K3847K4341K4951K5328
57177A577250K5401K5507K5966K6714K7469K8204K9166L0433L1758L2926L3919
57166A894713L4529L4343L3571L3275L4068L4976L4586L3083L2077L2448L3493
$$ plain form
57155 2265162 2299498 2334500 2370164 2406119 2441838 2477436 2513596 2550657 2588338 2626339 2664743
57144 2664743 2703844 2744080 2785963 2829583 2874325 2919620 2965697 3013013 3061268 3109745 3158350
57133 3158350 3207379 3256504 3305148 3353971 3404983 3459887 3519117 3582602 3650483 3722717 3798862
57122 3798862 3878752 3962815 4051364 4144119 4240499 4339801 4441211 4544825 4653071 4770267
57112 4770267 4900329 5045506 5207312 5387400 5587009 5806870 6048853 6317447 6619408
57103 6619408 6963053 7358791 7819794 8361538 9001413 9759251 10657021 11716566 12957590
57094 12957590 14397903 16054271 17941666 20071978 22453935 25092915 27988735 31132579
57086 31132579 34504775 38072690 41788618 45590295 49402722 53131981 56646550 59761743
$$ packed form
57155B265162L4336L5002L5664L5955L5719L5598L6160L7061L7681L8001L8404
57144B664743L9101M0236M1883M3620M4742M5295M6077M7316M8255M8477M8605
57133C158350M9029M9125M8644M8823N1012N4904N9230O3485O7881P2234P6145
57122C798862P9890Q4063Q8549R2755R6380R9302J01410J03614J08246J17196
57112D770267J30062J45177J61806J80088J99609K19861K41983K68594L01961
57103F619408L43645L95738M61003N41744O39875P57838Q97770J059545J241024
57094A2957590J440313J656368J887395K130312K381957K638980K895820L143844
57086C1132579L372196L567915L715928L801677L812427L729259L514569L115193
$$ plain form
57078 59761743 62253587 63908678 64583493 64237275 62925963 60772539 57934982 54581423
57070 54581423 50872670 46951685 42940164 38939992 35035851 31297040 27778550 24521389
57062 24521389 21552096 18882470 16510975 14425756 12607765 11033263 9676105 8510004
57054 8510004 7509995 6652824 5917182 5284414 4738966 4267794 3859479 3504124 3193687
57045 3193687 2921682 2682412 2470760 2282670 2115253 1966268 1833674 1715601 1610304
57036 1610304 1516082 1431611 1356349 1290138 1232356 1181942 1138447 1102470 1074816 1055592 1044292
57025 1044292 1040021 1040829 1043001 1041655 1032374 1012469 981293 940040 891342 838594 785133 733628
57013 733628 685743 642099 602639 567186 535582 507349 481499 456981 433278 410578 389441
$$ packed form
57078E9761743K491844J655091O74815l46218j311312k153424k837557l353559
57070E4581423l708753l920985m011521m000172l904141l738811l518490l257161
57062B4521389k969293k669626k371495k085219j817991j574502j357158j166101
57054H510004j000009q57171p35642o32768n45448m71172m08315l55355l10437
57045C193687k72005k39270k11652j88090j67417j48985j32594j18073j05297
57036A610304r4222q4471p5262o6211n7782n0414m3495l5977k7654j9224j1300
57025A044292m271Q08K172j346r281j9905l1176m1253m8698n2748n3461n1505
57013G33628m7885m3644l9460l5453l1604k8233k5850k4518k3703k2700k1137
$$ plain form
57002 389441 370272 352888 336495 320227 303738 287200 270885 254992 239720 225125 211040
56991 211040 197536 185403 175771 169321 166362 167551 173752 184948 199799 216346 232523 245883
56979 245883 253788 254669 248935 238369 225062 211024 198082 187394 179205 173363 169768 168140 167998
56966 167998 169324 172816 178968 187370 197416 209345 224047 242237 264283 290243 318921 346848
56954 346848 369054 381468 382661 373735 357230 336199 313566 291677 272078 255519 242042 231337
56942 231337 223258 217956 215478 215545 217961 222966 230986 242370 257605 277471 302574 332754 366787
56929 366787 401864 432862 453118 457511 445543 421285 390332 356943 323560 291719 262552 236581
56917 236581 213726 193869 177275 164161 153869 144899 136199 128167 121906 117623 114381 111379 108755
$$ packed form
57002C89441j9169j7384j6393j6268j6489j6538j6315j5893j5272j4595j4085
56991B11040j3504j2133r632o450k959J189O201J1196J4851J6547J6177J3360
56979B45883P905Q81n734j0566j3307j4038j2942j0688q189n842l595j628j42
56966A67998J326L492O152Q402J0046J1929J4702J8190K2046K5960K8678K7927
56954C46848K2206J2414J193q926j6505k1031k2633k1889j9599j6559j3477j0705
56942B31337q079n302k478O7K416N005Q020J1384J5235J9866K5103L0180L4033
56929C66787L5077L0998K0256M393j1968k4258l0953l3389l3383l1841k9167k5971
56917B36581k2855j9857j6594j3114j0292q970q700q032o261m283l242l002k624
$$ plain form
56904 108755 106970 106107 106092 106898 108220 109627 111483 115019 120903 128359 136301 144783 154654 166417 180320
56889 180320 197116 217665 241881 268776 297181 325438 350545 368784 377725 377264 368913 354922
56877 354922 338089 321316 306569 294477 285078 278510 274876 274046 276090 281629 291496 306208 325977
56864 325977 351088 382111 419909 465480 519336 580317 644254 703583 748906 772413 771221 748212
56852 748212 709975 663851 616028 570845 530814 497313 471426 453868 444246 441344 444705 455346
56840 455346 474575 502962 541110 590541 652804 728189 816007 914679 1019231 1118477 1196721
56829 1196721 1240123 1242405 1205907 1139215 1054015 962038 872420 790603 719053 658444 608407
56818 608407 568356 538312 518661 509026 508127 515234 531201 557605 595238 643900 703108 771854
$$ packed form
56904A08755j785q63j5Q06J322J407J856L536N884P456P942Q482R871J1763J3903
56889A80320J6796K0549K4216K6895K8405K8257K5107J8239Q941m61q351j3991
56877C54922j6833j6773j4747j2092r399o568l634q30K044N539R867J4712J9769
56864C25977K5111L1023L7798M5571N3856O0981O3937N9329M5323K3507j192k3009
56852G48212l8237m6124m7823m5183m0031l3501k5887j7558r622k902L361J0641
56840D55346J9229K8387L8148M9431O2263P5385Q7818R8672J04552R9246P8244
56829A196721M3402K282l6498o6692q5200r1977q9618q1817p1550o0609n0037
56818F08407m0051l0044j9651r635q99P107J5967K6404L7633M8662N9208O8746
$$ plain form
56806 771854 846717 919986 980110 1015386 1018936 991397 939485 872262 798216 724102 654547 592080
56794 592080 537877 492517 455820 426562 403456 386488 376511 373564 376558 384838 399148 420603
56782 420603 449281 484017 522534 560932 593515 614173 618528 605276 576285 535899 489659 442722
56770 442722 398706 359317 324560 293510 265527 240984 220551 203949 189964 177677 167074
56759 167074 158363 151281 145313 140044 135109 130243 125549 121318 117483 113766 110428 108260 107611 107948 108558
56744 108558 109156 109579 109440 108454 106808 104998 103596 103143 103723 104587 104762 104224 103848 104100 104448 104304 103822 103418
56726 103418 103158 103083 103503 104494 105542 106181 106582 107163 108078 109398 111268 113375 114755 114672 113454 112041 111091
56709 111091 110885 111624 113207 115006 116399 117434 118579 119977 121269 121949 121708 120675 119517 118912 118720 118159
$$ packed form
56806G71854P4863P3269O0124L5276L550k7539n1912o7223p4046p4114o9555o2467
56794E92080n4203m5360l6697k9258k3106j6968r977k947K994Q280J4310K1455
56782D20603K8678L4736L8517L8398L2583K0658M355j3252k8991m0386m6240m6937
56770D42722m4016l9389l4757l1050k7983k4543k0433j6602j3985j2287j0603
56759A67074q711p082n968n269m935m866m694m231l835l717l338k168o49L37O10
56744A08558N98M23j39r86j646j810j402m53N80Q64J75n38l76K52L48j44m82m04
56726A03418k60p5M20R91J048O39M01N81R15J320J870K107J380q3j218j413r50
56709A11091k06P39J583J799J393J035J145J398J292O80k41j033j158o05j92n61
$$ plain form
56693 118159 117102 116581 117433 119007 119955 119988 120061 120925 122233 123174 123404 123163 122925 123162 124136 125738 127639 129684
56675 129684 131979 134561 137116 139165 140474 141165 141412 141150 140342 139520 139611 140913 142552 143450 143622 143984 144956
56658 144956 145912 146038 145156 143640 142130 141500 142406 144524 146690 148098 148953 149753 150499 150928 151017 150862 150431
56641 150431 149799 149285 149099 149142 149262 149294 148778 147241 145017 143152 142169 141509 140500 139232 138033 136774 135358
56624 135358 134365 134465 135486 136718 137879 139196 140716 142067 142802 142587 141277 139231 137382 136590 136992 138195
56608 138195 139769 141280 142215 142338 141932 141354 140669 140013 139857 140360 140775 140135 138424 136602 135484 135090 135092 135535
56590 135535 136832 139164 141987 144351 145824 146902 148234 149746 151067 152488 154585 156913 158121 157763
56576 157763 157095 157540 159142 161082 162976 164952 167042 169253 171836 174910 178224 181786 186227 191999 198796
$$ packed form
56693A18159j057n21Q52J574R48L3P3Q64J308R41K30k41k38K37R74J602J901K045
56675A29684K295K582K555K049J309O91K47k62q08q22R1J302J639Q98J72L62R72
56658A44956R56J26q82j516j510o30R06K118K166J408Q55Q00P46M29Q9j55m31
56641A50431o32n14j86M3J20L2n16j537k224j865r83o60j009j268j199j259j416
56624A35358r93J00J021J232J161J317J520J351P35k15j310k046j849p92M02J203
56608A38195J574J511R35J23m06n78o85o56j56N03M15o40j711j822j118l94KM43
56590A35535J297K332K823K364J473J078J332J512J321J421K097K328J208l58
56576A57763o68M45J602J940J894J976K090K211K583L074L314L562M441N772O797
$$ plain form
56561 198796 206374 215345 226411 239293 253112 267217 280718 291695 298094 299468 297160 292888 287843
56548 287843 282942 278987 276281 274493 272946 270818 267366 262532 257155 252197 247942 244266 241184 238579
56534 238579 235882 232757 229723 227399 225471 223221 220748 218764 217269 215341 212409 209011 206150 204337
56520 204337 203326 202406 200955 199045 197394 196466 195907 195134 194067 192876 191520 190049 188885 188210 187512 186378
56504 186378 185255 184776 184782 184788 184935 185608 186484 186841 186493 185665 184326 182520 180943 180239 180027 179553 178882 178494 178125
56485 178125 177197 176051 175436 175067 174104 172944 173036 174736 176808 178342 179793 181630 183319 184325 185098 186310
56469 186310 187907 189526 191087 192498 193499 194293 195632 197731 199708 200582 200325 199540 198676 197960 197573 197558
56453 197558 197942 199071 201236 203796 205402 205392 204357 203201 202374 202218 203149 205005 206894 208160 208907 209270
$$ packed form
56561A98796P578Q971J1066J2882J3819J4105J3501J0977O399J374k308m272n045
56548B87843m901l955k706j788j547k128l452m834n377m958m255l676l082k605
56534B38579k697l125l034k324j928k250k473j984j495j928k932l398k861j813
56520B04337j011r20j451j910j651r28n59p73j067j191j356j471j164o75o98j134
56504A86378j123m79OOJ47O73Q76L57l48q28j339j806j577p04k12m74o71l88l69
56485A78125r28j146o15l69r63j160R2J700K072J534J451J837J689J006P73J212
56469A86310J597J619J561J411J001P94J339K099J977Q74k57p85q64p16l87j5
56453A97558L84J129K165K560J606j0j035j156q27j56R31J856J889J266P47L63
$$ plain form
56437 209270 208964 208014 207181 207034 207231 207310 207555 208378 209368 209727 209305 208492 207438 206160 205246 205600 207342 209542
56419 209542 211200 212144 212789 213506 214466 215834 217683 219664 221071 221466 221136 220717 220502 220420 220598 221423 222890
56402 222890 224370 225289 225660 225723 225536 225252 225314 226040 227403 229396 232015 234614 236164 236642 237220 238404 239080
56385 239080 238402 237603 238515 241012 243406 244833 245669 246000 245426 244364 243919 244298 244771 245279 246589 248706 250638
56368 250638 252091 253924 256506 258979 260661 261962 263403 264910 266576 268879 271658 273980 275521 276991
56354 276991 278770 280356 281655 283481 286068 288314 289264 289283 289126 289020 289356 291001 293920 296608 297939 298710
56338 298710 300407 303315 306795 310539 314506 318348 321975 326100 331310 337067 342466 347378 352165 356897
56324 356897 361631 366747 372136 376687 379464 380850 381760 382321 382205 381702 381511 381831 382454 383382 384642 385956
$$ packed form
56437B09270l06r50q33j47J97P9K45Q23R90L59m22q13j054j278r14L54J742K200
56419B09542J658R44O45P17R60J368J849J981J407L95l30m19k15q2J78Q25J467
56402B22890J480R19L71O3j87k84O2P26J363J993K619K599J550M78N78J184O76
56385B39080o78p99R12K497K394J427Q36L31n74j062m45L79M73N08J310K117J932
56368B50638J453J833K582K473J682J301J441J507J666K303K779K322J541J470
56354B76991J779J586J299J826K587K246R50J9j57j06L36J645K919K688J331P71
56338B98710J697K908L480L744L967L842L627M125N210N757N399M912M787M732
56324C56897M734N116N389M551K777J386R10N61j16n03j91L20O23R28J260J314
$$ plain form
56308 385956 387271 389208 392299 396245 400583 405572 411623 418292 424698 430691 436933 443985 451840 460123
56294 460123 468308 475926 482923 489596 496106 502536 509421 517431 526335 535176 543801 553286 564418 576733
56280 576733 589616 603353 618358 634223 650322 666684 683647 701397 720412 741564 765063
56269 765063 790107 816184 843868 873721 905440 938887 975001 1014761 1058070 1104594 1154858
56258 1154858 1209546 1268481 1331325 1398631 1471340 1549824 1634289 1725307 1823053 1926697 2035392
56247 2035392 2149152 2267824 2389922 2513414 2636916 2759194 2878195 2991594 3097655
56238 3097655 3194628 3279925 3350853 3405625 3443048 3462124 3462865 3446616 3414584 3366910 3304039 3228025
56226 3228025 3141410 3045809 2942720 2834627 2723886 2611402 2497744 2384782 2274731 2168388
$$ packed form
56308C85956J315J937L091L946M338M989O051O669O406N993O242P052P855Q283
56294D60123Q185P618O997O673O510O430O885Q010Q904Q841Q625R485J1132J2315
56280E76733J2883J3737J5005J5865J6099J6362J6963J7750J9015K1152K3499
56269G65063K5044K6077K7684K9853L1719L3447L6114L9760M3309M6524N0264
56258A154858N4688N8935O2844O7306P2709P8484Q4465R1018R7746J03644J08695
56247B035392J13760J18672J22098J23492J23502J22278J19001J13399J06061
56238C097655R6973Q5297P0928N4772L7423J9076P41j6249l2032m7674o2871p6014
56226C228025q6615r5601j03089j08093j10741j12484j13658j12962j10051j06343
$$ plain form
56216 2168388 2065678 1967262 1874079 1785927 1702011 1622416 1547717 1477719 1411968 1350878 1294812
56205 1294812 1242625 1192740 1145338 1101993 1063388 1028787 997412 968908 942696 918252 895941
56194 895941 876387 859185 843312 828493 815106 803079 791946 781651 772392 764153 757201 752230
56182 752230 748989 745731 741211 736291 732354 729260 726314 724043 723188 722961 722286 721919 723237 725724 727853
56167 727853 729815 733062 737491 741528 744900 749085 754841 761409 768381 776459 786018 796584 807995 820586
56153 820586 834096 847825 861909 877153 893806 911843 931916 954327 977533 999669 1021346
56142 1021346 1044947 1071225 1098431 1124738 1149513 1172192 1191991 1209229 1225305 1241079 1256526
56131 1256526 1271785 1286937 1300871 1312139 1320919 1328555 1335269 1339969 1342060 1341794 1339119 1334001 1327565
$$ packed form
56216B168388j02710r8416r3183q8152q3916p9595p4699o9998o5751o1090n6066
56205A294812n2187m9885m7402m3345l8605l4601l1375k8504k6212k4444k2311
56194H95941j9554j7202j5873j4819j3387j2027j1133j0295r259q239o952m971
56182G52230l241l258m520m920l937l094k946k271q55k27o75l67J318K487K129
56167G27853J962L247M429M037L372M185N756O568O972Q078R559J0566J1411J2591
56153H20586J3510J3729J4084J5244J6653J8037K0073K2411K3206K2136K1677
56142A021346K3601K6278K7206K6307K4775K2679J9799J7238J6076J5774J5447
56131A256526J5259J5152J3934J1268Q780P636O714M700K091k66k675n118o436
$$ plain form
56118 1327565 1321089 1314110 1305387 1295254 1284973 1274278 1261921 1248375 1235488 1223520 1210931 1197143
56106 1197143 1183160 1169376 1155223 1141258 1129184 1119401 1110657 1102433 1095551 1090249 1085775 1082041 1079549
56093 1079549 1077602 1074906 1072079 1071298 1073213 1076383 1079845 1083999 1088901 1094036 1099833 1107140 1115211 1122603
56079 1122603 1129855 1138744 1149124 1159272 1169145 1180221 1192153 1202824 1212031 1221952 1233578 1245741
56067 1245741 1258062 1271730 1286868 1302232 1317943 1335460 1354448 1372901 1390739 1409932 1430655
56056 1430655 1450841 1470052 1490183 1511657 1532579 1552463 1573109 1594923 1616104 1636403 1658043
56045 1658043 1681992 1707103 1733782 1764485 1799569 1836708 1875513 1918440 1965834 2014352 2061826
56034 2061826 2109375 2157154 2202406 2243689 2282891 2321297 2357808 2392758 2429148 2468257 2508321
$$ packed form
56118A327565o476o979q723j0133j0281j0695j2357j3546j2887j1968j2589j3788
56106A197143j3983j3784j4153j3965j2074r783q744q224o882n302m474l734k492
56093A079549j947k696k827p81J915L170L462M154M902N135N797P307Q071P392
56079A122603P252Q889J0380J0148R873J1076J1932J0671R207R921J1626J2163
56067A245741J2321J3668J5138J5364J5711J7517J8988J8453J7838J9193K0723
56056A430655K0186J9211K0131K1474K0922J9884K0646K1814K1181K0299K1640
56045A658043K3949K5111K6679L0703L5084L7139L8805M2927M7394M8518M7474
56034B061826M7549M7779M5252M1283L9202L8406L6511L4950L6390L9109M0064
$$ plain form
56023 2508321 2549247 2593977 2643293 2694074 2744826 2798178 2855815 2915918 2977920 3044632 3117086
56012 3117086 3192345 3269119 3350421 3438016 3529475 3623482 3722643 3828204 3937594 4050245 4170071
56001 4170071 4299047 4434360 4575202 4725985 4889039 5060568 5237949 5424600 5623392
55992 5623392 5831943 6049114 6279631 6527437 6791010 7070053 7370022 7695147 8044041
55983 8044041 8417209 8821483 9261896 9737113 10248428 10804996 11414412 12076976 12795534
55974 12795534 13581901 14447443 15397635 16443167 17606038 18907683 20363082 21995143
55966 21995143 23843135 25949273 28351786 31101699 34272531 37944829 42200836 47150011
55958 47150011 52946367 59774490 67847145 77437417 88894511 102621480 119082316 138863448
$$ packed form
56023B508321M0926M4730M9316N0781N0752N3352N7637O0103O2002O6712P2454
56012C117086P5259P6774Q1302Q7595R1459R4007R9161J05561J09390J12651J19826
56001D170071J28976J35313J40842J50783J63054J71529J77381J86651J98792
55992E623392K08551K17171K30517K47806K63573K79043K99969L25125L48894
55983H044041L73168M04274M40413M75217N11315N56568O09416O62564P18558
55974A2795534P86367Q65542R50192J045532J162871J301645J455399J632061
55966B1995143J847992K106138K402513K749913L170832L672298M256007M949175
55958D7150011N796356O828123Q072655R590272J1457094J3726969J6460836J9781132
$$ plain form
55950 138863448 162691296 191333810 225414572 265054608 309114099 354203130 394410640
55943 394410640 422719484 433755980 426089351 402472843 368125687 328539794 288096079
55936 288096079 249681302 214851744 184181444 157652273 134970906 115734092 99493780
55929 99493780 85811696 74303059 64634205 56502627 49643615 43844165 38929563 34743351
55921 34743351 31152575 28058788 25385758 23062359 21027621 19240635 17670422 16282382
55913 16282382 15044875 13940031 12955943 12074757 11278444 10558785 9910902 9322918 8781717
55904 8781717 8283122 7826995 7407532 7017109 6654545 6320784 6010858 5718278 5443227
55895 5443227 5188644 4952116 4728892 4519155 4325158 4144633 3973728 3813158 3665134
$$ packed form
55950A38863448K3827848K8642514L4080762L9640036M4059491M5089031M0207510
55943C94410640K8308844J1036496p666629k3616508l4347156l9585893m0443715
55936B88096079l8414777l4829558l0670300k6529171k2681367j9236814j6240312
55929I9493780j3682084j1508637r668854q131578o859012n799450m914602m186212
55921C4743351l590776l093787k673030k323399k034738j786986j570213j388040
55913A6282382j237507j104844r84088q81186p96313p19659o47883n87984n41201
55904H781717m98595m56127m19463l90423l62564l33761l09926k92580k75051
55895E443227k54583k36528k23224k09737j93997j80525j70905j60570j48024
$$ plain form
55886 3665134 3527494 3397041 3275350 3165128 3063851 2966903 2873953 2786386 2701421 2614858
55876 2614858 2527248 2441756 2358253 2274936 2193383 2116453 2043048 1970084 1897794 1828254 1760658
55865 1760658 1693003 1626833 1565484 1509046 1455444 1405006 1359646 1318996 1281465 1247828 1219923
55854 1219923 1197194 1178162 1163606 1154563 1148787 1142905 1136438 1130175 1122435 1110784 1095782 1079262
55842 1079262 1060671 1038959 1016282 995683 976526 956244 935202 915704 897388 877890 857300
55831 857300 838003 820700 804321 789268 777065 767251 757966 749056 741306 733324 722713 709816
55819 709816 696957 684426 670586 655620 641778 629954 619106 608957 600387 593227 586345 579859
55807 579859 574752 570697 566761 563683 562785 563184 562961 562570 564157 567784 571249 573501 575349 576841 576796 575099
$$ packed form
55886C665134j37640j30453j21691j10222j01277r6948r2950q7567q4965q6563
55876B614858q7610q5492q3503q3317q1553p6930p3405p2964p2290o9540o7596
55865A760658o7655o6170o1349n6438n3602n0438m5360m0650l7531l3637k7905
55854A219923k2729j9032j4556r043n776n882o467o263p740j1651j5002j6520
55842A079262j8591k1712k2677k0599j9157k0282k1042j9498j8316j9498k0590
55831H57300j9297j7303j6379j5053j2203r814r285q910p750p982j0611j2897
55819G09816j2859j2531j3840j4966j3842j1824j0848j0149q570p160o882o486
55807E79859n107m055l936l078q98L99k23l91J587L627L465K252J848J492m5j697
$$ plain form
55791 575099 572852 570032 565469 559298 553115 547628 542396 537951 535774 535839 536157 534875 531080 523830 512586
55776 512586 498660 484359 470769 458023 447166 439656 435471 433918 435801 442309 451818 460116 463912
55763 463912 462307 455381 443884 430296 417697 407115 397745 389479 383083 378048 372744 366851 361457
55750 361457 356626 351044 344241 337008 329429 320713 311336 303190 297136 292227 287715 283985 281204 278892
55736 278892 277197 276843 277459 277565 276493 274809 272833 270378 267860 265850 263525 259522 254320 249797 246356
55721 246356 242556 237817 233346 229927 226830 223491 220494 218339 216898 216491 217829 220508 223311 226308
55707 226308 230873 237226 243773 249298 253924 257382 258251 255768 250794 244327 236587 228172 220503 214287
55693 214287 208903 203933 199902 196977 194410 191950 190371 189935 189668 188879 188123 187992 188101 188009 188137 189229
$$ packed form
55791E75099k247k820m563o171o183n487n232m445k177O5L18j282l795p250j1244
55776E12586j3926j4301j3590j2746j0857p510m185j553J883O508R509Q298L796
55763D63912j605o926j1497j3588j2599j0582r370q266o396n035n304n893n394
55750C61457m831n582o803p233p579q716r377q146o054m909m512l730k781k312
55736B78892j695l54O16J06j072j684j976k455k518k010k325m003n202m523l441
55721B46356l800m739m471l419l097l339k997k155j441m07J338K679K803K997
55707B26308M565O353O547N525M626L458Q69k483m974o467p740q415p669o216
55693B14287n384m970m031k925k567k460j579m36k67p89p56j31J09r2J28J092
$$ plain form
55677 189229 191683 195544 200104 203524 204257 202949 201576 200612 198642 194931 190574 186653 183053 179745 177610
55662 177610 177175 177884 179209 181231 183584 185328 186476 188222 191071 194119 196694 199175 201554 202804 202535
55647 202535 201827 201514 200936 199317 197103 195093 193385 192019 191448 191493 190913 188837 185633 181768 177048 171702
55631 171702 166946 163475 160452 156835 152723 148688 144851 141424 139093 137972 137075 135606 133844 132143
55617 132143 130131 127681 125619 124603 124175 123677 123121 122500 121257 119248 117257 115799 114338 112453 110746
55602 110746 109788 109132 108231 107426 107188 107238 107225 107383 107722 107473 106183 104593 103631 103307 103270 103566 104029 103827 102467
55583 102467 100593 99100 98207 97949 98588 99824 100578 100366 99999 100161 100303 99820 99349 99874 101314 102941 104440
55566 104440 105701 106352 106456 106967 108566 110688 112498 114111 115949 117642 118517 118598 118250 117411 115978 114388
$$ packed form
55677A89229K454L861M560L420P33j308j373r64j970l711m357l921l600l308k135
55662A77610m35P09J325K022K353J744J148J746K849L048K575K481K379J250k69
55647B02535p08l13n78j619k214k010j708j366n71M5n80k076l204l865m720n346
55631A71702m756l471l023l617m112m035l837l427k331j121q97j469j762j701
55617A32143k012k450k062j016m28m98n56o21j243k009j991j458j461j885j707
55602A10746r58o56r01q05k38N0j3J58L39k49j290j590r62l24l7K96M63k02j360
55583A02467j874j493q93k58O39J236P54k12l67J62J42m83m71N25J440J627J499
55566A04440J261O51J04N11J599K122J810J613J838J693Q75Q1l48q39j433j590
$$ plain form
55550 114388 113074 111909 110763 109931 109414 108585 107229 106047 105451 104833 103818 103225 103743 104599 104643 103994 103553
55533 103553 103637 104106 105084 106433 107195 106692 105624 105029 104794 104250 103586 103449 103649 103462 102812 102071 101101 99565
55515 99565 97794 96328 94980 93337 91738 90697 89811 88405 86913 86458 87193 88112 88384 87933 86869 85331
55499 85331 83837 82946 82525 82019 81318 80752 80488 80543 81096 82154 83184 83702 83905 84237 84756 85468 86642 88128
55481 88128 88972 88497 87312 86496 86354 86681 87560 88966 90209 90710 90865 91242 91497 91072 90306 89760 89026 87404
55463 87404 85333 83932 83403 83122 82991 83459 84332 84786 84579 84230 84037 83861 83862 84497 85699 86824 87409 87407 86893
55444 86893 86168 85859 86240 86803 87124 87569 88365 88730 88033 87172 87511 88844 89727 89578 89114 88922 88946 89290 90234
55425 90234 91376 91961 92183 93089 95115 97725 100484 103448 106533 109626 113358 118595 124968 130908 135327
$$ packed form
55550A14388j314j165j146q32n17q29j356j182n96o18j015n93N18Q56M4o49m41
55533A03553Q4M69R78J349P62n03j068n95k35n44o64j37K00j87o50p41r70j536
55515I9565j771j466j348j643j599j041q86j406j492m55P35R19K72m51j064j538
55499H5331j494q91m21n06p01n66k64N5N53J058J030N18K03L32N19P12J174J486
55481H8128Q44m75j185q16j42L27Q79J406J243N01J55L77K55m25p66n46p34j622
55463H7404k071j401n29k81j31M68Q73M54k07l49j93j76JO35J202J125N85kn14
55444H6893p25l09L81N63L21M45P96L65o97q61L39J333Q83j49m64j92K4L44R44
55425I0234J142N85K22R06K026K610K759K964L085L093L732N237O373N940M419
$$ plain form
55410 135327 138365 140388 141305 141026 139703 137352 134061 130535 127500 124621 120930 116341 111688 107341 102937
55395 102937 98507 94652 91441 88342 85442 83483 82430 81268 79673 78648 78933 79901 80689 81400 82462
55380 82462 83651 84560 85332 86219 87016 87539 88158 89255 90585 91721 92621 93303 93372 92423 90646 88674 87087
55363 87087 86281 86439 87276 88050 88068 87077 85211 82916 80896 79679 79141 78793 78502 78542 79011 79661 80191 80336
55345 80336 79856 78983 78637 79528 81218 82638 83325 83507 83329 82863 82541 82635 82484 81327 79705 78925 79168 79389
55327 79389 79128 79091 79706 80376 80685 81136 82109 83078 83515 83738 84237 84884 85344 85581 85515 84844 83655 82544 81781
55308 81781 81077 80517 80847 82322 83962 84597 84089 83066 82051 81340 81151 81401 81732 82047 82550 83037 82859 81911
55290 81911 81054 81236 82701 85174 88034 90150 90525 89536 88666 88577 88380 87314 86094 85712 85769 85035 83259
$$ packed form
55410A35327L038K023R17k79j323k351l291l526l035k879l691m589m653m347m404
55395A02937m430l855l211l099k900j959j053j162j595j025K85R68P88P11J062
55380H2462J189R09P72Q87P97N23O19J097J330J136R00O82O9r49j777j972j587
55363H7087q06J58Q37P74J8r91j866k295k020j217n38l48k91M0M69O50N30J45
55345H0336m80q73l46Q91J690J420O87J82j78m66l22R4j51j157j622p80K43K21
55327G9389k61l7O15O70L09M51R73R69M37K23M99O47M60K37o6o71j189j111p63
55308H1781p04n60L30J475J640O35n08j023j015p11j89K50L31L15N03M87j78r48
55290H1911q57J82J465K473K860K116L75r89q70q9j97j066j220l82N7p34j776
$$ plain form
55273 83259 81509 80939 81818 83527 85026 85617 85602 85852 86537 86910 86621 86432 87078 88190 89037 89635 90306 90664
55255 90664 89990 88426 87041 86768 87676 89056 89849 89387 88164 87544 88322 89865 91017 91346 91099 90577 90057
55238 90057 89879 90000 89851 89132 88309 87834 87440 86763 86107 85878 85725 85086 84237 83985 84490 85130 85419 85409 85278
55219 85278 85090 84895 84640 84089 83273 82783 83126 84014 84795 85346 86001 86795 87402 87739 88040 88330 88353 88090 87882
55200 87882 87914 87910 87468 86512 85383 84547 84195 84056 83734 83192 82714 82412 82171 82124 82657 83767 84887 85603 86082
55181 86082 86515 86658 86317 85865 85865 86508 87703 89267 90675 91122 90352 89054 88054 87505 87275 87605 88736 90234
55163 90234 91268 91426 90783 89504 87902 86652 86372 87045 88180 89371 90383 91022 91355 91833 92734 93647 93919
55146 93919 93416 92544 91713 91131 90880 90832 90640 90072 89192 88142 87093 86474 86660 87223 87172 86294 85579 85797 86389
$$ packed form
55273H3259j750n70Q79J709J499N91j5K50O85L73k89j89O46J112Q47N98O71L58
55255I0664o74j564j385k73R08J380P93m62j223o20P78J543J152L29k47n22n20
55238I0057j78J21j49p19q23m75l94o77o56k29j53o39q49k52N05O40K89j0j31
55219H5278j88j95k55n51q16m90L43Q88P81N51O55P94O07L37L01K90K3k63k08
55200H7882L2mm42r56j129q36l52j39l22n42m78l02k41m7N33J110J120P16M79
55181H6082M33J43l41m52%O43J195J564J408M47p70j298j000n49k30L30J131J498
55163I0234J034J58o43j279j602j250k80O73J135J191J012O39L33M78R01R13K72
55146I3919n03q72q31n82k51m8j92n68q80j050j049o19J86N63n1q78p15K18N92
$$ plain form
55127 86389 86464 86234 86562 87490 88170 88077 87471 86739 86035 85532 85382 85426 85445 85673 86551 88046 89634 90860 91537
55108 91537 91582 91132 90607 90253 89849 89262 88980 89554 90854 92443 94309 96485 98236 98591 97716 96964 97347 98601
55090 98601 99939 101103 102366 103878 105399 106567 107281 107851 108661 109611 110122 109867 109195 108599 108060 107294 106343
55073 106343 105545 105172 105440 106496 107987 109077 109427 109771 110832 112081 112352 111518 110618 110303 110036 109048 107414
55056 107414 105800 104655 104015 103815 104028 104531 104990 104914 103961 102308 100565 99213 98281 97693 97596 98046 98679 98947
55038 98947 98558 97513 96109 95050 95070 96059 97009 97198 96966 96934 97032 96915 96809 97228 98208 99488 101089 102973
55020 102973 104452 104749 104048 103308 103155 103512 104130 104787 105108 104820 104094 103184 102002 100595 99616 99565 99892 99677
55002 99677 98963 98543 98657 98823 98839 99010 99340 99470 99489 99949 100915 101782 102214 102563 103162 103842 104311 104478 104346 104144
$$ packed form
55127H6389P5k30L28R28O80r3o06p32p04n03j50M4J9K28Q78J495J588J226O77
55108I1537M5m50n25l54m04n87k82N74J300J589J866K176J751L55q75p52L83J254
55090I8601J338J164J263J512J521J168P14N70Q10R50N11k55o72n96n39p66r51
55073A06343p98l73K68J056J491J090L50L44J061J249K71q34r00l15k67r88j634
55056A07414j614j145o40k00K13N03M59p6r53j653j743j352r32n88r7M50O33K68
55038I8947l89j045j404j059K0R89R50J89k32l2R8j17j06M19R80J280J601J884
55020A02973J479K97p01p40j53L57O18O57L21k88p26r10j182j407r79n1L27k15
55002I9677p14m20J14J66J6J71L30J30J9M60R66Q67M32L49N99O80M69J67j32k02
$$ plain form
54982 104144 104476 105652 106954 107361 106968 106805 107269 107679 107597 107552 108071 108882 109550 110165 110855 111271 111120 110745 110623
54963 110623 110706 110694 110651 110880 111350 111637 111357 110524 109517 108683 107874 106578 104748 103185 102611 102671 102475 101940 101876
54944 101876 102793 104376 106114 107716 108833 109176 109093 109335 110065 110674 110727 110451 110207 110085 110168 110583 111192 111841
54926 111841 112934 114970 117497 119362 120149 120602 121500 123004 125253 128567 132688 136809 140795 145468 151118
54911 151118 156661 160855 163519 164887 164624 162365 158616 154320 150013 146025 142854 140541 138203 135127
54897 135127 131889 129492 127771 125712 123177 121263 120767 121118 121164 120442 119379 118620 118471 118806 119302 119805 120513
54880 120513 121792 123864 126675 129927 133202 136250 139218 142433 146007 149875 154075 158516 162489 164988
54866 164988 165690 165206 164224 162872 161025 158663 155672 151800 147166 142447 138312 135004 132600 131117 130132
$$ packed form
54982A04144L32J176J302M07l93j63M64M10q2m5N19Q11O68O15O90M16j51l75j22
54963A10623Q3j2m3K29M70K87k80q33j007q34q09j296j830j563n74O0j96n35o4
54944A01876R17J583J738J602J117L43q3K42P30O09N3k76k44j22Q3M15O09O49
54926A11841J093K036K527J865P87M53Q98J504K249L314M121M121L986M673N650
54911A51118N543M194K664J368k63k259l749m296m307l988l171k313k338l076
54897A35127l238k397j721k059k535j914m96L51M6p22j063p59j49L35M96N03P08
54880A20513J279K072K811L252L275L048K968L215L574L868M200M441L973K499
54866A64988P02m84r82j352j847k362k991l872m634m719m135l308k404j483r85
$$ plain form
54851 130132 128840 126883 124719 122931 121635 120738 120174 119531 118072 115573 112743 110402 108658 107191 105880
54836 105880 104779 103942 103619 104116 105123 105767 105732 105685 106113 106493 106280 106008 106496 107468 107996 107980 108177 108844 109396
54817 109396 109523 109732 110421 111157 111343 111172 111433 112514 113983 115109 115577 115630 115634 115739 115951 116244 116396 116033 115224
54798 115224 114784 115420 116723 117617 117739 117626 117535 117052 116118 115534 115942 116999 118075 119023 119797 120002 119482 118767
54780 118767 118337 117991 117491 117205 117503 118152 118943 120280 122408 124725 126674 128621 130926 132890 133828 134631
54764 134631 136876 140640 144566 148052 152043 157447 163944 170571 176387 180308 181464 180239 178077 175725
54750 175725 172540 167992 162928 158529 154733 150615 145990 141731 138635 136642 135208 133838 132128 129842
54736 129842 127276 125300 124639 125104 125733 125780 125427 125430 126230 127640 129233 130660 131658 132216 132874 134431 137080
$$ packed form
54851A30132j292j957k164j788j296q97n64o43j459k499k830k341j744j467j311
54836A05880j101q37l23M97J007O44l5m7M28L80k13k72M88R72N28j6J97O67N52
54817A09396J27K09O89P36J86j71K61J081J469J126M68N3MJ05K12K93J52l63q09
54798A15224m40O36J303Q94J22j13r1m83r34n84M08J057J076R48P74K05n20p15
54780A18767m30l46n00k86K98O49P91J337K128K317J949J947K305J964R38Q03
54764A34631K245L764L926L486L991N404O497O627N816L921J156j225k162k352
54750A75725l185m548n064m399l796m118m625m259l096j993j434j370j710k286
54736A29842k566j976o61M65O29M7l53LQ00J410J593J427R98N58O58J557K649
$$ plain form
54719 137080 140182 143115 145937 148994 152282 155559 158742 161722 164055 165194 164929 163416 161083 158570
54705 158570 156259 153653 149877 145160 141068 138723 137509 136254 134913 134094 133536 132324 130423 128800 128000
54690 128000 127576 127005 126281 125489 124683 124294 124818 125869 126286 125438 123817 122205 120918 119997 119419 118872 117968
54673 117968 116874 116181 115992 115786 115320 114962 114920 114910 114848 115151 115953 116703 116996 117194 117756 118491 119000 119360 119750
54654 119750 119844 119213 118114 117309 117185 117492 117844 118040 117956 117488 116730 116001 115650 115915 116854 118258 119636 120439
54636 120439 120386 119675 118897 118578 118663 118593 118025 117290 116940 117150 117808 118844 120042 120816 120778 120309 119993 119702 118931
54617 118931 117889 117429 117829 118457 118757 118816 118818 118722 118746 119321 120227 120495 119602 118054 116422 114594 112589 111281
54599 111281 111472 112747 114100 115325 116922 118903 120589 121548 121932 121876 121263 120258 119407 118974 118689 118379 118372
$$ packed form
54719A37080L102K933K822L057L288L277L183K980K333J139k65j513k333k513
54705A58570k311k606l776m717m092k345j214j255j341q19n58j212j901j623q00
54690A28000m24n71p24p92q06l89N24J051M17q48j621j612j287r21n78n47r04
54673A17968j094o93j89k06m66l58m2j0o2L03Q02P50K93J98N62P35N09L60L90
54654A19750R4o31j099q05j24L07L52J96q4m68p58p29l51K65R39J404J378Q03
54636A20439n3p11p78l19Q5p0n68p35l50K10O58J036J198P74l8m69l16k91p71
54617A18931j042m60M00O28L00N9Kr6K4N75R06K68q93j548j632j828k005j308
54599A11281J91J275J353J225J597J981J686R59L84n6o13j005q51m33k85l10p
$$ plain form
54582 118372 118931 119669 119916 119504 118805 118084 117178 115874 114319 112844 111586 110514 109774 109729 110575 112155 114209
54565 114209 116561 118880 120630 121553 122011 122516 123068 123305 123119 122684 122058 121250 120613 120616 121145 121532 121381 120906
54547 120906 120465 120297 120823 122532 125211 127827 129586 130694 131686 132426 132317 131315 130239 129999 130805 132121
54531 132121 133179 133540 133278 132697 132045 131597 131727 132415 132807 131916 129912 128135 127570 127835 127998 127804 127566 127272
54513 127272 126585 125609 125013 125211 125776 125880 125138 123975 123248 123521 124592 125753 126460 126663 126578 126368 126137 125940
54495 125940 125705 125367 125171 125581 126721 128107 129118 129566 129685 129735 129744 129521 128879 127954 127243 127100 127291 127390 127526
54476 127526 128258 129719 131329 132479 132983 132836 132089 131222 131019 131734 132806 133745 134779 136298 138135 139883
54460 139883 141463 142890 143813 143876 143277 142439 141377 139958 138550 137792 137748 137860 137733 137510 137435 137445 137307 136855
$$ packed form
54582A18372N59P38K47m12o99p21r06j304j555j475j258j072p40m5Q46J580K054
54565A14209K352K319J750R23M58N05N52K37j86m35o26q08o37LN29L87j51m75
54547A20906m41j68N26J709K679K616J759J108R92P40j09j002j076k40Q06J316
54531A32121J058L61k62n81o52m48J30O88L92q91k004j777n65K65J63j94k38k94
54513A27272o87r76n96J98N65J04p42j163p27K73J071J161P07K03q5k10k31j97
54495A25940k35l38j96M10J140J386J011M48J19N0Rk23o42r25p11j43J91R9J36
54476A27526P32J461J610J150N04j47p47q67k03P15J072R39J034J519J837J748
54460A39883J580J427R23O3n99q38j062j419j408p58m4J12j27k23p5J0j38m52
$$ plain form
54442 136855 136077 135194 134648 134716 135154 135478 135504 135369 135081 134428 133332 132022 130836 130041 129833 130270 131164 132216
54424 132216 133226 134079 134664 135060 135639 136699 138031 139137 139837 140372 140875 141001 140230 138464 136272 134614
54408 134614 134264 135337 137322 139537 141581 143428 145268 147267 149263 150680 151006 150454 149853 149783 150100 150480
54392 150480 151061 152236 154021 155997 157778 159297 160718 162198 163630 164529 164444 163568 162635 161996 161217 159908
54376 159908 158547 158008 158483 159350 159962 160131 160089 160387 161687 164028 166395 167551 167409 167107 167734 169450 171826
54359 171826 174436 176853 178602 179581 180281 181233 182406 183359 183757 183428 182140 179776 176745 173884 171743 170168
54343 170168 168664 166982 165186 163343 161511 159950 158958 158345 157375 155527 153071 150682 148796 147739 148091
54328 148091 150153 153036 155067 155428 154891 154743 155480 156794 158187 159064 158753 157093 154846 153044 152090 151802
$$ packed form
54442A36855p78q83n46O8M38L24K6j35k88o53j096j310j186p95k08M37Q94J052
54424A32216J010Q53N85L96N79J060J332J106P00N35N03J26p71j766k192j658
54408A34614l50J073J985K215K044J847J840J999J996J417L26n52o01p0L17L80
54392A50480N81J175J785J976J781J519J421J480J432Q99q5q76r33o39p79j309
54376A59908j361n39M75Q67O12J69m2K98J300K341K367J156j42l02O27J716K376
54359A71826K610K417J749R79P00R52J173R53L98l29j288k364l031k861k141j575
54343A70168j504j682j796j843j832j561r92o13r70j848k456k389j886j057L52
54328A48091K062K883K031L61n37j48P37J314J393Q77l11j660k247j802r54k88
$$ plain form
54312 151802 151945 152185 151793 150131 147422 144592 142437 141309 141369 142481 143922 144865 145247 145595 145945 145592 144183
54295 144183 142473 141582 141851 142806 143902 144854 145479 145709 145850 146477 147864 149611 150923 151300 150939 150470 150338
54278 150338 150525 150805 151051 151180 151028 150576 150237 150590 151757 153209 154287 154753 154796 154605 154100 153104 151738 150486
54260 150486 149729 149274 148659 147955 147962 149342 151798 154329 156144 157062 157255 157003 156715 156836 157526 158509 159225 159147
54242 159147 158181 156890 156099 156036 156094 155717 155301 155727 157070 158304 158381 157191 155339 153390 151664 150461 150006
54225 150006 150183 150640 151195 151883 152570 152824 152468 152025 152276 153377 154796 156140 157551 159078 160207 160505 160277
54208 160277 159944 159126 157224 154745 153059 152692 152808 152670 152592 152875 152819 151739 150262 149596 149835 150029 149741 149574
54190 149574 150106 151149 152256 153306 154358 155401 156404 157276 157711 157457 156713 155938 155319 154848 154733 155151 155642
$$ packed form
54312A51802J43K40l92j662k709k830k155j128O0J112J441R43L82L48L50l53j409
54295A44183j710q91K69R55J096R52O25K30J41O27J387J747J312L77l61m69j32
54278A50338J87K80K46J29j52m52l39L53J167J452J078M66M3j91n05r96j366j252
54260A50486p57m55o15p04PJ380K456K531J815R18J93k52k88J21O90R83P16p8
54242A59147r66j291p91o3N8l77m16M26J343J234P7j190j852j949j726j203m55
54225A50006J77M57N55O88O87K54l56m43K51J101J419J344J411J527J129K98k28
54208A60277l33q18j902k479j686l67J16j38p8K83n6j080j477o66K39J94k88j67
54190A49574N32J043J107J050J052J043J003Q72M35k54p44p75o19m71j15M18M91
$$ plain form
54173 155642 155391 154286 153151 152768 153113 153746 154469 155301 156156 156883 157491 158032 158378 158245 157455 156190 155037
54156 155037 154677 155291 156291 156780 156235 154698 152559 150408 148866 148218 148251 148615 149190 149941 150770 151787 153373
54139 153373 155547 157636 159050 160046 161199 162480 163546 164546 165799 166804 166544 164869 162805 161338 160641
54124 160641 160616 161315 162445 163193 163095 162626 162521 162844 163125 163072 162799 162561 162516 162642 162811 163051 163666 164851 166345
54105 166345 167822 169400 171276 173099 174385 175400 176821 178580 179876 180389 180658 181058 181380 181598 182080 182658
54089 182658 182484 181402 180540 180828 181761 182374 182649 183041 183324 183012 182516 182766 183853 184988 185683 186085 186227 185874
54071 185874 185246 185033 185444 185893 185865 185542 185357 185419 185664 186171 187055 188303 189846 191520 192857 193313 192909 192386
54053 192386 192468 193153 193887 194329 194746 195747 197725 200548 203709 206769 209679 212755 216380 220663 225224 229340
$$ packed form
54173A55642k51j105j135l83L45O33P23Q32Q55P27O08N41L46j33p90j265j153
54156A55037l60O14J000M89n45j537k139k151j542o48L3L64N75P51Q29J017J586
54139A53373K174K089J414R96J153J281J066J000J253J005k60j675k064j467o97
54124A60641k5O99J130P48r8m69j05L23K81n3k73k38m5J26J69K40O15J185J494
54105A66345J477J578J876J823J286J015J421J759J296N13K69M00L22K18M82N78
54089A82658j74j082q62K88R33O13K75L92K83l12m96K50J087J135O95M02J42l53
54071A85874o28k13M11M49k8l23j85O2K45N07Q84J248J543J674J337M56m04n23
54053A92386Q2O85P34M42M17J001J978K823L161L060K910L076L625M283M561M116
$$ plain form
54037 229340 232595 235457 238962 243664 249117 254537 259675 264733 269666 274005 277420 280221 283159 286749
54023 286749 290768 294377 296863 298257 299111 299699 299708 298813 297188 295234 293071 290576 287787 284958 282298 279804
54007 279804 277238 274179 270285 265705 261101 257103 253806 250900 248124 245484 243160 241261 239554 237534
53993 237534 235032 232676 231289 230826 230391 229356 227882 226186 224077 221712 220107 220130 221314 222334 222458
53978 222458 221949 221272 220587 219935 219272 218303 216793 215071 213797 213233 213170 213455 214110 214945 215612 216123 216843 217831
53960 217831 218708 219337 220230 222004 224709 227917 231209 234368 237271 239807 241892 243570 245133 247046 249532
53945 249532 252282 254833 257159 259658 262576 265763 269037 272495 276335 280492 284509 287682 289509 290210
53931 290210 290737 292031 294250 296881 299469 302003 304728 307917 311771 316216 320877 325563 330588 336230
$$ packed form
54037B29340L255K862L505M702N453N420N138N058M933M339L415K801K938L590
54023B86749M019L609K486J394Q54N88Rq95j625j954k163k495k789k829k660k494
54007B79804k566l059l894m580m604l998l297k906k776k640k324j899j707k020
53993B37534k502k356j387m63m35j035j474j696k109k365j605K3J184J020J24
53978B22458n09o77o85o52o63r69j510j722j274n64o3K85O55Q35O67N11P20R88
53960B17831Q77O29Q93J774K705L208L292L159K903K536K085J678J563J913K486
53945B49532K750K551K326K499K918L187L274L458L840M157M017L173J827P01
53931B90210N27J294K219K631K588K534K725L189L854M445M661M686N025N642
$$ plain form
53917 336230 342002 347084 351486 356137 361624 367373 372459 376747 380802 384955 388940 392342 394948 396666
53903 396666 397480 397581 397394 397267 397126 396460 394690 391658 387758 383529 379124 374306 368940 363248 357549 351918
53887 351918 346209 340256 333941 327189 320033 312678 305508 299037 293748 289774 286697 283864 280961 278138
53873 278138 275590 273272 271044 268825 266441 263578 260146 256536 253266 250378 247425 244056 240495 237420
53859 237420 235358 234151 232943 230871 227901 224970 223090 222390 222142 221695 221110 220833 220990 221230 221187 220875 220548
53842 220548 220253 219620 218185 215995 213819 212579 212462 212746 212658 212242 212132 212544 212929 212704 211972 211250 210757 210295
53824 210295 209701 209071 208590 208440 208828 209881 211510 213545 215935 218547 220959 222808 224294 225923 227857
53809 227857 229942 232321 235402 239076 242621 245715 248972 253012 257437 261292 264264 266874 269667 272768
$$ packed form
53917C36230N772N082M402M651N487N749N086M288M055M153L985L402K606J718
53903C96666Q14J01j87j27j41o66j770l032l900m229m405m818n366n692n699n631
53887C51918n709n953o315o752p156p355p170o471n289l974l077k833k903k823
53873B78138k548k318k228k219k384k863l432l610l270k888k953l369l561l075
53859B37420k062j207j208k072k970k931j880p00k48m47n85k77J57K40m3l12l27
53842B20548k95o33j435k190k176j240j17K84q8m16j10M12L85k25p32p22m93m62
53824B10295n94o30m81j50L88J053J629K035K390K612K412J849J486J629J934
53809B27857K085K379L081L674L545L094L257M040M425L855K972K610K793L101
$$ plain form
53795 272768 276189 279973 283947 287752 291273 294692 298022 300908 303059 304624 305975 307291 308509 309484
53781 309484 309990 309646 308090 305338 301891 298389 295061 291527 287193 281912 276240 271028 266769 263275 259873
53766 259873 255923 251371 246876 243275 240801 238851 236609 233837 231050 229010 228026 227619 226836 225045 222498
53751 222498 220119 218771 218749 219747 221016 221711 221539 221116 221380 222540 223854 224478 224192 223281 222158 221278 221035
53734 221035 221469 222272 223220 224311 225378 225976 225901 225523 225392 225734 226461 227324 227906 227902 227657 228045 229578 231978
53716 231978 234787 237838 240819 242992 243925 244153 244599 245663 247300 249588 252626 256075 259396 262381 265080
53701 265080 267439 269498 271616 274068 276648 279196 282103 285716 289568 292919 295766 298532 300962 302280
53687 302280 302465 302443 302820 303198 303034 302502 302062 301711 301053 299816 298006 295865 293876 292544 291928 291602 291176
$$ packed form
53795B72768L421L784L974L805L521L419L330K886K151J565J351J316J218R75
53781C09484N06l44j556k752l447l502l328l534m334n281n672n212m259l494l402
53766B59873l950m552m495l601k474j950k242k772k787k040r84m07p83j791k547
53751B22498k379j348k2R98J269O95j72m23K64J160J314O24k86r11j123q80k43
53734B21035M34Q03R48J091J067N98p5l78j31L42P27Q63N82mk45L88J533K400
53716B31978K809L051K981K173R33K28M46J064J637K288L038L449L321K985K699
53701B65080K359K059K118K452K580K548K907L613L852L351K847K766K430J318
53687C02280J85k2L77L78j64n32m40l51o58j237j810k141j989j332o16l26m26
$$ plain form
53670 291176 290639 290093 289435 288434 287012 285367 283938 283143 282976 282950 282572 281759 280682 279565 278871 279215 280556
53653 280556 281855 282123 281576 281105 280889 280366 279436 278825 279075 279973 281200 282872 285035 287177 288652 289378 289952
53636 289952 291255 293862 297429 300713 302668 303527 304427 306114 308517 311375 314529 317613 320263 322732 325584
53621 325584 328787 331844 334882 338632 343126 347454 351190 355081 359729 364494 368449 371673 374805 377953
53607 377953 380921 384056 387964 392587 397294 401650 405439 408258 409919 411135 412919 415169 416590 416292
53593 416292 414878 413610 412892 411996 410151 407479 404794 402666 400948 399231 397463 395928 394792 394017 393558
53578 393558 393280 392728 391453 389600 387755 386213 384890 383904 383567 383609 383134 381695 379854 378338 377297 376805
53562 376805 377432 379568 382526 385015 386340 386647 386277 385536 384979 385301 386773 389102 391829 394620 397187 399247
$$ packed form
53670B91176n37n46o58j001j422j645j429p95j67k6l78q13j077j117o94L44J341
53653B80556J299K68n47m71k16n23r30o11K50Q98J227J672K163K142J475P26N74
53636B89952J303K607L567L284J955Q59R00J687K403K858L154L084K650K469K852
53621C25584L203L057L038L750M494M328L736L891M648M765L955L224L132L148
53607C77953K968L135L908M623M707M356L789K819J661J216J784K250J421k98
53593D16292j414j268p18q96j845k672k685k128j718j717j768j535j136p75m59
53578C93558k78n52j275j853j845j542j323r86l37M2m75j439j841j516j041m92
53562C76805O27K136K958K489J325L07l70p41n57L22J472K329K727K791K567K060
$$ plain form
53546 399247 400649 401482 402145 403273 405351 408303 411722 415537 420080 425373 430865 436182 441652 447784 454625
53531 454625 462051 470295 479719 490279 501708 513971 527144 541006 555143 569340 583635 598197
53519 598197 613399 629677 647016 664901 683168 702531 723828 747006 771381 796623 822940
53508 822940 850364 878386 906351 933899 961009 987794 1014241 1040096 1065184 1089875 1114775
53497 1114775 1139750 1163714 1185802 1206374 1226490 1246771 1267215 1287727 1308299 1328847 1349322
53486 1349322 1369766 1389954 1409346 1427815 1446085 1464977 1484532 1504211 1523429 1541302 1556418
53475 1556418 1567693 1575268 1579973 1582236 1582181 1580259 1576809 1571167 1562264 1550160 1536156 1521360 1505980
53462 1505980 1490014 1473773 1457453 1440911 1424005 1406544 1387831 1367012 1344080 1319885 1295126
$$ packed form
53546C99247J402Q33O63J128K078K952L419L815M543N293N492N317N470O132O841
53531D54625P426Q244R424J0560J1429J2263J3173J3862J4137J4197J4295J4562
53519E98197J5202J6278J7339J7885J8267J9363K1297K3178K4375K5242K6317
53508H22940K7424K8022K7965K7548K7110K6785K6447K5855K5088K4691K4900
53497A114775K4975K3964K2088K0572K0116K0281K0444K0512K0572K0548K0475
53486A349322K0444K0188J9392J8469J8270J8892J9555J9679J9218J7873J5116
53475A556418J1275P575M705K263n5j922l450n642q903j2104j4004j4796j5380
53462A505980j5966j6241j6320j6542j6906j7461j8713k0819k2932k4195k4759
$$ plain form
53451 1295126 1270132 1245688 1222961 1202037 1181452 1159921 1137967 1117176 1098393 1081423 1066141
53440 1066141 1052977 1042249 1033700 1026870 1021533 1017592 1014810 1012865 1011631 1011336 1012387 1015009 1019082 1024404
53426 1024404 1030960 1038756 1047526 1056983 1067358 1079391 1093693 1110358 1129196 1149994 1172470 1196315
53414 1196315 1221462 1248132 1276512 1306587 1338335 1371873 1407293 1444536 1483538 1524428 1567542
53403 1567542 1613235 1661569 1712100 1764218 1817858 1873557 1931483 1990741 2050161 2109584 2169855
53392 2169855 2231627 2294635 2358029 2420831 2482138 2541511 2599269 2655831 2710761 2763009 2812145
53381 2812145 2858654 2902772 2943689 2980258 3012007 3039084 3061582 3079204 3091293 3097001 3095824 3088138
53369 3088138 3074730 3055543 3029363 2995147 2953309 2905446 2853182 2797622 2739567 2679746 2618959
$$ packed form
53451A295126k4994k4444k2727k0924k0585k1531k1954k0791j8783j6970j5282
53440A066141j3164j0728q549o830n337l941k782j945j234k95J051K622M073N322
53426A024404O556P796Q770R457J0375J2033J4302J6665J8838K0798K2476K3845
53414A196315K5147K6670K8380L0075L1748L3538L5420L7243L9002M0890M3114
53403A567542M5693M8334N0531N2118N3640N5699N7926N9258N9420N9423O0271
53392B169855O1772O3008O3394O2802O1307N9373N7758N6562N4930N2248M9136
53381B812145M6509M4118M0917L6569L1749K7077K2498J7622J2089N708j177p686
53369C088138j3408j9187k6180l4216m1838m7863n2264n5560n8055n9821o0787
$$ plain form
53358 2618959 2558147 2498086 2438825 2379777 2320644 2261978 2204728 2149708 2097616 2048910 2003087
53347 2003087 1958550 1913777 1868422 1822909 1777487 1732359 1688363 1646603 1607384 1570179 1534668
53336 1534668 1501200 1470150 1441534 1415496 1392583 1373017 1356019 1340234 1324696 1309143 1293607
53325 1293607 1278115 1262763 1247766 1233268 1219251 1205756 1193127 1181896 1172393 1164462 1157645 1151641
53313 1151641 1146590 1142980 1141367 1142116 1145200 1150136 1156207 1162989 1170733 1180212 1192114 1206490 1222786
53300 1222786 1240383 1259143 1279456 1301855 1326677 1353980 1383472 1414412 1445808 1476978 1507814
53289 1507814 1538466 1568905 1598895 1628080 1655828 1681320 1704179 1724797 1743587 1760031 1772943
53278 1772943 1781636 1786356 1787555 1785285 1779472 1770351 1758382 1744031 1727698 1709505 1689060 1665810
$$ packed form
53358B618959o0812o0061n9261n9048n9133n8666n7250n5020n2092m8706m5823
53347B003087m4537m4773m5355m5513m5422m5128m3996m1760l9219l7205l5511
53336A534668l3468l1050k8616k6038k2913j9566j6998j5785j5538j5553j5536
53325A293607j5492j5352j4997j4498j4017j3495j2629j1231r503p931o817o004
53313A151641n051l610j613P49L084M936O071O782P744R479J1902J4376J6296
53300A222786J7597J8760K0313K2399K4822K7303K9492L0940L1396L1170L0836
53289A507814L0652L0439K9990K9185K7748K5492K2859K0618J8790J6444J2912
53278A772943Q693M720J199k270n813r121j1969j4351j6333j8193k0445k3250
$$ plain form
53266 1665810 1639798 1611721 1582171 1551322 1519562 1487833 1456850 1426311 1395339 1363471 1330878
53255 1330878 1297913 1264984 1232705 1201642 1171806 1142724 1114043 1085772 1057943 1030342 1002713
53244 1002713 974988 947254 919661 892456 865956 840427 816045 793032 771681 752123 734174
53233 734174 717552 702276 688677 676870 666277 655940 645374 634910 625055 615694 606137 595793
53221 595793 584505 572347 559422 545932 532184 518414 504784 491569 479208 468120 458485 450055
53209 450055 442106 433829 425086 416690 409655 404266 400014 396137 391784 386020 378422 369721 361264 353710
53195 353710 346778 340270 334634 330185 326404 322509 318408 314618 311494 308877 306447 304118 302122 300754
53181 300754 299940 299109 297708 295803 293846 291891 289540 286661 283657 280895 278411 276370 275184 274819 274485
$$ packed form
53266A665810k6012k8077k9550l0849l1760l1729l0983l0539l0972l1868l2593
53255A330878l2965l2929l2279l1063k9836k9082k8681k8271k7829k7601k7629
53244A002713k7725k7734k7593k7205k6500k5529k4382k3013k1351j9558j7949
53233G34174j6622j5276j3599j1807j0593j0337j0566j0464r855r361r557j0344
53221E95793j1288j2158j2925j3490j3748j3770j3630j3215j2361j1088r635q430
53209D50055p949q277q743q396p035n389m252l877m353n764p598q701q457p554
53195C53710o932o508n636m449l781l895m101l790l124k617k430k329j996j368
53181C00754q14q31j401j905j957j955k351k879l004k762k484k041j186l65l34
$$ plain form
53166 274485 273507 272090 270837 269881 269014 268295 267931 267708 267098 266011 264986 264583 264809 265199 265272 264902 264347 263915
53148 263915 263650 263433 263277 263195 262800 261546 259490 257455 256259 256090 256743 257960 259312 260211 260404 260196 259909
53131 259909 259480 258792 257991 257196 256342 255567 255327 255773 256508 257298 258476 260165 261656 262211 262065 262027 262466 263353
53113 263353 264904 267315 269973 271751 272145 271577 270619 269498 268308 267074 265567 263600 261534 259973 258953
53098 258953 258011 257071 256615 256781 256898 256250 254957 253790 253323 253448 253499 252799 251270 249604 248610 248372 248271 247856
53080 247856 247400 247497 248353 249644 250957 252177 253346 254131 253735 251752 249069 247339 247289 248001 248133 247291 245838
53063 245838 244043 242150 240752 240121 239429 237583 234850 232765 232319 233030 233955 234806 235746 236822 238049 239565
53047 239565 241313 242925 244194 245305 246364 247124 247409 247373 247022 245915 243755 241007 238563 236970 236249 236200
$$ packed form
53166B74485r78j417j253r56q67p19l64k23o10j087j025m03K26L90P3l70n55m32
53148B63915k65k17j56q2l95j254k056k035j196j69O53J217J352Q99J93k08k87
53131B59909m29o88q01p95q54p75k40M46P35P90J178J689J491N55j46l8M39Q87
53113B63353J551K411K658J778L94n68r58j121j190j234j507j967k066j561j020
53098B58953r42r40m56J66J17o48j293j167m67J25N1p00j529j666r94k38j01m15
53080B47856m56R7Q56J291J313J220J169P85l96j983k683j730n0P12J32q42j453
53063B45838j795j893j398o31o92j846k733k085m46P11R25Q51R40J076J227J516
53047B39565J748J612J269J111J059P60K85l6l51j107k160k748k444j593p21m9
$$ plain form
53031 236200 236526 236850 236928 236877 236969 237288 237675 237948 238017 237945 237948 238308 239130 240208 241156 241642 241558 241054 240365 239536 238471
53010 238471 237324 236555 236365 236392 236350 236698 238149 240611 243140 244938 245914 246339 246525 246869 247564 248073 247496 245765
52992 245765 243963 243166 243407 244078 244836 245660 246389 246823 247119 247641 248438 249253 250018 251063 252750 255077 257696
52975 257696 260242 262599 264820 266770 268021 268282 267874 267472 267448 267738 268356 269574 271440 273417 274735 274990
52959 274990 274402 273749 274010 275620 277827 279066 278263 275718 272666 270179 268447 266776 264167 260223 255733
52944 255733 252164 250411 250213 250741 251388 251850 251850 251167 249828 248146 246631 245838 245970 246598 247090 247358 247806 248505
52926 248505 248949 248798 248377 248101 247892 247505 247046 246702 246304 245637 245009 245077 246132 247874 249687 250921 251165 250660
52908 250660 250248 250456 250797 250420 249303 248230 247588 246801 245239 243245 241854 241677 242389 243260 243831 244055 244049 244013
$$ packed form
53031B36200L26L24P8n1R2L19L87K73O9p2LL60Q22J078R48M86q4n04o89q29j065
53010B38471j147p69j90K7m2L48J451K462K529J798R76M25J86L44O95N09n77j731
52992B45765j802p97K41O71P58Q24P29M34K96N22P97Q15P65J045J687K327K619
52975B57696K546K357K221J950J251K61m08m02k4K90O18J218J866J977J318K55
52959B74990n88o53K61J610K207J239q03k545l052k487j732j671k609l944m490
52944B55733l569j753j98N28O47M62%o83j339j682j515p93J32O28M92K68M48O99
52926B48505M44j51m21k76k09l87m59l44l98o67o28O8J055J742J813J234K44n05
52908B50660m12K08L41l77j117j073o42p87j562j994j391j77P12Q71N71K24ol6
$$ plain form
52890 244013 244254 244961 245879 246489 246689 247052 248103 249508 250401 250369 249765 249034 248225 247260 246316 245724 245761 246559 247912
52871 247912 249150 249645 249574 249789 250805 252361 254108 256163 258655 261266 263666 265989 268396 270527 271921
52856 271921 272670 273084 272962 271816 269737 267408 265219 262900 260148 257190 254540 252478 250856 249221 247080
52841 247080 244231 240930 237616 234574 231998 230175 229287 229101 229184 229344 229573 229699 229503 229188 229295 230055 231170
52824 231170 232327 233576 234959 236095 236427 235810 234655 233569 232972 232937 233154 233038 232071 230285 228465 227697
52808 227697 228474 230177 231634 232304 232781 234020 236212 238610 240297 240860 240385 239127 237358 235375 233469
52793 233469 231799 230269 228535 226309 223822 221908 221360 222104 223182 223712 223784 224174 225260 226497 227150 227240
52777 227240 227460 228271 229534 230963 232406 233495 233586 232486 230769 228995 227078 224989 223567 223730 225134
$$ packed form
52890B44013K41P07R18O10K00L63J051J405Q93l2o04p31q09r65r44n92L7P98J353
52871B47912J238M95p1K15J016J556J747K055K492K611K400K323K407K131J394
52856B71921P49M14j22j146k079k329k189k319k752k958k650k062j622j635k141
52841B47080k849l301l314l042k576j823q88j86Q3J60K29J26j96l15J07P60J115
52824B31170J157J249J383J136L32o17j155j086n97l5K17j16r67j786j820p68
52808B27697P77J703J457O70M77J239K192K398J687N63m75j258j769j983j906
52793B33469j670j530j734k226k487j914n48P44J078N30P2L90J086J237O53R0
52777B27240K20Q11J263J429J443J089R1j100j717j774j917k089j422J63J404
$$ plain form
52762 225134 226536 227391 228139 228933 229216 228879 228721 229193 229570 229081 228066 227302 226889 226611 226809 227942 229661
52745 229661 231206 232434 233671 234843 235659 236491 238090 240401 242477 243698 244381 245043 245761 246426 247144 248161
52729 248161 249725 251976 254586 256662 257553 257646 257758 257849 257114 255284 253053 251030 249106 247132 245495 244539
52713 244539 243957 243170 242007 240711 239617 239003 238905 238946 238776 238655 239093 239792 239753 238692 237610 237422 237691 237414
52695 237414 236580 236228 237118 238929 240723 241779 242088 242359 243385 245119 246566 246875 246285 245689 245606 245958 246565
52678 246565 247300 247854 247877 247344 246524 245678 245041 244880 245211 245673 246093 246914 248512 250291 251181 251042 250897 251563
52660 251563 252710 253574 254095 254802 255944 257239 258395 259479 260789 262627 265176 268316 271531 274196 275989
52645 275989 276847 276595 274958 272059 268631 265494 262983 261027 259585 258632 257857 256868 255741 254956 254667 254498
$$ packed form
52762B25134J402Q55P48P94K83l37j58M72L77m89j015p64m13k78J98J133J719
52745B29661J545J228J237J172Q16Q32J599K311K076J221O83O62P18O65P18J017
52729B48161J564K251K610K076Q91R3J12R1p35j830k231k023j924j974j637r56
52713B44539n82p87j163j296j094o14r8M1j70j21M38O99l9j061j082j88K69k77
52695B37414q34l52Q90J811J794J056L09K71J026J734J447L09n90n96q3L52O07
52678B46565P35N54K3n33q20q46o37j61L31M62M20Q21J598J779Q90j39j45O66
52660B51563J147Q64N21P07J142J295J156J084J310J838K549L140L215K665J793
52645B75989Q58k52j637k899l428l137k511j956j442r53p75r89j127p85k89j69
$$ plain form
52629 254498 254311 254713 256283 258697 261197 263657 266426 269160 270698 270401 268937 267353 265951 264590 263544
52614 263544 263313 263770 264185 264091 263606 262920 262014 261041 260536 260899 261902 262937 263628 264053 264507 265227 266219 267168
52596 267168 267541 267049 266117 265745 266611 268331 269838 270584 271057 271923 273025 273710 273909 274229 274882 275254 274850 274144
52578 274144 274023 274777 276058 277479 278709 279286 278975 278228 277769 277754 277864 278065 278627 279355 279522 278837 277874 277253
52560 277253 276899 276452 275932 275503 274983 274208 273646 273980 274996 275494 274500 272288 269983 268463 267860 267890 268311 269011
52542 269011 269879 270713 271253 271305 270889 270317 270017 270218 270744 271188 271377 271654 272643 274627 277174 279394 280647 281018
52524 281018 281111 281363 281595 281373 280702 280192 280432 281429 282798 284319 285981 287618 288906 289893 291226 293614 297133
52507 297133 301170 304937 307914 309904 310872 310823 309813 308081 306046 304058 302104 299883 297200 294163 291084
$$ packed form
52629B54498j87M02J570K414K500K460K769K734J538k97j464j584j402j361j046
52614B63544k31M57M15r4m85o86r06r73n05L63J003J035O91M25M54P20R92R49
52596B67168L73m92r32l72Q66J720J507P46M73Q66J102O85J99L20O53L72m04p06
52578B74144j21P54J281J421J230N77l11p47m59j5J10K01N62P28J67o85r63o21
52560B77253l54m47n20m29n20p75n62L34J016M98r94k212k305j520o03L0M21P00
52542B69011Q68Q34N40N2m16n72l00K01N26M44J89K77R89J984K547K220J253L71
52524B81018R3K52K32k22o71n10K40R97J369J521J662J637J288R87J333K388L519
52507B97133M037L767K977J990R68m9j010j732k035j988j954k221k683l037l079
$$ plain form
52492 291084 288391 286600 286014 286246 286326 285552 284125 282783 281980 281590 281241 280689 280022 279723 280333 281772 283240
52475 283240 284160 284979 286473 288449 289805 290009 289841 290422 292033 294296 296950 299926 302943 305634 307908
52460 307908 309770 310963 311281 311120 311126 311207 310407 307948 304054 299631 295419 291657 288276 285203 282564 280635
52444 280635 279437 278440 277028 275354 274394 274906 276514 277986 278294 277289 275617 274200 273629 273766 273934 273616
52428 273616 272939 272458 272646 273613 275100 276555 277427 277638 277715 278294 279544 281193 282964 284774 286605 288414
52412 288414 290263 292439 295363 299302 304108 309343 314867 321233 329181 338796 349432 360384 371021
52399 371021 380133 385927 387330 385003 380572 375131 368995 362497 356184 350257 344501 338938 333977 329866
52385 329866 326525 323990 322391 321346 320028 318221 316736 316448 317389 319167 321721 325058 328687 332055 335407
$$ packed form
52492B91084k693j791n86K32Q0p74j427j342q03l90l49n52o67k99O10J439J468
52475B83240R20Q19J494J976J356K04j68N81J611K263K654K976L017K691K274
52460C07908J862J193L18j61OQ1q00k459l894m423m212l762l381l073k639j929
52444B80635j198r97j412j674r60N12J608J472L08j005j672j417n71J37J68l18
52428B73616o77m81J88R67J487J455Q72K11P7N79J250J649J771J810J831J809
52412B88414J849K176K924L939M806N235N524O366P948R615J0636J0952J0637
52399C71021R112N794J403k327m431n441o136o498o313n927n756n563m961m111
52385C29866l341k535j599j045j318j807j485k88R41J778K554L337L629L368L352
$$ plain form
52370 335407 339525 344579 349826 354572 358930 363403 368030 372166 374970 376034 375756 375119 374884 374891 374367 373000
52354 373000 371519 371079 372182 374313 376532 378342 379944 381722 383575 385024 386005 387229 389449 392580 395944
52339 395944 399223 402747 406880 411691 417320 424120 432164 441028 450356 460219 470667 481430 492565
52326 492565 504939 519359 535461 552185 569258 587380 606853 626861 646468 665599 684509
52315 684509 702855 720033 736184 752207 768773 785784 802721 819025 834221 848184 861417
52304 861417 874606 887783 900277 911616 922079 932180 941953 951063 959359 966924 973637 978927 982058
52291 982058 982596 980652 976700 971114 963922 955200 945617 936323 928185 921366 915713 911279 908292 906849
52277 906849 906905 908475 911659 916527 923065 931094 940144 949620 959287 969530 980990 994010 1008416 1023598
$$ packed form
52370C35407M118N054N247M746M358M473M627M136K804J064k78o37k35Pn24j367
52354C73000j481m40J103K131K219J810J602J778J853J449R81J224K220L131L364
52339C95944L279L524M133M811N629O800Q044Q864R328R863J0448J0763J1135
52326D92565J2374J4420J6102J6724J7073J8122J9473K0008J9607J9131J8910
52315F84509J8346J7178J6151J6023J6566J7011J6937J6304J5196J3963J3233
52304H61417J3189J3177J2494J1339J0463J0101R773R110Q296P565O713N290L131
52291I82058N38j944l952n586p192q722r583r294q138o819n653m434k987j443
52277I06849N6J570L184M868O538Q029R050R476R667J0243J1460J3020J4406J5182
$$ plain form
52263 1023598 1038652 1052711 1065430 1077064 1087984 1098308 1108161 1117963 1128113 1138510 1148719 1158435
52251 1158435 1167549 1175906 1183392 1190164 1196359 1201584 1205067 1206328 1205326 1201990 1196134 1188065 1178868 1169697
52237 1169697 1160854 1151817 1142110 1131955 1122188 1113615 1106366 1099767 1092920 1085593 1078559 1072959 1069327 1067236
52223 1067236 1065819 1064533 1063370 1062467 1061772 1061279 1061461 1063154 1066811 1072023 1077909 1083856 1089720 1095484 1101083
52208 1101083 1106626 1112550 1119362 1127186 1135506 1143361 1149901 1154918 1158899 1162538 1166220 1169925 1173413 1176480
52194 1176480 1179270 1182430 1186685 1192022 1197498 1202173 1206075 1209957 1214187 1218286 1221535 1223692 1224909 1225171
52180 1225171 1224070 1221150 1216374 1210188 1203101 1195361 1187199 1179213 1172039 1165586 1159072 1152137 1145493 1140098
52166 1140098 1136075 1132939 1130561 1129267 1129084 1129532 1130241 1131225 1132472 1133768 1135142 1137016 1139561 1142119 1143571
$$ packed form
52263A023598J5054J4059J2719J1634J0920J0324R853R802J0150J0397J0209R716
52251A158435R114Q357P486O772O195N225L483J261j002l336n856q069r197r171
52237A169697q843r037r707j0155r767q573p249o599o847p327p034n600l632k091
52223A067236j417j286j163r03o95m93J82J693L657N212N886N947N864N764N599
52208A101083N543N924O812P824Q320P855O540N017L981L639L682L705L488L067
52194A176480K790L160M255N337N476M675L902L882M230M099L249K157J217K62
52180A225171j101k920m776o186p087p740q162p986p174o453o514o935o644n395
52166A140098m023l136k378j294j83M48P09R84J247J296J374J874K545K558J452
$$ plain form
52151 1143571 1143274 1141631 1139784 1138764 1138803 1139496 1140586 1142237 1144404 1146390 1147566 1148245 1149285 1150914 1152516
52136 1152516 1153511 1153878 1153837 1153646 1153881 1155399 1158780 1164091 1171230 1180167 1190877 1203526 1218723 1237085
52122 1237085 1258489 1282160 1307438 1333946 1361162 1388600 1416435 1445091 1473971 1501442 1526418
52111 1526418 1549171 1570181 1589006 1604877 1617735 1627984 1635750 1641057 1644328 1646084 1646506 1645840 1644803
52098 1644803 1643966 1643038 1641377 1638856 1635635 1631498 1626168 1619960 1613304 1605794 1596570 1585561 1573536 1560948
52084 1560948 1547625 1533816 1520681 1509320 1499899 1492147 1486182 1482355 1480626 1480699 1482613 1486726 1493010
52071 1493010 1500727 1509109 1518196 1528739 1541161 1554806 1568483 1581608 1594495 1607535 1620554 1633084
52059 1633084 1644775 1655255 1664041 1671016 1676632 1681176 1684145 1684931 1683847 1681804 1678978 1674454 1667353 1657754
$$ packed form
52151A143571k97j643j847j020L9O93J090J651K167J986J176O79J040J629J602
52136A152516R95L67m1j91K35J518L381N311P139Q937J0710J2649J5197J8362
52122A237085K1404K3671K5278K6508K7216K7438K7835K8656K8880K7471K4976
52111A526418K2753K1010J8825J5871J2858J0249P766N307L271J756M22o66j037
52098A644803q37r28j661k521l221m137n330o208o656p510r224j1009j2025j2588
52084A560948j3323j3809j3135j1361r421p752n965l827j729P3J914M113O284
52071A493010P717Q382R087J0543J2422J3645J3677J3125J2887J3040J3019J2530
52059A633084J1691J0480Q786O975N616M544K969P86j084k043k826m524p101r599
$$ [...]
##END NTUPLES=NMR SPECTRUM
##END=
