##TITLE=AC1505_CUNDCR13312_8126462_q7w8fun3M6
##JCAMPDX= 6.0         $$ Bruker NMR JCAMP-DX V2.0
##DATA TYPE= NMR SPECTRUM
##DATA CLASS= NTUPLES
##ORIGIN= BRUKER
##OWNER= Administrator
$$ 1.72 TOPSPIN		Version 2.1
$$ 2013-08-15 21:59:30.908 -0700  Administrator@X
$$ Compression mode = diff/dup
##.OBSERVE FREQUENCY= 400.02188249412
##.OBSERVE NUCLEUS= ^1H
##.ACQUISITION MODE= SIMULTANEOUS (DQD)
##.ACQUISITION SCHEME= undefined
##.AVERAGES= 8
##.DIGITISER RES= 22
##SPECTROMETER/DATA SYSTEM= spect
##.PULSE SEQUENCE= zg30
##.SOLVENT NAME= COFFEE_meoh
##.SHIFT REFERENCE= INTERNAL, COFFEE_meoh, 1, 14.98509
##AUDIT TRAIL= $$ (NUMBER, WHEN, WHO, WHERE, PROCESS, VERSION, WHAT)
$$ ##TITLE= Audit trail, TOPSPIN		Version 2.1
$$ ##JCAMPDX= 5.01
$$ ##ORIGIN= Bruker BioSpin GmbH
$$ ##OWNER= Administrator
$$ $$ E:\/data/COFFEE/nmr/AC1505_CUNDCR13312_8126462_q7w8fun3M6/10/pdata/1/auditp.txt
$$ ##AUDIT TRAIL=  $$ (NUMBER, WHEN, WHO, WHERE, PROCESS, VERSION, WHAT)
(   1,<2013-08-15 21:59:24.049 -0700>,<Administrator>,<X>,<go>,<TOPSPIN 2.1>,
      <created by zg
	started at 2013-08-15 21:58:18.033 -0700,
	POWCHK enabled, PULCHK disabled,
       configuration hash MD5:
       C8 4E 4E 5D D3 5C D8 9E 9F 52 82 E0 59 8A DE 15
       data hash MD5: 64K
       3B 4D F0 BA 5E 2B 7B A8 E6 B1 CA B1 6E 73 EF A8>)
(   2,<2013-08-15 21:59:26.971 -0700>,<Administrator>,<X>,<proc1d>,<TOPSPIN 2.1>,
      <Start of raw data processing
       efp LB = 0 FT_mod = 6 PKNL = 1 PHC0 = 0 PHC1 = 0 SI = 32K 
       data hash MD5: 32K
       E5 01 22 62 02 4E AB 3C 7E E9 8F 3C 93 66 09 2F>)
(   3,<2013-08-15 21:59:27.283 -0700>,<Administrator>,<X>,<proc1d>,<TOPSPIN 2.1>,
      <pk PHC0 = 97.22351 PHC1 = 0 
       data hash MD5: 32K
       11 D4 E0 50 70 B9 41 3D 6B 2E 5B 40 4B BC 70 E7>)
(   4,<2013-08-15 21:59:27.440 -0700>,<Administrator>,<X>,<proc1d>,<TOPSPIN 2.1>,
      <abs ABSG = 1 
       data hash MD5: 32K
       55 63 4D 0D A1 2E 69 22 24 54 81 83 12 EF AB D9>)
(   5,<2013-08-15 21:59:27.533 -0700>,<Administrator>,<X>,<proc1d>,<TOPSPIN 2.1>,
      <abs ABSG = 2 
       data hash MD5: 32K
       05 2B FC 0E 7A 30 D2 03 99 41 47 9B 49 51 47 D3>)
(   6,<2013-08-15 21:59:27.580 -0700>,<Administrator>,<X>,<proc1d>,<TOPSPIN 2.1>,
      <abs ABSG = 3 
       data hash MD5: 32K
       D1 F7 AB 47 2D 17 33 0C 86 2F A5 E5 9A A5 6D D0>)
(   7,<2013-08-15 21:59:27.690 -0700>,<Administrator>,<X>,<proc1d>,<TOPSPIN 2.1>,
      <abs ABSG = 4 
       data hash MD5: 32K
       03 26 29 E5 85 0F 55 6B 2B FB CD 8D 49 FF 89 47>)
(   8,<2013-08-15 21:59:27.752 -0700>,<Administrator>,<X>,<proc1d>,<TOPSPIN 2.1>,
      <abs ABSG = 5 
       data hash MD5: 32K
       45 F0 9D 25 DE F2 2C B5 19 A8 0F 39 3E 2B 88 08>)
$$ ##END=
$$ 
$$ $$ hash MD5
$$ $$ 69 DD B0 30 76 5F 08 7A 57 6E 81 CE 2A 87 D9 0A
##$RELAX= 
##$RELAX= 
##$RELAX= 
##$RELAX= 
##$RELAX= 
##$RELAX= 
##$RELAX= 
$$ Bruker specific parameters
$$ --------------------------
##$DU= <E:\>
##$EXPNO= 10
##$NAME= <AC1505_CUNDCR13312_8126462_q7w8fun3M6>
$$ [...]
##$TP= (0..7)
150 150 150 150 150 150 150 150
##$TP07= 0
##$TPNAME0= <>
##$TPNAME1= <>
##$TPNAME2= <>
##$TPNAME3= <>
##$TPNAME4= <>
##$TPNAME5= <>
##$TPNAME6= <>
##$TPNAME7= <>
##$TPOAL= (0..7)
0.5 0.5 0.5 0.5 0.5 0.5 0.5 0.5
##$TPOFFS= (0..7)
0 0 0 0 0 0 0 0
##$TUNHIN= 0
##$TUNHOUT= 0
##$TUNXOUT= 0
##$USERA1= <user>
##$USERA2= <user>
##$USERA3= <user>
##$USERA4= <user>
##$USERA5= <user>
##$V9= 5
##$VALIST= <valist>
##$VCLIST= <CCCCCCCCCCCCCCC>
##$VD= 0
##$VDLIST= <DDDDDDDDDDDDDDD>
##$VPLIST= <PPPPPPPPPPPPPPP>
##$VTLIST= <TTTTTTTTTTTTTTT>
##$WBST= 1024
##$WBSW= 4
##$XGAIN= (0..3)
0 0 0 0
##$XL= 0
##$YL= 0
##$YMAX_a= 640292
##$YMIN_a= -545312
##$ZGOPTNS= <>
##$ZL1= 120
##$ZL2= 120
##$ZL3= 120
##$ZL4= 120
##$ABSF1= 14.98509
##$ABSF2= -5.573092
##$ABSG= 5
##$ABSL= 3
##$ALPHA= 0
##$AQORDER= 0
##$ASSFAC= 0
##$ASSFACI= 0
##$ASSFACX= 0
##$ASSWID= 0
##$AUNMP= <proc_prof1d_extract_pilot.lims>
##$AXLEFT= 0
##$AXNAME= <>
##$AXNUC= <1H>
##$AXRIGHT= 0
##$AXTYPE= 0
##$AXUNIT= <>
##$AZFE= 0.1
##$AZFW= 0.1
##$BCFW= 0
##$BC_mod= 0
##$BYTORDP= 0
##$COROFFS= 0
##$CY= 15
##$DATMOD= 1
##$DC= 0
##$DFILT= <>
##$DTYPP= 0
##$F1P= 0
##$F2P= 0
##$FCOR= 0.5
##$FTSIZE= 32768
##$FT_mod= 6
##$GAMMA= 0
##$GB= 0
##$INTBC= 1
##$INTSCL= 1
##$ISEN= 128
##$LB= 0
##$LEV0= 0
##$LPBIN= 0
##$MAXI= 10000
##$MC2= 0
##$MEAN= 0
##$ME_mod= 0
##$MI= 0
##$NCOEF= 0
##$NC_proc= -8
##$NLEV= 6
##$NOISF1= 0
##$NOISF2= 0
##$NSP= 0
##$NTH_PI= 0
##$NZP= 0
##$OFFSET= 14.98509
##$PC= 1
##$PHC0= 97.22351
##$PHC1= 0
##$PH_mod= 1
##$PKNL= yes
##$PPARMOD= 0
##$PPDIAG= 0
##$PPIPTYP= 0
##$PPMPNUM= 2147483647
##$PPRESOL= 1
##$PSCAL= 4
##$PSIGN= 0
##$PYNMP= <proc.py>
##$REVERSE= no
##$SF= 400.02
##$SI= 32768
##$SIGF1= 0
##$SIGF2= 0
##$SINO= 400
##$SIOLD= 32768
##$SPECTYP= <>
##$SREGLST= <1H.CDCl3>
##$SSB= 0
##$STSI= 32768
##$STSR= 0
##$SW_p= 8223.68421052631
##$SYMM= 0
##$S_DEV= 0
##$TDeff= 65536
##$TDoff= 0
##$TI= <>
##$TILT= no
##$TM1= 0
##$TM2= 0
##$TOPLEV= 0
##$USERP1= <user>
##$USERP2= <user>
##$USERP3= <user>
##$USERP4= <user>
##$USERP5= <user>
##$WDW= 1
##$XDIM= 32768
##$YMAX_p= 450957197
##$YMIN_p= -726950
##$CURPLOT= <Network HP LaserJet P1505>
##$CURPRIN= <$Network HP LaserJet P1505>
##$DFORMAT= <normdp>
##$LAYOUT= <+/1D_H.xwp>
##$LFORMAT= <normlp>
##$PFORMAT= <normpl>
##$SURQMSG= 1
$$ End of Bruker specific parameters
$$ ---------------------------------
##NTUPLES= NMR SPECTRUM
##VAR_NAME=  FREQUENCY,     SPECTRUM/REAL,   SPECTRUM/IMAG
##SYMBOL=    X,             R,               I
##VAR_TYPE=  INDEPENDENT,   DEPENDENT,       DEPENDENT
##VAR_FORM=  AFFN,          ASDF,            ASDF
##VAR_DIM=   32768,         32768,           32768
##UNITS=     HZ,            ARBITRARY UNITS, ARBITRARY UNITS
##FACTOR=    0.250966925370066, 1,           1
##FIRST=     8223.43324360094, 40540,        7993
##LAST=      0,             12805,           -257121
##MIN=       0,             -726950,         0
##MAX=       8223.43324360094, 450957197,    0
$$ Real data points
##PAGE= N=1
##DATA TABLE= (X++(R..R)), XYDATA
$$ [...]
19549C0614a1029b919B00821P8287b32595A38761H197K1684K58679a40057F239
19537c6538E1738g8265A98945b08571i1465B9268g075B0390J68838d55164D5060
19525c46521l6865H5175O2154D5849a96358K9067A64898p8918a71840B75740a31999
19513I3970J12235k6532a19750k0524A86543b34288P0030G8879a37823n1548C17991
19501a68798L4629d3288j3680B8251h7829j45541m5388D4902j0775b29431o9153
19490b98584J25057A61090E570J82611q2582J92161b81448A07151K08385A03485
19479B07520c26761i1560l3619b0445p6531p378l15942J54392Q856A24814b2958
19467A98630c66284E39e7926E1978K6160K1725f0771j06866q6701a5486C09230
$$ plain form
19549 30614 -11029 -2919 200821 279108 -232595 138761 8197 29881 288560 -140057 6239
19537 -36538 51738 -78265 198945 -208571 -91465 29268 -7075 20390 189228 -455164 45060
19525 -346521 -383386 85175 147329 45849 -196358 -167291 164898 85980 -171840 275740 -131999
19513 93970 206205 179673 -119750 -140274 186543 -234288 -164258 78879 -137823 -189371 317991
19501 -168798 -134169 -43288 -56968 28251 -87829 -233370 -278758 44902 34127 -229431 -298584
19490 -298584 -173527 161090 5570 188181 105599 297760 -281448 107151 315536 103485
19479 207520 -326761 -91560 -125179 -20445 -96976 -104354 -420296 -265904 -257048 124814 -22958
19467 198630 -366284 539 -57926 51978 78138 99863 -60771 -167637 -254338 -15486 309230
19455c7300Q822k46786Q3374A71972a59792K1336n1620m0941C0524Q476a97556
19443C27959A17851L7516j5927E7805M05936a62160B93944b26799j18659a22325
19432d90370I4805I941b01720r8213C08919F5678b04135A39538h4685n3365C3732
19420a0665H0644i1045A48233m2389e6930A68298b90055J36097F4710D73R3721
19409I4194N3746E7468A0163b3339j79154j2492M2316j54402h0130B43689b48737
19397c30725b6370j86177j44233F3474R5229b44683J12623j27440a247p8909j55685
19386b35841C1209R0107h1121j42190e8448k83400o032C9810c8835j85061a59
19374A8296a10121C2134f69604a6654B21764B0153K34606f9606B55439d3391Q156
$$ plain form
19455 -37300 -28478 -275264 -191890 171972 -159792 -138456 -190076 -231017 30524 39000 -197556
19443 327959 117851 155367 139440 57805 463741 -162160 293944 -226799 -345458 -122325
19432 -490370 94805 9941 -201720 -299933 308919 65678 -204135 139538 -84685 -138050 33732
19420 -10665 80644 -91045 148233 105844 -56930 168298 -290055 -153958 64710 473 94194
19409 94194 147940 57468 10163 -23339 -202493 -214985 -172669 -327071 -80130 243689 -248737
19397 -330725 -26370 -212547 -356780 63474 158703 -244683 -132060 -259500 -1247 -80156 -235841
19386 -235841 31209 121316 -81121 -223311 -58448 -341848 -347880 39810 -38835 -223896 -159
19374 18296 -110121 32134 -669604 -16654 221764 20153 254759 -69606 255439 -43391 -35235
19363c5235A65687j022n1643h2907m42249C885J48286d7288a2216j47525k8082
19352a87823K38I8437J60094b30745a0560C61184a11963K0962g78H7456b82494
19340a19095B3404b37685d4385C1117b25449e09m6607j71605C4597K2071b36028
19328C7515b89148B62555a28985j25206b2952k4092j96904q7749P2525B27889
19317b61402D8594D214e20706P6108g3116j18548L7057C54916A18744b7338A8224
19305e735A43719m5167b23602e6512A40784a0945r3856D50119a30290j17674g3485
19293C74561A30827E3288h6539j50062b782B62519a00059A34135g9825j5286A30190
19281A39713i7430q5346h4587c5198k25904j15589R0905H0151l2116b66700Q1358
$$ plain form
19363 -35235 165687 164665 113022 -82907 -525156 3885 152171 -47288 -12216 -159741 -187823
19352 -187823 -187585 98437 258531 -230745 -10560 361184 -111963 -91001 -778 87456 -282494
19340 -119095 23404 -237685 -44385 31117 -225449 -509 -47116 -218721 34597 56668 -236028
19328 37515 -289148 262555 -128985 -254191 -22952 -47044 -243948 -331697 -259172 227889
19317 -261402 48594 4214 -520706 -444598 -73116 -191664 -154607 354916 118744 -27338 18224
19305 -5735 143719 98552 -223602 -56512 140784 -10945 -104801 450119 -130290 -247964 -73485
19293 374561 130827 53288 -86539 -236601 -2782 262519 -100059 134135 -79825 -95111 130190
19281 139713 -97430 -182776 -84587 -35198 -261102 -376691 -285786 80151 48035 -266700 -185342
19270a85342D69088A16115b41569Q841C8973b64897O729J11208G1909a58701A944
19258c22069e8080q699K7137H0054b19632A22193a08102o6447a1843k02307B4143
19246a68090L42f0185d410F1156L2519a83328f1981J1141H7867a44089E4153A9548
19233c940k99013K4905r9066f5526k26292l8951e7908k58060l285L8859A85114
19221d52709A07012a04677M3046C1709d42351F6418a48319j67152B24755h8037
19210g4880r8234G042c06345b9518H0210c37486e7903k99169a47208K9128j32834
19199b50914D7626a13522j26670K6340O8178j64647A21403a17517C8873K0823
19189E9696j9268j4676O291c58649J43191i4170I5942K56903A29704d649n4967
$$ plain form
19270 -185342 469088 116115 -241569 -232728 38973 -264897 -258168 -146960 71909 -158701 1944
19258 -322069 -58080 -66779 -39642 80054 -219632 122193 -108102 -174549 -11843 -214150 24143
19246 -168090 -167748 -60185 -4410 61156 93675 -183328 -61981 -50840 87867 -144089 54153 19548
19233 -3940 -302953 -278048 -377114 -65526 -291818 -330769 -57908 -315968 -319253 -280394 185114
19221 -452709 107012 -104677 -61631 31709 -442351 66418 -148319 -315471 224755 -88037
19210 -74880 -173114 7042 -306345 -29518 80210 -337486 -57903 -357072 -147208 -118080 -250914
19199 -250914 47626 -113522 -240192 -213852 -145674 -310321 121403 -117517 38873 59696
19189 59696 40428 25752 32043 -358649 -215458 -94170 95942 352845 129704 -4649 -59616
19178e9616k5799H5498a9014k49037A2270J32895b3220C47321d5608B82135C1850
19166a15586j06254g6186A53022f4134A6080a59424A35836b22809b3459k20791
19156b44250p3958a28456A34326e7516c381m2729k26246E785b876B9865J93289
19145B23154g7031j35776L4997H9013b29422j39900A39194a51486o00a7403D03077
19133g327j11426j53545J16117e9897K1358n1539k14757a5534H8958o350a53473
19121e3998j754G8330h9602p0689A11457R8007g7321k21440C5860Q5788n0594
19110G1054a18413i120A54998B9860g2734k98992J72420P4262a8532B67036g6700
19098a32801A06551A622N7437a85830F3367d70488b22276q5160g0901k28221a18870
$$ plain form
19178 -59616 -85415 85498 -19014 -268051 12270 145165 -23220 347321 -45608 282135 31850
19166 -115586 -221840 -76186 153022 -64134 16080 -159424 135836 -222809 -23459 -244250
19156 -244250 -318208 -128456 134326 -57516 -3381 -46110 -272356 5785 -2876 29865 223154
19145 223154 -77031 -212807 -177810 89013 -229422 -369322 139194 -151486 -152086 -17403 403077
19133 -7327 -118753 -272298 -156181 -59897 -38539 -90078 -304835 -15534 88958 82608 -153473
19121 -53998 -55752 78330 -89602 -160291 111457 209464 -77321 -298761 35860 121648 71054
19110 71054 -118413 -9120 154998 29860 -72734 -371726 -199306 -125044 -18532 267036 -76700
19098 -132801 106551 1622 59059 -185830 63367 -470488 -222276 -307436 -70901 -299122 -118870
19086a5083j252j0865k32377A96448b70560C4153a17109j41788B65299P5182a30239
19074a94980g0242A19016j2509a9556A68819a02481b0108E4429a49909j24491
19064b74400A24363a21369E100c6406L657m4442k55780O5499p9217J33077a5336
19052A15784J9720a37289n2572E6010a1443j35284O6865a6591F4829a79035k3335
19041b02370P8684N60k83724J32507A20773b7593B1185L92869i2076A9626J0735
19030C0361a18696B07462a07493C41291a85374b3489k7097o8414j08014a3273
19019b26422H3800f7705l38118E1908b98740a02522B55313f6274m26684c2951
19008d13656b6261j92600B88165A4849a45857j7250A80648g8288k11267E7483
$$ plain form
19086 -15083 -16335 -27200 -259577 196448 -270560 34153 -117109 -258897 265299 340481 -130239
19074 -194980 -70242 119016 106507 -19556 168819 -102481 -20108 54429 -149909 -274400
19064 -274400 124363 -121369 5100 -36406 -32749 -77191 -332971 -267472 -346689 -213612 -15336
19052 115784 135504 -137289 -189861 56010 -11443 -146727 -79862 -16591 64829 -179035 -202370
19041 -202370 -123686 -123126 -406850 -274343 120773 -27593 21185 414054 -92076 19626 30361
19030 30361 -118696 207462 -107493 341291 -185374 -23489 -50586 -119000 -227014 -13273
19019 -226422 83800 -67705 -405823 51908 -298740 -102522 255313 -66274 -492958 -32951
19008 -413656 -26261 -218861 288165 14849 -145857 -163107 180648 -78288 -289555 57483
18997C77990d80111a49511b9066I9021L1621B9406N9374h2448e307F8341j9428
18986D8913b58898h5864j14208A17305K4040F4679a38323M3320F3886a18368K8857
18975h9511A23036l2232a46278Q937A83050d8956G824M3283K572a2503j68638
18964a81141E1638c019B26636a5060k44629F5831c5933G5002I946d21934B535
18952h4865k86779i48B03859a63345j37888G1993C044g8266A36826a45593B31696
18940A02995a22820k58188C05506a69111B8824d3516m8725B34985a27866F1016
18929b96121i084k4537D899d2261A13892b26717P5388n7032C9614i5099A36024
18917d36643a30175L2235j25017h5256r7227A19780l9419a02041I50g1762C0397
$$ plain form
18997 377990 -480111 -149511 -29066 99021 130642 29406 88780 -82448 -5307 68341 48913
18986 48913 -258898 -85864 -200072 117305 141345 64679 -138323 -95003 63886 -118368 -89511
18975 -89511 123036 90804 -146278 -137341 183050 -48956 7824 51107 53679 -12503 -181141
18964 -181141 51638 -3019 226636 -15060 -259689 65831 -35933 75002 9946 -421934 2535
18952 -84865 -371644 -948 203859 -163345 -301233 71993 3044 -78266 136826 -145593 231696
18940 102995 -122820 -381008 305506 -169111 28824 -43516 -92241 234985 -127866 61016
18929 -296121 -9084 -33621 4899 -42261 113892 -226717 -151329 -208361 39614 -95099 136024
18917 -436643 -130175 -97940 -222957 -85256 -182483 119780 80361 -102041 950 -71762 30397
18905c26415J42245C0986a53675C4907J41483M9395A03230J34223b5392A06278
18894b65559A05159b32986c2041A44361a42763k29321a32331M6005j9490j82195
18884b88011b4666D16060b37264A01920a42094E935K44611b03844R3416L5555
18874g4873a0924k14191E153b46415L4862A7198K37502B2415a75769C4742a31830
18862I7026a41149G0426g8946B23761j7947G986a696j20636e3080j53456e0602
18850b22449j06537e1365m20822A35561n2788a95159d8902B23205c05257A42395
18839i4504j68645G047O3652b76552a32067A11975d69276C6738L9007L1710a84811
18827E6765Q5412e1593r1476R967r4678c0695r0306C59090H7486L63142j77216
$$ plain form
18905 -326415 -184170 30986 -153675 34907 176390 225785 103230 237453 -25392 106278
18894 -265559 105159 -232986 -32041 144361 -142763 -372084 -132331 -86326 -105816 -288011
18884 -288011 -24666 416060 -237264 101920 -142094 5935 250546 -203844 -110428 -74873
18874 -74873 -10924 -225115 5153 -246415 -211553 17198 254700 22415 -175769 34742 -131830
18862 97026 -141149 70426 -78946 223761 205814 7986 -1696 -122332 -53080 -206536 -50602
18850 -222449 -328986 -51365 -472187 135561 82773 -195159 -48902 223205 -305257 142395
18839 -94504 -263149 7047 70699 -276552 -132067 111975 -469276 36738 75745 107455 -184811
18827 56765 142177 -51593 -143069 -133102 -227780 -30695 -121001 359090 87486 450628 273412
18816B73412j33416a29294M3518B47523a92620R3213A46328m6906N2321a00996
18805b8999k37513A32450O4070g0997r3791g4510D7100c9373k10278K1806L5872
18794a91973Q66k7521R1542j3791N0104A12147m9851f8771Q710j91568I1531a82520
18781B6480b29177D5235g4356A11746j8801L8646a63587m04887b11949d6854j92412
18770b39266c1558A68872F0633b05324A61572b4162k35633A12293c20797A27638
18759A33446f0378k93489J33128C4596i6748j92037A14160e2741A10837b77085
18748C7313a31227k04097J37182i3552A65299b21094H720e9600m7870j7862p7940
18737b03272n7157Q9913A77370c52323M6481n266b5105D4838d6053j1441A20094
$$ plain form
18816 273412 139996 -129294 -85776 247523 -192620 -99407 146328 99422 151743 -100996
18805 -28999 -266512 132450 196520 -70997 -164788 -74510 47100 -39373 -249651 -227845 -191973
18794 -191973 -191107 -218628 -127086 -140877 -90773 112147 62296 -68771 -60061 -251629 91531 -182520
18781 26480 -229177 45235 -74356 111746 92945 131591 -163587 -568474 -211949 -46854 -239266
18770 -239266 -31558 168872 60633 -205324 161572 -24162 -259795 112293 -320797 127638
18759 133446 -60378 -353867 -220739 34596 -96748 -288785 114160 -52741 110837 -277085
18748 37313 -131227 -335324 -198142 -93552 165299 -221094 8720 -59600 -107470 -125332 -203272
18737 -203272 -260429 -170516 177370 -352323 -305842 -311108 -25105 44838 -46053 -57494 120094
18725a42781K2011a3658m17544a53420C4517a8385A38394b52508A09320a07990
18714f7053n4171j00784P4096A89911a5674m55138A4702d4482C3964d41922R062
18703d32860g6669B6263b08611B47709b1672j31849K9654C34603a87204m2559
18693b29763O0773A52216j5167a7238q8571A05J21229M2496b98800H942N3065
18682F2007E329a58445C40041d1510k4451H9785f5764A65572i6274A9318c80871
18670e3129j66733P1765n0110A15213a42182B77538E5167f9036o367A2154a01200
18658f902l7110j96253P3425k25596a32806C63659a25053l87922b22195d7887
18647A62774F9695a74014A27108j3340c9124k53012c4852k1795d529I4427b657
$$ plain form
18725 -142781 -120770 -13658 -431202 -153420 34517 -18385 138394 -252508 109320 -107990
18714 -67053 -121224 -222008 -147912 189911 -15674 -470812 14702 -44482 33964 -441922 -432860
18703 -432860 -76669 26263 -208611 247709 -21672 -153521 -123867 334603 -187204 -229763
18693 -229763 -168990 152216 137049 -17238 -105809 105 121334 163830 -298800 8942 62007
18682 62007 5329 -158445 340041 -41510 -65961 89785 -65764 165572 -96274 19318 -380871
18670 -53129 -219862 -148097 -198207 115213 -142182 277538 55167 -69036 -75403 12154 -101200
18658 -6902 -44012 -240265 -166840 -392436 -132806 363659 -125053 -512975 -222195 -47887
18647 162774 69695 -174014 127108 113768 -39124 -292136 -34852 -56647 -4529 94427 -2657
18635a57214g4982A922a55904p839c6825A12652a24581A44915f1091B89746c9066
18623a5414j28481B72550b27495G2246c5622j46859J882l4536A90696c31828k9136
18612c60964N9993h4864j70543R69h8811M0829j04834A95800D0514g969k49939
18601b57908A05190A1935J24769b26569b9652I2820c44632d5291j07312B58322
18590A61511b68507E1680a80163b8582l5233c95k48842a14192k11588a02417A5090
18578H4953f8746p1848A55898d10650a1604k32042i3672o457C892b83264D1196
18566b2616A1679i8738j61503a23065A19718E4374M4860f992A87731d8974A36290
18554B54724c7628I6709A1605J74480L9934L978n0169a94644b0157I1366B7665
$$ plain form
18635 -157214 -74982 1922 -155904 -163743 -36825 112652 -124581 144915 -61091 289746 -39066
18623 -15414 -143895 272550 -227495 72246 -35622 -182481 -180599 -215135 190696 -331828 -360964
18612 -360964 -300971 -84864 -255407 -254438 -88811 -47982 -152816 195800 40514 -7969 -257908
18601 -257908 105190 11935 136704 -226569 -29652 92820 -344632 -45291 -152603 258322
18590 161511 -268507 51680 -180163 -28582 -63815 -395 -249237 -114192 -325780 -102417 15090
18578 84953 -68746 -140594 155898 -410650 -11604 -243646 -93672 -100129 3892 -283264 41196
18566 -22616 11679 -98738 -260241 -123065 119718 54374 99234 -6992 187731 -48974 136290
18554 254724 -37628 96709 11605 186085 226019 229997 179828 -194644 -20157 91366 27665
18542D2344c44678g2374L6088j70513A65256l4813g5609H6531N5016b9026H8792
18530b30744I1773A0944a17198A483O7297a01055C03125b98868A57556m7876C6522
18518a29063p5134j1091a07512l9874I2251O8676a8571l67408d2595j70306l85581
18507e98482A5481c66948J1390O5373H0490a19630c8899m0184B1910a50154j48145
18496b98299a08360n5404C27901b47354J01436p2032L2354n2539j06570H2880
18485A09639a00598A64590p7887e32182A03928L4801g2734A06214A9214p540i2774
18473c71183e6265A88415C4615g2290j43178h3351G1236a5535C8153f1542B4154
18461f1270j25240f1958A80967M5597F0278J07319P7331I1763J09923d6551a3667
$$ plain form
18542 42344 -344678 -72374 -36286 -206799 165256 130443 -75609 86531 141547 -29026 88792
18530 -230744 91773 10944 -117198 1483 68780 -101055 303125 -298868 157556 109680 36522
18518 -129063 -204197 -215288 -107512 -147386 92251 160927 -18571 -385979 -42595 -212901 -598482
18507 -598482 15481 -366948 -355558 -290185 80490 -119630 -38899 -79083 21910 -150154 -298299
18496 -298299 -108360 -163764 327901 -247354 -145918 -217950 -185596 -238135 -344705 82880
18485 109639 -100598 164590 86703 -532182 103928 138729 -72734 106214 19214 11674 -92774
18473 -371183 -56265 188415 34615 -72290 -215468 -83351 71236 -15535 38153 -61542 24154
18461 -61270 -186510 -61958 180967 226564 60278 167597 244928 91763 201686 -46551 -13667
18449a26435k57913i5598A7672b93781b7807k1664B8629N0461c2971l05503J06129
18438b32345A20815b46632C64402b93505D0183N54042b1661n6919n4685F6949
18427a62571A45897a32394c3286j37253k37777a13807C98444d70676B31219O6503
18417B97722e0371D7131a39604A46188J2382b83527f2632B9196g0298G0751a58382
18405A04134b91663B68122a59421f874l29736e5679b3497j47610H9250f2606D1678
18393A20416a8427k47545k8481h3512k10463g6490A67174M7156a3637B76307b49075
18381d9599k05044R0110B3129a18393C45733A68550J90438a66729O0922j04936
18371b10743O1619N8646A8439a14919A23164P9730B93O4367K43528b9175C34089
$$ plain form
18449 -126435 -384348 -95598 17672 -293781 -27807 -49471 28629 79090 -32971 -338474 -232345
18438 -232345 120815 -246632 364402 -293505 40183 594225 -21661 -78580 -133265 66949
18427 -162571 145897 -132394 -33286 -170539 -408316 -113807 398444 -470676 231219 297722
18417 297722 -50371 47131 -139604 146188 158570 -283527 -62632 29196 -70298 70751 -158382
18405 104134 -291663 268122 -159421 -6874 -336610 -55679 -23497 -171107 89250 -62606 41678
18393 120416 -18427 -265972 -294453 -83512 -293975 -76490 167174 214330 -13637 276307 -249075
18381 -49599 -254643 -164533 23129 -118393 345733 168550 358988 -166729 -105807 -210743
18371 -210743 -149124 -90478 18439 -114919 123164 202894 293 64660 308188 -29175 334089
18359A47347a01201A72741f1034n0672A91942p8660J3739a35332N0584K8320j6304
18348g2732A78247b2520A44860d4900J4725n0443J1116n793k56461a42898A02296
18336a8464A7597K2528c18801C00294B5223a02367L2424b7331j91344L6812f7237
18324b0938m01855B36397F0251a85188g9052D46336b71218b3821g212l32583a0980
18312G5732N7017A8171h9574o7834M3300m7440A27527b2593A22463m091l4047
18301H4325J02534F616L7571K59065a27846q2076g8169A10389a23213j42423e2684
18289a29101k16811J71346j6786q7778B21885g2686p0180O2519H804J01177a82720
18277a07358j53280a12267I7482l87k8130a33755D0947A0315f4760l0068B77822
$$ plain form
18359 147347 -101201 172741 -61034 -111706 191942 113282 127021 -135332 -84748 -56428 -72732
18348 -72732 178247 -22520 144860 -44900 -30175 -80618 -69502 -75295 -331756 -142898 102296
18336 -18464 17597 40125 -318801 300294 25223 -102367 -69943 -27331 -218675 -181863 -67237
18324 -20938 -422793 236397 60251 -185188 -79052 446336 -271218 -23821 -7212 -339795 -10980
18312 75732 132749 18171 -89574 -157408 -114108 -161548 127527 -22593 122463 118372 84325
18301 84325 186859 6616 44187 303252 -127846 -209922 -78169 110389 -123213 -265636 -52684
18289 -129101 -345912 -174566 -191352 -279130 221885 -72686 -142866 -80347 8804 109981 -182720
18277 -107358 -260638 -112267 97482 97095 68965 -133755 40947 10315 -64760 -94828 277822
18265A80301D2459g4622B55197a63453A05651f788C7106d7628A39934e58941E4506
18253h2789K2281H7517A7157J06337g6225j23757F8707d7300a590j24573j94864
18242c21027E141J49568b86493L9727J2189L3008A25923a04714B15835J28491
18232C44326A51584a36568j4068B30313j03131b22821J00623k03689C1838M5537
18222G7375j5549k118i7313p4900A57820C8702J27467b72645g2290l6906J056
18211a08140B8661j0328c05316a44133a7880G9803A6542d9565j92434R3882d5537
18199A45503e9377A98406f7367o0950c6091r878j26369f2324C7506g9683j92969
18188b72652D4143h1903A07098M940l2569E997g9575n5171A51087F2812f3228
$$ plain form
18265 180301 42459 -74622 255197 -163453 105651 -6788 37106 -47628 139934 -558941 54506
18253 -82789 -60508 87517 17157 123494 -76225 -199982 68707 -47300 -1590 -126163 -321027
18242 -321027 5141 154709 -286493 -246766 -234577 -201569 125923 -104714 215835 344326
18232 344326 151584 -136568 -150636 230313 127182 -222821 -122198 -325887 31838 77375
18222 77375 61826 59708 -97313 -172213 157820 38702 166169 -272645 -72290 -109196 -108140
18211 -108140 28661 18333 -305316 -144133 -17880 79803 16542 -49565 -241999 -148117 -45537
18199 145503 -59377 198406 -67367 -128317 -36091 -45969 -172338 -62324 37506 -79683 -272652
18188 -272652 44143 -81903 107098 112038 79469 5997 -79575 -134746 151087 62812 -63228
18176B36109a7328q2138A55694b96476A85302c47817J22996e4841a0574l49659
18166c60233q1553e4499A31266a23473q4986B13887d27404A10597a05076a8032
18155a91460b6537d85I8686a91379A29963O3494a70897A24393d0239j48627n3582
18144b42448A48649A0412L16395e5216A72560b2780B2390b6298r3874A55730C9771
18132A87025b82294a03769K5235A50711D1036a67104B53233c08522J13472d2225
18121A73927i7932B10536h2499o8308l2449c4284q2301A43200c09318d5692k330
18110d8022B09158j03326c11026C719R5953b61877D2512J75532I5105D1288a03050
18098A34479d83039I9695J49251L5121c69848G0480a29923C5140J66674E9973
$$ plain form
18176 236109 -17328 -99466 155694 -296476 185302 -347817 -224821 -54841 -10574 -360233
18166 -360233 -441786 -54499 131266 -123473 -208459 213887 -427404 110597 -105076 -18032
18155 -191460 -26537 -485 98686 -191379 129963 193457 -170897 124393 -40239 -188866 -242448
18144 -242448 148649 10412 326807 -55216 172560 -22780 22390 -26298 -120172 155730 39771
18132 187025 -282294 -103769 -78534 150711 41036 -167104 253233 -308522 -195050 -42225
18121 173927 -97932 210536 -82499 -150807 -183256 -34284 -116585 143200 -309318 -45692 -48022
18110 -48022 209158 105832 -311026 3719 99672 -261877 42512 218044 95105 41288 -103050
18098 134479 -483039 99695 248946 284067 -369848 70480 -129923 35140 201814 59973
18087e8799A28635j9040l871f2978C4933R2659o3522i3744G8824J37285f1604
18075e4121n9444j00062I61J24577b00686K6060B3588a94631A89745K0549j02248
18064A08046e5713n1187l5748F7155b14991b0508k85561B19603a45669A9823b24257
18052D21999a29453F6927J05790d6099E2275P2093c1822l12839J05679B23741
18041a37588B102b6045p7818k09180e1950k32358A2646R402a17036a6375B30190
18029b00253A1582P3757a06487I5568b96319J10915E6320j0588d9791A04829J14735
18018B19564f2742k10659p6574a39787f0665D9377a64560A57649a55714g6060
18007D4134c21872H7353j2263k5802a82949Q8779D38527I4143h768I2771c31576
$$ plain form
18087 -58799 128635 109595 105724 -62978 34933 127592 64070 -93744 78824 216109 -61604
18075 -54121 -113565 -213627 961 125538 -200686 -174626 23588 -194631 189745 210294 108046
18064 108046 -55713 -106900 -142648 67155 -214991 -20508 -306069 219603 -145669 19823 -224257
18052 421999 -129453 66927 172717 -46099 52275 124368 -31822 -344661 -238982 223741
18041 -137588 2102 -26045 -103863 -313043 -51950 -284308 12646 22048 -117036 -16375 230190
18029 -200253 11582 85339 -106487 95568 -296319 -185404 56320 45732 -49791 104829 219564
18018 219564 -62742 -273401 -349975 -139787 -60665 49377 -164560 157649 -155714 -76060
18007 44134 -321872 87353 75090 49288 -182949 -94170 438527 94143 -8768 92771 -331576
17995e37j9977B41045b04715O3659F2021b61242C5489d0869A20275b23663A14636
17983G482R9196L58866c25456a18759j8368B52385m1996G7675a31040J573B2484
17971a08799o9275I7847A32a8055B95558I976E57h5729k4838A680a26139a9645
17958c3761l01201a0907j81158e6415m2403E1456K7451a16519j05752d89j63051
17947a63540B73516H3437b0296A91727d015A06639b10173j4382i1628r1502a0236
17935F9316c71231d3904H8625b15708e4242k93150J33139A48246O4381i9586j70163
17924b69749M3700D5278N8174a28898e3336k24560O7747A4033P3613a2489p4300
17913h6789r5526A54155d9291B82022d2052n4863A16937a09161k103A48947k6162
$$ plain form
17995 -537 -20514 241045 -204715 -141056 62021 -261242 35489 -40869 120275 -223663 114636
17983 7482 106678 465544 -325456 -118759 -137127 252385 210389 77675 -131040 -129467 22484
17971 -108799 -178074 97847 132 -18055 295558 9976 557 -85729 -110567 1680 -126139 -19645
17958 -33761 -334962 -10907 -192065 -56415 -98818 51456 78907 -116519 -222271 -489 -163540
17947 -163540 273516 83437 -20296 191727 -4015 106639 -210173 -224555 -91628 -183130 -10236
17935 69316 -371231 -43904 88625 -215708 -54242 -347392 -214253 148246 212627 -99586 -269749
17924 -269749 -226049 45278 103452 -128898 -53336 -277896 -210149 14033 87646 -12489 -86789
17913 -86789 -182315 154155 -49291 282022 -42052 -96915 116937 -109161 -111264 148947 122785
17902A22785a09513N656J1126J1868k3001A9329c03930A11881B6080A763K90835
17891B92598b01545I4478J65172A3489a67369E0666N3583l833d57892a07119o3798
17880a70917A41441e2202C95450a64240A07643c1439A74532E6716b1067B51612
17869B11943g0664C38663D444J05070K33107a1843l12402a48882c8232p4272J6674
17858i5830k91370A74462C4779b24880k6930B12304G3925c7893O176a880B0412
17846h293I1855b92353I978O8446a77057p1454a05336C6210o060A0776a18292
17834a75419A40292a42633b6999k05044a1438k0650G9799h8178C970b8331j79332
17823b07663B79669b46655E8360B8157j2373b39952a01658A13286d7853D2064
$$ plain form
17902 122785 -109513 -103857 -92731 -80863 -103864 19329 -303930 111881 26080 1763 292598
17891 292598 -201545 94478 259650 13489 -167369 50666 104249 100416 -457892 -107119 -170917
17880 -170917 141441 -52202 395450 -164240 107643 -31439 174532 56716 -21067 251612
17869 211943 -70664 338663 4444 109514 342621 -11843 -324245 -148882 -38232 -112504 -95830
17858 -95830 -387200 174462 34779 -224880 -251810 212304 73925 -37893 -31717 -1880 20412
17846 -8293 91855 -292353 9978 78424 -177057 -248511 -105336 36210 30150 10776 -118292
17834 -175419 140292 -142633 -26999 -232043 -11438 -32088 79799 -88178 3970 -28331 -207663
17823 -207663 279669 -246655 58360 28157 15784 -239952 -101658 113286 -47853 42064
17812B62067g0858A80709p4094C1621L74103a81164E3109B6318J21577a15702
17801a16666A0277N3216b2541A8224a86475I1206J04463g4563B04608I7440a48357
17789a44586j08653I7652Q7403C4151b41175j2014C68505D3475A6919K282L49720
17778C68921G2173f1601p6839a6677k69950E4254c59556g7804A47157A7483K08516
17767B25999I8926J10802M2892k0407a44082A41202D8994J4693a11429D9534b86353
17755b14249A13035B9191a89267F7021P0094F8272a67263D7241d46619a87174
17744G4450b65712B03654a91018A71509a99473G0217J5371m2261K4863J43012
17734B11202F154K0407b43369b9310B6302J7686K06791C8959a0140D1090i8034
$$ plain form
17812 262067 -70858 180709 106615 31621 405724 -181164 53109 26318 147895 -115702
17801 -116666 10277 63493 -22541 18224 -186475 91206 195669 -74563 204608 97440 -148357
17789 -144586 -253239 97652 185055 34151 -241175 -253189 368505 43475 16919 19201 368921
17778 368921 72173 -61601 -138440 -16677 -286627 54254 -359556 -77804 147157 17483 225999
17767 225999 98926 209728 252620 232213 -144082 141202 48994 63687 -111429 49534 -286353
17755 -214249 113035 29191 -189267 67021 137115 68272 -167263 47241 -446619 -187174
17744 74450 -265712 203654 -191018 171509 -199473 70217 85588 43327 68190 211202
17734 211202 6154 26561 -243369 -29310 26302 43988 250779 38959 -10140 41090 -98034
17722A76465F823i5912K5237c019A62015a93072J7671k1162A85966O1250c14250
17710C30526j51912a63478O9006C3699c3878j84121R9569B6746a4282B46882r8377
17699A48505D8057i391k67633B50895I8537H541b08016b8452H7366J25520a04175
17687D6841L210c2458G6127b6043H2908J34327p5608k563n0019C0660e1580o0085
17675a11665A69281F625L104e1518K3539j18450J1986C41668A60025n9180J16470
17664B17315a12392F0376a25776a2859j2614l9693l0835d7216j62314H3940J97317
17653B81257j15685a56987A69999F8506a0994D8878a97092j8363n340M1763H7052
17641B37922D3296N609b86432d4176I0372e0234A28782d82364A99193M6351b93330
$$ plain form
17722 176465 6823 -95912 -70675 -3019 162015 -193072 -175401 -196563 185966 247216 -314250
17710 330526 178614 -163478 -94472 33699 -33878 -217999 -118430 26746 -14282 246882 148505
17699 148505 48057 -9391 -277024 250895 98537 8541 -208016 -28452 87366 212886 -104175
17687 46841 50051 -32458 76127 -26043 82908 217235 141627 139064 89045 30660 -51580 -111665
17675 -111665 169281 6625 9729 -51518 -27979 -146429 -134443 341668 160025 100845 217315
17664 217315 -112392 60376 -125776 -12859 -25473 -65166 -96001 -47216 -209530 83940 281257
17653 281257 165572 -156987 169999 68506 -10994 48878 -197092 -215455 -220795 -179032 87052
17641 237922 43296 48905 -286432 -44176 90372 -50234 128782 -482364 199193 245544 -293330
17629c32129A84512f2117B20354n4690p8514a62785p440b1546h199j93349C73046
17617d13126C56984d2389k9703A38487j4736M6207a59619j66517c6394k5158B63041
17605A13627J21486d6635G5569a16571d3252B14361A1205K2935j4082R2860l6751
17594G6167B6877Q3381c0553N679l3545p3640H2824b74875J32383C2941J88204
17583B21145c34685B43619d3339D11a23914N3238D8595a40180O8492C32972b07972
17571A36390h6419C32068a1252j27990a5252G4460K4848b43259B55196p2139j5449
17560A67608a91212E0165c07086B42522A8882L35175h9383H9171B4929J06090
17550A31019c31216a31929c7248H7050O2844a10431A09543i0846B15999J6878
$$ plain form
17629 -332129 184512 -62117 220354 165664 87150 -162785 -170225 -21546 -8199 -201548 373046
17617 -413126 356984 -42389 -72092 138487 123751 169958 -159619 -326136 -36394 -61552 263041
17605 113627 235113 -46635 75569 -116571 -43252 214361 11205 34140 20058 112918 76167
17594 76167 26877 110258 -30553 -24874 -58419 -132059 82824 -274875 -142492 32941 221145
17583 221145 -334685 243619 -43339 411 -123914 -70676 48595 -140180 -71688 332972 -207972
17571 136390 -86419 332068 -11252 -139242 -15252 74460 99308 -243259 255196 183057 167608
17560 167608 -191212 50165 -307086 242522 18882 354057 -89383 89171 24929 131019
17550 131019 -331216 -131929 -37248 87050 149894 -110431 109543 -90846 215999 232877
17540B32877d4584d054m05763H4966e6382I2366Q4483f9383H7457L3398J64100
17529B84955Q0727f9860q1738B45285m8550K77611d7667k0615A02674J96113N3295
17518C52082J60749a9358A94841f190B83036m4605j8288I3392a69761H2585d08261
17506I7859c24052e2113B11291q2117d8579B04071G8338J24122p9410o207d5320
17494B11221c996E16581A68159F3239K21649a2949A65313f9232A63333K51630
17484D14963D7908g0478A06226a39459I4957J53730K22288c9318A67431J96030
17474C63461a21314B20603H9437J64502j1656b54378D10513e620C32135A18154
17463B36096J93699b25933H1467e6797A67304i7132A17758J8529A1990J29140
$$ plain form
17540 232877 -44584 -4054 -409817 84966 -56382 92366 176849 -69383 87457 120855 284955
17529 284955 365682 -69860 -151598 245285 196735 474346 -47667 -68282 102674 298787 352082
17518 352082 512831 -19358 194841 -6190 283036 238431 220143 93392 -169761 82585 -408261
17506 97859 -324052 -52113 211291 129174 -48579 204071 78338 202460 123050 116843 -45320
17494 211221 -3996 516581 168159 63239 284888 -12949 165313 -69232 163333 414963
17484 414963 47908 -70478 106226 -139459 94957 248687 470975 -39318 167431 363461
17474 363461 -121314 220603 89437 253939 242283 -254378 410513 -5620 332135 118154
17463 236096 429795 -225933 81467 -56797 167304 -97132 117758 136287 11990 141130
17453A41130R0023j3658a08712B37360J83694A80182K38866n9264A03622J63878
17443B67500J25131C1465L67182J19412B11428l0062K6975n9876K58152H4012
17432D92753J3269p9611m4144K71904B21226K24818j46011K25928A12032J77455
17422B89487J05028A990P03150E6671K08060D6049K59324o0832J39871A03783
17411B48620k0883H4466M1618O93J40375e0209j18236m6395A31562Q7188H8665
17399H2257Q7887f8603C49078A02566K37838j60380L8885j4146e8401C77438a57119
17387G5573R9149N8797b2029k04654a3393j631B81857J34083C4702a63983B1018
17375A1106a77970f8057D1101K12983a28569C55340e0471B411L20357G3296a15128
$$ plain form
17453 141130 231153 217495 -108712 237360 421054 180182 419048 359784 103622 267500
17443 267500 392631 31465 398647 518059 211428 181366 208341 148465 406617 84012
17432 492753 506022 426411 382267 654171 221226 446044 300033 525961 112032 289487
17422 289487 394515 1990 705140 56671 264731 46049 305373 244541 384412 103783
17411 248620 227737 84466 126084 126777 267152 -50209 -168445 -214840 131562 218750 88665
17399 82257 170144 -68603 349078 102566 340404 180024 218909 204763 -58401 377438 -157119
17387 75573 174722 233519 -22029 -226683 -13393 -15024 281857 415940 34702 -163983 21018
17375 11106 -177970 -68057 41101 254084 -128569 355340 -50471 2411 322768 73296 -115128
17363a1294j69703N2395k05274F6464J15930c11720H5624K82468j61200H2611
17352b13891C91961j31365D7857M8874K28145k7610I6197O1564c6520B84956M059
17341B89015B8622A3176K8247a04778C81795A89899J09945j14479k7438j5487
17331A42440K5498L32124B27309d6400B97382A4656J20600J41605n835a8304D9454
17319G3750J91392C0406a1976A95706P710l2926l5290K11034j47906a32961B07247
17307A05988L6216e1624B73619l636a22890B87544E513K94935j36065J2043o0678
17296A15748q089L40939p1147j87738L428L59455F9816O3272a39187D3754J68021
17285B11775N7598J13219A55115J01639l6470M6162b18615E06329A71087J27860
$$ plain form
17363 -11294 -180997 -128602 -333876 66464 182394 -311720 85624 368092 206892 82611
17352 -213891 391961 260596 47857 96731 324876 297266 96197 157761 -36520 284956 289015
17341 289015 28622 13176 41423 -104778 381795 189899 299844 185365 157927 142440
17331 142440 167938 500062 227309 -46400 297382 14656 135256 276861 271026 -18304 49454
17319 73750 265142 30406 -11976 195706 203416 170490 135200 346234 198328 -132961 207247
17307 105988 142204 -51624 273619 269983 -122890 287544 5513 300448 164383 176426 115748
17296 115748 107659 448598 377451 189713 193141 552596 69816 133088 -139187 43754 211775
17285 211775 269373 382592 155115 256754 220284 266446 -218615 506329 171087 298947
17275B98947A00030K5732J06787K55567C4430A2811J78433o71J9542F4070J40719
17264B04789a39360B10615f7893A25635K62840i5115B30301E8300L87164a21283
17253A75657K02540D9403J03397J83544Q6373j17818r0270I5046k3309h4874B72759
17241B05983p3347a012E0379K53256n7463J16009A46766l1962a2418H2950C5527
17229E46653k68293J9144e7507A25318m6569J46449I1865K70470a02595B61657
17218F11327B46092b94597a15731A06588A5786J49934K73084j77570d24595I3938
17207C8574J62186J75857A27717a12600B11353P0877J94332A20365h635A66090
17196B42197K03509k05342Q3633j55357K45795K26869B47666K04373A97448L1331
$$ plain form
17275 298947 100030 125762 232549 488116 34430 12811 191244 190573 210115 64070 204789
17264 204789 -139360 210615 -67893 125635 388475 -95115 230301 58300 445464 -121283
17253 175657 378197 49403 152800 336344 422717 304899 214629 95046 71737 -84874 272759
17241 205983 132636 -1012 50379 303635 246172 362181 146766 114804 -12418 82950 35527
17229 546653 278360 297504 -57507 125318 78749 225198 91865 362335 -102595 261657
17218 611327 246092 -294597 -115731 106588 15786 165720 438804 261234 -424595 93938
17207 38574 200760 376617 127717 -112600 211353 282230 476562 120365 -8635 166090
17196 242197 445706 240364 323997 168640 414435 641304 247666 452039 197448 228779
17186B28779b95164B58658j9325o8449b42921A98070p8644L07912J5236j46400
17176B96174A30685K88513j82815G7660M47185A96048L07248c3061C85484b27
17165A20717O4346K61874j83995k8743O4583A46750M0564m5035m2529R2267G9921
17153B32290P2381J21108I2392Q7429J04859q9707K53380j16538N3661k6135H3325
17141D32495k09607N2624O6109p7256K64454k44244j1577M20138C23269J42745
17131D66014A31016K58393j78027J37210j05559M7713J51199m0431J45635k21479
17121C25670p5586J86595J39162j66314J26311J88064j85609r9825P2787j41717
17111C69538l7976Q7870j45155J76134j50871H294N65478B83851n4911k1107J27762
$$ plain form
17186 228779 -295164 258658 239333 170884 -242921 198070 119426 427338 442574 296174
17176 296174 130685 419198 236383 77660 524845 196048 503296 -33061 385484 -227
17165 120717 185063 446937 262942 234199 298782 146750 187314 142279 99750 192017 79921
17153 232290 304671 425779 92392 179821 284680 194973 448353 331815 385476 359341 83325
17141 432495 222888 275512 341621 264365 528819 284575 272998 693136 323269 466014
17131 466014 131016 389409 211382 348592 243033 290746 441945 401514 547149 325670
17121 325670 250084 436679 575841 409527 535838 723902 538293 438468 511255 369538
17111 369538 331562 419432 274277 450411 299540 8294 573772 283851 228940 207833 335595
17100C35595J68576n1647A19517N7256L56816j36219K86097k14617j06993P9286
17090D41143j4726J00342A95534L20609d3565C66319L7387Q4073R1534k56784
17080C22529j7973K05263J47380A46070K96758A67025L64521A69267K49350J65674
17070E84291j05636J24221A18678M22467K86042D05838J56089K17328C19132k2805
17060B96327A28131L94135K54168k26824R0613K7539k92993J32576R2137M233
17050F03715q4468P686j6593J18772l4731j57434k0847Q1541j10660j0188J16718
17039D93511j19091L02756N5983C23782N45532B76953N3324J67530O6705J81991
17029G46503l40761A92656M5030J04364J8382K15862L57806j82126O257q0178
$$ plain form
17100 335595 504171 452524 119517 176773 533589 397370 683467 468850 361857 441143
17090 441143 426417 526759 195534 516143 -43565 366319 403706 487779 579313 322529
17080 322529 304556 509819 657199 146070 442828 167025 531546 169267 418617 584291
17070 584291 478655 602876 118678 541145 827187 405838 561927 779255 319132 296327
17060 296327 128131 522266 776434 549610 640223 667762 374769 507345 599482 603715
17050 603715 519247 526933 510340 629112 594381 436947 416100 497641 386981 376793 493511
17039 493511 374420 677176 733159 323782 869314 276953 330277 497807 564512 746503
17029 746503 405742 192656 237686 342050 360432 576294 934100 751974 758231 678053
17019F78053J25462l4051m6590k05135J95320J50326C61989K38755K13403q6123
17009G28024j11012n0360J98968J49309k43427j52451K30197k60791L22041j26583
16999F83915K38976k15838k63283N2189J10572K76816D40842K12310K3112J50996
16989H27260j75399j3761O1703P13L516J47069J756k14833K69167j38557m3086
16978G25548m9428L52010l70553K10165J19526K6231j16636j88699o0233J13132
16968G61063P0154P6609k43147L08989R0979R6018m19966J55082k28671K64602
16958I31712K11526O5421j69552J12741k44960J73324P6046j15428P4607J64543
16948A279980J12195l00098l13435K29273k66090L10075j62574K67435R8994m61696
$$ plain form
17019 678053 803515 769464 722874 517739 713059 863385 361989 600744 814147 728024
17009 728024 617012 566652 765620 914929 671502 519051 749248 488457 810498 683915
16999 683915 922891 707053 443770 495959 606531 883347 440842 653152 676264 827260
16989 827260 651861 638100 699803 700516 704032 851101 852857 638024 907191 768634 725548
16978 725548 676120 1028130 657577 867742 987268 1013499 896863 708164 647931 761063
16968 761063 831217 907826 664679 973668 1064647 1160665 740699 895781 667110 931712
16958 931712 1143238 1208659 1039107 1151848 906888 1080212 1156258 1040830 1115437 1279980
16948 1279980 1392175 1092077 778642 1007915 741825 1051900 889326 1156761 1255755 794059
16938G94059M49180n15483O62779k70250l86391M96884M59j42294K29200j38400
16928A179743j46401O6734J77126O798O2442L7610J2570L8877J08779j48668J74209
16917A569819l5168k43029j57003J17170L36343j74929j55122L92364l87100o4724
16907A198621M87811Q6765r2426L797j56662K42686k77505L19851m51453K50175
16897A611660M64497l21235K27216m81763L14012l02670Q4556K51200J43964k02390
16887A789047j0024L53498j46244M0265K82569j95777Q1302K6591L38869n43787
16877B016309P7163K22699n4925K50675l77513K56235l9995j7437Q9221J69717
16867B592149j02309N6984l93149L95354p1549R2083K69615m12470J97432L12145
$$ plain form
16938 794059 1243239 727756 1390535 1120285 733894 1230778 1231237 1088943 1318143 1179743
16928 1179743 1033342 1100076 1277202 1284000 1346442 1384052 1396622 1435499 1544278 1395610 1569819
16917 1569819 1534651 1291622 1134619 1251789 1588132 1413203 1258081 1650445 1263345 1198621
16907 1198621 1686432 1773197 1680771 1684568 1527906 1770592 1493087 1812938 1361485 1611660
16897 1611660 2076157 1754922 1982138 1500375 1814387 1511717 1596273 1847473 1991437 1789047
16887 1789047 1779023 2132521 1986277 2026542 2309111 2113334 2194636 2221227 2560096 2016309
16877 2016309 2093472 2316171 2261246 2511921 2134408 2390643 2350648 2333211 2422432 2592149
16867 2592149 2489840 2546824 2153675 2549029 2477480 2569563 2839178 2426708 2624140 2936285
16857B936285O6247m5268q4652J3932j02950K02761k5644K48939l6149L16898
16847C490399k18298J01159m0335P7890j59468L63906J06693k56067J4593K38797
16837C719269q8512j08834P36440O955m69208P00044l04717J07924P4291O7509
16827D441161J39814Q5088K17451J94656r1831p4880M28534l07675k2297O54030
16817E664051m86399N16771L9232J82622J54296O1689J85747j59486L99991j05122
16807F453392M90951J12643k26644m5801M81716J20869m425J64584K2821M49234
16797H019340L50543k29918L95412J15782J44379L15609N34043K10079l9370L59605
16787A0175504M63067J71993L58678K93132N84428J49580r0687P70449K54202
$$ plain form
16857 2936285 3002532 2957264 2872612 2886544 2783594 2986355 2960711 3209650 3173501 3490399
16847 3490399 3272101 3373260 3332925 3410815 3251347 3615253 3721946 3465879 3480472 3719269
16837 3719269 3630757 3521923 4258363 4265318 3796110 4496154 4191437 4299361 4373652 4441161
16827 4441161 4580975 4666063 4883514 5078170 4986339 4911459 5339993 5032318 5010021 5664051
16817 5664051 5177652 5694423 5733655 5916277 6070573 6132262 6318009 6158523 6558514 6453392
16807 6453392 6944343 7056986 6830342 6784541 7266257 7387126 7382701 7547285 7570106 8019340
16797 8019340 8369883 8139965 8535377 8651159 8795538 9111147 9645190 9855269 9815899 10175504
16787 10175504 10638571 10810564 11169242 11462374 12046802 12196382 12105695 12876144 13130346
16778A3130346J67155J085441J19533J33594O10244O94420O94008K39806N07661
16769A7382208O10754J088123K89873R32361O32325J030411O23759O63934J207493
16760B4461241O07414J100709J307226J158556Q26362J256121J730579J345880
16752C3794088J637314J185634J964120J749477K203467K160146K003180K510057
16744D9207483K660099K490623L398873K980234L723543L804552L596568M498767
16736G6360742M454086M869473N026112O187400N376794O724342O621723P005738
16728A22626410P281836P265733Q243572P715841P877484P471948P169751O434800
16720A82087375N784269M642407L592202K134270O49296m90103k102582l591896
$$ plain form
16778 13130346 13297501 14382942 14502475 14636069 15246313 15940733 16634741 16874547 17382208
16769 17382208 17992962 19081085 19370958 20303319 20935644 21966055 22589814 23253748 24461241
16760 24461241 25068655 26169364 27476590 28635146 29461508 30717629 32448208 33794088
16752 33794088 35431402 36617036 38581156 40330633 42534100 44694246 46697426 49207483
16744 49207483 51867582 54358205 57757078 60737312 64460855 68265407 71861975 76360742
16736 76360742 80814828 85684301 90710413 96897813 102274607 108998949 115620672 122626410
16728 122626410 129908246 137173979 145417551 153133392 161010876 168482824 175652575 182087375
16720 182087375 187871644 192514051 196106253 198240523 198889819 198399716 196297134 192705238
16712A92705238m547307n442355o541492p121926p909517p952033q117788p971914
16704A37100906q143479p530552p255431p145655o828361o074348n960416n671765
16696H2490899m804779m818847m286279l972860l959924l535268l083183l002918
16688E1026841l068035k397464k272542k178027k531967j723089j869192j681787
16680C3304738j352912j899961j322654r92190j547204j095576j099281q11956
16672B3183004q89359r09281q33347j038698q32417m85789p81123o18983p92816
16663A6001191k33239p64881q49474r8593p82996l71542l25926l57500m82795
16654A1734245l33092k35570l20564j03872q71741l19152j623k39979j92217n52309
$$ plain form
16712 192705238 188157931 182715576 176174084 169052158 161142641 153190608 145072820 137100906
16704 137100906 128957427 121426875 114171444 107025789 100197428 94123080 88162664 82490899
16696 82490899 77686120 72867273 68580994 64608134 60648210 57112942 54029759 51026841
16688 51026841 47958806 45561342 43288800 41110773 38578806 36855717 34986525 33304738
16680 33304738 31951826 30051865 28729211 27737021 26189817 25094241 23994960 23183004
16672 23183004 22293645 21384364 20551017 19512319 18679902 18194113 17412990 16794007 16001191
16663 16001191 15767952 15003071 14153597 14055004 13272008 12900466 12574540 12217040 11734245
16654 11734245 11401153 11165583 10845019 10741147 9869406 9550254 9548631 9308652 9116435 8564126
16644H564126N8558l73793j96857m52163J31093m17014n4813j95975l75391q9334
16634F598437o2850j63791q8689m95313J18704K08078l71350j82040P2941l39009
16624E295118J78226l63565j07839k20557k16612J41900n7874P7686m69922m1426
16614D215135L4916m73532L60132O156k23271K48777q79408L54004p8662k79363
16604C284884l8817j963Q6976j39096N0651j28729J13211j73325o9266k97898
16594B686628L61557k54071J87384m14784j28291P3114K78340l74318j09186l3275
16584B273098p2240Q5152N1831J14623l91206J89123J02738m43973j03425l0076
16574A775645L64439r4055j99156n102K91168k07667J72324n75562L72185p1659
$$ plain form
16644 8564126 8622684 8248891 8052034 7599871 7730964 7313950 7259137 7063162 6687771 6598437
16634 6598437 6535587 6371796 6283107 5787794 5906498 6114576 5743226 5561186 5634127 5295118
16624 5295118 5473344 5109779 5001940 4781383 4564771 4706671 4648797 4726483 4256561 4215135
16614 4215135 4250051 3776519 4136651 4142807 3919536 4168313 3288905 3642909 3564247 3284884
16604 3284884 3246067 3244104 3331080 3191984 3242635 3113906 3227117 3053792 2984526 2686628
16594 2686628 3048185 2794114 2981498 2566714 2438423 2511537 2789877 2415559 2306373 2273098
16584 2273098 2200858 2286010 2337841 2452464 2061258 2250381 2353119 1909146 1805721 1775645
16574 1775645 2140084 2046029 1846873 1841771 2132939 1925272 2097596 1522034 1894219 1822560
16564A822560j63198K11533J20162l27472k79276Q138J79945k8700Q4275P0813
16554A698780m09876M7683K80655l18192N1966m7915p8676k872K2950J69128j61825
16543A251806j38110K34632k24649J27945J01525k72004k11164N04274j09628
16534A264627j38256M03827r9273n31012M86356m84331M81773j37632l16877j40228
16524G88974L20603m7047j66761L16833l36383K69587r1342J67560E44650L43025
16514H87675J35085L8705l36487L4204N0843L13232j26386l22553J08482K09705
16504I92505l1525j68280K24398l74799M42904D88636O34134j01439k88264j75446
16494E57621M47460l25650N8799o8039K25967D06393M24899Q0339l10736k38573
$$ plain form
16564 1822560 1659362 1870895 1991057 1663585 1384309 1392447 1572392 1543692 1627967 1698780
16554 1698780 1288904 1336587 1617242 1299050 1351016 1303101 1224425 1221553 1244503 1413631 1251806
16543 1251806 1113696 1348328 1123679 1251624 1353149 1081145 869981 1374255 1264627
16534 1264627 1126371 1530198 1430925 899913 1386269 901938 1383711 1246079 929202 788974
16524 788974 1109577 1062530 895769 1212602 876219 1145806 1054464 1222024 544650 887675
16514 887675 1022760 1061465 724978 759182 810025 1123257 996871 674318 782800 992505
16504 992505 960980 792700 1017098 642299 1085203 488636 1122770 1021331 733067 557621
16494 557621 1005081 679431 738230 670191 896158 406393 831292 911631 600895 362322
16484C62322L51613j89542J34392C24385J35820P8735L38555B24360L81409J79452
16474G85221p3695j34637K2312j02703B25848L79933k18968R8390J21499R2989
16464F99691k46832K92405k87907p0472J89477m3114J70489B81936L36371q3202
16454E35105A73213J88663k587J19874j90426A07191N45048O6643l07762N8496
16444D69616J31623j79300J02579j96234P3813j1293l7930D7795N13623B07053
16433A47430K60910k00465N9086J20035R30m5836J17883R9737A33074L88877B13963
16421G74464l80044M5613A15942J54230K62230A93063K31571j02955o378A32593
16410C09291j6139k6951J11681J24746k42048N8211A25250M6713J21513K9158
$$ plain form
16484 362322 713935 524393 658785 324385 460205 538940 877495 224360 605769 785221
16474 785221 711526 576889 599201 496498 225848 605781 386813 485203 606702 699691
16464 699691 452859 745264 457357 386885 576362 533248 703737 281936 618307 535105
16454 535105 173213 361876 359289 479163 288737 107191 652239 718882 411120 469616
16444 469616 601239 421939 524518 328284 402097 390804 352874 47795 561418 207053
16433 147430 408340 207875 266961 386996 387926 342090 459973 559710 133074 521951 213963
16421 774464 394420 440033 115942 270172 532402 193063 424634 321679 315301 132593
16410 309291 293152 266201 377882 502628 260580 318791 125250 171963 293476 322634
16400C22634J66771A6489L88428A38697J08369J95695j23071l7482J21798a37160
16389C21835j39989q1935j1759K56013j17179j04766N0141J70328j43735Q6426
16379B85380L11692k58273r0498K91789k53747E1964K0201K15700F3355J30530
16369A93885G4536P1654K66975j51088A6510Q8644J55731J12098A63455m4320
16359A19135b3977C49194A19026J93895E135J78212P729J73669Q6566J54907B05831
16347B44205G9911B92J49371p888J0282p4188k7128h8283A23844K6610l4320E0468
16334D45091a09441A76294K0333Q1786D1908M53416B22101J35014j45148G1803
16323C2322K06476H0063j5674B4077M17885J50539B96014a3126A06239l1146N7363
$$ plain form
16400 322634 489405 16489 404917 138697 247066 442761 319690 282208 404006 -137160
16389 321835 181846 99911 88152 344165 226986 122220 172361 342689 198954 285380
16379 285380 597072 338799 248301 540090 286343 51964 72165 287865 63355 193885
16369 193885 74536 146190 413165 262077 16510 105154 260885 372983 163455 119135
16359 119135 -23977 349194 119026 312921 5135 183347 191076 364745 451311 606218 205831
16347 244205 79911 292 149663 141775 152057 77869 50741 -88283 123844 150454 116134 50468
16334 445091 -109441 176294 196627 278413 41908 495324 222101 357115 211967 71803
16323 32322 238798 80063 64389 24077 441962 592501 296014 -13126 106239 75093 132456
16312A32456J47553j03645J66423m1988I4143J84210j0824h1010G8448L49448
16302D27896r42A00297M7579j1431J73664a14815B80309j27863N7220a22007A05717
16290B04234K9743K684b63445a4679n3048E7978J25583b14653B18603b41681Q5579
16279a56102C6905h26o4817G5513N0027O5427e6485C21863F142L32194j8139A57758
16266A66862J05781j8727o3556o171K7987c3985D07519A78163c00293H3238g9217
16254B63646i5441J5880B07383b88011d7262a9515A15268K12273A50607P1475
16244B22082G4030J07435c700A78422r893G2097i405A94712e7163A89984J1391
16233B01375C9689J3580c5756l10062H3345K3370c9249B51088A13406a2459p6888
$$ plain form
16312 132456 280009 176364 342787 300799 94143 278353 267529 -81010 78448 427896
16302 427896 426954 100297 147876 136445 310109 -114815 280309 152446 209666 -122007 105717
16290 204234 233977 236661 -263445 -14679 -67727 57978 183561 -214653 218603 -241681 -156102
16279 -156102 36905 -826 -65643 75513 125540 190967 -56485 321863 6142 338336 320197 157758
16266 166862 272643 253916 190360 184189 212176 -33985 407519 178163 -300293 83238 -79217
16254 263646 -95441 -79561 207383 -288011 -47262 -19515 115268 327541 150607 222082
16244 222082 74030 181465 -3700 178422 168529 72097 -9405 194712 -57163 189984 201375
16233 201375 39689 53269 -35756 -345818 83345 106715 -39249 251088 113406 -12459 -89347
16222h9347B37066E4461K47197o0954l7028p8980b2049j74148A66169E1933a41883
16210e3048A56423P4042a47633b1845r055C0757c3343j05814E812b39444C41235
16198B05316b02444A88836a22122A8658J21836b12110A59633n0506n0310J08309
16188A67126a11703A84157c6622J0102r454p1004A90130B8236a8324k09983a7579
16176a04508A39854l5649J27944M401f1470k18542F2974a26334e4494H0793b71230
16164B19222A9787J65485C6205J58670L9641a8830m5793F7993J9901h047A64802
16152C027J18734A6663N0329R0188p8237a7710A29071P2709a9817p3481A8519
16140i8744I7277c3480k47731A24928j6139j6532l0733a71759g73B059b83338
$$ plain form
16222 -89347 237066 54461 301658 240704 203676 124696 -22049 -196197 166169 51933 -141883
16210 -53048 156423 230465 -147633 -21845 -30900 30757 -33343 -139157 5812 -239444 341235
16198 205316 -202444 188836 -122122 18658 140494 -212110 159633 109127 58817 167126
16188 167126 -111703 184157 -36622 -26520 -35974 -106978 190130 28236 -18324 -228307 -17579
16176 -104508 139854 104205 232149 236550 -61470 -280012 62974 -126334 -54494 80793 -271230
16164 219222 19787 185272 36205 194875 234516 -18830 -64623 67993 87894 -8047 164802
16152 3027 121761 16663 66992 157180 78943 -17710 129071 201780 -19817 -93298 18519
16140 -98744 97277 -33480 -281211 124928 108789 92257 61524 -171759 -773 2059 -283338
16128B57892F7448A5839e0621D653O2574R1266L2780H5505a5886G2608M0394P3167
16116A86169c52459e2011j9555l39579a72624j29793A71865g2029l795n586c6771
16104a64067O8996j02053D63298j73768H4185a5993l73929B54493a57476a6907
16093h0861A7375b1125l1092l9149B8755K54417a91137M305a0848k824e35j57168
16081a57703o4253e7915k69131B08566a66457B36794b21641C19974h4553j1527
16071i6080l7570J4842l1671q7676E1084a3015B00884E5923a14139C2302L32085
16060C64387a22597m3372G5044b77568B14750p8339c3672j91757B1380H051h8081
16048B85569a84092B97718a9450C7005j3630P958b16086R7652A07413L066m9532
$$ plain form
16128 257892 67448 15839 -50621 4653 67227 158493 191273 85505 -15886 72608 113002 186169
16116 186169 -352459 -52011 -71566 -411145 -172624 -302417 171865 -72029 -75824 -81410 -36771
16104 -164067 -95071 -197124 463298 289530 84185 -15993 -389922 254493 -157476 -16907
16093 -80861 17375 -21125 -52217 -91366 28755 283172 -191137 -186832 -10848 -13672 -535 -157703
16081 -157703 -221956 -57915 -327046 208566 -166457 236794 -221641 319974 -84553 -96080
16071 -96080 -133650 -118808 -150479 -238155 51084 -13015 200884 55923 -114139 32302 364387
16060 364387 -122597 -165969 75044 -277568 214750 136411 -33672 -225429 21380 8051 -88081
16048 285569 -184092 297718 -19450 37005 23375 31333 -216086 -118434 107413 110479 60947
16037F0947J36777P2255g7680k9277b1249B12363F1370M4054E0513Q6430d459
16025b01481Q810F0335Q8101a05964c0807A43588F7830M4957b6416A03680h6139
16013a55841A4420O5648a72011a1440k34502b1484B74496H0084K091a46561l0697
16002a77258a3632j10901I1334a30645e983j72106F114O3219a7290o7449D18275
15990b28949H3547e4207k40215R1111c2387m14457A05697Q8938H7077M17607C6546
15978C89601A29101a44855E6019g913j1053B36140g2791k23026C81539I4776p93
15967I3983l850f8951k29863D8116a27229A81078f5147c1682B05514e2602H3685
15955a59376O5476p0368H6139g8918o545j03738A53062c3611l26401c4925l08371
$$ plain form
16037 60947 197724 269979 -77680 -106957 -21249 212363 61370 105424 50513 136943 -4459
16025 -201481 -192671 60335 148436 -105964 -30807 143588 67830 112787 -26416 103680 -86139
16013 -155841 14420 80068 -172011 -11440 -245942 -21484 274496 80084 82175 -146561 -177258
16002 -177258 -13632 -124533 91334 -130645 -5983 -178089 6114 69333 -17290 -84739 418275
15990 -228949 83547 -54207 -294422 -203311 -32387 -446844 105697 194635 87077 504684 36546
15978 389601 129101 -144855 56019 -7913 -18966 236140 -72791 -295817 381539 94776 93983
15967 93983 90133 -68951 -298814 48116 -127229 181078 -65147 -31682 205514 -52602 83685
15955 -159376 -93900 -164268 86139 -78918 -85463 -189201 153062 -33611 -360012 -34925 -343296
15944c43296h5128b7816I414L7624A2537a39972A41583o5297e5381a1957C1181
15932f8993j7356B31112A03466G98J65651a85195L7654A64619L8883C0007J60752
15921A90759a29840A78344h5879A76040b97178A32246J05593b81566L8622D0963
15910E1001c1754k57856g2529o9459B3817a40039f627m517j40391N3228k7889
15899a26196N1172l4849C90572b02691A21693i9051A20232i1040a2509H0545O8510
15888A49055a24602I2805A9396J96322p1190A9310J01014a31236A67125c1461
15877A08258c18290d4685k94941i0737l04494a1330j96322A55137E3030f0589
15866a27160j20419d9401m1112N642E843a99833K1872j35935i6027K3448C7687
$$ plain form
15944 -343296 -85128 -27816 9414 47038 12537 -139972 141583 76286 -55381 -11957 31181
15932 -68993 -86349 231112 103466 798 166449 -185195 -147541 164619 203502 30007 190759
15921 190759 -129840 178344 -85879 176040 -297178 132246 237839 -281566 -242944 40963
15910 51001 -31754 -289610 -72529 -141988 23817 -140039 -6627 -11144 -151535 -98307 -126196
15899 -126196 -75024 -109873 390572 -202691 121693 -99051 120232 -91040 -12509 80545 149055
15888 149055 -124602 92805 19396 215718 144528 19310 120324 -131236 167125 -31461
15877 108258 -318290 -44685 -339626 -90737 -395231 -11330 -207652 155137 53030 -60589
15866 -127160 -247579 -49401 -90513 -84871 5843 -199833 -177961 -313896 -96027 -72579 37687
15854c7403C8L25159A23684L0456b9317k32533I3459g2295J9542J7763A31040
15842b16461O5291H3244P9691J5286H5801k5796c43346a17986j8265a6587A85369
15830C74555F5459J4197h9316a7190D2743a28706E2642c22411g0588m2541G7506
15818b60149j61076d6450k22532J3180q2738f1855l04838a6733A07569b99147
15807a2168j41412C607g0378E4829O9245b04142a5946A43978a65021A04652h4066
15795G3253c10375R5329C1640b43846A13036J21444k0030b34244b9901p5930A07782
15783F7758Q2439m3423h8894B20070A8264R6664a61406E9627a88667g9276H8779
15771a82495G2391d25394A258h1776j50700E7967P9122f2202j92948E5678k117
$$ plain form
15854 -37403 38 325197 123684 154140 -29317 -261850 93459 -72295 -52753 -34990 131040
15842 -216461 -151170 83244 162935 178221 85801 60005 -343346 -117986 -136251 -16587 185369
15830 374555 65459 79656 -89316 -17190 42743 -128706 52642 -322411 -70588 -113129 77506
15818 -260149 -421225 -46450 -268982 -255802 -338540 -61855 -366693 -16733 107569 -299147
15807 -12168 -153580 3607 -70378 54829 124074 -204142 -15946 143978 -165021 104652 -84066
15795 73253 -310375 -215046 31640 -243846 113036 234480 214450 -234244 -29901 -105831 107782
15783 67758 150197 106774 -88894 220070 18264 114928 -161406 59627 -188667 -79276 88779
15771 -182495 72391 -425394 1258 -81776 -232476 57967 137089 -62202 -255150 55678 53561
15760E3561b19169k99512C3361L02663j05842a01980c4764D57475a309A906K22277
15749B24183b65388M1509l681C34893a13893A78631a50087A95633D6839k0286
15739B6553i2417A7464J46149b24835B7943f4667m6272D0788A1646i61n4287j03816
15727a59064k43547i247m827D5693a93912G4619b38898I8499Q7047g4585l2831
15716a07416j38476e2052a7562f575r6147q8070A78140E189J3828J04357j0609
15705A12765a20565p8669G2960a53552B35537E1414b60734B93366A16059J25558
15695B41617n3423E6146b26523G2813B2355J68537e6658l3033r98A6471f9970
15683c90129g2032R25k25483a42203B71843b65198C6963J72382n6715b7386E628
$$ plain form
15760 53561 -219169 -518681 33361 336024 230182 -101980 -34764 457475 -1309 1906 224183
15749 224183 -265388 -223879 -227560 334893 -113893 178631 -150087 195633 46839 26553
15739 26553 -92417 17464 163613 -224835 27943 -64667 -110939 40788 11646 -961 -55248 -159064
15727 -159064 -402611 -9247 -14074 45693 -193912 74619 -238898 98499 185546 -74585 -107416
15716 -107416 -245892 -52052 -17562 -6575 -102722 -190792 178140 5189 19017 123374 112765
15705 112765 -120565 -199234 72960 -153552 235537 51414 -260734 293366 116059 241617
15695 241617 188194 56146 -226523 72813 22355 190892 -56658 -89691 -90689 16471 -69970
15683 -390129 -72032 -71107 -296590 -142203 271843 -265198 36963 209345 152630 -27386 5628
15671D6890K30220E2174J13488B541a00651A77320c41731B11184o0430D9028g9227
15659c9842B01147j9959c96756a41168D28549b35617d4657N884h491A10030J87928
15648B97958b53421J21268B5523e8514n2232H4004a52757n9714f8620j80688d7089
15636c21568J03429A58353b11368b962l15684G0397B4197P5551K46154I157Q0358
15625H9515L11633b31592J05328A39173a55824F8155A9429a01209A73772A5944
15614A48636a00687R920L381A09958c5385j26585A37729J19025b15780N8247d0280
15602c43692C577O6658b59910H7022c68299a30202C20437b28701j21724d0045
15591c62613B62367h9506k30316A64484e5977B57475F5174c08404A42905I642
$$ plain form
15671 46890 277110 52174 165662 2541 -100651 177320 -341731 211184 150754 49028 -79227
15659 -39842 201147 181188 -396756 -141168 428549 -235617 -44657 -38773 -8491 110030 297958
15648 297958 -253421 -132153 25523 -58514 -110746 84004 -152757 -212471 -68620 -249308 -47089
15636 -321568 -218139 158353 -211368 -2962 -318646 70397 24197 99748 345902 9157 89515
15625 89515 401148 -231592 -126264 139173 -155824 68155 19429 -101209 173772 15944
15614 148636 -100687 -90767 -87386 109958 -35385 -161970 137729 256754 -215780 -157533 -40280
15602 -343692 3577 70235 -259910 87022 -368299 -130202 320437 -228701 -350425 -40045
15591 -362613 262367 -89506 -319822 164484 -55977 257475 65174 -308404 142905 9642
15580a75170b5362F6432e9140a8503j94421A00304K48124I831c1969k3691j04594
15569a60254F1038K30761e1274A03728K16121i3646A56458p2099a50274A65541
15558A46843b8504C8583J57572C7276b36693A51662K4102b13709Q8439b1840l1603
15547e3443D935b65576A42335a79581N1480A75845a19673D4218Q4353b60116F1819
15535A51186E6210a59856E7018A8335R1955b50617b6916A5944a40775B63877P3637
15524C37514a71492N7215N4684C2970a80250A12584a755F6704a85932A20984R5487
15513B16471G8549b90673A63555H40e4802b0195l57090A14704a99940J6497k37543
15502d20986J77938R8869A32644B5497b66750B53241C8711h0210D078i4690C4787
$$ plain form
15580 -175170 -25362 66432 -59140 -18503 -212924 100304 348428 9831 -31969 -55660 -160254
15569 -160254 61038 291799 -51274 103728 319849 -93646 156458 84359 -150274 165541
15558 146843 -28504 38583 196155 37276 -236693 151662 175764 -213709 -125270 -21840 -53443
15547 -53443 4935 -265576 142335 -179581 -128101 175845 -119673 44218 128571 -260116 61819
15535 151186 56210 -159856 57018 18335 110290 -250617 -26916 15944 -140775 263877 337514
15524 337514 -171492 -114277 -59593 32970 -180250 112584 -1755 66704 -185932 120984 216471
15513 216471 78549 -290673 163555 840 -54802 -20195 -377285 114704 -199940 -183443 -420986
15502 -420986 -243048 -144179 132644 25497 -266750 253241 38711 -80210 4078 -94690 34787
15490b12942F5620e8426D1459P0352b02183A80769p4518c1832J3168k17462N8057
15479a78069G7233a71956j50663F9121K02062H9857R5594M3049a16856e6691l9612
15468i6303B35102a9429B80975D6321J58192a05343K3532J5678k42471b7986A14990
15456b29261J09066B28698g857B99595g6711B80745b4621c503p8183J7676B66060
15444D002a31247i769B70488J21601e0490J6008j52743M755D87126r4563c37677
15432a49206k37921a82733a2437j56338e9763A66707n2313m3047L69069f2421
15421A23564K42193c48216h9963C7281d165k97321D38609F7518b6086K298A91579
15409a94718B87603a83981j427A90580b54588C80785b6701j42847A41739i1931
$$ plain form
15490 -212942 65620 -58426 41459 111811 -202183 180769 106251 -31832 -18664 -236126 -178069
15479 -178069 77233 -171956 -322619 69121 271183 89857 185451 228500 -116856 -56691 -96303
15468 -96303 235102 -19429 280975 46321 204513 -105343 -81811 -66133 -308604 -27986 114990
15456 -229261 -120195 228698 -7857 299595 -76711 280745 -24621 -3503 -81686 -64010 266060
15444 4002 -131247 -9769 270488 392089 -50490 -34482 -187225 -182470 487126 392563 -337677
15432 -149206 -387127 -182733 -12437 -168775 -59763 166707 114394 71347 440416 -62421
15421 123564 365757 -348216 -89963 37281 -4165 -301486 438609 67518 -26086 -23788 191579
15409 -194718 287603 -183981 -185408 190580 -254588 380785 -26701 -169548 141739 -91931
15398C09387G6234B6812g0730G3321Q2239i5498A82231J28416H501K72271h7066
15386i18k08951A7889a37955A12092a19294H5099g7861k41728A29790b44126J6490
15375b27636B58415D3689b31954b6715k30604A53050a72812k7445A03636K42075
15365C45711j03426A14037a25092d9902j06492B03110b6048l43436J64505F6618
15354A01029a64715C23375A2986M0576J3838e3311j12036L8655A42890F0982b20099
15342F4546b6871F1043e6190j16857A63202R2099M6742c6605j36718j41821B87925
15330D9300N1892D6987a16959L3584A89264r1494h3048I35J3433a12570B14861
15318B6780J24305P8249c05435a6857q9433A35469p712L2688F7961J30295b81141
$$ plain form
15398 309387 76234 26812 -70730 73321 155560 -95498 182231 310647 8501 280772 -87066
15386 -918 -209869 17889 -137955 112092 -119294 85099 -77861 -319589 129790 -244126 -227636
15375 -227636 258415 43689 -231954 -26715 -257319 153050 -172812 -200257 103636 345711
15365 345711 242285 114037 -125092 -49902 -156394 203110 -26048 -369484 -204979 66618
15354 101029 -164715 323375 12986 53562 67400 -53311 -165347 -126692 142890 60982 -220099
15342 64546 -26871 61043 -56190 -173047 163202 255301 302043 -36605 -173323 -315144 287925
15330 49300 101192 46987 -116959 -83375 189264 97770 -83048 935 14368 -112570 214861
15318 26780 151085 229334 -305435 -16857 -106290 135469 127757 160445 67961 198256 -281141
15306H1050a14724A49623a05472j51264D69b479q7819B77498m1358f7758k6015
15295i3773E8977a18394I7424K130e0578j27546H2184a64426G3583MC1663h4866
15282b97191i6638I8762L11711d40025E24594B23104A03124i4012B35330p9423
15272A55907J8909C565i3190j35693D04902D9937J35045R6579A23102R4961N3987
15261B72050F0862a567A39664A0379J94208n9654B7114K34955l6875o920l7695
15250A80579J85165L32796J70646J95610K34076J20495k88572l24953k33309A60251
15239a05179C40082N7225A15779L9641g9161A072L31634q7490a21351c5901m1473
15228g7374E6346e8654k8180D4477J93384m2368F838b39490c9764j52495r6125
$$ plain form
15306 81050 -114724 149623 -105472 -256736 469 -2479 -90298 277498 236140 -67758 -93773
15295 -93773 58977 -118394 97424 99554 -50578 -178124 82184 -164426 73583 73587 31663 -84866
15282 -297191 -96638 98762 410473 -440025 524594 223104 103124 -94012 235330 155907
15272 155907 174816 3565 -93190 -228883 404902 49937 184982 281561 123102 218063 272050
15261 272050 60862 -1567 139664 10379 204587 144933 27114 262069 225194 218274 180579
15250 180579 365744 698540 869186 1064796 1298872 1419367 1130795 805842 572533 160251
15239 -105179 340082 397307 115779 155420 -79161 1072 332706 245216 -121351 -35901 -77374
15228 -77374 56346 -58654 -86834 44477 237861 195493 6838 -239490 -39764 -192259 -288384
15217b88384B46015G5114e4413A01609m5336m226O2507E1092l470J33733A9836
15205A36502k2814b59482e3587r5244i368B36139F7491a47251J4171m2049B30633
15193A39260a01218H8923L0027L7085E8394N9920e6284A9771b165l1694B04726
15181A22193h0246G0296g8163B4990J42435l8438a57290A49194D2546a43583B84576
15169i2393A73316j4353n2402H128O5474a76346P1356A13983L0443K1658m4541
15158A21543C4574e9037F6801a0605G3179J54088b94568D69742A24363a8125j98079
15147b16204B49847l7449J56900I5131Q7166g9975j2691C43638f3081C19422A15110
15135A6026a79948Q0755E9480a76725L5413C83503H0901J2229J24377J08532C6675
$$ plain form
15217 -288384 246015 75114 -54413 101609 56273 52047 114554 51092 47622 181355 19836
15205 136502 113688 -259482 -53587 -148831 -9368 236139 67491 -147251 -133080 -175129 230633
15193 139260 -101218 88923 118950 156035 58394 118314 -56284 19771 -2165 -33859 204726
15181 122193 -80246 70296 -78163 24990 167425 128987 -157290 149194 42546 -143583 284576
15169 -92393 173316 158963 106561 8128 73602 -176346 -104990 113983 144426 166084 121543
15158 121543 34574 -59037 66801 -10605 73179 227267 -294568 469742 124363 -18125 -216204
15147 -216204 249847 212398 369298 95131 182297 -79975 -92666 343638 -63081 319422 115110
15135 16026 -179948 -99193 59480 -176725 -141312 383503 80901 93130 217507 326039 36675
15123a00690C72955a27396j29917a12574D3730i0336C58822A56316A6413e3521
15112A21636K41143F9081b66954B69621J45307o8083j54335a16054K0734C04955
15101A43483a14710B3115K7677J66139b05234C56946A48150a21304E49676i559
15090C04113b15897B36437F9240K7994a18176B65710P5225o3776H2571J63054
15080B45625o3665O8191M1449f6491A67628O8472O6841m1596A25181l9703i7417
15068C2251J03189a63190e9100k93918A13960P870P0230B1078K33346o8926K11572
15057C97070A75798J48830F8960O9458n3359k5493J07731K10976a73890A98174
15046B71217A21306J1632K9902K6105J73274j77349C2064L61076A08022K43466
$$ plain form
15123 -100690 372955 -127396 -257313 -112574 43730 -90336 358822 156316 16413 -53521
15112 121636 362779 69081 -266954 269621 414928 346845 192510 -116054 -95320 304955
15101 143483 -114710 23115 50792 216931 -205234 356946 148150 -121304 549676 -9559
15090 304113 -215897 236437 69240 97234 -118176 265710 340935 277159 82571 245625
15080 245625 181960 250151 291600 -66491 167628 236100 302941 261345 125181 85478 -97417
15068 32251 135440 -163190 -59100 -353018 113960 121830 192060 21078 254424 185498 397070
15057 397070 175798 324628 68960 138418 85059 59566 167297 378273 -173890 198174
15046 271217 121306 132938 162840 188945 362219 184870 32064 393140 108022 351488
15036C51488I6186L6358L1040K34792n9723A30558J87564C8624J03098J91749
15026C33471j7794p1099K52914i139E53277k52284A26058M7355M4629I4126A773
15014A57916G2199a01222q269H1305a05009F7931L1740k2389b16163D13500a5258
15002D32269B12217k8030P3333M3045i796C60210A50155J18068J83378j50778
14992C00823J96185B18661F1788K48684K91500A86441N8698K43970A37097l5495
14982A01602J77456R7163E2006J68730O8034i3889B32986K08659r4365D0509L54999
14971C95508R850J00629m8431j83026g5639C29215j64179j7011R0931p452n9108
14960A72396K70295A29912J75350j29399j4812K36087j91870R9940j30719N3043
$$ plain form
15036 351488 96186 132544 163584 398376 338653 130558 318122 38624 141722 333471
15026 333471 315677 244578 497492 -9139 553277 300993 126058 173413 218042 94126 1773
15014 157916 72199 -101222 -109491 81305 -105009 67931 99671 77282 -216163 413500 -15258
15002 432269 212217 184187 257520 300565 -9796 360210 150155 268223 451601 300823
14992 300823 497008 218661 61788 310472 601972 186441 245139 489109 137097 101602
14982 101602 279058 376221 52006 220736 288770 -93889 232986 441645 347280 40509 395508
14971 395508 405358 505987 457556 274530 -75639 329215 165036 148025 238956 231504 172396
14960 172396 442691 129912 305262 175863 161051 397138 205268 305208 174489 227532
14950B27532j9307K22251j78765J73640q10F3839L32804A31944N73701k94092
14940D11553R9507j13343A51043L30894B10190q5158o0377L84029H2710M99271
14930E81981k28316O924I2227d5227A09633J70963L4397e552B03185R7256A36332
14918C92184A72200P9998N35525C40920N719J15422k6498A14575J94708J02588
14908D11871A48428J62445j45933M0468J07119q4096K20223k01528Q2168F5285
14897A81169R993J33161r2996R4979D2905M25685E5777J91334J19212B7727M01812
14886D29539k00337M18867k22823j9587A43554L16809B18836P7313R497r775G3942
14874D32224j75882K94010o691K9786A28684L072a50694C11926k0997m8395a89515
$$ plain form
14950 227532 208225 430476 251711 425351 424541 63839 396643 131944 705645 411553
14940 411553 511060 397717 151043 481937 210190 125032 64655 448684 82710 581981
14930 581981 353665 360589 92227 -45227 109633 280596 314993 -5552 203185 300441 136332
14918 392184 172200 252198 787723 340920 346639 462061 435563 114575 309283 411871
14908 411871 148428 310873 164940 205408 312527 228431 448654 247126 329294 65285
14897 181169 191162 324323 231327 326306 42905 468590 55777 247111 366323 27727 429539
14886 429539 229202 648069 425246 405659 143554 460363 218836 296149 305646 295871 73942
14874 432224 256342 550352 543661 573447 128684 131756 -150694 311926 290929 242534 -189515
14862D70820J40161j36382j74082K19654j80055J81691k10914J480K9061n3455
14852B87979K50198p7326j25657j06771L87339k17486J19575m4801N3850r824
14842E17076j30209J13085p7548J58338J6156J72976l16141k07550K50282B23159
14831E45520j50942O7328K32611j77686J12281j26482J10120n8504k37725l2953
14821B83568k7092n4190N8310M67796k12581j80954j13465J98245j616J29977
14811E47998l2052l4397J44222j9008k56662J61007k53574L17874P1002K12136
14801H58546j95252A60811J88600K5416K23978r111k16503J7654J10765j69248
14791C32362M57482j48967K3467k79657j39845K76682J86183k96963j06705K00812
$$ plain form
14862 470820 610981 474599 300517 520171 340116 521807 310893 312373 341434 287979
14852 287979 538177 460851 335194 228423 615762 398276 517851 473050 526900 517076
14842 517076 386867 499952 422404 580742 596898 769874 453733 246183 496465 223159
14831 545520 394578 461906 694517 516831 629112 502630 612750 554246 316521 283568
14821 283568 256476 202286 260596 728392 515811 334857 221392 419637 418021 547998
14811 547998 515946 481549 625771 606763 350101 511108 257534 575408 646410 858546
14801 858546 663294 160811 349411 374827 598805 589694 373191 390845 501610 332362
14791 332362 789844 640877 664344 384687 244842 521524 707707 410744 304039 504851
14781E04851B33127L97576K27280P7224D67290K5131L6021K9167J76726K8182
14771G62517K5056m6100k68095M5467j34563L6658K05717k25692L04666k82741
14761D22890J30559J60422m0814C27206L89373l7984K7760p9276o2164j65366
14751C99549O8049J99515Q4251Q4390l65061L48531j47946j35508M85793k91465
14741G30098m0150k25905j63147K83279Q9724K86679l99989M894J88402r5733
14731F58152k80579N6999J26306J69374B39575P27136l7895j81874C36990L13281
14721F50271K70014j51643j14436K28955j49855j35508K48651K15070K38328k74164
14711A025683m18549p6505J55015K17102P0536m1243l94871M06017j04078J67577
$$ plain form
14781 504851 233127 630703 857983 935207 467290 492421 528442 557609 734335 762517
14771 762517 787573 741473 473378 518845 384282 420940 626657 400965 705631 422890
14761 422890 553449 713871 673057 327206 716579 678595 706355 627079 564915 399549
14751 399549 467598 667113 751364 835754 470693 819224 671278 535770 1021563 730098
14741 730098 689948 464043 300896 584175 673899 960578 560589 565483 753885 658152
14731 658152 377573 434572 560878 730252 239575 966711 928816 746942 336990 650271
14721 650271 920285 768642 654206 883161 733306 597798 846449 1061519 1299847 1025683
14711 1025683 607134 530629 685644 902746 973282 932039 537168 943185 839107 1006684
14701A006684l36829K38202J14530j53269l5210j24051L96131l36489M5103K19579
14691A034381j67545l8336K98641k81338n0461L94696m02181K76369k98729N17917
14681A283414n64736J85895J52301m01658O40964o04637J96798J18389J21658
14672A128388k93654K88544j84255K42706k71642J22414j62529J14946J54155
14663A139073M125k9183O242m43812M10409P8071k17262K10087r6297k00560M16724
14652A277617L6243k89241L74772l8423l21778K27941K37640m64437K63279L576
14642A307189j87317J26418J38328k05147R3806K33716n75330N34066m67589K52931
14632A251071K92983k83457K22350P9401p7304r4394J68741k87221n4335j57393
$$ plain form
14701 1006684 669855 908057 1022587 869318 834108 710057 1106188 769699 814802 1034381
14691 1034381 866836 828500 1127141 845803 795342 1190038 787857 1064226 765497 1283414
14681 1283414 718678 904573 1056874 655216 1296180 691543 888341 1006730 1128388
14672 1128388 834734 1123278 939023 1181729 910087 1032501 869972 984918 1139073
14663 1139073 1143198 1114015 1120257 676445 1086854 1164925 947663 1157750 1061453 860893 1277617
14652 1277617 1313860 1024619 1399391 1360968 1039190 1267131 1504771 1040334 1303613 1307189
14642 1307189 1119872 1246290 1384618 1179471 1273277 1506993 931663 1465729 998140 1251071
14632 1251071 1544054 1260597 1482947 1562348 1485044 1390650 1559391 1272170 1217835 1060442
14622A060442M52185j90742J69875j57850J35252O654j40606R6759k97063K43157
14612A378063k26740M50593j07971k43235Q9808M45344j00644n8469m33984L86542
14602A579307l5686J15834P2230j53590m3169M8769J04122j38481j45276L16443
14592A720503J32805J50634o6641l84151O515K68633k96101O94588l65525j34357
14582A726903k5391L31216R5742j31727k63143M93867k62663K17356P7158k19160
14572B040158J78162k65439O75339j63667n86028L98087J80974k46867M0875J11682
14562B363276J00436P6230L43909K56499k82688K52236p264L79311j59333N60029
14552C882641L36416J20078J345190J722647M465766R469537J4802427j083129
$$ plain form
14622 1060442 1512627 1321885 1491760 1333910 1469162 1475816 1335210 1431969 1134906 1378063
14612 1378063 1151323 1601916 1493945 1250710 1340518 1785862 1685218 1626749 1192765 1579307
14602 1579307 1543621 1659455 1731685 1578095 1534926 1583695 1687817 1549336 1404060 1720503
14592 1720503 1853308 2003942 1937301 1553150 1559665 1828298 1532197 2226785 1861260 1726903
14582 1726903 1701512 2032728 2128470 1996743 1733600 2227467 1964804 2182160 2259318 2040158
14572 2040158 2218320 1952881 2628220 2464553 1878525 2276612 2457586 2210719 2251594 2363276
14562 2363276 2463712 2539942 2883851 3140350 2857662 3109898 3102634 3481945 3322612 3882641
14552 3882641 4219057 4339135 5684325 7406972 11872738 21342275 36144702 35061573
14544C5061573j1199636r221498o825262l643325j180643q64158L41846l54138
14536B114759l97750m6240L41874j61467L88250k68304K52001m1150J03548j73921
14526B111600q426Q7308Q3019q3673J82257K1767l641M08994m19105P9922K9772
14515B489794m7527K63416L16580j09829j43245J73174m6891j97379j6728L62208
14505C043573j02110J08305r8864m4416K35239P0652k16227J71299J26108R6404
14495C389963j34785O6022K17657J23988j73919j45024L05335J865J71411j97941
14485C624572K65181p8601N8020l6241J90677l88453M74112m05695M05579j41034
14475C968117K31804j46716J27165j83199J47456L49122p3525l8293j12342L8171
$$ plain form
14544 35061573 23861937 14640439 7815177 4171852 2991209 2127051 2468897 2114759
14536 2114759 1717009 1670769 2012643 1851176 2239426 1971122 2223123 2181973 2285521 2111600
14526 2111600 2103174 2190482 2273501 2189828 2372085 2393852 2390211 2799205 2380100 2460022 2489794
14515 2489794 2442267 2705683 3022263 2912434 2769189 2942363 2895472 2698093 2681365 3043573
14505 3043573 2941463 3049768 2950904 2906488 3141727 3212379 2996152 3167451 3293559 3389963
14495 3389963 3255178 3321200 3538857 3662845 3488926 3343902 3649237 3651102 3822513 3624572
14485 3624572 3889753 3811152 3869172 3832931 4023608 3635155 4109267 3703572 4109151 3968117
14475 3968117 4199921 4053205 4180370 3997171 4144627 4493749 4420224 4381931 4269589 4307760
14465D307760L30033j87853M59235K26962m36157M58633k26883o8493J22922K73854
14455E260013j86730J50141N7472J41846o9505q2123r273J23802L01988j593m760
14444E681278K98007r803K32479r0729K72885j77635M40331l4274j02640P9590
14434F589489k05124L75345P2012o2460K59893J01306K02109J5888p8357K86875
14424G556976P2642J03936K83746O2021j25179K49535J30715J04722J85209K78544
14414H902867r7674n1031L67383R1257L29377j18270L2150J85427O5240L3461
14404I740187N29184M14735m08289K32073K850P79002p4304O5606Q6742K51846
14394A1619632K54100J51438k53486O40469Q5121L52192M16949j60813P42289
$$ plain form
14465 4307760 4637793 4449940 4909175 5136137 4699980 5158613 4931730 4863237 4986159 5260013
14455 5260013 5073283 5223424 5280896 5422742 5353237 5271114 5261841 5385643 5687631 5686038 5681278
14444 5681278 5979285 5969482 6201961 6111232 6384117 6206482 6646813 6612539 6509899 6589489
14434 6589489 6384365 6759710 6831722 6769262 7029155 7130461 7332570 7348458 7270101 7556976
14424 7556976 7629618 7733554 8017300 8079321 7954142 8203677 8334392 8439114 8624323 8902867
14414 8902867 8805193 8754162 9121545 9212802 9542179 9423909 9456059 9641486 9706726 9740187
14404 9740187 10269371 10684106 10275817 10507890 10510740 11289742 11215438 11281044 11367786 11619632
14394 11619632 11873732 12025170 11771684 12412153 12497274 12849466 13266415 13105602 13847891
14385A3847891j91166M10591L8615M42554J21056O12864Q1252K69488N42340M3432
14375A6218917l7212P58043J08911L90226N04257M22414J15524N50025L94599
14366A9425704L05552K88472O69203N15260J95597L80941M63153L89176Q21492
14357B3454550M12095L75219Q14214L06077Q54432M55232N71613O54834J271456
14348B9169722J38775Q60656P37778O86673R84369J130680P65685Q65780P05284
14339C6045402J153167R47913Q59858J546629Q93115J493255J240040J427387
14331D5606766J449159J242222J218671J637567J558997J882872J595126K188312
14323E8379692J707728J817061K444125K348262K572373K399355K691257K576313
$$ plain form
14385 13847891 13656725 14067316 14105931 14548485 14669541 15282405 15363657 15633145 16175485 16218917
14375 16218917 16181705 16939748 17048659 17438885 17943142 18365556 18481080 19031105 19425704
14366 19425704 19731256 20019728 20688931 21204191 21399788 21780729 22243882 22633058 23454550
14357 23454550 23866645 24241864 25056078 25362155 26216587 26671819 27243432 27898266 29169722
14348 29169722 29308497 30169153 30906931 31593604 32577973 33708653 34474338 35340118 36045402
14339 36045402 37198569 38146482 39006340 40552969 41446084 42939339 44179379 45606766
14331 45606766 47055925 48298147 49516818 51154385 52713382 54596254 56191380 58379692
14323 58379692 60087420 61904481 64348606 66696868 69269241 71668596 74359853 76936166
14315G6936166K930607L091304K813735L467820L031814M319561M044177L975909
14307A04611093M316514M593846N130744N149666N370334N631852O362279O220200
14299A47386528O897313P478609P186763Q222537Q106123R389856R344298R919561
14291B13931588J0165813J0996891J1703505J2014668J2218184J2956031J3319733
14284B97306413J3865720J3866546J4176633J4551653J4375929J4353433J3826719
14277C96323046J3463668J2378910J1063900R467822N852560K407291r84047m803164
14269D45169986r79365l952041j129355M2754n558253q245389j1531147j3216897
14261D00600293j4380916j4807330j5485583j5717268j5387015j5502502j4785059
$$ plain form
14315 76936166 79866773 82958077 85771812 89239632 92271446 96591007 100635184 104611093
14307 104611093 108927607 113521453 118652197 123801863 129172197 134804049 141166328 147386528
14299 147386528 154283841 161762450 168949213 177171750 185277873 194667729 204012027 213931588
14291 213931588 224097401 235094292 246797797 258812465 271030649 283986680 297306413
14284 297306413 311172133 325038679 339215312 353766965 368142894 382496327 396323046
14277 396323046 409786714 422165624 433229524 442697346 448549906 450957197 449973150 445169986
14269 445169986 444190621 440238580 439109225 439151979 433593726 425348337 413817190 400600293
14261 400600293 386219377 371412047 355926464 340209196 324822181 309319679 294534620
14254B94534620j3619524j3802728j3047783j2733957j1813624j1527297j0764283
14247B07225424j0517765r438668q855587q553519q101126p681948p358071o812932
14239A39905808o160791n742177n634792n241929n067934n014186m063530m260940
14231I8719529l936031l549711l615321l520007l333656l124693l248777k451087
14223G1940246k781818k535045j858101k501256k163976j557541k294178j799774
14215E4448557j749359j625363j360129j506407j617304j242486j603818j051575
14207D2692116r05500j166629j069427j100861j132536j073408q18051j224092
14199C4201612l37766j501705n24792o99315r31045o51459r91009o26258m40225
$$ plain form
14254 294534620 280915096 267112368 254064585 241330628 229517004 217989707 207225424
14247 207225424 196707659 187268991 178413404 169859885 161758759 154076811 146718740 139905808
14239 139905808 133745017 128002840 122368048 117126119 112058185 107043999 102980469 98719529
14231 98719529 94783498 91233787 87618466 84098459 80764803 77640110 74391333 71940246
14223 71940246 69158428 66623383 64765282 62264026 60100050 58542509 56248331 54448557
14215 54448557 52699198 51073835 49713706 48207299 46589995 45347509 43743691 42692116
14207 42692116 41786616 40619987 39550560 38449699 37317163 36243755 35425704 34201612
14199 34201612 33863846 32362141 31837349 31138034 30206989 29555530 28564521 27938263 27498038
14190B7498038r72897o34988o65744m53451n21460q16430k85992n63242l65734
14181B2218100l05204p50071n85019n11203K2684q61445n4624m63767n38806l48293
14171A7822352l83000k26016o68500J42122p15391k35204m00464k3419m21312
14162A4891168J45429k45145l02408l38706j99726k31592n84811r2965N0789m74812
14152A2617221k44262j23371j52887m34185L34609m58836l54514m76542J90758
14143A0897991j62124j7323j77579k49661l18447O0913j42062k44068l10981q9355
14133I247304M8574n0181m49674K15843k44482m62188J77155n73483N02946l17039
14123H094775q7583J06893j98173K40831m48337k27310k30486J34242l7548k10804
$$ plain form
14190 27498038 26525141 25890153 25224409 24770958 24249498 23433068 23147076 22583834 22218100
14181 22218100 21912896 21162825 20577806 20066603 20089287 19227842 19173218 18709451 18170645 17822352
14171 17822352 17439352 17213336 16544836 16686958 15971567 15736363 15335899 15312480 14891168
14162 14891168 15036597 14791452 14489044 14150338 13950612 13719020 13134209 13041244 13092033 12617221
14152 12617221 12372959 12249588 12096701 11662516 11997125 11538289 11183775 10707233 10897991
14143 10897991 10735867 10718544 10540965 10291304 9972857 10033770 9891708 9647640 9336659 9247304
14133 9247304 9295878 9245697 8796023 9011866 8767384 8305196 8482351 7908868 8411814 8094775
14123 8094775 8007192 8114085 7915912 8156743 7708406 7481096 7250610 7384852 7347304 7136500
14113G136500L41541p67914M85463l20251j66077r0198k51285J58835j08868k08290
14103F209456L883J9375j84243J38670j83891j83013j63641J27025P7500l85089
14093E476032J03558l34082L30966k87670J9833J39864n0039k23167j9048K42207
14083E398454m93081Q7466K6432l5377o9129m86270N26844m97361m89K34504o8464
14072D623529m57343K48762M68993o24307J60638k21735j70488K75515n5004j33424
14062D115136j02630J35042N6065m771m8596m96270M18416M5445p5085k83046
14052C759706K20786k90422N0121O969p8820k1390n49850K91740r6310Q6447J76269
14041C555246j16565l08919j8725J58603k54533K19613R3156m35984M08010k13838
$$ plain form
14113 7136500 7478041 6710127 7195590 6875339 6709262 6619064 6367779 6526614 6417746 6209456
14103 6209456 6213339 6232714 6048471 6187141 6003250 5820237 5656596 5783621 5861121 5476032
14093 5476032 5579590 5245508 5576474 5288804 5308637 5448501 5398462 5175295 5156247 5398454
14083 5398454 4905373 4992839 5019271 4983894 4914765 4428495 4955339 4457978 4457489 4691993 4623529
14072 4623529 4166186 4414948 4883941 4259634 4420272 4198537 4028049 4303564 4248560 4115136
14062 4115136 4012506 4147548 4203613 4198842 4150246 3653976 4072392 4117837 4042752 3759706
14052 3759706 3980492 3690070 3740191 3747160 3668340 3646950 3097100 3388840 3292530 3378977 3555246
14041 3555246 3438681 3129762 3111037 3269640 3015107 3234720 3327876 2891892 3299902 3086064
14031C086064J16644p9124J8771k08840P2056j02409q4494L11650m14671J71871
14021B887518j71554O5109J1424j89290Q3307j06534J00524l27369L60262q9115
14011B624282P2754j83611L2940k58962L02854j12763K25327l75350N9474K5899
14001B412844p30884K78049M45491j82872K05033J87726m21225l21891N30116
13992B402387l84712N20295K29650J096669K339896Q826012J6729512L396214
13984C5155923q611065q841874o930547l447186k380706p54498k10448m82308
13976C497291l69919k69306j12293J8488Q1869k65120l28607M71985j84642j10041
13966B429705K10161n89973K06472K78551j41299j59179l661j19501J72558k77844
$$ plain form
14031 3086064 3202708 3123584 3142355 2933515 3005571 2903162 2818668 3130318 2715647 2887518
14021 2887518 2715964 2781073 2792497 2603207 2686514 2579980 2680504 2353135 2713397 2624282
14011 2624282 2697036 2513425 2546365 2287403 2590257 2477494 2702821 2327471 2386945 2412844
14001 2412844 1681960 1960009 2405500 2222628 2427661 2615387 2194162 1872271 2402387
13992 2402387 2017675 2537970 2767620 3864289 6204185 15030197 31759709 35155923
13984 35155923 26544858 17702984 10772437 7325251 4944545 4190047 3979599 3497291
13976 3497291 3127372 2858066 2745773 2764261 2846130 2581010 2252403 2724388 2539746 2429705
13966 2429705 2639866 2049893 2256365 2534916 2393617 2234438 2230777 2111276 2283834 2005990
13956B005990K12662j03808k97779K63893J63064r4785n24106L52696j60612p4696
13946A742519J60875j52725K65267J6114P8520k72672m5969m73k09404P1065k52568
13935A400549K16903J77216J95340l59810M9437J62072K9354j86851M1390m50435
13925A275165M2644J20308n2182q4014K68242r7597P8404K0857j23279K3959J43854
13914A616361N7916J9783j7364l40312l08546L19745q163M31606k68593K58720
13904A761153l41545o707j7013k90l12226L49108j35981j94197K09097o0681J41593
13893A392311k46051J61583j30390L63531o7166n2381j71346m4747n8851j31540
13883A014953j00029J10221J17834J41543j06948K77093m63518K10066l25799
$$ plain form
13956 2005990 2218652 2114844 1817065 2080958 2244022 2149237 1625131 1977827 1817215 1742519
13946 1742519 1903394 1750669 2015936 2032050 2110570 1837898 1791929 1791456 1582052 1653117 1400549
13935 1400549 1617452 1794668 1990008 1630198 1679635 1841707 1871061 1684210 1725600 1275165
13925 1275165 1317809 1438117 1385935 1301921 1570163 1472566 1550970 1571827 1448548 1472507 1616361
13914 1616361 1674277 1694060 1676696 1336384 1027838 1347583 1339420 1771026 1502433 1761153
13904 1761153 1419608 1412901 1395888 1395598 1083372 1432480 1296499 1102302 1311399 1250718 1392311
13893 1392311 1146260 1307843 1177453 1540984 1473818 1421437 1250091 1205344 1146493 1014953
13883 1014953 914924 1025145 1142979 1284522 1177574 1454667 991149 1201215 875416
13874H75416M19088l34698J50401L80915m07819m653q296J09186k1071K37235
13864A395704n07490K80884j65604K32909j27641J21926m29070Q1532L54124K18435
13854A455709k92247j0801K60915j75136k54514j04982l35683M79289k94801K02520
13844I30269q8550j45249K96603l9296L52024k57693o1682k6106j42577L79228
13834A196971n8726l55755J0619J95301k47401L91102j63957l75754O25943l88491
13824H29852J25736j39695J91948j84171K53311k81281J48676J306J7817k03366
13814G60133J85642L1713k4595K02819p508k51046m4868J16342k82066j26495
13804E60071M49297N2992k48782j62221Q4642J62297R9181B67163P19852k02168
$$ plain form
13874 875416 1294504 959806 1110207 1491122 1083303 1078650 1070354 1179540 1158469 1395704
13864 1395704 888214 1169098 1003494 1236403 1108762 1230688 801618 883150 1237274 1455709
13854 1455709 1163462 1152661 1413576 1238440 983926 878944 543261 1022550 727749 930269
13844 930269 841719 696470 993073 953777 1305801 1048108 986426 960320 817743 1196971
13834 1196971 1138245 782490 793109 988410 741009 1132111 968154 592400 1218343 829852
13824 829852 955588 815893 1007841 823670 1076981 795700 944376 945682 963499 760133
13814 760133 945775 977488 952893 1155712 1148204 897158 852290 968632 686566 560071
13804 560071 1009368 1062360 813578 651357 735999 898296 997477 267163 987015 784847
13794G84847C84255N22466D49472M09803j08521k2191J3364J84403D17441K14200
13784F31641J81441r411J0074A94005O14850J85118j24999j06131K6444j14455
13774F74832J94353K1678k8629j78979k30150K18697P0762R9461j10138k77405
13764D54482N25244j43055j48057j61836J72906M05572l57693p5366j9472j61681
13754D91044l2408j08760K93268p6483j919K45032j7327l55448L08792J01175
13744H46966j07303k54096Q5491M11132l71039K6998M9679J8022j38394N928m6817
13733E26567L6907j1320j01216L25781K04388m5465l96536j48971M42276l07521
13723E24890J1949j17284L04434B99789K56900J59096j51016p4464K66680k15712
$$ plain form
13794 784847 384255 906721 449472 859275 750754 728563 741927 926330 417441 631641
13784 631641 813082 803671 813745 194005 808855 993973 868974 762843 789287 674832
13774 674832 869185 890863 862234 683255 453105 671802 742564 842025 731887 454482
13764 454482 979726 836671 688614 526778 699684 1105256 747563 672197 652725 491044
13754 491044 458636 349876 643144 566661 564742 809774 792447 436999 745791 846966
13744 846966 739663 485567 571058 982190 611151 638149 687828 705850 567456 573384 526567
13733 526567 563474 552154 450938 776719 981107 935642 539106 390135 832411 524890
13723 524890 536839 419555 723989 299789 556689 715785 564769 490305 756985 541273
13713E41273j03157J75115r916j35364J43510k93422K46252j63625J30281P3259
13703F04206k7759o6672J53405p9627I0655O58189j92241j17842J31647L0878
13693F01286k5237K27425r3253k38539A50004P7627L34956L7365B69205N17923
13683G87128B71462o005K41108J75550B49375N35885j67905R3226l23906R6342
13673D83017B29075L65877K07907k61857O8455P4746Q3097l06931j31242J24614
13663D53741j20007k158L01530k30649J42444l9050J8248n2083k11834J40434
13653D00616r4693K6580K74929B42851N6381N4336k0033L18107c7739C53912r0659
13642B63253K62490m7687o0883q1340J43582J15515k52570P4328m5530l9625Q4844
$$ plain form
13713 541273 438116 613231 603315 467951 611461 318039 564291 400666 530947 604206
13703 604206 576447 509775 663180 583553 90655 748844 556603 438761 570408 601286
13693 601286 576049 803474 710221 471682 150004 227631 562587 599952 269205 787128
13683 787128 271462 265457 506565 682115 249375 785260 617355 710581 386675 483017
13673 483017 229075 594952 802859 541002 609457 684203 767300 460369 329127 453741
13663 453741 333734 331576 633106 402457 544901 505851 524099 472016 260182 400616
13653 400616 305923 332503 607432 242851 299232 353568 333535 651642 -37739 353912 263253
13642 263253 525743 478056 417173 335833 479415 594930 342360 416688 371158 331533 416377
13631D16377R448l3283J99686j64131o0562A33186K05224M85R7924j9887J5938
13620D32870J91970q8692k67717J05313j59033K90350q7731j77426L40140k23371
13610C56673F9735L80954K7362F5791J90176N2649L47110k32340B07049J66488
13600C73537K46464k19770J07283j42692j49961P7424L12876A97735n017J15335
13590C08053A29569J35925M85996A58251J86427n3513J0753j48748J79867j37433
13580A95604K81600k34504p8106m4139J54282M17672k47253I3965M35971B35362
13569B75697j17922L22466K7639J9939r2741A42502J5914L81496J05147j89252
13559D55807B2606L40142k5161l3590J59346j20607J09642H6365O18323j55860
$$ plain form
13631 416377 425825 392542 592228 428097 367535 133186 338410 338895 436819 416932 432870
13620 432870 624840 536148 268431 373744 214711 505061 417330 239904 580044 356673
13610 356673 69735 450689 478051 65791 255967 308616 655726 423386 207049 373537
13600 373537 620001 400231 507514 364822 214861 292285 605161 197735 192718 308053
13590 308053 129569 265494 751490 158251 344678 291165 301918 153170 333037 195604
13580 195604 477204 242700 164594 120455 274737 692409 445156 93965 529936 235362
13569 275697 157775 480241 507880 527819 435078 142502 158416 539912 645059 455807
13559 455807 22606 362748 337587 303997 463343 342736 452378 86365 704688 548828
13549E48828A34124k7745J68579A11965j923o090K23134j07928n2700b7168D36704
13537E40409o4780N1697K48150k62956j48474r1169l5093q3133K70684g5642C34556
13525E22361j23153j47828j15694K23933j31820m843J96472A60869L03105A96572
13514D37182r7747J29800I6334R4955L42346j80425L3924j37104h1866C43202
13503B30050K23968j28984H9516K20949p8968d849D27324B10087L99319k80263
13493C29143A12878J79002l7782J38874I1786Q7437o2873J31235J13553j07200
13483B53938l4253n8595p5456a64158E72442A7259M44271B15854j07149l8254
13473G0451R5944J47307a45146E11518I7923l5167L53017j85254M95K8407j09096
$$ plain form
13549 548828 134124 106379 274958 111965 110042 103952 327086 219158 166458 -27168 436704
13537 540409 475629 527326 775476 512520 364046 272877 237784 154651 425335 -75642 334556
13525 522361 399208 251380 135686 359619 227799 222956 419428 160869 463974 196572
13514 437182 339435 469235 96334 191289 533635 353210 387134 250030 -81866 343202
13503 230050 454018 325034 89516 310465 231497 -4849 427324 210087 609406 329143
13493 329143 112878 291880 254098 392972 91786 179223 116350 247585 361138 253938
13483 253938 219685 161090 85634 -164158 572442 17259 461530 215854 108705 70451
13473 70451 166395 313702 -145146 511518 97923 62756 415773 230519 231014 259421 150325
13462A50325J4636q931b78394A19940J33228n0553m4758J32557n2500j6536L39482
13451E60860A97626G367M5269N5094L17969e713A10241L23685j15951A21809K6437
13440A48246J74345P0095I3943K80541j23500L19972a06885B37934n4140b8314
13429B72522Q6595j7959J10948r9408H3466n248K34048p5231J91549A20257J07478
13418B27735l3382a51970C23405M8712A32920J63398o5814J73247m2819A27371
13407C03103A45684L01074H4181O9729A1740M27346j80876m4883K7534Q5790j19645
13396B07006b11967A89051d8086l3143F9579J42997J49730l9496b03782B40405
13385B3602J84998H6154b1358C66781A06945D4136L60215J32727i7795A55545
$$ plain form
13462 150325 164961 156030 -278394 119940 253168 202615 157857 290414 237914 221378 560860
13451 560860 197626 7367 52636 107730 425699 -5713 110241 433926 317975 121809 148246
13440 148246 322591 392686 93943 374484 250984 570956 -106885 237934 183794 -28314
13429 272522 359117 341158 452106 352698 83466 78218 312266 237035 428584 120257 227735
13418 227735 194353 -151970 323405 372117 132920 296318 230504 403751 360932 127371
13407 303103 145684 446758 84181 153910 11740 439086 258210 213327 240861 326651 207006
13396 207006 -211967 189051 -48086 -81229 69579 212576 362306 322810 -203782 240405
13385 23602 208600 86154 -21358 366781 106945 44136 404351 537078 -97795 155545
13374F7198K10205K7395F2527J87520a9898A06189K63132A32908E3159K55833
13364C08992j1375A35122a45638B89165e0819B22844P7744m6470j21620j4992
13354A17506L48117j68846A22777A1692K37086L44694B54768M8553I3738J27122
13344B20860p1999J57064Q1533I2887J09061J74698B5639a8184B93359n4084L46677
13333E85952C5336K29976P293m5578L5138H5654J59159Q0124j34462J87192A33687
13321A98621J44360l5001K13049A55715K25139k6250j34308B2631P9131M21638
13311E23400j80370A06079M2656l5705L64724b10830B01518q3845O0286J93219
13301C71178a049j57379D593a9093I5539D6983J72759J34430o153a72818n8897
$$ plain form
13374 67198 277403 304798 62527 250047 -19898 106189 369321 132908 53159 308992
13364 308992 297617 135122 -145638 289165 -50819 222844 300588 254118 132498 117506
13354 117506 465623 296777 122777 11692 248778 593472 254768 303321 93738 220860
13344 220860 148861 305925 387458 92887 201948 376646 25639 -18184 293359 239275 585952
13333 585952 35336 265312 272605 227027 262165 85654 244813 324937 190475 377667 133687
13321 198621 342981 307980 521029 155715 380854 354604 220296 22631 101762 523400
13311 523400 343030 106079 148735 113030 477754 -210830 201518 117673 177959 371178
13301 371178 -1049 -158428 4593 -19093 95539 46983 219742 354172 348019 -172818 -231715
13290b31715e4006F7811J65899a04291A92456N6187j08468N067J50788j5877j5670
13279B64483n4621q5829E4520K06146A13866L43157A13279A3169L10001F8503
13268C19433b03285B67896j13818J25742J11531j7286j73989I4999a24354N2728
13258g1626A15645J40829J23620b13521A22761D0981L3347P2772N5590i5433R918
13247h5515I6385d9945E2617L3033L4521c0945j46126A94298B9846J98196Q8272
13236C16314I6069m3156K9704K34051j9950q9774d7846A55770a71057B38547k3258
13225B15289a4791m6441n2760a8302A83165a3593k77C33243a7795A34631Q2660
13214B17291M3783c13498c5111A84948O924e0372B3632K27236J9405k9662A9758
$$ plain form
13290 -231715 -54006 67811 233710 -104291 192456 248643 140175 145242 296030 280153 264483
13279 264483 209862 124033 54520 260666 113866 457023 113279 13169 323170 68503
13268 319433 -203285 267896 154078 279820 391351 374065 200076 94999 -124354 -71626
13258 -71626 115645 256474 380094 -213521 122761 40981 74328 147100 202690 -95433 -85515
13247 -85515 96385 -49945 52617 85650 120171 -30945 -177071 194298 29846 228042 316314
13236 316314 96069 52913 82617 316668 296718 206944 -47846 155770 -171057 238547 215289
13225 215289 -14791 -61232 -113992 -18302 183165 -13593 -13870 333243 -17795 134631 217291
13214 217291 261074 -313498 -35111 184948 191872 -50372 23632 250868 270273 240611 19758
13202b77500J02723g5427B99806b14820C22787e6545j50868F18292B00898B77
13191a03456n6972b3176C1955J23521J56710d8391A86604l6472N06848a40646
13180A34714J06648J25050q6645e6886A9225b2325b497A512a90873R3504A7153
13168C52554a16390A41192i9008A4455L80876e5315B66121j32308E6877J36518
13158A93395C4549K35889a26625I0184K5852n4551c3068B90190F1047J22475a43737
13146a41321D68268A48605K0614f8939f842J079A91064o0800L6891j1810m876
13135A50469b58443a6208G5284K12397g5957B7344J19195K12426A70403J49513
13125C19916j45186a27962m7366A96699F2664d8048C89156B5850P8143e9179A70188
$$ plain form
13202 -277500 -174777 -75427 299806 -214820 322787 -56545 -207413 618292 200898 277
13191 -103456 -160428 -23176 31955 155476 312186 -48391 186604 150132 656980 -140646
13180 134714 241362 366412 279767 -56886 19225 -22325 -2497 1512 -190873 -97369 17153
13168 352554 -116390 141192 -99008 14455 395331 -55315 266121 133813 56877 193395
13158 193395 34549 270438 -126625 90184 116036 61485 -33068 290190 61047 183522 -143737
13146 -141321 468268 148605 169219 -68939 -6842 -5763 191064 130264 167155 155345 150469
13135 150469 -258443 -16208 75284 287681 -75957 27344 146539 358965 170403 319916
13125 319916 174730 -127962 -175328 196699 62664 -48048 389156 25850 103993 -59179 170188
13113A63162M9353c1171B9636c670I5756c4534a6581j03756E9174d9408j42292
13102a91700G8151J71216r5238g5058A93309F1826h5402G7225C6602L2827a15277
13090B14872P264j03683a03286B33927a20155A58123k2997M927J08234A54P0966
13079G1120N1677b5998C7701e5571n9219C91794c96807B51748K1072b48229B27487
13067b3436C1814L15050a61233B15718r7699n6120J19835J29595M7457A09582
13056A1845d8957C0803K44385d637A84617K04231A68667P1688F0588M6574k9428
13045G7734j4222L40597G471K59117B0849L10398c4914F2301h2757J9617E9030
13033f8838C72437C5046a17345A95821g8387c174j63510D48317A03306J50435
$$ plain form
13113 163162 212515 -31171 29636 -3670 95756 -34534 -16581 -120337 59174 -49408 -191700
13102 -191700 78151 249367 154129 -75058 193309 61826 -85402 77225 36602 69429 -115277
13090 214872 222136 118453 -103286 233927 -120155 158123 135126 140053 248287 154 71120
13079 71120 122797 -25998 37701 -55571 -114790 391794 -396807 251748 272820 -248229 227487
13067 -23436 31814 346864 -161233 215718 118019 61899 181734 311329 358786 109582
13056 11845 -48957 30803 275188 -4637 184617 388848 168667 240355 60588 107162 77734
13045 77734 63512 404109 7471 266588 20849 331247 -34914 62301 -82757 -63140 59030
13033 -68838 372437 35046 -117345 195821 -78387 -3174 -166684 448317 103306 253741
13023B53741p3310K41279C4152h6530g283C13788j29047c8405B35453j16650e9495
13011A36946b2810A52431F0750J18506d11p9853b1981E1588N9661e660B74439
12999e7790p996F648a74904D7171b42204B8865J37082B0217K04759E8697c26559
12987F0662a50629D9369m644L6603b11966B92654C5535d9466A6890f9543B74139
12975B74621N8780a77715c3185j06494L4090A70697D5279n076j0448h2789E5617
12963A82548F3826c00587c3562B5268Q4336P303J44198J84767a75984m0285B51567
12951A20396a61681A4874J0308a02355k9607C2634M24737j25241A64645D2575
12940a74989B84528j26135b46558A4417J56845b2027A10403B6698O7036l8328
$$ plain form
13023 253741 180431 421710 34152 -86530 -7283 313788 184741 -38405 235453 118803 -59495
13011 136946 -22810 152431 60750 179256 -411 -80264 -21981 51588 111249 -5660 274439
12999 -57790 -65786 6648 -174904 47171 -242204 28865 165947 20217 224976 58697 -326559
12987 60662 -150629 49369 44725 81328 -211966 292654 35535 -49466 16890 -69543 274139
12975 274621 333401 -177715 -33185 -139679 -105589 170697 45279 40203 29755 -82789 55617
12963 182548 63826 -300587 -33562 25268 109604 116907 261105 445872 -175984 -216269 251567
12951 120396 -161681 14874 25182 -102355 -131962 32634 457371 332130 164645 42575
12940 -174989 284528 158393 -246558 14417 171262 -22027 110403 26698 93734 55406
12930E5406J99685N4060a50030c4745A05037J36906f9234a084D7924K1725J30103
12919A99752j7214D6956A7235b44472A00750i0839K1419j13727j1406A47956E0970
12907a73767o883A02699N7068b50562d7487B6523a45971j17843a24004o070A72741
12895H8290K50091E0754a15961j34025A06671a05589N931I8339l5064a26640j27468
12884b54108B44315g4366P242k42032a02551g42G1125B6269b24234A32090l6721
12873I5369J68760a48819D07923B2656a91476g4894A14041C6317J48421a56120
12862a89740l13740H6974N5359L0291h2342j00603e7245o5678k3197C02692E0736
12850B76544m8576b04258M8218B62845a69413C26127g6340k29729h2859j14263
$$ plain form
12930 55406 255091 309151 -150030 -34745 105037 241943 -69234 -1084 47924 69649 199752
12919 199752 182538 46956 17235 -244472 100750 -90839 -69420 -183147 -194553 147956 50970
12907 -173767 -180650 102699 159767 -250562 -47487 26523 -145971 -263814 -124004 -130074 172741
12895 88290 338381 50754 -115961 -249986 106671 -105589 -99658 98339 63275 -126640 -254108
12884 -254108 244315 -74366 -67124 -309156 -102551 -742 71125 26269 -224234 132090 95369
12873 95369 264129 -148819 407923 22656 -191476 -74894 114041 36317 184738 -156120
12862 -189740 -503480 86974 142333 172624 -82342 -182945 -57245 -122923 -146120 302692 50736
12850 276544 227968 -204258 -156040 262845 -169413 326127 -76340 -306069 -82859 -197122
12840a97122d7065C21991I5844i8933d9021A47759l0826j5409k8758c6333C48612
12828a10439D8874a90806B3980M8960J30897E7903b25338Q0841b4858O066j90473
12817b09265B16743c1616B44508A8740a55351b2293A6239b01365A58763C0779
12806B81627j30113a22348C81958A14898l5254B3433A0245J30662b11669A58360
12795f0406j42852P8571Q649A30355h1007F2312a6019A24289J4299o3270a9274
12783a32088c390j62721J9574B77979n1673A03357K23727m8110a51303k9310A17955
12771a83067A56551b79888A83333a5093j18013A16190A2896f2252B27957h9868
12760D0045a27381K3432L8970j1428A11190C5063h5624R482r0511H1735L31991
$$ plain form
12840 -197122 -47065 321991 95844 -98933 -49021 147759 116933 101524 72766 -36333 348612
12828 -110439 48874 -190806 23980 72940 203837 57903 -225338 -144497 -24858 -18792 -209265
12817 -209265 216743 -31616 244508 18740 -155351 -22293 16239 -201365 158763 30779
12806 281627 151514 -122348 381958 114898 79644 23433 10245 140907 -211669 158360
12795 -60406 -203258 -124687 -116038 130355 -81007 62312 -16019 124289 138588 75318 -19274
12783 -132088 -3390 -166111 -146537 277979 226306 103357 327084 278974 -151303 -180613 117955
12771 -183067 156551 -279888 183333 -15093 -133106 116190 12896 -62252 227957 -89868
12760 40045 -127381 -103949 -64979 -76407 111190 35063 -85624 -76142 -166653 81735 413726
12749D13726A74789a8002G3565K7716b56084N3547C2612a33119e5511B66932a6708
12737B0829K02345k6910A3206L07948j00657r6220i5910A33173B4599L18082j06267
12726B36414H6794b35035a2341B11870a37551k59926J58758a08923H3140M16176
12716D99316l0143A13538a67358k8879L4613g9124A31674O5669K426J22594j29806
12705A92557k6117d6726B70659a68913B42190L1100L9613F7451A4399b0825F6767
12693A46360b349q5342l83503K03294J27706B33437P8419d8828A25589A9381e671
12681B06118H4711J76412g2803A98504J32023j53673j9662K08768c1340A66935
12670C89153b8149E4373J3687L1800a08495B01242B1223M49120B0874M7394J75294
$$ plain form
12749 413726 174789 -18002 73565 101281 -256084 -202537 32612 -133119 -55511 266932 -16708
12737 20829 223174 196264 13206 321154 220497 124277 -95910 133173 24599 342681 236414
12726 236414 86794 -235035 -12341 211870 -137551 -397477 -238719 -108923 83140 499316
12716 499316 469173 113538 -167358 -196237 -161624 -79124 131674 197343 199769 322363 192557
12705 192557 166440 -46726 270659 -168913 242190 273290 312903 67451 14399 -20825 66767
12693 146360 -2349 -87691 -471194 -267900 -140194 233437 311856 -48828 125589 19381 -5671
12681 206118 84711 261123 -72803 198504 330527 176854 157192 365960 -31340 166935
12670 389153 -28149 54373 68060 99860 -108495 201242 21223 470343 20874 68268 243562
12659B43562G495L04958d21956C35261a14674C21929l6108b8353B74334n0627
12649B23707j08702a13913A9298Q2592N5893Q8287c075k91497A83669m6520N6496
12638A93645A2869K5633J90173B6889N0270h3733r5330A09859l6380Q9352K5815
12627A88646Q8970K00037j49249o7011a06206A92266J70141A27838b8344A50917
12616G9135a59682B12899J63534e0584A03757K20839a25512k8985B27932h8286
12605C18236a69809A31595J8526P8768e7548G5359J15005M906L3777D413K73210
12594B77623a81908d2106C9303A2179O5653b25362c498r241j41054A15368D4280
12582A04290b3757E1109L6901a1913o80E9180d1594B06728a25224k14445P0963
$$ plain form
12659 243562 7495 312453 -421956 335261 -114674 321929 285821 -28353 274334 223707
12649 223707 115005 -113913 19298 101890 157783 246070 -3075 -294572 183669 137149 193645
12638 193645 12869 38502 228675 26889 77159 -83733 -179063 109859 73479 162831 188646
12627 188646 277616 477653 328404 261393 -106206 192266 362407 127838 -28344 150917
12616 79135 -159682 212899 376433 -50584 103757 324596 -125512 -154497 227932 -88286
12605 318236 -169809 131595 150121 228889 -57548 75359 190364 195270 229047 4413 277623
12594 277623 -181908 -42106 39303 12179 77832 -225362 -3498 -12739 -153793 115368 44280
12582 104290 -23757 51109 88010 -11913 -12593 59180 -41594 206728 -125224 -339669 -268706
12571b68706R3304B22881a5016I2069k1077a05431L8543j57418B8792K29239A12585
12559C38386r1448D4724a5306C16615F0769J56103J58076b18959F7687J1263a04556
12547B04623H1396b90911A44754b10849B29842j11617C4550J42961B8164M463
12537C2627C482O0862P092N2389d7959A84763G4296a90157m472f1747k72020B38299
12524g9640P081D4263K32204b76270J05163A05867N827Q0034k1976a55211A89499
12512e2887i186j54498A10878l9458O216B9446K9385B5118J48197g4185G2006
12500d2614O484B5119J44390d2176b0395F2781j9577a81219A21525K6079R9491
12489B47095q0774R2232b46341A37231h9574A44856A2559b8459E4143K76274A43731
$$ plain form
12571 -268706 -175402 222881 -15016 92069 70992 -105431 -66888 -224306 28792 258031 112585
12559 338386 246938 44724 -15306 316615 60769 216872 374948 -218959 67687 78950 -104556
12547 204623 81396 -290911 144754 -210849 229842 118225 34550 177511 28164 32627
12537 32627 3482 64344 71436 123825 -47959 184763 74296 -190157 -194629 -61747 -333767 238299
12524 -79640 -72559 44263 276467 -276270 -171107 105867 111694 191728 169752 -155211 189499
12512 -52887 -9186 -163684 110878 71420 77636 29446 58831 25118 173315 -74185 72006
12500 -42614 -36130 25119 169509 -42176 -20395 62781 43204 -181219 121525 147604 247095
12489 247095 166321 258553 -246341 137231 -89574 144856 12559 -28459 54143 330417 143731
12477h1668A41905A2262M35445a20729B4670a75040P9683p0477A48076K351N4037
12466B04464a59955c1767C4648b19184b4553A51263K0036c46350f2627j78908
12456b41535Q6013j47138B6109a33384K9307c805k20203H9112K573i2269M5150
12445d7119C07511a28495C2644a382A10632J8852c68135F8947b30127N7548E4323
12433A52207a1214p0355k03335f792q7763d5202l22461e5880D4659J73620p8410
12422A39869b22008C78776e4700B6683a62409A91933J97125e2064p6991A27651
12411b3785J0210m02784H2856j5090h6440a5823D5076e2308q0091c342j27891
12400a31233A55803a40661e6830B61569k3213a29701a8709F2187b4657P278j8618
$$ plain form
12477 -81668 141905 12262 447707 -120729 24670 -175040 -95357 -165834 148076 150427 204464
12466 204464 -159955 -31767 34648 -219184 -24553 151263 171299 -346350 -62627 -241535
12456 -241535 -155522 -302660 26109 -133384 -104077 -3805 -224008 89112 91685 -92269 -47119
12445 -47119 307511 -128495 32644 -1382 110632 129484 -368135 68947 -230127 -172579 54323
12433 152207 -11214 -81569 -284904 -6792 -94555 -45202 -367663 -55880 44659 218279 139869
12422 139869 -222008 378776 -54700 26683 -162409 191933 389058 -52064 -129055 127651
12411 -23785 -13575 -416359 82856 67766 -86440 -15823 45076 -52308 -132399 -3342 -131233
12400 -131233 155803 -140661 -56830 261569 238356 -129701 -18709 62187 -24657 -17379 -35997
12389c5997j51939L1764A92652D3729K8520b66226J02565A422J04511k6557K13262
12378B92638A46037b34364e7681n432n6313j54422a21895A08390a8164n7497A8762
12366d4362A488b97149C8261e3315l03194A16531L55958A25080c7833B52285p363
12355B44922F5541J63350A3879K19489I5297m1949a79774N5954N3511A31741D7308
12343a4423A7809a2778j34477B56894E9606g1733F2655J23847a8746D34897f4526
12331c79705A31752b0271l0102n8830B54400D7922g7062l06090A33649d78573
12320a7848C8167j0129L5400J43446f1898C86510E9504J15098m1861a98746a6565
12308D6142b37186A14257m0950a52538k99832A56151I333J03376J19540a1754
$$ plain form
12389 -35997 -187936 -156172 192652 43729 72249 -266226 -163661 1422 105933 79376 292638
12378 292638 146037 -234364 -57681 -63113 -119426 -273848 -121895 108390 -18164 -75661 18762
12366 -44362 1488 -297149 38261 -53315 -356509 116531 472489 125080 -37833 252285 244922
12355 244922 65541 228891 13879 233368 95297 53348 -179774 -123820 -70309 131741 47308
12343 -14423 17809 -12778 -147255 256894 59606 -71733 62655 186502 -18746 434897 -64526
12331 -379705 131752 -20271 -50373 -109203 254400 47922 -77062 -383152 133649 -478573
12320 -17848 38167 28038 63438 206884 -61898 386510 59504 174602 132741 -198746 -16565
12308 46142 -237186 114257 73307 -152538 -452370 156151 9333 112709 232249 -11754
12297B6008J5070M1889d8828A57809e1214A51501a31943d2417A5234J09988D0019
12285C28109A47587A8792J60375D2215L11325o8985g1166K0188B33748b85811
12274A9712K92167a05815A82785a2789B03251C7666P215n414j0340L21230a98424
12262c8125A50226M7110l5977h2100F8352a06903B39715b87498D1381a986B29058
12250A97601i0061q5865B56876H1473N5697c7739E9056d708F0939A3172M3108
12239E6280a27762B38995D9304N7704a87797L6293L9000D447d0084F8430M44838
12228E13268A63989L6205J20994a19031B43017l7110B8511J95637l7322J72398
12218C59224A54730l2840R1758E8332J79486b0708I916M5258K26483b93091D0340
$$ plain form
12297 26008 41078 82967 -48828 157809 -51214 151501 -131943 -42417 15234 125222 40019
12285 328109 147587 18792 179167 42215 353540 284555 -71166 -50978 233748 -285811
12274 19712 311879 -105815 182785 -12789 203251 37666 44881 39467 29127 350357 -198424
12262 -38125 150226 197336 161359 -82100 68352 -106903 239715 -287498 41381 -1986 229058
12250 197601 -90061 -175926 256876 81473 137170 -37739 59056 -4708 60939 13172 56280
12239 56280 -127762 238995 49304 107008 -187797 -151504 -112504 4447 -40084 68430 513268
12228 513268 163989 200194 321188 -119031 243017 205907 28511 224148 186826 359224
12218 359224 154730 121890 213648 58332 237818 -20708 9916 55174 281657 -293091 40340
12206B06334P799f0252B53322r0465F1158f9676c0164B21011a8829r2801G2336
12194C06350j31565a44419A25406O1650K09138b7497Q572A00217r244C2383e0679
12182C3257J12356J7349G4271l4211d566j03990B27725L0628G5509g8425C13313
12170D09441r6378A12504g267C16685R7388C8954b50994A58811I168J60825f3407
12158A9151g435B38037c09884C39736a33209C15319d3967C09193i4298A07335
12147B69715c601j63875e212B7067a56603A76985c32341P9231A36807c491B3046
12135a21990C5841e1796D5286a43255O2076L9925B51922a303A25769Q8337d42364
12123H8225b8857E0291J54627H92a57801I9783L58a68558B37398l0311b7444B09439
$$ plain form
12206 206334 214133 -60252 253322 162857 61158 -69676 -30164 221011 -18829 -111630 72336
12194 306350 174785 -144419 125406 187056 396194 -27497 -18925 100217 90973 32383 -50679
12182 33257 145613 162962 74271 40060 -4566 -108556 227725 258353 75509 -78425 313313
12170 409441 313063 112504 -7267 316685 414073 38954 -250994 158811 9168 169993 -63407
12158 19151 -7435 238037 -309884 339736 -133209 315319 -43967 309193 -94298 107335
12147 269715 -3601 -167476 -5212 27067 -156603 176985 -332341 -253110 136807 -3491 23046
12135 -121990 35841 -51796 45286 -143255 -81179 -41254 251922 -1303 125769 214106 -442364
12123 88225 -28857 50291 204918 892 -157801 99783 100141 -168558 237398 207087 -27444 209439
12110E2321d7891j18684A83994G9511a17739e2435A28461f1436C8229b68767B45962
12098a24993N1223k8391J7222B16428R0374E8374e0479k30953A94250l1502A2233
12086D9016J9493H809a82757h9837A7155N7487a61536b65l6604d038D1635c6833
12073C18597K45315P29883K58753m94123k27820l54289B11812O3381a53993M2988
12063a11005N3568C0520N792q960K83652C1719L9134R2064h7730c8539d574j42506
12051a47080d8573B3079a05652A83019l4574A9409g2200p7714C269J59076a23723
12039A32512e6966B61094C7335g149k77788d3399k4240F4401j9849J67580d841
12027B17702K18887A1074c8534j03248B48487I6947D2325b39909N2490q2304E3774
$$ plain form
12110 52321 -47891 -166575 183994 79511 -117739 -52435 128461 -61436 38229 -268767 245962
12098 -124993 -73770 -102161 -84939 216428 306802 58374 -50479 -281432 194250 162748 12233
12086 49016 68509 8809 -182757 -89837 17155 74642 -161536 -265 -36869 -4038 41635 -36833
12073 318597 563912 1293795 1552548 1058425 830605 476316 211812 275193 -153993 -111005
12063 -111005 -57437 30520 36312 27352 311004 31719 70853 162917 -87730 -38539 -4574 -147080
12051 -147080 -48573 23079 -105652 183019 148445 19409 -72200 -149914 3269 162345 -123723
12039 132512 -56966 261094 37335 -7149 -284937 -43399 -67639 64401 44552 212132 -4841
12027 217702 436589 11074 -38534 -141782 248487 96947 42325 -239909 -187419 -269723 53774
12015E7542L05522a11401N1122d047o8354B05848c747j32737d9190r3H2262N04480
12003E86742f9609B29578a99687q1033A86038a45764a922j39452O5259a3319k07277
11992b20596J06899A33583a95757B74240K2455b30920C6444E440e2142o9764A73835
11980A57463a78382E6194a08404G2469a51664n7246B38351e0743j292j4491A07802
11968D4784b59466f1973A45783b1066k1547k70942i3945j8518p3168d2043D4268
11956H9977h5583C47401h337j12855j84664J05357K2421P4712q4079M9246n402
11945a43601B17032h6717k4849A18137c5240j26537A99037a91389I7039K81379
11935C78418R0283j47959a90109H1157d131A80185a7022j42069A29371c718n0890
$$ plain form
12015 57542 363064 -111401 -60279 -4047 -72401 205848 -3747 -136484 -49190 -49283 82262 586742
12003 586742 -69609 229578 -199687 -280720 186038 -145764 -1922 -141374 -76115 -13319 -220596
11992 -220596 -113697 133583 -195757 274240 296695 -230920 36444 5440 -52142 -121906 173835
11980 157463 -178382 56194 -108404 72469 -151664 -208910 238351 -50743 -52035 -66526 107802
11968 44784 -259466 -61973 145783 -21066 -42613 -313555 -93945 -112463 -185631 -42043 44268
11956 89977 -85583 347401 -8337 -121192 -305856 -200499 -178078 -103366 -187445 -138199 -143601
11945 -143601 217032 -86717 -111566 118137 -35240 -161777 199037 -191389 97039 378418
11935 378418 468701 320742 -190109 81157 -4131 180185 -17022 -159091 129371 -3718 -54608
11924e4608A46877b21455A85853a91643A76420O5963b9327m9960A646J03150O2076
11913A66872c33965b0215j01483Q025j78373l3580a37369b3762q0693j24481Q7051
11902a41885e8627C9525a39819O0284B16571F0460h9812D6801a1716j91338q3739
11891b86793a4195l54633A65582a99080i64B63554L055b69674J10554B42238e086
11879B7719a93718D7175a97503b9914E9028J64004J7754c1448k39492A75023A9117
11867B58366f912H3769a4053j74907I9611H731a97843K6260B7400R2773b33313
11855b89263N9989a02922B3251j745a55747k61343d3443A36103E237b67116j32335
11844c99451a9334k6022B43723a44247j73610J1349a12265N3974l48006A26850
$$ plain form
11924 -54608 146877 -221455 185853 -191643 176420 242383 -29327 -79287 1646 104796 166872
11913 166872 -333965 -20215 -121698 -113673 -292046 -325626 -137369 -23762 -104455 -228936 -141885
11902 -141885 -58627 39525 -139819 -79535 216571 60460 -89812 46801 -11716 -203054 -286793
11891 -286793 -14195 -368828 165582 -199080 -964 263554 266609 -269674 -159120 242238 -5086
11879 27719 -193718 47175 -197503 -29914 59028 223032 240786 -31448 -270940 175023 19117
11867 258366 -6912 83769 -14053 -188960 99611 8731 -197843 -171583 27400 120173 -233313
11855 -289263 -229274 -102922 23251 21506 -155747 -417090 -43443 136103 5237 -267116 -399451
11844 -399451 -19334 -45356 243723 -144247 -317857 -306508 -112265 -58291 -406297 126850
11833b05347B02909b67420j9725a37127I8238e7414A67324b95868A37206b96417
11822e4107j59607O0112C4126b4070p3550B12819b7226j66333e2087p0664A54089
11810c94439A53736B5598K0153A2188g0485I0643a23784B99964g6704B6015F483
11798A87101G6844e5869D2412P8474b3455j08815I3666b65248h5920A10661b61368
11786B07936N025a20233E2803N6445d21416A4527K16839I9109h6489K4640A24312
11774c27808J34790h6108q4182B1999a20513J5005A25554L03213b17640c7233
11763e4393k61481A29802C1394f2841Q674D1059J43144J48223b6910J1877D5815
11751b39972B13956j04456b45264A80867N0436O1359a59561N6783b9769C0041
$$ plain form
11833 -205347 202909 -267420 -287145 -137127 98238 -57414 167324 -295868 137206 -296417
11822 -54107 -213714 -153602 34126 -24070 -97620 212819 -27226 -193559 -52087 -122751 154089
11810 -394439 153736 25598 45751 12188 -70485 90643 -123784 299964 -76704 26015 6483
11798 187101 76844 -55869 42412 120886 -23455 -132270 93666 -265248 -85920 110661 -261368
11786 207936 212961 -120233 52803 109248 -421416 14527 231366 99109 -86489 -61849 124312
11774 -327808 -193018 -86108 -170290 21999 -120513 -105508 125554 428767 -217640 -37233
11763 -54393 -315874 129802 31394 -62841 -54167 41059 184203 332426 -26910 -15033 45815
11751 -239972 213956 109500 -245264 180867 231303 292662 -159561 -102778 -29769 30041
11740B07692f4815G5690a73022A9750a1905p5427B12714F5336j1136k5502e2359
11728A8179P9316c26644f9545A21975b32219a4360A88284D9453K06181A24260
11717a26896F4013J37076a54226C05391A21549i0048L3716k05767A03783J11447
11707B15230A4712L48098C3820a10375B03248o5470a37383A17453d192k15897
11697b20089A09211N802J5404C1671P6946J65015c4279j11290H2273g4570B29570
11685C18801E6442a25553G686c19329G3932J75151p2140g7297B9047L30095I4991
11673a18019B8085c2202A36914F815J19955c01397f6208D3302J74263e1663B42425
11661b77727a281n7053l7689a0387C58936E3823J39376F5473b54922A34439f8845
$$ plain form
11740 207692 -64815 75690 -173022 19750 -11905 -87332 212714 65336 54200 28698 -52359
11728 18179 97495 -326644 -69545 121975 -232219 -14360 188284 49453 255634 124260
11717 -126896 64013 201089 -154226 305391 121549 -90048 -56332 -262099 103783 215230
11707 215230 14712 362810 33820 -110375 203248 137778 -137383 117453 -4192 -220089
11697 -220089 109211 115013 130417 31671 108617 273632 -34279 -145569 82273 -74570 229570
11685 318801 56442 -125553 7686 -319329 73932 249083 176943 -77297 29047 359142 94991
11673 -118019 28085 -32202 136914 6815 126770 -301397 -66208 43302 217565 -51663 242425
11661 -277727 -1281 -58334 -96023 -10387 358936 53823 193199 65473 -254922 134439 -68845
11649A42681m1731a10895M7243b8739D81584b0013F4333a69420a9583A42510c05688
11637A44035L0706a11861b2875B96211b0603k13001Q6769g1393B78557r4998p9475
11626A04084A4297R6528a98974B99062a25490C16549H2615h0113A40144J12888
11616B53032o2696d0887H974A371b27266B65d1873H8507l6121K34905a8790M564
11604a4226G3014J83039b0825r835D7482L81226q1919r7497i6411A14135k3012
11593I1123g6313a0818G8609J89143a597D10045A16716f4608E0576p354J72945
11582B16167J45991A62673J85864q0628D5124a43415C60137j71237E5161c3928
11571C50416H3640e4779A36477b38025c4905A7273J81733a37641A05905J42598
$$ plain form
11649 142681 100950 -110895 -63652 -28739 481584 -20013 64333 -169420 -19583 142510 -305688
11637 144035 174741 -111861 -22875 296211 -20603 -233604 -146835 -71393 278557 183559 104084
11626 104084 14297 110825 -198974 299062 -125490 316549 82615 -80113 140144 253032
11616 253032 190336 -40887 8974 1371 -227266 265 -41873 88507 52386 287291 -18790 -14226
11604 -14226 73014 256053 -20825 -30660 47482 428708 346789 249292 -96411 114135 91123
11593 91123 -76313 -10818 78609 267752 -1597 410045 116716 -64608 50576 43222 216167
11582 216167 362158 162673 348537 267909 45124 -143415 360137 188900 55161 -33928
11571 350416 83640 -54779 136477 -238025 -34905 17273 199006 -137641 105905 248503
11561B48503a28991B89341h8614j7169a3803D91103A03725Q8044C863L33965j19772
11550B18056b185n2685A72136a08094G6033b4941D99066a31221D30361A99879
11539D48154a97204B83821d7781B79735C1653Q0421L25568A69142G7753j0057
11529F7696J03698C597J00532N9979o0520g1275B0568K763K3411c0058j16234
11518a46292b9018l94211B67252M187d0898B10044b64137Q6001B89694r5400K61575
11507D55869I0938J71945j06730M6238b16740A45813F7234J41089k0348l6758
11497A51217h2884B2091J54646b69675E8372M23607a12945B50464j03443G0781
11486a20182A27692E7627J63417k2836C7825K39499K00275H7936C9948g2784A52577
$$ plain form
11561 248503 -128991 289341 -88614 -105783 -13803 491103 103725 191769 3863 337828 218056
11550 218056 -2185 -54870 172136 -108094 76033 -24941 499066 -131221 430361 199879
11539 448154 -197204 283821 -47781 279735 31653 112074 437642 169142 77753 67696
11529 67696 171394 3597 104129 164108 103588 -71275 20568 23331 46742 -30058 -146292
11518 -146292 -29018 -423229 267252 271439 -40898 210044 -264137 -178136 289694 194294 455869
11507 455869 90938 262883 156153 202391 -216740 145813 67234 208323 187975 151217
11497 151217 -82884 22091 176737 -269675 58372 481979 -112945 250464 147021 70781
11486 -120182 127692 57627 221044 198208 37825 277324 477599 87936 39948 -72784 152577
11474B74555o7129c1505E6988J18223P1242D9804K2336K26401F4649a8719D73832
11462a70002A98816C4699O7698l1635J21807k3501L9091k3174E2338J63184b0450
11450B32499b88353B54916b34635C74425a08675p7479A80945a8073B37711b9156
11439A82000j9765J84443j37446J1340h2852k4405C7859a23706b0784m1415B71796
11427C21870C7545A7712f7483I889K7077a40036C4592J77711p4002K0808m8186
11416A10923m3130d6626E3356K6663i2337c7480B62382r3684a02538A31703n3010
11405G8693b6328C47776b37337A29661d0904B0916c55304f4883l17195B35528
11394a48185n3873D2527P995f1882A70810c29290L4284C0482K53785e5100H838
$$ plain form
11474 274555 207426 -31505 56988 175211 246453 49804 72140 298541 64649 -18719 473832
11462 -170002 198816 34699 102397 70762 192569 169068 208159 184985 52338 215522 -20450
11450 232499 -288353 254916 -234635 374425 -108675 -186154 180945 -18073 237711 -29156
11439 182000 162235 346678 209232 220572 -82852 -107257 37859 -123706 -20784 -62199 271796
11427 321870 37545 17712 -67483 9889 36966 -140036 34592 212303 138301 159109 110923
11416 110923 67793 -46626 53356 80019 -92337 -37480 262382 168698 -102538 131703 78693
11405 78693 -26328 347776 -237337 129661 -40904 20916 -355304 -64883 -382078 235528
11394 -148185 -202058 42527 50522 -61882 170810 -329290 -295006 30482 284267 -55100 8838
11382d4358A26076J03160r8889c7517j64937c3747m9625j221A66737J31493c2755
11370I802a64750K7281L373J0590L6708j20807C30640i313D0031a08592B6826
11358b24557a11548H5200a76378M1510k76659e184k45242G216L15929a00429C76153
11346A10631b16041O1599C382J65935A1593a32296N5142I108J50318a42257L8195
11335a04062L0861A93101q6712m4295b22533J3446r2259h993D9262g8235B52359
11323A25385B4932J75004f0491j91508A58613F1155P636a03881K4199C36811A2951
11311e7170B898J5691a66438f7949F8352J54810G8765K74254C582d2509A70605
11299a37514j55492I8165b56442A83305b72047a511r9108j66772B62026b12247
$$ plain form
11382 -44358 126076 229236 130347 -37517 -202454 -33747 -83372 -84593 166737 298230 -32755
11370 9802 -164750 -137469 -134096 -123506 -86798 -207605 330640 -9313 40031 -108592 26826
11358 -224557 -111548 85200 -176378 -134868 -411527 -5184 -250426 7216 323145 -100429 376153
11346 110631 -216041 -154442 3382 169317 11593 -132296 -77154 9108 159426 -142257 -104062
11335 -104062 -73201 193101 106389 62094 -222533 -209087 -301346 -8993 49262 -78235 252359
11323 125385 24932 199936 -60491 -251999 158613 61155 68791 -103881 -79682 336811 12951
11311 -57170 2898 18589 -166438 -67949 68352 223162 78765 353019 3582 -42509 170605
11299 -137514 -293006 98165 -256442 183305 -272047 -1511 -100619 -267391 262026 -212247
11288a39076c4037l17862I2910b49966a07077o738k28172D1348a60172n1625C6740
11276F8141c0565k3699f82k6851j10751b9598A87691b53822k20916a09144j50847
11265b59991A65182r889g5315j723A46741a93139h3109A06160c25460F8858l3523
11254C5335K7236i0994q1134B56827a39223C1341g4855E5500C570c1554n1168
11243h2722k1320B4220K09666n9850P4000e9115B45642a8818p2729A73636L1054
11232B04690O7329e7033a4928G9273A0089a141B4467G134b19741N3422Q1911B2667
11219b63257E4506m264J7195C3287J9312a99266A9084a31925e3819a3931A2295
11207i7298A23045N417a15611m3571G4101a3419k39304j12850b7478A11007c49143
$$ plain form
11288 -139076 -34037 -351899 92910 -249966 -107077 -113815 -341987 41348 -160172 -211797 36740
11276 68141 -30565 -54264 -682 -27533 -138284 -29598 187691 -253822 -474738 -109144 -259991
11265 -259991 165182 155293 -75315 -77038 146741 -193139 -83109 106160 -325460 68858 35335
11254 35335 62571 -90994 -172128 256827 -139223 31341 -74855 55500 3570 -31554 -82722
11243 -82722 -104042 24220 233886 174036 248036 -59115 245642 -18818 -91547 173636 204690
11232 204690 272019 -57033 -14928 79273 10089 -1141 24467 7134 -219741 -166319 -84408 22667
11219 -263257 54506 50242 67437 33287 52599 -199266 19084 -131925 -53819 -13931 12295
11207 -97298 123045 128462 -115611 -159182 74101 -13419 -252723 -365573 -27478 111007 -349143
11195b02413e0193C41184a16646b7592q5660B78790C8733a3434k5185q1080j25845
11184b45544a19290C1401e2826b2226A21232a0504D0456J5770B534a09381B06630
11172G9680i8462j7174e5239D2405a79094G3042a5127k0368A90938f0811B61627
11160a85216A08583b58062R5045C08978a69147f3631o7404B68031c2423G4462
11149b41483B69736a81450g1084k87433a44873e0139A21741f3853k1010c455A07498
11137F8284b78587a9328C41757q0796j01077K27799B3325e9736B02844A9704a51175
11125B9602J12608D9329h7560H3607o197J85505r4965G5970H272J17746M0452
11114A66470b94339E2905K76889H0813a4683A05098J3645E6380O2365K50394e8183
$$ plain form
11195 -202413 -50193 341184 -116646 -27592 -113252 278790 38733 -13434 -38619 -119699 -245544
11184 -245544 -119290 31401 -52826 -22226 121232 -10504 40456 56226 2534 -109381 206630
11172 79680 -98462 -115636 -55239 42405 -179094 73042 -15127 -35495 190938 -60811 261627
11160 -185216 108583 -258062 -163017 308978 -169147 -63631 -131035 268031 -32423 74462
11149 -241483 269736 -181450 -71084 -358517 -144873 -50139 121741 -63853 -84863 -3455 107498
11137 68284 -278587 -19328 341757 260961 159884 387683 23325 -59736 202844 19704 -151175
11125 29602 142210 49329 -87560 83607 77410 262915 167950 75970 8272 126018 166470
11114 166470 -294339 52905 329794 80813 -14683 105098 118743 56380 118745 369139 -58183
11102A84346k8783l1229K24938j36272J02638i4895B12509P9257q8895n3417A0967
11090E08707G189J54555i467F6079k481K45899i1644A35991K20872A03321J29862
11079B33183n3630J4344e435F65718a664D95880J60377k03723j59579O9750L6297
11068C99002O5164j51748O0201J65478o7799G2797R9773L01681M39500j87250
11058G26501C49566o6664J85166J8812M63261j66945r4396l40839P0387K32774
11048F51122J7771J0414j89847N08923j97815k46578K84844j47317l8953j76813
11038D75751J93327K11315C61479J61696K04349K581n0490L3022j2686j03317
11028E96634J22319k86710J06399N5907L9853L105k7003j83901N17370j76064
$$ plain form
11102 184346 155563 124334 349272 213000 315638 -94895 212509 291766 202871 149454 10967
11090 508707 7189 161744 -9467 66079 63598 309497 -91644 135991 356863 103321 233183
11079 233183 179553 193897 -5435 665718 -1664 495880 656257 452534 292955 362705 399002
11068 399002 464166 312418 372619 538097 470298 72797 172570 474251 913751 726501
11058 726501 349566 282902 468068 486880 950141 783196 688800 347961 418348 651122
11048 651122 668893 679307 489460 998383 800568 553990 838834 691517 652564 475751
11038 475751 669078 880393 361479 523175 727524 730105 679615 712637 699951 596634
11028 596634 718953 432243 538642 594549 634402 637507 610504 426603 943973 767909
11018G67909n1868q5158K02234k51912k7582J90167Q4836l45933j0226O3025J8112
11007E53604L15690j5591j01721r629l14553J24627K97533j99672J04763J69156
10997I24207O7637k68068K34634m34896k1907R9764J52088K3361n8670M08507
10987A126657m47570K67062N71982n61808O1817J53531l6365r2377K91927M34529
10977A769385r739N3970K35367M10210K16534J06897j44124L52735m37033K0342
10967B574544l03679J07850k52936k50081j36255K7019R5018J99768N6739k55454
10957A862533R6796L27468j81867l32264j07232n17701k45082l28805k8599N1532
10947E96779o2797J04431P178l17321j18394K18356j02955a8126B65601q0804
$$ plain form
11018 767909 716041 630883 833117 581205 553623 743790 828626 482693 472467 535492 553604
11007 553604 869294 853703 751982 742353 427800 552427 849960 650288 755051 924207
10997 924207 991844 723776 958410 523514 501607 601371 753459 776820 718150 1126657
10987 1126657 679087 946149 1518131 956323 1018140 1171671 1135306 1042929 1334856 1769385
10977 1769385 1759646 1813616 2048983 2459193 2675727 2782624 2638500 2991235 2554202 2574544
10967 2574544 2270865 2378715 2125779 1875698 1739443 1766462 1861480 2061248 2117987 1862533
10957 1862533 1959329 2286797 2104930 1772666 1665434 1147733 902651 573846 545247 596779
10947 596779 533982 638413 645591 328270 209876 428232 325277 -18126 265601 184797
10937A84797c5697A42310g8247m5170D18059I7225L32684b90127G8783J19173
10927A97956D8172B0446d3522A09130n439R8892p4310n4013e2421D3627c2968
10915C30844C9644A4228J97255K793n0704O7697b32197j9345M6686D4684Q5539
10904A30223R3426G5197h9660A84693a881j7716A4411h881m7089B61211c17265
10892e633j98401A08725a79173B57485c0362A22371c8574F0148J36305D0724a6713
10880A63013J71291e1021j25096d6054A96866C4699b26721M5448B87548G7636
10869b77917A29423A4697f1793C0821c4449j11417B00865q2753J00468O7446A9508
10857a0717K734E9996e4441B5K37333I5991B0704e9584l7041H9936l7431B4544
$$ plain form
10937 184797 -35697 142310 -78247 -123417 418059 97225 429909 -290127 78783 197956
10927 197956 48172 20446 -43522 109130 103691 202583 128273 74260 -52421 43627 -32968
10915 330844 39644 14228 211483 214276 163572 231269 -232197 -251542 -204856 44684 130223
10904 130223 223649 75197 -89660 184693 -1881 -19597 14411 -8881 -55970 261211 -317265
10892 -5633 -204034 108725 -179173 257485 -30362 122371 -38574 60148 196453 40724 -16713
10880 163013 334304 -51021 -176117 -46054 196866 34699 -226721 -181273 287548 77636
10869 -277917 129423 14697 -61793 30821 -34449 -145866 200865 118112 218580 286026 19508
10857 -10717 -7983 59996 -54441 25 237358 95991 20704 -59584 -96625 89936 52505 24544
10844d51924C54396C7458g1206j05820D52161A4313h0332a9188q3326j36760N7864
10833a81410g1167K6894J2462A43693e8160H3740P6982c58633B63546F0431J95180
10822B55611g6856L0154A01126l9854b89212G5021r038b22741e6547C149K61410
10811B64559f1332B2723R3292a87898d9378B44J47381c9313A53689d7723j60759
10800b08482C2978H945a0603l9300l3812A88035c0793j8989A4580b09530F3317
10788b8407j34379J4684j92598D3353a47554A38889b26700M5003Q6021j33289
10778b28965B3708h5032j8521j69378O8123C1355a4092j51738j4499C74578e1201
10766c37594a67092A33494b07684M2355A88849b50644A36265a99942K173G3214
$$ plain form
10844 -451924 354396 37458 -71206 -177026 452161 14313 -80332 -19188 -102514 -239274 -181410
10833 -181410 -71167 -44273 -31811 143693 -58160 83740 160722 -358633 263546 60431 255611
10822 255611 -76856 -46702 101126 61272 -289212 75021 65983 -222741 -56547 3149 264559
10811 264559 -61332 22723 116015 -187898 -49378 244 147625 -39313 153689 -47723 -208482
10800 -208482 32978 8945 -10603 -49903 -83715 188035 -30793 -49782 14580 -209530 63317
10788 -28407 -162786 -148102 -340700 43353 -147554 138889 -226700 -181697 -95676 -228965
10778 -228965 23708 -85032 -103553 -272931 -204808 31355 -14092 -165830 -180329 374578 -51201
10766 -337594 -167092 133494 -207684 -165329 188849 -250644 136265 -199942 -197769 73214
10755B23153d67129A9309b58885a10164k12109a45705k3883F8854Q1356R5967
10745B46177a85207M5281a4087A84997a02263l7939C07272p9401b10465A23537
10734f9268A55513E627K69196e2823E9585L5167J59142a15224P298m5277a1022
10722c32117B08194f2477G6454g6940m58153b42357a09014j19091p609A63520
10711B91893a65858N2897j64861a09428A0838J9460L0964Q5000J24711h9495j97462
10700b86957J11616Q5152j6434B99680a89714G9784a47366j39908A70099b32357
10689B23211J8859c30860m1836G5978e2749j13678j59439a14948A03086J07376
10679B10462a94870E868b9279A08752c21116A04798a31335A29726k3829c08411
$$ plain form
10755 223153 -467129 19309 -258885 -110164 -322273 -145705 -169588 68854 150210 246177
10745 246177 -185207 -139926 -14087 184997 -102263 -140202 307272 227871 -210465 123537
10734 -69268 155513 5627 274823 -52823 59585 94752 253894 -115224 -107926 -153203 -11022
10722 -332117 208194 -62477 76454 -76940 -535093 -242357 -109014 -228105 -235714 163520
10711 291893 -165858 -112961 -277822 -109428 10838 30298 61262 146262 270973 -89495 -286957
10700 -286957 -175341 -90189 -106623 299680 -189714 79784 -147366 -287274 170099 -232357
10689 223211 242070 -330860 -372696 75978 -52749 -166427 -325866 -114948 103086 210462
10679 210462 -194870 5868 -29279 108752 -321116 104798 -131335 129726 105897 -308411
10668B35486d0907E2233j300J48026b73012o4884a28459q0763C7565b19904P7468
10657a42436c3173A97691E1441e0046r7146A81287f8508C45231a48305F1749B6554
10645a88008R1606k36330n9893A86944C7165J85114a75267A08117c87431A13820
10634C696K46470b85876J11334b4053k12050Q2811k2568B16984a1598m4583B5801
10622g4876A1876K12016A708d3781l78541B38877b03582d7136A68443b87291A74033
10610a43200A0987c46708b3007h133m3270A43584D5377a14389p6766B13441a57881
10598b30405B11549g7819A70019H4740e658l9877A75394a8172k43776f944I354
10586a43290G908L271J26532c83729M3956D3793Q1236b59766A10538c93143P3995
$$ plain form
10668 235486 -40907 52233 50933 198959 -273012 -337896 -128459 -209222 37565 -219904 -142436
10657 -142436 -33173 197691 51441 -50046 -147192 181287 -68508 345231 -148305 61749 26554
10645 -188008 -96402 -332732 -392625 186944 37165 222279 -175267 108117 -387431 113820
10634 3696 250166 -285876 -174542 -24053 -236103 -153292 -175860 216984 -11598 -56181 25801
10622 -74876 11876 223892 1708 -43781 -422322 238877 -203582 -47136 168443 -287291 174033
10610 -143200 10987 -346708 -23007 -8133 -51403 143584 45377 -114389 -191155 213441 -157881
10598 -230405 211549 -77819 170019 84740 -5658 -45535 175394 -18172 -261948 -6944 9354
10586 -143290 7908 11179 137711 -383729 -339773 43793 125029 -259766 110538 -393143 -319148
10575c19148f3923A69015a45654c9909E3893k3609d7937k45984B8658j2758a2363
10563e7441H757a93633P0289l2986H3483d582p9521l32301B62343c1913m23061
10552d54974J99106B261J89801p309K9276F2652a79270j53661E4438a30468G5109
10540D28571B03671I2114a18414N8757I8191L02497c62647C572c97437A03561
10529F3814b07386A29230l4375b88574A62864c42593d4767A37110a80022k34477
10519d14499a80355G7612J683k5668a86491e858B69682G3055R8282a27743M3487
10508h4256D58451a27485b8888C5410a81506H54N7151c0708j45057h6244f631
10496e0216m9284A21133b8410j3213j66883M0113J4019b6386j5620k32836A21526
$$ plain form
10575 -319148 -63923 169015 -145654 -39909 53893 30284 -47937 -293921 28658 15900 -12363
10563 -57441 8757 -193633 -123344 -156330 83483 -4582 -84103 -416404 262343 -31913 -454974
10552 -454974 -255868 2261 192062 184753 214029 62652 -179270 -332931 54438 -130468 75109
10540 428571 203671 92114 -118414 -59657 98191 400688 -362647 3572 -397437 103561
10529 63814 -207386 129230 94855 -288574 162864 -342593 -44767 137110 -180022 -414499
10519 -414499 -180355 77612 79295 53627 -186491 -5858 269682 73055 171337 -127743 -84256
10508 -84256 458451 -127485 -28888 35410 -181506 854 58005 -30708 -175765 -86244 -6631
10496 -50216 -99500 121133 -28410 -41623 -208506 -168393 -154374 -26386 -42006 -274842 121526
10484a8984H2841h0767A26162J05026M54633b2028B9054K0988J26576A4763b48241
10472h8801K1956a5564j29344I4159Q7562D2944b8912A31842C9135b976C50391
10460h2476l845a3012d798m4420G4740J25064D327b86154a42915j046C3844K77836
10448C11680A10840d78395A43217b92094L2565d3672k98954J2665A20808a03973
10437A25967b23981O4296B43979A00853m1420M9548c4302l546A83545b91845A48407
10425A42942F0743a61255B06974e8082A35331I955a6058q4305E174J48977o6404
10414H7747b9844r0651j90699A633N036O4134c1174A64975c50379A74011d7256
10402a96982P1935k8284I2467a06140B3874c57384a38849H6518J61659q7598b09597
$$ plain form
10484 -18984 82841 -80767 126162 231188 685821 -22028 29054 50042 176618 14763 -248241
10472 -88801 -66845 -15564 -144908 94159 181721 42944 -28912 131842 39135 -2976 350391
10460 -82476 -86321 -13012 -4798 -49218 74740 199804 4327 -286154 -142915 -143961 33844 311680
10448 311680 110840 -478395 143217 -292094 -259529 -43672 -342626 -329961 120808 -103973
10437 125967 -223981 -159685 243979 100853 59433 108981 -34302 -37848 183545 -291845 148407
10425 142942 60743 -161255 206974 -58082 135331 9955 -16058 -100363 5174 154151 87747
10414 87747 -29844 -120495 -311194 1633 6669 70803 -31174 164975 -350379 174011 -47256
10402 -196982 -125047 -153331 92467 -106140 23874 -357384 -138849 86518 248177 160579 -209597
10390C99413f3664J7869J2235B71209B690J51775o6384d1030A94386e624o419
10379a2043H3337N8913j7868O0842F8853K48259L0782F264K90234n5137J14743
10368C56104L45283j99441j31438j69487L81527j40827j28732M954j53201O8675
10358B33417A07632k3272C882L11280A36158J80246A15520L58586J87626r0608
10348E71124j12862K24781l3841C10044L03847k76452O7751A09110J04876I6758
10337a134B73622N006F3741O1024J01234Q6403j49092J56858j0170a44524B76099
10325A12722h8301C13806j26002H5103K40828g8741a4055A78221e5598A35037
10314A33900C3940Q8028D4665d0771F2474J41794J83827j76143a10358k287A45511
$$ plain form
10390 399413 -63664 -45795 -33560 271209 2690 154465 88081 -41030 194386 -5624 -12043
10379 -12043 83337 142250 124382 185224 68853 317112 347894 6264 296498 241361 356104
10368 356104 701387 501946 370508 201021 582548 441721 312989 317943 164742 233417
10358 233417 107632 84360 3882 315162 136158 316404 115520 474106 661732 571124
10348 571124 458262 683043 649202 310044 613891 337439 405190 109110 213986 96758
10337 -1134 273622 278628 63741 124765 225999 312402 163310 320168 309998 -144524 276099
10325 112722 -88301 313806 187804 85103 325931 -78741 -14055 178221 -55598 135037
10314 133900 33940 121968 44665 -40771 62474 204268 388095 211952 -110358 -112645 145511
10302A20267b5360b471j86566A75709a04121B5394a61232l187P0797k06124F6913
10290a94451D0449c3973A2384b7021j33159A25704F0125K4351a73348j066A25558
10278A07101B5670c45987A64748c50172E5243N4408c75695b7980D83620j24793
10268C58827d0131a8427q7565d0287m4901L8787D02231D6986L08084K05591k41943
10257C18718J22219l1971A46547N685a76148N8789F752a34476F5585c72729A00875
10245b8125j08879B69283e5575r7301O4292D3125A0442a61576F342J11847a14957
10233A02209b99202D55299d8165r2655C0191a34007A2350c98846B3985a71066
10222a89693G4026c3165F4027d57820a85437j67274e8071B6783J9714A2765h1313
$$ plain form
10302 120267 -25360 -2471 -189037 175709 -104121 25394 -161232 -164419 -93622 -299746 66913
10290 -194451 40449 -33973 12384 -27021 -160180 125704 60125 84476 -173348 -174414 125558
10278 107101 25670 -345987 164748 -350172 55243 109651 -375695 -27980 483620 358827
10268 358827 -40131 -18427 -105992 -40287 -85188 -46401 402231 46986 355070 560661 318718
10257 318718 440937 408966 146547 152232 -176148 -117359 6752 -134476 65585 -372729 100875
10245 -28125 -137004 269283 -55575 -152876 -88584 43125 10442 -161576 6342 118189 -114957
10233 102209 -299202 455299 -48165 -140820 30191 -134007 12350 -398846 23985 -171066
10222 -189693 74026 -33165 64027 -457820 -185437 -352711 -58071 26783 46497 12765 -81313
10210A20099b38357F7068Q6457j897E7609c21021J16152j06408A20192c19482
10199d1119A23528g209j70483A30154c9112H0462C9828c82050f046n613j52695
10188a64354l1373O5438N526I7987b0608l51946i8043C92432c6388j1772j69174
10177b17334j36895C39829B7908a74970j73925I0148b93444a12164o1225e6777
10166a59969H8704a36619p4974L9786Q3846A43614b42201B2099a09268A16954
10155C3775a81067c11A50693a19952A0376L2525j8557M1642a2380j22675H163
10143c71367C5233f4998A33099E159e5881E8022b2415k05176Q8412d9576C10991
10131B28501E8105j9978J34236a24217e2403j8710k0376m5154B9454K1234P5689
$$ plain form
10210 120099 -238357 67068 153525 151628 57609 -321021 -204869 -311277 120192 -319482
10199 -41119 123528 -7209 -177692 130154 -39112 80462 39828 -382050 -6046 -11659 -164354
10188 -164354 -195727 -130289 -124763 97987 -20608 -372554 -98043 392432 -36388 -48160 -217334
10177 -217334 -354229 339829 27908 -174970 -348895 90148 -293444 -112164 -173389 -56777
10166 -159969 88704 -136619 -211593 -171807 -87961 143614 -242201 22099 -109268 116954
10155 33775 -181067 -311 150693 -119952 10376 42901 24344 65986 -12380 -135055 8163
10143 -371367 35233 -64998 133099 5159 -55881 58022 -22415 -227591 -139179 -49576 310991
10131 228501 58105 38127 172363 -124217 -52403 -71113 -91489 -136643 29454 50688 126377
10120A26377a48947j23496J19174B8118n301a76698H7364b2448c581p0669B90282
10108a86459k71169A97993F0534K2573R8654P4521G1044K2772Q2449a66761j19783
10097b86544E8168c28218B58549J85952B15815d1865H5238Q4381a23118E8827
10086a06137b223j3446q2533k42277A74164b2968B65652q792D0178J7862K99937
10075C57977j27303a80518c8609k40889A72621b3824l2405J1714G997J37059M4168
10064A89224L6209b8125I6095A6412a42025f4863A70120O9503O1413a42757B5900
10052F169K14062a55434b8197D615J07612c46819H7626d0559r1096j69731A02417
10040e1386j23489k50796b06233J1446n1780l5836D9088g8597N51B1760M1950
$$ plain form
10120 126377 -148947 -272443 -153269 28118 22817 -176698 87364 -22448 -3581 -74250 290282
10108 -186459 -457628 197993 60534 83107 181761 256282 71044 93816 176265 -166761 -286544
10097 -286544 58168 -328218 258549 444501 215815 -41865 85238 169619 -123118 58827
10086 -106137 -2223 -15669 -98202 -340479 174164 -22968 265652 256860 40178 58040 357977
10075 357977 230674 -180518 -38609 -279498 172621 -23824 -56229 -44515 7997 145056 189224
10064 189224 225433 -28125 96095 16412 -142025 -64863 170120 239623 301036 -142757 25900
10052 6169 220231 -155434 -28197 4615 112227 -346819 87626 -40559 -131655 -301386 102417
10040 -51386 -174875 -425671 -206233 -194787 -246567 -282403 49088 -78597 -78046 21760 63710
10029F3710a7830l96472B2463f9671L3157k69738i578J101q5197j00698j65440
10018c59812e6475c174k05679P5847l2606a559I9791D0716c5436k1364B37402
10006c05546B29929C0171h309I4495O9430g1618r1272b5390F4897i1446D2125
9994d0326e426p0291C76666i5200k18235A07195P6364b1091j9685F8841d2747
9982d16563a62020r6543a28449k81856H146J71719b1196A71734J20193a79771
9971a59137q3648A52599a1180E6021d61789J92261a02440h765n7531j73098N108
9960b34286L3445e6136m0971C50605B659c02144g7862j34197M2547j49754J27263
9949a92003P3650m16897a48820R864m8754j48679A50958a53974p3732K6505A12198
$$ plain form
10029 63710 -17830 -414302 22463 -69671 -36514 -306252 -9578 -8477 -93674 -194372 -359812
10018 -359812 -56475 -3174 -208853 -133006 -165612 -1559 99791 40716 -35436 -56800 237402
10006 -305546 229929 30171 -8309 94495 163925 -71618 -162890 -25390 64897 -91446 42125
9994 -40326 -5426 -75717 376666 -95200 -313435 107195 183559 -21091 -40776 68841 -42747
9982 -416563 -162020 -258563 -128449 -410305 8146 179865 -21196 171734 291927 -179771
9971 -159137 -242785 152599 -11180 56021 -461789 -269528 -102440 -8765 -66296 -239394 -234286
9960 -234286 -200841 -56136 -97107 350605 2659 -302144 -77862 -212059 -169512 -319266 -192003
9949 -192003 -118353 -535250 -148820 -138956 -187710 -336389 150958 -153974 -227706 -201201 112198
9937D4414a49377G3219L6459f6500D737K40792c1007p1168r4653Q5784d8966j09480
9925a58446l611a885B63414G693b00865j95997J36910q5608J22765K7930I4930
9913d7923j7502G1667i4049n7590B50925A7886K6457L81371b84993M13J25722
9902a58858A88334a47690k8337A95176a22994p5977A63834j2451e6039P95F0142
9890c08760N8562B97812b20231B82310a89699R882A18738M2390c0856k98009F5565
9878f2053k20511I234a88241N4628A69984a8843c784j23388q4039f6114c1942
9866b33025a01527H305J91133K9445f6026H6462L4928f3532J4870j14897C0373
9854a41742A45069e1923D08228c45581G239a11069B92723g7010j2129j72930e2640
$$ plain form
9937 44414 -149377 73219 109678 -66500 4737 245529 -31007 -102175 -196828 -111044 -48966 -158446
9925 -158446 -162057 -1885 263414 7693 -200865 -396862 -259952 -345560 -222795 -194865 94930
9913 -47923 -65425 71667 -94049 -151639 250925 17886 44343 425714 -284993 -284580 -158858
9902 -158858 188334 -147690 -176027 195176 -122994 -198971 163834 151383 -56039 -55244 60142
9890 -308760 -250198 297812 -220231 282310 -189699 -179817 118738 161128 -30856 -328865 65565
9878 -62053 -282564 9234 -188241 -133613 169984 -18843 -3784 -127172 -211211 -66114 -31942
9866 -233025 -101527 8305 199438 228883 -66026 86462 121390 -63532 -48662 -163559 30373
9854 -141742 145069 -51923 408228 -345581 7239 -111069 292723 -77010 -89139 -262069 -52640
9842d50848A04647A7669b84731a11617A9930f3170b1750B4714o199h5061j26299
9831b11360c3669l37296f2005q4090r3496n8447i9441m7613M9533j70339a14584
9819A72831M7940d2612A40921b30471D4086b09794A7834P2816a18853A96162D4837
9807A14813h3178m8235q046A48058B3782a16261M8322j77228o9453P2995C766
9795h8129L5918k1301k54622e3600I7041h8380B76455G039e55879d1790j48910
9784a90700l1618c5745C57427i6928I4419J18282f118A54759d734j41106G9528
9772c87949E1763a84622c5326A4888a01965j31353A07886m2793a44918L2535A66896
9760I1714o08a70322Q4565H5702b36300A98237d6465l902J1636j09698L0909k44864
$$ plain form
9842 -450848 104647 17669 -284731 -111617 19930 -63170 -21750 24714 18515 -85061 -211360
9831 -211360 -33669 -370965 -62005 -146095 -239591 -298038 -99441 -147054 -97521 -267860 -114584
9819 172831 220771 -42612 140921 -230471 44086 -209794 17834 90650 -118853 196162 44837
9807 114813 -83178 -131413 -139459 148058 23782 -116261 -67939 -245167 -314620 -241625 3766
9795 -88129 -52211 -73512 -328134 -53600 97041 -88380 276455 7039 -555879 -41790 -190700
9784 -190700 -222318 -35745 357427 -96928 94419 212701 -6118 154759 -4734 -145840 79528
9772 -387949 51763 -184622 -35326 14888 -101965 -233318 107886 65093 -144918 -112383 166896
9760 91714 91106 -170322 -85757 85702 -236300 198237 -46465 -50367 -38731 -148429 -117520 -362384
9748c62384a68728M7174I6151N82Q8794b04852A20489d34997A29345a53852A18468
9736c09889C21382b09781b7054j14806a1409H2895O0354b51928e4175o3499j56018
9725b73692A45431O459g0792A30513a18355C14014g5906j23768d002o6037a3905
9713b75387b4291k05902m2828B34750a95173A35751o0750b23083a8346g148o7364
9702g4512r1490j18733A77007G4637g3928r0697B86521b17163g8549j34999A35825
9690a31847K2183b1591A92149C3736h1591A43675a15681A29057B3765a13726c9661
9678I8065a89447a0882k20227n8741B11618e9382q1161j35872J33754F6008b8330
9666c7098j97124G2713k2126B3157N6009M9499C8300a34597J4298L2182l623F3241
$$ plain form
9748 -362384 -168728 -121554 96151 96733 185527 -204852 120489 -434997 129345 -153852 118468
9736 -309889 321382 -209781 -27054 -141860 -11409 82895 143249 -251928 -54175 -117674 -273692
9725 -273692 145431 151890 -70792 130513 -118355 314014 -75906 -199674 -4002 -70039 -13905
9713 -275387 -24291 -230193 -273021 234750 -195173 135751 75001 -223083 -18346 -7148 -74512
9702 -74512 -166002 -284735 177007 74637 -73928 -164625 286521 -217163 -78549 -213548 135825
9690 -131847 -109664 -21591 192149 33736 -81591 143675 -115681 129057 23765 -113726 -39661
9678 98065 -189447 -10882 -231109 -289850 211618 -59382 -140543 -276415 -142661 66008 -28330
9666 -37098 -234222 72713 50587 23157 79166 128665 38300 -134597 -120299 -88117 -91740 63241
9653A1060b3016B88712g3159j14464A62068o4381a68602P8232A2620J01093a16698
9641a42482k1034g8989B24901q8933b24854n7800b1778j55327f050k6217j6345
9630d8612I2839b85183B57386F999a54378m8408A719a06084o9557g6036j87120
9619b63156J04343j09595f1421k07297A69972d3781p2880q7067F6624g1387A66164
9607A48297f4996j19833O0645j0709k7641P2913k76644A12285a61585O203A00912
9595g0693A7335M2082K69068f0242K3860j53615N5964j2718A9209a24253B6672
9583a49495D140h7047l2926L8698j45228A52162h562k92073K4093J07718G9714
9571I6913M8015a11528k79037a73617A74014a201C3848b71784j9179C02406j00614
$$ plain form
9653 11060 -23016 288712 -73159 -187623 162068 97687 -168602 -90370 12620 113713 -116698
9641 -142482 -163516 -78989 224901 135968 -224854 -282654 -21778 -177105 -6050 -32267 -48612
9630 -48612 92839 -285183 257386 6999 -154378 -202786 1719 -106084 -175641 -76036 -263156
9619 -263156 -158813 -268408 -61421 -268718 169972 -43781 -116661 -203728 66624 -71387 166164
9607 148297 -64996 -184829 -124184 -134893 -162534 -89621 -366265 112285 -161585 -155382 100912
9595 -70693 17335 59417 328485 -60242 -36382 -189997 -134033 -146751 19209 -124253 26672
9583 -149495 4140 -87047 -119973 -81275 -226503 152162 -8562 -300635 -276542 -168824 79714
9571 96913 144928 -111528 -390565 -173617 174014 -1201 33848 -271784 -290963 302406 201792
9560B01792c69425a39255L0750F8892a71471E088a85336k05382A13896g4069j71292
9549b45361i9395B61698d5991D6598c4968l603l96783D3065c36680C33291b04392
9537a62000k78942B1175a81550D60039b18070j10712D8825b08477B0305a67328
9526B59131g0432A36003b50553A6050c47755o1871a57163E0150a33582G8445c04335
9514h0612q1895B01384H3297g0482k2798j45027D7679J98581c34251m5285c6531
9502h9334J49k7169B88860d3438n5088n8170A49320b27426I3952a63099L2287
9491a30812j44098A72938E2719J49721a57220q7196D5713P988g6544j4996K888
9480h8652q4981O5910H9370A5563g1592g482j85457j93586B55413j24171L265
$$ plain form
9560 201792 -369425 -139255 -108505 68892 -171471 5088 -185336 -390718 113896 -74069 -245361
9549 -245361 -99395 261698 -45991 46598 -34968 -38571 -435354 43065 -336680 333291 -204392
9537 -162000 -440942 21175 -181550 460039 -218070 -328782 48825 -208477 20305 -167328
9526 259131 -70432 136003 -250553 16050 -347755 -409626 -157163 50150 -133582 78445 -304335
9514 -80612 -162507 201384 83297 -70482 -93280 -238307 47679 246260 -334251 -379536 -36531
9502 -89334 -89185 -116354 288860 -43438 -98526 -156696 149320 -227426 93952 -163099 -130812
9491 -130812 -274910 172938 52719 202440 -157220 -244416 45713 53701 -76544 -91540 -88652
9480 -88652 -173633 -107723 89370 15563 -71592 -7482 -192939 -386525 255413 131242 134507
9469A34507d416r0043c3572A85050b19573B4259h4552c1924i096p0048A18863
9457A06207E0877b50015a08172o4217J1060a8551E6360K03892i7824k38142P0935
9446b65031J31420B03068a55968J8954G5426a69961Q0411E5427H985P3665a03456
9434d07117e3638a5963l92157i6242A88037d41167K0962a20364k79138A44294
9423B22451d13062k981A86792b2224A14830d0888a7706m5316j9532E4847F513
9411a51332K468n1484L5873C17571j30929a8070j36624B41432F5199b07744R3460
9400a14284I1601b88339D8040d32147b9053r353G4697m000J0446g6725c4186j32293
9388a66479j64942F6766P5252h4727j7387A78742a54154b0154B97196a26797C9270
$$ plain form
9469 134507 -4416 -94459 -33572 185050 -219573 24259 -84552 -31924 -9096 -79144 118863
9457 106207 50877 -250015 -108172 -172389 -161329 -18551 56360 260252 -97824 -335966 -265031
9446 -265031 -133611 203068 -155968 -137014 75426 -169961 -89550 55427 8985 82650 -103456
9434 -407117 -53638 -15963 -408120 -96242 188037 -441167 -420205 -120364 -399502 144294
9423 222451 -413062 -416043 186792 -22224 114830 -40888 -17706 -63022 -82554 54847 6513
9411 -151332 -148864 -200348 -164475 317571 186642 -18070 -154694 241432 65199 -207744 -114284
9400 -114284 91601 -288339 48040 -432147 -29053 -38406 74697 70697 81143 -76725 -34186 -166479
9388 -166479 -331421 66766 142018 -84727 -102114 178742 -154154 -20154 297196 -126797 39270
9376A84412G2896b51971h9402l65776J17139B45165a73113Q5733p214n8440A30410
9364a80914d7498B28787A08157a94745A32244a05327b6987l5322B05740H8770
9353a38771c2254m1445J8172r8513b2773i247m0420C08141a45666c3690F7725
9341A15879b05374C1422e28637b51245A27201b81380B1313R9025D409K18336n6931
9330A65814J077h2776j19572G6390a45663J787A40879b92668i4721p6861B2404
9318B8612b41496C6263O7617a29989A0793K02299E1969P4965L8709a35050q3057
9307b18107O4578J9950j12727D8287g6110q2965d5294k95877J9623A51600G909
9295a94379b1937l01302e8467A3303J81624H6414e8128A90217a33900k08692J49469
$$ plain form
9376 184412 72896 -251971 -89402 -455178 -338039 245165 -173113 -87380 -94594 -153034 130410
9364 -180914 -47498 228787 108157 -194745 132244 -105327 -26987 -62309 205740 88770
9353 -138771 -32254 -73699 -55527 -154040 -22773 -9247 -49667 308141 -145666 -33690 67725
9341 115879 -205374 31422 -528637 -251245 127201 -281380 21313 120338 4409 222745 165814
9330 165814 166891 -82776 -202348 76390 -145663 -143876 140879 -292668 -94721 -171582 22404
9318 28612 -241496 36263 103880 -129989 10793 213092 51969 126934 165643 -135050 -218107
9307 -218107 -153529 -133579 -246306 48287 -76110 -159075 -45294 -341171 -321548 151600 7909
9295 -194379 -21937 -323239 -58467 13303 194927 86414 -58128 190217 -133900 -342592 -193123
9284a93123f5072k7849o9614q6361j05645B34078b50439B4592b57382a14309B11050
9272B09324a94259N1299A65138O6636I4822F392b77244o4547a26469E9901J69182
9261B29083G5577b61838D23896A13746D4525a36876I4070Q9002p060K6644A00606
9249C982d0669q8148j42108a12319B99481a77877h1493j05081f0443n8679j96039
9238c15161B00472a07603p002a1009B45037B0783c81774D9117J3722b37783F4914
9226a75891d0421j27413o053L4332L6770j63879J10435D5158J68033g7356b6604
9214b51146C5644b46734B3744a13906G3148g224B82165i795p9514N32p9378G6185
9201a83654j19523B28941a32403M0711c5248k21441a18471E5930a98927K6852
$$ plain form
9284 -193123 -65072 -92921 -162535 -248896 -354541 234078 -250439 24592 -257382 -114309 211050
9272 209324 -194259 -142960 165138 231774 94822 6392 -277244 -341791 -126469 59901 229083
9261 229083 75577 -261838 423896 113746 44525 -136876 94070 183072 176012 202656 100606
9249 3982 -40669 -128817 -270925 -112319 299481 -177877 -81493 -186574 -60443 -119122 -315161
9238 -315161 200472 -107603 -114605 -11009 245037 20783 -381774 49117 62839 -237783 64914
9226 -175891 -40421 -167834 -173887 -139555 -102785 -266664 -156229 45158 213191 -77356 -26604
9214 -251146 35644 -246734 23744 -113906 73148 -7224 282165 -9795 -89309 -88777 -168155 76185
9201 -183654 -303177 228941 -132403 -91692 -35248 -256689 -118471 55930 -198927 -172075
9191a72075j59376i5897M1186r0314l18429f532p9007D0082P9419d213m35498
9180d39711i6551Q205B17368D0352a92634a5554j9102r3650j4515L3743B20052
9168d36430K15582r581a9582l7155k5403C795a92112Q5367l23135N7470G8042
9156G851J5757L5284K9641K43669p7862b47854H2704a18657j41619P9725k18440
9145c98991H9913a64468C2983L72128G2701a44779j91154I4449b26018k1230C9514
9133b88076j6661i8601A07281c9314q1669A0049L7308f4350m1138A66416b04278
9121f31800b38316J09157m359d7812k1130k719E3752c70517k3625E9247a40718
9109c74521I8262f228l9774n6642A61793p0044f6971A56167E2170b52989l9929
$$ plain form
9191 -172075 -331451 -95897 -54711 -145025 -463454 -6532 -85539 40082 119501 -4213 -439711
9180 -439711 -96551 -88346 217368 40352 -192634 -15554 -34656 -128306 -142821 -109078 220052
9168 -436430 -220848 -230429 -19582 -56737 -82140 3795 -192112 -106745 -429880 -372410 78042
9156 7851 23608 58892 88533 332202 254340 -247854 82704 -118657 -260276 -180551 -398991
9145 -398991 89913 -164468 32983 405111 72701 -144779 -335933 94449 -226018 -247248 39514
9133 -288076 -304737 -98601 107281 -39314 -120983 10049 47357 -64350 -105488 166416 -204278
9121 -631800 -238316 -129159 -133518 -47812 -68942 -71661 53752 -370517 -394142 59247 -140718
9109 -374521 98262 -6228 -46002 -102644 161793 91749 -66971 156167 52170 -252989 -292918
9098b92918h1494o7823A26325o0484c38088C6467e3015K420j03874d1781n0655
9087i2436H8141e6024D07457A80917a50764B19393C2136h0610k21162A04567a89906
9075a78633A73480f6097B9790Q3361O2022d073A3794b35839j1380B16159a21855
9063B59100c78991A29359a37780B3155f6318k1506F1067j9823b31101B25847C4161
9051b14962B3183P7683a04400b8435A12035a93251Q4263e0512j16251K0469O7011
9040g9283A11725g6210C36098b31961B891a63243H5948O8824b1096r6748j34126
9029b51970A19473n887a77942b8480G9310B9617J28659b15117A51351c35487B23171
9017A95406a56210M6319B3821O3973m0008L5338d6725o3653k93404A6153d5012
$$ plain form
9098 -292918 -81494 -149317 126325 65841 -338088 36467 -53015 -50595 -154469 -41781 -92436
9087 -92436 88141 -56024 407457 180917 -150764 219393 32136 -80610 -301772 104567 -189906
9075 -178633 173480 -66097 29790 113151 175173 -4073 13794 -235839 -247219 216159 -121855
9063 259100 -378991 129359 -137780 23155 -66318 -87824 61067 41244 -231101 225847 34161
9051 -214962 23183 100866 -104400 -28435 112035 -193251 -108988 -50512 -166763 -146294 -79283
9040 -79283 111725 -76210 336098 -231961 2891 -163243 85948 154772 -21096 -117844 -251970
9029 -251970 119473 113586 -177942 -28480 79310 29617 158276 -215117 151351 -335487 223171
9017 195406 -156210 -109891 23821 87794 47786 83124 -46725 -110378 -403782 16153 -45012
9005a81334J5896r0023G8102L474c02537m8370a46390A71352a46093n80857B37944
8993a29193d2431l48984J85897C9247M7998a17350B22126c28776H4385C0331P2507
8982A02838a20235A1284M4407L1295a81829j0337A39147c56611a70827B15242
8971e7247D9088i8409k58183B18513a18324r6107K2134A17304c24975A09711h8060
8959G7126g1195C66295H1762A5277N6481a15018p8994J0668l2501B63176a07289
8947C7433J0092j8355b12384J00921A78366b94061a42623j20582e2693F7517l1260
8936C6257J10336J31379R5718F5889K38239g1412B09953b1105A18991N553J28734
8925B53278M08566P52474L376163P418552j025819n221651k965335A360425B56768
$$ plain form
9005 -181334 -165438 -255461 78102 81576 -302537 -350907 -146390 171352 -146093 -726950 237944
8993 -129193 -42431 -391415 -205518 39247 87245 -117350 222126 -328776 84385 30331 102838
8982 102838 -120235 11284 55691 86986 -181829 -192166 139147 -356611 -170827 215242
8971 -57247 49088 -98409 -356592 218513 -118324 -214431 -192297 117304 -324975 109711 -88060
8959 77126 -71195 366295 81762 15277 71758 -115018 -194012 -183344 -215845 263176 -107289
8947 37433 47525 29170 -212384 -111463 178366 -294061 -142623 -263205 -52693 67517 36257
8936 36257 146593 277972 373690 65889 304128 -71412 209953 -21105 118991 124544 253278
8925 253278 661844 1414318 4790481 12209033 11183214 5961563 2996228 1360425 256768
8915a2430m1391J6861n4565j23078A30544J36836J94101k09102j0292J35001a19370
8903E9072B4863a5776k09800D0927a31363E2263R6473f1305E339k356b4072B18816
8890D2851a8218H98b32789O1840j63567i372G429i8521B92443b14722d8590d038
8877B05211J23039b10222b9149j86206F1548f1722D04731a14071j07980Q8465
8867a33586a0660j09313B48887A7730J34348a12958n2990O9012G6863I820R2109
8856A01929K61848E4246b95396e338j67783G7304O021J21310b83701D6803a65278
$$ plain form
8915 -12430 -53821 -36960 -91525 -214603 130544 267380 461481 252379 242087 377088 -119370
8903 59072 24863 -15776 -225576 40927 -131363 52263 148736 -61305 5339 2983 -24072 218816
8890 42851 -18218 898 -232789 -170949 -334516 -9372 7429 -98521 292443 -214722 -48590 -4038
8877 205211 328250 -210222 -29149 -215355 61548 -61722 404731 -114071 -222051 -133586
8867 -133586 -10660 -119973 248887 17730 152078 -112958 -165948 -96936 76863 9820 101929
8856 101929 363777 54246 -295396 -5338 -173121 77304 83325 204635 -283701 46803 -165278
$$ [...]
##END NTUPLES=NMR SPECTRUM
##END=
