##TITLE=AC1505_CUNDCR13312_8126462_q7w8fun3M6
##JCAMPDX= 6.0         $$ Bruker NMR JCAMP-DX V2.0
##DATA TYPE= NMR SPECTRUM
##DATA CLASS= NTUPLES
##ORIGIN= BRUKER
##OWNER= Administrator
$$ 1.72 TOPSPIN		Version 2.1
$$ 2013-08-16 19:05:54.600 -0700  Administrator@X
$$ Compression mode = diff/dup
##.OBSERVE FREQUENCY= 400.02188249412
##.OBSERVE NUCLEUS= ^1H
##.ACQUISITION MODE= SIMULTANEOUS (DQD)
##.ACQUISITION SCHEME= undefined
##.AVERAGES= 8
##.DIGITISER RES= 22
##SPECTROMETER/DATA SYSTEM= spect
##.PULSE SEQUENCE= zg30
##.SOLVENT NAME= COFFEE_meoh
##.SHIFT REFERENCE= INTERNAL, COFFEE_meoh, 1, 14.98509
##AUDIT TRAIL= $$ (NUMBER, WHEN, WHO, WHERE, PROCESS, VERSION, WHAT)
$$ ##TITLE= Audit trail, TOPSPIN		Version 2.1
$$ ##JCAMPDX= 5.01
$$ ##ORIGIN= Bruker BioSpin GmbH
$$ ##OWNER= Administrator
$$ $$ E:\/data/COFFEE/nmr/AC1505_CUNDCR13312_8126462_q7w8fun3M6/20/pdata/1/auditp.txt
$$ ##AUDIT TRAIL=  $$ (NUMBER, WHEN, WHO, WHERE, PROCESS, VERSION, WHAT)
(   1,<2013-08-16 19:05:47.991 -0700>,<Administrator>,<X>,<go>,<TOPSPIN 2.1>,
      <created by zg
	started at 2013-08-16 19:04:42.303 -0700,
	POWCHK enabled, PULCHK disabled,
       configuration hash MD5:
       C8 4E 4E 5D D3 5C D8 9E 9F 52 82 E0 59 8A DE 15
       data hash MD5: 64K
       45 CF AC 08 1B E9 CD A4 04 0A 65 B6 30 98 9F D4>)
(   2,<2013-08-16 19:05:50.913 -0700>,<Administrator>,<X>,<proc1d>,<TOPSPIN 2.1>,
      <Start of raw data processing
       efp LB = 0 FT_mod = 6 PKNL = 1 PHC0 = 0 PHC1 = 0 SI = 32K 
       data hash MD5: 32K
       EF BF 30 DB FA CE EB FA 76 73 47 DF 8B 1C CB E0>)
(   3,<2013-08-16 19:05:51.288 -0700>,<Administrator>,<X>,<proc1d>,<TOPSPIN 2.1>,
      <pk PHC0 = 100.0909 PHC1 = 0 
       data hash MD5: 32K
       A0 B5 9F 18 89 69 02 50 76 08 89 69 7D 26 A2 D3>)
(   4,<2013-08-16 19:05:51.382 -0700>,<Administrator>,<X>,<proc1d>,<TOPSPIN 2.1>,
      <abs ABSG = 1 
       data hash MD5: 32K
       0D DD A0 EE BF E2 12 B3 BD 06 5C E2 BC 31 C9 21>)
(   5,<2013-08-16 19:05:51.428 -0700>,<Administrator>,<X>,<proc1d>,<TOPSPIN 2.1>,
      <abs ABSG = 2 
       data hash MD5: 32K
       6A 4D 6E DB 21 FA E9 D3 A2 D7 64 46 43 3A 44 86>)
(   6,<2013-08-16 19:05:51.491 -0700>,<Administrator>,<X>,<proc1d>,<TOPSPIN 2.1>,
      <abs ABSG = 3 
       data hash MD5: 32K
       F8 A3 D1 C3 63 17 BE C5 9F 54 7E 16 4D 03 97 08>)
(   7,<2013-08-16 19:05:51.538 -0700>,<Administrator>,<X>,<proc1d>,<TOPSPIN 2.1>,
      <abs ABSG = 4 
       data hash MD5: 32K
       C7 04 ED 63 84 05 A7 12 0E 67 8B DC F0 B8 B5 47>)
(   8,<2013-08-16 19:05:51.585 -0700>,<Administrator>,<X>,<proc1d>,<TOPSPIN 2.1>,
      <abs ABSG = 5 
       data hash MD5: 32K
       7F 4D 66 2C 1A EC BE 33 B2 CA 36 DF F5 00 90 64>)
$$ ##END=
$$ 
$$ $$ hash MD5
$$ $$ 4F 7A DB AE 2B BB 31 8B 15 41 5D 29 D5 0D 15 23
##$RELAX= 
##$RELAX= 
##$RELAX= 
##$RELAX= 
##$RELAX= 
##$RELAX= 
##$RELAX= 
$$ Bruker specific parameters
$$ --------------------------
##$DU= <E:\>
##$EXPNO= 20
##$NAME= <AC1505_CUNDCR13312_8126462_q7w8fun3M6>
$$ [...]
150 150 150 150 150 150 150 150
##$TP07= 0
##$TPNAME0= <>
##$TPNAME1= <>
##$TPNAME2= <>
##$TPNAME3= <>
##$TPNAME4= <>
##$TPNAME5= <>
##$TPNAME6= <>
##$TPNAME7= <>
##$TPOAL= (0..7)
0.5 0.5 0.5 0.5 0.5 0.5 0.5 0.5
##$TPOFFS= (0..7)
0 0 0 0 0 0 0 0
##$TUNHIN= 0
##$TUNHOUT= 0
##$TUNXOUT= 0
##$USERA1= <user>
##$USERA2= <user>
##$USERA3= <user>
##$USERA4= <user>
##$USERA5= <user>
##$V9= 5
##$VALIST= <valist>
##$VCLIST= <CCCCCCCCCCCCCCC>
##$VD= 0
##$VDLIST= <DDDDDDDDDDDDDDD>
##$VPLIST= <PPPPPPPPPPPPPPP>
##$VTLIST= <TTTTTTTTTTTTTTT>
##$WBST= 2048
##$WBSW= 25
##$XGAIN= (0..3)
0 0 0 0
##$XL= 0
##$YL= 0
##$YMAX_a= 653318
##$YMIN_a= -557303
##$ZGOPTNS= <>
##$ZL1= 120
##$ZL2= 120
##$ZL3= 120
##$ZL4= 120
##$ABSF1= 14.98509
##$ABSF2= -5.573092
##$ABSG= 5
##$ABSL= 3
##$ALPHA= 0
##$AQORDER= 0
##$ASSFAC= 0
##$ASSFACI= 0
##$ASSFACX= 0
##$ASSWID= 0
##$AUNMP= <proc_prof1d_extract_pilot.lims>
##$AXLEFT= 0
##$AXNAME= <>
##$AXNUC= <1H>
##$AXRIGHT= 0
##$AXTYPE= 0
##$AXUNIT= <>
##$AZFE= 0.1
##$AZFW= 0.1
##$BCFW= 0
##$BC_mod= 0
##$BYTORDP= 0
##$COROFFS= 0
##$CY= 15
##$DATMOD= 1
##$DC= 0
##$DFILT= <>
##$DTYPP= 0
##$F1P= 0
##$F2P= 0
##$FCOR= 0.5
##$FTSIZE= 32768
##$FT_mod= 6
##$GAMMA= 0
##$GB= 0
##$INTBC= 1
##$INTSCL= 1
##$ISEN= 128
##$LB= 0
##$LEV0= 0
##$LPBIN= 0
##$MAXI= 10000
##$MC2= 0
##$MEAN= 0
##$ME_mod= 0
##$MI= 0
##$NCOEF= 0
##$NC_proc= -8
##$NLEV= 6
##$NOISF1= 0
##$NOISF2= 0
##$NSP= 0
##$NTH_PI= 0
##$NZP= 0
##$OFFSET= 14.98509
##$PC= 1
##$PHC0= 100.0909
##$PHC1= 0
##$PH_mod= 1
##$PKNL= yes
##$PPARMOD= 0
##$PPDIAG= 0
##$PPIPTYP= 0
##$PPMPNUM= 2147483647
##$PPRESOL= 1
##$PSCAL= 4
##$PSIGN= 0
##$PYNMP= <proc.py>
##$REVERSE= no
##$SF= 400.02
##$SI= 32768
##$SIGF1= 0
##$SIGF2= 0
##$SINO= 400
##$SIOLD= 32768
##$SPECTYP= <>
##$SREGLST= <1H.CDCl3>
##$SSB= 0
##$STSI= 32768
##$STSR= 0
##$SW_p= 8223.68421052631
##$SYMM= 0
##$S_DEV= 0
##$TDeff= 65536
##$TDoff= 0
##$TI= <>
##$TILT= no
##$TM1= 0
##$TM2= 0
##$TOPLEV= 0
##$USERP1= <user>
##$USERP2= <user>
##$USERP3= <user>
##$USERP4= <user>
##$USERP5= <user>
##$WDW= 1
##$XDIM= 32768
##$YMAX_p= 455299241
##$YMIN_p= -685432
##$CURPLOT= <Network HP LaserJet P1505>
##$CURPRIN= <$Network HP LaserJet P1505>
##$DFORMAT= <normdp>
##$LAYOUT= <+/1D_H.xwp>
##$LFORMAT= <normlp>
##$PFORMAT= <normpl>
##$SURQMSG= 1
$$ End of Bruker specific parameters
$$ ---------------------------------
##NTUPLES= NMR SPECTRUM
##VAR_NAME=  FREQUENCY,     SPECTRUM/REAL,   SPECTRUM/IMAG
##SYMBOL=    X,             R,               I
##VAR_TYPE=  INDEPENDENT,   DEPENDENT,       DEPENDENT
##VAR_FORM=  AFFN,          ASDF,            ASDF
##VAR_DIM=   32768,         32768,           32768
##UNITS=     HZ,            ARBITRARY UNITS, ARBITRARY UNITS
##FACTOR=    0.250966925370066, 1,           1
##FIRST=     8223.43324360094, -133669,      -61320
##LAST=      0,             -170001,         -135874
##MIN=       0,             -685432,         0
##MAX=       8223.43324360094, 455299241,    0
$$ Real data points
##PAGE= N=1
##DATA TABLE= (X++(R..R)), XYDATA
$$ [...]
$$ plain form
19560 -286362 164309 -41778 -75616 -137915 149177 -86671 -293811 4417 -128309 39810 -182878
19548 250255 -154995 -135538 -140919 -75501 -47914 42057 -112142 -43773 423232 -68060 -18990
19536 -348379 -123193 -43579 -7878 -73336 -366992 15985 -65367 -25783 -196354 -77934 -55126
19525 -55126 130859 192265 95678 -4640 -264720 -109131 -52555 -96940 -262168 -45393 72785
19513 188368 -92961 32259 173646 235702 14560 55757 226345 17251 -92121 -155150 57600
19501 -253744 -253551 -159326 -14856 -93537 -337731 67361 54538 -33362 -409587 -102270 146524
19489 57873 -367467 -35944 96446 -122710 -193562 -150794 -184530 -237365 -426475 -233221 203246
19477 -174695 -80702 227748 238774 -223549 37449 211007 -128016 47850 -5413 -95175 -102461
$$ packed form
19560b86362A64309d1778l3838o2299A49177h6671k07140D417a28309C9810a82878
19548B50255a54995J9457n381O5418K7587D2057a12142d3773D23232f8060a8990
19536c48379a23193d3579g878o5458k93656A5985f5367b5783j70571g7934K2808
19525e5126A30859O1406I5678d640k60080a09131e2555m4385j65228d5393G2785
19513A88368i2961C2259J41387O2056A4560M1197J70588A7251i2121o3029E7600
19501b53744J93R4225a4856p8681k44194F7361j2823c3362l76225a02270A46524
19489E7873c67467c5944I6446a22710p0852M2768l3736n2835j89110J93254B03246
19477a74695h0702B27748J1026b23549C7449J73558a28016D7850e413q9762p286
$$ plain form
19466 -102461 -84307 -52331 -39379 -78227 236883 -143904 -360310 -311032 109669 -188111
19455 182387 47194 -346202 -38315 -39073 139893 111450 151418 -115247 -212 -120043 139179
19443 -222329 -43815 -30905 41252 -16684 -92162 36997 160747 110421 -141433 70685 -205485
19431 -47511 175199 16068 22380 5370 -48648 -125720 116046 -215256 80845 -65194 81941
19419 -103011 45654 -58238 -345621 -148510 83463 -19898 353284 -52542 193707 -308459
19408 -134370 -215730 256306 75120 46713 -123480 -98455 -315627 -165281 -123571 -38921 276380
19396 64067 -45614 -417391 -101437 76755 -365311 -148118 -131649 -196567 -328576 -164607
19386 -164607 178763 -60944 64602 -156863 -135191 36389 -247680 35317 73239 333600 52211
$$ packed form
19466a02461J8154L1976J2952l8848B36883a43904k16406M9278A09669a88111
19455A82387D7194c46202c8315p58A39893k8443L9968a15247b12j19831A39179
19443b22329d3815J2910D1252a6684p5478C6997J23750n0326a41433G0685b05485
19431d7511A75199A6068O312E370d8648p7072A16046b15256H0845f5194H1941
19419a03011D5654e8238k87383a48510H3463a9898C53284e2542A93707c08459
19408a34370q1360B56306G5120k8407a23480K5025k17172J50346M1710c8921B76380
19396F4067d5614l71777a01437G6755c65311a48118J6469o4918j32009J63969
19386a64607A78763f0944F4602a56863K1672C6389b47680C5317L7922K60361E2211
$$ plain form
19374 82034 140629 29833 -306232 72304 110483 -320696 -27038 179364 -128031 290081 172286
19363 172286 113406 -250820 -272783 -297407 -140227 32267 -157503 -120495 -189703 115572 115299
19352 115299 96580 37905 -299012 176284 -76602 4701 -44977 -101897 -29889 -431908 241894
19340 75906 216431 -79100 -235720 -231422 -146646 -131513 -149208 -406640 -228064 -23653 -75568
19329 -75568 -63904 -164615 132180 188763 -112421 -126385 -311792 -155432 -131689 213515
19318 140547 -79928 -134955 -39832 81600 -15743 -145191 -288605 196412 128285 -213037 -13790
19306 222211 40528 -83316 -219582 53805 -279950 286734 -501958 -181406 -162780 4537 -85000
19294 131546 -11644 -348263 -289781 -177928 -79636 103964 -74947 297602 -275953 119276
$$ packed form
19374H2034N8595B9833c06232G2304L8179c20696b7038A79364a28031B90081j17795
19363A72286n8880b50820k1963k4624a40227C2267a57503L7008o9208A15572k73
19352A15299j8719C7905b99012A76284g6602D701d4977n6920b9889m02019B41894
19340G5906J40525g9100j56620M298Q4776J5133j7695k57432J78576b3653n1915
19329g5568J1664j00711A32180N6583a12421j3964j85407a55432K3743B13515
19318A40547g9928n5027c9832H1600a5743j29448j43414A96412o8127b13037a3790
19306B22211D0528h3316j36266E3805b79950B86734e01958a81406J8626D537h5000
19294A31546a1644l36619N8482J11853g9636A03964g4947B97602b75953A19276
$$ plain form
19283 -152353 165557 95673 -464365 21184 -24598 289999 -92183 58638 -277565 -106284
19272 -22107 18715 117465 -95217 -49006 -473017 -39814 -78752 -563993 151015 -45493 155255
19260 -31935 -113044 -213939 313460 -265246 213342 184865 44746 235587 -231971 -79840
19249 296475 -291486 -170485 -109940 -85947 -57893 -301265 -213378 272696 207619 19869 -209357
19237 2004 -113090 89671 -185004 119247 44002 -274631 15119 170897 334999 206327
19227 206327 -174952 -258144 -324570 -183826 272424 -135386 512967 -121047 201167 131778
19217 131778 -6968 -230261 -152157 -396867 -183255 -337000 -102795 -7472 71769 -437110 -254213
19206 -254213 -48605 -253199 116645 -404834 -32014 33307 -45702 6275 -143341 163485 23771
$$ packed form
19283a52353A65557o9884d64365B1184b4598B89999i2183E8638b77565a06284
19272b2107A8715R8750i5217M6211m24011c9814l8938m85241A51015d5493A55255
19260c1935q1109j00895C13460b65246B13342k8477D4746J90841b31971g9840
19249B96475b91486J21001O0545K3993K8054k43372Q7887B72696o5077A9869b09357
19237B004a13090H9671a85004A19247D4002b74631A5119J55778J64102j28672
19227B06327a74952q3192o6426J40744B72424a35386E12967a21047B01167o9389
19217A31778f968k23293P8104k44710a83255j53745a02795g472G1769d37110J82897
19206b54213d8605k04594A16645d04834c2014C3307d5702F275a43341A63485B3771
$$ plain form
19194 -84086 63319 -56687 -259463 16316 -165960 167095 81218 -199674 -167388 -135944 -144237
19183 -144237 -13474 17446 -76032 -13847 -213613 -112632 -75558 -36381 -68358 -204591 -116689
19172 -116689 -112278 -255176 66942 -40780 -471316 -200309 191865 -50543 229805 48735 -354664
19160 215151 -184593 409176 -136854 -166326 -86087 36990 -151335 -79091 -258995 13190
19149 -34138 -292680 -143028 31211 -256411 15324 -115786 52949 -113581 -297583 -244707
19139 -244707 -335537 267814 143940 -41353 -11662 -274686 -372860 -4570 -314728 -272201 35454
19127 110188 -223749 -507318 -53732 45256 223349 21324 30919 -38029 176209 -200200 -376212
19116 -376212 232841 344185 -86032 -151288 -199705 -68561 -229787 -87377 135876 -133892
$$ packed form
19194h4086F3319e6687k02776A6316a65960A67095H1218a99674L2286L1444q293
19183a44237a3474A7446g6032a3847j99766J00981L7074c6381l1977j36233Q7902
19172a16689M411j42898F6942d0780m30536b00309A91865e0543B29805D8735c54664
19160B15151a84593D09176a36854k9472Q0239C6990a51335P2244j79904A3190
19149c4138k58542a43028C1211b56411A5324a15786E2949a13581j84002N2876
19139b44707r0830B67814j23874d1353a1662k63024r8174d570l10158M2527C5454
19127A10188b23749k83569e3732D5256J78093B1324R595c8029A76209b00200j76012
19116c76212B32841J11344h6032o5256m8417f8561j61226h7377A35876a33892
$$ plain form
19105 -77598 32928 -54527 18265 -76787 121062 -69428 -156540 -132639 42554 25463 619 -134123
19092 8211 112348 -268255 11122 145520 -167830 28103 -161255 67685 -52395 -131172 -232582
19081 -232582 -52770 -107371 -209320 -155185 -33866 -13826 -208409 -108471 -68259 29544 68923
19070 68923 -272051 87606 -90718 43014 -58709 60828 -214380 -197850 -46072 63143 334998
19059 334998 50743 151630 -19716 12360 9094 -162625 -289130 -271149 -188442 63073 -55286
19047 -109998 -212085 -293285 -62163 -149708 -208074 203533 -102986 -26772 243974 -197049
19036 78404 74956 -205534 -80516 91404 351578 87152 189287 -65005 48507 -80144 -133591
19025 -133591 347008 83910 8260 226608 -269160 57466 -78479 -43386 285236 -317828 -205741
$$ packed form
19105g7598C2928e4527A8265g6787A21062f9428q7112K3901D2554j7091F19a34123
19092H211J04137b68255A1122J34398a67830B8103a61255F7685e2395p8777j01410
19081b32582e2770n4601j01949N4135c3866a3826j94583R9938M0212B9544L9379
19070F8923b72051H7606i0718D3014e8709F0828b14380J6530d6072F3143K71855
19059C34998E0743J00887a9716A2360l266a62625j26505J7981Q2707F3073e5286
19047a09998j02087q1200f2163q7545n8366B03533a02986b6772B43974a97049
19036G8404l448b05534h0516I1404K60174H7152J02135f5005D8507h0144n3447
19025a33591C47008H3910H260K18348b69160E7466g8479L5093B85236c17828J12087
$$ plain form
19014 -205741 -245153 13142 -304949 -256622 -26910 151779 -118816 35237 162369 -254434
19003 22684 213353 51604 -43334 -36101 -72584 -197301 -13018 44554 274966 35389 -125159
18991 -48234 -148506 -177259 214087 58266 -268177 -339856 198124 130715 36648 239349 265
18979 185093 4696 -162512 -487665 -124051 -69846 5543 133791 -38371 -184524 148505 -176695
18967 -32191 -238742 150949 -22974 -32139 -363404 119837 -4253 8058 -55934 72737 193078
18956 193078 259325 144445 122929 -215765 -98979 -3830 158552 112402 -35854 116205 31833
18944 6304 304846 -49777 -135593 253551 -178137 67442 106079 30422 -201130 -132311 -67715
18933 -67715 -311245 42770 -118444 -84302 -127107 128310 -96010 150297 70743 -4058 -13772
$$ packed form
19014b05741l9412A3142c04949M8327b6910A51779a18816C5237J27132b54434
19003B2684J90669E1604d3334P233l6483j24717a3018D4554K30412C5389a25159
18991d8234j00272k8753B14087E8266b68177p1679A98124o7409C6648K02701B65
18979A85093D696a62512l25153a24051N4205E543J28248c8371j46153A48505a76695
18967c2191k06551A50949b2974r165l31265A19837d253H058e5934G2737J20341
18956A93078O6247j14880k1516b15765i8979c830A58552m6150c5854A16205C1833
18944F304K98542d9777q5816B53551a78137F7442L8637C0422b01130O8819O4596
18933f7715k43530D2770a18444L4142m2805A28310i6010A50297G0743d058r714
$$ plain form
18922 -13772 12913 -291558 -66412 48497 -210855 7173 -149104 75362 173130 -90440 -41937
18910 111755 -164459 -59393 -62298 170311 238639 -104596 -68833 -124054 -97818 112120 154453
18899 154453 -522695 -10741 90308 -70415 -359709 164422 -187560 -43841 -54117 -131727 -259815
18888 -259815 -86982 -178500 -30478 -21136 -166780 -180110 138494 -113090 -212227 68360 -580
18876 -4061 281078 101578 -26199 -108745 -213019 69275 41695 272195 74903 -92788 -74536
18865 -74536 -282202 -189875 -60903 29098 -423415 170454 -423984 108929 -393824 -151286
18854 -81947 -90916 36915 79661 1193 447758 -242544 -248301 -562 159907 -45417 48818 -202691
18841 43335 -247412 121748 -24326 -219624 -154290 -124199 -35946 77340 -57275 -209346 -29751
$$ packed form
18922a3772A2913b91558f6412D8497b10855G173a49104G5362R7768i0440d1937
18910A11755a64459e9393k905A70311O8328a04596L5763n5221K6236A12120M2333
18899A54453e22695a0741I0308g0415k89294A64422a87560d3841j0276p7610j28088
18888b59815h6982r1518c0478R342j45644j3330A38494a13090r9137F8360e80
18876d061B81078A01578b6199q2546j04274F9275k7580K30500G4903i2788J8252
18865g4536k07666R2327f0903B9098d23415A70454d23984A08929c93824a51286
18854h1947q969C6915M2746A193M46565b42544n757e62A59907d5417D8818b02691
18841D3335b47412A21748b4326j95298O5334L0091c5946G7340e7275j52071b9751
$$ plain form
18829 -58715 83843 535849 211064 -191611 -23365 -216304 -91691 -135906 79163 319224 -256455
18817 -263010 148262 132113 52593 12419 25264 -210796 -74038 264434 271841 -88556 -319477
18806 -319477 15223 178502 -174653 -96872 34777 81709 -10247 -483737 -40626 -7803 -142227
18795 -142227 281975 -211007 143926 -335280 -60102 -149905 -267415 -119821 15582 16375 24109
18784 24109 -271418 334 -228570 -72212 136945 75993 -211871 -132068 77663 -26206 -12022
18772 -93298 -37437 -237499 -242230 3198 -76784 -33441 -20243 167788 -69952 -334018 -202115
18761 -202115 -177329 216582 -353091 244645 -160335 204913 9890 235933 -187894 27096
18750 -155280 -394567 277067 -365004 72836 -22886 102322 -20297 830 106592 -33851 -222021
$$ packed form
18829e8715H3843M52006B11064a91611b3365j92939i1691m4215G9163K40061b56455
18817b63010A48262j6149E2593A2419J2845b10796g4038B64434P407h8556k30921
18806c19477A5223J63279a74653P7781C4777M6932a0247m73490d0626g803j34424
18795a42227B81975b11007A43926c35280f0102q9803j17510a19821A5582P93P734
18784B4109b71418C34b28570g2212A36945o0952b11871P9803G7663b6206a2022
18772i3298c7437k00062m731C198g6784c3441J3198A67788f9952k64066J31903
18761b02115K4786B16582c53091B44645a60335B04913I890K26043a87894B7096
18750a55280k39287B77067c65004G2836b2886A02322b0297H30J05762c3851j88170
$$ plain form
18739 -222021 113054 -158234 -150119 85837 13497 70956 -32835 68543 83749 93628 -101345
18727 326319 -58150 -166506 -53848 -217764 176907 -344764 84217 96044 -9812 -359678 112754
18715 21092 -183763 -212488 105354 -217366 -161481 -88857 325851 488907 91666 -164842
18704 -65345 -149185 -108377 -447709 16983 -195772 -424422 -18982 138426 108232 -134723 177544
18692 262089 227326 -211813 -380873 -218142 -259343 -372386 -190887 136194 78562 -109549
18681 237705 87979 263417 -157330 -178762 -31713 30121 -206293 76255 -85781 -288291 89656
18669 90888 -124404 -107930 126930 46542 -177803 158850 -72435 128495 14704 102378 33558
18657 139080 -129122 293266 -71231 -83052 -29854 -207391 -177348 -289671 12368 90248 -43550
$$ packed form
18739b22021A13054a58234Q115H5837A3497N7459c2835F8543J5206R879a01345
18727C26319e8150j08356e3848j63916A76907c44764H4217J1827i812l49866A12754
18715B1092a83763k8725A05354b17366N5885P2624C25851J63056I1666a64842
18704f5345q3840M0808l39332A6983a95772k28650a8982A38426l0194a34723A77544
18692B62089l4763b11813j69060J62731m1201j13043J81499A36194n7632a09549
18681B37705H7979J75438a57330k1432c1713C0121b06293G6255h5781k02510H9656
18669I0888a24404J6474A26930D6542a77803A58850g2435A28495A4704Q7674C3558
18657A39080a29122B93266g1231j1821b9854j77537L0043j12323A2368P7880d3550
$$ plain form
18645 -111115 -127477 -39476 -108044 -16857 127715 267210 -128127 -76504 -107772 -176899 89295
18633 -180854 84874 239192 -685432 -242883 -112762 -65465 -200549 -175060 191920 -190461
18622 132439 128714 -35443 -3842 -167686 -137408 276945 -148048 -337786 -184022 -168611 -59536
18610 6479 -75992 39284 89942 -75056 -139544 -155722 -209511 -16738 -136095 -2424 83057 -119500
18597 -286466 -437218 -13411 -260701 -123787 -4877 -218198 166996 -39506 -86121 -107261 22122
18585 -100676 106438 -291855 210197 80863 -88784 -182819 -116116 -113763 -63912 -206627 97750
18573 -205712 -53547 -183342 -20413 -137008 -18076 -213931 -63897 -160332 44412 54222 -236197
18561 20188 151142 -365862 -66185 -15719 274864 190744 -142945 171399 -174149 -20128
$$ packed form
18645a11115j6362c9476o8568a6857A27715J39495a28127N1623l1268o9127H9295
18633a80854H4874J54318f85432b42883a12762M7297j35084K5489A91920a90461
18622A32439l725c5443c842j63844L0278B76945a48048j89738J53764J5411e9536
18610F479g5992C9284N0658g5056o4488j6178n3789a6738j19357b424H3057a19500
18597b86466j50752a3411k47290a23787d877k13321A66996c9506m6615k1140B2122
18585a00676A06438b91855B10197H0863h8784r4035O6703K353M9851j42715I7750
18573b05712e3547j29795b0413j16595a8076j95855f3897r6435D4412R810b36197
18561B0188J30954c65862f6185a5719B74864q4120a42945A71399a74149b0128
$$ plain form
18550 -435457 -79514 158585 -30987 286713 -268462 -192083 -284253 112845 -313910 61493
18539 -96639 -270730 29564 -236091 -134385 -76576 186987 -200843 346481 -110104 184156
18528 -105708 -30451 73071 39000 -277357 44850 -175031 -104244 126113 170209 -283435 -143913
18517 -143913 -75236 -146054 38294 31999 7676 44495 152222 130386 123946 492861 -80097 -185737
18505 -185737 -121446 35299 -122960 -89820 -167682 -48980 50513 153477 364938 -33476 68688
18493 -69875 99024 -153108 99564 -199885 -134551 -443512 -65173 -31354 184307 -210926 -62608
18481 -144077 -48452 -157206 -131515 65956 -144334 11279 -69738 -74528 -34458 -122471 7885
18469 -129884 182119 -310605 -51021 -130877 -12029 15556 -362015 -211569 -350214 -83366
$$ packed form
18550d35457g9514A58585c0987B86713b68462P6379r2170A12845c13910F1493
18539i6639j74091B9564b36091J01706N7809A86987b00843C46481a10104A84156
18528a05708c0451G3071l4071b77357D4850a75031P0787A26113M4096b83435J39522
18517a43913O8677p0818C8294o295G676L6819J07727k1836o440L68915h0097j05640
18505a85737O4291C5299a22960L3140p7862d8980E0513J02964K11461c3476F8688
18493f9875I9024a53108I9564a99885O5334l08961f5173c1354A84307b10926f2608
18481a44077d8452j08754K5691F5956a44334A1279f9738m790c4458q8013G885
18469a29884A82119c10605e1021p9856a2029A5556c62015J50446j38645h3366
$$ plain form
18458 -141923 -50414 -312016 -2890 132667 110767 -131311 -66186 -361078 -5536 105611 36628
18446 -28581 -43484 -232584 82954 -178454 -157602 -277946 40724 105842 182701 -109369 -113566
18435 -113566 -191271 -289606 7775 -197946 -61424 128777 -142409 -213840 -99417 -410210 -116084
18423 -198146 -57115 -416837 -199657 234122 183030 -182873 -123634 177181 -61182 -37671
18413 -37671 -9839 -122831 158350 -176019 -162843 61982 48684 370054 65859 -224056 254920
18401 -196290 -172236 207434 156976 136290 90341 -182890 -152489 -133530 87099 -204737 66206
18389 -391766 81285 114650 87838 18634 -111262 255307 170037 -104111 -32157 169736 177942
18378 177942 261894 -46616 51157 257377 -19501 147570 2805 132344 -61740 197112 -126492
$$ packed form
18458a41923e0414k61602b890A32667k1900a31311O5125k94892e536A05611C6628
18446b8581j4903j89100H2954a78454K0852j20344D0724O5118P6859a09369m197
18435a13566p7705r8335G775a97946f1424A28777a42409p1431i9417l10793a16084
18423a98146e7115l59722a99657B34122n1092a82873N9239A77181f1182K3511
18413c7671i839j12992A58350a76019J3176F1982j3298L21370F5859b24056B54920
18401a96290K4054B07434n0458k0686m5949a82890L0401J8959H7099b04737F6206
18389c91766H1285L3365k6812A8634a11262B55307q5270a04111c2157A69736Q206
18378A77942Q3952d6616E1157K06220a9501A47570B805J29539f1740A97112a26492
$$ plain form
18366 -273880 292380 189572 -102692 34000 22299 -173751 -301033 188661 -89892 -83087
18356 -83087 -99856 -7480 -112222 10122 -176360 -9916 -77119 -26215 184351 -61471 -294804
18345 -294804 341150 44424 43870 -220481 -47791 -43952 -136507 -311761 88630 90552 72723 -119673
18332 291766 -210710 -211470 -305923 147185 -108724 -23394 -88508 -65915 -44325 191660 -146070
18320 9700 161347 -85323 19601 -165187 138154 -285560 69729 -175826 -208108 114420 -24628
18308 57375 78230 -310547 -54981 106282 -187836 65016 -311363 -39621 -14054 123764 12864
18296 -99615 -11250 -252532 -173029 -106244 -236342 201604 201913 -97116 127107 149458 -39181
18284 -162895 163919 34665 321270 128565 53864 -352885 -51561 -104716 142544 45942
$$ packed form
18366b73880B92380j02808a02692C4000j1701a73751j27282A88661h9892O805
18356h3087j6769g480j04742A0122a76360i916o7203b6215A84351f1471k33333
18345b94804C41150D4424n54b20481d7791L839r2555j75254H8630J922j7829a19673
18332B91766b10710p60r4453A47185a08724b3394o5114K2593K1590A91660a46070
18320I700J51647h5323A9601a65187A38154b85560F9729a75826l2282A14420b4628
18308E7375K0855c10547e4981A06282a87836F5016c11363c9621a4054A23764A2864
18296i9615a1250k41282P9503O6785j30098B01604L09i7116A27107K2351c9181
18284a62895A63919C4665K86605A28565E3864c52885e1561n3155A42544D5942
$$ plain form
18273 -43763 -120837 -236931 -127949 -147503 120158 -104609 109194 -14413 -18020 -171886 -72596
18261 -131037 36089 -39798 329465 -45085 -4945 -6632 38529 226271 -256751 263682 -163612
18249 -255143 -99665 -236255 -164154 -91156 -39070 -115077 215380 -155710 -110237 82708 -81432
18237 -51709 419477 -119947 72768 90400 -83579 -446739 -260822 -27007 312188 -328885
18226 197719 -114132 109636 -298865 -128931 41861 -278535 -41484 185320 -159831 -206142
18216 -206142 -21003 85907 3583 -149860 119227 -67194 -128306 -274605 -134102 89173 -397693
18204 -223588 -390454 93565 242331 11315 -119270 -80592 -168029 84888 49316 -87789 -52632
18193 -52632 75957 -59426 8666 172165 -395200 -233599 380443 38055 -51852 205456 -254422
$$ packed form
18273d3763p7074j16094J08982j9554A20158a04609A09194a4413l607j53866g2596
18261a31037C6089c9798C29465d5085d945j687C8529J87742b56751B63682a63612
18249b55143i9665j36590P2101P2998c9070p6007B15380a55710M5473H2708h1432
18237e1709D19477a19947G2768J7632h3579l63160J85917b7007C12188c28885
18226A97719a14132A09636b98865a28931D1861b78535d1484A85320a59831m6311
18216b06142b1003H5907C583a49860A19227f7194o1112j46299a34102H9173c97693
18204b23588j66866I3565J48766A1315a19270L8678q7437H4888l5572h7789L5157
18193e2632G5957e9426H666J63499c95200J61601C80443C8055e1852B05456b54422
$$ plain form
18181 79493 260108 -195919 -234174 -217890 -95412 166612 29867 -126074 -330944 -143468
18170 -90685 9763 -139298 -23336 96900 -134153 -180351 -348535 -155054 -88680 80821 -3719
18158 -171887 96873 -147111 -230760 135693 61612 30549 57684 139412 310844 -125434 21501
18146 -8571 -567125 -184503 -68238 -21470 -186522 200620 -157588 -103001 152377 355736
18136 355736 92937 -64204 -34333 117946 66501 -165488 139006 198199 -209639 47884 -179796
18124 -121003 -299767 -365445 84875 334644 -53986 -304545 29395 87528 -431905 -11792 16199
18112 3072 168733 71299 185507 -64856 -161199 75957 3509 -127007 34532 -32362 325872
18100 -8759 96106 51648 166921 -175877 207943 -64616 -29060 21448 71826 35820 -254279
$$ packed form
18181G9493J80615a95919l8255J6284i5412A66612B9867a26074k04870a43468
18170i0685I763a39298b3336I6900a34153m6198j68184a55054O6374H0821c719
18158a71887I6873a47111q3649A35693F1612C0549K7135Q1728J71432a25434B1501
18146h571n58554a84503f8238b1470j65052B00620a57588N4587A52377K03359
18136C55736I2937f4204K9871A17946n1445a65488A39006N9193b09639D7884a79796
18124a21003j78764o5678H4875K49769e3986k50559B9395N8133d31905a1792A6199
18112C072J65661G1299J14208f4856r6343G5957C509a27007C4532c2362C25872
18100h759I6106m4458J15273a75877B07943f4616b9060B1448N0378C5820b54279
$$ plain form
18088 59965 182154 271650 -17490 82471 38675 26641 88521 -93702 -211787 -202545 77003
18076 26016 -271539 67989 -82402 -213767 90171 -295064 -130609 -92884 231655 -316357
18065 100628 24194 161281 -152087 -159187 -252149 -23786 -380374 -162899 -224999 48695 47359
18054 47359 -307805 -152692 52805 -384147 -43070 56036 -4120 265490 -31529 -135421 289271
18042 76965 -58419 -78937 -41117 60044 195110 457609 112333 -77937 -159008 -471546 116583
18030 -143073 116055 -37775 -134119 186433 201238 324656 -55642 -215460 -192929 -115695 199926
18018 -347462 19769 -20409 -75402 -258217 -79518 103240 -86624 265132 -21382 -17793 218968
18006 -40266 45470 -147293 -265439 421681 -103453 74572 173419 -74056 -126825 -70809 -301889
$$ packed form
18088E9965J22189Q9496a7490H2471C8675j2034O1880i3702j18085R242G7003
18076B6016b71539F7989h2402j31365I0171b95064a30609L7725B31655c16357
18065A00628B4194J37087a52087p100r2962b3786l56588a62899o2100D8695j336
18054D7359c07805a52692E2805c84147d3070E6036d120B65490c1529j03892B89271
18042G6965e8419k0518L7820F0044J35066K62499A12333g7937q1071l12538A16583
18030a43073A16055c7775r6344A86433J4805J23418e5642j59818K2531P7234A99926
18018c47462A9769b0409n4993j82815g9518A03240h6624B65132b1382L589B18968
18006d0266D5470a47293j18146D21681a03453G4572R8847g4056n2769N6016k31080
$$ plain form
17995 -301889 -158002 -302003 37120 -2571 -152971 -136285 49395 98597 -246181 208010 3846
17983 138851 -27802 -179432 137295 -185120 21646 -123666 271133 -193486 -173610 -26577
17972 -131895 102926 91558 18434 84339 201524 -13867 90990 -142189 -324380 -260117 91520
17960 247264 143614 108831 -58524 -214175 204485 113001 -561933 -295505 -189988 -248779
17950 -248779 -398723 10208 -62643 118097 -100992 -413 -148871 -69377 -13375 -264560 15505
17938 48147 -333540 -17930 166020 -141052 72760 -99373 -105848 -30739 188866 -379515 -407910
17927 -407910 -436140 362308 242938 -12330 -123827 35050 191482 227027 59678 117236 -205675
17915 168987 -125015 347215 -38261 -125701 -21835 -231641 -177700 -288249 31929 -64807 -182239
$$ packed form
17995c01889J43887j44001C7120b571j50400J6686D9395M9202b46181B08010C846
17983A38851b7802j51630A37295a85120B1646a23666B71133a93486J9876b6577
17972a31895A02926j1368A8434O5905J17185a3867I0990a42189j82191O4263I1520
17960B47264j03650l4783e8524j55651B04485r1484e61933K66428J05517n8791
17950b48779j49944A0208f2643A18097a00992d13j48458f9377a3375k51185A5505
17938D8147c33540a7930A66020a41052G2760i9373o475c0739A88866c79515k8395
17927d07910k8230C62308j19370a2330j11497C5050J56432L5545E9678N7558b05675
17915A68987a25015C47215c8261q7440b1835k09806N3941j10549C1929f4807j17432
$$ plain form
17904 -182239 -52910 -159849 25414 -220109 -219496 60661 -69165 -82342 119614 -53131 221951
17892 -77150 146173 -251179 294639 259000 77600 212438 -279282 279539 -270965 -137715
17882 -137715 52488 231324 -196584 289679 -322194 -1424 262763 -46682 49816 186131
17872 186131 -105466 115362 59419 -57377 212898 127405 -293897 -207468 130695 268186
17862 268186 -26301 83907 34347 -15801 106809 -199147 8334 -150371 187478 -177928 111554
17850 -122102 -94566 -219635 28115 119814 240079 93804 97165 -25643 97602 202504 174588
17839 174588 -129317 -159514 -154999 -13104 -313244 215691 -2909 -26393 -294041 299703 -122014
17827 -125040 -43529 -310182 -186435 422874 -138238 169320 -26006 239671 -183910 67072
$$ packed form
17904a82239e2910j06939B5414b20109O13F0661f9165j3177A19614e3131B21951
17892g7150A46173b51179B94639l5639G7600J34838b79282B79539b70965J33250
17882a37715E2488J78836a96584B89679c22194a424B62763d6682D9816J36315
17872A86131a05466A15362n5943e7377B12898q5493b93897Q6429A30695J37491
17862B68186b6301H3907C4347a5801A06809a99147H334a50371A87478a77928A11554
17850a22102K7536j25069B8115R1699J20265I3804L361b5643I7602J04902k7916
17839A74588a29317l0197M515a3104l00140B15691b909k3484k67648B99703a22014
17827a25040d3529k66653J23747D22874a38238A69320b6006B39671a83910F7072
$$ plain form
17816 -194986 47266 -210465 -9756 70747 -23358 256208 -72672 194142 -214120 -43543 -82369
17805 -82369 -54810 212617 -136960 259593 21204 -215218 76128 -258348 -137132 -409850
17795 -409850 -180164 -68089 -9343 -114753 23367 -223335 240924 240516 186494 244608 -1914
17783 84229 -3751 127282 93754 -57987 -74536 181323 133407 32855 -62535 -23086 222170
17771 -1454 216757 -209572 -258275 323738 393466 -87666 -39332 106181 -114283 173370 164966
17760 164966 -172188 77533 -87454 128715 -47460 3760 57776 157570 -412 139920 188481
17749 188481 75807 112476 182605 242586 126782 82289 103363 -43279 -50479 -161343 -29158
17737 119706 -198577 88510 -180855 -381259 -226560 -47980 -128732 -54652 418555 -101637
$$ packed form
17816a94986D7266b10465i756G0747b3358B56208g2672A94142b14120d3543l8826
17805h2369K7559B12617a36960B59593B1204b15218G6128b58348J21216k72718
17795d09850a80164f8089i343j05410B3367b23335B40924m08n4022N8114a914
17783H4229c751A27282l3528e7987j6549A81323m7916C2855f2535b3086B22170
17771a454B16757b09572m8703C23738O9728h7666c9332A06181a14283A73370q404
17760A64966a72188G7533h7454A28715d7460C760N4016R9794d12A39920M8561
17749A88481G5807L6669P0129N9981j15804m4493K1074d3279p200j10864b9158
17737A19706a98577H8510a80855k00404J54699d7980q0752e4652D18555a01637
$$ plain form
17726 -215756 -119625 -93016 10279 -3380 -161455 -48655 55898 6698 -3623 -36277 -144425 -79297
17714 -79297 -90788 -61447 108976 -36933 105793 156527 2672 -283866 -92924 138396 -119844
17702 -46351 280738 -285630 111128 -245905 125266 -96990 -103007 -210043 -128387 -21250 185444
17690 181878 -16302 5700 -238368 218418 -278825 -2499 -315109 223880 -18351 -195751 -132840
17679 -132840 -88274 78827 -113341 15287 216705 -216417 -235967 -139579 136839 -120212
17668 198568 -189156 177792 -182885 231742 264917 -81914 -173849 65644 69618 538785 -194983
17656 -39292 -220810 125549 -1992 270618 230585 214324 -136478 44075 69154 225084 85775
17644 -63020 -233246 301769 -105822 -259068 322449 19148 -79641 68245 46452 -1094 18220
$$ packed form
17726b15756R6131K6609A0279c380j58075d8655E5898F698c623l2654j08148O5128
17714g9297j1491K9341A08976c6933A05793N0734B672b83866i2924A38396a19844
17702d6351B80738b85630A11128b45905A25266i6990o017j07036Q1656b1250A85444
17690A81878a6302E700b38368B18418b78825b499l12610B23880a8351j77400O2911
17679a32840M4566G8827a13341A5287K01418b16417j9550R6388A36839a20212
17668A98568a89156A77792a82885B31742L3175h1914r1935F5644L974M69167a94983
17656c9292j81518A25549a992B70618m0033j6261a36478D4075K5079J55930H5775
17644f3020j70226C01769a05822j53246C22449A9148g9641F8245k1793a094A8220
$$ plain form
17632 -30183 -4392 319497 1159 -93974 -35964 57619 -152149 -2185 53740 -332488 141843
17620 140176 -28161 126373 18004 231708 43899 -9044 216292 -106787 118682 -238656
17609 -28386 -71500 -221956 -160172 -33121 6559 80341 170475 167370 -32305 97190 171654 141288
17597 141288 -106709 -198277 98986 -70386 -347397 -2960 -46498 93659 118939 -38625 -132370
17586 -132370 108187 -41526 -155481 234505 -13447 225671 59223 337100 -146209 -329149
17576 -329149 126173 369971 223913 183679 113215 130617 -136883 -148936 97635 38303 59192
17565 59192 -183134 -87770 265539 40761 -132679 80543 207177 31657 225800 104704
17554 -137705 67985 120247 29788 26218 19022 234190 79489 297301 49081 16756 -150076
$$ packed form
17632c0183d392C19497A159i3974c5964E7619a52149b185E3740c32488A41843
17620A40176b8161A26373A8004K13704D3899i044B16292a06787A18682b38656
17609b8386m3114j50456O1784c3121F559P3782R0134l105c2305I7190P4464l0366
17597A41288a06709r1568I8986g0386k77011b960m3538I3659K5280c8625r3745
17586a32370A08187d1526j13955B34505a3447B25671E9223K77877a46209j82940
17576c29149A26173K43798j46058m0234p0464J7402a36883j2053I7635C8303K0889
17565E9192a83134h7770B65539D0761a32679H0543J26634C1657J94143A04704
17554a37705F7985N2262B9788l570p196K15168G9489K17812D9081A6756a50076
$$ plain form
17542 110406 -10438 217440 167316 217441 242723 -145142 66578 -17664 151656 43729 224144
17531 224144 -74415 116639 194957 178609 -116191 58688 -284063 143191 -189943 127096
17520 150658 29451 270005 304267 161277 4158 198348 -13038 -316287 151640 185403 251487
17509 251487 227792 41688 389441 207570 -271114 45249 373253 -36215 -146891 192412
17498 228900 149179 122983 -48969 -220272 77431 321260 -31883 285182 -236718 131620
17487 194979 482783 184709 -188486 98962 167212 212900 228097 41894 173660 -80134 314710
17475 150446 5030 172284 174214 101406 293184 74594 193969 203710 111076 240923 118711
17463 -93448 -81993 241529 -30441 133799 -99136 251390 -126861 -167889 -177483 -133845 151554
$$ packed form
17542A10406a0438B17440n0124N0125K5282a45142F6578a7664A51656D3729J80415
17531B24144g4415A16639P8318j6348a16191E8688b84063A43191a89943A27096
17520A50658B9451K40554L4262j42990D158J94190a3038l03249A51640L3763O6084
17509B51487k3695D1688L47753j81871b71114D5249L28004c6215j10676A92412
17498B28900p9721k6196d8969j71303G7431K43829c1883B85182b36718A31620
17487A94979K87804A84709a88486I8962O8250M5688J5197D1894J31766h0134C14710
17475A50446E030J67254J930p2808J91778G4594J19375R741r2634J29847A18711
17463i3448J1455B41529c0441A33799i9136B51390a26861m1028r594M3638A51554
$$ plain form
17451 296852 33299 -49069 38073 189036 64277 393275 549727 485407 -89917 428283 210699
17439 64162 210907 247722 333907 307805 229501 181180 331834 320470 590949 142591 433161
17428 433161 -747 103806 199237 -42888 293244 72171 -197978 -25656 -55105 144182 252181
17417 252181 461701 99629 284915 215395 368922 316191 -141008 58036 -142751 157512
17406 245205 366768 26784 267105 210523 125847 364752 548404 263357 263862 221205 135022
17395 135022 188000 407298 279200 86309 -43963 365397 291380 174313 86587 280125
17385 280125 -94746 -77487 -82454 -80216 437295 261708 249414 -174974 412903 253511 -17094
17373 -147853 -6257 141606 27849 2399 364512 184409 72313 131305 68686 152612 285092
$$ packed form
17451B96852C3299d9069C8073J50963F4277L28998J56452o4320h9917D28283B10699
17439F4162J46745L6815Q6185k6102p8304m8321J50654j1364K70479A42591K90570
17428D33161g47A03806R5431d2888B93244G2171a97978b5656k9449A44182J07999
17417B52181K09520I9629J85286o9520J53527n2731a41008E8036a42751A57512
17406B45205J21563B6784K40321n6582q4676K38905J83652B63357N05m2657q6183
17395A35022N2978K19298j28098H6309d3963C65397p4017j17067H6587J93538
17385B80125i4746J7259m967K238D37295j75587j2294a74974D12903j59392a7094
17373a47853f257A41606B7849B399L62113j80103G2313N8992o2619Q3926J32480
$$ plain form
17362 285092 144543 -29629 -108792 -279162 31994 -19494 260416 220767 25308 -73039 44052
17350 573876 -35342 159380 287296 247424 490585 312054 305489 376435 -71919 -73014 327316
17338 238682 440753 144305 153072 191573 90178 220431 306790 14046 156605 300536 101229
17326 362219 -57795 236796 -10393 183517 -46252 344266 -85078 -172169 174570 313913
17316 313913 60635 -28103 49269 -254249 197067 83760 187614 131906 150045 360069 66326
17304 137876 244676 -186894 -52135 80276 153980 -317376 6769 161429 42613 289227 172228
17293 172228 -50743 -85534 9528 99120 150945 205782 145922 153367 181653 199501 22331 45345
17281 45345 56231 47084 221252 -106313 232905 -13527 -40597 -76040 46197 141003 -137935
$$ packed form
17362B85092j40549b9629p9163j70370C1994a9494B60416l9649B5308g3039D4052
17350E73876c5342A59380J27916l9872K43161j78531o565P0946g1919j095C27316
17338B38682K02071A44305Q767L8501I0178J30253Q6359A4046J42559J43931A01229
17326C62219e7795B36796a0393A83517d6252C44266h5078q7091A74570J39343
17316C13913F0635b8103D9269b54249A97067H3760J03854n5708J8139K10024F6326
17304A37876J06800a86894e2135H0276P3704c17376F769J54660D2613K46614j16999
17293A72228e0743l4791I528Q9592N1825N4837n9860P445K8286J7848B2331K3014
17281D5345J0886r147J74168a06313B32905a3527k7070l5443D6197R4806a37935
$$ plain form
17269 237134 282564 69971 190811 46501 -214610 -21213 338652 184315 204933 491304
17259 491304 96332 421467 166500 34883 22133 22073 262501 -120496 298446 427337 178284
17247 254253 172168 113182 81551 425031 -26231 357293 -117134 97173 392788 215997
17237 215997 175962 224184 271427 242726 26054 250566 167566 -77659 369333 11171 111488
17226 111488 326022 441463 237172 242491 178634 281547 43366 435070 125389 76521
17216 76521 337824 432599 235522 137885 337359 255127 328724 298859 350267 191627 -253266
17204 407235 87568 -38622 180281 324959 254280 402302 329174 78831 119694 28581 280723
17193 280723 120626 -130198 312530 190927 394227 296796 452366 129750 -77436 43448
$$ packed form
17269B37134M5430F9971J20840D6501b14610b1213C38652j54337K0618K86371
17259D91304I6332L25135A66500C4883j2750o0K40428a20496B98446J28891A78284
17247B54253q2085n8986l1631L43480b6231C57293a17134I7173K95615j76791
17237B15997m0035M8222M7243k8701B6054K24512q3000g7659C69333A1171J00317
17226A11488K14534J15441k04291N319o3857J02913D3366L91704A25389m8868
17216G6521K61303R4775j97077r7637J99474q2232P3597k9865N1408j58640b53266
17204D07235H7568c8622A80281J44678p0679J48022p3128G8831M0863B8581K52142
17193B80723A20626a30198C12530j21603K03300r7431J55570A29750g7436D3448
$$ plain form
17182 624128 -107590 444762 384011 197141 252780 122014 255157 230746 106611 267883
17172 267883 -34716 213235 294012 496162 313430 210897 159131 422234 469654 360210
17162 360210 44031 70479 487107 355186 200091 10466 125907 187507 203014 191312 147409
17151 147409 320986 327503 184932 364331 -76718 593647 513889 348092 310490 281148 219242
17140 219242 525716 377345 370598 353403 270246 557653 269964 177428 516740 476585 167420
17128 530173 433094 154931 264809 150353 151243 -146530 291609 425951 135102 43415
17117 274596 132868 165143 339154 367473 714755 281543 133918 82138 486715 470627
17107 470627 210825 289028 412402 155203 522511 254437 153776 460673 204164 134057
$$ packed form
17182F24128a07590D44762o0751j86870N5639A22014J33143k4411A06611J61272
17172B67883c4716B13235Q0777K02150j82732j02533n1766K63103M7420j09444
17162C60210D4031K6448M16628j31921j55095A0466J15441O1600J5507j1702m3903
17151A47409J73577O517j42571J79399g6718E93647p9758j65797l7602k9342o1906
17140B19242L06474j48371o747j7195q3157K87407B69964r2536L39312m0155A67420
17128E30173r7079A54931J09878j14456Q90a46530B91609J34342A35102D3415
17117B74596A32868L2275J74011K8319L47282B81543A33918n1780M04577j6088
17107D70627B10825P8203J23374A55203L67308B54437j00661L06897B04164p0107
$$ plain form
17097 134057 485031 342889 382434 498411 506529 121656 769430 399918 398989 598424 541031
17086 541031 520048 371239 394637 231808 282570 159279 286271 368877 543065 461553
17076 461553 307926 239496 441372 512488 568226 174522 488424 498827 546386 532547 572644
17065 572644 388073 595634 331853 553396 513497 275650 464003 268016 611256 263108
17054 384888 624033 124832 474561 400917 663500 500066 403324 272414 353098 590032
17044 590032 811209 437297 471785 494571 687931 450073 554634 314959 749246 446107
17034 446107 511101 159629 894430 556476 569089 597284 838815 697672 646030 730531
17024 730531 784301 637431 985990 417951 823181 438089 379813 374954 642320 572551
$$ packed form
17097A34057L50974j42142L9545J15977Q118A21656O47774l69512r29J99435n7393
17086E41031k0983j48809K3398j62829N0762j23291J26992Q2606J74188q1512
17076D61553j53627o8430K01876P1116N5738A74522L13902J0403M7559j3839M0097
17065E72644j84571K07561k63781K21543l9899k37847J88353j95987L43240B63108
17054C84888K39145A24832L49729p3644K62583j63434r6742j30910Q0684K36934
17044E90032K21177l73912L4488K2786J93360k37858J04561k39675M34287l03139
17034D46107O4994A59629P34801l37954J2613K8195K41531j41143n1642Q4501
17024G30531N3770j46870L48559D17951M05230l85092n8276m859K67366o9769
$$ plain form
17014 572551 500010 556317 862169 675475 655325 748036 857006 622747 578979 669330 548310
17003 548310 730840 370521 568750 709376 711920 746447 725996 576015 613603 875634
16993 875634 505626 701401 571159 936976 598154 798509 755220 1102177 816724 764625
16983 764625 515098 535523 372240 734330 978413 861871 1010270 913265 1004039 817696
16973 817696 687799 644838 942854 1163060 580491 601014 1015149 694184 942003 1258827
16963 1258827 867474 976291 697222 716874 827367 896440 962482 786922 974726 903197
16953 903197 978866 991368 993741 1193974 1042778 1163985 1025011 1092462 1039241 923982 1208405
16942 1208405 1090878 987390 868257 1123856 875530 1113704 1103881 1128711 1173431 1329839
$$ packed form
17014E72551p2541N6307L05852j86694k0150R2711J08970k34259m3768R0351j21020
17003E48310J82530l60319J98229J40626K544L4527k0451j49981L7588K62031
16993H75634l70008J95775j30242L65817l38822K00355m3289L46957k85453n2099
16983G64625k49527K0425j63283L62090K44083j16542J48399r7005R0774j86343
16973H17696j29897m2961K98016K20206E80491K0523M14135l20965K47819L16824
16963A258827l91353J08817k79069J9652J10493O9073O6042j75560J87804p1529
16953I03197P5669J2502K373K00233j51196J21207j38974O7451n3221j15259K84423
16942A208405j17527j03488j19133K55599k48326K38174r823K4830M4720J56408
$$ plain form
16932 1329839 1345231 803210 1266672 687368 1396720 1053375 1229050 956297 1419077 1057693
16922 1057693 1324258 1216598 1402657 1649371 1343413 1467241 1432954 1286147 1371350 1491797
16912 1491797 1589550 1163643 1434673 1609271 1206934 1286757 1626991 1410954 1579256 1850203
16902 1850203 1685511 1507851 1494793 1529512 1280541 1617770 1788969 1633709 1896434 1742172
16892 1742172 1837121 1638196 1978142 1769029 1873715 1503404 1926769 1813970 1552487 2061301
16882 2061301 2057881 2197756 2074086 2150287 2015693 2029490 2127739 2250839 2311381 2142898
16872 2142898 2040968 1967024 2228719 2243992 2160854 2453421 2472257 2601679 2360998 2176052
16862 2176052 2893484 2649208 2759666 2815555 2448199 2643481 2911013 3027122 2914868 2717039
$$ packed form
16932A329839J5392n42021M63462n79304P09352l43345J75675k72753M62780l61384
16922A057693K66565j07660J86059K46714l05958J23828l4287j46807Q5203J20447
16912A491797R7753m25907K71030J74598m02337P9823L40234k16037J68302K70947
16902A850203j64692j77660j3058L4719k48971L37229J71199j55260K62725j54262
16892A742172R4949j98925L39946k09113J04686l70311M23365j12799k61483N08814
16882B061301l420J39875j23670P6201j34594J3797R8249J23100O0542j68483
16872B142898j01930p3944K61695J5273q3138K92567J8836J29422k40681j84946
16862B176052P17432k44276J10458N5889l67356J95282K67532J16109j12254j97829
$$ plain form
16852 2717039 3214026 3169665 3021609 2751791 3004514 3481326 2944240 3518943 3414710 3160419
16842 3160419 3539016 3423306 3681401 3528465 3716217 3801194 3768852 3515411 3762605 3961274
16832 3961274 3946814 4124679 4080772 4310754 4101169 4289336 4503638 4382599 4644178 4496438
16822 4496438 4910689 5012317 4989835 5066636 5240713 5152060 5139955 5768682 5801506 5538984
16812 5538984 6126791 6046316 6333337 6092745 6182213 6585476 6508991 6748988 6793838 7171996
16802 7171996 7275190 7715642 7645244 7946931 7826376 8169430 8383048 8356139 8667089 8963044
16792 8963044 9459599 9862683 9701646 9844218 9963655 10650074 10698444 11085609 11633066 11846229
16782 11846229 12279569 12429449 12890792 13216175 13783175 13987376 14591308 14970163 15389878
$$ packed form
16852B717039M96987m4361j48056k69818K52723M76812n37086N74703j04233k54291
16842C160419L78597j15710K58095j52936J87752Q4977l2342k53441K47194J98669
16832C961274j4460J77865m3907K29982k09585J88167K14302j21039K61579j47740
16822D496438M14251J01628k2482P6801J74077q8653j2105O28727L2824k62522
16812E538984N87807q0475K87021k40592Q9468M03263p6485K39997M4850L78158
16802G171996J03194M40452p0398L01687j20555L43054K13618k6909L10950K95955
16792H963044M96555M03084j61037J42572J19437O86419M8370L87165N47457K13163
16782A1846229M33340J49880M61343L25383N67000K04201O03932L78855M19715
$$ plain form
16773 15389878 16087865 16753666 17067296 17785035 18207086 19051431 19747008 20630664 21338467
16764 21338467 22573408 22684540 23789791 24880117 26321402 27006877 28358762 28992007
16756 28992007 30646935 32249385 33337836 35260982 36829831 38849508 40428918 42608393
16748 42608393 44677807 47144749 49328001 52144745 54813700 58326211 61450934 65149266
16740 65149266 69410510 73177011 77381212 82294925 87710732 93133739 99076634 105466519
16732 105466519 111708208 119025016 126784741 134080442 142216708 150254641 158083578 166573776
16724 166573776 174244790 181426013 188236762 193761245 198173179 201192072 202968992 203316704
16716 203316704 202179211 199708766 196133449 190876215 185004857 177966857 170189937 162184700
$$ packed form
16773A5389878O97987O65801L13630P17739M22051Q44345O95577Q83656P07803
16764B1338467J234941J11132J105251J090326J441285O85475J351885O33245
16756B8992007J654928J602450J088451J923146J568849K019677J579410K179475
16748D2608393K069414K466942K183252K816744K668955L512511L124723L698332
16740F5149266M261244L766501M204201M913713N415807N423007N942895O389885
16732A05466519O241689P316808P759725P295701Q136266Q037933P828937Q490198
16724A66573776P671014P181223O810749N524483M411934L018893J776920L47712
16716B03316704j137493k470445l575317n257234n871358p038000p776920q005237
$$ plain form
16708 162184700 153823507 145587953 137496616 129400168 121572319 114548933 107112415 100691649
16700 100691649 94348147 88565670 83069887 78103703 73295973 69026611 64912217 60649170
16692 60649170 57518513 54490031 51067644 48293803 45744562 43109862 41241697 38975044
16684 38975044 37041559 35393264 33893353 32114307 30308340 29094733 27933883 26769345
16676 26769345 25406147 24547459 23342651 22406025 21431593 20828880 20067849 19306035 18404445
16667 18404445 17511450 17212496 16500403 15792709 15730259 14907464 14529173 14048417 13102457
16658 13102457 13098305 12608718 12276792 11847130 11629734 11150567 10531067 10804263 10151110 10061716
16648 10061716 9501084 9499855 9326111 9186422 8610775 8376360 8345867 8070961 7535737 7507282
$$ packed form
16708A62184700q361193q235554q091337q096448p827849p023386p436518o420766
16700A00691649o343502n782477n495783m966184m807730m269362m114394m263047
16692F0649170l130657l028482l422387k773841k549241k634700j868165k266653
16684C8975044j933485j648295j499911j779046j805967j213607j160850j164538
16676B6769345j363198q58688j204808r36626r74432o02713p61031p61814r01590
16667A8404445q92995k98954p12093p07694o2450q22795l78291m80756r45960
16658A3102457m152m89587l31926m29662k17396m79167o19500K73196o53153q9394
16648A0061716n60632j229j73744j39689n75647k34415l0493k74906n35224k8455
$$ plain form
16638 7507282 7478983 6964610 6825120 6989819 6789021 6427058 6587254 6147074 6298193 5775040
16628 5775040 5689307 5910050 5601625 5375180 5345075 5140085 4982443 5019515 5015966 4537548
16618 4537548 4842636 4578214 4739550 4136734 4632202 4346183 4135230 3753470 4226204
16609 4226204 3887378 3971433 3618253 3685882 3490897 3592253 3376545 3390269 3383835 3341259
16599 3341259 3389755 2988162 3106320 2998277 2778794 2734896 2954522 2936124 2902280 2748944
16589 2748944 2478864 2571108 2926488 2521118 2589057 2084505 2471967 2156935 2533547 2276782
16579 2276782 2554254 2561073 2042197 2201054 1991225 1803093 2239677 2125250 2097811 2041951
16569 2041951 1921134 2141961 2119561 2134559 1883001 2040073 2107467 2127254 1468133 1903526
$$ packed form
16638G507282k8299n14373j39490J64699k00798l61963J60196m40180J51119n23153
16628E775040q5733K20743l08425k26445l0105k04990j57642L7072l549m78418
16618D537548L05088k64422J61336o02816M95468k86019k10953l81760M72734
16609D226204l38826Q4055l53180O7629j94985J01356k15708J3724o434m2576
16599C341259M8496m01593J18158j08043k19483m3898K19626j8398l3844j53336
16589B748944k70080R2244L55380m05370O7939n04552L87462l15032L76612k56765
16579B276782K77472O819n18876J58857k09829j88132M36584j14427k7439n5860
16569B041951j20817K20827k2400J4998k51558J57072O7394J9787o59121M35393
$$ plain form
16559 1903526 1414047 1708303 1902618 1808162 1503566 1735862 1296464 1365760 1523171 1229183
16549 1229183 1321971 1470122 1283668 1426715 1427737 1382689 1072965 1332276 1549288 1401909
16539 1401909 1380078 1300335 1016040 1162354 1183154 1142175 1366969 1270807 1369935 1142721
16529 1142721 1201370 1579821 919480 1210065 939643 1171485 1220331 1029274 1069420 852729
16519 852729 824318 969795 1008352 839979 1095326 1063081 755237 795171 740104 1121240
16509 1121240 881344 962707 984956 737311 902319 1070338 788430 1004384 684283 1204386
16499 1204386 893341 724008 714887 885664 860579 759846 884557 818721 323711 742033
16489 742033 1183554 1028371 788489 674408 773022 1259926 914620 714364 533040 614136
$$ packed form
16559A903526m89479K94256J94315r4456l04596K32296m39398O9296J57411k93988
16549A229183R2788J48151j86454J43047J022m5048l09724K59311K17012j47379
16539A401909k1831p9743k84295J46314K0800m0979K24794r6162R9128k27214
16529A142721N8649L78451o60341K90585k70422K31842M8846j91057M0146k16691
16519H52729k8411J45477L8557j68373K55347l2245l07844L9934n5067L81136
16509A121240k39896Q1363K2249k47645J65008J68019k81908K15954l20101N20103
16499A204386l11045j69333r121J70777k5085j00733J24711o5836C23711M18322
16489G42033M41521j55183k39882j14081R8614M86904l45306k00256j81324Q1096
$$ plain form
16479 614136 583646 800684 858415 797343 717324 712512 388850 751079 632860 633667 468249
16468 468249 863781 399968 412582 364542 534164 543750 630115 655216 702771 57345 525676
16457 525676 782384 -122246 651109 779061 714586 890077 421719 811761 678165 613279
16447 613279 832153 495592 533713 420957 548052 469935 395563 496379 570684 357784
16437 357784 359219 496793 566007 474267 674969 223776 617906 346361 277468 509146
16427 509146 424874 386302 836377 501289 595301 473615 264003 362034 445221 619822
16417 619822 549798 441475 828357 55745 506353 415493 147838 339369 -132788 350686
16406 328396 625707 432303 319238 181314 191952 384304 64180 142664 332594 208360
$$ packed form
16479F14136l0490K17038N7731o1072q0019m812l23662L62229j18219Q07j65418
16468D68249L95532C99968J2614m8040J69622R586Q6365K5101M7555E7345M68331
16457E25676K56708a22246F51109J27952o4475J75491D21719L90042j33596o4886
16447F13279K18874l36561L8121j12756J27095p8117p4372J00816P4305k12900
16437C57784J435J37574O9214r1740K00702B23776L94130k71545o8893K31678
16427E09146q4272l8572M50075l35088R4012j21686k09612R8031Q3187J74601
16417F19822p0024j08323L86882E5745M50608r0860A47838J91531a32788C50686
16406C28396K97311j93404j13065j37924J0638J92352F4180P8484J89930j24234
$$ plain form
16396 208360 384934 284320 679874 77202 606693 363809 305721 403291 349495 333501
16386 333501 257577 336045 177752 254395 405122 526588 281734 265271 273126 372788 560681
16375 560681 444612 419111 568279 617269 149946 149555 358770 121102 245862 377658
16365 377658 -21235 312058 98286 252981 292082 375802 506354 186397 321568 231394
16355 231394 368432 284090 604907 653907 310242 -31600 -234210 377368 257611 280620
16345 280620 376203 459024 429365 336706 411077 210569 390060 564741 372768 316615 575867
16334 575867 146462 4022 289915 300361 182166 -130496 400372 134419 205307 242431
16324 242431 11373 344402 275265 -65684 26074 -21395 146137 -17746 79812 -155524 271086
$$ packed form
16396B08360J76574j00614L95554G7202N29491k42884n8088R7570n3796j5994
16386C33501p5924P8468j58293P6643J50727J21466k44854j6463P855R9662J87893
16375E60681j16069k5501J49168M8990A49946l91K09215A21102J24760J31796
16365C77658b1235C12058I8286J54695L9101Q3720J30552A86397J35171r0174
16355B31394J37038q4342L20817M9000C10242c1600k02610C77368j19757K3009
16345B80620R5583Q2821k9659r2659P4371k00508J79491J74681j91973n6153K59252
16334E75867A46462D022K85893J0446j18195a30496D00372A34419P0888L7124
16324B42431A1373L33029o9137f5684B6074b1395A46137a7746G9812a55524B71086
$$ plain form
16312 46241 94174 287780 65360 177289 -211278 198410 49821 147131 -101678 -29179 233785
16300 -94784 189138 -15571 -55559 8943 62148 170918 45698 162671 347307 245030 136544
16289 136544 88672 284194 171566 56428 103363 316365 265925 130825 212078 365798
16279 365798 212870 280952 -68678 206876 124200 239262 274469 283359 98373 61613 95237
16268 95237 74609 -174721 -74586 118652 -263110 148803 67204 218974 247302 -37219 -152918
16257 -152918 117379 249034 -251582 409893 175562 -255774 86551 141155 -16122 522473
16246 -86062 175445 12327 -102503 331807 134451 168920 346406 -25723 -165333 -254842
16236 -254842 255288 409932 -95364 -301984 286679 -158843 16978 -36945 100191 -108605
$$ packed form
16312D6241M7933J93606F5360J11929b11278A98410D9821R7310a01678b9179B33785
16300i4784A89138a5571l9988H943N3205J08770D5698J16973J84636j02277j08486
16289A36544m7872J95522j12628E6428M6935K13002n0440A30825Q1253J53720
16279C65798j52928O8082f8678B06876q2676J15062L5207Q890I8373l6760L3624
16268I5237k0628a74721g4586A18652b63110A48803F7204J51770K8328c7219j15699
16257a52918A17379J31655b51582D09893A75562b55774H6551N4604a6122E22473
16246h6062A75445A2327a02503C31807A34451L4469J77486b5723j39610q9509
16236b54842B55288J54644i5364k06620B86679a58843A6978c6945A00191a08605
$$ plain form
16225 74478 -218870 495821 -195597 263262 200785 20019 292753 -143168 137719 165152
16215 165152 296704 198851 52657 -59470 -311886 53956 -119589 106277 228826 95599
16204 49739 46564 -8213 -11004 -142684 -152734 25237 156834 336128 44803 426176 68657
16192 -16984 240474 29044 375358 190319 84603 222095 125007 -165691 21334 9557 56228
16181 56228 134017 41630 15200 -243210 -273705 -65715 67054 63108 461141 -46343 -96203
16170 -96203 39384 213791 -253973 -135690 172867 -293053 216600 -29041 118004 -274920
16159 124253 81682 -115220 177477 -71117 162553 217827 2448 208420 -28807 22305 -121972
16147 106343 51829 -240174 158985 -327386 -18298 77907 -75915 140608 79372 28345 -96910
$$ packed form
16225G4478b18870D95821a95597B63262o2477B0019K72734a43168A37719K7433
16215A65152J31552r7853E2657e9470k52416E3956a19589A06277J22549I5599
16204D9739l175h213k791j31680j0050B5237J31597J79294D4803L81373F8657
16192a6984B40474B9044L46314j85039H4603J37492r7088a65691B1334I557M6671
16181E6228P7789D1630A5200b43210l0495f5715F7054l946L98033d6343m9860
16170i6203C9384J74407b53973J18283A72867b93053B16600b9041A18004b74920
16159A24253m2571a15220A77477g1117A62553N5274B448K05972b8807B2305a21972
16147A06343E1829b40174A58985c27386a8298G7907g5915A40608o1236B8345i6910
$$ plain form
16135 -437964 31770 -228359 -155287 97408 -251720 -29420 -15228 7371 31877 72686 -192923
16123 162664 -296074 -29144 -122181 159126 -4174 172537 -143858 19951 -66170 179077 120619
16112 120619 -10462 420683 -181881 162672 -130492 107877 -192889 5018 195738 14259
16101 84728 87301 63650 6492 -307877 167617 -140903 -241542 -314545 -29953 -232961 72832
16089 -51069 -395973 8980 -365670 193992 138166 406091 -220596 6492 126200 -148118 11535
16077 9447 147362 -58750 114595 347783 113437 -186087 3479 93220 -155619 27736 -97848
16065 -43051 -28577 -97373 -89097 -78505 -3464 -141026 252907 247865 133316 -228821 -248717
16054 -248717 -255052 -144614 -187734 -32232 -197183 159741 248673 155047 101197 306276 -66449
$$ packed form
16135d37964C1770b28359P3072I7408b51720b9420J4192G371K4506M0809a92923
16123A62664b96074b9144r3037A59126d174A72537a43858A9951f6170A79077n8458
16112A20619a0462D20683a81881A62672a30492A07877a92889E018J90720A4259
16101H4728K573k3651F492c07877A67617a40903j00639p3003b9953k03008G2832
16089e1069l44904H980c65670A93992n5826K67925b20596F492J19708a48118A1535
16077I447J37915e8750A14595K33188A13437a86087C479Q9741a55619B7736i7848
16065d3051J4474o8796Q276J0592c464j37562B52907n042j14549b28821j9896
16054b48717o335J10438m3120c2232j64951A59741Q8932r3626n3850K05079f6449
$$ plain form
16042 -30002 -100514 381117 -458946 -1849 -111559 11191 92393 -137908 218517 74103 189365
16031 189365 69280 -189765 -57823 204721 48611 119585 37974 -176595 243039 268353 190791
16020 190791 -142015 134436 75958 -90971 -55600 -256832 -64905 46847 249574 -24280 182946
16008 -124584 297019 -3584 119484 -262053 137229 -125528 -18412 -312899 167304 -149835
15997 124093 -48366 -12722 -232539 12548 -42421 -181231 -11759 -189195 -21066 65104 33325
15986 33325 -70039 -2988 -33849 332987 139709 45958 -228815 274657 -170083 131621 1460
15974 -168953 -270261 -152092 -62442 -9332 -203308 -64625 144588 71381 16573 22467 -214048
15962 235126 235631 -254930 -120419 -4876 -323742 166629 223068 10807 321923 124208 -72556
$$ packed form
16042c0002p0512C81117d58946a849j09710A1191Q1202a37908B18517G4103J15262
16031A89365F9280a89765e7823B04721D8611P0974C7974a76595B43039K5314p7562
16020A90791a42015A34436n8478i0971L5371k01232f4905D6847K02727b4280A82946
16008a24584B97019c584A19484b62053A37229a25528a8412k94487A67304a49835
15997A24093d8366a2722k19817A2548d2421j38810a1759j77436b1066F5104l1779
15986C3325g0039b988l0861C32987A39709D5958b28815B74657a70083A31621A460
15974a68953j01308J18169f2442i332j93976f4625A44588G1381A6573N894b14048
15962B35126N05b54930a20419d876l18866A66629N6439A0807L11116A24208g2556
$$ plain form
15950 17475 136619 81928 -143647 -230109 -76116 89159 -335786 -211302 -360189 152695
15939 -277614 -11845 -45483 -14585 261182 -26113 -97370 -66082 2357 -347811 172658 172579 -273593
15926 116 -57267 37983 39657 23602 156890 182553 -233758 -460840 -264185 -185570 94951
15914 71430 207405 -44874 -119903 -52647 -133570 -217180 88871 -69714 -201813 60527 318881
15903 318881 110447 -16873 56666 -53015 -2834 -136841 -145482 11866 4622 -116364 -181949
15892 -181949 -15517 -240236 -178464 149262 -225983 -235323 -184198 -253022 193590 406983 -154443
15880 35878 -153898 -316464 -192425 -206458 -42000 -165421 -159322 -84470 23768 289992 -193006
15868 -57501 -80798 -5181 -155467 -164584 -4181 -168308 137255 -120895 -111282 -241743 14231
$$ packed form
15950A7475J19144n4691a43647q6462g6116H9159c35786J24484j48887A52695
15939b77614a1845l3638a4585B61182b6113p1257L1288B357c47811A72658p9b73593
15926A16e7267C7983J674j6055J33288K5663b33758k27082J96655P8615I4951
15914G1430J35975d4874p5029e2647q0923q3610H8871f9714j32099F0527K58354
15903C18881A10447a6873E6666e3015b834j34007q641A1866D622a16364o5585
15892a81949a5517k24719O1772A49262b25983r340N1125o8824A93590K13393a54443
15880C5878a53898j62566J24039j4033d2000j23421O099P4852B3768K66224a93006
15868e7501k3297e181j50286r117d181j64127A37255a20895R613j30461A4231
$$ plain form
15856 125057 -138297 -298102 -102662 -11321 -64500 -144121 52386 22138 56799 113917 -282601
15844 -149975 -28999 86500 109960 -311540 212690 140687 -25627 199972 -147075 -288809
15834 -288809 247576 -111402 143332 122714 -85994 88621 48661 186486 -50996 -264413
15824 -264413 -98379 -331770 10503 -257352 -244770 -215605 -198087 -291103 170355 -102518 34129
15812 152469 141082 -46585 100641 273462 -51546 104442 -1631 40105 -38965 -125316 74151
15800 -209985 162511 -204059 289278 29941 115779 51934 -31535 350749 186733 -216810
15789 39050 42994 -59332 213487 158638 -480356 49356 88605 -126347 -62330 -125500 59730
15777 -35914 -187798 232004 -238509 -114730 59567 276250 -37881 -84200 232351 -57898
$$ packed form
15856A25057a38297j59805a02662a1321n3179p9621E2386B2138L4661N7118b82601
15844a49975b8999H6500K3460c11540B12690p2003b5627A99972a47075j41734
15834b88809B47576a11402A43332k0618h5994H8621l9960J37825e0996k13417
15824b64413i8379k33391A0503b57352J2582K9165J7518r3016A70355a02518C4129
15812A52469j1387d6585A00641J72821e1546A04442a631D0105c8965q6351G4151
15800b09985A62511b04059B89278B9941Q5838E1934c1535C50749j64016b16810
15789C9050L944e9332B13487n4849d80356D9356L9249a26347f2330o3170E9730
15777c5914j51884B32004b38509a14730E9567K16683c7881m6319B32351e7898
$$ plain form
15766 2660 -268888 -159693 -23405 81420 110846 -32271 31750 -115496 71158 58648 -9627
15754 110238 137990 -192466 -272141 -7256 157999 152129 -315196 -192128 176253 100570 -192048
15742 224257 300528 -94414 33103 13301 75964 29957 -150043 81340 -264505 -25283 -325002
15731 -325002 -174803 240676 -64014 -237558 158789 -135770 -268563 206951 -83596 -152790
15721 -152790 63934 -278213 159015 -118469 -145246 274509 -444238 49973 -335900 139166
15710 -181280 1105 -154109 -103002 -115138 -177824 173683 -187696 36447 -164116 -38120 -99260
15699 -99260 85088 -285827 215200 66442 -85051 -68883 256483 75403 13639 141253 -186115
15687 -132946 42523 31778 -10060 236500 170446 -234873 -102736 -51543 -56771 -21246 202677
$$ packed form
15766B660b68888J09195b3405H1420K9426c2271C1750a15496G1158j2510i627
15754A10238K7752a92466p9675g256A57999n870c15196J23068A76253p5683a92048
15742B24257P6271i4414C3103A3301O2663B9957a50043H1340b64505b5283k99719
15731c25002J50199B40676f4014j73544A58789a35770j32793B06951h3596o9194
15721a52790F3934b78213A59015a18469k6777B74509d44238D9973c35900A39166
15710a81280A105a54109N1107j2136o2686A73683a87696C6447a64116c8120o1140
15699i9260H5088b85827B15200F6442h5051J6168B56483G5403A3639J27614a86115
15687a32946D2523j0745a0060B36500o6054b34873a02736N1193n228b1246B02677
$$ plain form
15675 160394 24355 163007 201778 211549 281392 -100285 -131608 13225 -82442 61696 -171237
15663 182253 73500 127799 -199402 -150557 -120619 -133886 -183340 69606 294844 176093 -120550
15651 43756 -32938 -132808 -430742 -423905 -164832 -290717 27060 22774 134347 -133568 320170
15639 -226475 -18677 224684 3739 56543 -81128 124569 -172970 58258 -276405 -78573 -76218
15628 -76218 -54382 104814 54827 -180461 -86247 -221748 152748 -3758 202663 -486322 -240478
15616 56295 40047 51719 -84363 -10112 -56492 445982 58048 42338 19361 -262355 -69610
15604 -105826 215368 48460 -176 39916 -126006 -150113 -94401 316389 -72067 99396 3990
15592 122114 45199 254086 -155852 -462375 -104883 -250336 -134214 83806 -236274 -108945
$$ packed form
15675A60394B4355J38652L8771R771O9843a00285l1323A3225h2442F1696a71237
15663A82253G3500N4299a99402M8845K9938j3267m9454F9606K25238j18751a20550
15651D3756c2938r9870k97934O837a64832j25885B7060m286J11573a33568C20170
15639b26475a8677B24684C739N2804h1128A24569a72970E8258b76405g8573K355
15628g6218K1836A04814m9987a80461h6247j35501A52748c758B02663d86322b40478
15616E6295j6248J1672h4363a0112m6380D45982E8048j5710A9361b62355f9610
15604a05826B15368D8460a76C9916a26006k4107N5712C16389g2067I9396C990
15592A22114D5199K08887a55852l06523a04883j45453J16122H3806b36274a08945
$$ plain form
15581 -269676 -73017 -12796 -149286 59039 131221 66673 -178055 -71547 154803 -19721 210970
15569 -138749 -275436 103307 -73935 60757 -186810 -143863 -52281 -95500 -46054 -92876 20962
15557 -355561 -30543 44338 -51840 -21999 38837 180929 -222549 -280113 -118909 -144443 78016
15545 -169012 64756 57538 74393 33195 -157088 -440655 -172358 90026 393368 101204 -106932
15533 -32829 -267746 118618 -284834 342494 88381 17046 -172807 -236085 -36508 300717
15522 -4436 64427 -30871 -137793 -409661 10685 -35477 30335 -4088 88573 -1219 43286 516247
15510 516247 -64677 -43211 3829 248676 238467 -13539 184172 139433 129883 259224 174198
15499 174198 -58930 -182216 153122 119406 16979 -321873 -208638 -317247 -210236 -187268
$$ packed form
15581b69676g3017a2796j36490E9039P2182o4548a78055g1547A54803a9721B10970
15569a38749j36687A03307g3935F0757a86810M2947e2281m3219d6054m6822B0962
15557c55561c0543D4338e1840b1999C8837J42092b22549n7564a18909k5534G8016
15545a69012F4756p218J6855C3195a57088k83567a72358I0026L03342A01204a06932
15533c2829k34917A18618b84834C42494H8381A7046a72807o3278c6508C00717
15522d436F4427c0871j06922k71868A0685c5477C0335d088H8573a219D3286M72961
15510E16247f4677K1466C829K44847j0209a3539A84172m4739r550J29341q5026
15499A74198e8930j23286A53122l3716A6979c21873J13235j08609J07011K2968
$$ plain form
15489 -187268 -157999 79903 204552 41601 -177954 -226298 -135391 -128150 81606 223348 -5076
15477 56102 -69444 -38289 -105768 -242071 113000 -36678 88979 17343 -276503 101595 -174751
15465 -56963 115241 -294018 -19866 -64965 139635 58799 -134923 -18158 -158750 -116346 -117851
15454 -117851 107205 -38737 179531 -227179 -42143 -162387 -88800 64966 -79395 -103060 140972
15442 228984 235764 77376 -135477 98513 -57798 -37795 -147092 19285 445737 -8372 -393533
15431 -393533 -21095 95129 88084 11035 -14586 211611 9775 -292936 -351995 -109925 -29679
15419 -247331 192897 125959 -18818 -198404 -129736 -279096 129410 -141018 24277 -41790
15408 127290 294745 116936 -195725 -213886 -144133 -8032 -50625 -64443 50693 -325351 -106447
$$ packed form
15489a87268K9269G9903J24649D1601a77954m8344R0907P241H1606J41742e076
15477E6102f9444L1155o7479j36303A13000c6678H8979A7343b76503A01595a74751
15465e6963A15241b94018a9866m5099A39635E8799a34923a8158j40592M2404j505
15454a17851A07205c8737A79531b27179d2143j20244P3587F4966g9395k3665A40972
15442B28984O780G7376a35477I8513e7798K0003j09297A9285M26452h372l85161
15431c93533b1095I5129p045A1035a4586B11611I775b92936n9059a09925b9679
15419b47331A92897o6938a8818j79586O8668j49360A29410a41018B4277d1790
15408A27290J67455A16936a95725j8161O9753h032m2593j3818E0693c25351a06447
$$ plain form
15396 4368 -140211 251523 -418079 -161563 465461 -248990 -82193 111657 62637 -175010
15385 53095 -77995 226352 124798 -484915 259320 -27133 -115458 382077 150462 113418
15375 113418 -111651 -255371 -235098 65899 93069 28586 -207027 498361 227005 -129248
15364 214308 -406319 -288990 4747 13687 -197697 65630 -105631 -26760 167322 -129357 -106009
15353 -106009 272655 195069 21538 127903 10307 -57645 159920 159288 141505 -135331 332824
15341 -30054 32763 -117400 4952 -4806 3075 -592317 -452172 -13217 132223 -127965 -348130
15330 -348130 257223 -75370 -6490 29814 186370 -166217 45986 -81554 -124871 449668 46916
15318 -339609 -100722 186982 -44672 -76123 -32068 100671 240077 43677 282208 23498
$$ packed form
15396D368a40211B51523d18079a61563D65461b48990h2193A11657m9020a75010
15385E3095g7995B26352j01554d84915B59320b7133q8325C82077A50462l7044
15375A13418a11651j43720K0273F5899K7170B8586b07027D98361B27005a29248
15364B14308d06319J17329D747Q940a97697F5630a05631b6760A67322a29357K3348
15353a06009B72655p7586B1538J06365A0307e7645A59920o32j7783a35331C32824
15341c0054C2763a17400D952d806C075e92317J40145a3217A32223a27965k20165
15330c48130B57223g5370f490B9814J56556a66217D5986h1554m3317D49668D6916
15318c39609a00722A86982d4672l1451c2068A00671J39406D3677K38531B3498
$$ plain form
15307 -40789 -245674 15298 -162061 83001 -190615 101258 -160179 224478 54424 -133783
15296 236839 -242530 139799 -204622 102609 -37237 173800 -6752 23733 275286 223252
15286 223252 149703 72922 70899 -86929 58278 41744 47619 495984 -73051 129384 425246
15275 425246 288548 -179784 240837 -76878 204408 -57784 -25671 233127 -32195 86314
15264 97324 -207297 -16204 219682 95655 -251705 -97086 -106612 17697 14692 24153 54001 46701
15252 46701 170360 -132338 389197 635414 1339485 1126710 1216391 1286924 1014416 171577
15241 392434 539463 100121 16198 266025 135617 -5561 134246 173124 451618 -72954
15230 190658 271303 -71907 251568 190381 235448 229139 145103 201374 22196 48149 195602
$$ packed form
15307d0789k04885A5298a62061H3001a90615A01258a60179B24478E4424a33783
15296B36839b42530A39799b04622A02609c7237A73800f752B3733K51553n2034
15286B23252p3549G2922k023h6929E8278j6534N875M48365g3051A29384K95862
15275D25246j36698a79784B40837g6878B04408e7784b5671B33127c2195H6314
15264I7324b07297a6204B19682I5655b51705i7086r526A7697l005R461K9848p300
15252D6701J23659a32338C89197K46217P04071k12775Q9681P0533k72508A71577
15241C92434J47029A00121A6198K49827j30408e561A34246L8878K78494g2954
15230A90658Q0645g1907B51568o1187M5067o309q4036N6271B2196K5953J47453
$$ plain form
15219 195602 -192678 106863 122938 33574 62437 29759 86559 -139398 -58310 322759 270194
15208 270194 -35689 36647 47301 242342 -56889 -220454 -98902 67587 -122107 34596 6420
15196 -2358 -138460 -295039 -286275 138491 151581 -67687 -88800 -34667 -56164 -172316 275478
15184 -40100 -32891 157152 -126918 361599 244984 133292 41598 -22482 212352 132158 -94798
15172 -62259 -75058 127349 -51942 -115397 251818 -16285 -208881 -111991 -114081 -31850 405935
15160 6268 465692 -67340 -200769 210412 206922 25925 -35377 4369 242288 -82692 96098
15148 192403 130573 32440 -77806 215317 357244 41877 179508 270649 -79168 181056 71524
15136 1395 74344 424879 371237 194521 -83336 101978 172506 402283 9722 321593 17769
$$ packed form
15219A95602a92678A06863J6075C3574K8863B9759N6800a39398e8310C22759n2565
15208B70194c5689C6647J0654J95041e6889j63565i8902F7587a22107C4596F420
15196b358j36102j56579Q764A38491J3090f7687k1113c4667k1497j16152B75478
15184d0100P209A57152a26918C61599j16615j11692D1598b2482B12352q0194i4798
15172f2259j2799A27349e1942o3455B51818a6285j92596R6890k090c1850D05935
15160F268M59424f7340j33429B10412l490B5925c5377D369K37919h2692I6098
15148A92403o1830C2440g7806B15317J41927D1877J37631R1141g9168A81056G1524
15136A395P2949L50535n3642j76716h3336A01978P0528K29777I722L11871A7769
$$ plain form
15124 -6358 482975 156532 -9370 133432 15150 267948 32232 284265 186252 59974 44725
15113 44725 241312 -12766 207092 302314 233546 237225 -192370 184155 43145 -18116 -40525
15102 -40525 422272 296384 278639 188215 551836 -177225 181440 99334 91441 -23636 -96580
15091 -96580 -163769 -82845 85716 312530 -243235 -37634 182162 135749 294389 195611 -23955
15079 203017 305650 -238778 344522 251088 103457 271133 3466 34780 145461 99445
15069 99445 472524 118790 54639 135175 289072 33791 347811 124609 -37419 -110593 -43606
15057 259837 646858 -145649 -68254 313836 121204 -54500 314533 257845 63172 189250
15047 189250 375390 145893 583291 151448 435432 -68438 239953 203502 -77625 142082
$$ packed form
15124f358D82975A56532i370A33432A5150K52798C2232K52033r8013E9974j5249
15113D4725J96587a2766B07092R5222o8768L679a92370A84155D3145a8116k2409
15102d0525D22272j25888j7745r0424L63621a77225A81440q2106p893b3636p2944
15091i6580o7189Q0924H5716K26814b43235c7634A82162m6413J58640r8778b3955
15079B03017J02633b38778C44522r3434A03457J67676C466L1314J10681m6016
15069I9445L73079A18790E4639Q0536J53897C3791L14020A24609c7419p3174d3606
15057B59837L87021a45649f8254C13836A21204e4500C14533n6688F3172J26078
15047A89250J86140A45893M37398A51448K83984f8438B39953l6451g7625A42082
$$ plain form
15036 -235426 110842 613056 340223 33209 -10946 281320 110590 491145 298033 159135
15026 159135 199783 31159 217527 124419 115972 -87585 436831 140654 64745 564295 -93670
15014 280826 263963 28963 -29239 -19160 297452 -126906 59765 127135 231914 260802 121873
15002 -119203 442858 202081 128859 164985 -79072 212932 -119440 -175108 211444 255368
14992 255368 433082 83422 660653 415277 204838 219172 -111431 51157 303853 234719
14982 234719 117385 -67940 196154 771365 144291 295843 62831 147373 230463 104664
14971 258205 308384 13966 296076 315688 148902 326121 422341 82420 570053 319865
14961 319865 42511 -57542 122511 481669 -59088 79397 271549 327187 106534 59222 324252
$$ packed form
15036b35426A10842N02214k72833C3209a0946B81320A10590L80555j93112j38898
15026A59135M0648C1159J86368r3108q447h7585D36831A40654F4745M99550i3670
15014B80826j6863B8963b9239J0079B97452a26906E9765O7370J04779K8888A21873
15002a19203D42858B02081p3222L6126g9072B12932a19440n5668B11444M3924
14992B55368J77714H3422N77231k45376B04838J4334a11431E1157K52696o9134
14982B34719j17334f7940A96154N75211A44291J51552F2831Q4542Q3090A04664
14971B58205N0179A3966K82110J9612A48902J77219R6220H2420M87633k50188
14961C19865D2511e7542A22511L59158e9088G9397J92152N5638A06534m7312K65030
$$ plain form
14950 324252 -4446 320342 517983 213341 362710 58044 296608 64715 129657 161205 352810
14939 352810 505979 -40307 307843 -6 560184 328105 -158979 95773 457935 301870 215867
14928 215867 38299 428744 47956 95596 491904 151071 387270 43473 241204 71145
14917 193856 289590 366714 338951 364670 286339 94962 499741 308896 360178 270236 310433
14906 310433 107364 -123641 411832 -28333 412746 400897 43018 239892 178514 412897
14896 412897 416352 232867 654809 573825 562393 107165 380341 313630 257195 474008 92590
14884 377075 297903 352286 364502 159466 280346 651538 496493 307321 262090 434538
14874 434538 303618 127619 472769 459119 353089 338650 295500 261650 96061 364326
$$ packed form
14950C24252d446C20342J97641B13341J49369E8044K38564F4715O4942L1548J91605
14939C52810J53169d0307C07843fE60184k32079a58979I5773L62162j56065q6003
14928B15867C8299L90445D7956M7640L96308A51071K36199D3473J97731G1145
14917A93856R5734P7124k7763K5719p8331I4962M04779j90845N1282q9942M0197
14906C10433A07364a23641D11832b8333D12746j1849D3018J96874o1378K34383
14896D12897L455j83485M21942q0984j1432A07165K73176o6711n6435K16813I2590
14884C77075p9172N4383J2216A59466J20880L71192j55045j89172m5231J72448
14874D34538j30920A27619L45150j3650j06030j4439m3150l3850I6061K68265
$$ plain form
14864 364326 707525 213648 374298 430312 -28929 31243 427289 656805 272231 444581
14854 444581 578327 288480 147743 539918 466093 447966 377635 329445 659936 404205
14844 404205 126287 265427 361982 673778 579660 540058 253005 588449 523893 190059
14833 528969 895094 497050 164981 419975 739963 574329 316771 419948 351717 626863
14823 626863 313355 533565 460676 425619 44761 383224 324528 433889 361120 417187 315419
14812 315419 312846 319993 513204 988547 502329 543095 401798 484668 534960 329564 339416
14801 339416 668513 675168 590365 517329 314616 581085 520052 560190 430406 360184 293032
14790 293032 493448 540974 729662 410841 620728 836745 482084 474374 840308 354098
$$ packed form
14864C64326L43199B13648J60650N6014b8929C1243L96046K29516B72231J72350
14854D44581J33746B88480j40737L92175p3825j8127p0331m8190L30491k55731
14844D04205A26287J39140R6555L11796r4118l9602B53005L35444o4556A90059
14833E28969L66125l98044A64981K54994L19988j65634k57558J03177o8231K75146
14823F26863C13355K20210p2889l5057D4761L38463n8696J09361p2769N6067j01768
14812C15419k573P147J93211M75343m86218M0766j41297Q2870N0292k05396R852
14801C39416L29097O655q4803p3036k02713K66469o1033M0138j29784p0222o7152
14790B93032K00416M7526J88688l18821K09887K16017l54661p710L65934C54098
$$ plain form
14779 440723 550090 690295 482999 587438 419181 581013 415916 591324 285680 730505
14769 730505 527813 653778 560235 693195 495535 293059 433040 170078 638913 764572
14759 764572 473079 572942 346667 470271 415373 402346 516394 676160 699585 831935
14749 831935 400552 711340 268177 505978 29964 654468 669846 712670 713639 427712 523301
14738 523301 407006 695131 320519 854237 726920 568747 700048 612739 531807 404240
14728 404240 884194 523314 738505 718035 956638 796365 853277 998977 522927 980070
14718 980070 798026 996089 840124 1129665 936866 1028964 711927 798036 967385 583596
14708 583596 1012539 602233 657772 963322 901046 1030124 961855 1030852 1116156 984106
$$ packed form
14779D40723J09367J40205k07296J04439j68257J61832j65097J75408B85680M44825
14769G30505k02692J25965r3543J32960j97660k02476J39981A70078M68835J25659
14759G64572k91493R9863k26275J23604n4898j3027J14048J59766K3425J32350
14749H31935D00552L10788B68177K37801B9964O24504J5378M2824R69k85927R5589
14738E23301j16295K88125C20519N33718j27317j58173J31301q7309q0932j27567
14728D04240M79954l60880K15191k0470K38603j60273N6912J45700m76050M57143
14718I80070j82044J98063j55965K89541j92799R2098l17037Q6109J69349l83789
14708E83596M28943m10306N5539L05550o2276J29078o8269O8997Q5304j32050
$$ plain form
14698 984106 957995 469822 932711 527379 962938 852889 1080027 907790 727790 1136580
14688 1136580 893132 1056878 646567 1114379 1172815 779966 1016203 1058189 995819 974016
14678 974016 806705 831834 747680 902657 1245744 1261765 1306339 875548 921430 592324
14668 592324 748118 853372 1121498 1194821 795516 1141293 827601 1049277 1138063 1482434
14658 1482434 990121 883111 754117 993630 826659 914439 1042978 928606 996220 955131
14648 955131 879773 1360921 1223076 1362134 1397133 1283109 1063523 1263861 1101978 1226138
14638 1226138 1089357 1584678 1385864 1310890 1390362 1409217 1330923 1116335 1333954 1463713
14628 1463713 1400458 1359653 1116067 1222551 1336968 1293070 1480344 1042323 1300141 1470419
$$ packed form
14698I84106k6111D69822M62889m05332M35559j10049K27138j72237j80000M08790
14688A136580k43448J63746m10311M67812N8436l92849K36237M1986o2370k1803
14678I74016j67311K5129q4154J54977L43087J6021M4574m30791M5882l29106
14668E92324J55794J05254K68126P3323l99305L45777l13692K21676Q8786L44371
14658A482434m92313j07010j28994K39513j66971Q7780J28539j14372O7614m1089
14648I55131p5358M81148j37845J39058L4999j14024k19586K00338j61883J24160
14638A226138j36781M95321j98814p4974P9472J8855p8294k14588K17619J29759
14628A463713o3255m0805k43586J06484J14417m3898J87274m38021K57818J70278
$$ plain form
14618 1470419 1400015 1286083 1280348 1715007 1616533 1209626 1412087 1717674 1610210 1492309
14608 1492309 1504852 1411989 1694954 1219979 1341321 1491057 1739987 1547428 1442187 1376778
14598 1376778 1532801 1588581 1529524 1495593 1707414 1474154 1710647 1887865 1757073 1678753
14588 1678753 1865015 1967365 1928237 1932290 2079898 1950786 2328728 1962313 2131291 1952231
14578 1952231 2159267 2075874 1644953 1786401 2010075 2215970 1896567 2039338 2345724 2330059
14568 2330059 2309958 2256781 2328706 2324396 2304529 2733182 2755508 2309529 2652598 2822817 2889552
14557 2889552 2881052 3096999 3141559 3309043 3326323 4274736 4413234 5409278 7921234 12134294
14547 12134294 20951795 35605565 41098634 24231190 12010614 6057744 3977928 2696064
$$ packed form
14618A470419p0404j13932n735M34659r8474m06907K02461L05587j07464j17901
14608A492309J2543r2863K82965m74975J21342J49736K48930j92559j05241o5409
14598A376778J56023N5780n9057l3931K11821k33260K36493J77218j30792p8320
14588A678753J86262J02350l9128M053J47608j29112L77942l66415J68978j79060
14578A952231K07036q3393m30921J41448K23674K05895l19403J42771L06386j5665
14568B330059k0101n3177P1925m310j9867M28653K2326m45979L43069J70219O6735
14557B889552q500K15947M4560J67484J7280R48413J38498R96044K511956M213060
14547A2134294Q817501J4653770N493069j6867444A2010614n952870k079816j281864
$$ plain form
14539 2696064 2649273 2164430 2154893 2054468 1592401 2076791 2208247 1982451 1727164 2181338
14529 2181338 2234305 2346139 2285276 2118023 2085509 2279419 2227492 2663509 2120175 2268385
14519 2268385 2244966 2681695 2699392 2666073 2786906 2669193 2605930 2475942 2574851 2626850
14509 2626850 2660493 3094661 3070592 3272447 2872068 2867891 3169309 2982486 3135027 3067688
14499 3067688 3015947 2986301 3192390 3216019 3381031 3481769 3145344 3284266 3390370 3395551
14489 3395551 3474121 3636295 3416525 3775381 3429743 3527523 3597959 4264949 3522160 3827689
14479 3827689 3666181 3885408 3890702 3882419 3835566 3932640 4099907 4166928 4204069 4216295 4188390
14468 4188390 4512689 4263713 4466588 4462307 4489889 4433220 4543842 4903014 4712412 4555028
$$ packed form
14539B696064m6791m84843r537j00425m62067M84390J31456k25796k55287M54174
14529B181338N2967J11834o0863j67253l2514J93910n1927M36017n43334J48210
14519B268385k3419M36729J7697l3319J20833j17713o3263j29988R8909N1999
14509B626850L3643M34168k4069K01855m00379m177L01418j86823J52541o7339
14499C067688n1741k9646K06089K3629J65012J00738l36425J38922J06104N181
14489C395551P8570J62174k19770L58856l45638R7780P0436O66990p42789L05529
14479C827689j61508K19227N294q283m6853R7074J67267O7021L7141J2226k7905
14468D188390L24299k48976K02875m281K7582n6669J10622L59172j90602j57384
$$ plain form
14458 4555028 4680629 4942324 4962489 4958242 5171100 5162805 5181680 5195242 5473502 5632180 5140693
14447 5140693 5714427 5425423 5634451 5690279 5456837 6033696 5803754 6008004 6109395 6067260
14437 6067260 6386290 6328363 6393276 6670231 6357779 6479920 6569416 6834372 6945481 7098862
14427 7098862 6996228 7190257 7377344 7110810 7663812 7351317 7916698 8133453 8075360 8153577
14417 8153577 8095765 8484677 8330931 8459856 8528791 8633718 8654880 8870428 8945864 8937958
14407 8937958 9468125 9518190 9931516 9995233 10237645 10237578 10153716 10299276 10652309 11077246 11232866
14396 11232866 11118909 11280773 11659030 11547504 11808515 12274176 12274484 12306280 12722198 12799935
14386 12799935 13219306 13183586 13901919 13732548 14042761 14381015 14672094 14842595 15103708
$$ packed form
14458D555028J25601K61695K0165m247K12858q295J8875J3562K78260J58678m91487
14447E140693N73734k89004K09028N5828k33442N76859k29942K04250J01391m2135
14437F067260L19030n7927O4913K76955l12452J22141Q9496K64956J11109J53381
14427G098862j02634J94029J87087k66534N53002l12495N65381K16755n8093P8217
14417H153577n7812L88912j53746J28925O8935J04927K1162K15548P5436p906
14407H937958N30167N0065M13326O3717K42412o7q3862J45560L53033M24937J55620
14396A1232866j13957J61864L78257j11526K61011M65661L08L1796M15918P7737
14386A2799935M19371l5720P18333j69371L10213L38254K91079J70501K61113
$$ plain form
14377 15103708 15388882 15978907 15876165 16416608 16523332 17127613 17162893 17698162 18128598
14368 18128598 18263912 18906315 19411984 19524809 20038602 20400979 20964568 21673995 21540941
14359 21540941 22094412 22945361 23253794 24209796 24288007 24884999 25174836 26104404 26497967
14350 26497967 27376925 27968719 28715482 29521688 30205429 30808351 31771167 32866879 33589726
14341 33589726 34241385 35103308 36313082 37204754 38605012 39435274 40487664 41804087 42956830
14332 42956830 44165323 45722366 46792618 48613650 49959013 51533102 52951888 55014429
14324 55014429 56888006 58306490 60547385 62873574 64743473 67182482 69399441 72487735
14316 72487735 74561290 77758228 80757742 83790647 87019392 90470524 94071255 97813522
$$ packed form
14377A5103708K85174N90025j02742N40443J06724O04281L5280N35269M30436
14368A8128598J35314O42403N05669J12825N13793L62377N63589P09427j33054
14359B1540941N53471Q50949L08433R56002P8211N96992K89837R29568L93563
14350B6497967Q78958N91794P46763Q06206O83741O02922R62816J095712P22847
14341C3589726O51659Q61923J209774Q91672J400258Q30262J052390J316423J152743
14332D2956830J208493J557043J070252J821032J345363J574089J418786K062541
14324E5014429J873577J418484K240895K326189J869899K439009K216959L088294
14316G2487735K073555L196938K999514L032905L228745L451132L600731L742267
$$ plain form
14308 97813522 102076294 106560144 111120956 115554808 120796318 126494413 132114025 138062991
14300 138062991 144636679 151217644 158695356 166281950 174083285 182557602 191724698 201068793
14292 201068793 211157606 221695632 232563899 244189808 256486926 269182832 282330853
14285 282330853 296054050 310315892 324731493 339484630 354279068 369163924 383748025
14278 383748025 398046474 411681078 424194604 435644974 445202768 450514943 452377679
14271 452377679 453017834 453342368 455299241 451666833 448907177 444295473 438287370 430795630
14263 430795630 421280304 409529784 396498334 382645879 368079726 353200664 337683011
14256 337683011 322396638 307437338 293361120 279581003 265843675 252587148 240434937
$$ packed form
14308I7813522M262772M483850M560812M433852N241510N698095N619612N948966
14300A38062991O573688O580965P477712P586594P801335Q474317R167096R344095
14292B01068793J0088813J0538026J0868267J1625909J2297118J2695906J3148021
14285B82330853J3723197J4261842J4415601J4753137J4794438J4884856J4584101
14278C83748025J4298449J3634604J2513526J1450370R557794N312175J862736
14271D52377679O40155L24534J956873l632408k759656m611704o008103p491740
14263D30795630r515326j1750520j3031450j3852455j4566153j4879062j5517653
14256C37683011j5286373j4959300j4076218j3780117j3737328j3256527j2152211
$$ plain form
14249 240434937 228275421 217292948 206488119 196418042 187090708 178606630 169918976
14242 169918976 161809583 154307185 147288616 140281584 134101086 128700195 122858295 117429337
14234 117429337 112879041 107605116 103521597 99979908 95597069 91751115 88192797 84992771
14226 84992771 81325418 78257889 75683034 72925332 70103432 68116127 65870624 63526390
14218 63526390 61570748 59478862 57185902 55333346 53796588 52617971 50786261 48935225
14210 48935225 47550381 46224952 44955656 44333018 43028513 41458630 40305328 39284408
14202 39284408 38256074 37322084 36544320 35452943 34525930 33236878 32443670 31705655 31324233
14193 31324233 30361583 29649132 28717908 27917001 27619117 26628535 26169466 25652425 24703365
$$ packed form
14249B40434937j2159516j0982473j0804829j0070077r327334q484078q687654
14242A69918976q109393p502398p018569p007032o180498n400891n841900n428958
14234A17429337m550296n273925m083519l541689m382839l845954l558318l200026
14226H4992771l667353l067529k574855k757702k821900j987305k245503k344234
14218F3526390j955642k091886k292960j852556j536758j178617j831710j851036
14210D8935225j384844j325429j269296o22638j304505j569883j153302j020920
14202C9284408j028334r33990p77764j091377r27013j289052p93208p38015l81422
14193C1324233r62650p12451r31224q00907k97884r90582m59069n17041r49060
$$ plain form
14184 24703365 24605655 23682652 23341111 22918352 22379485 22038885 21795494 20825907 20485740
14175 20485740 20210727 19731518 18903559 18895291 18461310 18150401 17791518 17471505 17414960 17009235
14165 17009235 16423891 16501179 16053636 15483833 15763344 15151517 15239539 14525867 14184634 14181794
14155 14181794 14212274 13741105 13236646 13324303 13195377 12576174 12727206 12280719 12269427 12442976
14145 12442976 12005268 11816192 11561284 11574022 11008297 11206128 11088898 10770191 10571767
14136 10571767 10328164 9987227 9932729 9775327 9945618 9637927 9749295 9317278 9194494
14127 9194494 8961271 8906216 8773417 8985562 8582875 8325351 8200133 8226153 7993863 8027672
14117 8027672 8045909 7863449 7572222 7630505 7430122 7431869 7298082 6949817 7014001 7165132
$$ packed form
14184B4703365r7710r23003l41541m22759n38867l40600k43391r69587l40167
14175B0485740k75013m79209q27959q268m33981l10909l58883l20013n6545m05725
14165A7009235n85344P7288m47543n69803K79511o11827Q8022p13672l41233k840
14155A4181794L0480m71169n04459Q7657j28926o19203J51032m46487j1292J73549
14145A2442976m37708j89076k54908J2738n65725J97831j17230l18707j98424
14136A0571767k43603l40937n4498j57402J70291l07691J11368m32017j22784
14127I194494k33223n5055j32799K12145m02687k57524j25218K6020k32290L3809
14117H027672J8237j82460k91227N8283k00383J747j33787l48265O4184J51131
$$ plain form
14107 7165132 7186390 6985622 6542569 6774324 6618544 6661288 6219689 6749344 6337123 6338349
14097 6338349 6156629 5740994 5788271 6034638 5915819 5935681 5794509 5477071 5875620 5215693
14087 5215693 5564185 5704021 5507565 5419799 5336804 5383312 5007893 5367170 5085084 5171129
14077 5171129 4814598 5020194 4810550 4928654 4725162 4760457 4579552 4784261 4682012 4865680
14067 4865680 4304494 4465479 4370741 4726852 4144326 4474944 4419287 4322383 4600200 3995578
14057 3995578 4252527 4091201 3930545 4264385 3802412 4177657 3472322 3875940 3850148 3771997
14047 3771997 3404172 3537349 3814122 3658804 3533617 3366737 3056663 3300790 3412921
14038 3412921 3424288 3515225 3454220 3128449 3072745 3828861 3367951 3378559 3195960 3059367
$$ packed form
14107G165132K1258k00768m43053K31755j55780M2744m41599N29655m12221J226
14097F338349j81720m15635M7277K46367j18819J9862j41172l17438L98549o59927
14087E215693L48492J39836j96456q7766q2995M6508l75419L59277k82086Q6045
14077E171129l56531K05596k09644J18104k03492L5295j80905K04709j02249J83668
14067D865680n61186J60985r4738L56111n82526L30618n5657r6904K77817o04622
14057C995578K56949j61326j60656L33840m61973L75245p05335M03618k5792p8151
14047C771997l67825J33177K76773j55318j25187j66880l10074K44127J12131
14038C412921J1367R0937o1005l25771n5704P56116m60910J0608j82599j36593
$$ plain form
14028 3059367 3151752 2870852 2830710 3105819 2869876 2807603 3154561 3109203 2864590 2737668
14018 2737668 2862921 2451586 3107379 2508875 2771509 2646765 2651420 2595604 2422425 2576036
14008 2576036 2947323 2587220 2393459 2388154 2456178 2235463 2113699 2410393 2109897 2453705
13998 2453705 2433524 2351254 2142903 2234084 2038101 2398555 2476716 2731505 2844417 3863066
13988 3863066 7260499 14823825 29973390 41670176 27826173 15388378 9924981 6874117
13980 6874117 5405991 4841050 4099587 3692421 3633877 3142780 3141781 3003136 3130927 2852897
13970 2852897 2860010 2802875 2889448 2508156 2483397 2483127 2351758 2322254 2169190 2200808 2429026
13959 2429026 2184131 1990289 2386177 2282237 2096631 2198781 2216857 2299749 2052780 1943814
$$ packed form
14028C059367R2385k80900m0142K75109k35943o2273L46958m5358k44613j26922
14018B737668J25253m11335O55793n98504K62634j24744M655n5816j73179J53611
14008B576036L71287l60103j93761n305O8024k20715j21764K96694l00496L43808
13998B453705k0181q2270k08351R1181j95983L60454P8161K54789J12912J018649
13988C863066L397433P563326J5149565J1696786j3844003j2437795n463397l050864
13980F874117j468126n64941p41463m07166n8544m91097r99j38645J27791k78030
13970B852897P113n7135Q6573l81292k4759k70j31369k9504j53064L1618K28218
13959B429026k44895j93842L95888j03940j85606J02150J8076Q2892k46969j08966
$$ plain form
13949 1943814 2426343 1965493 2336066 2232456 2226097 1913195 1882704 1755736 1907047 1802082
13939 1802082 1851545 1993205 2153316 1932596 1861901 1979724 1777055 1818719 1688721 1884113
13929 1884113 1664431 1767027 1609371 1952163 1487562 1663490 1582389 1747155 1895239 1602534
13919 1602534 1562397 1704628 1579353 1675813 1906843 1463387 1516077 1647840 1689439 1485972
13909 1485972 1703274 1790207 1467965 1539891 1487827 1789869 1473776 1716307 1330980 1082138
13899 1082138 1565550 1274521 1382846 1562886 1138530 1375482 1719284 1161673 1306719
13890 1306719 1078253 1251849 1179158 1376179 1407218 1486800 1270349 1061825 1470059 1377302
13880 1377302 1506920 1313257 1332538 1294911 1198522 1432654 1300780 1266344 1298055 1107590
$$ packed form
13949A943814M82529m60850L70573j03610o359l12902l0491j26968J51311j04965
13939A802082M9463J41660J60111k20720p0695J17823k02669M1664j29998J95392
13929A884113k19682J02596j57656L42792m64601J75928q1101J64766J48084k92705
13919A602534m0137J42231j25275R6460K31030m43456N2690J31763M1599k03467
13909A485972K17302Q6933l22242P1926n2064L02042l16093K42531l85327k48842
13899A082138M83412k91029J08325J80040m24356K36952L43802n57611J45046
13890A306719k28466J73596p2691J97021L1039P9582k16451k08524M08234r2757
13880A377302J29618j93663J9281l7627r6389K34132j31874l4436L1711j90465
$$ plain form
13870 1107590 1326770 1071498 1364701 971958 1202109 1184812 1065104 1306677 966686 937428
13860 937428 1349388 1515478 1180714 1113026 1073656 1154372 847962 1110095 1121753 1150225
13850 1150225 987947 1339188 1452706 785565 1188742 1191466 924324 1226187 1099472 748778
13840 748778 858607 1151051 1334046 1260095 1170826 999413 1270435 1175670 980889 888155
13830 888155 764731 1006673 783092 927597 1147469 1043928 1133448 1065611 789027 1075759
13820 1075759 1154017 1165087 918487 952872 649756 939703 1060147 1268761 1061917 1035344
13810 1035344 938316 1060321 929239 980290 1047266 774381 835647 785312 1021764 1216078
13800 1216078 897950 870584 816463 664313 963636 815937 733104 796537 763242 760241 660565
$$ packed form
13870A107590K19180k55272K93203l92743K30151j7297j19708K41573l39991k9258
13860I37428M11960J66090l34764o7688l9370Q0716l06410K62133J1658K8472
13850A150225j62278L51241J13518o67141M03177K724k67142L01863j26715l50694
13840G48778J09829K92444J82995p3951q9269j71413K71022r4765j94781r2734
13830H88155j23424K41942k23581J44505K19872j03541Q9520o7837k76584K86732
13820A075759P8258J1070k46600L4385l03116K89947J20444K08614k06844k6573
13810A035344r7028J22005j31082N1051O6976k72885O1266n0335K36452J94314
13800A216078l18128k7366n4121j52150K99323j47699q2833O3433l3295l001r9676
$$ plain form
13789 660565 496343 863876 579379 804119 841598 655352 815420 986617 731804 568658
13779 568658 1053952 861124 460718 1027895 1013713 845238 787556 623131 1055094 401966
13768 823027 675807 715766 926149 805064 754093 1040423 277712 524787 813106 883012
13758 883012 920051 836678 669478 853517 808511 802415 672587 926677 531435 522058 827545
13747 827545 620223 851067 627371 645848 872382 760696 752351 972738 807617 503877
13737 503877 475633 765186 1008313 785782 613576 680014 575420 608177 818604 628081
13727 628081 873590 570845 820932 928221 784935 470471 458863 664856 847131 430417
13717 430417 705613 609790 637065 432476 706326 704741 659641 469367 723587 415582
$$ packed form
13789F60565j64222L67533k84497K24740L7479j86246J60068J71197k54813j63146
13779E68658M85294j92828m00406N67177j4182j68475n7682j64425M31963D01966
13768H23027j47220L9959K10383j21085n0971K86330B77712K47075K88319O9906
13758H83012L7039q3373j67200J84039m5006o096j29828K54090l95242r377L05487
13747H27545k07322K30844k23696J8477K26534j11686q345K20387j65121l03740
13737E03877k8244K89553K43127k22531j72206O6438j04594L2757K10427j90523
13727F28081K45509l02745K50087J07289j43286l14464j1608K05993J82275m16714
13717D30417K75196r5823K7275k04589K73850j585m5100j90274K54220l08005
$$ plain form
13707 415582 672447 510803 309118 333844 372600 351394 316731 390761 604698 605689 324550
13696 324550 753835 437326 810644 476487 376559 525914 689156 492478 930927 482322
13686 482322 422494 559103 488228 491592 517332 651449 495416 327627 538424 508142 634310
13675 634310 658145 609553 576279 1020384 516143 411350 729204 396367 580077 445671
13665 445671 378443 896101 303548 412843 538774 357426 640459 408902 319195 557923
13655 557923 648638 426518 319450 466940 498164 560417 663271 112295 133097 760430
13645 760430 273284 396074 476478 213822 768932 556548 273078 422777 438124 742497
13635 742497 497025 603581 127883 194543 428140 615201 506185 321018 294943 292600
$$ packed form
13707D15582K56865j61644k01685K4726L8756k1206l4663P4030K13937R91k81139
13696C24550M29285l16509L73318l34157r9928J49355J63242j96678M38449m48605
13686D82322n9828J36609p0875L364K5740J34117j56033j67789K10797l0282J26168
13675F34310K3835m8592l3274M44105n04241j04793L17854l32837J83710j34406
13665D45671o7228N17658C03548J09295J25931j81348K83033k31557q9707K38728
13655E57923R0715k22120j07068J47490L1224O2253J02854A12295K0802O27333
13645G60430B73284J22790Q0404B13822N55110k12384B73078J49699J5347L04373
13635G42497k45472J06556A27883O6660K33597J87061j09016j85167k6075k343
$$ plain form
13625 292600 565356 268626 572806 625713 177562 446677 305506 735615 272463 338518
13615 338518 590960 331147 417667 504513 635209 661404 681608 214638 478030 582276
13605 582276 520719 786663 472442 533315 273325 331426 326322 662235 581687 469773 563075
13594 563075 347580 54637 146283 448897 291561 464855 296588 263636 41155 302360
13584 302360 290863 138915 378296 182594 385910 423427 36577 229736 -19435 635274
13573 345602 475702 254517 378976 139025 268785 264759 166637 176083 465230 391837 299590
13562 299590 277355 217437 418947 380207 209818 257123 415048 312693 -144503 189005
13551 274687 451875 563096 270809 321656 369438 341806 491502 559748 150602 -14817
$$ packed form
13625B92600K72756B68626L04180N2907A77562K69115j41171M30109B72463O6055
13615C38518K52442k59813Q6520Q6846J30696K6195K0204B14638K63392J04246
13605E82276o1557K65944l14221O0873k59990N8101n104L35913q0548j11914R3302
13594E63075k15495E4637R1646L02614j57336J73294j68267l2952D1155K61205
13584C02360j1497A38915K39381A82594K03316L7517C6577J93159a9435F35274
13573C45602J30100k21185J24459A39025J29760m026r8122R446K89147p3393r2247
13562B99590k2235n9918K01510l8740j70389M7305J57925j02355a44503A89005
13551B74687J77188J11221B70809N0847M7782k7632J49696O8246A50602a4817
$$ plain form
13540 313716 332820 135171 196676 397227 371218 356188 59087 -37026 368509 397664 384216
13529 384216 277139 370866 458168 418355 469859 299375 225375 371025 90661 540479 55810
13517 481874 347466 387455 620136 560359 -54522 244630 656356 18826 408516 207731
13507 207731 112501 588360 383481 411885 168660 454107 525358 104360 285083 348688
13497 348688 501250 86690 73672 220976 545876 480334 494011 233253 407972 261635
13487 261635 337347 -110933 643674 177116 113781 436038 278849 552136 240447 192502
13477 192502 248391 303797 366887 249550 151788 539440 96266 338397 104900 406558
13467 406558 420286 368337 468130 365120 411798 239445 387327 348790 194751 323440
$$ packed form
13540C13716J9104A35171O1505K00551k6009j5030E9087c7026C68509K9155j3448
13529C84216j07077R3727Q7302l9813N1504j70484p4000J45650I0661M49818E5810
13517D81874j34408L9989K32681n9777e4522B44630M11726A8826L89690k00785
13507B07731r5230M75859k04879K8404A68660K85447P1251A04360J80723O3605
13497C48688J52562H6690j3018J47304L24900o5542J3677B33253J74719j46337
13487B61635P5712a10933F43674A77116o3335L22257j57189K73287B40447m7945
13477A92502N5889N5406O3090j17337r7762L87652I6266K42131A04900L01658
13467D06558J3728n1949R9793j03010M6678j72353J47882l8537j54039J28689
$$ plain form
13457 323440 663316 -40241 357115 499878 164021 248135 -78514 317177 29858 113383
13447 113383 382256 302285 493787 439861 125475 283260 565076 28615 357052 72201
13436 509522 399850 232633 207971 300055 154461 118452 399600 377838 146819 100811
13426 100811 301581 439030 258130 -123856 272063 498748 12031 325909 90099 153159
13416 153159 114394 288647 370159 34587 182052 -142834 422629 69138 483507 106379
13405 136929 179529 49898 36588 380367 304456 225871 -109824 189866 303329 520374
13395 520374 147331 458757 73719 603312 -119241 229780 128511 290908 -91621 360354
13384 160695 462335 188618 78605 118343 216578 -46903 100899 131670 -19269 180869 57325
$$ packed form
13457C23440L39876d0241C57115J42763A64021Q4114g8514C17177B9858Q3525
13447A13383K68873p9971J91502n3926A25475J57785K81816B8615L28437G2201
13436E09522j09672j67217k4662R2084j45594l6009K81148k1762A46819m6008
13426A00811K00770J37449j80900a23856B72063K26685A2031L13878I0099O3060
13416A53159l8765J74253Q1512C4587J47465a42834D22629F9138M14369A06379
13405A36929M2600D9898j3310L43779p5911p8585a09824A89866J13463K17045
13395E20374A47331L11426G3719N29593a19241B29780j01269J62397i1621C60354
13384A60695L01640A88618G8605L9738R8235d6903A00899L0771a9269A80869E7325
$$ plain form
13372 84315 643224 117751 10645 474731 244292 482936 420911 465622 373899 576392
13362 576392 278332 464774 404684 26342 311031 324430 187105 -173532 316039 390732
13352 390732 437235 303439 128618 27600 11029 74535 247151 142693 167605 92483 50424
13341 50424 293341 -13760 442831 366319 297664 311201 314470 239673 15264 346662 35771
13329 730628 139929 266997 293370 140565 44254 315665 149674 -5277 115163 52969
13318 379645 196115 -11452 379613 177655 45459 252450 197581 32785 -103204 314803
13307 664017 -82314 -176396 121578 329019 372230 317948 -36728 -211283 -30956 155579 163499
13296 163499 385573 170697 94408 82414 11422 82231 50831 -233283 240007 281103 18330
$$ packed form
13372H4315N58909A17751A0645M64086k30439K38644o2025M4711r1723K02493
13362E76392B78332J86442o0090B6342K84689J3399j37325a73532C16039P4693
13352C90732M6503j33796A28618B7600A1029O3506J72616j04458K4912p5122m2059
13341E0424K42917a3760D42831p6512o8655J3537L269p4797A5264L31398C5771
13329G30628A39929J27068K6373A40565D4254K71411A49674e277A15163E2969
13318C79645j83530a1452C79613A77655D5459K06991n4869C2785a03204C14803
13307F64017h2314r4082A21578K07441M3211n4282c6728j74555c0956A55579P920
13296A63499K22074A70697p6289j1994A1422P0809l1400b33283B40007M1096A8330
$$ plain form
13284 13631 20128 248914 141699 301972 360795 99887 30280 444754 -58668 30621 306716
13273 306716 346898 425533 304028 258077 169815 199315 -54832 -29749 315110 85755 13394
13261 143561 -155986 -158199 287470 116649 361796 258547 -120942 -150054 9777 399162
13251 399162 157650 -48085 163905 283634 72096 -16525 231339 147214 161522 44134 33993
13240 33993 -116960 10799 329046 204664 -11113 -177571 104817 422532 -62207 321377
13229 123781 407234 110017 134395 229699 -171059 293817 -42656 188486 -154548 257184
13218 89847 75350 -35123 -129818 276665 240996 232710 190089 239584 88208 403170 -185595
13206 1359 -155305 -11278 83391 324773 39975 98323 -180054 90930 376584 148075 133184
$$ packed form
13284A3631O497K28786j07215J60273N8823I9887C0280M14474e8668C0621K76095
13273C06716M0182P8635j21505m5951q8262K9500e4832K5083C15110H5755A3394
13261A43561a55986k213B87470A16649K45147j03249a20942k9112I777L89385
13251C99162A57650d8085A63905J19729G2096a6525B31339q4125J4308D4134j0141
13240C3993a16960A0799L18247j24382a1113j66458A04817L17715f2207C21377
13229A23781K83453A10017K4378R5304a71059B93817d2656A88486a54548B57184
13218H9847j4497c5123r4695B76665l5669q286m2621M9495H8208L14962a85595
13206A359a55305a1278H3391K41382C9975N8348a80054I0930K85654A48075j4891
$$ plain form
13195 133184 315647 33202 -214792 39378 -40165 153889 364586 -477 81151 106880 14309
13183 91505 14162 -173062 -85548 226298 261359 59605 164486 -285543 -370646 256114 51462
13171 208512 269469 192480 391387 233625 -203605 352212 -10183 344499 -32894 55944
13160 197658 170889 -53576 95539 267482 157734 88513 -74721 379503 346201 397344 -180711
13148 -55438 39457 190909 130394 151028 497421 -88439 -32131 119104 -70898 -31795 72067
13136 142151 -47210 16217 245950 359749 -8479 -54612 10209 143601 179354 -66981 205965
13124 -208946 271103 108038 -16090 -42643 455318 8835 -26364 205350 -7475 97867 43409
13112 189418 134508 54552 22387 -80318 -108407 97463 333455 139950 23071 153736 66162
$$ packed form
13195A33184J82463C3202b14792C9378d0165A53889K10697d77H1151K5729A4309
13183I1505A4162a73062h5548B26298L5061E9605J04881b85543q5103B56114E1462
13171B08512O0957p6989J98907j57762b03605C52212a0183C44499c2894E5944
13160A97658k6769e3576I5539J71943j09748o9221g4721C79503l3302N1143a80711
13148e5438C9457J51452o0515K0634L46393h8439c2131A19104g0898c1795G2067
13136A42151d7210A6217K29733J13799h479m6133A0209J33392L5753f6981B05965
13124b08946B71103A08038a6090k6553D55318H835b6364B05350g475I7867D3409
13112A89418n4910E4552B2387h0318k8089I7463K35992A39950B3071J30665F6162
$$ plain form
13100 -23018 -41269 -133357 190107 43469 109001 157423 109118 -90655 -86446 -33116 215294
13088 61724 94080 -96342 -38244 217212 278044 -96592 -149301 57134 119547 33152 5633 -120236
13075 358473 2751 -398799 129270 68338 437218 395888 207953 42171 -10632 140010 97143
13064 97143 252250 163181 135360 186781 126465 283301 473801 101987 173541 56376 153705
13053 153705 344174 315862 147414 3414 -155908 170676 307098 103313 1806 81487 -25539
13041 104647 376688 221822 62487 -39324 36755 130130 144119 226057 365718 446767 72893
13029 -218860 205571 387806 -138026 -8762 429414 21250 242010 -29777 74399 46334 565181
13018 565181 21156 -81712 -94270 194476 196259 308080 260471 67151 86603 149395 174609
$$ packed form
13100b3018j8251r2088A90107D3469O5532M8422m8305i0655M209c3116B15294
13088F1724L2356i6342c8244B17212O0832i6592n2709E7134O2413C3152E633a20236
13075C58473B751c98799A29270o0932L68880m1330j87935D2171a0632A40010m2867
13064I7143J55107q9069k7821N1421o0316J56836J90500A01987P1554E6376R7329
13053A53705J90469k8312A47414C414a55908A70676J36422A03313A806P9681b5539
13041A04647K72041j54866F2487c9324C6755R3375J3989Q1938J39661Q1049G2893
13029b18860B05571J82235a38026h762D29414B1250K20760b9777G4399k8065N18847
13018E65181B1156h1712j2558A94476J783J11821m7609F7151J9452O2792K5214
$$ plain form
13007 174609 128566 348622 176300 19671 -29072 10832 30435 129432 -176357 15721 -9285
12995 289104 215438 21139 296783 -18737 -12509 118255 -46515 -231171 -93074 70963 42752
12984 42752 -4098 74180 -108727 27222 258788 201918 44783 92016 30010 -134929 -408551
12973 -408551 295604 57436 180971 83391 -62542 -101767 385514 362489 240678 335740 193388
12962 193388 67422 74561 391582 117838 107591 -44334 -11829 42580 -50729 352026 -77011
12950 89615 260963 -2518 224251 307495 203857 35157 -12728 201168 -104094 100776 108151
12939 108151 -118417 16705 -1658 224156 -109472 145771 300440 -277762 -107378 -161317
12929 -161317 282383 243587 182966 5904 -196732 496474 -222604 4191 319867 102892 195903
$$ packed form
13007A74609m6043K20056j72322A9671b9072A0832J9603R8997a76357A5721i285
12995B89104p3666B1139K75644a8737O228A18255d6515j84656i3074G0963k8211
12984D2752d098G4180a08727B7222K31566n6870D4783M7233C0010a34929k73622
12973d08551B95604E7436J23535H3391f2542l9225C85514k3025j21811R5062j42352
12962A93388F7422P139L17021A17838j0247d4334a1829D2580e0729C52026g7011
12950H9615J71348b518B24251Q3244j03638C5157a2728B01168a04094A00776P375
12939A08151a18417A6705a658B24156a09472A45771J54669b77762a07378n3939
12929a61317B82383l8796o0621E904a96732D96474b22604D191L15676A02892R3011
$$ plain form
12918 195903 -55771 -134835 -66092 -56204 172382 233221 17990 -23889 -317454 3126 202637
12907 202637 195900 31580 280376 164700 -9392 -112493 -43483 -3956 305654 222517 -90002
12895 116994 361292 75609 80974 16887 242417 283553 38831 133189 -70101 15066 -409238
12883 -46936 231911 65620 248701 63303 -101324 446237 201101 -154028 60596 -135217
12872 -14080 -151822 294655 338924 -95136 2253 -681318 270137 -95513 431589 -87327 122040
12860 -32819 230784 101170 499129 -46600 530184 105307 47171 -133388 262195 266038
12850 266038 -261737 182675 -148369 191659 253063 -85643 -388608 -37744 148801 36563
12839 -87326 -29300 193185 515372 -170377 -2438 -88592 116144 -344528 4352 209764 -114148
$$ packed form
12918A95903e5771p9064f6092R888A72382O0839A7990b3889k93565C126J99511
12907B02637o737C1580K48796j15676i392j03101d3483c956C05654q3137i0002
12895A16994K44298G5609N365A6887K25530M1136C8831R4358g0101A5066d09238
12883d6936B31911F5620J83081F3303a01324D46237B01101a54028F0596a35217
12872a4080j37742B94655M4269i5136B253f81318B70137i5513D31589h7327A22040
12860c2819B30784A01170L97959d6600E30184A05307D7171a33388B62195L843
12850B66038b61737A82675a48369A91659O1404h5643l02965c7744A48801C6563
12839h7326b9300A93185L22187a70377b438q6154A16144c44528D352K05412a14148
$$ plain form
12827 321206 196217 70514 -128129 257970 -4979 -152514 242204 -260934 -272523 202648
12816 45080 19096 -5571 7677 4094 -112570 -8412 158452 103094 -188113 209882 -29500 341666
12803 119378 221276 131681 96839 122256 -111258 -485963 -88427 351468 290388 -207035
12792 23696 -35498 165376 4169 267804 -160980 18837 194410 -387332 -97779 16292 -210842
12780 -88900 -76538 -149672 136530 182546 -23449 -75039 133853 -19858 -97855 26931 110656
12769 110656 -104696 -185058 -11937 459827 96344 -58473 -238812 219264 -157119 59015
12758 -79676 114925 107651 242904 -222918 71558 93807 337347 236207 31404 -76949 -213650
12747 -213650 179056 341904 -52053 -120127 -62294 31297 -218199 11474 64124 19197 -70556
$$ packed form
12827C21206j24989G0514a28129B57970d979j47535B42204b60934j1589B02648
12816D5080A9096e571G677l583a12570h412A58452n5358a88113B09882b9500C41666
12803A19378J01898q9595l4842K5417a11258l74705h8427C51468o1080b07035
12792B3696c5498A65376D169K63635a60980A8837J75573c87332i7779A6292b10842
12780h8900J2362p3134A36530M6016b3449n1590A33853a9858p7997B6931Q3725
12769A10656a04696q0362a1937D59827I6344e8473j80339B19264a57119E9015
12758g9676A14925p274J35253b22918G1558K2249K43540j01140C1404g6949j36701
12747b13650A79056J62848e2053o8074N7833C1297b18199A1474N2650A9197g0556
$$ plain form
12735 163090 337834 252334 334988 163966 -146054 -9876 288035 24221 217238 45301 31796
12724 31796 182309 488155 -106917 208657 261487 85388 300576 114606 -165 -62127 -194834
12713 -194834 -27736 33848 232897 192315 277262 210434 321427 186559 69150 120527 499491
12702 499491 371253 50088 106485 436713 25971 385195 31308 217947 -219150 -119058
12692 -119058 196583 98147 -24377 -402923 547144 -390758 -76928 86210 -269150 411972
12681 -106089 183887 296241 -30788 153792 303144 165961 26317 89125 162460 199266
12671 199266 109142 50420 97502 -45675 40078 -212293 -203619 168235 -24384 143891 -261035
12659 234486 182031 197865 -39365 27748 270141 212634 534958 344043 290578 -114142 133370
$$ packed form
12735A63090J74744q5500Q2654A63966a46054i876B88035B4221J93017D5301j3505
12724C1796J50513L05846a06917B08657N2830H5388K15188A14606a65o1962j32707
12713a94834b7736C3848J99049m0582Q4947o6828J10993j34868F9150N1377L78964
12702D99491j28238E0088N6397L30228B5971L59224C1308J86639b19150J00092
12692a19058A96583I8147b4377l78546E47144c90758g6928H6210b69150D11972
12681a06089A83887J12354c0788A53792J49352j37183B6317O2808P3335L6806
12671A99266r0124E0420M7082d5675D0078b12293Q674A68235b4384A43891b61035
12659B34486n2455J5834c9365B7748K42393n7507L22324j90915n3465a14142A33370
$$ plain form
12647 122023 537356 -121692 -100413 276958 215710 -161131 -80315 -104575 83664 -26000 56887
12635 -223554 173928 397761 -44671 220502 -20277 95995 521990 233795 -30064 290647
12624 61546 63543 21255 77687 328032 102549 -337078 99543 2479 189961 69584 -61566
12612 -44861 271529 85632 224870 337303 -14770 184548 -86867 387556 132575 -18789
12601 181580 74805 322466 -45788 234700 176049 406418 332611 88412 -231228 -111761
12590 12381 457211 -51755 -96477 298045 188475 -135108 -155806 -156615 -38439 58766 273025
12579 273025 -153387 467474 -138901 -304077 -129902 84354 -72174 256216 -70312 -51679
12569 -51679 20187 -21163 -206407 231965 -55359 -90689 -150068 302318 -208927 -56165 66950
$$ packed form
12647A22023M15333a21692K1279B76958o1248a61131h0315k4260H3664b6000E6887
12635b23554A73928K23833d4671B20502b0277I5995M25995B33795c0064B90647
12624F1546J997B1255N6432K50345A02549c37078I9543B479J87482F9584f1566
12612d4861B71529H5632J39238J12433a4770A84548h6867C87556A32575a8789
12601A81580G4805K47661d5788B34700n8651K30369p3807H8412b31228a11761
12590A2381M44830e1755m4722B98045j09570a35108k0698q09c8439E8766K14259
12579B73025a53387D67474a38901j65176a29902H4354g2174B56216g0312J8633
12569e1679B0187b1163j85244B31965e5359l5330n9379C02318b08927e6165F6950
$$ plain form
12557 22960 -66464 -298307 -3302 21953 61627 50445 -185045 -42597 -85635 -11529 126966
12545 -165710 100346 44319 78725 -100222 151527 95561 -23748 128512 1890 -17973 20442
12533 -163166 242923 -265928 99374 147036 330853 74345 267156 344765 -149098 272388
12522 140953 315035 -246130 -145805 204646 -316385 -124856 108805 -189016 -309201 88755
12511 67846 75491 163089 -345717 63229 153990 -65258 155724 -8308 -145197 -180007 -88900
12499 142286 453112 397602 -244321 203962 -185285 -168188 -88721 -237838 248406 -193703
12488 -406421 87692 -5898 108515 196561 -281486 76392 -35892 13399 -72304 239632 329948
12477 329948 -105357 134031 266358 211464 -12730 173847 308676 -73361 133793 121390
$$ packed form
12557B2960f6464k31843c302B1953L9674j1182a85045d2597m3038a1529A26966
12545a65710A00346D4319L4406a00222A51527n5966b3748A28512A890a7973B0442
12533a63166B42923b65928I9374M7662J83817G4345J92811P7609a49098B72388
12522A40953J74082b46130J00325B04646c16385a24856A08805a89016j20185H8755
12511F7846P645Q7598c45717F3229R0761f5258A55724h308j36889l4810h8900
12499A42286L10826n5510b44321B03962a85285J7097P9467j49117B48406a93703
12488d06421H7692e898A08515Q8046b81486G6392c5892A3399g2304B39632R0316
12477C29948a05357A34031J32327n4894a2730A73847J34829g3361A33793j2403
$$ plain form
12467 121390 47230 -224939 135326 -262470 -119772 -169071 -173207 101990 249642 -67262
12456 -119084 132023 32049 -178422 -30319 30996 -272580 -54943 35457 89396 -191325 -26620
12444 297263 6929 62072 -147057 144245 172372 205153 103266 -181210 -17422 71042 58220
12433 58220 98624 170920 -74511 -277872 -119072 -220612 206176 -154994 -152785 249639 63613
12421 317580 -359600 113175 274929 5499 557839 6700 326826 -187068 429910 -102796
12410 -20194 -268985 -74303 -53482 -265606 308780 -94096 -50623 -99931 107296 82902 -205933
12398 55786 -61855 -178663 -60939 -223009 -36012 -99764 -75452 78397 -116658 -124717 157369
12386 -50929 93339 -53641 -97196 65391 -11541 59937 369989 93565 -387951 -257021 134900
$$ packed form
12467A21390D7230b24939A35326b62470a19772m9299m136A01990J47652f7262
12456a19084A32023C2049a78422c0319C0996b72580e4943C5457N3939a91325b6620
12444B97263F929N5143a47057A44245K8127L2781j01887a81210a7422G1042j2822
12433E8220M0404P2296g4511k03361a19072j01540B06176a54994K209B49639F3613
12421C17580c59600A13175J61754E499N52340F700L20126a87068D29910a02796
12410b0194k48791g4303K0821k12124C08780i4096M3473m9308A07296k4394b05933
12398E5786f1855j16808f0939j62070c6012o3752K4312G8397a16658q059A57369
12386e0929I3339e3641m3555F5391a1541E9937L10052I3565c87951J30930A34900
$$ plain form
12374 80238 -109437 66691 160157 81653 -46638 139239 46849 112593 43603 61092 201359
12363 201359 211966 -155458 193111 -63779 -39500 219102 79259 -116852 20955 234075
12353 234075 -342027 240700 223901 7541 -57428 -257658 -219722 41854 102919 -8082 226354
12341 -32905 188699 -93536 -10219 52444 -111359 -69030 -15767 154074 -66973 -27146 -96308
12330 -96308 -116190 228475 7130 95082 334666 150127 -77349 207168 -300428 -239294 28546
12318 134639 174522 563199 79107 145989 -182581 237165 223917 -44680 58224 -315752 -4620
12306 137450 96309 -307904 132684 -91719 121966 17871 -154494 159992 85933 -27946
12295 119095 6420 -242844 163584 -78449 40735 107779 240857 10040 176150 100643 80024
$$ packed form
12374H0238a09437F6691R3466p8504d6638A39239D6849O5744D3603J7489J40267
12363B01359J0607a55458A93111f3779K4279B19102G9259a16852B0955K13120
12353B34075c42027B40700j6799G541e7428k00230L7936D1854O1065h082B26354
12341c2905A88699i3536a0219E2444a11359M2329a5767A54074f6973b7146o9162
12330i6308j9882B28475G130Q7952K39584A50127g7349B07168c00428O1134B8546
12318A34639L9883L88677G9107O6882a82581B37165j3248d4680E8224c15752d620
12306A37450m1141c07904A32684i1719A21966A7871a54494A59992p4059b7946
12295A19095F420b42844A63584g8449D0735O7044J33078A0040J66110p5507k0619
$$ plain form
12284 80024 29495 234916 -45672 -15289 128423 -220443 -4699 -90890 274550 -45848 17753
12272 -34834 92095 239744 -5339 -44859 285051 131365 147113 -264553 269253 -39819 125799
12260 45539 -98380 434271 91304 104890 323266 -64746 -147118 -95831 65448 236512 -10032
12248 235648 -97812 -109871 203983 67924 280756 -177920 91447 162977 -29413 -165509 -158662
12237 -158662 343519 142598 329802 -100163 163481 34019 -12847 193613 184113 242062
12227 242062 -59531 313116 240720 -65325 188529 80123 115843 -119980 244100 223736 -10422
12215 86048 311477 404333 67994 169642 300056 82470 32332 -217108 476716 320373
12205 320373 192719 179617 295477 298423 52363 -43741 250250 -80932 261908 -29339 272815
$$ packed form
12284H0024B9495K05421d5672a5289A28423b20443d699q6191B74550d5848A7753
12272c4834I2095J47649e339l9520B85051A31365J5748b64553B69253c9819A25799
12260D5539i8380D34271I1304J3586K18376f4746q2372N1287F5448J71064a0032
12248B35648i7812j2059B03983F7924K12832a77920I1447P1530b9413j36096O847
12237a58662C43519A42598J87204a00163A63481C4019a2847A93613r500N7949
12227B42062e9531C13116p2396f5325A88529H0123L5720a19980B44100k0364a0422
12215H6048K25429R2856F7994J01648J30414H2470C2332b17108D76716j56343
12205C20373j27654j3102J15860K946E2363d3741B50250h0932B61908b9339B72815
$$ plain form
12193 158732 -141747 49474 419130 -95326 -30929 178679 198454 128857 142178 415236 -5892
12181 314909 271872 185731 103908 324996 70706 123376 485702 -87044 238173 326015 -247732
12169 339235 172442 167518 230834 194692 184763 116636 201140 -121642 118090 -257249 263274
12157 152042 -263860 17723 145337 257964 83686 -12027 -171305 317899 -31208 94114
12146 -177076 -78072 89305 7452 -58184 138125 211858 45033 360668 2305 -25232 88633
12134 151774 293752 -25692 374211 -267032 172788 -123253 125084 144045 -46594 234454
12123 -6637 253699 183862 720 6365 194043 -370662 68197 -149033 158488 -64336 102975
12111 138876 88203 192795 -231016 -295266 -13119 -79242 -48632 62589 -125633 176074 -21311
$$ packed form
12193A58732a41747D9474L69656i5326c0929A78679J9775o9597J3321K73058e892
12181C14909m3037q6141q1823K21088G0706N2670L62326h7044B38173Q7842b47732
12169C39235j66793m924O3316l6142r929o8127Q4504a21642A18090b57249B63274
12157A52042b63860A7723J27614J12627H3686a2027j59278C17899c1208I4114
12146a77076g8072H9305G452e8184A38125P3733D5033L15635B305b5232H8633
12134A51774J41978b5692C74211b67032A72788a23253A25084J8961d6594B34454
12123f637B53699o9837G20N645J87678c70662F8197a49033A58488f4336A02975
12111A38876n0673J04592b31016o4250a3119o6123L0610F2589a25633A76074b1311
$$ plain form
12099 55438 -259918 91405 141722 178179 301574 -6057 -208242 26651 -248838 -103949 63488
12087 -82698 28574 -26489 -90611 -20108 -60689 -173968 -48956 -94090 100694 69953 -214941
12075 -151287 -30957 -16827 171865 320933 1172012 1625345 672042 373762 -31387 117934
12064 279159 267173 280664 -3346 117042 75323 76966 -193331 -248934 164791 -102623 135353
12052 -179455 197961 -232448 -11829 192887 -16361 -26288 60494 40575 -293015 144285 -56032
12040 7521 -105248 265925 -16318 13489 -66009 -181643 -157511 96829 27015 -142305 73225
12028 -3327 327697 -181705 939 74263 -211088 9057 53475 83987 229088 -165022 -237003
12017 -237003 149328 297388 41016 -95011 -207798 -83934 28598 14255 -259930 33228 147544
$$ packed form
12099E5438b59918I1405N0317L6457J23395f057k02185B6651b48838a03949F3488
12087h2698B8574b6489o4122b0108m0581j13279d8956m5134A00694l0741b14941
12075a51287c0957J4130A71865J49068Q51079M53333F72042k98280c1387A17934
12064B79159j1986J3491c346A17042m1719J643a93331n5603A64791a02623A35353
12052a79455A97961b32448a1829A92887a6361r927F0494j9919b93015A44285e6032
12040G521a05248B65925a6318A3489f6009j15634K4132I6829B7015a42305G3225
12028c327C27697a81705I39P3324b11088I057M4418L0512J45101a65022p1981
12017b37003A49328J48060D1016i5011j12787h3934B8598A4255b59930C3228J14316
$$ plain form
12006 147544 -37799 197980 -34106 -137849 141023 -152794 169917 149564 33755 304121
11996 304121 -89228 -127399 -157746 41870 359951 -72767 133605 -146563 27222 -124837 -305518
11985 -305518 -199541 37876 -291826 -34074 65715 49508 -86452 43754 69184 139160 170441
11974 170441 179889 -414146 188845 292789 -112920 -163317 -106241 171323 -258008 336282
11963 -41811 -189754 75779 -44158 -71008 199081 -254526 -13729 -242454 -205555 27050 201567
11952 201567 211167 -148048 100453 72879 -42161 217355 -16230 287157 -57959 -247053 -35743
11940 -13342 -117800 110584 -75132 14856 155958 140198 -121464 -43056 -71945 -9756 14589
11928 251395 65630 -30686 11897 -50100 -265542 6289 -16130 192057 -242246 -113823 -189863
$$ packed form
12006A47544c7799A97980c4106j03743A41023a52794A69917k0353C3755K70366
11996C04121h9228l8171l0347D1870L18081g2767A33605a46563B7222a24837j80681
11985c05518J05977C7876b91826c4074F5715j6207h6452D3754K5430O9976L1281
11974A70441R448d14146A88845J03944a12920n0397N7076A71323b58008C36282
11963d1811j47943G5779d4158k6850A99081b54526a3729k28725L6899B7050J74517
11952B01567R600a48048A00453k7574d2161B17355a6230B87157e7959j89094c5743
11940a3342j04458A10584g5132A4856J41102j5760a21464d3056k8889i756A4589
11928B51395F5630c0686A1897e0100k15442F289a6130A92057b42246a13823p6040
$$ plain form
11917 -189863 -188267 -98022 346315 231866 269907 218930 -26699 31888 137440 -15832 -127584
11906 -127584 303007 123318 89708 90290 483142 82959 -174056 14020 210568 125987 -140074
11894 199183 -18357 -103395 -5295 36614 174649 137044 48614 28989 -197988 -142779 284461
11882 123338 87733 102182 186726 66651 -357230 536847 58163 -107956 -566333 -283991
11872 -283991 -443879 107660 -119298 159781 -253952 -188580 -271049 414870 -132398 103278
11861 216082 -435609 66017 9408 -210251 -314687 -74132 -208827 115533 -323257 -434863
11851 -434863 398001 -112228 -342035 120270 197965 -88757 -315414 -46600 342155 107271
11840 -237796 -142251 -369422 -14941 240992 242365 -385156 -46407 87872 118589 78888 -56784
$$ packed form
11917a89863J596R0245C46315j14449L8041n0977b6699C1888J05552a5832j11752
11906a27584C03007A23318l3610N82L92852H2959a74056A4020J96548q4581a40074
11894A99183a8357q5038e295C6614J38035l7605D8614j9625a97988N5209B84461
11882A23338l5605J4449Q4544F6651c57230E36847E8163a07956m58377K82342
11872b83991j59888A07660a19298A59781b53952O5372q2469D14870a32398A03278
11861B16082d35609F6017I408b10251j04436g4132j34695A15533c23257j11606
11851d34863C98001a12228k29807A20270P7695h8757k26657d6600C42155A07271
11840b37796R5545k27171a4941B40992J373c85156d6407H7872L0717l9701e6784
$$ plain form
11828 42136 76857 -88040 167687 96335 -30185 -41544 -210118 -247676 -154318 -147567 113695
11816 17906 -288605 235121 219897 94310 52022 29505 -106426 198905 -397616 -1580 -144593
11805 -144593 57191 33093 -501423 -264160 185477 166462 -50261 -155230 -38290 -73675 50305
11793 222873 -133885 148199 35575 -7334 377597 -61146 135176 325486 -285406 -75561
11782 -27095 -79601 -5064 111336 164162 -130758 48362 273850 -169091 377053 40430 111954
11771 111954 10008 50439 -127726 191768 -321830 -19688 -64211 107944 16272 -118978
11760 26251 -102236 -188955 -153203 73754 -90939 326719 506512 26335 75044 -91373 -167276
11749 -167276 -33055 302225 -397872 152007 168328 -299322 80639 178747 -9672 257589 -46923
$$ packed form
11828D2136L4721h8040A67687p1352c0185j1359j68574l7558R3358O751A13695
11816A7906b88605B35121j5224I4310m2288k2517a06426A98905c97616a580j43013
11805a44593E7191k4098e01423K37263A85477j9015e0261j04969c8290l5385E0305
11793B22873a33885A48199C5575g334C77597f1146A35176J90310b85406g5561
11782b7095n2506e064A11336N2826a30758D8362K25488a69091C77053D0430P1524
11771A11954A0008M0431a27726A91768c21830a9688m4523A07944A6272a18978
11760B6251a02236q6719L5752G3754i0939C26719J79793B6335M8709i1373p5903
11749a67276c3055C02225c97872A52007J6321b99322H0639R8108i672B57589d6923
$$ plain form
11737 -125609 198533 -230809 -43035 -353999 -71194 185313 -14911 -81767 -183993 252830
11726 115592 -88124 346086 -163315 -125521 -109815 -92951 -6805 180156 186580 -159563 43763
11714 -204231 -78436 -157835 -215552 240044 -139835 118847 -118930 5603 73229 293076 321348
11703 321348 -198916 150252 129476 252598 -182219 223388 -156659 165202 -375401 -26503
11692 288683 401389 159425 422324 -227809 313477 99613 -225106 108153 16613 -224270
11681 -43091 124055 -39913 -74622 -114570 25774 -190629 57078 35438 29813 105328 405911
11670 405911 267828 280839 -287574 -4690 63815 -140758 66214 -154892 150977 -218257
11659 226912 -213014 590866 74429 145018 -179872 52377 52114 -233494 -212336 263258 393619
$$ packed form
11737a25609A98533b30809d3035l10964g1194A85313a4911o6856j02226B52830
11726A15592h8124C46086a63315L7794J5706J6864f805A80156O424a59563D3763
11714b04231g8436p9399n7717B40044a39835A18847a18930E603O7626K19847K8272
11703C21348a98916A50252k0776J23122a82219B23388a56659A65202c75401b6503
11692B88683J12706A59425K62899b27809C13477I9613b25106A08153A6613b24270
11681d3091A24055c9913l4709l9948B5774a90629E7078k1640n625P5515L00583
11670D05911j38083J3011b87574d690F3815a40758F6214a54892A50977b18257
11659B26912b13014E90866G4429P0589a79872E2377k63b33494K1158B63258J30361
$$ plain form
11648 393619 -317780 44467 -152032 298996 -132359 90413 73743 -176389 -197471 -278634
11638 -278634 -301999 72825 247514 293357 213977 -102826 -163483 95689 115622 232785 192658
11627 192658 31305 162324 362392 -78796 -124998 134907 16356 331433 -129270 -127326 -99473
11616 -99473 327530 -441851 -125197 43825 -137460 -68738 -43363 303382 -55723 120682
11605 -93249 90719 87218 146808 204005 40091 57354 -72535 -141895 -80857 276185 284231 -248781
11592 50368 -169990 153630 -4249 135200 88229 29738 -95038 374796 58538 353741 149353
11580 189383 -96379 67930 -100574 286902 -420295 174446 116451 80010 91747 -97677 163434
11568 71487 338938 126433 94139 306027 264170 -30846 292741 222394 -6579 -212049 356724
$$ packed form
11648C93619c17780D4467a52032B98996a32359I0413j6670a76389k1082q1163
11638b78634k3365G2825J74689M5843p9380a02826o0657I5689J9933J17163m0127
11627A92658C1305J31019K00068g8796m6202A34907A6356L15077a29270J944K7853
11616i9473C27530d41851a25197D3825a37460O8722K5375C03382e5723A20682
11605i3249I0719l501N9590N7197D0091J7263g2535o9360O1038B76185Q046b48781
11592E0368a69990A53630d249A35200m6971B9738i5038C74796E8538K95203A49353
11580A89383i6379F7930a00574B86902d20295A74446n7995l6441J1737i7677A63434
11568G1487K67451A26433l2294K11888m1857c0846B92741p0347f579k05470C56724
$$ plain form
11556 265720 74435 359293 204380 92875 279760 256063 214376 -284487 236844 -275134
11545 27626 16734 71739 185602 -55768 233873 283338 148613 106003 -360494 318963 320613
11534 320613 17339 127543 167893 -176200 -26340 166104 274418 -211206 -46472 26335
11523 19548 84388 232055 160925 68742 196179 280638 158175 -65812 88143 -5537 -1420
11511 189311 -37423 64996 -45995 -53227 4515 162262 -64462 235301 302175 124416 346800
11500 346800 -48834 630682 20554 -236875 108015 97427 -6884 -9016 -98205 -83398 504273
11488 47074 20241 154933 396608 81110 62887 10282 495005 18959 191153 17013 -320325
11476 202170 487066 80214 28328 379453 165804 305039 252383 178365 106372 118288 524666
$$ packed form
11556B65720G4435K84858j54913I2875J86885k3697m1687b84487B36844b75134
11545B7626j0892N5005J13863e5768B33873M9465j34725m2610c60494C18963J650
11534C20613A7339J10204M0350a76200b6340A66104J08314b11206d6472B6335
11523A9548O4840J47667p1130F8742J27437Q4459j22463f5812H8143e537a420
11511A89311c7423F4996d5995p232D515J57747f4462B35301O6874A24416K22384
11500C46800d8834F30682B0554b36875A08015j0588f884k132q9189J4807E04273
11488D7074B0241J34692K41675H1110j8223A0282M84723A8959J72194A7013c20325
11476B02170K84896H0214B8328L51125A65804J39235n2656p4018p1993J1916M06378
$$ plain form
11465 524666 -84419 223111 160915 24134 101561 63490 -47957 -107782 116146 254059 43911
11453 -135539 29990 58538 259725 -90076 23802 184094 178268 -241889 66451 348741 226772
11442 226772 3056 -96345 37324 -137483 -47518 85251 -55345 147437 349372 89487 51232
11431 51232 -45329 243037 22861 -7096 36830 182078 -220451 -327163 72206 8716 42700
11420 42700 -236028 194486 21459 199786 -31865 173174 143286 197527 -146397 301292
11409 179988 -124898 -142543 -157837 -15653 2868 39515 -196721 186987 -114108 123008 154106
11398 154106 335566 -99754 38133 4135 -99730 -274019 -261458 18615 -101072 38172 -206788
11386 100424 159089 320258 250342 -148595 459311 -66495 -195011 191682 -115903 27060
$$ packed form
11465E24666h4419B23111o2196B4134P7427l8071d7957n9825A16146J37913D3911
11453a35539B9990K8548K01187i0076B3802J60292n826b41889F6451K82290j21969
11442B26772C056i6345C7324a37483d7518H5251e5345A47437K01935H9487l8255
11431E1232d5329B43037B2861g096C6830J45248b20451j06712G2206H716L3984
11420D2700b36028A94486B1459J78327c1865A73174k9888N4241a46397C01292
11409A79988a24898j7645j5294a5653B868L6647a96721A86987a14108A23008L1098
11398A54106J81460i9754C8133D135i9730j74289J2561A8615a01072C8172b06788
11386A00424N8665J61169o9916a48595D59311f6495j28516A91682a15903B7060
$$ plain form
11375 207903 -120180 258559 9334 106688 369919 74925 32423 -112763 -296653 42311 -32714
11363 90835 -194240 36678 132533 -303357 -413193 140296 -154056 -246957 207080 278642
11353 278642 58127 105207 1533 108627 -43857 40131 106080 150888 -192264 155110 -102792
11341 3092 -201836 86994 33676 145800 117393 133353 149659 28633 -27897 115784 -50590
11329 -15147 97052 285324 -80438 135690 -10919 -206725 -104630 -86752 -180150 148405 4783
11317 99013 39344 27524 -245679 277514 -235705 -2785 -185136 92173 270388 78804 -230257
11305 276490 -82980 44216 111519 -10080 -190110 -39384 93161 -3561 -15117 -74758 91412
11293 -507790 63312 -242083 14048 147410 151974 -13628 -40560 134744 180975 -190581 18895
$$ packed form
11375B07903a20180B58559I334R7354K63231G4925C2423a12763j83890D2311c2714
11363I0835a94240C6678R5855c03357j09836A40296a54056r2901B07080P1562
11353B78642E8127M7080A533J07094d3857D0131O5949M4808a92264A55110a02792
11341C092b01836H6994C3676J12124k8407J5960J6306B8633b7897A15784e0590
11329a5147I7052J88272h0438A35690a0919j95806J02095J7878r3398A48405D783
11317I9013C9344j1820b45679B77514b35705b785j82351I2173J78215G8804b30257
11305B76490h2980D4216O7303a0080j80030c9384I3161c561j1556n9641I1412
11293e07790F3312b42083A4048J33362M564a3628k6932A34744M6231a90581A8895
$$ plain form
11281 -258049 -63433 -397303 -182852 -356327 193904 -292669 -158540 -12020 92927 57730
11271 57730 47757 -1686 206221 -90320 -356077 -122464 58170 -132640 135173 117718 13697
11259 109303 -36048 -138254 -77096 -108791 53159 -79275 -186428 96434 -109477 -108133 -286024
11248 -286024 -115220 -50358 -24109 -295102 -2876 -214970 -262075 22465 -251331 -24231 74747
11236 -32601 -127785 -25082 -155991 184867 6262 21800 377888 -100971 210440 -263251 -156266
11225 -156266 -184315 90377 -110509 124443 -289376 99830 50480 172823 97268 68663 41068
11214 41068 -64986 -6794 -150802 -39142 101908 94084 -1561 -205080 -105597 241676 -113010
11202 -160676 -234350 -39536 148193 163593 -216003 164378 -53583 -91791 -63067 -343002 -111020
$$ packed form
11281b58049f3433l33870a82852j73475A93904b92669J34129a2020I2927l5197
11271E7730r973a686B06221i0320k65757a22464E8170a32640A35173j7455A3697
11259A09303c6048j02206O1158l1695E3159g9275j07153I6434a09477J344j77891
11248b86024a15220e0358b4109k70993b876k12094m7105B2465b51331b4231G4747
11236c2601r5184b5082j30909A84867F262J5538L56088a00971B10440b63251J06985
11225a56266k8049I0377a10509A24443b89376I9830m9350J22343p5555k8605k7595
11214D1068f4986f794j44008c9142A01908p824a561k03519R9483B41676a13010
11202a60676p3674c9536A48193J5400b16003A64378e3583l8208K8724k79935a11020
$$ plain form
11190 -330234 -107237 -43224 -110379 -175912 -74811 -235783 236759 243063 -69624 -217171 -176731
11179 -176731 220133 52328 298703 46979 -138480 184879 89873 -89825 -217993 -305819
11169 -305819 -81571 -72564 6580 -121250 -117267 80009 16365 -50891 132097 -461831 277161
11157 -143640 72063 -104964 -56043 39642 48092 7218 -57469 109240 -181454 -339704 325400
11145 211628 66902 126842 210169 -26245 64114 -94304 -9001 107826 109944 75268 152083 149840
11133 149840 50096 -18043 181638 139982 291642 12428 -84151 -11208 -167244 171814 93419
11122 93419 261777 180689 150225 -22560 105256 26568 -138950 54080 299605 97381 36893
11110 -63698 141067 -29625 -187606 13076 138187 29583 144416 104044 240993 25971 232988
$$ packed form
11190c30234a07237d3224o7155o5533g4811j60972B36759O304f9624j47547M0440
11179a76731B20133E2328K46375D6979a38480A84879H9873h9825j28168q7826
11169c05819h1571R007F580a21250L983H0009A6365e0891A32097d61831B77161
11157a43640G2063a04964M8921C9642Q450G218e7469A09240a81454j58250C25400
11145B11628F6902N9940Q3327b6245F4114i4304i001A07826K118l4676P6815k243
11133A49840E0096a8043A81638m1656J51660A2428h4151a1208j56036A71814p8395
11122I3419J68358q1088l0464b2560A05256B6568a38950E4080K45525I7381C6893
11110f3698A41067b9625j57981A3076J25111B9583J14833m0372J36949B5971K07017
$$ plain form
11099 232988 246624 37298 -158320 -89795 153697 -50092 108230 339900 218430 95386
11088 370570 539651 159252 406631 131923 210083 -99153 311959 349710 128907 310513
11078 310513 145285 329607 189554 311132 288109 599657 291238 538791 458103 431478
11068 431478 452249 59447 431380 243273 337972 304189 407089 304308 403912 201010
11057 502235 488123 442736 1010444 669718 528222 642513 832063 495246 913990 671619
11047 671619 787738 1002171 590813 777768 836549 666361 662325 803519 463397 621625
11037 621625 384814 674017 558205 884776 603772 709217 713577 543447 631235 813460
11027 813460 825306 816427 855182 805320 481231 483330 815197 541807 796044 979897 474704
$$ packed form
11099B32988J3636C7298a58320O8525A53697e0092A08230K31670j21470I5386
11088C70570J69081A59252K47379A31923P8160i9153C11959L7751A28907J81606
11078C10513A45285J84322j40053J21578k3023L11548B91238K47553q0688k6625
11068D31478K0771E9447L71933j88107R4699l3783J02900j02781R9604B01010
11057E02235j4112m5387N67708l40726j41496J14291J89550l36817M18744k42371
11047F71619J16119K14433m11358J86955N8781j70188m036J41194l40122J58228
11037F21625k36811K89203j15812L26571k81004J05445M360j70130Q7788J82225
11027H13460J1846q879L8755m9862l24089K099L31867k73390K54237J83853D74704
$$ plain form
11015 650428 853122 646682 907524 484970 715686 799035 646250 640638 379462 454324
11005 454324 685233 520433 494199 308954 630355 514804 440843 823775 530482 690353
10995 690353 597877 909091 630834 686124 895948 873043 617030 664380 920677 1177886
10985 1177886 1173215 1068816 875407 1219370 1292890 1505300 1427039 1347590 1863865 1781341
10975 1781341 2186509 2597329 2696745 2680882 2804876 2973070 3187716 2776803 2641671 2315212
10965 2315212 1886270 2159527 1935635 1862777 1730209 2224811 1874154 2340747 2207058 2096785
10955 2096785 1672638 1629313 1422626 1264211 1091517 1002867 966042 762783 499345 343995
10945 343995 227454 416337 135353 118957 441819 407143 35572 206493 166212 235365
$$ packed form
11015F50428K02694k06440K60842m22554K30716Q3349j52785n612k61176P4862
11005D54324K30909j64800k6234j85245L21401j15551p3961L82932k93293J59871
10995F90353r2476L11214k78257N5290K09824k2905k56013M7350K56297K57209
10985A177886m671j04399j93409L43963P3520K12410p8261p9449N16275q2524
10975A781341M05168M10820R9416j5863J23994J68194K14646m10913j35132l26459
10965B315212m28942K73257k23892p2858j32568M94602l50657M66593j33689j10273
10955B096785m24147m3325k06687j58415j72694q8650l6825k03259k63438j55350
10945C43995j16541J88883A35353j6396L22862l4676C5572J70921m0281O9153
$$ plain form
10935 235365 153064 263281 31394 -116649 26260 -140585 -103126 -111775 -27526 99883 66810
10924 66810 114916 28314 -12206 30184 -29703 -219697 133714 79613 317906 -4214 31620
10912 -68089 19263 -24202 83240 99277 -147993 314372 147851 -112972 -329967 71508 -72960
10900 -164054 -182392 -73149 70434 -12909 196613 -50604 -65820 252362 -131534 -492616 113518
10888 -18359 145371 94106 -64950 -154651 416724 244815 -83704 31563 -39781 -136523 -153331
10877 -153331 19178 -126253 133207 -70485 118791 -168470 246490 -12894 -133439 241331
10866 392412 -230090 127234 118288 -161906 16366 151858 158789 227867 149401 -173209 406635
10854 -111635 -193289 435609 73028 52011 -89428 -174873 -14953 -36368 134987 52586 133031
$$ packed form
10935B35365q2301J10217C1394a16649B6260a40585L7459q649b7526I9883l3073
10924F6810M8106B8314a2206C0184b9703j89994A33714n4101K38293d214C1620
10912f8089A9263b4202H3240J6037a47993C14372A47851a12972k16995G1508g2960
10900a64054j8338g3149G0434a2909A96613e0604j5216B52362a31534l61082A13518
10888a8359A45371n1265f4950q9701D16724j71909h3704C1563c9781r6742j6808
10877a53331A9178a26253A33207g0485A18791a68470B46490a2894j20545B41331
10866C92412b30090A27234q946a61906A6366J35492O931O9078p8466a73209D06635
10854a11635q1654D35609G3028k1017h9428q5445a4953k1415A34987E2586Q0445
$$ plain form
10843 133031 8879 -110520 -41687 310407 -313 1014 -101865 35339 168366 169782 -18255 153406
10830 -56614 -180499 -69205 163217 216532 -146397 -331460 -350483 -326708 60389 -96698 17804
10818 -220066 125282 163552 -120389 -138675 -85720 -119741 -14450 1856 -153587 -101994 324524
10806 -121468 178588 -132120 69552 41224 -96646 -90039 -104253 -87576 -38196 -137882 406 44685
10794 44685 -249478 -115434 234949 -202111 -338417 -96637 -186401 -61318 -39485 -133731 238536
10782 -181870 79800 216280 -99762 -307131 715 63490 241487 42506 86249 -7641 -3547 50427
10769 -72028 518603 135879 64713 -249389 244044 -221017 23633 95715 -30976 46153 228785
10758 228785 -125008 79233 -197685 -165317 268031 74381 -23765 -112437 -42155 23172 58130
$$ packed form
10843A33031H879a10520d1687C10407c13A014a01865C5339J33027J416a8255A53406
10830e6614j23885f9205A63217N3315a46397j85063j9023K3775F0389i6698A7804
10818b20066A25282L8270a20389j8286N2955l4021a4450A856a53587N1593C24524
10806a21468A78588a32120F9552k8328i6646O607j4214J6677c8196r9686D06M4279
10794D4685b49478a15434B34949b02111j36306i6637q9764f1318K1833r4246B38536
10782a81870G9800J36480i9762k07369G15O2775J77997D2506M3743g641c547E0427
10769g2028E18603A35879F4713b49389B44044b21017B3633P2082c0976D6153J82632
10758B28785a25008G9233a97685L2368B68031G4381b3765q8672d2155B3172L4958
$$ plain form
10747 58130 93737 -86073 -202503 -181614 11254 201007 -236104 -51389 -95817 -98724 -24082
10735 -161397 89431 -178765 -80784 -52346 -74475 14752 -886 -46691 32359 -242853 -171587
10724 -171587 92440 -184357 -82246 -254888 237412 -70995 -32409 -68649 -63120 228711 87772
10712 91939 -78489 -110902 307030 1686 -212526 -23547 45863 -64053 -56534 -66502 -369868 140767
10699 117153 23552 364300 -142652 -304029 78550 41972 -117115 79412 -199492 155530
10688 -113619 106253 -204736 31577 51392 -125297 -154913 120526 -145371 -219877 -197700
10678 -197700 112813 260775 -220405 -262875 -255784 93269 213573 -207030 158222 284327
10668 284327 -162805 -219923 -179463 -165637 -99222 68080 -37601 -71501 -252667 232427 -253001
$$ packed form
10747E8130L5607h6073j16430K0889A1254J89753b36104e1389m4428k907b4082
10735a61397H9431a78765h0784K8438k2129A4752h86m5805C2359b42853P1266
10724a71587I2440a84357h2246j72642B37412g0995c2409l6240N529B28711H7772
10712I1939g8489l2413C07030A686b12526b3547D5863f4053P519r968l03366A40767
10699A17153B3552L40748a42652j61377G8550l6578a17115G9412a99492A55530
10688a13619A06253b04736C1577J9815a25297k9616A20526a45371p4506K2177
10678a97700A12813J47962b20405m2470P091I3269J20304b07030A58222J26105
10668B84327a62805n7118M0460J3826O6415F8080c7601l3900j81166B32427b53001
$$ plain form
10656 242829 81027 -81038 -57323 -227216 -114837 -173556 110072 -159761 -104269 -79977 74762
10644 -272485 -250818 -274537 44465 -159304 44810 -183389 114305 344664 68311 12029 260541
10633 260541 2097 -189596 -86141 -52567 -132937 206358 -20532 -143769 -10062 -240953 -168137
10622 -168137 -13155 -51097 -91462 32329 -330722 7109 -233047 -150595 -54689 -176628 132518
10610 -319795 -429059 90090 -85553 -190154 -102102 -73703 -188928 32554 -54880 -280109 -285025
10599 -285025 -245750 148797 142758 5308 116024 -216201 212141 -45934 -186972 -23422 86496
10587 -35320 -89742 107378 -124856 -236759 -233111 105051 -313558 -369575 127112 25799 46466
10576 46466 -74078 -31043 661 82473 -115002 -133435 -18589 -49913 -55737 138440 62774 -231811
$$ packed form
10656B42829H1027h1038K3715j69893J12379n8719A10072a59761N5492K4292G4762
10644b72485K1667k3719D4465a59304D4810a83389A14305K30359F8311A2029K48512
10633B60541B097a89596h6141L3574q0370B06358b0532j23237a0062k30891P2816
10622a68137a3155l7942m0365C2329c30722G109b33047Q2452e4689j21939A32518
10610c19795j09264I0090h5553j04601Q8052K8399j15225C2554e4880k25229m916
10599b85025L9275A48797o039E308J10716b16201B12141d5934j41038b3422H6496
10587c5320n4422A07378a24856j11903L648A05051c13558n6017A27112B5799K0667
10576D6466g4078c1043F61Q1812a15002j8433a8589l1324n824A38440F2774b31811
$$ plain form
10563 132566 -234424 -139380 249219 -164758 -200767 -11643 -54471 -135554 158155 51076 281963
10552 281963 101394 120576 306075 -132179 -46863 308421 -8918 71534 -38608 -89328 122435
10540 -148190 -89868 -274382 -17143 116519 -319367 -86761 -57232 -88807 363689 57171 -399342
10528 -54403 -274282 133055 -151112 -317873 -138268 199368 198458 151358 149649 315658 70554
10516 293364 55111 -4555 121865 15436 77067 -55372 -73191 -43435 145565 -43041 110635
10504 -348908 -4581 230794 223132 292618 -18608 -81280 41962 -66179 362130 21193 -165259
10492 -134700 -201106 -123371 1020 -114749 -37710 62635 37956 140570 -234688 387777 87654
10480 538941 260241 366884 100931 -10325 93476 9323 203433 -133656 148305 79852
$$ packed form
10563A32566b34424R5044B49219a64758l6009a1643m2828q1083A58155E1076K30887
10552B81963A01394J9182J85499a32179d6863C08421h918G1534c8608n0720A22435
10540a48190N8322j84514a7143A16519c19367h6761K9529l1575C63689E7171c99342
10528e4403k19879A33055a51112j66761a38268A99368r10m7100j709J66009G0554
10516B93364E5111d555A21865A5436O1631e5372j7819K9756A45565d3041A10635
10504c48908d581B30794p662O9486a8608o2672D1962f6179C62130B1193a65259
10492a34700o6406P7735A020a14749c7710F2635k4679J02614b34688C87777H7654
10480E38941B60241J06643A00931a0325I3476I323J94110a33656A48305o8453
$$ plain form
10470 79852 71407 -59782 42476 -159537 -51555 -228243 -180354 -80085 -4377 -235362 317684
10458 193415 239538 -56171 -287140 -363006 84969 -69417 249997 -192881 -55662 -21056 91969
10446 -33378 -26294 39718 -70370 -328376 174887 96923 208959 200947 -142796 -254529 252902
10434 18880 -168090 18790 54827 -334620 86325 72404 17900 -64929 -315485 -42747 -162220
10423 -162220 -113037 -5247 46130 -319690 -117315 -74487 -46950 9622 260890 119746 150
10411 95375 -204346 -25551 -46545 158106 -32648 144338 -19624 -65802 160236 147886 -156007
10399 -66717 55774 113118 26485 -25354 480597 -129185 41274 -26118 -10275 -201504 137744
10387 184947 224767 175971 403834 229753 -14180 66162 -117762 87562 128127 264683 77781
$$ packed form
10470G9852q445e9782D2476a59537e1555j76688M7889h0085d377k30985C17684
10458A93415M6123e6171k30969p5866H4969f9417B49997a92881e5662b1056I1969
10446c3378P084C9718g0370k58006A74887p7964J12036q012a42796j11733B52902
10434A8880a68090A8790L6037c34620H6325j3921A7900f4929k50556d2747j19473
10423a62220M9183e247D6130c19690a17315M2828K7537I622K51268A19746A50
10411I5375b04346b5551k0994A58106c2648A44338a9624m6178A60236j2350a56007
10399f6717E5774N7344B6485b5354D80597a29185D1274b6118a0275j91229A37744
10387A84947L9820m8796K27863j74081a4180F6162a17762H7562M0565J36556G7781
$$ plain form
10375 417282 233897 -239923 135996 138617 314343 42831 376009 667202 220688 421414
10365 421414 413396 487149 577948 387286 152855 88643 165888 199227 497695 68743 531578
10354 531578 386307 450175 377099 671269 665832 506364 420009 38320 -26339 163994 381941
10343 381941 713259 167606 -98310 467518 174214 -82727 8885 283944 172660 74316
10332 343638 43005 309758 12266 -71532 469540 -106284 3190 -323487 163932 103539 282682
10321 282682 512633 177305 -90361 56090 100697 472363 224652 20436 27019 -66262 97819
10309 232946 167452 118390 -65794 -22390 -83103 142828 165654 272504 43062 179166 -362242
10297 135207 -14327 104716 54684 199914 -150974 -201238 27776 193072 -31529 -33598 -12781
$$ packed form
10375D17282j83385b39923A35996K621J75726D2831L33178K91193B20688K00726
10365D21414q018P3753R0799j90662A52855o4212P7245L3339K98468F8743M62835
10354E31578j45271O3868p3076K94170n437j59468q6355C8320b6339A63994K17947
10343C81941L31318A67606i8310D67518A74214h2727H885K75059j11284G4316
10332C43638D3005K66753A2266g1532D69540a06284C190c23487A63932o0393J79143
10321B82682K29951A77305i0361E6090M4607L71666B24652B0436O583f6262I7819
10309B32946o5494m9062f5794b2390o0713A42828K2826J06850D3062J36104c62242
10297A35207a4327A04716n0032J45230a50974n0264B7776J65296c1529k069a2781
$$ plain form
10285 21099 165646 -460444 -4966 108670 -107477 -138043 -138539 155031 -77220 -179644 10115
10273 -158784 -401 -71337 218364 -341510 -9255 -51014 57075 199742 -272529 128172 121756
10262 121756 306086 168765 -6705 570673 802610 248113 93376 261667 204602 141544
10252 141544 43911 87224 -143002 132540 120449 182168 -29556 -127393 158392 64305 -17281
10240 -348338 36888 -37272 -14527 -76548 -21251 474260 -74090 -56730 -71999 -126002 -222172
10229 -222172 131859 367403 -63829 156271 -23624 -469900 -162841 -112401 -50564 238682
10218 -89391 -158636 43229 -290759 45701 82932 -57633 111901 -122454 -168693 10059 -131471
10206 8564 25632 147640 -215713 -159679 -268838 123557 -16241 -291632 -63796 -191826 184742
$$ packed form
10285B1099J44547d60444d966A08670a07477l0566m96A55031g7220j02424A0115
10273a58784d01p0936B18364c41510i255m1759E7075J42667b72529A28172o416
10262A21756J84330j37321f705E70673K31937B48113I3376J68291n7065o3058
10252A41544D3911M3313a43002A32540j2091O1719b9556r7837A58392F4305a7281
10240c48338C6888c7272a4527o2021b1251D74260g4090J7360j5269n4003r6170
10229b22172A31859K35544f3829A56271b3624m46276a62841N0440e0564B38682
10218h9391o9245D3229b90759D5701L7231e7633A11901a22454m6239A0059a31471
10206H564J7068J22008b15713N6034j09159A23557a6241k75391f3796j28030A84742
$$ plain form
10194 245158 -289114 -55673 -159708 18820 -136593 -57356 -99892 189062 -65439 -186488
10184 -186488 19632 -182918 3365 130714 -73450 -141838 46468 -150129 -29994 -130438 71020
10172 -248909 65364 -95837 29576 -203098 -57965 47830 -186996 -5507 220287 -146939 33564
10160 182172 -97199 434427 31477 -280275 -130287 -145960 29005 -84755 -45127 -86509 74379
10148 -136314 50270 -201909 -162677 -287743 -367420 -201751 3174 169525 -142868 76177 25551
10136 -314107 -135331 -113074 314936 65232 -106810 53645 -15992 -248326 -17310 134478
10125 98424 -134372 101027 -84688 -49655 -35446 -172193 246611 55631 -67626 -156049 -468826
10114 -468826 -18209 -30042 14860 -43874 299142 159455 -208233 58022 241684 13423 -88077
$$ packed form
10194B45158b89114e5673j04035A8820a36593e7356m2536A89062f5439j21049
10184a86488A9632a82918C365J27349g3450o8388D6468a50129b9994j00444G1020
10172b48909F5364i5837B9576b03098e7965D7830a86996e507B20287a46939C3564
10160A82172i7199D34427C1477b80275a30287j5673B9005h4755L9628m1382G4379
10148a36314E0270b01909L9232j25066p9677J65669C174J66351a42868G6177B5551
10136c14107a35331K2257C14936F5232a06810E3645a5992k32334a7310A34478
10125I8424a34372A01027h4688L5033J4209j36747B46611E5631f7626q8423l12777
10114d68826a8209j1833A4860d3874B99142j39687b08233E8022J83662A3423h8077
$$ plain form
10102 -116346 -256733 70410 28572 46680 -164183 -179665 -21362 143020 -186534 -287209
10092 -287209 -74206 91411 -252896 -306454 63641 -227220 13065 -107914 -93401 -343188 -65311
10080 -67181 312563 -58478 -28852 -27074 62541 -75922 -164274 -105389 -146443 -40829 -53748 -145017
10068 -145017 -158731 -360766 373254 259450 -67988 -24988 175536 -335455 6821 171117
10058 171117 185953 131358 -23302 -123571 -345124 -235922 -190251 -285459 249612 25351 -18664
10046 6320 -197253 -49713 -295392 -113203 -239222 49496 64313 171791 216495 173374 -429219
10034 4100 133401 -331413 -13631 8913 -79531 -388273 18060 145739 -107176 65919 -11674
10022 8048 -119469 18064 -56394 -108937 4315 -76881 100406 243412 136436 -407098 85574
$$ packed form
10102a16346j40387G0410B8572J8108a64183j5482b1362A43020a86534j00675
10092b87209g4206I1411b52896n3558F3641b27220A3065a07914J4513k49787f5311
10080f7181C12563e8478b8852J778F2541g5922q8352N8885m1054d0829j2919r1269
10068a45017j3714k02035C73254j13804f7988b4988A75536c35455F821J64296
10058A71117J4836n4595b3302j00269k21553J09202M5671r5208B49612B5351a8664
10046F320a97253d9713k45679a13203j26019D9496J4817J07478M4704m3121d29219
10034D100J29301c31413a3631H913g9531l08742A8060J27679a07176F5919a1674
10022H048a19469A8064e6394n2543D315g6881A00406J43006j06976d07098H5574
$$ plain form
10010 -254376 67965 -87084 35366 -198138 305111 102921 -50645 46194 -84844 -76001 89158
9998 38553 -103903 -221956 -191068 54165 -37070 31562 48875 -95929 148080 -175229 153385
9986 51214 -220057 -308709 -91146 335082 34532 -13910 87944 171399 -183385 -150842 -236680
9975 -236680 -63144 -38370 53552 -267640 -73003 93754 105347 -163548 -155536 -174978 113637
9963 -141262 301004 -251550 -349325 48748 -150011 -107314 118165 -162511 -233623 48210 33273
9952 33273 -399920 -267820 -135322 51273 30124 126222 -207135 -266154 -285939 -63831 -8361
9940 11372 -152476 41887 21696 118193 -155978 -61268 -42721 -111132 6986 -74393 352644
9928 -222084 -199334 -235519 26962 5730 -14423 117803 -15273 -123434 -294347 351902 -489640
$$ packed form
10010b54376F7965h7084C5366a98138C05111A02921e0645D6194h4844Q843H9158
9998C8553a03903j18053L0888E4165c7070C1562J7313i5929A48080a75229A53385
9986E1214b20057q8652i1146C35082C4532a3910H7944Q3455a83385L2543q5838
9975b36680f3144K4774E3552b67640g3003I3754J1593a63548Q012j9442A13637
9963a41262C01004b51550r7775D8748a50011M2697A18165a62511p1112D8210j4937
9952C3273c99920J32100J32498E1273k1149R6098b07135n9019j9785f3831h361
9940A1372a52476D1887k0191R6497a55978f1268J8547o8411F986g4393C52644
9928b22084K2750l6185B6962E730a4423A17803a5273j08161j70913C51902d89640
$$ plain form
9916 149959 238924 -161262 -152658 46882 -177979 27623 -123897 -21875 -262445 -266421 161086
9904 81333 219249 -70269 -3491 -232513 -197747 -328406 -193669 -46817 52284 -257889 -278495
9893 -278495 -44536 -7674 50290 -128620 -181261 -320271 -384422 132242 -137790 -112669 -246145
9882 -246145 -327944 177493 -64345 186551 68376 128052 128568 133205 -57585 22175 354056 93597
9869 99136 94207 -31025 20660 182909 -172386 -151150 -159123 -132667 -196130 -315755 -129040
9857 -288943 -86033 -337757 18568 153951 64992 190589 32740 -385577 40508 152530 299482
9846 299482 35682 -120082 -161904 -385756 62343 -24327 62678 -286223 -68615 -151479 105048
9834 168497 -176307 -374167 88158 -169691 -300480 175972 -342979 -237211 178423 301795
$$ packed form
9916A49959Q8965a61262Q604D6882a77979B7623a23897b1875k40570l976A61086
9904H1333J37916g0269c491k29022L4766j30659J34737d6817E2284b57889k0606
9893b78495d4536g674E0290a28620n2641j39010o4151A32242a37790K5121j33476
9882b46145q1799A77493f4345A86551F8376N9676N16M637e7585B2175L31881I3597
9869I9136m929c1025B0660J62249a72386K1236p973K6456o3463j19625a29040
9857b88943h6033k51724A8568J35383F4992J25597C2740c85577D0508J12022J46952
9846B99482C5682a20082m1822k23852F2343b4327F2678b86223f8615q2864A05048
9834A68497a76307j97860H8158a69691j30789A75972c42979J05768A78423J23372
$$ plain form
9824 301795 292699 65088 -119516 -193280 -67302 -91405 179367 236076 -110460 -28977 -187718
9813 -187718 242141 -419316 247715 -230256 5314 -1017 130582 184886 -254469 -141471 100767
9801 -136173 -78689 207479 50084 -396358 111966 -52592 31787 74284 177060 -212524 -97242
9789 -134314 -20868 -68324 21219 -138561 -171514 -158037 215049 -1674 -27506 -190105 -563609
9778 -563609 -47367 -151867 -118871 -107731 -51195 67130 -31336 150299 116221 -77310 -268871
9767 -268871 -17464 -184504 -165216 -139748 -177550 -225295 145384 15138 -229556 148605 -83199
9755 75312 -39574 158955 -21804 -24690 -392672 -341953 -148542 -9900 103068 -251227 16407
9743 107321 -57283 207472 167459 316617 -7068 14673 -113912 215655 -259627 99698 8723
$$ packed form
9824C01795r096F5088a19516p3764f7302k4103A79367N6709a10460b8977j58741
9813a87718B42141d19316B47715b30256E314a017A30582N4304b54469J12998A00767
9801a36173N7484B07479E0084c96358A11966e2592C1787M2497J02776b12524i7242
9789a34314b0868m7456B1219a38561l2953J3477B15049a674k5832j62599l73504
9778e63609d7367j04500L2996J1140e1195F7130c1336A50299l4078g7310j91561
9767b68871a7464j67040J9288K5468l7802m7745A45384A5138b29556A48605h3199
9755G5312c9574A58955b1804k886l67982N0719a48542i900A03068b51227A6407
9743A07321e7283B07472m0013J49158g068A4673a13912B15655b59627I9698H723
$$ plain form
9731 86719 -135246 -373149 -327127 -76149 -202375 156593 -66116 -26894 -390089 -290048 -172925
9720 -172925 54069 213576 201672 187513 -85158 333573 -164949 -13866 212339 210186 -374866
9708 -96966 -132471 88180 -78980 24890 123372 55586 -405198 -63359 -336343 135059 -27532
9696 -28824 -124197 -53419 107764 -30039 -57086 -84314 -229999 -2863 -32833 -87118 56684 302750
9684 302750 -221603 -78343 -22383 -16235 -28579 -337427 296109 -366990 134707 -166516 -33129
9672 -414557 -105233 -271527 -125101 60376 -65058 -93030 -87284 -37039 82477 53707 -221730
9660 74927 110024 -309316 -371795 45765 -291883 -177219 -347193 -108618 192900 -376514
9649 58880 -12801 -22592 -277695 61585 -99890 -405212 35999 21497 -25545 -204151 101515
$$ packed form
9731H6719a35246k37903M6022g6149j26226A56593f6116b6894l63195J00041J17123
9720a72925E4069J59507j1904j4159h5158C33573a64949a3866B12339k153c74866
9708i6966l5505H8180g8980B4890R8482E5586d05198f3359k72984A35059b7532
9696b8824r5373e3419A07764c0039k7047k7228j45685b863k9970n4285E6684K46066
9684C02750b21603g8343b2383O148j2344l08848B96109c66990A34707a66516c3129
9672d14557a05233j66294a25101F0376f5058k7972N746c7039H2477k8770b21730
9660G4927L5097c09316o2479D5765b91883J14664j69974a08618A92900c76514
9649E8880a2801r791k55103F1585i9890l05322C5999j4502b5545j78606A01515
$$ plain form
9637 54902 -101279 -178778 -109277 -81131 -57362 14041 -139993 -30911 221971 -120393 -278967
9626 -278967 -6909 -69622 -296591 -59935 198200 -172604 -390075 330833 -30133 17506 -180231
9614 -60382 -64201 -191550 -318547 -31995 -246209 -374776 -161225 194365 -288517 15135 -139040
9602 -143969 -301968 -85492 108609 61479 153398 -239173 -77242 -40895 114927 187497 -28757
9590 -145398 -222249 -38451 -147788 -339633 -416087 -80165 -31583 189680 -179567 -15129 75225
9578 -84526 -146231 -38619 206663 -138570 -97089 156440 24011 -95073 -327983 -83600 -217771
9567 -217771 -181122 -224200 -329689 -321839 173031 -91663 263720 214785 12895 -35266 256059
9555 -339899 -334192 -176401 119003 157393 10416 -206629 -157704 107483 216206 -50851 243195
$$ packed form
9637E4902a01279p7499O9501K8146K3769A4041a39993c0911B21971a20393j58574
9626b78967f909o2713k26969e9935A98200a72604k17471C30833c0133A7506a80231
9614f0382l819j27349j26997c1995k14214j28567a61225A94365b88517A5135a39040
9602a43969j57999h5492A08609m7130R1919b39173g7242L6347A14927P2570b8757
9590a45398p6851c8451j09337j91845p6454h0165c1583A89680a79567a5129G5225
9578h4526o1705c8619B06663a38570M1481A56440B4011i5073k32910h3600j34171
9567b17771L6649m3078j05489P850A73031i1663B63720m8935A2895c5266B56059
9555c39899N707J57791A19003L8390A0416b06629M8925A07483J08723e0851B43195
$$ plain form
9543 -15015 -21886 -246120 34481 -69697 -176706 -142396 -183691 -223162 -56567 -219788 -237899
9532 -237899 342958 -148608 -281780 -254194 -102719 -3153 -99019 104636 55762 -56693 -51464
9521 -51464 -43946 -186366 -138916 -76672 -28257 -582539 -166187 331659 181614 62980 116460
9510 116460 -112842 408819 -179958 -171788 -265232 -136323 67237 -165606 -91281 -365564 69257
9498 -31090 65756 221442 14364 -56835 -88567 71625 -218018 -160790 -143540 143061 -311167
9486 -308583 21137 -116685 -132277 -299396 -112553 -202815 -136156 60281 183766 -171537 178972
9474 -157788 -80930 73162 -2110 393154 -447890 -179484 47564 -291909 -60200 -200581 47489
9462 128868 51483 -14607 -329478 222087 147903 -18506 -115876 -36513 -109186 -344753 -109278
$$ packed form
9543a5015o871k24234C4481f9697j07009L4310m1295l9471e6567j63221j8111
9532b37899C42958a48608j33172K7586a02719c153r5866A04636m8874e6693N229
9521e1464P518j42420M7450O2244b8257n54282a66187C31659j50045F2980N3480
9510A16460a12842D08819a79958Q170r3444J28909F7237a65606P4325k74283F9257
9498c1090F5756J55686A4364e6835l1732G1625b18018N7228J7250A43061c11167
9486c08583B1137a16685j5592j67119a12553r0262O6659F0281J23485a71537A78972
9474a57788P6858G3162b110C93154d47890a79484D7564b91909f0200j40381D7489
9462A28868E1483a4607l14871B22087p4184a8506r7370c6513p2673k35567a09278
$$ plain form
9450 -571947 -66518 215598 -151978 169301 159463 -26315 64194 -222114 50643 -93438 -27934
9438 -58903 -30354 198576 -16749 356121 -193658 105173 -299588 -118524 74094 68782 -288469
9426 -203242 32478 39148 -228815 7428 49983 -286762 -282806 -18654 -12673 -104226 -175996 -216719
9414 -216719 -268538 -162804 44995 144217 -299784 65526 -267605 68293 -19859 46734 -223117
9402 -27247 -2710 -76593 84699 139844 -103773 -339125 -287145 -304517 -204040 111188 -42235
9390 -408966 -276684 47855 -181119 184056 169258 49396 -231122 -278061 7312 -268115 149511
9378 47960 -202555 44232 34938 -409640 -64894 56246 -97449 -407837 -112187 -8058 251882
9366 -433906 -65367 57627 -67484 131982 -18730 -268252 -111655 -3358 251678 150555 -86327
$$ packed form
9450e71947f6518B15598a51978A69301r838b6315F4194b22114E0643i3438b7934
9438e8903K8549A98576a6749C56121a93658A05173b99588a18524G4094n312b88469
9426b03242C2478O670b28815G428M2555b86762L956a8654N981r1553p1770m0723
9414b16719n1819J05734D4995R9222b99784F5526b67605F8293a9859D6734b23117
9402b7247b710p3883H4699N5145a03773k35352N1980j7372J00477A11188d2235
9390d08966J32282D7855a81119A84056j4798D9396b31122m6939G312b68115A49511
9378D7960b02555D4232r294d09640f4894E6246i7449l10388a12187h058B51882
9366d33906f5367E7627f7484A31982a8730k49522a11655c358B51678j01123h6327
$$ plain form
9354 -185862 154155 -235552 40546 -540050 78981 -125195 -81380 -53877 -181406 -121150 -64992
9343 -64992 -70189 12777 -79201 15220 -98342 -195861 -170683 -96493 -235484 96907 -19032 -193710
9331 -193710 -54190 -226401 -26784 -417175 76288 -131722 152885 181932 -53655 -102005 416592
9319 -295716 153375 -251305 -125401 198665 69573 -239140 -254387 -90710 194781 -33821
9308 -115681 -46576 -60412 42526 -57307 -50523 102987 128990 -513230 -78262 -224150 7264
9296 -462831 250799 42372 283612 -238416 25472 -90049 -110770 85061 -135160 -127035 31935
9284 -4640 89383 18207 -233277 292212 -201388 -20476 -372174 -147130 -53270 -307873 -420003
9273 -420003 -31292 -234795 11331 -34121 212610 55444 -190649 26516 -128344 -205018 -91468
$$ packed form
9354a85862A54155b35552D0546e40050G8981a25195M3815K7503j27529O0256N6158
9343f4992n197A2777g9201A5220i8342r7519K5178P4190j38991I6907a9032j74678
9331a93710e4190j72211b6784l90391G6288a31722A52885K9047e3655m8350D16592
9319b95716A53375b51305a25401A98665F9573b39140j5247i0710A94781c3821
9308a15681d6576j3836D2526e7307O784A02987K6003e13230g8262j45888G264
9296d62831B50799D2372K41240b38416B5472i0049k0721H5061a35160Q125C1935
9284d640H9383A8207b33277B92212b01388b0476l51698a47130e3270k54603j12130
9273d20003c1292k03503A1331c4121B12610E5444a90649B6516a28344p6674i1468
$$ plain form
9261 -24826 -282793 -96015 -102573 -179494 -9384 -90178 -60784 -192787 -64913 -69162 -286783 -113002
9248 -110177 -213069 -28973 -29763 -8896 79481 -87583 -46289 -56397 11594 46929 -230088 57063
9235 -83683 -118894 60200 -89844 -192779 -86984 -175742 65682 -47842 -142326 100053 139755
9224 139755 -183066 68199 -235371 277418 -229111 -29854 -22345 -92784 -908 -52167 -116037
9213 -116037 58650 300737 -77485 -50627 -77803 165946 -193546 -20707 39680 184246 29603
9201 120759 256890 -124163 174460 -173147 -226494 -32140 -202465 182505 -99355 -50737
9191 -50737 -170876 -1634 -410907 -450029 -166343 -271769 101929 121241 147064 -249794 157429
9179 -163378 -237804 3805 3715 -135313 64506 -236546 -25176 170260 -95267 -115187 -253534 151088
$$ packed form
9261b4826k57967i6015o558p6921i384q0794K9394j32003f4913m249k17621a13002
9248a10177j02892b8973p90h896G9481h7583M1294j0108A1594L5335b30088E7063
9235h3683l5211F0200h9844j02935h6984q8758F5682d7842r4484A00053L9702
9224A39755a83066F8199b35371B77418b29111b9854P509p0439i08n1259o3870
9213a16037E8650K42087g7485K6858k7176A65946a93546b0707C9680J44566B9603
9201A20759J36131a24163A74460a73147n3347c2140j70325A82505i9355M8618
9191e0737j20139a634m09273l9122a66343j05426A01929J9312K5823b49794A57429
9179a63378p4426C805r0a35313F4506b36546b5176A70260i5267j9920j38347A51088
$$ plain form
9166 135150 277938 -210276 -543106 -99200 259249 -133954 -92080 -60673 -59586 -90124 65558
9154 316659 -159254 7560 86162 89876 -88105 -45187 145039 -22060 208816 -132217 -485842
9143 -485842 -137770 -308614 -315903 231740 1191 -128671 71390 -35506 -119963 -237181 -27956
9131 15081 -139448 78504 -333488 146706 -82344 -40013 -175893 17007 -208060 128779 42442
9119 -62230 23162 -285090 -193814 93030 -302557 -211364 -248987 -85264 151219 216806 49211
9107 -22060 -78213 -34695 -354719 -82093 -102520 -266479 -8959 260682 -197476 -103999 279095
9095 -119282 -277224 1366 -46409 -65310 -23099 236795 -394226 -226301 -427396 33736 -104171
9083 120194 -296284 -76338 -56306 -22633 102944 -336951 -105440 51901 -127528 -26150 -290031
$$ packed form
9166A35150J42788b10276l32830i9200B59249a33954M1874L1407J087l0538F5558
9154C16659a59254G560P8602L714h8105M2918A45039b2060B08816a32217l53625
9143d85842a37770j70844p289B31740A191a28671G1390c5506q4457j17218b7956
9131A5081a39448G8504c33488A46706h2344d0013j35880A7007b08060A28779D2442
9119f2230B3162b85090R1276I3030c02557R1193l7623h5264A51219O5587D9211
9107b2060n6153c4695l20024h2093k0427j63959h959B60682a97476R3477B79095
9095a19282j57942A366d6409j8901b3099B36795c94226J67925k01095C3736a04171
9083A20194b96284g6338K0032b2633A02944c36951a05440E1901a27528b6150k63881
$$ plain form
9072 -290031 212155 382304 58204 -184765 -86664 -61801 142652 231750 -510228 51895 -65526
9060 -47745 -320651 116730 -14540 -258898 361424 -223548 -536876 -5315 304886 -213960
9049 -103774 -16904 -282612 -77323 -124245 78298 96508 -345571 17858 -83409 -20417 -32150
9038 -32150 263337 -320495 -146559 257860 10029 -181391 420623 -106221 35590 -151134
9027 -355904 25932 55023 -122009 -135096 -302036 -3272 -28063 -52072 -24361 -154404 -63390
9015 -50005 -26621 69098 -30690 -60827 150173 -428345 260456 -40738 -246984 -181872 -97427
9004 -97427 -110472 74948 -204386 -284699 -246822 -346838 322458 -3571 -112834 35735 -55407
8992 -244612 36571 -216330 382239 -464332 219607 37599 -5815 110662 -178598 -2420 96776
$$ packed form
9072b90031B12155J70149E8204a84765h6664K4863A42652Q9098e10228E1895f5526
9060d7745k72906A16730a4540k44358C61424b23548l13328e315C04886b13960
9049a03774a6904k65708g7323m6922G8298J8210c45571A7858h3409b0417j1733
9038c2150B63337c20495a46559B57860A0029a81391D20623a06221C5590a51134
9027c55904B5932K9091a22009j3087j66940c272k4791k4009b4361j30043f3390
9015e0005K3384F9098c0690l0137A50173d28345B60456d0738k06246O5112Q4445
9004i7427j3045G4948b04386q0313L7877j00016C22458c571j09263C5735e5407
8992b44612C6571b16330C82239d64332B19607C7599e815A10662a78598b420I6776
$$ plain form
8980 229042 29246 -109728 -33749 149983 208874 35816 -29180 -58146 160862 -127909 -18816
8968 160741 -87777 145141 -35272 -10939 -356128 -80475 -139387 -195373 158702 -252784 -337624
8957 -337624 77658 -37152 88507 -126719 67571 203344 -43114 106618 -174702 152539 -24449
8945 123379 155776 14406 -313301 -14444 -121751 78459 241012 -383409 -24439 96856 463476
8934 463476 409792 -69881 91425 -63446 327103 287475 199306 161015 733787 735271 2397212
8923 2397212 6376050 15608562 13012092 4395902 1865510 969262 518962 323790 402347
8914 402347 185445 181607 -113811 28073 228398 102891 254138 11281 21715 224268 -208614
8902 -266995 -206419 -16039 -87524 -229571 94484 66409 -368422 -328854 -95351 179412 -248927
$$ packed form
8980B29042B9246a09728c3749A49983N8891C5816b9180k8966A60862a27909a8816
8968A60741h7777A45141c5272a0939l45189h0475n8912n5986A58702b52784q4840
8957c37624G7658c7152H8507a26719F7571J35773d3114A06618a74702A52539b4449
8945A23379L2397A4406c13301a4444j07307G8459J62553c83409b4439I6856L66620
8934D63476n3684f9881I1425f3446C27103l9628q8169l8291N72772J484J661941
8923B397212L978838R232512k596470D395902A865510q96248m50300j95172P8557
8914D02347A85445l838a13811B8073K00325A02891J51247A1281J0434K02553b08614
8902b66995O0576a6039p1485j42047I4484k8075c68422L9568i5351A79412b48927
$$ plain form
8890 -271490 266264 -67542 -17372 -289011 -197548 -226141 204115 -50361 -52388 -206484 -41294
8878 -30376 -363888 -183535 42263 31266 -177307 332273 -89397 -132186 -65195 155042 -103295
8866 -96418 -181436 -84998 155437 -223185 -147051 -341753 52607 -363423 -158277 -115972 -114265
8855 -114265 862 65447 97913 72342 -147034 37932 -149956 -75345 13437 114347 -33804
$$ packed form
8890b71490B66264f7542a7372k71639R1463k8593B04115e0361k027j54096d1294
8878c0376l33512J80353D2263j0997a77307C32273h9397m2789f5195A55042a03295
8866i6418q5018h4998A55437b23185P6134j94702E2607c63423a58277M2305J707
8855a14265H62O4585L2466k5571a47034C7932a49956P4611A3437J00910c3804
$$ [...]
##END NTUPLES=NMR SPECTRUM
##END=
