##TITLE=AC1506_CUNDCR13313_8126553_ktEYUnGwJc
##JCAMPDX= 6.0         $$ Bruker NMR JCAMP-DX V2.0
##DATA TYPE= NMR SPECTRUM
##DATA CLASS= NTUPLES
##ORIGIN= BRUKER
##OWNER= Administrator
$$ 1.72 TOPSPIN		Version 2.1
$$ 2013-08-15 22:33:03.238 -0700  Administrator@X
$$ Compression mode = diff/dup
##.OBSERVE FREQUENCY= 400.02188249412
##.OBSERVE NUCLEUS= ^1H
##.ACQUISITION MODE= SIMULTANEOUS (DQD)
##.ACQUISITION SCHEME= undefined
##.AVERAGES= 8
##.DIGITISER RES= 22
##SPECTROMETER/DATA SYSTEM= spect
##.PULSE SEQUENCE= zg30
##.SOLVENT NAME= COFFEE_meoh
##.SHIFT REFERENCE= INTERNAL, COFFEE_meoh, 1, 14.98509
##AUDIT TRAIL= $$ (NUMBER, WHEN, WHO, WHERE, PROCESS, VERSION, WHAT)
$$ ##TITLE= Audit trail, TOPSPIN		Version 2.1
$$ ##JCAMPDX= 5.01
$$ ##ORIGIN= Bruker BioSpin GmbH
$$ ##OWNER= Administrator
$$ $$ E:\/data/COFFEE/nmr/AC1506_CUNDCR13313_8126553_ktEYUnGwJc/10/pdata/1/auditp.txt
$$ ##AUDIT TRAIL=  $$ (NUMBER, WHEN, WHO, WHERE, PROCESS, VERSION, WHAT)
(   1,<2013-08-15 22:32:56.457 -0700>,<Administrator>,<X>,<go>,<TOPSPIN 2.1>,
      <created by zg
	started at 2013-08-15 22:31:50.473 -0700,
	POWCHK enabled, PULCHK disabled,
       configuration hash MD5:
       C8 4E 4E 5D D3 5C D8 9E 9F 52 82 E0 59 8A DE 15
       data hash MD5: 64K
       C5 55 15 7B F5 BF 09 73 D0 C1 81 ED 4A AC 98 75>)
(   2,<2013-08-15 22:32:59.395 -0700>,<Administrator>,<X>,<proc1d>,<TOPSPIN 2.1>,
      <Start of raw data processing
       efp LB = 0 FT_mod = 6 PKNL = 1 PHC0 = 0 PHC1 = 0 SI = 32K 
       data hash MD5: 32K
       EF FE B6 FC 13 53 1D 61 CC C5 4A 41 68 6E 4B 85>)
(   3,<2013-08-15 22:32:59.691 -0700>,<Administrator>,<X>,<proc1d>,<TOPSPIN 2.1>,
      <pk PHC0 = 96.74561 PHC1 = 0 
       data hash MD5: 32K
       58 5E C9 D2 6F D1 67 9A 24 10 EF D2 FB 9A 6C AC>)
(   4,<2013-08-15 22:32:59.816 -0700>,<Administrator>,<X>,<proc1d>,<TOPSPIN 2.1>,
      <abs ABSG = 1 
       data hash MD5: 32K
       E9 E5 51 8A E3 A8 C1 30 0A D8 7B BF 8F C1 87 2B>)
(   5,<2013-08-15 22:32:59.957 -0700>,<Administrator>,<X>,<proc1d>,<TOPSPIN 2.1>,
      <abs ABSG = 2 
       data hash MD5: 32K
       FA 6E 30 66 48 2E 47 1D B2 37 2E 3F 8F 0E 09 38>)
(   6,<2013-08-15 22:33:00.082 -0700>,<Administrator>,<X>,<proc1d>,<TOPSPIN 2.1>,
      <abs ABSG = 3 
       data hash MD5: 32K
       9D 72 E4 E9 BD 14 F1 29 AE 49 48 46 D4 FC 26 6B>)
(   7,<2013-08-15 22:33:00.191 -0700>,<Administrator>,<X>,<proc1d>,<TOPSPIN 2.1>,
      <abs ABSG = 4 
       data hash MD5: 32K
       90 A3 01 D5 3C 2F E6 82 B1 1E 00 82 5C D6 B6 F4>)
(   8,<2013-08-15 22:33:00.238 -0700>,<Administrator>,<X>,<proc1d>,<TOPSPIN 2.1>,
      <abs ABSG = 5 
       data hash MD5: 32K
       B3 02 E6 77 DA 23 8A F1 10 5C B6 EE F6 6A 2A FD>)
$$ ##END=
$$ 
$$ $$ hash MD5
$$ $$ 41 A7 C6 95 91 08 74 1D 01 5D DD A2 E8 FD 8D 19
##$RELAX= 
##$RELAX= 
##$RELAX= 
##$RELAX= 
##$RELAX= 
##$RELAX= 
##$RELAX= 
$$ Bruker specific parameters
$$ --------------------------
##$DU= <E:\>
##$EXPNO= 10
##$NAME= <AC1506_CUNDCR13313_8126553_ktEYUnGwJc>
$$ [...]
##$TP= (0..7)
150 150 150 150 150 150 150 150
##$TP07= 0
##$TPNAME0= <>
##$TPNAME1= <>
##$TPNAME2= <>
##$TPNAME3= <>
##$TPNAME4= <>
##$TPNAME5= <>
##$TPNAME6= <>
##$TPNAME7= <>
##$TPOAL= (0..7)
0.5 0.5 0.5 0.5 0.5 0.5 0.5 0.5
##$TPOFFS= (0..7)
0 0 0 0 0 0 0 0
##$TUNHIN= 0
##$TUNHOUT= 0
##$TUNXOUT= 0
##$USERA1= <user>
##$USERA2= <user>
##$USERA3= <user>
##$USERA4= <user>
##$USERA5= <user>
##$V9= 5
##$VALIST= <valist>
##$VCLIST= <CCCCCCCCCCCCCCC>
##$VD= 0
##$VDLIST= <DDDDDDDDDDDDDDD>
##$VPLIST= <PPPPPPPPPPPPPPP>
##$VTLIST= <TTTTTTTTTTTTTTT>
##$WBST= 1024
##$WBSW= 4
##$XGAIN= (0..3)
0 0 0 0
##$XL= 0
##$YL= 0
##$YMAX_a= 637081
##$YMIN_a= -542432
##$ZGOPTNS= <>
##$ZL1= 120
##$ZL2= 120
##$ZL3= 120
##$ZL4= 120
##$ABSF1= 14.98509
##$ABSF2= -5.573092
##$ABSG= 5
##$ABSL= 3
##$ALPHA= 0
##$AQORDER= 0
##$ASSFAC= 0
##$ASSFACI= 0
##$ASSFACX= 0
##$ASSWID= 0
##$AUNMP= <proc_prof1d_extract_pilot.lims>
##$AXLEFT= 0
##$AXNAME= <>
##$AXNUC= <1H>
##$AXRIGHT= 0
##$AXTYPE= 0
##$AXUNIT= <>
##$AZFE= 0.1
##$AZFW= 0.1
##$BCFW= 0
##$BC_mod= 0
##$BYTORDP= 0
##$COROFFS= 0
##$CY= 15
##$DATMOD= 1
##$DC= 0
##$DFILT= <>
##$DTYPP= 0
##$F1P= 0
##$F2P= 0
##$FCOR= 0.5
##$FTSIZE= 32768
##$FT_mod= 6
##$GAMMA= 0
##$GB= 0
##$INTBC= 1
##$INTSCL= 1
##$ISEN= 128
##$LB= 0
##$LEV0= 0
##$LPBIN= 0
##$MAXI= 10000
##$MC2= 0
##$MEAN= 0
##$ME_mod= 0
##$MI= 0
##$NCOEF= 0
##$NC_proc= -8
##$NLEV= 6
##$NOISF1= 0
##$NOISF2= 0
##$NSP= 0
##$NTH_PI= 0
##$NZP= 0
##$OFFSET= 14.98509
##$PC= 1
##$PHC0= 96.74561
##$PHC1= 0
##$PH_mod= 1
##$PKNL= yes
##$PPARMOD= 0
##$PPDIAG= 0
##$PPIPTYP= 0
##$PPMPNUM= 2147483647
##$PPRESOL= 1
##$PSCAL= 4
##$PSIGN= 0
##$PYNMP= <proc.py>
##$REVERSE= no
##$SF= 400.02
##$SI= 32768
##$SIGF1= 0
##$SIGF2= 0
##$SINO= 400
##$SIOLD= 32768
##$SPECTYP= <>
##$SREGLST= <1H.CDCl3>
##$SSB= 0
##$STSI= 32768
##$STSR= 0
##$SW_p= 8223.68421052631
##$SYMM= 0
##$S_DEV= 0
##$TDeff= 65536
##$TDoff= 0
##$TI= <>
##$TILT= no
##$TM1= 0
##$TM2= 0
##$TOPLEV= 0
##$USERP1= <user>
##$USERP2= <user>
##$USERP3= <user>
##$USERP4= <user>
##$USERP5= <user>
##$WDW= 1
##$XDIM= 32768
##$YMAX_p= 453795818
##$YMIN_p= -746350
##$CURPLOT= <Network HP LaserJet P1505>
##$CURPRIN= <$Network HP LaserJet P1505>
##$DFORMAT= <normdp>
##$LAYOUT= <+/1D_H.xwp>
##$LFORMAT= <normlp>
##$PFORMAT= <normpl>
##$SURQMSG= 1
$$ End of Bruker specific parameters
$$ ---------------------------------
##NTUPLES= NMR SPECTRUM
##VAR_NAME=  FREQUENCY,     SPECTRUM/REAL,   SPECTRUM/IMAG
##SYMBOL=    X,             R,               I
##VAR_TYPE=  INDEPENDENT,   DEPENDENT,       DEPENDENT
##VAR_FORM=  AFFN,          ASDF,            ASDF
##VAR_DIM=   32768,         32768,           32768
##UNITS=     HZ,            ARBITRARY UNITS, ARBITRARY UNITS
##FACTOR=    0.250966925370066, 1,           1
##FIRST=     8223.43324360094, -67360,       -294446
##LAST=      0,             107858,          52310
##MIN=       0,             -746350,         0
##MAX=       8223.43324360094, 453795818,    0
$$ Real data points
##PAGE= N=1
##DATA TABLE= (X++(R..R)), XYDATA
$$ [...]
19562d80115b39208a19449b6150P392B96598c10391j08037J46572A77520B0266
19551A33360I434K53916F7398a39078j0232L4506d7102A50183k4182J4868a82576
19539b56463h6546D364b51494B2223a78421J8514A09044c68998j41987a65916
19528a31154A14153b64843C51850a78834A96589D9793J23498d0314B7676J53331
19518A81007d8725j51672e5732C875J5678J48577q1045Q6756H1842O0996a53366
19506A03055e3168b3436o3358A1872i9410m5746j9348L6775h452k47828A19542
19494b820E1211a57397E3865b4306q7003j09310A21321l2414a05947G9130g9603
19482E865c4436k11846O8122P496M5286B437a60664P0083m8665o5109c3181j08355
$$ plain form
19562 -480115 -239208 -119449 -26150 -18758 296598 -310391 -418428 -271856 177520 20266
19551 133360 9434 263350 67398 -139078 -149310 -114804 -47102 150183 126001 140869 -182576
19539 -256463 -86546 4364 -251494 22223 -178421 -159907 109044 -368998 -510985 -165916
19528 -131154 114153 -264843 351850 -178834 196589 49793 173291 -40314 27676 181007
19518 181007 -48725 -200397 -55732 3875 19553 168130 87085 173841 81842 142838 -153366
19506 103055 -53168 -23436 -86794 11872 -99410 -145156 -164504 -127729 -8452 -256280 119542
19494 -2820 51211 -157397 53865 -24306 -111309 -220619 121321 88907 -105947 79130 -79603
19482 5865 -34436 -246282 -178160 -170664 -125378 2437 -160664 -90581 -139246 -204355 -33181 -141536
19470a41536I3759d744j7715c069l95j32777j27955J10042N0367L5485l4788j56022
19458b59112j1627A28971c71494A75992c00038I8603l735A2122e8452j67533O0983
19447a65002c4872j35958A14672C3786a53538H3143a62200O3902j49813A09485
19436b67485B15486b3278j77313a0894r552l5399j30889q008i0832a9098D7252
19424d2837B00354C0584b03232i8813j04788J0957g4737r8229O7549B45276c35077
19412b12655e8851C7921J17072P9732b87298j7997C6292R4022i1147A10620c3207
19400a00284b84j6627l53885b6655p8988M0681c0417B06232f2889F1506b97591
19388a44243n4760A17213c23241a42938O6622j6543C2950M8593J78392c35552
$$ plain form
19470 -141536 93759 -4744 -22459 -3069 -3464 -136241 -264196 -154154 -103787 -68302 -103090 -259112
19458 -259112 -270739 128971 -371494 175992 -300038 98603 94868 12122 -58452 -225985 -165002
19447 -165002 -34872 -170830 114672 33786 -153538 83143 -162200 -98298 -248111 109485
19436 -267485 215486 -23278 -200591 -10894 -20446 -55845 -186734 -194742 -90832 -19098 47252
19424 -42837 200354 30584 -203232 -98813 -203601 -192644 -74737 -172966 -105417 245276 -335077
19412 -212655 -58851 37921 154993 234725 -287298 -305295 36292 130314 -91147 110620 -33207
19400 -100284 -284 -16911 -370796 -26655 -105643 -64962 -30417 206232 -62889 61506 -297591
19388 -144243 -199003 117213 -323241 -142938 -76316 -92859 32950 81543 259935 -335552
19377i9836q188M955D8470a23122M2248a8471B67431f8755H8098l4616b23226
19365A46921g1097o3848A00241e3457B31019B3831J25235a21880C843a55207o3155
19354b18362A9584a96604A00604c92598C4972h6986D2751b21560B03734i8800
19343a2130C0406K7908e1644A27527d35815f0609n8561p1956h8239j23891C05634
19331c5429j02935j09341q7021A35497a35560G4297b45046O5490J5627d1814k30770
19320b72584M8063J11019k6985J0255b0425c407k17135I7194a16509B25937a42145
19308D9358c14926A54260O739c54609B77841J8527h8292j53327a03744B2913A0332
19296a04061b3506A20901a02843M7567A48253a0642n78680K77546R6587l8574
$$ plain form
19377 -99836 -108024 -103069 48470 -123122 -80874 -18471 267431 -68755 88098 53482 -223226
19365 146921 -71097 -134945 100241 -53457 231019 23831 149066 -121880 3843 -155207 -218362
19354 -218362 19584 -196604 100604 -392598 34972 -86986 42751 -221560 203734 -98800
19343 -12130 30406 58314 -51644 127527 -435815 -60609 -119170 -191126 -88239 -212130 305634
19331 -35429 -138364 -247705 -334726 135497 -135560 74297 -245046 -179556 -163929 -41814 -272584
19320 -272584 -224521 -113502 -140487 -130232 -20425 -3407 -220542 97194 -116509 225937 -142145
19308 49358 -314926 154260 160999 -354609 277841 296368 -88292 -241619 -103744 22913 10332
19296 -104061 -23506 120901 -102843 -55276 148253 -10642 -589322 -311776 -215189 -253763
19286b53763k5570f8917b2514C20320c35248l1803d0266r7701I002J11392a52769
19274e6890K3299k2205A43156j2237N2763b4576q2692B5543N8811c99052A42998
19262A1677M104a37198A04184f4401B2134h4299l3056p2445J8099b6932k4666
19251e1598k39245c1453J3281g804k06228g3721b8950k33698k14019b19542F0720
19239B11062r0765j1822a05603B87914h370B96496D6758c8885E7010j8757J04374
19228A42627A6689a61435e0212n0652K4608o63k37535J16183k03216A60036a8540
19216a72770D23648F0425A9047N349a5073C5875a12434A71564L446a79878e7673
19204H9657c10961f5401G0793J8085i8258J0075C0942O5194a1626k01131B6667
$$ plain form
19286 -253763 -279333 -68917 -22514 320320 -335248 -367051 -40266 -137967 9002 120394 -152769
19274 -56890 -33591 -55796 143156 130919 183682 -24576 -107268 25543 84354 -399052 142998
19262 11677 15781 -137198 104184 -64401 22134 -84299 -117355 -189800 -171701 -26932 -51598
19251 -51598 -290843 -31453 -18172 -7804 -214032 -73721 -28950 -262648 -476667 -219542 60720
19239 211062 120297 108475 -105603 287914 -8370 296496 46758 -38885 57010 38253 142627
19228 142627 16689 -161435 -50212 -100864 -76256 -76919 -314454 -198271 -401487 160036 -18540
19216 -172770 423648 60425 19047 24396 -15073 35875 -112434 171564 175010 -179878 -57673
19204 89657 -310961 -65401 70793 88878 -98258 -88183 30942 96136 -11626 -212757 26667
19192a12185r5939h8367A8755h1091k93798H6753C2433f7250B70062b5935j22626
19181a48561F45790a14261M2295A07482a73475L0944A20667c64945J32402A49221
19170b72265h325l04207A02640B1059J18527k8110L74815c20724A2675b64692
19159a27342H0173e054j67746O4586G5850Q5061b9735j8294A4361d4758k28897
19148b73655g421A22490c7648H4713c88312J75526E8319p818e0960m0594j02847
19137a94401a1571j18591e6748j3918I7697l2010K2110k9124B7269b59602D9368
19125a61121A51784b15436C6937L33319a09095m50945E489K41978o6637K42265
19115D23095b0476l07016F1529b94686F90a21887B2618i4161B74232C753K24370
$$ plain form
19192 -112185 -208124 -88367 18755 -81091 -374889 86753 32433 -67250 270062 -25935 -148561
19181 -148561 645790 -114261 -71966 107482 -173475 -142531 120667 -364945 -232543 149221
19170 -272265 -8325 -312532 102640 21059 139586 111476 486291 -320724 12675 -264692
19159 -127342 80173 -5054 -172800 -108214 75850 160911 -29735 -48029 14361 -44758 -273655
19148 -273655 -7421 122490 -37648 84713 -388312 -212786 58319 50501 -50960 -91554 -194401
19137 -194401 -11571 -130162 -56748 -70666 97697 65687 87797 58673 27269 -259602 49368
19125 -161121 151784 -215436 36937 370256 -109095 -560040 5489 247467 180830 423095
19115 423095 -20476 -327492 61529 -294686 690 -121887 22618 -94161 274232 3753 228123
19104B28123A6845f406k7219k4171l62858Q1715B8210i3272j27606L6995H16c76164
19091b05852j32583n2524J00356a01357F8279N3299a06152B20341a50821m1733
19081a92554C8118J64732a58646L6797b8126q5153A93225a47521k0075B19883
19070b21826e3062q9067B40387a05819j42612O6681l4068H7558g0365A07900g8618
19058a74994o2361h7853B1537b5693k8090a0271k25152A82142c16344d6382A07619
19046b65212i0881A87187A9162N255i7980k17173A54222b17085C56327f0452A94032
19034A51842c9938I2169Q8927G0277b09587D4615J85740c3665A45309a50230A07584
19022b24101A52924c26187a23658k6564g015j6443k29042A10657c05750C47980
$$ plain form
19104 228123 16845 -6406 -33625 -57796 -420654 -338939 28210 -93272 -220878 -183883 816 -376164
19091 -205852 -338435 -390959 -290603 -101357 68279 121578 -106152 220341 -150821 -192554
19081 -192554 38118 202850 -158646 -121849 -28126 -113279 193225 -147521 -167596 219883
19070 -221826 -53062 -142129 240387 -105819 -248431 -181750 -215818 87558 -70365 107900 -78618
19058 -174994 -237355 -87853 21537 -25693 -53783 -10271 -235423 182142 -316344 -46382 107619
19046 -265212 -90881 187187 19162 24417 -97980 -315153 154222 -217085 356327 -60452 194032
19034 151842 -39938 92169 181096 70277 -209587 44615 230355 -33665 145309 -150230 107584
19022 -224101 152924 -326187 -123658 -150222 -7015 -23458 -252500 110657 -305750 347980
19011g8224J2794j45645A73564g3530D4297c8757G3546J40404a03934f493q1335
19000h7828H3535d4271A82370a74886K4401p6637a9482o0304k16718C6301J89865
18989B26166b42402h6536l66637A48636a24002C89897A12634h8868A02187b7818
18978b97472Q6213b0802q1061C05718I9721L9244f6434A47710f4111G1325d9495
18966B04480A3463h2568A2985g4336A46568a71077C6762M7826Q8717g9614m7797
18955a27411j74976G0759f3958A36665j578d30707a14118o5168A01663C608b26438
18943B41293f0433A33694a72586O0572o6177g9759A50619c4140m8627k14730g0868
18931H089P295d9676I5980l6810g1469K2100J9274G6108e0116j25723m4795B31459
$$ plain form
19011 -78224 -65430 -211075 173564 -73530 44297 -38757 73546 213950 -103934 -6493 -87828
19000 -87828 83535 -44271 182370 -174886 -150485 -227122 -19482 -79786 -296504 36301 226166
18989 226166 -242402 -86536 -453173 148636 -124002 389897 112634 -88868 102187 -27818
18978 -297472 -211259 -20802 -101863 305718 99721 138965 -66434 147710 -64111 71325 -49495
18966 204480 13463 -82568 12985 -74336 146568 -171077 36762 84588 173305 -79614 -127411
18955 -127411 -302387 70759 -63958 136665 135087 -430707 -114118 -179286 101663 3608 -226438
18943 241293 -60433 133694 -172586 -112014 -178191 -79759 150619 -34140 -82767 -297497 -70868
18931 8089 15384 -49676 95980 59170 -71469 -49369 -30095 76108 -50116 -175839 -220634 231459
18918C03774e20705b15270a7431B10007b52286A49487l8564E0014L702c77374
18907A98215b31971p386I2861b13006E5768b24916B4758b84061A84196A8125M4225
18896F2350f2353C05321a48584e0242j52948B4369c9259A29415C2682J2883a43721
18884c135j19894q5231f6900B18621f6890l3872K7987A51381d70141a95696g5669
18872A13806a31727j3618i113C6470c21329a31946j9264D5821h747k79183F453
18860a45533o7090a3226k14747Q1739j23722c0827n4668n9835d8218A19267h7530
18848d9082j08787p0918I6818a14257C3539b2749G4159c7754E9081a45119i565
18836b03687A48587A9259o571J45052e2980J2104r4904A62303f8923D2056J27363
$$ plain form
18918 303774 -520705 -215270 -17431 210007 -252286 149487 110923 50014 53716 -377374
18907 198215 -231971 -239357 92861 -213006 55768 -224916 24758 -284061 184196 18125 62350
18896 62350 -62353 305321 -148584 -50242 -203190 24369 -39259 129415 32682 45565 -143721
18884 -3135 -123029 -208260 -66900 218621 -66890 -100762 -72775 151381 -470141 -195696 -75669
18872 113806 -131727 -145345 -9113 36470 -321329 -131946 -151210 45821 -8747 -287930 6453
18860 -145533 -212623 -13226 -227973 -146234 -269956 -30827 -85495 -145330 -48218 119267 -87530
18848 -49082 -157869 -228787 96818 -114257 33539 -22749 74159 -37754 59081 -145119 -9565
18836 -203687 148587 19259 12688 157740 -52980 -40876 -135780 162303 -68923 42056 169419
18825A69419a40418c1723J1412p0578m380A1965g4266j39440E0650K83318A486
18813a48696b7728j44364e4131C42597n0228k9198b47660B48564c06139i3677
18802c16030O728B03500i863A9710a9033B5907b41936I7543j8759b29764e5642
18790C0096a36818k50456J11749C1001a83864M1893q0607j88816a79416l4509
18780b13925E9822a48261F6085a83119h4885j04905k76381E2269b65263B8813
18769E3878a36531B23013b50426D1071Q4600a30633j0803B02014b14206m0387
18759b54593J26683k35691C51686b04125A46982i6230A71924B5067g3765I203
18748A77393b1793B58698p3740d87312d8690F5937A4668e9951D6294a8773D4853
$$ plain form
18825 169419 -140418 -31723 -20311 -90889 -95269 11965 -74266 -213706 50650 333968 1486
18813 -148696 -27728 -172092 -54131 342597 292369 263171 -247660 248564 -306139 -93677
18802 -316030 -309302 203500 -9863 19710 -19033 25907 -241936 97543 78784 -229764 -55642
18790 30096 -136818 -387274 -275525 31001 -183864 -141971 -222578 -411394 -179416 -213925
18780 -213925 59822 -148261 66085 -183119 -84885 -189790 -466171 52269 -265263 28813
18769 53878 -136531 223013 -250426 41071 125671 -130633 -141436 202014 -214206 -254593
18759 -254593 -127910 -363601 351686 -204125 146982 -96230 171924 25067 -73765 9203
18748 177393 -21793 258698 184958 -487312 -48690 65937 14668 -59951 46294 -18773 44853
18736b5105k10352B16041k3665C441K88923D2464Q176a40370r5690R0900e4190
18724A03668j1347i2378b244d47j20842b1400l39838C4864c6274J7042n2080C18348
18711d9958q5955k02164E0325c75015f7597B1541Q4498c36404B44441b19170Q4552
18700a34618j57003K1725a16068A43322C3067b44794B82888a54181g1427M632
18690f6795n1992A1059P8567k5123a95187A20219N9051e5834o7940l9687e7770
18678C07591a48386a8603o5806J4443A84824m4726K8418o0573p068g9433A57540
18666e1560D00K932J11840e16958G1098c5398M132j48461B08149b4049j17897
18655a41946b7351F1628b41136J1996I0309d4906l3880j09219a5119j2646A36510
$$ plain form
18736 -25105 -235457 216041 192376 3441 292364 42464 50640 -140370 -236060 -145160 -54190
18724 103668 92321 -92378 -2244 -447 -121289 -21400 -361238 34864 -36274 -19232 -71312 318348
18711 -49958 -135913 -338077 50325 -375015 -67597 21541 106039 -336404 244441 -219170 -134618
18700 -134618 -291621 -269896 -116068 143322 33067 -244794 282888 -154181 -71427 -66795
18690 -66795 -118787 11059 89626 64503 -195187 120219 179270 -55834 -123774 -163461 -57770
18678 307591 -148386 -18603 -84409 -69966 184824 140098 168516 107943 100875 -79433 157540
18666 -51560 400 3332 115172 -516958 71098 -35398 -31266 -179727 208149 -24049 -141946
18655 -141946 -27351 61628 -241136 -229140 90309 -44906 -78786 -188005 -15119 -27765 136510
18643G1397a59584C6949J08537a23192k1459p1944c5819C2748a25462j94258J53029
18632a66691A10132b56139p9379a31540j38358D7156f1173o3880d5091Q104r5483
18621a32470j25913A21573a36735f2235A54328n0763a06422F1020q080a50068
18610A28457D3242M7938a26850A3959l369a30146j04592M8805f241I697J41561
18599A51258k2927a61578l8998b8568l04395a05497l25485I778R4902J03634M5472
18588B53786a53573I3596j9926N6912a28393A19769j9734j4136b19701I7597g2338
18576A40359a88677A22184P3032E6775a97555L6551I4571c42107I5211m2050b6453
18564a10030a9057k21991B47313a27589A45347M1476g4248p0514A37752Q8708
$$ plain form
18643 71397 -159584 36949 145486 -123192 -144651 -216595 -35819 32748 -125462 -319720 -166691
18632 -166691 110132 -256139 -335518 -131540 -269898 47156 -61173 -125053 -45091 -36987 -132470
18621 -132470 -258383 121573 -136735 -62235 154328 103565 -106422 61020 52940 -150068
18610 128457 43242 91180 -126850 13959 10590 -130146 -234738 -185933 -6241 9697 151258
18599 151258 128331 -161578 -200576 -28568 -332963 -105497 -430982 9778 104680 208314 253786
18588 253786 -153573 93596 73670 130582 -128393 119769 100035 85899 -219701 97597 -72338
18576 140359 -188677 122184 195216 56775 -197555 -161004 94571 -342107 95211 53161 -26453
18564 -110030 -19057 -241048 247313 -127589 145347 186823 -74248 -144762 137752 226460
18554B26460c35343c3467k97547E6123a8985A31376k0327c12258A9852K43737
18544B63589h922q4682A56153n1759i907j27742L9208A80259q9825N8485a9330
18532e23920H7156a01091a0687C7031M8917b6716l15437F6845k0447L8258a54249
18520B66066a8885o2122m3511r3340J7451A06406c57959d9991A18874a8010j74096
18509a92106A37796K9413a90270Q3879b292j24471B61430b0528D0319e0152j27874
18498a78026d8603B9538a41177n0897B4274Q8443E4569b70169M4707f330J620
18487d710p7874b6563j0604q521D7020b05626j64764K7450A66919o5283a66376
18475E803f2213k4969m52j36275d1008j5004j86311O3806H2014i1135G8500a39931
$$ plain form
18554 226460 -335343 -33467 -331014 56123 -18985 131376 111049 -312258 19852 263589
18544 263589 -8922 -93604 156153 104394 -9907 -137649 -98441 180259 90434 148919 -19330
18532 -523920 87156 -101091 -10687 37031 85948 -26716 -342153 66845 46398 84656 -154249
18520 266066 -18885 -81007 -124518 -217858 -200407 106406 -357959 -49991 118874 -18010 -192106
18509 -192106 137796 167209 -190270 -106391 -2292 -126763 261430 -20528 40319 -50152 -178026
18498 -178026 -48603 29538 -141177 -192074 24274 112717 54569 -270169 -225462 -6330 -4710
18487 -4710 -82584 -26563 -37167 -45688 47020 -205626 -370390 -342940 166919 101636 -166376
18475 5803 -62213 -87182 -87634 -223909 -41008 -56012 -242323 -178517 82014 -91135 78500 -139931
18462a00198B94562C0255J5901J73895A152N776e2141A10674d0393m1933n6232
18451a38558L2214K4574k5995d6139Q734j14858k0983D9041M022a53438C8453
18439B89994F5707b1794D250K8243K6350a15628B21068g4203B7369b13328K335
18428b10993C54723a50901E906c07261K8074J3744L0778a9383l13916e0004q2885
18417a32889A17543a87650e9624A82441A1539J19105a23378C5919c9831B28858
18406B85585F3075b29322h3902A29103A3207a8085A33882J12394C2748K10284
18396B43032b10592M4079L4949D6414a21560a1161A46427P7588e7596j05688B4673
18384D8270f7569B11806d8994j02740n7492g8428o1009B73399a68736A41795g7241
$$ plain form
18462 -100198 294562 30255 46156 220051 1152 6928 -52141 110674 -40393 -82326 -138558
18451 -138558 -106344 -81770 -107765 -46139 -37405 -152263 -173246 49041 53063 -153438 38453
18439 289994 65707 -21794 4250 32493 58843 -115628 221068 -74203 27369 -213328 -210993
18428 -210993 354723 -150901 5906 -307261 -279187 -265443 -234665 -19383 -333299 -50004 -132889
18417 -132889 117543 -187650 -59624 182441 11539 130644 -123378 35919 -39831 228858
18406 285585 63075 -229322 -83902 129103 13207 -18085 133882 246276 32748 243032
18396 243032 -210592 -166513 -131564 46414 -121560 -11161 146427 224015 -57596 -163284 24673
18384 48270 -67569 211806 -48994 -151734 -209226 -78428 -139437 273399 -168736 141795 -77241
18372a38665n9441M60k7240H3481b56528K356J7468a0818n6722J3698p8357A22140
18359b05294C37549A54443c87778J56856B6379a84102j75108h2518L0071H5912
18348b29854i6911H0962b13705B4125d19358N2620I9809J64090a24922A49744
18337f6799H3526g7431r6185K8836A9979a60042N4004j21861N6182A96777f3932
18325G1211f6210k1276r2996E6883a25438f692k04856j3332C8769J28499c9973
18313C6137b53324I3356a54119f0046K5573m9175G1726l0758a23381j93831D18
18301e5672G4594b86480j0020d538l0041p0440J3653B3326O9930F185a4409j00789
18289a15198L437D09594G6354A6097Q4566O9922a89386g336B36637O4520E286
$$ plain form
18372 -138665 -198106 -197646 -224886 83481 -256528 -254172 -236704 -10818 -67540 -53842 -132199 122140
18359 -205294 337549 154443 -387778 -230922 26379 -184102 -359210 -82518 -52447 85912
18348 -229854 -96911 80962 -213705 24125 -419358 -366738 99809 263899 -124922 149744
18337 -66799 83526 -77431 -173616 -144780 19979 -160042 -106038 -227899 -171717 196777 -63932
18325 71211 -66210 -87486 -180482 56883 -125438 -6692 -211548 -224880 38769 167268 -39973
18313 36137 -253324 93356 -154119 -60046 -34473 -83648 71726 40968 -123381 -317212 418
18301 -55672 74594 -286480 -296500 -4538 -34579 -105019 -91366 23326 93256 6185 -14409 -115198
18289 -115198 -111761 409594 76354 16097 100663 170585 -189386 -7336 236637 301157 5286
18277f7632j03318D3354h0692a5653A3097D052b80031a12185c9742A64213a93906
18265a74006F4641A5053a30754k30203D3429j86M9037O9507i8592C7746b54061
18253A24935a534r4254A62486C0523a72455A14019g3089A22337b07017o381B04150
18241c65762a42662n0790f7723E1918K49723A21744a46086M2671D4271b58179
18230A5781b4296m4869B27325a26157M8878B92154f7283A29626l8223d0437j32571
18219a73008B56798h7741A10239b12416E8575d22070J88932e8772j84055a13944
18208c35943I6052J19089a43020I4706b62618h0896j42343E577J43100E9167K8395
18197H7562h7828l1926A13183L9282b27943C7609h3601l19581R5863A02966a61987
$$ plain form
18277 -67632 -170950 43354 -80692 -15653 13097 4052 -280031 -112185 -39742 164213 -193906
18265 -174006 64641 15053 -130754 -360957 43429 43243 92280 161787 -98592 37746 -254061
18253 124935 -1534 -95788 162486 30523 -172455 114019 -73089 122337 -207017 -213398 204150
18241 -365762 -142662 -193452 -67723 51918 301641 121744 -146086 -103415 44271 -258179
18230 15781 -24296 -69165 227325 -126157 -77279 292154 -67283 129626 91403 -40437 -173008
18219 -173008 256798 -87741 110239 -212416 58575 -422070 -233138 -58772 -242827 -113944
18208 -335943 96052 215141 -143020 94706 -262618 -80896 -223239 5577 148677 59167 87562
18197 87562 -87828 -119754 113183 152465 -227943 37609 -83601 -403182 -307319 102966 -161987
18185b66565A8286c7666a6626j1689l73753A62880j4824J47865a09118l3887A05712
18173b40259C3785J75561r0478J07281b66176a3847r903A71356a314p1944j7226
18162i0484c6739A82543e3745k35715P5874P7730C490a0928l59064A37547b26226
18150A34532j8664m7972a65816j48420I5149a77249H4369b01534k9312j14772
18140c45618h5037F4915N9650g9904b5880r1061A88124f2656k5447B870c40205
18128a25603A07732D2753f5405j74321C1226J61210a59288D9212D138b45989k0529
18117b66518h7452a0580j09182j6512A34808P9893c00812H6391B8553J8803i7048
18105D15322A01209c23910F2817K17901b97519C20455b2328q1821j89548G0355
$$ plain form
18185 -266565 18286 -37666 -16626 -28315 -402068 162880 148056 295921 -109118 -143005 105712
18173 -240259 33785 209346 118868 226149 -266176 -13847 -23750 171356 -1314 -73258 -90484
18162 -90484 -36739 182543 -53745 -289460 -213586 -135856 3490 -10928 -369992 137547 -226226
18150 134532 115868 67896 -165816 -314236 95149 -177249 84369 -201534 -230846 -345618
18140 -345618 -85037 64915 124565 -79904 -25880 -116941 188124 -62656 -88103 2870 -340205
18128 -125603 107732 42753 -65405 -239726 31226 192436 -159288 49212 4138 -245989 -266518
18117 -266518 -87452 -10580 -119762 -136274 134808 214701 -300812 86391 28553 47356 -97048
18105 415322 101209 -323910 62817 280718 -297519 320455 -22328 -104149 -293697 70355
18094H4631b57214b6697A48741a15432e5432l7120Q903j88139B52858h7589j2116
18083i9705l1690j25969J28348b0330j50187d85A50165o5272d914j05672A28204
18071A5067b65063F4190b21584k0379A32029c3798A91495B0173b27182E1507r65
18060E0542K72276A52849b98340I3561c7167k813n7499H9380j3135O5790a48853
18048I3400a35297C6386c9320j9826A25626b26043G5003d5666n2698l472d601
18036a53884B2926a22224G1267J83972L3644o6239c49067a0557k06188A62338
18025i3172k11312D0954J9630a74291m9148h908I2451h6841c671o787k20311d2246
18012E4693b39168C3317L3341b40597e7451G750J13180K7478E5638R5954b40733
$$ plain form
18094 84631 -257214 -26697 148741 -115432 -55432 -92552 -83649 -271788 252858 -87589 -99705
18083 -99705 -131395 -257364 -129016 -20330 -170517 -485 150165 84893 -4914 -110586 128204
18071 15067 -265063 64190 -221584 -241963 132029 -33798 191495 20173 -227182 51507 50542
18060 50542 322818 152849 -298340 93561 -37167 -39980 -97479 89380 76245 142035 -148853
18048 93400 -135297 36386 -39320 -59146 125626 -226043 75003 -45666 -98364 -101836 -4601
18036 -153884 22926 -122224 71267 255239 288883 222644 -349067 -10557 -216745 162338
18025 -93172 -304484 40954 60584 -174291 -223439 -8908 92451 -86841 -3671 -10458 -230769 -42246
18012 54693 -239168 33317 66658 -240597 -57451 7750 120930 148408 55638 151592 -240733
18000b60542P3991D93320A22422b14575A3459b3815I3593J89337j33210i1625
17989B29512e7395B67808b5019p189H7961a63375C05177g790C9621J61559a22089
17977A95593a25597A22011l362a45948j28112E2518a61902A39326l8874b28291
17966b02586A64174E9600C631L5537K4479a87007G8185b9222j10393H6158a69319
17954a42979j21131f9186j90693A91733J99715G8484c69552I314b95006C7924
17943G0664b6806J1064k41490f6629c1391k68853a15991A02075J3066K8484p1111
17932G2514c50926c8453l81536b2439A00882K51451h7018B79733I9753b24167
17921b28106P9871E2029k1757a35390b5188i890C16593h8827Q48H8940J77994
$$ plain form
18000 -260542 -186551 493320 122422 -214575 13459 -23815 93593 282930 149720 -91625
17989 229512 -57395 267808 -25019 -32208 87961 -163375 305177 -7790 39621 201180 -122089
17977 195593 -125597 122011 118649 -145948 -274060 52518 -161902 139326 100452 -228291
17966 -202586 164174 59600 3631 39168 63647 -187007 78185 -29222 -139615 86158 -169319
17954 -142979 -264110 -69186 -259879 191733 391448 78484 -369552 9314 -295006 37924
17943 70664 -26806 -15742 -257232 -66629 -31391 -300244 -115991 102075 115141 143625 72514
17932 72514 -350926 -38453 -419989 -22439 100882 352333 -87018 279733 99753 -224167
17921 -228106 -148235 52029 30272 -135390 -25188 -9890 316593 -88827 -87979 88940 266934
17910B66934D2248a62191a280j61251B34171Q630i5459j59221m5228B8566M0666
17899F9232K22131f8787q677g26D6849K53653D4362K25453a82256B91251b1676
17887A82169d3497C5679b551j32822D5556N4328a42993G9438l6614b39999I9149
17875b90062k7052f6586B49607i3844a6220A261e741D7528O1397b01912D87742
17863A37978R1345b13513d6513B5951c2118l6038j37528A61242a09189A1197K51517
17852B62714b8070k0802A64180N5267B6192J20229a77155A27159J04576R4562
17842C26297a11140N5059C08598j03145I6990a43621A42132e8412H9686c40540
17831F9284J34657a3174D5302J88760b46298A08756O7756K19594j05150G6959
$$ plain form
17910 266934 42248 -162191 -1280 -162531 234171 242801 -95459 -254680 -299908 28566 69232
17899 69232 291363 -68787 -77464 -726 46849 300502 44362 269815 -182256 291251 -21676
17887 182169 -43497 35679 -2551 -135373 45556 99884 -142993 79438 42824 -239999 99149
17875 -290062 -317114 -66586 249607 -93844 -16220 1261 -5741 47528 108925 -201912 487742
17863 137978 229323 -213513 -46513 25951 -32118 -68156 -205684 161242 -109189 11197 262714
17852 262714 -28070 -48872 164180 219447 26192 146421 -177155 127159 231735 326297
17842 326297 -111140 -56081 308598 205453 96990 -143621 142132 -58412 89686 -340540
17831 69284 203941 -13174 45302 234062 -246298 108756 176512 396106 290956 76959
17820F0412b2723j23870A91596i13j2154F5749e8001j14407A56315E5830a852
17808a73580G4475b17542F3522h2382m2707C15609G0372L4326o954L8040K3670
17797A59454a5170C52142j50912G0533a5183j08395j14838H3801E930g3867C64957
17785b19977d4263k02490A39974B6672h0455C6665a41661k1116D9222i4451A11509
17773A48796c67791I2675A7203J02967d7512B20513e7181k31717A88589D8276
17762b21626i1534j18591O3536A77206b93885m1687B3479a49081D7595g4882B46811
17750c73501h1928H3716b43198R4176m3249e3147j89296Q6080B17025a83209A8614
17738C28239a97971Q7231E5644K52188a02979k33104f9890L4083A44033b99699
$$ plain form
17820 60412 -22723 -146593 191596 -913 -13067 65749 -58001 -172408 156315 55830 -1852
17808 -173580 74475 -217542 63522 -82382 -125089 315609 70372 104698 97744 135784 159454
17797 159454 -15170 352142 201230 70533 -15183 -123578 -238416 83801 5930 -73867 364957
17785 -219977 -44263 -246753 139974 26672 -80455 36665 -141661 -162777 49222 -94451 111509
17773 148796 -367791 92675 17203 120170 -47512 220513 -57181 -288898 188589 48276
17762 -221626 -91534 -210125 -146589 177206 -293885 -335572 23479 -149081 47595 -74882 246811
17750 -373501 -81928 83716 -243198 -149022 -192271 -53147 -242443 -156363 217025 -183209 18614
17738 328239 -197971 -110740 55644 307832 -102979 -336083 -69890 -35807 144033 -299699
17727C92002c1303B90992a37935c5899C26596G4074a55228f3537r6815A88508
17716a10656c1177A59485g1323A58994a17058m9613f8228A62577f7168j44635
17706b11803A71869C6867K39930f5626b6955j02707N3398A34982b30025C01922
17695A20044h6415A40958a26524K3766A49143o362c0980C8792a36084C46052A59126
17683B1058I154K04859a32829a47D4411c1806j90184h7592B58839b25372K2419
17672b02953B04698a02946o1978C41673A45948a79379Q0679A37899C5530a80556
17661a40316B48298A20551E8593d5198A7087M494e2190l4756D06186a86619l6734
17650b23353k46980A20359b48499A40024K9196f8163j0424J2309k998A37398A3
$$ plain form
17727 392002 -31303 290992 -137935 -35899 326596 74074 -155228 -63537 -160352 188508
17716 -110656 -31177 159485 -71323 158994 -117058 -166671 -68228 162577 -67168 -211803
17706 -211803 171869 36867 276797 -65626 -26955 -129662 -76264 134982 -230025 301922
17695 120044 -86415 140958 -126524 -102758 149143 142781 -30980 38792 -136084 346052 159126
17683 21058 9154 214013 -132829 -147 44411 -31806 -221990 -87592 258839 -225372 -202953
17672 -202953 204698 -102946 -164924 341673 145948 -179379 -98700 137899 35530 -180556
17661 -140316 248298 120551 58593 -45198 17087 21581 -52190 -86946 406186 -186619 -223353
17650 -223353 -470333 120359 -248499 140024 169220 -68163 -78587 -66278 -69276 137398 13
17638G8315a01400A44914E4402a98289A75624o6591b37194j55756D4206Q338j1127
17627D1417J33547D2996O7711b36118f670j89508A32844B6621L32945C8133b1377
17615C08338j387a64523B17515I999K7767e9393b0028j11774B0522L16923A26137
17603A28768f7017A16342D4771L34704A37329p349a78439o9757a3736D252L71096
17592C75348b5083r9793e8837H0095N5761I88a6638C4042j0326a37757C05040
17580a20076A7565K73057H6304E00f5051j46443M2598O0157B7730L10226C4828
17568D9244J2834c12545A84982K5582e7135C07164r9328E3692b34684g5584A75635
17556c4992F1756K28566C1972a57228B89032o4961a4603C5073J74046R7123l5219
$$ plain form
17638 78315 -101400 144914 54402 -198289 175624 109033 -237194 -392950 44206 52544 41417
17627 41417 174964 42996 110707 -236118 -6670 -196178 132844 26621 359566 38133 -21377
17615 308338 306951 -164523 217515 9999 37766 -59393 -20028 -131802 20522 337445 126137
17603 128768 -67017 116342 44771 379475 137329 129980 -178439 -248196 -13736 4252 375348
17592 375348 -25083 -124876 -58837 80095 135856 988 -16638 34042 23716 -137757 305040
17580 -120076 17565 290622 86304 500 -65051 -211494 -168896 -108739 27730 337956 34828
17568 49244 62078 -312545 184982 210564 -57135 307164 207836 53692 -234684 -75584 175635
17556 -34992 61756 290322 31972 -157228 289032 224071 -14603 35073 209119 306242 271023
17545B71023b60285l86631E1168a05343K5037A58867J519a44802A14578n1892
17535F2686a54871A03704C1827i4280B55946a95698A07115K01356E2927J56577
17525B09504b96098B38621e371C7133J0823J41878G7298R0246l9402R02h6011
17513B68485a94478f4912B33061p3652m2845D5276f8421B22271J5590P3887a8314
17501I3500K7270Q2362b28310A20562J91937k8180d3067D47166k15654a25350
17490d7887B25051m8255j1229J63660A44610a34258A27465o3225L39572b7946
17479b03868A73030J36369I7193c2595C96549J844m9665I1779J65104J1461H2286
17467A65127K8523L3085L855b5700A37450k4120a4488A07020K36975j32266K11401
$$ plain form
17545 271023 -260285 -646916 51168 -105343 -80306 158867 160386 -144802 114578 62686
17535 62686 -154871 103704 31827 -94280 255946 -195698 107115 308471 52927 209504
17525 209504 -296098 238621 -5371 37133 47956 189834 77298 167544 128142 129044 -86011
17513 268485 -194478 -64912 233061 159409 116564 45276 -68421 222271 237861 311748 -18314
17501 93500 120770 203132 -228310 120562 312499 284319 -43067 447166 231512 -125350
17490 -47887 225051 176796 165567 329227 144610 -134258 127465 64240 403812 -27946
17479 -203868 173030 309399 97193 -32595 396549 398393 348728 91779 256883 268344 82286
17467 165127 193650 226735 230590 -25700 137450 113330 -14488 107020 343995 211729 423130
17456D23130j25886J19668A19097J75143j4285N8417n4123l4268N9030A08029
17445B30897J0273J43748A10601J52893L04492C515K33110K27753D5139R8187
17435A43326b7724B97600g1598A79613L22230k25122F9885L11437b1941D15512
17424c9310C35333j28361P4503k5203j13420P7914p0502C0328J20735O5221p5074
17413A41210O8153Q7501m7157H0382c0192A20418K35545J67957j90386o7567j03141
17402A62826j9262e3983R234B35961m3106F2248J74332O9739j21009K31583A67368
17390D67808e3810I5613K65615H5566J69443a30125D6937K70691a49079A60383
17379A97433J5906L0237l2142a20094r9754I7523l7097K11910L0568a24178e4382
$$ plain form
17456 423130 297244 416912 119097 294240 279955 338372 284249 249981 309011 108029
17445 230897 241170 384918 110601 263494 567986 3515 236625 464378 45139 143326
17435 143326 -27724 297600 -71598 179613 501843 276721 69885 381322 -21941 415512
17424 -39310 335333 206972 281475 256272 142852 220766 150264 30328 151063 216284 141210
17413 141210 209363 296864 249707 80382 -30192 120418 355963 523920 333534 265967 162826
17402 162826 143564 -53983 -44749 235961 192855 62248 236580 306319 185310 416893 167368
17390 467808 -53810 95613 361228 85566 255009 -130125 46937 317628 -149079 160383
17379 197433 213339 243576 211434 -120094 -219848 97523 60426 272336 302904 -124178 -54382
17367G7515L51192K6682a21667F7641c3288l7764B60323o9723n993K35455A31167
17355B14663A2913L17442m1428j21073J372c7510C55166A0486J44540i9282A5960
17343A28198a1920r8975A89971b37843h3497A17639b5300A96633J24771I3777
17332B44698a97598C66386A32097L0687M293L8457g3287A54760J56544j55583
17322A55721J5606J54811A62853F6513M8113L24221d4463B1563L61902j0135A27424
17310A32643N9898f1704n9970B67891q9120g9542A49523a48184A1015J13456C1651
17298C74245r2480j24726J15164A17670K02646j69j31243r2803L2496N6016l7783
17287A46830D8455J31543J06412J71366A48504o5696K59579i6348D09541A24240
$$ plain form
17367 77515 428707 455389 -121667 67641 -33288 -71052 260323 190600 184607 420062 131167
17355 214663 12913 330355 288927 167854 169226 -37510 355166 10486 155026 -99282 15960
17343 128198 -11920 -110895 189971 -237843 -83497 117639 -25300 196633 321404 93777
17332 244698 -197598 366386 132097 162784 167077 205534 -73287 154760 311304 155721
17322 155721 171327 326138 162853 66513 114626 438847 -44463 21563 383465 373330 127424
17310 132643 192541 -61704 -121674 267891 178771 -79542 149523 -148184 11015 124471 31651
17298 374245 281765 157039 272203 117670 320316 320147 188904 96101 128597 184613 146830
17287 146830 48455 179998 286410 457776 148504 82808 342387 -96348 409541 124240
17276c1128A25528P3099q8647P0516n2410a558j09623E77254A46713J0217n8889
17265I8041R1342B7296K27116P3653n8790a10210M5205G1818c1685D3908J40796
17254A84704M3366H0140J37778a26824H3900K1975J20449f9040C78271G403L52268
17243C59671a50923C77802o4703A31631K96535B8478R4225k237K50719A82919
17232e6627B44412K17940A84694Q1558D9440N09008p6953A48864D5665L63525
17222D09190A61801K6130N8459o5768J12084K59975B21592R6974l2112b11209
17211A43116J02440o3099N04332C03783k6748K00239H9973K37123K37436j66185
17201C98347A78213q2305L94494J0778j40565j63516I4860N86301J62591C09289
$$ plain form
17276 -31128 125528 198627 109980 180496 128086 -1558 -111181 577254 146713 156930 98041
17265 98041 189383 27296 254412 328065 269275 -110210 -65005 71818 -31685 43908 184704
17254 184704 228070 80140 217918 -126824 83900 105875 226324 -69040 378271 7403 359671
17243 359671 -150923 377802 313099 131631 428166 28478 122703 120466 371185 182919
17232 -56627 244412 462352 184694 266252 49440 558448 481495 148864 45665 409190
17222 409190 161801 187931 246390 180622 292706 552681 221592 318566 286454 -211209
17211 143116 245556 182457 686789 303783 277035 477274 89973 327096 564532 398347
17201 398347 178213 95908 490402 501180 360615 197099 94860 681161 843752 309289
17190B31685L24725B14774J82167E6470J66615J8616J91976j75042j030K9491
17180B87096p0445L61526k44534A21291N754O79711j42577j52995j39372j15780
17170B56032E8298J95652r4004N6400J84399j02339j3236O612j09046q2073K82964
17159C83627j64684n0318Q092M0229N8921A24958N1815N20007k55666j77634L21509
17148E84989j56669m6745O9431J0082k27237n8549M5949M49097C02364O7858m008
17137C66214K53584B89691k2702J41642I1482M15013k14389L9073l8326n8409
17127B34444J89394q8316N516l409m2635L07351j24547p8356L26727A76400N28319
17116G04719k65184Q3126A68567L85068k48534H4202R9504J64912l7408K49557
$$ plain form
17190 231685 556410 214774 396941 56470 223085 241701 433677 258635 257605 287096
17180 287096 216651 578177 333643 121291 127045 806756 664179 511184 371812 256032
17170 256032 58298 253950 159946 216346 400745 298406 285170 291782 182736 100663 383627
17159 383627 218943 168625 176717 216946 275867 124958 176773 696780 441114 263480 584989
17148 584989 428320 381575 451006 461088 233851 175302 221251 670348 302364 370222 366214
17137 366214 619798 289691 266989 408631 91482 506495 292106 331179 292853 234444
17127 234444 423838 335522 341038 337629 294994 602345 477798 399442 726169 176400 704719
17116 704719 439535 522661 168567 553635 305101 84202 183706 348618 311210 560767
17106E60767p0656j33553o9681n3639j15917M10000j77671K32326j57137j99977
17096B24862L70241B58967L1662Q7128J68344M0009r1904k3435k8676J6145J04715
17085E62955g0117B22801K8628J05389J60398j44314J09822B09508J22362J8416
17075C50286J59148J13455A96515M32623C01269P1289J64084k48936L53893j32128
17065E09471k38352J6033O7816K54246J26239l59952N75973m64289J25103k8521
17055E83767j32630K25769l16241L16224j91474k24024L70036m9013k71439J5510
17045C26485J64179j76995K86782k4513o2696L5794J49936B00600M90306k67208
17035D23698J74209k09835J21031K96335j94275j57392K13438j0938j37782K67913
$$ plain form
17106 560767 490111 356558 286877 233238 117321 527321 349650 581976 424839 224862
17096 224862 595103 258967 290629 377757 546101 586110 494206 470771 442095 458240 562955
17085 562955 -70117 222801 251429 356818 517216 372902 482724 209508 331870 350286
17075 350286 509434 622889 196515 629138 301269 372558 536642 287706 641599 509471
17065 509471 271119 287152 354968 609214 735453 375501 951474 487185 612288 583767
17055 583767 451137 676906 360665 676889 485415 261391 631427 582414 310975 326485
17045 326485 490664 313669 600451 575938 513242 549036 698972 200600 690906 423698
17035 423698 597907 388072 509103 805438 611163 453771 667209 656271 518489 786402
17025G86402l20757Q6332j90675l1235J07239N76639m86966L44710m9904C69268
17014D97671L89890j33004k35363O34805l72903p3735J26726J17595k46058j790
17004G03834J66939k52449j19537j8757R2409P1753J57013q1218j99093K21026
16994G41920Q3774j53434j6516K78542k40280K04297o7794m0943k12202K27060
16984H04424k06210K64055K76322j13959q4757j25332O2619k5441K14042j53975
16974I11788j31806N0491j2440L58509l10104J41295j63451k96417N30914k35714
16964H43065L64056j3325l12107K59108l31073J04450J79842P3574m165m27779
16954G35646L74834m1292r3195J79310m38437L45722n5643n6107K71275j47930
$$ plain form
17025 786402 465645 551977 361302 330067 437306 1013945 526979 871689 821785 369268
17014 497671 887561 754557 519194 1153999 781096 707361 834087 951682 705624 703834
17004 703834 870773 618324 498787 480030 572439 644192 801205 719987 520894 741920
16994 741920 825694 672260 655744 934286 694006 898303 830509 789566 577364 804424
16984 804424 598214 862269 1138591 1024632 939875 814543 877162 851721 1065763 911788
16974 911788 779982 830473 818033 1176542 866438 1007733 844282 547865 1078779 843065
16964 843065 1207121 1193796 881689 1140797 809724 914174 1094016 1167590 1163425 735646
16954 735646 1110480 1069188 975993 1155303 716866 1062588 1006945 950838 1222113 1074183
16944A074183M402J78503j8115l23354j39111P38067m85317Q3240M22357m39785
16934A095070O5037O8958j6213q1556K22283J08523k2387m2803r673J91644j23943
16923A454940j498j1555j50789J79137k5246j04296L03585P7833k41775k24035
16913A256301M43383j90494M5761M5623m41171K84267J41542j79256J93532K54472
16903A853960l14155J99970j5809O1061K116k02296P1424K37442p4993J7846J22834
16892A959400k87137L16249J380k65504O95670m21279n1864k60611K38723j15571
16882A809456P98399r3104o8443m15139m0538M71373L7877j73199J7947j08693
16872B235936Q7476k45919L12595o9321K66749j0617m40643J56127K22361N001
$$ plain form
16944 1074183 1078585 1257088 1238973 915619 776508 1514575 1029258 1112498 1534855 1095070
16934 1095070 1160107 1229065 1212852 1131296 1353579 1462102 1439715 1396912 1387239 1578883 1454940
16923 1454940 1453442 1441887 1291098 1470235 1444989 1340693 1644278 1722111 1480336 1256301
16913 1256301 1699684 1509190 1554951 1600574 1159403 1443670 1585212 1405956 1599488 1853960
16903 1853960 1539805 1739775 1723966 1785027 1787143 1584847 1656271 1893713 1818720 1836566 1959400
16892 1959400 1672263 1988512 1989892 1724388 2420058 1998779 1946915 1686304 1925027 1809456
16882 1809456 2607855 2514751 2446308 2031169 1990631 2462004 2499881 2326682 2344629 2235936
16872 2235936 2323412 2077493 2390088 2320767 2587516 2576899 2136256 2292383 2514744 2519745
16862B519745L3352l9527L41986j19819P2595l8718L29701j04253K70348m55550
16852B809860K42730R5251k02388J36515k3873J50874L11420J7718O3556j7153
16842C584510L25937o11431M40025m24742O34880j54094O8885j25208p980L46585
16832D077367k4509k39836M21491J15280L34779n99736N58293J28106J40166p9470
16822D831931J25639O3057n6844J11965p7432K57451K65611q7846J72081Q7320
16812E692933J95350J75881K32262k21216K87198L5448N9022J63534R5203m1063
16802F674552L65867Q0086L36985J85056K29401P3180J00989J08641K85267M60547
16792H900571N5163M21401J58977L64304q8121P22807J53143M17474j93286L22393
$$ plain form
16862 2519745 2553097 2513570 2855556 2735737 2808332 2769614 3099315 2995062 3265410 2809860
16852 2809860 3052590 3147841 2945453 3081968 3058095 3208969 3520389 3538107 3601663 3584510
16842 3584510 3910447 3299016 3739041 3314299 3949179 3795085 3863970 3738762 3730782 4077367
16832 4077367 4052858 3813022 4234513 4349793 4684572 4084836 4643129 4771235 4911401 4831931
16822 4831931 4957570 5020627 4963783 5075748 4998316 5255767 5521378 5433532 5605613 5692933
16812 5692933 5888283 6064164 6296426 6075210 6362408 6397856 6456878 6620412 6715615 6674552
16802 6674552 7040419 7120505 7457490 7642546 7871947 7945127 8046116 8154757 8440024 8900571
16792 8900571 8955734 9377135 9536112 9900416 9812295 10535102 10688245 11105719 10912433 11234826
16782A1234826L46716L67811L82257K56306K97237N79034L87305N24225M30439
16773A4806156K38512L67510Q05184M90138M97488R52382M89179O05349N91464
16764A9843362N77493J310185O05881N84924R98822J128582O55319J366787Q96356
16755B7967711J025998J632772J326669J519750J429350J815247J446666K013889
16747D0178052K397604J609743K515212K629105K543458K445673L154138K874135
16739F0347120M256374L404167M096013M312799M909546M837601N090199N892980
16731I7146799N816881O560619O965344P289167P625441P704092Q219804Q243847
16723A55571994Q130444P765519P494488O772304N909719M970968L267689K513957
$$ plain form
16782 11234826 11581542 11949353 12331610 12587916 12885153 13464187 13851492 14375717 14806156
16773 14806156 15044668 15412178 16217362 16707500 17204988 18157370 18646549 19251898 19843362
16764 19843362 20420855 21731040 22336921 22921845 23920667 25049249 25704568 27071355 27967711
16755 27967711 28993709 30626481 31953150 33472900 34902250 36717497 38164163 40178052
16747 40178052 42575656 44185399 46700611 49329716 51873174 54318847 57472985 60347120
16739 60347120 64603494 68007661 72103674 76416473 81326019 86163620 91253819 97146799
16731 97146799 102963680 109524299 116489643 123778810 131404251 139108343 147328147 155571994
16723 155571994 163702438 171467957 178962445 185734749 191644468 196615436 199883125 202397082
16715B02397082O55019o96939k525560l644613n066614o129838p001848p804776
16707A70181913q181273q288103q628938q349889q113298q129470p625562p436246
16699A05429134o586685o447847n852996n737276n038465m767732m269119m105468
16691F2623546l765923l248847l472706k799058k616432k629275k598821k096681
16683C9395803k175199j615976j774014j675464j631753j228545j637277j191795
16675B6465780j258052p90621j228438q93520j598314l53897p77554p32949p21733
16666A8110702o31209q12526n65343m72204o85665p37527K7384p94576l90141
16657A3048895m83946m14014k65183k60894n89673n46658K00604m11838m61601
$$ plain form
16715 202397082 203052101 202355162 199829602 196184989 191118375 184988537 177986689 170181913
16707 170181913 162000640 153712537 145083599 136733710 128620412 120490942 112865380 105429134
16699 105429134 98842449 92394602 86541606 80804330 75765865 70998133 66729014 62623546
16691 62623546 58857623 55608776 52136070 49337012 46720580 44091305 41492484 39395803
16683 39395803 37220604 35604628 33830614 32155150 30523397 29294852 27657575 26465780
16675 26465780 25207728 24417107 23188669 22295149 20696835 20342938 19565384 18832435 18110702
16666 18110702 17479493 16666967 16101624 15629420 14943755 14206228 14233612 13439036 13048895
16657 13048895 12564949 12150935 11885752 11624858 11035185 10488527 10689131 10277293 9815692
16648I815692R147o9998q98395n17453K1538l2163m39100j47518j85099l11951
16638G244700m89370L42863n35530j27459K96526k81709m55555j97699Q2325r1924
16628E787168k51404R8798l16569l11381k7846m0510o9892j11298j36961l55541
16618D264564R4676N39030q49672k465r8002j23832M8769j47275q5700L2115k22409
16607C449799m4885k7939P7064P2655j43234L7625k80138m3318k21507R3444p0961
16596B898605J09415j30277j22511j20418J20156k38832n0948J40079m81074K80208
16586B404403J73735L437l27833m07440L85298r5268k15668K22841K51186l31913
16576B062778n0281l34863L21330p5714N3330k83719N3666K43243j94411j12864
$$ plain form
16648 9815692 9824839 9754841 8856446 8338993 8360531 8328368 7889268 7741750 7556651 7244700
16638 7244700 6755330 7098193 6562663 6435204 6731730 6450021 5994466 5796767 5879092 5787168
16628 5787168 5535764 5634562 5317993 5006612 4978766 4938256 4868364 4757066 4620105 4264564
16618 4264564 4359240 4898270 4048598 4046133 3948131 3824299 3873068 3725793 3640093 3672208 3449799
16607 3449799 3404914 3376975 3454039 3526694 3383460 3421085 3140947 3097629 2876122 2969566 2898605
16596 2898605 3008020 2877743 2755232 2634814 2754970 2516138 2465190 2605269 2124195 2404403
16586 2404403 2578138 2581575 2253742 1846302 2231600 2136332 1920664 2143505 2394691 2062778
16576 2062778 2012497 1677634 1998964 1923250 1976580 1692861 1746527 1989770 1795359 1682495
16566A682495J73588o2728k35317o2945M53179m5288k43665k06748L9864J0426
16556A502861n7931j14580J77901J01319k94235L53194m85630n0951O9170J01536
16546A302654L04579l59433p2956J81705P1231m02469m6397K25672J00397j46493
16536A158490q8599j0129l0629l53839M89692j69644p1509L04441J40423l33580
16526A035117k30258K74391l36499K16869L9316k06318J93487j25595J27668O7223
16516A055401m5291l60179l830J33853J3521n4324L27470l23285J75102P9666
16506I98104k33370o5883n3259o4571Q1406J05429l32160L62452k31529j01245
16496D65374J24384N7680j64725M3979J64766J48063l97690P5019K79320l83416
$$ plain form
16566 1682495 1856083 1793355 1558038 1495093 1948272 1902984 1659319 1452571 1492435 1502861
16556 1502861 1444930 1330350 1508251 1609570 1315335 1668529 1182899 1131948 1201118 1302654
16546 1302654 1607233 1247800 1174844 1356549 1427780 1025311 978914 1204586 1304983 1158490
16536 1158490 1069891 1059762 1029133 675294 1164986 995342 923833 1228274 1368697 1035117
16526 1035117 804859 1079250 742751 959620 998936 792618 986105 860510 988178 1055401
16516 1055401 1010110 649931 646101 779954 793475 739151 1066621 743336 918438 998104
16506 998104 764734 698851 645592 581021 662427 767856 435696 798148 566619 465374
16496 465374 589758 647438 482713 526692 691458 839521 441831 516850 796170 412754
16486D12754o5207J52797N17286n03185k17057K02641J35308C02572L94544j4142
16476F82974K72607N6298k33396C87205R5252o2359N46930D40921l3145K51979
16466F59755q9530O1477p5437j4373k27936J1945J20147L3869L4501L497j04219
16455D13696O4572j62608j37591K62973M2405N3136B35975n2285N26440B80615
16444F76364l06269R7225I7315Q6877M49561j30939n4917A93286K29503P191K74877
16433G04857k61881j04427j12868K93930k11981p1335L10563j70839j84738J76823
16423C68104p0612j41569l5022L74663C6319L82188K46388A22792O6393L50835
16413E40020B24917J13977j13411a27376C09500L19232l10181O213F4824b6121
$$ plain form
16486 412754 347547 500344 1017630 514445 297388 500029 635337 302572 697116 682974
16476 682974 955581 1011879 778483 387205 482457 420098 967028 440921 407776 659755
16466 659755 570225 631702 556265 541892 313956 325901 446048 479917 514418 517915 413696
16455 413696 478268 315660 178069 441042 483447 536583 235975 183690 710130 280615
16444 676364 370095 467320 97315 184192 633753 502814 447897 193286 422789 429980 704857
16433 704857 442976 338549 225681 519611 307630 236295 546858 376019 191281 368104
16423 368104 297492 155923 120901 495564 36319 418507 664895 122792 189185 540020
16413 540020 224917 338894 225483 -127376 309500 628732 318551 324764 64824 -26121
16402A00313J98277K05262A54429M92942j42449j78954j38962J62083j00052I9768
16391B62163R0649J32912B31146I3297K71016A81098K18151e319D9523K01704
16381B51227a0434k4660A97363L93546I4622Q4477J47068F4798J13283O7534n2975
16370A92640J91359p2309j0545j2035B144c2113a671j14854A59570E1705K0563
16359G2268J46299b5302A34660M08852j50029H5979J64324a27359B53871M935
16349B58806P4248A25704a43825C48867b8125A25151O779E1972K37173j03529
16339A85616J11106j31235B1996J53619B1899J37769l1276P5241J53675E5366
16328B10903n8829a22657e8721C2771f9925K9258D0947J19444p1684a99214h64
$$ plain form
16402 100313 298590 503852 154429 647371 504922 325968 187006 349089 249037 99768
16391 262163 352812 485724 231146 93297 364313 181098 399249 -5319 49523 251227
16381 251227 -10434 -35094 197363 590909 94622 179099 326167 64798 178081 245615 192640
16370 192640 383999 311690 301145 289110 2144 -32113 -1671 -116525 159570 51705 72268
16359 72268 218567 -25302 134660 543512 393483 85979 250303 -127359 253871 258806
16349 258806 333054 125704 -143825 348867 -28125 125151 131930 51972 289145 185616
16339 185616 296722 165487 21996 175615 21899 159668 128392 203633 357308 55366
16328 210903 152074 -122657 -58721 32771 -69925 -40667 40947 160391 88707 -199214 -864
16316C75844j33793e1301B49852n5720F0421O5538K17212a514F8327J70509o7911
16305A70925M1395I9405J15747E290P17500b81602B07603B6145K4169a5311B9591
16293B12616K53100H5165K87947j69820O1888N9999c8986B58301F9959R5432p1404
16282I3987l2614a83934B88166F4046d09360B1671a56136j34149D19651A59326
16271i90A28963k5028b66854B1137g1700m6517G2850J41526G1165b92227A0562
16259f7796k49010C591J97451G9206K0035K75607p4035A9595J67841j1264a69961
16247a15451o9054e4606E4762O9607b48090R2062H3068f512C52984j20592F1119
16235a53376B10515b89731d7704o074B98859a43698B39410E4656k0175N9939a37252
$$ plain form
16316 375844 242051 -51301 249852 194132 60421 125959 343171 -1514 68327 238836 170925
16305 170925 212320 99405 215152 5290 722790 -281602 207603 26145 50314 -15311 29591
16293 212616 465716 85165 373112 203292 265180 325179 -38986 258301 69959 165391 93987
16282 93987 61373 -183934 288166 64046 -409360 21671 -156136 -290285 419651 159326
16271 -990 128963 103935 -266854 21137 -71700 -118217 72850 214376 71165 -292227 10562
16259 -67796 -316806 3591 201042 79206 99241 374848 300813 19595 187436 176172 -169961
16247 -115451 -184505 -54606 54762 124369 -248090 -156028 83068 -6512 352984 232392 61119
16235 -153376 210515 -289731 -47704 -53778 298859 -143698 239410 54656 34481 94420 -137252
16223h0220A35433N765N755b91202K9222E1853d5085l5047K2513m1766C16657
16211B29421C8164d7803a1272A47694E247K53004m4719n3320e56869g6473a2908
16199E1230e5569C4868a04282K6999A92464B1577a38428d0081o0501D4567J51839
16188A96406g8530C52013b17008C63998a21550c0018A38815B3129Q997J72283
16178B04409a90151A51679b5437G0976f0075b4036j05514G5814d0763E3367P1208
16167A24575F0129f61356g2326B0071J43239a12257A46671m7997Q9677a46803
16156b4333m3307c0980B36424a9478l62317a02258m96675A51842b65728E1418
16145g2186I5942c35018d5342A4252a41941n6314A82061B8799N8539J5589k375
$$ plain form
16223 -80220 135433 141198 146953 -291202 -261980 51853 -45085 -80132 -57619 -99385 316657
16211 229421 38164 -47803 -11272 147694 5247 258251 213532 160212 -556869 -76473 -12908
16199 51230 -55569 34868 -104282 -77283 192464 21577 -138428 -40081 -100582 44567 196406
16188 196406 -78530 352013 -217008 363998 -121550 -30018 138815 23129 32126 204409
16178 204409 -190151 151679 -25437 70976 -60075 -24036 -129550 75814 -40763 53367 124575
16167 124575 60129 -661356 -72326 20071 163310 -112257 146671 98674 188351 -146803
16156 -24333 -67640 -30980 236424 -19478 -381795 -102258 -598933 151842 -265728 51418
16145 -72186 95942 -335018 -45342 14252 -141941 -198255 182061 28799 87338 102927 100552
16134A00552a03495I6294e27517K40029G5493J18605a51927n9738B9477d8978
16123a11014o3907f9553B31750H8678e5068A43034J46073b26959E0183L9039D4217
16111F8771a08021n1395A95894f0319P28p9120j35023A90644G2984k2287K23981
16100B74678A08371R5150a23821B60453J48160e4211A91036a20338K3743E9933
16089a02114a4865j18129j00505a7007m72562a92689d9271r1456j03752J09180
16079a35299F3459b37261A72902F148a25293F1383J35285g6781A34626o4033K4209
16068I4802a28380e9618j33468j4199A63147a40117N9597j40973h7349C70158
16057e8004l738G6198l7285a51536B22241a27146M0892B1986M3825d491B3536
$$ plain form
16134 100552 -103495 96294 -527517 -287488 75493 194098 -151927 -211665 29477 -48978
16123 -111014 -174921 -69553 231750 88678 -55068 143034 289107 -226959 50183 89222 44217
16111 68771 -108021 -159416 195894 -60319 -59591 -138711 -273734 190644 72984 50697 274678
16100 274678 108371 203521 -123821 260453 408613 -54211 191036 -120338 -96595 59933
16089 -102114 -14865 -132994 -233499 -17007 -489569 -192689 -49271 -140727 -244479 -135299
16079 -135299 63459 -237261 172902 6148 -125293 61383 196668 -76781 134626 70593 94802
16068 94802 -128380 -59618 -193086 -207285 163147 -140117 -80520 -221493 -87349 370158
16057 -58004 -61742 76198 38913 -151536 222241 -127146 -86254 21986 65811 -4491 23536
16045C10260k1410M668a9353E260c83131L8107K85A68752F2735f9415k09032B71007
16032i1991a1962k4335j2925E6144L6580G586i3995B42971e26479A07085a5605
16020G994a51579k117h914C85063g3590A4400L1282R7692a44925B44595J917E5907
16007c8772B70147B3571b97123f373G8255l3413N1084c24159a31032K3764a5485
15995d42111a58342k47602B3114g4054G8823a3007k65667K5175B49304H1207k0811
15984F0396R6622Q3790G9777N15878k96402L75649I5919A0866a27468B97564a62821
15972A39634h0082K4080a7625A95695a90794j35769A09332P7436g0230C4386a20961
15960a27636j12131A71794a8100C34704a23946A3743J4512d4826j18070m3268
$$ plain form
16045 310260 288850 293518 -19353 5260 -383131 -345024 -344739 168752 62735 -69415 -278447 271007
16032 -91991 -11962 -36297 -49222 56144 92724 7586 -93995 242971 -526479 107085 -15605
16020 7994 -151579 -153696 -8914 385063 -73590 14400 45682 143374 -144925 244595 246512 55907
16007 -38772 270147 23571 -297123 -6373 78255 44842 95926 -324159 -131032 -107268 -15485
15995 -442111 -158342 -405944 23114 -74054 78823 -13007 -278674 -253499 249304 81207 60396
15984 60396 157018 240808 79777 595655 299253 674902 95919 10866 -127468 297564 -162821
15972 139634 -80082 -56002 -17625 195695 -190794 -326563 109332 186768 -70230 34386 -120961
15960 -127636 -239767 171794 -18100 334704 -123946 13743 28255 -44826 -162896 -206164
15950b06164A28580a10218j243A7369g7469l473j99606J33278j17511a13465l4796
15939a48261j81784a37964D8057g0211A01156b23781R3229C3331a17520B05586
15928a85814O6868k1561A63712l4102n3949a37033b7659j90000p5574A64968F1665
15916b08270I0622c16954A22626e314A94966d1496j75207E0766b36692Q9454q4868
15905b32106a11701E4803b27663O6617I7940b52957i1443K2648j12705B35025
15894a0645E0966b4402e976A74758c07226a40958B06454f1504l9491a2606p3431
15883h6037A31718d22576A06083i1609m3312m6798A08704d5706A2051O7020a37384
15871B62835A2029L8031b81759a22511D9194f7661n0719A83300c37554J66621
$$ plain form
15950 -206164 128580 -110218 -111461 17369 -77469 -80942 -280548 -147270 -264781 -113465 -148261
15939 -148261 -330045 -137964 48057 -70211 101156 -223781 -130552 33331 -117520 205586
15928 -185814 -118946 -140507 163712 129610 75661 -137033 -27659 -217659 -293233 164968 61665
15916 -208270 90622 -316954 122626 -5314 194966 -41496 -216703 50766 -236692 -147238 -232106
15905 -232106 -111701 54803 -227663 -161046 97940 -252957 -91443 -68795 -181500 235025
15894 -10645 50966 -24402 -5976 174758 -307226 -140958 206454 -61504 -100995 -12606 -86037
15883 -86037 131718 -422576 106083 -91609 -134921 -181719 108704 -45706 12051 79071 -137384
15871 262835 12029 50060 -281759 -122511 49194 -67661 -118380 183300 -337554 -170933
15861a70933A23236D14f9757K9065k67153G3581K23012R3545c79372A5083b52900
15849f3799A65886b45147M0670J1857F389f0469B32673A269b61581J06559A86503
15837a47651R329D8455a15436D3028g3295j37850C7356a39418K1345j80819b6457
15825f5365j03199C2505A0905Q3777c53378A44748b71859n0459c2297m19298B7500
15813A7606a04372m2180A34546a00066b0335p6126A75933c7231l18727C4039a39374
15801I7083e019m0946q7896f0009l9488D2164a71134M2621G2871k6429a36200
15789c18937a17626H958a82441A61822b46790A10326b97111a20690B70338b74496
15778a86276n8186l8519J18258j975c5607j13983q6386j59670C7898e36559B60532
$$ plain form
15861 -170933 123236 414 -69757 -40692 -307845 73581 296593 390138 -379372 15083 -252900
15849 -63799 165886 -245147 -204477 -192620 6389 -60469 232673 1269 -261581 -155022 186503
15837 -147651 -138322 48455 -115436 43028 -73295 -211145 37356 -139418 -118073 -298892 -26457
15825 -65365 -168564 32505 10905 94682 -353378 144748 -271859 -322318 -32297 -451595 27500
15813 17606 -104372 -146552 134546 -100066 -20335 -96461 175933 -37231 -355958 34039 -139374
15801 97083 -5019 -45965 -133861 -60009 -99497 42164 -171134 -128513 72871 46442 -136200
15789 -318937 -117626 8958 -182441 161822 -246790 110326 -297111 -120690 270338 -274496
15778 -186276 -244462 -282981 -164723 -166698 -35607 -149590 -235976 -395646 37898 -536559 260532
15766A18022k937j6128a44403p1706D2451d2095D5331j9608K4750b24356A29566
15754D1783c9796B20877a6604B01568a7191G6529c06608i5603B14885E3306K26105
15743B79411J5683H4024l5837a00150A40586K0803a49639d4804l43816d2926A18693
15731i3669b992j70147E6404e689j81289B27193E0391b3178A76634e14524B00748
15719B70594C469c37341C7672g2812l82162A88421e5224A31083a16058A0600l522
15708G078L81831a98746I6334g0691j12727m3857d531j1090A71056a75492A05259
15696a65150e5657j19820D126M6758a59495b3780A99764J9867E4215A7262J16812
15685A34074B7382b79437A16560J87223b36222B1863a35816m4381K1888e1403
$$ plain form
15766 118022 115085 98957 -144403 -216109 42451 -42095 45331 25723 50473 -224356 129566
15754 41783 -39796 220877 -16604 201568 -17191 76529 -306608 -95603 214885 53306 279411
15743 279411 295094 84024 48187 -100150 140586 161389 -149639 -44804 -388620 -42926 118693
15731 -93669 -2992 -173139 56404 -5689 -186978 227193 50391 -23178 176634 -514524 200748
15719 270594 3469 -337341 37672 -72812 -454974 188421 -55224 131083 -116058 10600 7078
15708 7078 388909 -198746 96334 -70691 -183418 -227275 -4531 -15621 171056 -175492 105259
15696 -165150 -55657 -175477 4126 50884 -159495 -23780 199764 219631 54215 17262 134074
15685 134074 27382 -279437 116560 303783 -236222 21863 -135816 -180197 -158309 -51403
15674f6414n7020K8273A16794e4424j43552c1965j0684B16032a87130F726R8434
15663A05160K7458C4999c01284A490K55632b27015C7125O7661B8393c88348B27895
15651a56330r2838a01753j88834f3299b1475j15987e6522G3236L5138C5502c77
15639B5118j867K0477a48248K2632r4172e4021H4562O1302b29501A0076N3431
15628F3507K10788a62849O5362j26589A27177i8033j94460A23557J14002D30J53418
15617A53848b68030D5562J18639c04265c4697j50564b1654n1851A99623a29029
15606G3361e5692k12366j0366a21533L4085K1350m52660c461o9484j61254n2130
15595b86329g0277J652j976k8874I7441b1282l51352B17873B0215K61369E2384
$$ plain form
15674 -66414 -123434 -95161 116794 -54424 -197976 -31965 -42649 216032 -187130 6726 105160
15663 105160 132618 34999 -301284 1490 257122 -227015 37125 104786 28393 -388348 227895
15651 -156330 -249168 -101753 -290587 -63299 -21475 -137462 -56522 73236 108374 35502 -377
15639 25118 23251 43728 -148248 -125616 -219788 -54021 84562 145864 -229501 10076 63507
15628 63507 274295 -162849 -97487 -224076 127177 -98033 -292493 123557 237559 430 153848
15617 153848 -268030 45562 164201 -304265 -34697 -185261 -21654 -73505 199623 -129029
15606 73361 -55692 -268058 -278424 -121533 -87448 -66098 -518758 -3461 -72945 -234199 -286329
15595 -286329 -70277 -68625 -70601 -99475 97441 -21282 -372634 217873 20215 281584 52384
15583A92950e3685r4275L5983A46670a4214A16087K626i5713A87609e35382e8277
15571E7493f1124j3650c619j45027D715J65227K9215F1314h2641B87287a6823
15559D4277a7752D0380g1320G9644c6889q3202A29685B610K13642J5318L2590
15548B64160N3363A47482c1639j07426q2964D2352J40856a07930A55458A4705
15537i3478G4306M446a65895g3581A56967a70780q0920J07246A03884g0853k22255
15526b93108B38853r4263e0621C3759K22341p9903A2613J81812B1381R217f1879
15514H206K2686c5431C57721j56026O6279b70873B1577R8472a25255K7823j47417
15503b44849A03498f7885j18931p8408R7097C276a79712B60618d7508G2526b425
$$ plain form
15583 192950 -53685 -147960 -111977 146670 -14214 116087 118713 -95713 187609 -535382 -58277
15571 57493 -61124 -74774 -3619 -148646 4715 169942 199157 61314 -82641 287287 -16823
15559 44277 -17752 40380 -71320 79644 -36889 -120091 129685 2610 216252 231570 264160
15548 264160 317523 147482 -31639 -139065 -222029 42352 183208 -107930 155458 14705
15537 -93478 74306 78752 -165895 -73581 156967 -170780 -251700 -144454 103884 -70853 -293108
15526 -293108 238853 144590 -50621 33759 256100 176197 12613 194425 21381 30598 -61879
15514 8206 30892 -35431 357721 201695 267974 -270873 21577 120049 -125255 -97432 -244849
15503 -244849 103498 -67885 -186816 -265224 -168127 3276 -179712 260618 -47508 72526 -2425
15491a71966G8704k9878d1074A62946K0832H2349c68189a75311e2295j92108D25738
15479a21465j66217D3069a90721C65294B5452b15363b307B87456j21098J22079
15469B88437C7216a99885B23845a81157c1473G6810K42531a45401K6570D2266
15458a32111j4702A50291B4720A2323N8676ep1879A7787N0773n200a4858F9431
15445b41767e7289C2620K04625a26145D12610E1872N7005K3469K72054f0046I4682
15433A89242E8693a10357B2597g762m12849H5570a46879C0864g4232F0021P4913
15422A34934A5609N527J51173e1326A08055E3169k2643c39708D20382H215L57505
15411C65720E8250h4143k3679D8627b43934B78222c545A4513a2368C9957a32931
$$ plain form
15491 -171966 78704 48826 -41074 162946 183778 82349 -368189 -175311 -52295 -244403 425738
15479 -121465 -287682 43069 -190721 365294 25452 -215363 -2307 287456 166358 288437
15469 288437 37216 -199885 223845 -181157 -31473 76810 319341 -145401 -118831 42266
15458 -132111 -146813 150291 24720 12323 70999 -5 -71884 17787 68560 63360 -14858 69431
15445 -241767 -57289 32620 237245 -126145 412610 51872 108877 132346 404400 -60046 94682
15433 189242 58693 -110357 22597 -7762 -420611 85570 -146879 30864 -74232 60021 134934
15422 134934 15609 21136 172309 -51326 108055 53169 30526 -339708 420382 8215 365720
15411 365720 58250 -84143 -107822 48627 -243934 278222 -3545 14513 -12368 39957 -132931
15399H3228b20071b5426j59090A72471e9674I168P655J45186N293a87945d3758
15387B0027a12608A33016a00220l84612A42507m8815d0885G0595R8148a71731
15376a69771M4540b2639j1774l6050j04885G5025b7599I8966e2394m4277H5438
15364a10742A48208c41024a40079p2964a00554A47584n8471J95754J50984b92813
15353C23315i2904M1858a9694B17783g9700b0349k75861f3950q0118I7079N9443
15342A56522a7260D5842h8048C7204Q2033m9841J40089B6492O1495e8224m9599
15331a07823p5578b4610D8349B2368b87348b0823C02443b67791A46429a96598
15320A75134b4882A18593a26736B5766a42170I340K22126I0176c3266C14582c93915
$$ plain form
15399 83228 -220071 -25426 -184516 172471 -59674 9168 16823 162009 167302 -187945 -43758
15387 20027 -112608 133016 -100220 -484832 142507 93692 -40885 70595 168743 -171731
15376 -169771 -125231 -22639 -34413 -70463 -175348 75025 -27599 98966 -52394 -96671 85438
15364 -110742 148208 -341024 -140079 -213043 -100554 147584 89113 284867 435851 -292813
15353 323315 -92904 -51046 -19694 217783 -79700 -20349 -296210 -63950 -144068 97079 156522
15342 156522 -17260 45842 -88048 37204 119237 69396 209485 26492 87987 -58224 -107823
15331 -107823 -183401 -24610 48349 22368 -287348 -20823 302443 -267791 146429 -196598
15320 175134 -24882 118593 -126736 25766 -142170 9340 231466 90176 -33266 314582 -393915
15308b24543B16659a2770C51295f7755A2684K61826b40984e5945D7543I097Q7910
15297I7007J45014F0773h5483j81090D76402f5149B60195d9318n2215n5658D35431
15285C3098L3474f365k4187A97483B3262J42264G3536j6370a04728A61125p8794
15274H2331d151C26963a08221D44829d4232k22661G1368J69548h2278B0637a9392
15262A06693M66640D1433K66299D4714c16911D5308L37850a10948F36651H0517
15251C44867l2131A01216L28919J62225L00232Q13589l69595J29906K07034H22340
15240D67378J05957r4208G6718a43948D41499a08832a199F2570h4744j53803A9388
15228F067h7180n233b8153A45693e6651A72492a62996l8645B87671g2443A64915
$$ plain form
15308 -224543 216659 -12770 351295 -67755 12684 274510 -240984 -55945 47543 9097 97007
15297 97007 242021 60773 -85483 -266573 476402 -65149 260195 -49318 -101533 -157191 435431
15285 33098 66572 -6365 -30552 197483 23262 165526 73536 57166 -104728 161125 82331
15274 82331 -4151 326963 -108221 444829 -44232 -266893 71368 240916 -82278 20637 -19392
15262 106693 573333 41433 307732 44714 -316911 45308 383158 -110948 636651 80517
15251 344867 312736 101216 430135 592360 892592 1706181 1336586 1466492 1673526 822340
15240 467378 573335 479127 76718 -143948 441499 -108832 -1199 62570 -84744 -238547 19388
15228 6067 -87180 -92413 -28153 145693 -56651 172492 -162996 -201641 287671 -72443 164915
15216E6505L2038C0468L62512j52542B0410K04964J64161r8049A13650J5021K60338
15205C89009E7838a20086N2343A1343K09457a34536j4229A77935F7210b7543I4893
15193c34046D9561J40444a67818A21698O7816a01192J528A0373J89419e5421C46915
15181h6610B87443A36030A0455a20668E5340f5318A9426c1069B8301a55280C80248
15169A41440a3446G5949J54700d83990C1450K60850L54324g2899o9496A5884K58083
15158B73967j15528l422K46417a25790A81560J13021j25743G8566L88430A75186
15147h8329A8705J92387p070b22193A7646o097Q1129R5794q5651g268j05519A30292
15134C94885a07301A31806N4812Q115H9592J55648A11402K6654g2436B66156j18025
$$ plain form
15216 56505 88543 30468 392980 240438 20410 225374 389535 291486 113650 128671 389009
15205 389009 57838 -120086 -67743 11343 220800 -134536 -148765 177935 67210 -27543 94893
15193 -334046 49561 190005 -167818 121698 189514 -101192 -99664 10373 199792 -55421 346915
15181 -86610 287443 136030 10455 -120668 55340 -65318 19426 -31069 28301 -155280 380248
15169 141440 -13446 75949 230649 -483990 31450 292300 646624 -72899 -142395 15884 273967
15158 273967 158439 155017 401434 -125790 181560 294581 168838 78566 466996 175186
15147 -88329 18705 211092 204022 -222193 17646 11549 92678 188472 102821 -7268 -112787 130292
15134 394885 -107301 131806 186618 194733 89592 245240 111402 138056 -72436 266156 148131
15123A48131A9584J38310G1527f0585A34866M46159A2345J20489L49378A2754
15112C51242A26420B959J51325a39981A19371J08a5011L494B28346l7251m8379
15101A42716D465J66277l7408N0046d23323Q7843B20370A3621J92415K16439A91777
15089H2664j4721g303B03517p4973n8732J97859j28677C4982O616M2716C9927
15077D778J03585h7223C24860b55539C8427a22561N1675F8825P9275E2331M6777
15066I9108J41412l0037J81987j25349l5211L06497F7082M48453c0565B28488
15055A99427K06753b8794B38706J33592J02814j04618j182A41613C0282O173f3621
15043A14735J04285n6902K0943m4698J85180b15648A862J23534J69904K68083
$$ plain form
15123 148131 19584 157894 71527 -60585 134866 581025 12345 132834 482212 12754
15112 351242 126420 2959 154284 -139981 119371 119479 -15011 -11517 228346 191095 142716
15101 142716 4465 170742 133334 183380 -423323 -335480 220370 13621 206036 422475 191777
15089 82664 67943 -7303 203517 128544 69812 267671 138994 34982 41598 84314 39927
15077 4778 108363 -87223 324860 -255539 38427 -122561 -70886 68825 148100 52331 99108
15066 99108 240520 210483 392470 267121 231910 538407 67082 515535 -30565 228488
15055 199427 406180 -28794 238706 372298 475112 370494 369312 141613 30282 36455 -63621
15043 114735 219020 162118 183061 138363 323543 -215648 1862 125396 295300 563383
15033E63383A27346C4869L8137k4745J61836M6904a04570C90315a4771B80957
15022B08203K67693j06715c882B9184N563J46334J50433A46041J56508a67905
15011d2552C07487P7876J57688B14677G0207J04594k4672K18270I7830O1769J22685
15000B82284n4883L72953j41918n8943j96852e9761p6213A25813n8404L7328J83531
14989B88268A25489J10010J232D9619c4903C30878M0856m0904j31257C7963K17345
14978B55308M93930I5202L34260r8237r1810K24701J89881j55410k00173e1215
14967B26698e3945C61057A03658K2289J05128L19859L6267j55639r763j54967
14957B66832F7672N2480D7862J59598c5349B48359J94433k11417j613a98305D60430
$$ plain form
15033 563383 127346 34869 73006 48261 210097 257001 -104570 390315 -14771 280957
15022 208203 475896 369181 -3882 29184 34747 181081 331514 146041 302549 -167905
15011 -42552 307487 385363 543051 214677 70207 174801 150129 368399 97830 159599 282284
15000 282284 227401 600354 458436 399493 202641 -59761 -135974 125813 67409 104737 288268
14989 288268 125489 235499 236731 49619 -34903 330878 371734 330830 199573 37963 255308
14978 255308 749238 95202 429462 331225 239415 464116 653997 498587 298414 -51215
14967 226698 -53945 361057 103658 125947 231075 550934 587201 431562 421799 266832
14957 266832 67672 120152 47862 207460 -35349 248359 442792 231375 229762 -198305 460430
14945D5565K38189A24414J24957D9601J5051L20929j29682C9793K19266J8621
14935B77680R3559j38097G9541O2115M63038k81913O0920J04920B10426J3899
14925B24325L68684B87599k8580L12525k01972J17464B31751o098J07968N2414
14915C86035F8196n665J87375J82193n3933j22064Q0443J38608O053j67986k9552
14904B83668D8185L30919N3484M9799Q0190j47550A24828K66093j25225J9896
14894B85592O2462k0973L032r8708J27733j37649j5635M8013O35101l24311J5218
14883E79875a91689C59106J7397L54679A54343J60798k2049J03499R1728P3645
14873E61964k36038K61615k67138j4333j01203J23696p0101K19524j37958L4662
$$ plain form
14945 45565 283754 124414 249371 49601 64652 385581 255899 39793 259059 277680
14935 277680 371239 233142 79541 141656 604694 322781 383701 488621 210426 224325
14925 224325 593009 287599 259019 571544 369572 487036 231751 225653 333621 386035
14915 386035 68196 62531 249906 432099 378166 256102 336545 475153 481206 313220 283668
14904 283668 48185 379104 432588 482387 562577 415027 124828 390921 265696 285592
14894 285592 348054 327081 330113 231405 359138 221489 205854 253867 888968 564657 579875
14883 579875 -191689 359106 376503 731182 154343 315141 293092 396591 488319 561964
14873 561964 325926 587541 320403 306070 204867 328563 258462 477986 340028 374690
14863C74690N7714N197k2449R7616K0882j3745j62063M01863l53814p2568n8648
14852B74675N7841K69063k03863K08379j08638j45474J14041A06229M64010B28328
14841G67139B81425M65312k22978P1376r5961j95175L50603B68334R9677P8893
14831D46904B22288L9112K13573j01874Q414C9414O93414o0745k58550K57575
14821F71108j66144N9134j05395J05761J04767j45060j99152J41502K27867k46278
14811D48110O0778n6763q5434J08728j14559J05308J03644j76748j74117M58191
14801F77138J36960B15114m6333M61267q4199j51778R8526J00852j74721L1022
14791D49750O4141K61756r4436j11043O120j17457J02069J21796k12301p0190
$$ plain form
14863 374690 432404 437601 415152 512768 533650 519905 357842 759705 405891 333323 274675
14852 274675 332516 601579 397716 606095 497457 351983 466024 106229 570239 228328
14841 767139 281425 746737 523759 595135 499174 303999 654602 268334 368011 446904
14831 446904 222288 261400 474973 373099 381513 39414 732828 672083 413533 671108
14821 671108 504964 564098 458703 564464 669231 524171 325019 466521 694388 448110
14811 448110 508888 452125 366691 475419 360860 466168 569812 393064 218947 677138
14801 677138 814098 215114 168781 630048 545849 394071 492597 593449 418728 449750
14791 449750 513891 775647 681211 570168 576288 458831 560900 682696 470395 400205
14781D00205J58066Q1795J52926C90859J38324M5771J34282j23866J78217J5999
14771G79586l46157L36828q4662K45128l07276j11922K09928j76296K62614K70461
14761A078232D66289L44283j00016J33193k38193m7825J6447l6822J88363J81555
14751I07274C78722j15553K48251K22299o8219K85008D59584L08531k77751J47978
14741F38342j47390M62684k89747M4856j60881L25760j06641J72910k95674J63386
14731H07605j65723J25450N6823j06138B55405O81730r2274j26204J21792j21606
14721G18843M27351k51304p3299r3170k682l8652J86403K33744E19938J67111
14711F87049L23506J2923l55761L01613R5543j80652Q2762j07035j40672K83808
$$ plain form
14781 400205 558271 640066 792992 390859 529183 574954 709236 585370 763587 779586
14771 779586 433429 770257 685595 930723 623447 511525 721453 545157 807771 1078232
14761 1078232 466289 810572 710556 843749 605556 557731 574178 537356 725719 907274
14751 907274 378722 263169 511420 733719 665500 950508 459584 768115 490364 638342
14741 638342 490952 953636 663889 708745 547864 873624 766983 939893 644219 807605
14731 807605 641882 767332 824155 718017 255405 937135 844861 718657 840449 718843
14721 718843 1146194 894890 821591 728421 725739 687087 873490 1107234 519938 687049
14711 687049 1010555 1023478 667717 969330 1064873 884221 966983 859948 719276 1003084
14701A003084j39769l9223j74806L32397j18814o746O5910K86593n86348M36680
14691A058958r7410J55149J07260k84803k68251K26267K8273J46608r7120N805
14681I80736j30167J26540q2077J05286K42620k63507J44968l0492J81200k58314
14671A016793p2637m2700L00731L6084M5829k96467L88838k04196j98249J75078
14661A149104L5732l3671O8143j97690k38140M81347l32760L9076o8439K56954
14651A159656J66815j62390K37825r1419J49288M2930l44128O2935M8127p2784
14641A196855j33602J60488J53002j39347j15964k0268K22285k43361L60882k52230
14631A188740j5681M85527n76917L07780M6650n7344k62200K83550J5341j2087
$$ plain form
14701 1003084 863315 824092 649286 981683 862869 856123 922033 1208626 622278 1058958
14691 1058958 961548 1116697 1223957 939154 670903 897170 925443 1072051 974931 980736
14681 980736 850569 977109 895032 1000318 1242938 979431 1124399 1093907 1275107 1016793
14671 1016793 944156 901456 1202187 1238271 1284100 987633 1376471 1172275 974026 1149104
14661 1149104 1184836 1151165 1219308 1021618 783478 1264825 932065 971141 902702 1159656
14651 1159656 1326471 1164081 1401906 1310487 1459775 1502705 1158577 1221512 1269639 1196855
14641 1196855 1063253 1223741 1376743 1237396 1121432 1101164 1323449 1080088 1440970 1188740
14631 1188740 1173059 1658586 1081669 1389449 1436099 1378755 1116555 1400105 1415446 1403359
14621A403359o9730j90388K35920J08494J79317K18467n22111K7271K51693k52763
14611A389529J28511Q1922l9609p2149J40510K10199l8244j73449N3549j10315
14601A570454M14822l10327J57171q5146l8679K59276m55886j5471M65529j34703
14591A827040k76557M09660j36843n5747J52599Q771J66410j29078K61073j57834
14581B069494k12722J68041L4072p5978j31578K53710J42065J00275j58758L66135
14571B554756K31058m68665o2611m0371K54392P5381N7730j56591M66084k77537
14561B633626k03410L41927k75843K63311J24124M63867J67903j23129K79364
14552C671740M48962L41239J130945J651722M336045P983996J9869004k079167
$$ plain form
14621 1403359 1333629 1143241 1379161 1487655 1666972 1885439 1363328 1390599 1642292 1389529
14611 1389529 1518040 1599962 1560353 1488204 1628714 1838913 1800669 1627220 1680769 1570454
14601 1570454 1985276 1674949 1832120 1746974 1708295 1967571 1511685 1496214 1961743 1827040
14591 1827040 1550483 1960143 1823300 1767553 1920152 1928923 2095333 1966255 2227328 2069494
14581 2069494 1856772 2024813 2058885 1982907 1851329 2105039 2247104 2347379 2188621 2554756
14571 2554756 2785814 2317149 2254538 2214167 2468559 2543940 2601670 2445079 2911163 2633626
14561 2633626 2430216 2772143 2496300 2759611 2883735 3347602 3515505 3392376 3671740
14552 3671740 4120702 4461941 5592886 7244608 11580653 19564649 39433653 37354486
14544C7354486j5595307r468784m313447l079436j620723n67039p53639O7401
14536B023512n2568j23492J72847n6944P3949J51657J51057o68637M48683K13960
14526B334024O8858R7642k49175J5589K90840K37342k87422J7508q8953K2154
14516B458407J19196P9155o4448M27816m24864J72012l7374j44980K93997J53682
14506C032599j3815o0646J05226r6680j21136N90557k40997L09222o8016j97220
14496C239094P4174j09371P00924l36485o9588O0261L91842l55567J96402j84454
14486C607232n8734N9898K36685j91844M31881k61691m8648L47607n7118K7099
14476D092367N0088j68931J34224L69671r5839j08344J4000J31752k62047M95465
$$ plain form
14544 37354486 21759179 12290395 7976948 4897512 3276789 2709750 1956111 2023512
14536 2023512 1970944 1847452 2020299 1963355 2037304 2188961 2340018 1671381 2120064 2334024
14526 2334024 2402882 2500524 2251349 2266938 2557778 2795120 2507698 2525206 2436253 2458407
14516 2458407 2577603 2656758 2592310 3020126 2595262 2767274 2729900 2584920 2878917 3032599
14506 3032599 3018784 2958138 3063364 2966684 2845548 3436105 3195108 3504330 3436314 3239094
14496 3239094 3313268 3203897 3904821 3568336 3498748 3559009 3950851 3595284 3791686 3607232
14486 3607232 3548498 3608396 3845081 3653237 4085118 3823427 3774779 4122386 4065268 4092367
14476 4092367 4142455 3973524 4107748 4477419 4381580 4273236 4287236 4418988 4156941 4652406
14466D652406J58967k96629K96038j51054K23663J36033j48245N5960L11720o310
14456E232549J37754j62844O0108O054L1287N4755L47535M5979j94580L75133
14446E933730l38981n7667N8165L68167K04742l311N8306L84193k65625M27906
14436F769625L0618j23419L2964L20582k2916k00167m8216L93418J76127J23006
14426G451622J19497l5907K23848L2126j25203K24415K03717p7843Q8898l4307
14416H070863L34650J55487J46854M5449L2047J73572L34156J75245q7336K87790
14406I668777r45R740L91205J81910J74836j00372M6627L56681L01891L28384
14396A1358734K8693J34633L56221K25500K6498K55228L27755j99046K74346L19640
$$ plain form
14466 4652406 4811373 4514744 4810782 4659728 4883391 5019424 4871179 4927139 5238859 5232549
14456 5232549 5370303 5207459 5267567 5273621 5304908 5359663 5707198 5753177 5558597 5933730
14446 5933730 5594749 5537082 5595247 5963414 6168156 6164845 6223151 6607344 6341719 6769625
14436 6769625 6800243 6676824 6709788 7030370 7007454 6807287 6759071 7152489 7328616 7451622
14426 7451622 7571119 7535212 7759060 7791186 7665983 7890398 8094115 8016272 8105170 8070863
14416 8070863 8405513 8561000 8707854 8753303 8785350 8958922 9293078 9468323 9380987 9668777
14406 9668777 9667832 9677572 10068777 10250687 10425523 10325151 10371778 10728459 11030350 11358734
14396 11358734 11387427 11522060 11878281 12103781 12130279 12385507 12713262 12514216 12788562 13108202
14386A3108202K31511N05303O2272L99868K97774N8183K60664K58626J16657P12966
14376A6012026K63904J88757J08088M34471N36200j5318L93911M32909K85577
14367A8640525N57081K06089L75548P75413J21197N66778K61477J031578M37448
14358B2973134M47290L00104M08361Q36970N33452N37652N14314P39979P68118
14349B8059374O55874Q42020N50792P28900N77231J045164R74249Q23085J045104
14340C5301793O33497J344827O61352J424692J035988R23213J178239J174484
14332D3678085J648869J348844J577947J115555J753430J597039J764715J636505
14324E6120989K015876J822835J940123K461075K112089K341290K351532K915574
$$ plain form
14386 13108202 13339713 13845016 13907288 14307156 14604930 14663113 14923777 15182403 15299060 16012026
14376 16012026 16275930 16464687 16572775 17007246 17543446 17528128 17922039 18354948 18640525
14367 18640525 19197606 19403695 19779243 20554656 20675853 21242631 21504108 22535686 22973134
14358 22973134 23420424 23720528 24128889 24965859 25499311 26036963 26551277 27291256 28059374
14349 28059374 28715248 29557268 30108060 30836960 31414191 32459355 33433604 34256689 35301793
14340 35301793 35935290 37280117 37941469 39366161 40402149 41325362 42503601 43678085
14332 43678085 45326954 46675798 48253745 49369300 51122730 52719769 54484484 56120989
14324 56120989 58136865 59959700 61899823 64360898 66472987 68814277 71165809 74081383
14316G4081383K604807L041365K895456K801212L641228L873649L683695L762050
14308A00384845L996638M488110M913466M763735N062934O017610N232531O484837
14300A41344706O545038O658582P592164P542816Q107361Q826682R007535R450606
14292B05075490J0014556J0562974J1611855J1430976J2089921J2980394J2855381
14285B86621547J3950732J3750047J4278632J4654860J4676160J4407036J4470706
14278C86809720J3637639J3182892J2060795J0784243R155741N661296J847737
14271D53140063O55755j322352n063696l167644l39375l931397p808790r944887
14263D22217677j1380291j3391561j4621287j5297237j5705515j5701639j5308851
$$ plain form
14316 74081383 76686190 79727555 82623011 85424223 89065451 92939100 96622795 100384845
14308 100384845 104381483 108869593 113783059 118546794 123609728 129627338 134859869 141344706
14300 141344706 147889744 154548326 162140490 169683306 177790667 186617349 195624884 205075490
14292 205075490 215090046 225653020 237264875 248695851 260785772 273766166 286621547
14285 286621547 300572279 314322326 328600958 343255818 357931978 372339014 386809720
14278 386809720 400447359 413630251 425691046 436475289 445631030 451292326 453140063
14271 453140063 453795818 452473466 447409770 444242126 443902751 439971354 432162564 422217677
14263 422217677 410837386 397445825 382824538 367527301 351821786 336120147 320811296
14256C20811296j5629090j5227854j4628300j3086307j3054197j2122345j2001746
14249B25061457j1561626j0978948r917026r600036q749132q441220p833824p370486
14241A50609159p316836o689768o068539n334906n729357n084086n347947m363292
14233A04674428m393230m082733l461348l722165l697058l341166l058998k967031
14225G5950699k774447k744469k593301k598638j942824j959268k112747k022773
14217E7202232j877570k285807j052686j495603j607650j681311j218757j434745
14209D4548103j554739j004432p35734j275156j270238j263995j060948n48441
14201C5834420j137123q02351j153395q40249r75061n53202l13571q03698j143512
$$ plain form
14256 320811296 305182206 289954352 275326052 262239745 249185548 237063203 225061457
14249 225061457 213499831 202520883 192603857 183003821 174254689 165813469 157979645 150609159
14241 150609159 143292323 136602555 130534016 125199110 119469753 114385667 109037720 104674428
14233 104674428 100281198 96198465 92737117 89014952 85317894 81976728 78917730 75950699
14225 75950699 73176252 70431783 67838482 65239844 63297020 61337752 59225005 57202232
14217 57202232 55324662 53038855 51986169 50490566 48882916 47201605 45982848 44548103
14209 44548103 42993364 41988932 41253198 39978042 38707804 37443809 36382861 35834420
14201 35834420 34697297 33894946 32741551 31901302 30926241 30373039 30059468 29255770 28112258
14192B8112258p34723n91465m40381o02614o54709p20559j95490r74354l11750
14183B2886213m21558o71602l84961o37044o92011j88155j14057r46083j07037
14174A8723705j18900n06400l18191n02197l70281J8737k02485p47324k81667
14165A5694997j80796l57465n28190J46616m28071l52983n3272N9487n62490j47064
14155A3290769l03058m44404K52741m29115J43117m45932n08141Q9292k9206j65144
14145A1450919m77092j97842k91435j90997k45493m7142J24373k10628k04609
14136I710054m37705M12982q1110l96445J3715n37457K26846j23299n2376j14346
14126H620859l20759Q5800k76503j66390l86480J61281J25747j15750n00680L91751
$$ plain form
14192 28112258 27377535 26786070 26345689 25743075 25088366 24367807 24172317 23197963 22886213
14183 22886213 22464655 21793053 21408092 20771048 20079037 19890882 19776825 18830742 18723705
14174 18723705 18604805 18098405 17780214 17278017 16907736 16926473 16723988 15976664 15694997
14165 15694997 15514201 15156736 14628546 14775162 14347091 13994108 13940836 14000323 13437833 13290769
14155 13290769 12987711 12543307 12796048 12366933 12510050 12064118 11555977 11645269 11616063 11450919
14145 11450919 10973827 10775985 10484550 10293553 10048060 10000918 10125291 9914663 9710054
14136 9710054 9272349 9685331 9604221 9207776 9221491 8684034 8910880 8787581 8735205 8620859
14126 8620859 8300100 8385900 8109397 7943007 7556527 7717808 7843555 7727805 7227125 7618876
14116G618876j27066j18227k65300k3984j21618k88923j3223N5152K4014m48070
14106F291631R3925l32307k48022N30087j68324r83j79923k57580j32833M81352
14096F077023n09682k84666K39493O1477j77006j94133k02240L83026R0480m12528
14086E071244J37256j78895m6057j80189j12813J49405M9384m55147K44647k8969
14076D649866K4866n99172M86608K20230n39122m7615J56586k05763l2438J9520
14066D133566j60291J49831j8422k21203J8212K07000j87969J34716n9409J77712
14056D173743l63472p4246K5840o5106J43766n73344K84265n35868L39973o3990
14046C291561K19356l46196m5273O1717j4079k09031O3830L5734p078K71503l83960
$$ plain form
14116 7618876 7491810 7373583 7108283 7084299 6962681 6673758 6660535 6715687 6739701 6291631
14106 6291631 6385556 6053249 5805227 6335314 6166990 6166007 5986084 5728504 5595671 6077023
14096 6077023 5567341 5282675 5522168 5583645 5406639 5212506 5010266 5393292 5483772 5071244
14086 5071244 5208500 5029605 4983548 4803359 4690546 4839951 4889335 4434188 4678835 4649866
14076 4649866 4674732 4075560 4562168 4782398 4243276 4195661 4352247 4146484 4114046 4133566
14066 4133566 3973275 4123106 4104684 3883481 3901693 4108693 3920724 4055440 3996031 4173743
14056 4173743 3810271 3736025 3761865 3696759 3840525 3267181 3551446 3015578 3355551 3291561
14046 3291561 3510917 3164721 3119448 3181165 3167086 2958055 3021885 3057619 3050541 3322044 2938084
14035B938084k30212l2303K98937L12893m00232L68908o19353L09188o4885k3652
14025B857373l3470k06445K67275m19162j2164K11680J72229l48036J15356j13249
14015B491387j80933K5987o3317O2633P0538l04958K27687N0260l89685M49438
14005B439037k82814K07684L19317n03381m0251k23566J31562l2003p0688j08328
13995A836569M37620n7860j59804L79597k09241O71454Q64041K616320O621161
13986A2999857J9744373O523297j3059913j0642919o364236k839219j366024r27669
13978D067547l15571m19663n57089k40815j26811N22696n42098R9369P3840o815
13968B554590j98413j43541j20655J26324j84292O45077p57767K81102m6713l64611
$$ plain form
14035 2938084 2707872 2675569 2974506 3287399 2887167 3256075 2636722 2945910 2881025 2857373
14025 2857373 2823903 2617458 2884733 2465571 2453407 2665087 2837316 2489280 2604636 2491387
14015 2491387 2310454 2336441 2273124 2335757 2406295 2101337 2329024 2379284 1989599 2439037
14005 2439037 2156223 2363907 2683224 2179843 2139592 1916026 2047588 2015585 1944897 1836569
13995 1836569 2274189 2216329 2056525 2436122 2226881 2898335 3762376 6378696 12999857
13986 12999857 32744230 39267527 26207614 15564695 9200459 6361240 4995216 4067547
13978 4067547 3751976 3332313 2775224 2534409 2407598 2930294 2388196 2487565 2561405 2554590
13968 2554590 2356177 2212636 2091981 2218305 2034013 2679090 1921323 2202425 2155712 1791101
13958A791101K14069j29843K10207n03166J57069J87921j55047J90057r6141Q7283
13948A953510k21100K26368K2863J9879k89329J57262j93980K63121l44818K21082
13938A814858k07525P0585J24448k60391K58767l68272L02984J9028k18197j16225
13928A420060L14597O9588l07868L49029p3979J4371j87110p4059k07833K80742
13918A597538j66216r4157j06153K35409n0045K37811k22189j42205L46810k0787
13908A615816l5345k33820j59609K17234K6610j83813j16537N0845l0658L82660
13898A533383n94593O50517k40239P2607m13134J25801L17419k06386k4918J25795
13888A346252P8257j04927j72419m9661k9333J68493l46893L81537k41456L05270
$$ plain form
13958 1791101 2005170 1875327 2085534 1582368 1739437 1927358 1772311 1962368 1866227 1953510
13948 1953510 1732410 1958778 1981641 2001520 1712191 1869453 1675473 1938594 1593776 1814858
13938 1814858 1607333 1677918 1802366 1541975 1800742 1432470 1735454 1754482 1536285 1420060
13928 1420060 1734657 1804245 1496377 1845406 1771427 1785798 1598688 1524629 1316796 1597538
13918 1597538 1431322 1337165 1231012 1466421 1416376 1654187 1431998 1289793 1636603 1615816
13908 1615816 1580471 1346651 1187042 1404276 1430886 1247073 1130536 1181381 1150723 1533383
13898 1533383 938790 1589307 1349068 1421675 1008541 1134342 1451761 1245375 1220457 1346252
13888 1346252 1424509 1319582 1147163 1097502 1068169 1236662 889769 1271306 1029850 1335120
13878A335120N8874n57066K95039J55828m76525M2847O21616l67212J20935k85929
13868I43527J60979k40794N65074l75980P5362K53438l55099J58268j4828k7504
13858A142443j72832L06308l8564j39379R6019P3483m62500k31437L97182j17140
13848H53583L14082o7311j39820P4948j47962K0780r1945K22458q3978j40452
13838H14383J14741j62409J34431J60812J82827n95410M25331o3467M903q944
13828A007198J66502r9397j6972k90358N05932m48211R8489l17447K43536o5555
13818G83717L40921k44999j25428N1675k571j1660L2608p3359K13917J15004m56043
13807F23782J39716k38079K83885q3009K10491l29675J19226r1658N9549K17570
$$ plain form
13878 1335120 1393994 836928 1131967 1287795 811270 854117 1475733 1108521 1229456 943527
13868 943527 1104506 863712 1428786 1052806 1128168 1381606 1026507 1184775 1169947 1142443
13858 1142443 969611 1275919 1237355 1097976 1193995 1267478 804978 573541 970723 853583
13848 853583 1167665 1100354 960534 1035482 887520 908300 816355 1038813 954835 814383
13838 814383 929124 766715 901146 1061958 1244785 649375 1074706 1011239 1016142 1007198
13828 1007198 1173700 1074303 1057331 766973 1272905 824694 923183 605736 849272 783717
13818 783717 1124638 879639 754211 805886 803315 791655 824263 750904 964821 1079825 623782
13807 623782 763498 525419 809304 726295 936786 607111 726337 634679 694228 911798
13797I11798j53042j95009P3123o2767J95471k75930R3465K6872n0444J99937
13787G63474k50724L83719j03540m4798K973j56328K87838l18103K4484J59705
13777G48700l63231M69197j45667N7852k1758k97426K51616k02829L97858k69944
13767F24368J04263J42578o4965j82333B84504M42714k48780J27807Q3437K68114
13757I57796l62039p3449K68947K2692k99894K2692J65872k92270J72956j35061
13747D48242J03835j16303K89075N8825n6761j25456p086p4066R2644n7182L0678
13736E86445B9732P90980l59104R8565O5678j57349K25507j6469j26739p4799
13726D76002K59878j31910p2286j87794J37442n9755N5820K7060K59513k38184
$$ plain form
13797 911798 758756 563747 636870 574103 769574 493644 587109 613981 563537 763474
13787 763474 512750 896469 792929 748131 751104 594776 882614 564511 588995 748700
13777 748700 385469 854666 708999 766851 745093 447667 699283 496454 894312 624368
13767 624368 728631 871209 806244 623911 284504 727218 478438 606245 689682 957796
13757 957796 595757 522308 791255 813947 514053 536745 702617 410347 583303 448242
13747 448242 552077 435774 724849 783674 726913 601457 594371 520305 612949 555767 586445
13736 586445 29732 820712 461608 560173 625851 468502 694009 677540 550801 476002
13726 476002 735880 603970 531684 343890 481332 421577 477397 504457 763970 525786
13716E25786m5292M22141C26821J48390J92779l24526o7294L44203m5963B54257
13705D24959j92739L54732k59325M78038k75851j36990p7282M40552B18664L77239
13695E95903A62982P10468l96176L23104l03942j31986L17010l5706o0552B26970
13684E57402k8174A18685M68797k55744j879E0907N92986j3280l3447J49863j28604
13673F18425j33275j26090K51850B31980J20977K55568A44861O1439J12950L93594
13663G12844C06171r3249J01067K52040j23683J3478q3783P6485R0041k33547
13653C05020J98159m4516o1502F5165K47756J01679j80816K93867j85789A06283
13642A66808K09379K10133B47240L30400k62852o4226k5934K18658n6754L0559
$$ plain form
13716 525786 480494 902635 326821 475211 667990 343464 276170 620373 574410 254257
13705 424959 232220 586952 327627 805665 529814 392824 315542 756094 218664 595903
13695 595903 162982 873450 477274 800378 496436 364450 681460 645754 585202 226970
13684 557402 529228 118685 587482 331738 329859 50907 643893 630613 597166 747029 618425
13673 618425 485150 359060 610910 231980 352957 608525 144861 206300 319250 712844
13663 712844 306171 212922 313989 566029 442346 455824 372041 448526 538567 305020
13653 305020 503179 458663 397161 65165 312921 414600 233784 527651 341862 106283
13642 166808 376187 586320 247240 577640 314788 250562 224628 443286 386532 417091
13632D17091B07885J92993m9913Q4147G1120O18541k03077j33685n0540n6620
13622B45739R9189l0628J72148J97932B49222L2743k1957N125J10846N7936j17911
13611C16004A53852J77823l2302P7272J728p1753l2201J19165n3186j140m1033
13600B98225K08009J15574B72968M9465K2641M4979j55408L39464j60637r1922
13590C21550L0217j36300R9015m6201J9403G4224L62437J01419q5371k3029J63703
13579E93383A72344N9992L06617R3167j32832B24796K75700I7335L46016L1611
13569D74962j51849j36074j5262O3908J31084J42593B00992J2559M30921j72179
13559D72293q3886M2574k14776L26030B61058L381r5150J50230n1825J30726R7974
$$ plain form
13632 417091 207885 400878 350965 435112 71120 689661 486584 352899 302359 245739
13622 245739 344928 314300 486448 684380 249222 281965 260008 265133 375979 433915 316004
13611 316004 153852 331675 299373 376645 378373 306620 274419 393584 340398 339258 298225
13600 298225 506234 621808 272968 322433 345074 390053 234645 574109 413472 321550
13590 321550 351767 215467 314482 268281 287684 74224 436661 538080 452709 429680 593383
13579 593383 172344 232336 538953 632120 499288 224796 500496 97335 443351 474962
13569 474962 323113 187039 171777 235685 366769 509362 200992 213551 644472 472293
13559 472293 388407 430981 216205 542235 261058 264439 169289 319519 267694 398420 496394
13548D96394B00071J02479J7975J02926j57840J58900J51240A43523K55758P7623
13538D76904k15538N7342H3937K06461r7297J6143N2906D7520K33729M949M0570
13527C26768J66845A79550K83073L1158k01046R8651M2403M7075B29873L3361
13517B63234L1942A28352o0828P5686K55613F478K61539K12386B4792Q2545J8547
13506A25884Q7895K43530k25171E1838L65966A25522l982L29781A60130L15121
13496D75251p8172C8995L64221A48411L8721b4094E00629B45834Q9196G8647A1514
13484A73966C6919J70227l0353F8332L92205j88866a09676A84208P7668K27768
13474D89644I2785B7363J45540J07178q9891A9941c5178D41734A36259N3072K3688
$$ plain form
13548 496394 200071 302550 320525 423451 265611 424511 575751 143523 399281 476904
13538 476904 261366 318708 83937 290398 193101 209244 262150 47520 281249 286198 326768
13527 326768 493613 179550 462623 493781 292735 391386 433789 480864 229873 263234
13517 263234 295176 128352 67524 143210 398823 6478 268017 480403 24792 107337 125884
13506 125884 213779 457309 232138 51838 417804 125522 121540 451321 160130 475251
13496 475251 397079 38995 403216 148411 187132 -24094 500629 245834 335030 78647 11514
13484 173966 36919 207146 176793 68332 460537 271671 -109676 184208 261876 489644
13474 489644 92785 27363 172903 280081 190190 19941 -35178 441734 136259 189331 213019
13463B13019C8181J08849J24000j2471J37506F5530a8850B45719K69419D1832
13452E35062B59474A12913K26852A36133J63011A09308K9545K12404o9507A05423
13441B79638L7018j14250n9130N4023a3295C10374C0230b8551C00970A10410J58600
13430B69010N3825D1560J67143o7198k0133R7956p0317L40513j76104q9526d2366
13418D60421o5173G7969k1576K740q535J86994n3984C5537a20446C15156G7804
13406A24566J51490A244N2455A6652N45956F0142J08266C890J94015P2035P3621
13395C43561I1363K97320R8928G1816J21129L1263K1707P4562A53781K9135L88761
13384E71677e1342A84398k7709p8092J18718q7829J44417G7976O62439k90348
$$ plain form
13463 213019 38181 147030 271030 258559 396065 65530 -18850 245719 515138 41832
13452 535062 259474 112913 339765 136133 299144 109308 138853 351257 281750 105423
13441 279638 316656 202406 143276 197299 -13295 310374 30230 -28551 300970 110410 269010
13430 269010 322835 41560 208703 141505 121372 219328 149011 489524 313420 223894 -42366
13418 460421 395248 77969 56393 59133 50598 237592 183608 35537 -120446 315156 77804
13406 124566 276056 1244 53699 16652 562608 60142 168408 3890 197905 269940 343561
13395 343561 91363 388683 487611 71816 192945 224208 245915 320477 153781 182916 571677
13384 571677 -51342 184398 156689 78597 197315 109486 253903 77976 740415 450067
13374D50067r9379d3882A58037r994J11608k2286d5224H9835J44795l0980J00249
13363C03899m6393J01811k143a8032D36505o7870G3692N23726B97160N408J11745
13352D14313B7733K82036L680o6663J70367j47874K86771o7374B39666R2741o8979
13341B63428J4782n0230j3073p8796a0857D23675F9092M01784P3678k69717j25592
13330A49245a31750C77364j00646C4817g2577C76971C8178R9757k1924h2854B03836
13318C23094n6397a2848k26566I549a2637D7667K44087C3313J10067J139h2152
13306D0090J71964a3382D42016g1730A04590J08108O7308A39916a36302B54913
13295B39937A07083K01255f3366E35660c7697A01860j2152J95397b00494B76625
$$ plain form
13374 450067 350688 -43882 158037 148043 259651 237365 -45224 89835 234630 203650 303899
13363 303899 257506 359317 357174 -18032 436505 368635 73692 597418 297160 302568 414313
13352 414313 27733 309769 313449 246786 417153 269279 556050 488676 239666 332407 263428
13341 263428 278210 227980 214907 136111 -10857 423675 69092 470876 544554 274837 149245
13330 149245 -131750 377364 276718 34817 -72577 376971 38178 137935 116011 -82854 203836
13318 323094 266697 -12848 -239414 9549 -12637 47667 291754 33313 143380 144519 -82152
13306 40090 212054 -13382 442016 -71730 104590 212698 280006 139916 -136302 254913
13295 239937 107083 308338 -63366 535660 -37697 101860 89708 285105 -200494 276625
13284H0478l5789d9816o2694E3097f3532B44382e2148E4559g9982j70564D9037
13272a6079l8589J6187A62128J58376B2010J421e3674A3490M51674r5096A35892
13260D887L94077E0112P6583k3198n0680Q9104Q9381B7455b97168C02521K2319
13249C24840A0591K67105g8353K107A26196M09542a33962A17127J6344J51524
13239B84995q1993J11015A08937R9343i6094C25589G0744J04890K17778d3028
13228I0988J0981g0871A60306F0192L7245j8569J18807p568A9959J33889n8756
13217I5092K77448o750j63855J44171A42126J76100a03029K6195B19193b44341
13206B3816J59054C4526a20223B71174o7523B606c8997H7838O709D6790M3790
$$ plain form
13284 80478 44689 -49816 -112510 53097 -63532 244382 -52148 54559 -79982 -250546 49037
13272 -16079 -54668 -38481 162128 320504 22010 23431 -53674 13490 465164 370068 135892
13260 4887 398964 50112 126695 103497 52817 141921 231302 27455 -297168 302521 324840
13249 324840 10591 277696 -78353 -76246 126196 535738 -133962 117127 133471 284995
13239 284995 203002 314017 108937 208280 -96094 325589 70744 175634 393412 -43028
13228 90988 101969 -70871 160306 60192 97437 78868 197675 190107 19959 153848 95092
13217 95092 372540 365790 201935 346106 142126 318226 -103029 -76834 219193 -244341
13206 23816 182870 34526 -120223 271174 203651 2606 -38997 87838 94547 46790 90580
13195I0580g0694B14255g0118B7047Q2327J51792G1985J80878E1638j0319R7970
13184A39289J27589C8648K36606m6168D4193K77130j39886J5923K73957H1831
13173A95501q9562g0654A48477G0520J00354C7416a4781B28702c6135B52807f8280
13161B96447B8780L2910b97627c6029H6011i0892M2306F238i7610G9925Q7455
13150A67380J40638F4289c0016C61984c3367C43412A8085i021B65731k0889c4119
13138G8748J62897F942Q5813C3364e3992a9300A13424c6350J6328F1467e642j96304
13126b01946A22263j0569k9666M5949J36315r064e4315j889A79658J66645a54565
13114A43267b12220I0570a50599O1452c7080m1218C31577A6409K19788o6520a9316
$$ plain form
13195 90580 -70694 214255 -70118 27047 109374 261166 71985 252863 51638 41319 139289
13184 139289 266878 38648 275254 229086 44193 321323 181437 197360 471317 81831
13173 195501 105939 -70654 148477 70520 170874 37416 -14781 228702 -36135 252807 -68280
13161 296447 28780 61690 -297627 -36029 86011 -90892 -48586 6238 -97610 79925 167380
13150 167380 308018 64289 -30016 361984 -33367 343412 18085 -9021 265731 244842 -34119
13138 78748 241645 6942 92755 33364 -53992 -19300 113424 -36350 -20022 61467 -5642 -201946
13126 -201946 122263 111694 82028 127977 264292 255228 -54315 -56204 179658 346303 -154565
13114 143267 -212220 90570 -150599 -89147 -37080 -78298 331577 16409 236197 169677 -19316
13102A11856C0380d9572E73292B55663o5955a22970b5708L591B11554k980K3676
13091B32250b5708A89836D7751b4350I2316b32221A4355e9986B40756a3291A1027
13079I7039a8993B1734K49708h4680b6090H2822J3914m6524M21885a34440B71231
13067B97531b01217m435B39454d96038A58199O1680a51892A34262J03760D9436
13056A99545q0770C2635J56091f244C12855E8012K03225R1788k3089n6854P5658
13045C48740I363R9480b36693A53646p567a34037E4265A3869R4330b2848A94113
13033A64476p8634j4240K83901l4682p712I5776K33456a3211k8028A25961c5800
13021A89661j3039J61772B7841h7520A38981a78785f4747G7330M4114m8913J22986
$$ plain form
13102 111856 30380 -49572 573292 255663 189708 -122970 -25708 -22117 211554 208574 232250
13091 232250 -25708 189836 47751 -24350 92316 -232221 14355 -59986 240756 -13291 11027
13079 97039 -18993 21734 271442 -84680 -26090 82822 96736 50212 472097 -134440 271231
13067 297531 -201217 -205652 239454 -496038 158199 219879 -151892 134262 238022 49436
13056 199545 118775 32635 188726 -6244 312855 58012 261237 353025 329936 273082 348740
13045 348740 9363 108843 -236693 153646 146079 -134037 54265 13869 108199 -22848 194113
13033 164476 85842 71602 355503 320821 313109 95776 329232 -13211 -41239 125961 -35800
13021 189661 176622 338394 27841 -87520 138981 -178785 -64747 77330 121444 72531 195517
13010A95517L62233b09887A00367c4666A75762N7674a70665C2144J56225G5918
12999D6377J85254P0974G3708L98k9172h9055b3354E4583J82862A04633J08322
12988B12955a77184j15618B9068J1964O0386m4535a11498A2901N0403G421a48060
12976a42028F9113b4820I2534m1597c74225G7561K73875j72764R4984a6885C48032
12964C9813J94536a31878C37471b05925B53730a48649D7676a64721P4646c009
12953A03926b07229L148A42153a63359A7020Q1256a89699D0865a67164A04760
12942b97419A62492a06681b1653d343D13039f5813a2834D1055N6534L66138a7280
12930B34736g4495A5084K20415b36183D3363a28525K2804A00149c7145A2824b6171
$$ plain form
13010 195517 557750 -209887 100367 -34666 175762 233436 -170665 32144 188369 75918
12999 46377 231631 302605 73708 74106 44934 -89055 -23354 54583 237445 104633 212955
12988 212955 -177184 -292802 29068 41032 101418 56883 -111498 12901 63304 7421 -148060
12976 -142028 69113 -24820 92534 50937 -374225 77561 351436 178672 273656 -16885 348032
12964 39813 234349 -131878 337471 -205925 253730 -148649 47676 -164721 -90075 -3009
12953 103926 -207229 -204081 142153 -163359 17020 98276 -189699 40865 -167164 104760
12942 -297419 162492 -106681 -21653 -4343 413039 -65813 -12834 41055 97589 463727 -17280
12930 234736 -74495 15084 235499 -236183 43363 -128525 -105721 100149 -37145 12824 -26171
12918g0089n1231H800J50274j4975a71060j15077e4614A93867f8100K5967n2287
12907i4420A80161d30060j3274I2662j0578h135j31378K7354a1387C3493N8822
12896I2315g8663m2527A25135P0041K7040o9396J76594G0205J27798h6051j197
12885h7248B9504K28342b9795j56675a5548G9189a32643k04089I0073P7924a19896
12873F456K31426a54826A46221i6454k65652a12960j48770A53852f5021E6037
12862A20774D1793K96273c01852f7431A62784g7725n4531A36116b36644A81266
12851h2656C73674j11054a18455H798M3201h0106A41231a2553k59763B04105a73062
12839A43260a20879G0326L03512A27586K64699j07089H5346N6742l030c27060
$$ plain form
12918 -70089 -121320 8800 159074 144099 -171060 -286137 -54614 193867 -68100 -42133 -94420
12907 -94420 180161 -430060 -443334 92662 82084 -8135 -139513 -112159 -11387 33493 92315
12896 92315 -78663 -121190 125135 195176 222216 152820 329414 70205 198003 -86051 -87248
12885 -87248 29504 257846 -29795 -186470 -15548 79189 -132643 -336732 90073 167997 -119896
12873 6456 237882 -154826 146221 -96454 -362106 -112960 -261730 153852 -65021 56037
12862 120774 41793 338066 -301852 -67431 162784 -77725 -132256 136116 -236644 181266
12851 -82656 373674 262620 -118455 8798 51999 -80106 141231 -12553 -272316 204105 -173062
12839 143260 -120879 70326 373838 127586 392285 285196 85346 142088 139058 -327060
12828a16573F9995J26855m2185N1782p7144B7706e0303m5835B88527A33740J1651
12817A45391a88632C4466i6795j81104h5920L4398j17713F949h0751C28602n5084
12806B73518b2644B20863b09305h1502A52324c19874E119L27975A5129a67114
12795c37747d0171A15945L9344jC4239O0319N6402E3709M4792a77651B87485H2717
12782H7477m2589N3934a46327a5268q9830K3454A52259O9519a02481M4529D1726
12770D46609A80555l0070n3774K916b56366D5421J02287a79490n2411a0843B08969
12758A22310a19052A20925k0170a49721j83071a20584A33598J58242n9959n5088
12748A76793o4715b78135f6295C88722h4275E2610c84967I6543k8901c92905A22186
$$ plain form
12828 -116573 69995 196850 154665 206447 129303 27706 -50303 -96138 288527 133740 145391
12817 145391 -188632 34466 -96795 -277899 -85920 -51522 -169235 6949 -80751 328602 273518
12806 273518 -22644 220863 -209305 -81502 152324 -319874 5119 333094 15129 -167114
12795 -337747 -40171 115945 155289 155288 34239 94558 150960 53709 98501 -177651 287485 82717
12782 87477 44888 98822 -146327 -15268 -105098 -81644 152259 221778 -102481 -57952 41726
12770 446609 180555 150485 96711 99627 -256366 45421 147708 -179490 -231901 -10843 208969
12758 122310 -119052 120925 100755 -149721 -332792 -120584 133598 291840 231881 176793
12748 176793 112078 -278135 -66295 388722 -84275 52610 -384967 96543 67642 -392905 122186
12736B96343D9608A8509J8527d0528j68411k40A80923J57953F6935J61553m3680
12725A84808a25594A10995k2765a45043B1904L12066A07334b90188J15769C36394
12714D3448J87974h354H3730i2840C06250K3197N7520a00311D0030J99306l2502
12703B06834Q9728G842g2387D7591F000J74961E3478e2397a9476C993L48924a02526
12690c120A35601a47471B5649a69855A41723e4884j71758C901N5209e8934A81011
12678D61476k16634L09700A11496B3631Q903e0167i847E4310a15441m5316b0904
12666B64004p6744b0914l5220d410B9614a43752A25142C378P8308Q866L71152
12655D61704A34459A9308K6678J1764L03073b7293E98071c2162B00860r8135b6801
$$ plain form
12736 296343 49608 18509 37036 -40528 -208939 -209179 180923 338876 66935 228488 184808
12725 184808 -125594 110995 88230 -145043 21904 333970 107334 -290188 -174419 336394
12714 43448 231422 -8354 83730 -92840 306250 329447 386967 -100311 40030 239336 206834
12703 206834 296562 7842 -72387 47591 6000 180961 53478 -52397 -19476 3993 352917 -102526
12690 -3120 135601 -147471 25649 -169855 141723 -54884 -226642 3901 59110 -58934 181011
12678 461476 244842 554542 111496 23631 32534 -50167 -9847 54310 -115441 -160757 -20904
12666 264004 187260 -20914 -56134 -4410 29614 -143752 125142 3378 81686 90552 461704
12655 461704 134459 19308 45986 57750 360823 -27293 598071 -32162 200860 102725 -26801
12643B0119a49074A23667e6497J4283E20888A33963A7413J87229a13508B83029
12632E614J12666K89207j51957k919G9831J19640J05335B9107c2343p4998n1741
12621a59082B82397K59819k03543j23621r2457b8108m8920A09330J28675r6545
12611A41460a44406B2776b10939Q245B70023a750p2383l474A94387q9685N3387
12600A58089P282J7844p2001N0924oj3011c17980c5146l8646C51970a88150J88
12588a87962A23704b8839F5154J11641Q5003b98194H5129A5161a151I1735i6959
12576b7755j69842d7955D0923a07658r2924D1318J41039n0080a37010f0661A77360
12564A94781G375J3046e1967a9754j67287B70863j01346N7730b69490e1632a7007
$$ plain form
12643 20119 -149074 123667 -56497 -42214 520888 133963 17413 204642 -113508 283029
12632 5614 118280 407487 255530 252611 79831 199471 304806 29107 -32343 -107341 -159082
12621 -159082 282397 542216 338673 215052 122595 -28108 -77028 109330 238005 141460
12611 141460 -144406 22776 -210939 -202694 270023 -1750 -74133 -77607 194387 104702 158089
12600 158089 165371 183215 111214 162138 162132 149121 -317980 -35146 -73792 351970 -188150 -187962
12588 -187962 123704 -28839 65154 176795 261798 -298194 85129 15161 -1151 91735 -96959
12576 -27755 -197597 -47955 40923 -107658 -200582 41318 182357 132277 -137010 -60661 177360
12564 194781 7375 20421 -51967 -19754 -187041 270863 169517 227247 -269490 -51632 -17007
12552b63646A71074c6265E757b1309p4143A13577D5751J26377f1065k1578k1542
12541a04185k43571A47403c5578A74585G808k014m06M29240f3010J5451H4959
12529A51986b4293G1232a74684h0292B08922G8111J3118i2315k6065J357j52983
12518b70006C980f8515E6809d0490A97597q1941a17611L4188G2222d16124b5431
12506C19259A35857B3072J31031G1115J27199G9419J84698A17908d9964C77392
12495A07105a21662a332B84847e2999B5962a7502j079b563i59m61535C18000a85376
12482e8458K5586B09894L8446b43221h7630j99231g5669d307A09144C8835h7796
12470g6652A39161L3715a41932Q303E4976J60048A6736a03451l3126b896l3860
$$ plain form
12552 -263646 171074 -36265 5757 -21309 -95452 113577 45751 172128 -61065 -82643 -104185
12541 -104185 -347756 147403 -35578 174585 7808 5794 5388 434628 -63010 -47559 84959
12529 151986 -24293 71232 -174684 -80292 208922 78111 91229 -92315 -118380 -117023 -270006
12518 -270006 3980 -68515 56809 -40490 197597 115656 -117611 -83423 72222 -416124 -25431
12506 319259 135857 23072 154103 71115 198314 79419 264117 117908 -49964 377392
12495 107105 -121662 -1332 284847 -52999 25962 -17502 -18581 -2563 -959 -462494 318000 -185376
12482 -58458 -32872 209894 248340 -243221 -87630 -286861 -75669 -4307 109144 38835 -87796
12470 -76652 139161 172876 -141932 -133629 54976 215024 16736 -103451 -136577 -2896 -36756
12459c6756A23805b17225B01052C8019d97615a93938i2704j56716A26305a52748
12448a05008c9086j0443B23047e4735p7970A53395F4550J95269B7897c7812E972
12436A4183J18622g1100q8398B21942d12616f1014B0863a3243B8200f7911i949
12424c40908A64407a47203A49972a18307A37146m8819B2616e4936n2025j90721
12414b97682A66859d9783A74988a80594B79948j31588E4729L7823a99234i8040
12403A60413J9440a67599N2611P237p4820b2382j44575P1023I1361J6229d9120
12391H4098L4369J00283a36669A38207b7373q7262A04906E0111J18568e8789B71445
12379c1088k02412C9741R97h057A53506k3103P7670O5490A13276l928a86759r6688
$$ plain form
12459 -36756 123805 -217225 201052 38019 -497615 -193938 -92704 -249420 126305 -152748
12448 -105008 -39086 -49529 223047 -54735 -132705 153395 64550 259819 27897 -37812 5972
12436 14183 132805 -71100 -159498 221942 -412616 -61014 20863 -13243 28200 -67911 -9949
12424 -340908 164407 -147203 149972 -118307 137146 88327 22616 -54936 -106961 -297682
12414 -297682 166859 -49783 174988 -180594 279948 148360 54729 92552 -199234 -98040
12403 160413 179853 -167599 -114988 -107751 -182571 -22382 -166957 -95934 91361 107590 -49120
12391 84098 118467 218750 -136669 138207 -27373 -114635 104906 50111 168679 -58789 271445
12379 -31088 -233500 39741 40738 -8057 153506 130403 208073 273563 113276 109348 -186759 -283447
12367b83447Q5538r2382C86131h2340A03312B9882b0261A24818J2015g8519r6603
12356a75122I4293b16436A38245J32d6468j78737m8030Q9334j03599K7779f6041
12344a1981n7374f431k35059i976j54241B56119D8234d42301a13963I3674a04865
12332a0584A00743M5613i56B79989a27778A3037L78471a85830A25486b04883B47758
12320c7714j64071c008j0773l13786A18710e8568I2166l2370a58274K778B06538
12308a12414A35970a26429C00953a53216D5427M1035K8040A5382h9896B64981
12297g2658A25041F0739R09k3279c5908j76215f547p9611a2515A85555r0226J74975
12285B70304q2286R6293j00364a05127b8380B9222a83978H5705L8232J40579P4487
$$ plain form
12367 -283447 -197909 -290291 386131 -82340 103312 29882 -20261 124818 136833 -78519 -175122
12356 -175122 94293 -216436 138245 138377 -46468 -225205 -273235 -183901 -287500 -259721 -66041
12344 -11981 -69355 -6431 -241490 -9976 -164217 256119 48234 -442301 -113963 93674 -104865
12332 -10584 100743 146356 -956 279989 -127778 13037 391508 -185830 125486 -204883 247758
12320 -37714 -201785 -3008 -13781 -327567 118710 -58568 92166 59796 -158274 -155496 206538
12308 -112414 135970 -126429 300953 -153216 45427 86462 114502 15382 -89896 264981
12297 -72658 125041 60739 61648 38369 -35908 -212123 -6547 -86158 -12515 185555 95329 270304
12285 270304 188018 284311 183947 -105127 -28380 29222 -183978 85705 123937 264516 339003
12274C39003j47099a13153F9675P4289K73461A71954N1373r0300b54211d3017
12263G706f6961F7734J07703N3263J22347j62366M9295b75182a10740K0645B02795
12251I918J44005a6170E7117P9388b56919A45067E2642J29246e1635C0196J1523
12240D1719L6109j2751K5500k5113J70179I4266h1603D5053a36953B26689g997
12228E3903J48357J39422J16871A16915d0982A14635r192d0000C25911J21709
12218D47620B18778e5782E8501J92501E6183K27284J31572j17879j18159R1680
12208B70681J49027j87990i4325C37469j21480J82069j52140E3442P6503J38113
12198B68058N5807G3220L54658A54568J00816q8358e7937B52974F5377K25498
$$ plain form
12274 339003 191904 -113153 69675 143964 417425 171954 223327 133027 -254211 -43017
12263 7706 -66961 67734 175437 228700 351047 188681 237976 -275182 -110740 -90095 202795
12251 9918 153923 -16170 57117 136505 -256919 145067 52642 181888 -51635 30196 41719
12240 41719 77828 65077 90577 65464 235643 94266 -81603 45053 -136953 226689 -7997
12228 53903 202260 341682 458553 116915 -40982 114635 105443 -40000 325911 447620
12218 447620 218778 -55782 58501 251002 56183 283467 415039 297160 179001 270681
12208 270681 419708 231718 -94325 337469 215989 398058 245918 53442 129945 268058
12198 268058 323865 73220 427878 154568 255384 167026 -57937 252974 65377 290875
12188B90875E0263a66807A38518A7742L88412k01003p2919J5431a03743D07041
12177A79267g130A92204J89504A76598g6229D13629H9156c18315A02664N3483
12167A56147O7371a7095A68193K35684b75591J16234C32864E0989K1090o188J32287
12156A98178J89373A05544k3530c28555E187N32559h2656l7972B5361O9083N7125
12145A51569h6962j7336b5114A70715d1602J6581E3395a0611k90224A01247b03850
12133a37711A54454j9559d2253j58364A62423a7905B2009c9259G470a47054A99961
12121a5502F5990i4881C4770a77787B22908b6816j6524E1055a34888C072J45344
12110A48416b05171j39007F819J28522b9731C5493J6269A1917M6312a52178F4313
$$ plain form
12188 290875 50263 -166807 138518 17742 406154 205151 132232 147663 -103743 407041
12177 179267 -7130 192204 381708 176598 -76229 413629 89156 -318315 102664 156147
12167 156147 223518 -17095 168193 403877 -275591 -159357 332864 50989 72079 65891 198178
12156 198178 387551 105544 82014 -328555 5187 537746 -82656 -120628 25361 94444 151569
12145 151569 -86962 -104298 -25114 170715 -41602 -25021 53395 -10611 -300835 101247 -203850
12133 -137711 154454 134895 -42253 -200617 162423 -17905 22009 -39259 7470 -147054 199961
12121 -15502 65990 -94881 34770 -177787 222908 -26816 -43340 51055 -134888 3072 148416
12110 148416 -205171 -344178 6819 135341 -29731 35493 51762 11917 58229 -152178 64313
12098a27307K5228D3981j1771N4400m2865J44404a3555A88202c40116M6818g0720
12086c02971J39804C9875j6308M4336b43179p3469B74565m0898o0374R0726A18791
12074D47788J371062j81495o21354A50229G4153J75177k0549p0152n0543K20182
12064C28268p3849A04301a90200B94989f9684K8383I1914a30951k7305I4319a58527
12052c36443a47657A76445O8269c35602B36924h4834k5670p1972K523C12084A02782
12040b2664P777F9557J19654a44965n3381M1102k18439J82559a8061k5762j61126
12029b04949H637Q5542A7279a12346c1826D1808a8972o5690B0463b15006d794
12017A29667a90002A20737c5738B47478J41077a82659Q7225E6002J77814f6656
$$ plain form
12098 -127307 -102079 43981 32210 86610 43745 188149 -13555 188202 -340116 -293298 -70720
12086 -302971 -163167 39875 23567 67903 -243179 -316648 274565 233667 173293 264019 118791
12074 447788 1818850 1637355 1016001 150229 74153 249330 228781 158629 108086 328268
12064 328268 254419 104301 -190200 294989 -69684 -41301 91914 -130951 -158256 94319 -158527
12052 -336443 -147657 176445 244714 -335602 236924 -84834 -110504 -182476 -179953 312084 102782
12040 -22664 -14887 69557 189211 -144965 -198346 -157244 -375683 -193124 -18061 -43823 -204949
12029 -204949 8637 94179 17279 -112346 -31826 41808 -18972 -84662 20463 -215006 -4794
12017 129667 -190002 120737 -35738 247478 388555 -182659 -95434 56002 233816 -66656
12006b64457a19251B37414a65707o4119e8637K195j70070G9273a0945l9828A25277
11994F9330h9988A17345b4533l30542I8916b62092C66315a46027B99785g3102
11983h8540A74817l7647c65957A26028D532c3135A45753e6596r9950E0655f9347
11971C945J68958C583a49550E0208b0961L086D6556i2935c3903k83635A92781
11959A21700J32948J72628b13750A22761j8689g5042F2070a7377f358I6665l1950
11948F4715J87855M1991a86765L6427B13824c8977j00091j04610a2984o8625A3137
11936c1433q531D24406a12596D39392c0736j54027G9382b41572A80883a59141
11925d66388A21195a58122A93023a57567E8364R5292L0013c44330J50355D7208
$$ plain form
12006 -264457 -119251 237414 -165707 -229826 -58637 -56442 -226512 79273 -10945 -50773 125277
11994 69330 -89988 117345 -24533 -355075 98916 -262092 366315 -146027 299785 -73102
11983 -88540 174817 137170 -365957 126028 4532 -33135 145753 -56596 -156546 50655 -69347
11971 3945 172903 3583 -149550 50208 -20961 -17875 46556 -92935 -33903 -317538 192781
11959 121700 254648 427276 -213750 122761 104072 -75042 62070 -17377 -6358 96665 64715
11948 64715 252570 294561 -186765 -150338 213824 -38977 -139068 -243678 -12984 -81609 13137
11936 -31433 -39964 424406 -112596 439392 -30736 -184763 79382 -241572 180883 -159141
11925 -466388 121195 -158122 193023 -157567 58364 153656 183669 -344330 -193975 47208
11914D7898f10j70192H2290J23879a25461p4890F6624b49645H3002J752b465A30180
11901B12418a1150C6543a3238A85344C8765O4336b26G5581A5109g325o5456A92253
11888A55329a25607e7581A41600d2223A05099a85514M0345C3294Q2536J20478
11878B36308d1834n12756K54092e5357K6677j63604G8231d7640j54618P8379A0294
11866C89519b54251a21707f0652a2092C32433a65169k3295A11137b00130N6577
11856a43553h110A74309o6688b84148A30536g8537B017O3449k5235q869J7554
11845D8916b12268G1372b62860J073L3043A20160J73016H3450g6582O032l71836
11834d42386B33271b25003A10684a73149A42424E8370K10587a27315E8327a06984
$$ plain form
11914 47898 -610 -170802 82290 206169 -125461 -200351 66624 -249645 83002 84754 -2465 130180
11901 212418 -11150 36543 -13238 185344 38765 103101 -226 75581 15109 -7325 -72781 192253
11888 155329 -125607 -57581 141600 -42223 105099 -185514 -145169 33294 115830 236308
11878 236308 -41834 -554590 -300498 -55357 -28680 -192284 78231 -47640 -202258 -123879 10294
11866 389519 -254251 -121707 -60652 -12092 332433 -165169 -188464 111137 -200130 -143553
11856 -143553 -8110 174309 107621 -284148 130536 -78537 2017 65466 40231 31362 48916
11845 48916 -212268 71372 -262860 -261787 -228744 120160 293176 83450 -76582 -70550 -442386
11834 -442386 233271 -225003 110684 -173149 142424 58370 268957 -127315 58327 -106984
11823a3646j350p4066F5151a83802b3374O217D3735L9937K042j6448a45056I374
11810f289o3269j00972A24869g1353j06002H7608b7608O865n6434a577G4087b12113
11797b04165j13774A15720J426b65425B86551b20154b3705i152A35856a00496
11786b21211A21347b67115G0254h0733p2634k3288I2839g3268k49497e8115J6891
11775d1224B93354b07663B5089e6533b2137j95885F4849A80L45449b44586G2001
11763c893k09916p4202a33888a0642k51307G8170K6002a07943j64823B65708j05104
11752A60604o4325L7243a55881r953A21422c2227l7785A94386j264d443A33345
11740a64605A02291E0695L7727a76291A53734i7268K0146B6116b46132h9111J2753
$$ plain form
11823 -13646 -14996 -89062 65151 -183802 -23374 -17157 43735 83672 85714 69266 -145056 9374
11810 -6289 -69558 -170530 124869 -71353 -177355 87608 -27608 -20743 -77177 -1577 74087 -212113
11797 -204165 -317939 115720 117146 -265425 286551 -220154 -23705 -9152 135856 -100496
11786 -221211 121347 -267115 70254 -80733 -153367 -176655 92839 -73268 -322765 -58115 -41224
11775 -41224 293354 -207663 25089 -56533 -22137 -218022 64849 180 345629 -244586 72001
11763 -3893 -213809 -288011 -133888 -10642 -261949 78170 104172 -107943 -272766 265708 160604
11752 160604 96279 133522 -155881 -165834 121422 -32227 -70012 194386 193122 -4443 133345
11740 -164605 102291 50695 88422 -176291 153734 -97268 -77122 26116 -246132 -89111 -76358
11729g6358H4857J95809a61778a2768B8080J61551e9112h114j30655P549b579
11717I2865m866A5110M15791A05477K38721L24253a24802p1002A84630m8647b19647
11705D1473a16856L0648B33374i7172k68765A14811J8807b29493B6182a05068
11694A73432b21204A69891c7919j89398j2231I8642J505a1227j88302A94750C0026
11682a5688n9380D7234L15816c50593a56982A21548J2043a87324I0496J403l5504
11671E6395J23085L9454E7030M033b36392A12090P858a63601E5937j2299a34876
11659C31125i3993C4583c15173h6117D282J41141e7359F436L3601c79391c6907
11647F4798M17340b37989B08238B4122B235K02632p4765a43030a9335f227A87263
$$ plain form
11729 -76358 84857 280666 -161778 -12768 28080 189631 -59112 -8114 -138769 -131220 -2579
11717 92865 87999 15110 430901 105477 344198 668451 -124802 -195804 184630 135983 -219647
11705 41473 -116856 -86208 233374 -97172 -365937 114811 133618 -229493 26182 -105068
11694 173432 -221204 169891 -37919 -227317 -239548 98642 100147 -11227 -199529 194750 30026
11682 -15688 -75068 47234 363050 -350593 -156982 121548 133591 -187324 90496 91899 56395
11671 56395 179480 218934 57030 61063 -236392 112090 119948 -163601 55937 43638 -134876
11659 331125 -93993 34583 -315173 -86117 4282 145423 -57359 6436 40037 -379391 -36907
11647 64798 482138 -237989 208238 24122 2235 204867 130102 -143030 -19335 -6227 187263
11635C37992b62792f693l73264B8154J10409K27A9278b8027n4578D6345N5608
11624A01953h1139B03166d5167E1551J28788F5007L02125b25015N4358k597D0914
11612G1829M9544g346m1860j72144j62506a69621h2738B92992j18108B0328k633
11601A7695a31876A82423a05007M657A63751B1742a00024A09696a20997A26550
11590b80893B9563g1A15021m1160b9216I9150R0353a14079E517K82798H5179a94645
11577b46217a11755B43963B0150e277k4006A70694J58938k3562A30659n0531h2430
11565a49155F5934B3028D790J01J88905n7097k7481e4451r9336B16885P3526h654
11552D9349K4288a51177P4025F9282a48900D42458A33838O9344e5633D29296A69067
$$ plain form
11635 337992 -262792 -6693 -379957 28154 138563 138790 19278 -28027 -82605 46345 101953
11624 101953 -81139 203166 -45167 51551 180339 65007 367132 -225015 -170657 -173254 40914
11612 71829 121373 -7346 -49206 -221350 -383856 -169621 -82738 292992 174884 20328 17695
11601 17695 -131876 182423 -105007 -100350 163751 21742 -100024 109696 -120997 126550
11590 -280893 29563 -71 115021 73861 -29216 99150 189503 -114079 5517 288315 85179 -194645
11577 -246217 -111755 243963 20150 -5277 -29283 170694 329632 306070 130659 80128 -82430
11565 -149155 65934 23028 4790 4891 193796 136699 109218 -54451 -153787 216885 290411 -8654
11552 49349 73637 -151177 -77152 69282 -148900 442458 133838 203182 -55633 429296 169067
11540A60062B1754a26145m0938B14768F3795J40939B6956L171J85444n9537G7875
11528A41700O5891g7669F4558a29195H4693b11174B42880a18227H4896f4514B16490
11516f555E16307B18970C1598L40237b55510d5650K0931j00213I1009k4210e9294
11504a09428J98B17410I0748b9131r0755D1227R8490K6904C4669R1212i6927n1166
11492a48093A6009f4940j8984D6306K76696A52852B9984K25225o2198L0079H112
11480i9218H0664J95956A374K45248d5397A78126G9650A9157R3862K6633J23743
11469B63395b9341o3845D1262J3857K90705a15093A37492N8359n7160J74766a33001
11457F3340N6188K7640h3707E6545L06969c9608j4152J2381k79862B94337b22742
$$ plain form
11540 160062 21754 -126145 -167083 214768 63795 204734 26956 30127 215571 156034 77875
11528 141700 207591 -77669 64558 -129195 84693 -211174 242880 -118227 84896 -64514 216490
11516 -6555 516307 218970 31598 371835 -255510 -45650 -24719 -124932 91009 66799 -59294
11504 -109428 -109230 217410 90748 -29131 -119886 41227 139717 166621 34669 125881 -96927 -148093
11492 -148093 16009 -64940 -83924 46306 323002 152852 29984 255209 193011 223090 8112
11480 -99218 80664 276620 1374 246622 -45397 178126 79650 19157 113019 139652 263395
11469 263395 -29341 -93186 41262 55119 345824 -115093 137492 195851 138691 313457 -133001
11457 63340 119528 147168 -83707 56545 363514 -39608 -53760 -41379 -321241 294337 -222742
11445B95245r6588a11629B72567j6518a86648J3481A23078K6296m502J10080a35000
11433B25054q0114O280a15225B23660A3355b55094D6613K4702J92994g8518k9424
11422a07942B97227a0973j4436n8142r1j26465I0644a38371a5439l50648a41147
11410B10989g3204m5396A71301C8058b33574A48488O4814a03708a7855G9633J82092
11399B61725C2033h866m1871r2390d8618j19349P7630H4803c0729B34408a74512
11387H8844B6082P566b03938I0121F756b35627B07712d886m3189p1073A29899
11375e160j59824J4730d4017I526K91354A5539K63629b80637a33674A43877a39070
11363A51395m082a30344B1547a14852F1818c8514j61971h4444K9531H5653C6391
$$ plain form
11445 295245 198657 -111629 272567 256049 -186648 -173167 123078 149374 144872 254952 -135000
11433 225054 144940 151220 -115225 223660 13355 -255094 46613 71315 264309 -78518 -107942
11422 -107942 297227 -10973 -25409 -83551 -83642 -210107 90644 -138371 -15439 -366087 -141147
11410 210989 -73204 -118600 171301 38058 -233574 148488 213302 -103708 -17855 79633 261725
11399 261725 32033 -8866 -50737 -143127 -48618 -167967 -90337 84803 -30729 234408 -174512
11387 88844 26082 33648 -203938 90121 6756 -235627 207712 -4886 -48075 -119148 129899
11375 -5160 -164984 -150254 -44017 9526 300880 15539 279168 -280637 -133674 143877 -139070
11363 151395 147313 -130344 21547 -114852 61818 -38514 -200485 -84444 -54913 85653 36391
11351G1212d3359p4141j59407f7849j31228B25842a28715A33593b98657J10902
11341a87755B77723d9752e187B5709J14266C6324L0383J08723a91220i3790B63670
11329A10419P0425c07565a23977l2042j30617Q9135L6532j86892a44008q031e2500
11317B82794a06988A93531g4392C0755b243A5777f5168J7393q0521J7616A21922
11305h9989K939P896B71577A0188a3135I7890b1040l27202a34445J4352k64930
11294c85023B42763A03710C3226o105a05356E30481E0194K30456d0583J4699k48441
11283b74325j7321C03194k3687E2358a69841N5550j35398b2408A497J09697D2234
11271b17017j8403A08185J22099F3698b22945F5737K10664d5708k30295A33125
$$ plain form
11351 71212 -43359 -117500 -276907 -67849 -199077 225842 -128715 133593 -298657 -187755
11341 -187755 277723 -49752 -5187 25709 139975 36324 66707 175430 -191220 -93790 263670
11329 110419 180844 -307565 -123977 -156019 -286636 -197501 -160969 -347861 -144008 -152039 -52500
11317 282794 -106988 193531 -74392 30755 -2243 15777 -65168 -47775 -128296 -110680 121922
11305 -89989 -87050 -79154 271577 10188 -13135 97890 -21040 -348242 -134445 -120093 -385023
11294 -385023 242763 103710 33226 27121 -105356 530481 50194 280650 -40583 -25884 -274325
11283 -274325 -291646 303194 279507 52358 -169841 -114291 -249689 -22408 1497 111194 42234
11271 -217017 -235420 108185 230284 63698 -222945 65737 276401 -45708 -276003 133125
11260B462e53627E536J16785b8503I2926c71128B2879O7528k7835A519b53817
11248H8381i8638o465A27722C0684J37462b9786F3314e1789A66174d0740j04097
11237a44837A12421K83015a73475j24784K8184N5399C35660g6714b4944j59683
11227a84627D5979c47575l6978C796M9844L5908I344J30889J91377H4793J62677
11216B47470p2066a06964K5575j11361B94200b04392j62492E6739J15154f8357
11205B49970j03037a55633B07037K1154P6830a71822I1813c93305a92430b7302
11194E5919d1032k04329J18682k6041f7264A57223E0507J95641a59728k7068F2582
11182i7084n518A40402b091p5992m2880d1956B96063c2406r6676D830f4178A21611
$$ plain form
11260 2462 -553627 5536 122321 -28503 92926 -371128 22879 90407 62572 1519 -253817
11248 88381 -98638 -105103 127722 30684 168146 -29786 63314 -51789 166174 -40740 -144837
11237 -144837 112421 395436 -173475 -298259 -270075 -214676 335660 -76714 -24944 -184627
11227 -184627 45979 -347575 -384553 3796 53640 89548 9344 140233 331610 84793 247470
11216 247470 175404 -106964 -81389 -192750 294200 -204392 -366884 56739 171893 -68357
11205 249970 146933 -155633 207037 228191 305021 -171822 91813 -393305 -192430 -27302
11194 55919 -41032 -245361 -126679 -152720 -67264 157223 50507 246148 -159728 -186796 62582
11182 -97084 -102602 140402 -2091 -78083 -120963 -41956 296063 -32406 -129082 4830 -64178 121611
11169G9457i2706a4481k03444j03135J14386B08859Q6387A1376J16649M47980
11159E76005a31841N4934k0011B37284c39503a29842A34345C3745c41185J43222
11149a97963L6443K6245N8161I3207a10937c9878C08008P752d13656a64406f5255
11137G025b42911B08036a51491A71992o0617a1415j68064A39214J0990C3488c77888
11125A20136c9700F8923A1352J80821J7010b21717B00826C279Q8726j7974K01350
11114B75381c07511d2855B24938j04243f8369B57156e1106E1003a1633A72254
11103B59318D4549J63987K1569J27487k3734M1529H3886P5642c28166D7939M6043
11092I3982J26426K45705A80299K18164j55016c9889H4669J10951K4542G9304
$$ plain form
11169 79457 -92706 -14481 -217925 -321060 -206674 208859 295246 11376 128025 576005
11159 576005 -131841 -76907 -96918 237284 -339503 -129842 134345 33745 -341185 -197963
11149 -197963 -161520 -135275 -77114 93207 -110937 -39878 308008 315760 -413656 -164406 -65255
11137 7025 -242911 208036 -151491 171992 111375 -11415 -179479 139214 150204 33488 -377888
11125 120136 -39700 68923 11352 192173 209183 -221717 200826 3279 92005 74031 275381
11114 275381 -307511 -42855 224938 120695 -68369 257156 -51106 51003 -11633 172254
11103 259318 44549 208536 230105 357592 333858 375387 83886 159528 -328166 47939 93982
11092 93982 220408 466113 180299 398463 243447 -39889 84669 195620 220162 79304
11081D70117H6701l3761J03993P0669J53864j75272B5165L40466K27362B17642
11070C82550R7987G6696L70093j47599L04296K9537j47939K49310A56882n1110
11060A05772K72777K90695A52597L08623P5460k59251L33808J74142j74682J94022
11050H04719j07617O1819j03227l9769L58543m74214K66983K4104K8099m03598
11040D15842J47384m265B32075K75448N9867J48808k76568J49406n272M3239L9271
11029F66274K37761k24619o6021m1752J22649R7507l53459L32428O3647C71611
11018D39123Q4746J97654O5415j06485J28531l02900M16947l05559K3699j65088
11008D76083J52041j91284O3675B04710K00779o8617M54320j09524j6696k17208
$$ plain form
11081 470117 86701 52940 156933 227602 381466 206194 25165 365631 592993 217642
11070 382550 480537 76696 446789 299190 603486 633023 485084 734394 156882 105772
11060 105772 378549 669244 152597 461220 536680 277429 611237 785379 610697 804719
11050 804719 697102 758921 655694 615925 974468 500254 767237 791341 819440 415842
11040 415842 563226 558961 232075 507523 567390 716198 439630 589036 583764 627003 666274
11029 666274 904035 679416 613395 571643 694292 791799 438340 770768 834415 371611
11018 439123 523869 721523 786938 680453 808984 506084 923031 617472 641171 476083
11008 476083 628124 436840 500515 204710 405489 336872 791192 681668 664972 447764
10998D47764r0968L08004j09598J51262P6287Q3316l50342M64956D63769L67666
10988H31435L3326q1694J04399r7488j7047K80071j48061K87119j2386K0186l3052
10977A166808O7685N16309J88518P9111M51533L48489n16059L08624L229j71943
10967B442304q1969n18508O5495k18786p8319j05359j30J40321r9294P2316k63439
10956A354632M64594l35887j60514p8625k61000l75773J09769l06086K60053P654
10946F78817B23638o8322C5566f1007B26611f5706A25434a34003B72741A8504
10935A20567a17497I1552D4461M48165a67687c5264k2569C48718e9426D06462
10924C29794a80890j66403F2054c6845E0916L23355e0080C40228G3374b95334
$$ plain form
10998 447764 356796 664800 555202 706464 782751 866067 515725 980681 463769 831435
10988 831435 864761 783067 887466 789978 772931 1053002 904941 1192060 1179674 1199860 1166808
10977 1166808 1234493 1750802 1939320 2018431 2469964 2818453 2302394 2611018 2614247 2442304
10967 2442304 2360335 1841827 1907322 1688536 1610217 1504858 1504728 1645049 1545755 1618071 1354632
10956 1354632 1819226 1483339 1322825 1244200 983200 607427 717196 411110 671163 678817
10946 678817 223638 155316 35566 -61007 226611 -65706 125434 -134003 272741 18504
10935 120567 -117497 91552 44461 492626 -167687 -35264 -57833 348718 -59426 406462
10924 329794 -180890 -347293 62054 -36845 50916 374271 -50080 340228 73374 -295334
10913a12301l1957G4753f4240E0828b68748F2034h6573A75516J6922a3909H6808
10901F5433b2428D6930Q7237J8861a64780b20j47269J2390B0559K40661j00109
10890A61111h5348G4285a62269p7766J682H0229P8050P8351B4371c58245P3517
10879b84728a06506j06921n707m9125A73832E1645g1080A98958a02183j73535
10869b75718d3975a032p9199A14452J59220D0033b25765O8176B58760f2203l925
10858f6128E4333e0438p310r2173j54228d9768C2143P943L10687I0191f8477k27176
10846b95653B24877a1402p4772q543G5864J16167F3522i8857k9981r067k1546
10835a59451m5393H5603c7706H2982a33886G4578b64302A48503a74219o0239a06270
$$ plain form
10913 -112301 -144258 74753 -64240 50828 -268748 62034 -86573 175516 192438 -13909 86808
10901 65433 -22428 46930 134167 153028 -164780 -220 -147489 -135099 20559 261220 161111
10890 161111 -85348 74285 -162269 -240035 -238353 80229 158279 236630 24371 -358245 -284728
10879 -284728 -106506 -213427 -219134 -268259 173832 51645 -71080 198958 -102183 -275718
10869 -275718 -43975 -1032 -80231 114452 273672 40033 -225765 -157589 258760 -62203 -66128
10858 -66128 54333 -50438 -57748 -149921 -304149 -49768 32143 40086 350773 90191 -68477 -295653
10846 -295653 224877 -11402 -86174 -94717 75864 192031 63522 -98857 -128838 -137905 -159451
10835 -159451 -204844 85603 -37706 82982 -133886 74578 -264302 148503 -174219 -234458 -106270
10823g1132D1504d1834l78583K00893R8360C4277K5509b43030B5449P5760P98
10812A02007b33083E5612L21765D9731L9135b68355J23439E1624b41552j54525
10802c96077f4599j16344j86508a23114N8932A84880b62906j10519a82365A86757
10791C546J52441a71614o2570J04403A63228b6597A41760a86089C797e2128B7480
10779c33431B22380b48664J6394d6465m9196j14381n2551A52227B5963J47830
10769A73793b40449Q9742j17208E5870L2507a74887j776K5913A73093b63187N516
10758b57671L0207A5504a22898B61809n1552a96346m0323B91087a00275H768c08171
10746e6894K3609n1619j43226a02599A46127A6539e6629C4568c7355j95333R235
$$ plain form
10823 -71132 41504 -41834 -420417 -219524 -121164 34277 59786 -243030 25449 101209 102007
10812 102007 -233083 55612 377377 49731 88866 -268355 -144916 51624 -241552 -396077
10802 -396077 -64599 -180943 -367451 -123114 -64182 184880 -262906 -373425 -182365 186757
10791 3546 155987 -171614 -234184 -129781 163228 -26597 141760 -186089 3797 -52128 27480
10779 -333431 222380 -248664 -232270 -46465 -95661 -210042 -262593 152227 25963 173793
10769 173793 -240449 -150707 -267915 55870 88377 -174887 -176663 -150750 173093 -263187 -257671
10758 -257671 -227464 15504 -122898 261809 210257 -196346 -236669 291087 -100275 8768 -308171
10746 -56894 -33285 -84904 -228130 -102599 146127 16539 -56629 34568 -37355 -232688 -223453
10735b23453n8742B9947c0462k63655Q6838E8559J7761d8084A21966D7449l347
10724D4102N8739a95015C7813a24446C20081F5016k8369K16081b3081o9946k07546
10713c00573a21769M9345B32624a29466N2126B33802a80955A17645j395a83418
10702b51974D1348c03275R0696K763B23333f2391j26007N6660e5555G8856e1095
10690d7480A3149h9419J6739i648B6965O6747f2705E8775b07391F0282b7922j5691
10678d3613p0384j58962P3184B76017q4553p2845P268J41663j30156b75991J30384
10667a45607M6920p8111K1952k64856A50072l5172c12583a8486q187j35811e9385
10655b5590k25686a16564l04079J03103a57325H5625m1838a57830M8925l21498
$$ plain form
10735 -223453 -282195 29947 -30462 -294117 -207279 58559 76320 -48084 121966 47449 44102
10724 44102 102841 -195015 37813 -124446 320081 65016 36647 252728 -23081 -93027 -300573
10713 -300573 -121769 -72424 232624 -129466 -77340 233802 -180955 117645 116250 -183418
10702 -251974 41348 -303275 -212579 -209816 223333 -62391 -188398 -131738 -55555 78856 -51095
10690 -47480 13149 -89419 -72680 -9648 26965 93712 -62705 58775 -207391 60282 -27922 -43613
10678 -43613 -113997 -272959 -199775 276017 191464 118619 125887 267550 137394 -275991 -145607
10667 -145607 -98687 -176798 -154846 -419702 150072 114900 -312583 -18486 -26673 -162484 -59385
10655 -25590 -251276 -116564 -420643 -317540 -157325 85625 43787 -157830 -108905 -430403
10645d30403J27150A62292f947C7592a36577B04467a4243o9173A38546b0882F3688
10633A32208L847l9628b03599j0648A46243a57550A15388c55390J00286R1828
10623a63276A11515D8723b75494A55685a16008j26686A85462L9118b98225B46564
10612d7701j55840B03604L58756a33277e293A55367b45175B05126a63930D321
10601F1856j1792b65556C3140f9449j25628F3131M381Q4078a17012A29923E6805
10589A26837O3121O1733F7209h7205j83530L5427C20226a20079A3789a08225k75568
10578c83793e2849A05123J3273c21236J38598n9436P8186j8741A64288a54388
10567c9469A07181a4439n0945j97038P7939A15923J04379d0835B8591a30929G6498
$$ plain form
10645 -430403 -303253 162292 -6947 37592 -136577 204467 -14243 -83416 138546 -20882 63688
10633 132208 136055 96427 -203599 -214247 146243 -157550 115388 -355390 -255104 -163276
10623 -163276 111515 48723 -275494 155685 -116008 -242694 185462 224580 -298225 246564
10612 -47701 -203541 203604 562360 -133277 -5293 155367 -245175 205126 -163930 4321
10601 61856 50064 -265556 33140 -69449 -195077 63131 67512 151590 -117012 129923 56805
10589 126837 189958 251691 67209 -87205 -270735 -235308 320226 -120079 13789 -108225 -383793
10578 -383793 -52849 105123 118396 -321236 -182638 -242074 -163888 -182629 164288 -154388
10567 -39469 107181 -14439 -65384 -262422 -184483 115923 220302 -40835 28591 -130929 76498
10555I220a55248M2532k2175A38952a07242l20401A64382o7109a04866d7260j53007
10544b00267P4039j77391i555p9164C37397C5621d7927a3096j50128j03946A15111
10532g2713l05931b9774r4956A23556a57341g4301C0724J08560a00391A39603
10521a00929B49142i6769l35617a55819B79399b24571p055j11592e5453k8388
10511h3841K3459A59010b73657b145A12452A8065b5067G9235K46823d5491l97205
10500d42696i8847k0477A94P4091c2758i556j64622d7884A28558b2157A17318
10488d22177a22177C25622A9441K70672f1252D0681J03450a50965A01659J72914
10478B74573J4530j29016h7433A69325i8982B89197i8120B7179a06309L7023j92450
$$ plain form
10555 9220 -155248 -112716 -134891 138952 -107242 -427643 164382 97273 -104866 -47260 -200267
10544 -200267 -126228 -303619 -9555 -88719 337397 35621 -47927 -13096 -163224 -267170 115111
10532 -72713 -378644 -29774 -124730 123556 -157341 -74301 30724 139284 -100391 139603
10521 -100929 249142 -96769 -432386 -155819 279399 -224571 -231626 -343218 -55453 -83841
10511 -83841 -60382 159010 -273657 -2145 112452 18065 -25067 79235 326058 -45491 -442696
10500 -442696 -98847 -119324 194 74285 -32758 -9556 -174178 -47884 128558 -22157 117318
10488 -422177 -122177 325622 19441 290113 -61252 40681 144131 -150965 101659 274573
10478 274573 289103 160087 -87433 169325 -98982 289197 -98120 27179 -106309 -69286 -261736
10467b61736f9560A92640F4682L3425M0517d71027A43970c8572l85891A12198
10456C54882b08456A0740a47506j09645d8134h707A18310N0787d660A00079D1930
10444b76315A3684N737d7921k63936i6841j17901G8869a46343A33428b77230A30261
10432a75055b9739E9635K41625b8107r9935H6547J61750m0006h0939j4557j8202
10421a13698F3406L261c95544d2901n0235c5768J907p5697j44102l5084A4427
10409c35017P07B0008J51331E1629F471J05876j6286a130H9447B2449J08838m0513
10397I0774h7913B19795d20312a32263A03471K85378q2977e0295I1047f4098D16912
10385D2991J70239a26258E9243a34158A22240i6019A41252A6140K12323q3348
$$ plain form
10467 -261736 -69560 192640 64682 98107 138624 -471027 143970 -38572 -424463 112198
10456 354882 -208456 10740 -147506 -257151 -48134 -8707 118310 169097 -4660 100079 41930
10444 -276315 13684 19421 -47921 -311857 -96841 -214742 78869 -146343 133428 -277230 130261
10432 -175055 -29739 59635 301260 -28107 -128042 86547 248297 208291 -80939 -95496 -113698
10421 -113698 63406 66667 -395544 -42901 -93136 -35768 -33861 -109558 -253660 -288744 14427
10409 -335017 -334310 20008 171339 51629 6471 112347 96061 -1130 89447 22449 131287 90774
10397 90774 -87913 219795 -420312 -132263 103471 388849 305872 -50295 91047 -64098 416912
10385 42991 213230 -126258 59243 -134158 122240 -96019 141252 16140 228463 145115
10375A45115E5751f7859B79164a57687K0070B24117J07422J77099j34653J14957
10365D88942k8536A58714M90675B0639K71544j39657J8592J35737J0329A07343
10354I6760J66193o7128L69480A57458K49150q7408L8958j00908M9740j48821
10344A58169J852K25125J9577k02068l2854B3564L02492k8985a20085F45645c8471
10332A17734n0951J26060O8795J50804a72845D85057a86761D6166a5969J751A52463
10320a78010c2999A6761R6542K09111j07602a64834B11014b68708E2363N7500
10310A09863b0111q4074A89696e252A01384b20609B6869P4759L221i5219A03223
10298A35774J1398o8514C3917J5047b41290A35739a74916I9559c28184B35995
$$ plain form
10375 145115 55751 -67859 279164 -157687 -137617 224117 331539 508638 373985 488942
10365 488942 460406 158714 649389 20639 292183 152526 171118 306855 317184 107343
10354 96760 262953 195825 565305 157458 406608 319200 358158 257250 306990 158169
10344 158169 160021 385146 404723 202655 169801 23564 326056 297071 -120085 645645 -38471
10332 117734 66783 192843 261638 412442 -172845 485057 -186761 46166 -15969 -14218 152463
10320 -178010 -32999 16761 113303 322414 214812 -164834 211014 -268708 52363 109863
10310 109863 -20111 -104185 189696 -5252 101384 -220609 26869 101628 104849 -95219 103223
10298 135774 147172 78658 33917 48964 -241290 135739 -174916 99559 -328184 235995
10287b89930a09369A12617R9047J02641F5348a35724B20563a87239l5527G6306
10276C81801b84287K1178f9279B88751c0958j00031m4503B02178d431F6549J75646
10265B42195h1358j54557e2013B66630P6257J21920k04106r2899O0228I8636O4956
10254A63592N8585q0532a29553C4732c0130a805m8072I2657b89622R1123K9273
10243a69226C8699C017K42073a41136A49454f2615m3651d0919G4419f0686i963
10231c86743a74641j22538e992k31473J10318L2407G8157J89493n2517b15429
10220D4250N1516b24774d8831A86743i8877E9447k1228N767K73092a96648A24960
10208g7998A17172a80476j80006A48945i4754A93507H470c17346a18152b4635
$$ plain form
10287 -289930 -109369 112617 211664 314305 65348 -135724 220563 -187239 -222766 76306
10276 381801 -284287 -263109 -69279 288751 -30958 -130989 -175492 202178 -4431 66549 242195
10265 242195 -81358 -235915 -52013 266630 342887 464807 260701 167802 228030 98636 163592
10254 163592 222177 141645 -129553 34732 -30130 -1805 -49877 92657 -289622 -198499 -169226
10243 -169226 38699 3017 245090 -141136 149454 -62615 -106266 -40919 74419 -60686 -9963
10231 -386743 -174641 -297179 -5992 -237465 -127147 -94740 78157 267650 215133 -215429
10220 44250 95766 -224774 -48831 186743 -98877 59447 38219 43986 317078 -196648 124960
10208 -77998 117172 -180476 -360482 148945 -94754 193507 8470 -317346 -118152 -24635
10197A34561A7179c26133C79160H6607a04731A1244a93243A62778E1851f476k0365
10186b6841E8518d11647J472J93940g4041L2185o5554A00416c21372G4529a03480
10174I9068M9588c30712B49152a01148j30816A75194b52046n7400a35525M1828
10164i3697E7942J8920b75275A05242b05176J6017A09851n06a54799C65233c06804
10152g9226j06359g2562o2530A80421a96456A06371q358a83170g2840k9096A1255
10140b43484c7090j2271k7486n4905M3376k5561A14771k1782J79242l8839e1713
10128A70335a19756F3208J0593J08728p1079b18660R6567k97921G9020b77583
10117h9241A16472e4824A67520c69598O6919g5763J1776j6397O294q4608A46781
$$ plain form
10197 134561 17179 -326133 379160 86607 -104731 11244 -193243 162778 51851 -6476 -26841
10186 -26841 58518 -411647 -410175 -216235 -74041 -41856 -107410 100416 -321372 74529 -103480
10174 99068 148656 -330712 249152 -101148 -231964 175194 -252046 -309446 -135525 -93697
10164 -93697 57942 76862 -275275 105242 -205176 -189159 109851 109345 -154799 365233 -306804
10152 -79226 -185585 -72562 -135092 180421 -196456 106371 98013 -183170 -72840 -101936 11255
10140 -243484 -37090 -49361 -76847 -131752 -88376 -113937 114771 92989 272231 233392 -51713
10128 170335 -119756 63208 73801 182529 111450 -218660 -122093 -420014 79020 -277583
10117 -89241 116472 -54824 167520 -369598 -302679 -75763 -63987 -80384 -74090 -158698 146781
10105c24918O5595f2071A278R3168j4493l7825b63653E3950L8242d9873A12918
10093f2617o5798B0675d71694a6265p5062j61399K7052a6683G1912b22599J07364
10082a15235A48014h3252p8522A74679e02947l0245G8793C9214a15284D6255d2816
10070A14683E40a545l03492E6044a5852j04412L343r745B9770f6084k8891F7356
10057a21172A19434J03386a10818j12581f332B97216A13664f0186g149q1246D37005
10045b06420a7721n0471A0276J28209A0854d24423a29851A20074c97157J21340
10035b75817H1529g5079j09842F0171d8504j30878B43081g4489H5615D2147c03892
10023c22232m2985i9475d0177k91424K7255g9841A49594c24878B26532a96436
$$ plain form
10105 -324918 -259323 -62071 1278 94446 79953 42128 -263653 53950 92192 -49873 112918
10093 -62617 -128415 20675 -471694 -16265 -91327 -252726 -225674 -16683 71912 -222599 -115235
10082 -115235 148014 -83252 -161774 174679 -502947 -533192 78793 39214 -115284 46255 -42816
10070 114683 540 -1545 -305037 56044 -15852 -120264 -116921 -126666 29770 -66084 -94975 67356
10057 -121172 119434 222820 -110818 -223399 -6332 297216 113664 -60186 -7149 -88395 437005
10045 -206420 -17721 -68192 10276 138485 10854 -424423 -129851 120074 -397157 -275817
10035 -275817 81529 -75079 -184921 60171 -48504 -179382 243081 -74489 85615 42147 -303892
10023 -322232 -365217 -99475 -40177 -331601 -304346 -79841 149594 -324878 226532 -196436
10012i578p9218C28361b47494A09529a12461j66453D0073J5054b25322r5359j1583
10001c32264J62773A18486D9786E578g8800g05D9175b84213g1183A4738g4095
9989i1131M5522A50234a10740j6141a0766k72869J8446P9166B40709h5821m36817
9978e22638a04084D2206b52541E1919c04799d7372C34635g8540G1369a19912j6632
9967a36544J9395E3544f6621G666K0602b25799P4565j08499d8313J0759n9823
9956i7377A89053a63912J7110A20909c44129b8174A5724a12414a9977l48079J48925
9945b19131F337N6200c38027i8893h745j29008b071j26896G8440b5271j74121
9934a99392C5217a93533J2729L3030e2720j70297P8400n135d2761A81517a17142
$$ plain form
10012 -9578 -88796 328361 -247494 109529 -112461 -278914 40073 55127 -225322 -320681 -332264
10001 -332264 -169491 118486 49786 5578 -78800 -705 49175 -284213 -71183 14738 -74095
9989 -91131 -45609 150234 -110740 -126881 -10766 -283635 -265189 -186023 240709 -85821 -522638
9978 -522638 -104084 42206 -252541 51919 -304799 -47372 334635 -78540 71369 -119912 -136544
9967 -136544 -117149 53544 -66621 7666 28268 -225799 -151234 -259733 -48313 -37554 -97377
9956 -97377 189053 -163912 -146802 120909 -344129 -28174 15724 -112414 -19977 -368056 -219131
9945 -219131 6337 62537 -338027 -98893 -8745 -137753 -2071 -128967 78440 -25271 -199392
9934 -199392 35217 -193533 -180804 -147774 -52720 -223017 -144617 -149752 -42761 181517 -117142
9922D2067R3592J06694m722c26161d212j30846e8167a3018k89032G0144a10568
9910a06103A42354a79337h1224b4355j23885k11111A3857J37443B14J71314b65036
9898a45381N0591I5685c27161G9858b04260C83363c89974a92445b7556B03291
9887A31081a8727k26432A6720M15377A16687P4781a39296G7941J4905J11477a06251
9875B56169a29203A86590b6185j03629A65243C3795a6902A11316e6507k52144
9865c08651j67649a28741p7437N2307D2240J44081b41740n854M5625q7005B12715
9853B81365A6958J93935F8032a48073E5215b70403I8783O165D1493O5549f7316
9841i099B82296a96352c3903M397a0009n1121l44908J88916J8291I5227b71287
$$ plain form
9922 42067 135659 242353 237631 -326161 -4212 -135058 -58167 -13018 -302050 70144 -110568
9910 -106103 142354 -179337 -81224 -24355 -148240 -359351 13857 151300 214 171528 -265036
9898 -145381 -94790 95685 -327161 79858 -204260 383363 -389974 -192445 -27556 203291
9887 131081 -18727 -245159 16720 432097 116687 191468 -139296 77941 92846 204323 -106251
9875 256169 -129203 186590 -26185 -129814 165243 33795 -16902 111316 -56507 -308651
9865 -308651 -476300 -128741 -206178 -153871 42240 186321 -241740 -247594 -201969 -288974 212715
9853 281365 16958 210893 68032 -148073 55215 -270403 98783 104948 41493 107042 -67316
9841 -9099 282296 -196352 -33903 -29506 -10009 -61130 -406038 -217122 -198831 95227 -271287
9829c45565a40776E7376r19g9288B8232a89345I676g0386c647p2923C3831b85888
9816b50191C8249i8266A22313a78621O283A7734a41213N4209B6410g7803L7165
9805d0638j10444F8162a52702A83750c41355a10796A2152K2625f7046j25527k3300
9794b15873l1297B23885c523j20931e0925J1409H22J59563g3709k43503J39626
9783a77586l50C14584G4678J11940G7353f6456j16645m50A40392c4577l31246
9772c65823a70509Q2751J2023A21432b20804d9172j5917a518j89689E75620a48306
9760b45685F4927f252j17348j09655a01363q0320F5697J70182a67373I9414c34900
9748e8168h796l4259j92085P538F9353d5116k715a5542k43571I9084A1582K03936
$$ plain form
9829 -345565 -140776 57376 56457 -79288 28232 -189345 9676 -70386 -3647 -76570 33831 -285888
9816 -250191 38249 -98266 122313 -178621 -172338 17734 -141213 -87004 26410 -77803 -40638
9805 -40638 -151082 68162 -152702 183750 -341355 -110796 12152 34777 -67046 -192573 -215873
9794 -215873 -247170 223885 -3523 -124454 -50925 -39516 822 160385 -73709 -317212 -177586
9783 -177586 -177936 314584 74678 186618 77353 -66456 -183101 -183551 140392 -34577 -365823
9772 -365823 -170509 -87758 -75735 121432 -220804 -49172 -65089 -1518 -191207 575620 -148306
9760 -245685 64927 -6252 -123600 -233255 -101363 -181683 65697 235879 -167373 99414 -334900
9748 -58168 -8796 -43055 -235140 -227602 69353 -45116 -47831 -15542 -259113 99084 11582 215518
9736B15518G0550K8615J3658M1730P0129g2783k06057A21106D3286h0327O623
9725g3704A6415b13802b7802H4380R9605d19065A33380i9734J8574C6283g3944
9713a58276d2999j30617A67842b7522m64129r8157A2459M2572J79469a99224A17951
9701B40809p1283c8194J7025j18507f5529k11051i2507C44227C2460L4677a27568
9689B04147b6577l00001P4415P9770q5703m9732g7841J4350g151C9212b77512
9677e1030K0240n18926a46863j37401I4633c55j70071e9889n7767k6485H5723
9665A43079K8650c462k07018A29267h480J217k4220A34953c6927p0758k72023
9654c79708J44315N1876r6929A49460c76002e5369q4201G6940i7061k76435a40939
$$ plain form
9736 215518 70550 99165 112823 154553 224682 -72783 -278840 121106 43286 -80327 -73704
9725 -73704 16415 -213802 -27802 84380 183985 -419065 133380 -99734 -81160 36283 -73944
9713 -158276 -42999 -173616 167842 -27522 -491651 -589808 12459 55031 234500 -199224 117951
9701 240809 169526 -38194 -21169 -139676 -65529 -276580 -92507 344227 32460 67137 -127568
9689 204147 -26577 -326578 -252163 -172393 -258096 -307828 -77841 -63491 -7151 39212 -277512
9677 -51030 -30790 -549716 -146863 -284264 94633 -355 -170426 -59889 -117656 -144141 85723
9665 143079 171729 -3462 -210480 129267 -8480 -7263 -31483 134953 -36927 -107685 -379708
9654 -379708 -235393 -183517 -280446 149460 -376002 -55369 -139570 76940 -97061 -373496 -140939
9642a85743d4025B37031A1281d70166i8671l7943B46712F8383k3283b11828B9746
9630a16771G0357h2900D8088F473K10132b89504J44618A5143b47304B08579c01786
9618c1103l11816a03845B1404J49552m4104b752k64110A8486O0120h547p6267
9607h4814j96522A62082N236a45206d9958H4469b93152J03635E5753d4304A84563
9595g4593g611k6829j0310A55392c27736F9553e8289E6775d79370a30222n063
9584a35285N6377j41352A58778n8384a76788g1490n9257G6835k659b88568d0144
9572h6065B0280c80250A86513a25040B36520a41443n5286i2609o9280j38273J08773
9561a91389p8747A99772c16106d3562k35841j04635e0219n8661G1479J7026P7213
$$ plain form
9642 -185743 -44025 237031 11281 -470166 -98671 -136614 246712 68383 45100 -211828 29746
9630 -116771 70357 -82900 48088 6473 216605 -289504 -144886 15143 -247304 208579 -301786
9618 -31103 -342919 -103845 21404 170956 126852 -2752 -266862 18486 78606 -8547 -84814
9607 -84814 -281336 162082 167318 -145206 -49958 84469 -293152 -189517 55753 -44304 184563
9595 -74593 -7611 -34440 -44750 155392 -327736 69553 -58289 56775 -479370 -130222 -135285
9584 -135285 -78908 -220260 158778 100394 -176788 -71490 -130747 76835 74176 -288568 -40144
9572 -86065 20280 -380250 186513 -125040 236520 -141443 -196729 -92609 -161889 -300162 -191389
9561 -191389 -270136 199772 -316106 -43562 -279403 -384038 -50219 -108880 71479 88505 165718
9550A65718a10491q2315H8230b05465B17030J23190c21025B4763a69721k86551
9540d56272a4436B82068H7416c1498l1346l25033a26887j20095a542D79365a91282
9528G9660h8180C1004h8379F2069b21373J8649e6703j76777M9788O8391A81281
9516a31547A36235E7205a95372R6306A08691d94940a30750O4338F2268R1901r927
9505A44242j9314J07280a44487j13615J25630L4224a5043A43248d7031A38696
9494A95235A5568J79163b4410l2926k73954B16260a2775q368k54993I3022b52003
9482a98963n4092C08378A4287L467e5726j19387N472D5582a10473A13496c34232
9470a49195d934j76158A09357N188P5470J9757f8728D5590a86855g1681a3979
$$ plain form
9550 165718 -110491 -192806 88230 -205465 217030 340220 -321025 24763 -169721 -456272
9540 -456272 -14436 282068 87416 -31498 -62844 -387877 -126887 -246982 -1542 479365 -191282
9528 79660 -88180 31004 -88379 62069 -221373 -202724 -56703 -233480 -183692 -115301 181281
9516 -131547 136235 57205 -195372 -99066 108691 -494940 -130750 -66412 62268 154169 144242
9505 144242 124928 232208 -144487 -258102 -132472 -98248 -15043 143248 -47031 138696
9494 195235 15568 194731 -24410 -57336 -331290 216260 -12775 -21143 -276136 93022 -252003
9482 -198963 -253055 308378 14287 17754 -55726 -175113 -169641 45582 -110473 113496 -334232
9470 -149195 -4934 -181092 109357 114545 190015 209772 -68728 45590 -186855 -71681 -13979
9458a69387a7022k66883B88571a63184B36918a11145A82802e3586l27635A89749
9447B94611f0095k36742B55472b31741A63010f0921A1422a11895k0154J1801a5514
9435g5841k06844A01144a67881a0526j19937I035M9519b20842A492J74396c09126
9423b84125a16740k36781H5566b83004B44991c76258B75251a64125B79527b79145
9412H1250A8847a21095j50163C2026a81995J9562A4611a29856c9718j42455n8376
9401b40549f0478G0903a51305b7685A97664d64313C764b23752k8822A84855J4148
9390A99003e4525j85459A67340J7615i0620A29393a15381A1673a82462d8960k86431
9379c35391E1876b24372M7230K8122I7753b60183H6775f4840A21306e6997J1946
$$ plain form
9458 -169387 -17022 -283905 288571 -163184 236918 -111145 182802 -53586 -381221 189749
9447 294611 -60095 -296837 255472 -231741 163010 -60921 11422 -111895 -132049 -120248 -15514
9435 -75841 -282685 101144 -167881 -10526 -130463 9035 58554 -220842 1492 175888 -309126
9423 -284125 -116740 -353521 85566 -283004 244991 -376258 275251 -164125 279527 -279145
9412 81250 18847 -121095 -271258 32026 -181995 -162433 14611 -129856 -39718 -182173 -240549
9401 -240549 -60478 70903 -151305 -27685 197664 -464313 3764 -223752 -252574 184855 199003
9390 199003 -54525 -239984 167340 184955 -90620 129393 -115381 11673 -182462 -48960 -335391
9379 -335391 51876 -224372 -177142 -149020 97753 -260183 86775 -64840 121306 -56997 -45051
9368d5051l03380A35440f9447n8173j40327b5778I0211f6493r9859A74927b43594
9356c17024J15909B27118a61065A44940h2955j75164h5643m8082j36591a03741
9345c40017b0766B8229N4540c41948p1738J69169a9964q6022o4950a6350B08530
9333G7426R7987h8619C2949d0596l84459E131b34863q5603A01076n0344k4751
9322B5981K35957g4005A91202h5085E5872b98A6798K16082a14952o1108A03243
9310b52571C3234M772b13497a00835D4202b08426c1159p4639j4293L4657K931
9299h2503q1115c5945B57580F1240a45639M5962b0137I3859b08086j03860R9016
9288b12930K8565Q1497j8376k4374j21998l6078b2335j05193m7882G0836b24719
$$ plain form
9368 -45051 -348431 135440 -69447 -127620 -267947 -25778 90211 -66493 -166352 174927 -243594
9356 -317024 -201115 227118 -161065 144940 -82955 -258119 -85643 -133725 -270316 -103741
9345 -340017 -20766 28229 82769 -341948 -413686 -244517 -19964 -105986 -170936 -16350 208530
9333 77426 175413 -88619 32949 -40596 -425055 5131 -234863 -320466 101076 50732 25981
9322 25981 261938 -74005 191202 -85085 55872 -298 16798 232880 -114952 -176060 103243
9310 -252571 33234 38006 -213497 -100835 44202 -208426 -31159 -105798 -120091 -85434 -82503
9299 -82503 -163618 -35945 257580 61240 -145639 -99677 -20137 93859 -208086 -311946 -212930
9288 -212930 -184365 -102868 -121244 -145618 -267616 -303694 -22335 -127528 -175410 70836 -224719
9276a8396A56375a51579B98771C3054a96443e9218l06578j10721b06278P9384
9266a26894k61229c6794H7101g3339p0699A60599b77132B35664o8581R3316d5329
9254b32096A39367i9028l22157C62995i1959j43658e3698j09674I1160J8023B9912
9242A50970p5272a2203D9566h8950D7135a00137A64682e3712B6561a77808b2437
9230a29958B2026D285M2102K24971C46i9525k1859j82995E7984c294H2495a94109
9217C00598F1462a44091j11406M0814H0955b4190p7228l87D7340h2771i025I9741
9204B75215n6948B6774I584N5915j7821a24848K6834d8716C7347a41815C7a5358
9191a48609A56797a63473e2067j33366a2519j92419n036l427Q9527j91352q1613
$$ plain form
9276 -18396 156375 -151579 298771 33054 -196443 -59218 -365796 -476517 -206278 -126894
9266 -126894 -388123 -36794 87101 -73339 -144038 160599 -277132 235664 167083 260399 -45329
9254 -232096 139367 -99028 -421185 362995 -91959 -235617 -53698 -163372 91160 109183 29912
9242 150970 75698 -12203 49566 -88950 47135 -100137 164682 -53712 26561 -177808 -22437
9230 -129958 22026 4285 46387 271358 346 -99525 -121384 -304379 57984 -3294 82495 -194109
9217 300598 61462 -144091 -255497 -214683 80955 -24190 -101418 -101805 47340 -82771 -9025 99741
9204 275215 218267 26774 9584 65499 47678 -124848 -98014 -48716 37347 -141815 37 -15358
9191 -148609 156797 -163473 -52067 -185433 -12519 -204938 -209974 -213401 -123874 -315226 -396839
9180c96839J75643J05919A13963a39796M9901m14500f927j42231N9645n2594b7679
9168A53171e1978F2441K27872b908j66515F4556C0845K2239g8805j91139d4505
9156A85222d81392D1709J4186Q9497b8826l1991q2873A50972a69338A12200j9706
9145I2494b77974J18207d7595O846l08631e0001a2116j87200L9199k6310j193
9134a87620N4788A4142b14357f2060n767k9328j33471b9497k8518n5003j17655
9123b30673j20795L8366J53631A38701a75291l4497g5177m9604I2963P589i8739
9111e3716o7005j49921b7592H2253R5948a95725L5050A03038R8000b74265e7310
9099b2994A03782i7013j42881D42046D1966K34610a52512A0051g0904F2135l468
$$ plain form
9180 -396839 -221196 -115277 113963 -139796 -89895 -504395 -6927 -149158 -89513 -142107 -27679
9168 153171 -51978 62441 290313 -2908 -169423 64556 30845 53084 -78805 -269944 -44505
9156 185222 -481392 41709 55895 145392 -28826 -60817 -143690 150972 -169338 112200 92494
9145 92494 -277974 -159767 -47595 -40749 -349380 -50001 -12116 -199316 -160117 -186427 -187620
9134 -187620 -132832 14142 -214357 -62060 -67827 -97155 -230626 -29497 -58015 -113018 -230673
9123 -230673 -351468 -313102 -159471 138701 -175291 -209788 -75177 -124781 92963 100552 -98739
9111 -53716 -120721 -270642 -27592 82253 178201 -195725 -160675 103038 201038 -274265 -57310
9099 -22994 103782 -97013 -239894 442046 41966 276576 -152512 10051 -70904 62135 58667
9088E8667K68857b6314h548j67436O925j65088K245e6884j39582K3191g639j24332
9076a31971f0699m9300A08237b72400O1246o6539i2465L0884q0422e4817p4203
9065a29020G2638d0765G1599b2600o9753B38138a83623A10187R361k873a83724
9053d59844a63532g923j49794j17541A98589P4431e9285i240k69301J31018L5827
9042a11696A07482a30544j6337A81341B8790a07438E413c8770A32087b59635a22257
9030a42160M7032A39811e355q6543G2123e0650j38920m9670A58912C1311a88447
9018c36737B23254p149a02536E7644a3252A78720f6548C5567a27599B79824a32479
9006B08332b1193G8255a82060E0626b88608J37180C01756b5736k04697A412P8441
$$ plain form
9088 58667 327524 -26314 -8548 -175984 -169059 -334147 -331902 -56884 -196466 -173275 -7639 -131971
9076 -131971 -60699 -109999 108237 -272400 -211154 -277693 -92465 -61581 -142003 -54817 -129020
9065 -129020 72638 -40765 71599 -22600 -92353 238138 -183623 110187 119548 116675 -183724
9053 -459844 -163532 -7923 -157717 -275258 198589 273020 -59285 -9240 -278541 -147523 -111696
9042 -111696 107482 -130544 -146881 181341 28790 -107438 5413 -38770 132087 -259635 -122257
9030 -142160 -95128 139811 -5355 -91898 72123 -50650 -189570 -239240 158912 31311 -188447
9018 -336737 223254 216105 -102536 57644 -13252 178720 -66548 35567 -127599 279824 -132479
9006 208332 -21193 78255 -182060 50626 -288608 -151428 301756 -25736 -230433 1412 79853
8995G9853h1717A34543b7785m7076A3386M6532a90494L7929j45402f7760K4950
8984d2810l1557n8418d5802j60167a00585j53372f2341l00055d3751l99942J1357
8973d32336a42633a566m0395n6288B48431c41188a28682j88496q615b7100A5016
8961b47296g4009A75030b32634j4072k9608a12644A00451D9025N6194b8359D6030
8949C22955F0600J86413b67435d7935j76819g2322F4854B5257c1163A26731b0577
8937D4144J81150q6426K88283P7348A40936J19966C0709L32385A60721n5507L30998
8926D36212r3794N97102P68463K368251R813489j488126o039188B974932A112761
8916D16062K6252G5976b19133C64311A02918J15407J72713M3082j67631J19195
$$ plain form
8995 79853 -81717 134543 -27785 -74861 13386 59918 -190494 -152565 -297967 -67760 -42810
8984 -42810 -74367 -132785 -45802 -205969 -100585 -253957 -62341 -362396 -43751 -443693 -432336
8973 -432336 -142633 -1566 -41961 -98249 248431 -341188 -128682 -317178 -325793 -27100 15016
8961 -247296 -74009 175030 -232634 -246706 -276314 -112644 100451 49025 105219 -28359 46030
8949 322955 60600 247013 -267435 -47935 -224754 -72322 64854 25257 -31163 126731 -20577
8937 44144 225294 138868 427151 504499 140936 260902 30709 363094 160721 105214 436212
8926 436212 342418 939520 1707983 4076234 13889723 12401597 6362409 2974932 1112761
8916 416062 442314 75976 -219133 364311 102918 218325 391038 434120 266489 385684
8906C85684A08642G455b9481A90093c51951b4610k997j7363k03386g3620A15282
8894a66058p0217C6566a22461c64C6762j4113f1856r3536j8411j25675J13041
8883a86437c4273p0979m9552l0785j06539J35590r0065d0963o0235A51910j947
8872A49963c14683A30898J85474a4042k06043b5713I338c07833J47787l2237E6409
8860a03377k6146k24945a61855r8148J4609J06374B6804c17517J19728C7713b20962
$$ plain form
8906 385684 108642 7455 -29481 190093 -351951 -24610 -27607 -44970 -248356 -73620 115282
8894 -166058 -236275 36566 -122461 -364 36762 22649 -61856 -155392 -173803 -299478 -186437
8883 -186437 -34273 -105252 -154804 -185589 -292128 -156538 -246603 -40963 -101198 151910 149963
8872 149963 -314683 130898 316372 -14042 -220085 -25713 9338 -307833 -160046 -192283 56409
8860 -103377 -129523 -354468 -161855 -260003 -245394 -139020 26804 -317517 -197789 37713 -220962
$$ [...]
##END NTUPLES=NMR SPECTRUM
##END=
