##TITLE=AC1506_CUNDCR13313_8126553_ktEYUnGwJc
##JCAMPDX= 6.0         $$ Bruker NMR JCAMP-DX V2.0
##DATA TYPE= NMR SPECTRUM
##DATA CLASS= NTUPLES
##ORIGIN= BRUKER
##OWNER= Administrator
$$ 1.72 TOPSPIN		Version 2.1
$$ 2013-08-15 22:46:02.363 -0700  Administrator@X
$$ Compression mode = diff/dup
##.OBSERVE FREQUENCY= 400.02188249412
##.OBSERVE NUCLEUS= ^1H
##.ACQUISITION MODE= SIMULTANEOUS (DQD)
##.ACQUISITION SCHEME= undefined
##.AVERAGES= 64
##.DIGITISER RES= 22
##SPECTROMETER/DATA SYSTEM= spect
##.PULSE SEQUENCE= noesygpps1d.comp
##.SOLVENT NAME= COFFEE_meoh
##.SHIFT REFERENCE= INTERNAL, COFFEE_meoh, 1, 14.96095
##AUDIT TRAIL= $$ (NUMBER, WHEN, WHO, WHERE, PROCESS, VERSION, WHAT)
$$ ##TITLE= Audit trail, TOPSPIN		Version 2.1
$$ ##JCAMPDX= 5.01
$$ ##ORIGIN= Bruker BioSpin GmbH
$$ ##OWNER= Administrator
$$ $$ E:\/data/COFFEE/nmr/AC1506_CUNDCR13313_8126553_ktEYUnGwJc/12/pdata/1/auditp.txt
$$ ##AUDIT TRAIL=  $$ (NUMBER, WHEN, WHO, WHERE, PROCESS, VERSION, WHAT)
(   1,<2013-08-15 22:45:57.348 -0700>,<Administrator>,<X>,<go>,<TOPSPIN 2.1>,
      <created by zg
	started at 2013-08-15 22:34:27.332 -0700,
	POWCHK enabled, PULCHK disabled,
       configuration hash MD5:
       C8 4E 4E 5D D3 5C D8 9E 9F 52 82 E0 59 8A DE 15
       data hash MD5: 64K
       87 17 4A B1 F0 52 A7 FC D7 14 34 8D 6F 8A C5 E1>)
(   2,<2013-08-15 22:46:00.348 -0700>,<Administrator>,<X>,<proc1d>,<TOPSPIN 2.1>,
      <Start of raw data processing
       efp LB = 0.3 FT_mod = 6 PKNL = 1 PHC0 = 0 PHC1 = 0 SI = 128K 
       data hash MD5: 128K
       A1 C0 0D AB 5F E9 AD 63 EB 16 4A F4 4B 6B 19 7C>)
(   3,<2013-08-15 22:46:01.285 -0700>,<Administrator>,<X>,<proc1d>,<TOPSPIN 2.1>,
      <pk PHC0 = -80.93628 PHC1 = 0 
       data hash MD5: 128K
       A6 DF AB 90 33 1A 96 B1 B2 59 7A CD 1A 86 EB D7>)
(   4,<2013-08-15 22:46:01.770 -0700>,<Administrator>,<X>,<proc1d>,<TOPSPIN 2.1>,
      <abs ABSG = 1 
       data hash MD5: 128K
       B8 50 9A DE 3A 43 B7 0B F5 4F 3E DB C1 5F 88 01>)
(   5,<2013-08-15 22:46:01.895 -0700>,<Administrator>,<X>,<proc1d>,<TOPSPIN 2.1>,
      <abs ABSG = 2 
       data hash MD5: 128K
       63 DB 97 E5 75 A6 DA CF 36 14 2A A2 DD E4 F7 AE>)
(   6,<2013-08-15 22:46:01.973 -0700>,<Administrator>,<X>,<proc1d>,<TOPSPIN 2.1>,
      <abs ABSG = 3 
       data hash MD5: 128K
       74 F2 58 50 F9 91 1C 12 AC 8F 4B 9D 29 F8 AC 5C>)
(   7,<2013-08-15 22:46:02.098 -0700>,<Administrator>,<X>,<proc1d>,<TOPSPIN 2.1>,
      <abs ABSG = 4 
       data hash MD5: 128K
       D8 CF 67 7B 6B 82 C3 4F 1C 4E DB B1 19 31 1E 2D>)
(   8,<2013-08-15 22:46:02.176 -0700>,<Administrator>,<X>,<proc1d>,<TOPSPIN 2.1>,
      <abs ABSG = 5 
       data hash MD5: 128K
       1E 36 D7 64 3C 28 5D F3 F5 FD 27 88 A0 41 66 63>)
$$ ##END=
$$ 
$$ $$ hash MD5
$$ $$ 4A 68 B1 E7 06 51 E0 80 DE 13 0A 0F BF F2 C9 7F
##$RELAX= 
##$RELAX= 
##$RELAX= 
##$RELAX= 
##$RELAX= 
##$RELAX= 
##$RELAX= 
##$RELAX= 
$$ Bruker specific parameters
$$ --------------------------
##$DU= <E:\>
##$EXPNO= 12
$$ [...]
##$TP07= 0
##$TPNAME0= <>
##$TPNAME1= <>
##$TPNAME2= <>
##$TPNAME3= <>
##$TPNAME4= <>
##$TPNAME5= <>
##$TPNAME6= <>
##$TPNAME7= <>
##$TPOAL= (0..7)
0.5 0.5 0.5 0.5 0.5 0.5 0.5 0.5
##$TPOFFS= (0..7)
0 0 0 0 0 0 0 0
##$TUNHIN= 0
##$TUNHOUT= 0
##$TUNXOUT= 0
##$USERA1= <user>
##$USERA2= <user>
##$USERA3= <user>
##$USERA4= <user>
##$USERA5= <user>
##$V9= 5
##$VALIST= <valist>
##$VCLIST= <CCCCCCCCCCCCCCC>
##$VD= 0
##$VDLIST= <DDDDDDDDDDDDDDD>
##$VPLIST= <PPPPPPPPPPPPPPP>
##$VTLIST= <TTTTTTTTTTTTTTT>
##$WBST= 1024
##$WBSW= 4
##$XGAIN= (0..3)
0 0 0 0
##$XL= 0
##$YL= 0
##$YMAX_a= 6056536
##$YMIN_a= -14180368
##$ZGOPTNS= <>
##$ZL1= 120
##$ZL2= 120
##$ZL3= 120
##$ZL4= 120
##$ABSF1= 14.96095
##$ABSF2= -5.597232
##$ABSG= 5
##$ABSL= 3
##$ALPHA= 0
##$AQORDER= 0
##$ASSFAC= 0
##$ASSFACI= 0
##$ASSFACX= 0
##$ASSWID= 0
##$AUNMP= <proc_prof1d_extract.lims>
##$AXLEFT= 0
##$AXNAME= <>
##$AXNUC= <1H>
##$AXRIGHT= 0
##$AXTYPE= 0
##$AXUNIT= <>
##$AZFE= 0.1
##$AZFW= 0.1
##$BCFW= 0
##$BC_mod= 0
##$BYTORDP= 0
##$COROFFS= 0
##$CY= 15
##$DATMOD= 1
##$DC= 0
##$DFILT= <>
##$DTYPP= 0
##$F1P= 0
##$F2P= 0
##$FCOR= 0.5
##$FTSIZE= 131072
##$FT_mod= 6
##$GAMMA= 0
##$GB= 0
##$INTBC= 1
##$INTSCL= 1
##$ISEN= 128
##$LB= 0.3
##$LEV0= 0
##$LPBIN= 0
##$MAXI= 10000
##$MC2= 0
##$MEAN= 0
##$ME_mod= 0
##$MI= 0
##$NCOEF= 0
##$NC_proc= -2
##$NLEV= 6
##$NOISF1= 0
##$NOISF2= 0
##$NSP= 0
##$NTH_PI= 0
##$NZP= 0
##$OFFSET= 14.96095
##$PC= 1
##$PHC0= -80.93628
##$PHC1= 0
##$PH_mod= 1
##$PKNL= yes
##$PPARMOD= 0
##$PPDIAG= 0
##$PPIPTYP= 0
##$PPMPNUM= 2147483647
##$PPRESOL= 1
##$PSCAL= 4
##$PSIGN= 0
##$PYNMP= <proc.py>
##$REVERSE= no
##$SF= 400.020009658792
##$SI= 131072
##$SIGF1= 0
##$SIGF2= 0
##$SINO= 400
##$SIOLD= 131072
##$SPECTYP= <>
##$SREGLST= <1H.CDCl3>
##$SSB= 0
##$STSI= 131072
##$STSR= 0
##$SW_p= 8223.68421052631
##$SYMM= 0
##$S_DEV= 0
##$TDeff= 65536
##$TDoff= 0
##$TI= <>
##$TILT= no
##$TM1= 0
##$TM2= 0
##$TOPLEV= 0
##$USERP1= <user>
##$USERP2= <user>
##$USERP3= <user>
##$USERP4= <user>
##$USERP5= <user>
##$WDW= 1
##$XDIM= 131072
##$YMAX_p= 401802684
##$YMIN_p= -36996
##$CURPLOT= <Network HP LaserJet P1505>
##$CURPRIN= <$Network HP LaserJet P1505>
##$DFORMAT= <normdp>
##$LAYOUT= <+/1D_H.xwp>
##$LFORMAT= <normlp>
##$PFORMAT= <normpl>
##$SURQMSG= 1
$$ End of Bruker specific parameters
$$ ---------------------------------
##NTUPLES= NMR SPECTRUM
##VAR_NAME=  FREQUENCY,     SPECTRUM/REAL,   SPECTRUM/IMAG
##SYMBOL=    X,             R,               I
##VAR_TYPE=  INDEPENDENT,   DEPENDENT,       DEPENDENT
##VAR_FORM=  AFFN,          ASDF,            ASDF
##VAR_DIM=   131072,        131072,          131072
##UNITS=     HZ,            ARBITRARY UNITS, ARBITRARY UNITS
##FACTOR=    0.0627417313425164, 1,          1
##FIRST=     8223.62146879497, 2912,         -66278
##LAST=      0,             4865,            -66497
##MIN=       0,             -36996,          0
##MAX=       8223.62146879497, 401802684,    0
$$ Real data points
##PAGE= N=1
##DATA TABLE= (X++(R..R)), XYDATA
$$ [...]
63881G93394j7002j6121j4985j3309j0898p971n038k355K54K948N540P844J0003
63868G32304J2267J4686J7242J9972K2659K4735K5947K6871K8298L0146L1414
63857I86541L1271K9839K7907K6128K4547K2718K0238J7171J3884J0435O489K023
63845A219191k314n954r214j2861j7041k1230k5085k8726l2108l4726l6242l6926
63833I56764l7257l7375l7196l6749l6075l5023l3447l1548k9745k8184k6583
63822E87582k4608k2279j9950j7964j6412j5185j4097j2961j1686j0435r444q616
63810D03945p551o238n349n331n497m726l030j574j059j015r68j293k195k775
63796C55344k145r12n22j358k547l437m144m665m544l819l315l456l583k970k001
$$ plain form
63881 793394 776392 760271 745286 731977 721079 713108 708070 705715 705969 708917 714457 722301 732304
63868 732304 744571 759257 776499 796471 819130 843865 869812 896683 924981 955127 986541
63857 986541 1017812 1047651 1075558 1101686 1126233 1148951 1169189 1186360 1200244 1210679 1217168 1219191
63845 1219191 1216877 1210923 1201709 1188848 1171807 1150577 1125492 1096766 1064658 1029932 993690 956764
63833 956764 919507 882132 844936 808187 772112 737089 703642 672094 642349 614165 587582
63822 587582 562974 540695 520745 502781 486369 471184 457087 444126 432440 422005 412561 403945
63810 403945 396394 390156 384807 379476 373979 369253 366223 364649 363590 362575 361607 360314 358119 355344
63796 355344 353199 352287 351765 350407 347860 344423 340279 335614 331070 327251 323936 320480 316897 313927 311926
63781C11926j624k010k410k245j733j325r84l94L39O20J17p18j228j329j345j184
63765B94473m35O25R66K07o81o97j93j21m45l35K68M61k35j172j534j236o44k9
63747B89243L99M57K84K89O94J370K099K539K178R48j99r7J196K501L058L117
63731C10076L031K731K366K452K903K832J939J214J612K681L348L417L474L745
63717C47821L974M113M326M388L815K610J298L22j57j10K00R5q07j851j966j078
63701C66993k32k63q70j199p89K91J731K975L347K632J520J080J661K571K866
63686C84314K383J799J720J953J858J271P00N64O25M38J04J03N35R11Q64O60P47
63669D01549R67P18j10p62m47O43J525J553Q97k2j112k341l351l825l962m175
$$ plain form
63781 311926 310302 308292 305882 303637 301904 300579 299595 299201 299540 300160 300277 299559 298331 297002 295657 294473
63765 294473 294038 294663 295629 295836 295155 294458 294265 294144 293699 293364 293632 294093 293858 292686 291152 289916 289272 289243
63747 289243 289642 290099 290383 290672 291366 292736 294835 297374 299552 300500 300301 300204 301400 303901 306959 310076
63731 310076 313107 315838 318204 320656 323559 326391 328330 329544 331156 333837 337185 340602 344076 347821
63717 347821 351795 355908 360234 364622 368437 371047 372345 372667 372510 372400 372600 372695 371888 370037 368071 366993
63701 366993 366761 366498 365628 364429 363640 363931 365662 368637 371984 374616 376136 377216 378877 381448 384314
63686 384314 386697 388496 390216 392169 394027 395298 395998 396562 397187 397625 397729 397832 398367 399278 400142 400802 401549
63669 401549 402516 403234 403124 402362 401915 402558 404083 405636 406533 406511 405399 403058 399707 395882 391920 387745
63653C87745m523m783m886m841m448l544k411j461p04J5M68L75J64N93J665K673
63637C62097L342M085M980N386M993M459M457M804M997N088N323N533N510N631
63623D30685O390P566Q519R101R726J0694J1947J3392J4936J6361J7589J8967
63611E75873K0832K2923K4709K6116K7503K9014L0472L1820L3078L3858L3444
63600H89642L1484K8121K3434J7359J0376L746j338m575o314o899o666o341o785
63587I65244q255j0276j2444j5005j8335k2082k5263k7231k8170k8417k7743k5743
63575G16280k2707j9594j7047j4885j2663j0311p961n542k992o82Q36J561K169
63562F06462L220M482N316N608N972O902Q113R042R727J0689J2175J4089J6607
$$ plain form
63653 387745 383222 378439 373553 368712 364264 360720 358309 356848 356144 356159 356627 357002 357166 357759 359424 362097
63637 362097 365439 369524 374504 379890 384883 389342 393799 398603 403600 408688 414011 419544 425054 430685
63623 430685 437075 444641 453160 462261 471987 482681 494628 508020 522956 539317 556906 575873
63611 575873 596705 619628 644337 670453 697956 726970 757442 789262 822340 856198 889642
63600 889642 921126 949247 972681 990040 1000416 1004162 1002824 998249 991935 985036 978370 972029 965244
63587 965244 956989 946713 934269 919264 900929 878847 853584 826353 798183 769766 742023 716280
63575 716280 693573 673979 656932 642047 629384 619073 611112 605570 602578 601896 602732 604293 606462
63562 606462 609682 614164 619480 625088 631060 637962 646075 655117 664844 675533 687708 701797 718404
63549G18404K0002K3711K6580K8477L0829L4782L9634M3871M6874M8286M6470
63538A107920L9534K8017J5101L763n054j1316j4683j5252j4359j3426j2699j1977
63526A095569j1777j2952j5654j9488k4206k9400l4004l6944l8122l8172l7499
63515G97351l6174l4395l2421l0172k7503k4689k2159j9991j7996j6091j4229
63504E21531j2312j0490r146q307p548o798o579o992p190o515n540n161n163m551
63490D19239k983j117J85M42k67j075q32M74J358P21m63l98J139K806L766M357
63474D27352M825M703L820K803K187J775J190M06n14j581k561k999k724j930q61
63459D35891R7L26l13q40j81J381K583K937L042L241L154K815L027M125N313N927
$$ plain form
63549 718404 738406 762117 788697 817174 848003 882785 922419 966290 1013164 1061450 1107920
63538 1107920 1147454 1175471 1190572 1194335 1189281 1177965 1163282 1148030 1133671 1120245 1107546 1095569
63526 1095569 1083792 1070840 1055186 1035698 1011492 982092 948088 911144 873022 834850 797351
63515 797351 761177 726782 694361 664189 636686 611997 589838 569847 551851 535760 521531
63504 521531 509219 498729 489583 481276 473728 466930 460351 453359 446169 439654 434114 428953 423790 419239
63490 419239 416256 415139 415324 415766 415499 414424 413592 414066 415424 416145 415682 415284 416423 419229 422995 427352
63474 427352 432177 436880 440700 443503 445690 447465 448655 449061 448547 446966 444405 441406 438682 436752 435891
63459 435891 435988 436314 436001 435161 434980 436361 438944 441881 444923 448164 451318 454133 457160 461285 466598 472525
63443D72525O424P507Q938J0003J0650J1479J2916J4905J7127J9221K1136K3531
63431F36362K7346L2474L7227L9471L8229L3995K8012K1537J5484J0337O438M333
63419I31245M505O712J0064J3907J8270K3250K8427L2984L6063L6909L5138L1090
63407A208564K5541J8991J1748M610j267n427q390j0587j1752j1776j1418j1685
63395A197152j3048j5687j9890k5447l1131l5518l8200l9664m0232l9681l7861
63384H60793l5060l1818k8700k6130k4084k1978j9211j5821j2416r534p235n206
63372F23600l108q63J318L239N026O905Q764J0372J1940J3950J6358J8584K0490
63359G36575K2698K5591K8596L1012L3017L5220L7607L9548M0658M0923M0057
$$ plain form
63443 472525 478949 486456 495394 505397 516047 527526 540442 555347 572474 591695 612831 636362
63431 636362 663708 696182 733409 772880 811109 845104 873116 894653 910137 920474 926912 931245
63419 931245 935750 942462 952526 966433 984703 1007953 1036380 1069364 1105427 1142336 1177474 1208564
63407 1208564 1234105 1253096 1264844 1269454 1268187 1262760 1254370 1243783 1232031 1220255 1208837 1197152
63395 1197152 1184104 1168417 1148527 1123080 1091949 1056431 1018231 978567 938335 898654 860793
63384 860793 825733 793915 765215 739085 715001 693023 673812 657991 645575 636041 628806 623600
63372 623600 620492 619629 620947 624186 629212 636117 644881 655253 667193 681143 697501 716085 736575
63359 736575 759273 784864 813460 844472 877489 912709 950316 989864 1030522 1071445 1111502
63348A111502L7398L2591K6065J8747J1540N022o34n475r295j1556j2101j1728
63336A192076j1676j2607j4464j7140k0752k5091k9371l2804l5192l6648l7043
63325I19288l6070l3858l1033k8079k4945k1506j8063j4866j1313o558j309J701
63313F93389m5o211j3772j9761k3192k4507k4184k2547k0226j8005j6152j4395
63301D90392j2534j0784r417q313p073n612m455m227m729m958m204k977k363k741
63287D06005l530m089m286m267m152m066m029l778l073k184j549j094l66N89J129
63272C67260Q72J73m17o39m56J2L81L86M02R74J864K244J961J759K162K864L505
63255C85307M102M446M005K962K462L181M352M862M656M371M243M167M325N026
$$ plain form
63348 1111502 1148900 1181491 1207556 1226303 1237843 1242865 1242231 1236756 1227461 1215905 1203804 1192076
63336 1192076 1180400 1167793 1153329 1136189 1115437 1090346 1060975 1028171 992979 956331 919288
63325 919288 883218 849360 818327 790248 765303 743797 725734 710868 699555 692997 691688 693389
63313 693389 693344 687133 673361 653600 630408 605901 581717 559170 538944 520939 504787 490392
63301 490392 477858 467074 457657 449344 442271 436659 432204 427977 423248 418290 414086 411109 408746 406005
63287 406005 402475 398386 394100 389833 385681 381615 377586 373808 370735 368551 367002 365908 365542 366131 367260
63272 367260 368132 368305 367888 367249 366793 366805 367186 367572 367974 368948 370812 373056 375017 376776 378938 381802 385307
63255 385307 389409 393855 397860 400822 403284 406465 410817 415679 420335 424706 428949 433116 437441 442467
63241D42467O133P317Q480R493R983R950J0067J0769J1597J2092J2747J4239J6200
63228E81534J7637J8216J8294J8013J7347J6733J6722J7073J7100J6846J7000
63217G72515J7701J8328J8539J8618J8666J8271J7212J5769J4084J1799Q701N123
63205I55326J479k126n615q711j1322j3752j6280j8698k0462k1105k0493j8897
63193G99344j6812j4560j2097r404o861m857l154j128J447M265P025R739J2413
63180G65360J4865J6874J8321J9189J9641J9956K0156J9925J9161J8299J7744
63169I69491J7321J6683J5888J4960J3398J0822P837N306K957l27m831r531j3475
63156A046499j6778j9975k3078k5738k7719k8892k9180k8822k8290k7728k6791
$$ plain form
63241 442467 448600 455917 464397 473890 483873 493823 503890 514659 526256 538348 551095 565334 581534
63228 581534 599171 617387 635681 653694 671041 687774 704496 721569 738669 755515 772515
63217 772515 790216 808544 827083 845701 864367 882638 899850 915619 929703 941502 950203 955326
63205 955326 956805 954679 949064 940353 929031 915279 898999 880301 859839 838734 818241 799344
63193 799344 782532 767972 755875 746471 739610 734753 731599 730471 731918 736183 743208 752947 765360
63180 765360 780225 797099 815420 834609 854250 874206 894362 914287 933448 951747 969491
63169 969491 986812 1003495 1019383 1034343 1047741 1058563 1066400 1071706 1074663 1074336 1069505 1059974 1046499
63156 1046499 1029721 1009746 986668 960930 933211 904319 875139 846317 818027 790299 763508
63145G63508k5160k2826j9893j6648j3875j2356j1848j1185r730q067o925o081
63133E98914m829l083j415l22J30J46J34N49J469K494L333M223N433O637P235
63118F21048P119O707O346O015N633N275N035M846M506L853K963K201J970K294
63104F85811K711K681K027R70j24r74j485j714j701j441j082r46j159j373j179
63089F81022o76k73k7L73R61J316J186Q78P62P54O02M20O18J377K432L362L918
63072F99005M163M326M555M849N264O021P194Q374R002R053R175J0017J1674J3807
63058H06479J6075J8289K0391K2427K4523K6783K9145L1365L3144L4469L5811
63047A098901L7764M0314M2749M4416M5330M5863M6144M6084M5668M4916M3848
$$ plain form
63145 763508 738348 715522 695629 678981 665106 652750 640902 629717 619987 611920 604995 598914
63133 598914 594085 591002 589587 589265 589395 589541 589675 590224 591693 594187 597520 601743 607176 613813 621048
63118 621048 628167 634874 641220 647235 652868 658143 663178 668024 672530 676383 679346 681547 683517 685811
63104 685811 688522 691203 693230 694200 694076 693102 691617 689903 688202 686761 685679 684733 683574 682201 681022
63089 681022 680346 680073 680046 680419 681380 682696 683882 684760 685522 686276 686878 687298 687916 689293 691725 695087 699005
63072 699005 703168 707494 712049 716898 722162 728183 735377 743751 752753 761806 770981 780998 792672 806479
63058 806479 822554 840843 861234 883661 908184 934967 964112 995477 1028621 1063090 1098901
63047 1098901 1136665 1176979 1219728 1264144 1309474 1355337 1401481 1447565 1493233 1538149 1581997
63036A581997M2818M2426M2654M2550M1399L9674L8145L6430L3523K9437K5069
63025A996122K0346J3871M933n176j4594k2878l0768l8493m5183m9827n2202n2801
63013A723350n2181n0461m7438m3205l8352l3300k7714k1231j4529q796m128N65
63001A382580N851J1010J5376J9366K3443K6953K8984K9788L0378L1076L1401
62990A636206L1199L0941L0941L0993L0859L0483K9677K8057K5410K1764J7113
62979A943643J1471N078j806r196j7106k5095l2493l8964m4489m8935n2088n4044
62967A635976n5086n5267n4478n2867n0781m8325m5439m2380l9639l7406l5430
62956A118878l3506l1679k9941k8136k6326k4856k3860k2975k1771k0318j9148
$$ plain form
63036 1581997 1624815 1667241 1709895 1752445 1793844 1833518 1871663 1908093 1941616 1971053 1996122
63025 1996122 2016468 2030339 2035272 2030096 2015502 1992624 1961856 1923363 1878180 1828353 1776151 1723350
63013 1723350 1671169 1620708 1573270 1530065 1491713 1458413 1430699 1409468 1394939 1386143 1382015 1382580
63001 1382580 1388431 1399441 1414817 1434183 1457626 1484579 1513563 1543351 1573729 1604805 1636206
62990 1636206 1667405 1698346 1729287 1760280 1791139 1821622 1851299 1879356 1904766 1926530 1943643
62979 1943643 1955114 1960192 1958386 1949190 1932084 1906989 1874496 1835532 1791043 1742108 1690020 1635976
62967 1635976 1580890 1525623 1471145 1418278 1367497 1319172 1273733 1231353 1191714 1154308 1118878
62956 1118878 1085372 1053693 1023752 995616 969290 944434 920574 897599 875828 855510 836362
62945H36362j8631j8493j8017j6788j5224j4070j3358j2244j0241q180p399q048
62933F75669q835q515p153n677m644l930l324k894k646k226j295j24N37K98l69
62918F24872p52q07j113j917k687k810k372j960j930k155k362k482k651k990l334
62903E92550l282k693k087k110k561k498j537m31K2O9L35N97M8j319k476k590
62887E70037j902j166q18q63j100j230j023n83j43L62J171K065K417K035J478
62872E70737J198Q72M0r79j383j000n50p01j361j995k323k360k098j492p61l34
62856E55510l24l20J45R97J706J926J743J364Q51K66k08m61o16p55o92k68K51
62839E61115L42k31j194k051k404k088j288n22k43l79m36j43K19K62R9K95J173
$$ plain form
62945 836362 817731 799238 781221 764433 749209 735139 721781 709537 699296 691116 683717 675669
62933 675669 666834 658319 651166 645489 640845 636915 633591 630697 628051 625825 624530 624406 624943 625241 624872
62918 624872 624120 623313 622200 620283 617596 614786 612414 610454 608524 606369 604007 601525 598874 595884 592550
62903 592550 589268 586575 584488 582378 579817 577319 575782 575351 575373 575442 575777 576374 576422 575103 572627 570037
62887 570037 568135 566969 566151 565288 564188 562958 561935 561352 561209 561571 562742 564807 567224 569259 570737
62872 570737 571935 572807 572847 571868 570485 569485 568935 568234 566873 564878 562555 560195 558097 556605 555844 555510
62856 555510 555186 554866 555011 556008 557714 559640 561383 562747 563598 563864 563656 563195 562579 561824 561132 560864 561115
62839 561115 561457 561226 560032 557981 555577 553489 552201 551679 551436 551057 550621 550478 550697 550959 551058 551353 552526
62822E52526K362L170L290L013K760K683K786L129L566L558K731J576J039J373
62808E89562J848J885J831K265L002L414L444L624M188M706M801M735N081O051
62794F40437P284Q203Q595Q875R725J1268J2870J4016J5152J7218K0458K4223
62782G98324K7862L1329L4824L8381M2061M6024N0110N3800N6894N9762O2468
62771A301839O4138O3836O1865N9404N6792N2937M6733L8410K9042J9179Q706
62760A802881k227j2936k2968l2454m1347m8932n4532n8314o0851o2217o2225
62749A343878o1314o0315n9194n6926n3072m8739m5304m2687l9686l5759l1610
62738H09272k8054k5180k2783k0858j9175j7068j4313j1806j0580j0285r449p378
$$ plain form
62822 552526 554888 558058 561348 564361 567121 569804 572590 575719 579285 582843 585574 587150 588189 589562
62808 589562 591410 593295 595126 597391 600393 603807 607251 610875 615063 619769 624570 629305 634386 640437
62794 640437 647721 655924 664519 673394 683119 694387 707257 721273 736425 753643 774101 798324
62782 798324 826186 857515 892339 930720 972781 1018805 1068915 1122715 1179609 1239371 1301839
62771 1301839 1365977 1429813 1491678 1551082 1607874 1660811 1707544 1745954 1774996 1794175 1802881
62760 1802881 1800654 1787718 1764750 1732296 1690949 1642017 1587485 1529171 1468320 1406103 1343878
62749 1343878 1282564 1222249 1163055 1106129 1053057 1004318 959014 916327 876641 840882 809272
62738 809272 781218 756038 733255 712397 693222 676154 661841 650035 639455 629170 619721 612343
62726F12343n099l954l877l669k699j517p50j54Q91K434M007N314O360P149P768
62711F24547Q699J0478J2948J5267J6894J8202J9975K2586K5796K9137L2239L5010
62699H71778L7712M0696M3992M7252N0182N2818N5391N8132O1209O4472O7105
62688A450739O7884O6108O2075N6497M9697M1527L1866K0883Q999l252j5426k7289
62676A810308l8532m8415n6121o1612o5607o8524o9928o9426o7556o5208o2549
62665A136830n9159n5014n0587m6135m1542l6952l2917k9787k7420k5569k4023
62654G07725k2312j9907j7027j4621j3188j2085j0505q738p769p802p957p536
62642E58278o862o493o141n083l397k060j696j785j472o85LK38J07k96r20j432
$$ plain form
62726 612343 607244 603290 599413 595744 593045 591528 590778 590624 591515 593949 597956 603270 609630 616779 624547
62711 624547 633246 643724 656672 671939 688833 707035 727010 749596 775392 804529 836768 871778
62699 871778 909490 950186 994178 1041430 1091612 1144430 1199821 1257953 1319162 1383634 1450739
62688 1450739 1518623 1584731 1646806 1703303 1753000 1794527 1826393 1847276 1856275 1853023 1837597 1810308
62676 1810308 1771776 1723361 1667240 1605628 1540021 1471497 1401569 1332143 1264587 1199379 1136830
62665 1136830 1077671 1022657 972070 925935 884393 847441 814524 784737 757317 731748 707725
62654 707725 685413 665506 648479 633858 620670 608585 598080 589342 581573 573771 565814 558278
62642 558278 551416 544923 538782 533699 530302 528242 526546 524761 523289 522604 522607 522845 522952 522656 521736 520304
62626E20304j453j213j414k236k960k834j888o80L35R09R28O23N36R61J635K273
62610E13826L002L960M786M987M655M397M695N570O760P912Q802R576J0620J2066
62596F05614J3655J5299J7293J9761K2351K4771K7112K9223L0446L0596L0638
62585H66759L1417L2048L0594K6328K0564J5094J0512O188J258m524j0519j5632
62573A010087j9385k2390k5415k8182k9768k9963k9453k8704k7594k6188k4958
62562G18087k3962k2597k0559j8308j6224j4068j1729r766q545p505o015m515
62550E54294l960m354m671m264l567l265l253k892j943q88l18k35m6P16J849K718
62534E25921K879K373J524P18L36N43J168J969K950M134N211N903O610Q100J0389
$$ plain form
62626 520304 518851 517638 516224 513988 511028 508194 506306 505626 505961 506870 507798 508421 508957 509918 511553 513826
62610 513826 516828 520788 525574 530561 535216 539613 544308 549878 556638 564550 573352 582928 593548 605614
62596 605614 619269 634568 651861 671622 693973 718744 745856 775079 805525 836121 866759
62585 866759 898176 930224 960818 987146 1007710 1022804 1033316 1039504 1040762 1036238 1025719 1010087
62573 1010087 990702 968312 942897 914715 884947 854984 825531 796827 769233 743045 718087
62562 718087 694125 671528 650969 632661 616437 602369 590640 580874 572329 564824 558809 554294
62550 554294 550334 545980 541309 537045 533478 530213 526960 524068 522125 521237 520919 520684 520638 521354 523203 525921
62534 525921 528800 531173 532697 533415 533751 534294 535462 537431 540381 544515 549726 555629 562239 570339 580728
62519E80728J2574J3982J5046J6653J9042K1796K4579K7341L0030L2608L5253
62508H29632L8159M0989M2985M3674M3318M2527M1574M0105L7490L3360K7926
62497A261739K1785J5539R602M327J26k604l628k985j048J638M785Q581J3293
62484A331150J8674K4012K8795L3105L7318M1619M5724M8629M8593M3914L4479
62473A736012K2547J1540L522k364r041j8951l2042m5908n7697o5867p0505p2603
62461A398643p3241p3097p2163o9934o6055o0834n4939m8766m2386l5990l0036
62450G71202k4940k0808j7501j4762j2318r956p534m930k263j08R31J142J705
62437F59860L404N648P248P690P235O225M889L541K152R4k949o109q243r464j0734
$$ plain form
62519 580728 593302 607284 622330 638983 658025 679821 704400 731741 761771 794379 829632
62508 829632 867791 908780 951765 995439 1038757 1081284 1122858 1162963 1200453 1233813 1261739
62497 1261739 1283524 1299063 1308665 1312992 1313118 1310514 1306886 1303901 1302853 1304491 1309276 1317857 1331150
62484 1331150 1349824 1373836 1402631 1435736 1473054 1514673 1560397 1609026 1657619 1701533 1736012
62473 1736012 1758559 1770099 1773621 1771257 1762216 1743265 1711223 1665315 1607618 1541751 1471246 1398643
62461 1398643 1325402 1252305 1180142 1110208 1044153 983319 928380 879614 837228 801238 771202
62450 771202 746262 725454 707953 693191 680873 670917 663383 658453 656190 656082 657013 658155 659860
62437 659860 663264 668912 676160 683850 691085 697310 702199 705740 707892 707986 705037 698928 690685 681221 670487
62422F70487j2074j2436j1563j0701j0900j1582j1516j0408q890p534o602o231
62410E50050o211n944n182m464m338m524m361l767l144k645k027j137j09Q09J412
62395E04418J604J539J502J588J787K355L555M858N169M204L022K722L150L503
62381E44976L595L803M188M529N006O095P749R308J0289J0754J0897J0769J0554
62368F42512J0714J1635J3216J4957J6423J7733J9535K2290K5706K9162L2598
62357H56481L6475M0853M5160M9121N3105N7186O0483O2027O1714N9827N6156
62346A438588N0273M2384L3261K3675J4389O181q01p348j4092k0537k5951l0792
62334A509230l6061m1421m5188m6371m5715m4343m2383l9505l6060l2917l0477
$$ plain form
62422 670487 658413 645977 634414 623713 612813 601231 589715 579307 570417 562883 556281 550050
62410 550050 543839 537895 532713 528249 523911 519387 515026 511259 508115 505470 503443 502306 502197 503006 504418
62395 504418 506022 507561 509063 510651 512438 514793 518348 523206 528375 532579 535601 538323 541473 544976
62381 544976 548571 552374 556562 561091 566097 572192 579941 589249 599538 610292 621189 631958 642512
62368 642512 653226 664861 678077 693034 709457 727190 746725 769015 794721 823883 856481
62357 856481 892956 933809 978969 1028090 1081195 1138381 1198864 1260891 1322605 1382432 1438588
62346 1438588 1488861 1531245 1564506 1588181 1602570 1608751 1607950 1600602 1586510 1565973 1540022 1509230
62334 1509230 1473169 1431748 1386560 1340189 1294474 1250131 1207748 1168243 1132183 1099266 1068789
62323A068789k8487k6608k4754k3003k1596k0998k1538k2927k4238k4585k3804
62312H06251k2481k1253k0223j9075j7713j6426j5402j4366j2899j0967q938p321
62300F19187o446o100n438l757j579l50p19j640j662o23N44J173J342J351J492
62285E96775K124L280M321M690M746N131N602N457N022N562P425R362J0187J0305
62271F79989J0929J2396J4033J5372J6701J8446K0493K2375K3914K5497K7664
62260H87809L0498L3583L6639L9851M3373M6876N0034N3110N6442N9510O1247
62249A398972O1243N9836N6952N1783M4024L4673K5087J5768O593k365j0912j9275
62237A722379k7774l6140m3749n0487n6681o2119o5777o6877o5788o3487o0396
$$ plain form
62323 1068789 1040302 1013694 988940 965937 944341 923343 901805 878878 854640 830055 806251
62312 806251 783770 762517 742294 723219 705506 689080 673678 659312 646413 635446 626508 619187
62300 619187 612741 606641 601203 597446 595867 595517 594798 593158 591496 590873 591417 592590 593932 595283 596775
62285 596775 598899 602179 606500 611190 615936 621067 626669 632126 637148 642710 650135 659497 669684 679989
62271 679989 690918 703314 717347 732719 749420 767866 788359 810734 834648 860145 887809
62260 887809 918307 951890 988529 1028380 1071753 1118629 1168663 1221773 1278215 1337725 1398972
62249 1398972 1460215 1520051 1577003 1628786 1672810 1707483 1732570 1748338 1754931 1752566 1741654 1722379
62237 1722379 1694605 1658465 1614716 1564229 1507548 1445429 1379652 1312775 1246987 1183500 1123104
62226A123104n6272n1166m5909m1334l7356l3250k8802k4653k1484j9226j7336
62215G46316j5543j3920j2547j1457j0701j0154r316p810n980m602l997l762l410
62202F33117k847k109j102J48J262J860K070K410L181M181N041N759O607P581
62188F67159Q165P982P471P507Q330R316R973J0605J1658J2848J3419J2997J1783
62175G99213J0158Q546P458P281Q036R602J1906J4678J7500K0387K3921K8288
62163I66974L2760L6666M0257M3813M6497M7148M5877M3608M0243L4682K6880
62152A405405J8493J1022M493j454o456j0355j4296j9595k5935l1671l5764l8427
62140A255460m0032m0280l8753l5665l1780k7832k4213k0935j7828j4821j2049
$$ plain form
62226 1123104 1066832 1015666 969757 928423 891067 857817 829015 804362 782878 763652 746316
62215 746316 730773 716853 704306 692849 682148 671994 662678 654868 648888 644286 640289 636527 633117
62202 633117 630270 628161 627059 627207 628469 630329 632399 634809 637990 642171 647212 652971 659578 667159
62188 667159 675324 683306 690777 698284 706614 715930 725903 736508 748166 761014 774433 787430 799213
62175 799213 809371 817917 825375 832656 840692 850294 862200 876878 894378 914765 938686 966974
62163 966974 999734 1036400 1076657 1120470 1166967 1214115 1259992 1303600 1343843 1378525 1405405
62152 1405405 1423898 1434920 1439413 1437959 1431503 1421148 1406852 1387257 1361322 1329651 1293887 1255460
62140 1255460 1215428 1175148 1136395 1100730 1068950 1041118 1016905 995970 978142 963321 951272
62129I51272r609p449n634m603m741n709o499o348n430m502l940l373k339j018
62115H80078Q1R89K197L669M718N173N867P166P708N790J745k281m853o309p119
62100I04619o700m619j905j13K56m75k203m809p256q219p641o740o320n904m711
62085H37260k785p39J037K519L752M867O150P725R338J0694J1960J3543J5497
62072I20818J7483J9319K1163K2939K4016K3935K3230K2998K3728K5038K6562
62061A171229K8424L0636L2678L4004L4375L3380L0352K5394J9821J4772R990
62050A465055M809k53m200p505j1959j8319k5349l1415l6041l9446m1712m2936
62038A210729m3446m3300m2242m0534l8962l7644l5677l2531k8966k5964k3540
$$ plain form
62129 951272 941663 934214 928580 923977 919236 913527 907028 900680 895250 890748 886808 883435 881096 880078
62115 880078 880159 881148 883345 887014 891732 896905 902772 909938 917646 923436 925181 922900 918047 911738 904619
62100 904619 897919 893300 891395 891282 891538 891063 888860 884051 876795 868576 860935 854195 847875 841971 837260
62085 837260 834475 833736 834773 837292 841044 845911 852061 859786 869124 879818 891778 905321 920818
62072 920818 938301 957620 978783 1001722 1025738 1049673 1072903 1095901 1119629 1144667 1171229
62061 1171229 1199653 1230289 1262967 1296971 1331346 1364726 1395078 1420472 1440293 1455065 1465055
62050 1465055 1469864 1469611 1465411 1457906 1445947 1427628 1402279 1370864 1334823 1295377 1253665 1210729
62038 1210729 1167283 1123983 1081741 1041207 1002245 964601 928924 896393 867427 841463 817923
62027H17923k1273j9209j7495j5847j4198j3164j3028j2931j2087j1141j1230
62016F56320j2084j2306j1330r962r005q360p593o583n412m314l698l583l187
62003E58903j830n4J031J427K156L445M191L680K774K644L171L375K915K342K108
61988E92278K086J944J502O19q42k723m468n447n450m951m803n441o441p037o978
61973E43848o598o086n241m039l039k823l266l641l384k568j747j392j462j472
61959D97090j077n24l08m53m90j59K66N15P29J071J247R64O17J036K441M167N533
61942E12665O616P814R016R670R668R620J0102J0955J1610J1865J1968J2080J2002
61929F45651J1496J0582R431Q171O880N590M290K994J772N76p54k140l092l339
$$ plain form
62027 817923 796650 777441 759946 744099 729901 716737 703709 690778 678691 667550 656320
62016 656320 644236 631930 620600 610638 601633 593273 585680 579097 573685 569371 565673 562090 558903
62003 558903 557073 557019 558050 559477 561633 565078 569269 572949 575723 578367 581538 584913 587828 590170 592278
61988 592278 594364 596308 597810 598429 597587 594864 590396 584949 579499 574548 569745 564304 557863 550826 543848
61973 543848 537250 531164 525923 521884 518845 516022 512756 509115 505731 503163 501416 500024 498562 497090
61959 497090 496013 495489 495181 494728 494238 494079 494345 494860 495589 496660 497907 498871 499488 500524 502965 507132 512665
61942 512665 519281 527095 536111 545781 555449 565069 575171 586126 597736 609601 621569 633649 645651
61929 645651 657147 667729 677160 685331 692211 697801 702091 705085 706857 707433 706679 704539 701447 698108
61915F98108l401l948m655m385k679m17J368K712M229N974P474Q616R784J1033
61901G29813J1773J1388R914P902N841L811J633o75k697m022m876n926p429q811
61887G47639r355q999q238p510o936o443o003n844o443p950r639j0445j0220r860
61873F33754r936r836q812p184n875n168m615l828k686j101P41K061K253J801
61859E81569J784K570L661M721N927P399R021J0858J3005J4968J6027J6364J6978
61846G04852J8204J9141J9030J8406J8204J8271J7530J5390J2328R171O344L789
61834H80660J264j389m034o240p567p844p146n627l530j203J030K992M609N906
61820H51881O985P795P907O817M573J827r05l703o771r751j1995j3392j4537j5895
$$ plain form
61915 698108 694707 690759 686104 681719 679040 678623 679991 682703 686932 692906 700380 708996 718780 729813
61901 729813 741586 752974 762888 770790 776631 780442 782075 781400 778703 774681 769805 763879 756450 747639
61887 747639 738284 729285 721047 713537 706601 700158 694155 688311 681868 673918 664279 653834 643614 633754
61873 633754 623818 613982 605170 597986 592111 586943 582328 578500 575814 574713 575454 577515 579768 581569
61859 581569 583353 585923 589584 594305 600232 607631 616652 627510 640515 655483 671510 687874 704852
61846 704852 723056 742197 761227 779633 797837 816108 833638 849028 861356 870527 876871 880660
61834 880660 881924 880535 876501 870261 862694 854850 847704 842077 838547 837344 838374 841366 845975 851881
61820 851881 858866 866661 874568 881385 885958 887785 886880 883177 876406 866655 854660 841268 826731 810836
61806H10836j7114j7405j6490j4888j3291j1951j0805r866r194q658q082p566
61794F65526p224o684n363l438j990j781k323k539k123j692j811k343k786k822
61780F20607k459j889j307q08m50l92p56j237j287q70o73j233k153k594k199j225
61764E99075k5J085J771K031K414L293M177M283L675L127L014K979K744K454K101
61749F38198J337R6j117j835k118k248k380k714l494m558n257n163m550l972l582
61734E96643l138k438j529n80K63R70J620K188K445K234J773J437J365J542K051
61719F06846K806L228K703J444L69J16N23J072J332R82k3j171j765j756j731k022
61703F12953k310k312k253k374k494k434k488l003l790m304m221l655k968k591
$$ plain form
61806 810836 793722 776317 759827 744939 731648 719697 708892 699026 689832 681174 673092 665526
61794 665526 658302 651618 646255 642817 640827 639046 636723 634184 632061 630369 628558 626215 623429 620607
61780 620607 618148 616259 614952 614144 613694 613302 612546 611309 610022 609152 608479 607246 605093 602499 600300 599075
61764 599075 599050 600135 601906 603937 606351 609644 613821 618104 621779 624906 627920 630899 633643 636097 638198
61749 638198 639535 639631 638514 636679 634561 632313 629933 627219 623725 619167 613910 608747 604197 600225 596643
61734 596643 593505 591067 589538 588958 589221 590191 591811 593999 596444 598678 600451 601888 603253 604795 606846
61719 606846 609652 612880 615583 617027 617396 617512 618035 619107 620439 621421 621398 620227 618462 616706 614975 612953
61703 612953 610643 608331 606078 603704 601210 598776 596288 593285 589495 585191 580970 577315 574347 571756
61689E71756k796l397l880l943l818l905m328m878n202m951m072l002k370k371
61675E18843k677k896k881k594k132j835j966k264k234j887j661j629j343o56
61661D90188j8K17K00P7l07q10p98l4Q12J136J375K277L537L994L189K012J657
61644E08704K269K907K567J234j02m98j19N3m58j049j052p68r45j550j812j365
61628E08016p57o51j103j788k521l196l518l301k934l103l879m424l930k714j906
61613D68291k036k454k346j858j704k096k686l328m161m949n031m189l027k280
61599D26146k139k346k563k473k012j653j985k832l319l002k434k308k549k678
61585C91853k572k443k325k070j683j312j059j064j444j923j915j214l51J22L42
$$ plain form
61689 571756 568960 565563 561683 557740 553922 550017 545689 540811 535609 530658 526586 523584 521214 518843
61675 518843 516166 513270 510389 507795 505663 503828 501862 499598 497364 495477 493816 492187 490844 490188
61661 490188 490170 490387 490587 490664 490357 489547 488749 488715 489527 490663 492038 494315 497852 501846 505035 507047 508704
61644 508704 510973 513880 516447 517681 517579 517081 516962 517015 516557 515508 514456 513688 512743 511193 509381 508016
61628 508016 507259 506608 505505 503717 501196 498000 494482 491181 488247 485144 481265 476841 472911 470197 468291
61613 468291 466255 463801 461455 459597 457893 455797 453111 449783 445622 440673 435642 431453 428426 426146
61599 426146 424007 421661 419098 416625 414613 412960 410975 408143 404824 401822 399388 397080 394531 391853
61585 391853 389281 386838 384513 382443 380760 379448 378389 377325 375881 373958 372043 370829 370478 370600 370942
61570C70942O96J066R82L98k13m23j42O08J671K492K386J294N8l69R5O74O95L51
61552C83261K97O64R13P23N52R22J567J855J744J682J747J568J123Q73R65J006
61536D01462P81N71O10Q10J245K167L310L857L420K476J515M88o25j471j990k643
61520D15983l463l650k741j550j090j264j337j198j192j105m01P46J465J297N77
61505D01077j59n96n94l21l08p92j215r44k17K52M01P10J191J302Q76L36j11o71
61487D00217j169r17K70J525J848J180J95n15o92j85R44K182K872K867K597K394
61471D15613K014J080j60r02q20n26o50q73m91L38P18L39j92m42o83r92q46m7
61453D12478P41R92J088J455J722J504J247J431J656J408J126J413J799J476P78
$$ plain form
61570 370942 371638 372704 373686 374084 373871 373448 373306 373914 375585 378077 380463 381757 381815 381446 381541 382215 382910 383261
61552 383261 383558 384222 385135 385858 386410 387332 388899 390754 392498 394180 395927 397495 398618 399491 400456 401462
61536 401462 402243 402814 403424 404234 405479 407646 410956 414813 418233 420709 422224 422712 422087 420616 418626 415983
61520 415983 412520 408870 406129 404579 403489 402225 400888 399690 398498 397393 396992 397738 399203 400500 401077
61505 401077 400918 400322 399728 399407 399099 398307 397092 396148 395931 396183 396584 397294 398485 399787 400663 400999 400888 400217
61487 400217 399048 398131 398401 399926 401774 402954 403149 402634 401942 401757 402701 404883 407755 410622 413219 415613
61471 415613 417627 418707 418547 417645 416825 416299 415649 414776 414285 414623 415341 415680 415488 415046 414363 413371 412525 412478
61453 412478 413219 414211 415299 416754 418476 419980 421227 422658 424314 425722 426848 428261 430060 431536 432314
61438D32314O31Q76N67j90j38J171K648L169K802K134J411P56L99K84J25P9N51
61421D49589J242J281O05K05O22J184J223J047J004N76o94j990j991o42P42J007
61405D55010K20p55j258j273j226j407j676j805j935k256k385j743n41K66K52
61390D37488m3j36k36m56k72N77J395J479J188J213J360J087Q21J533L014L773
61374D53785K987J647J216J838K472K356J720J245J329J881K434K436J734Q17
61360D79897L66N75J060J492J960K582L101L192L044L202L866M700N412O166P202
61345E27817Q328R048R010Q204O931N690M906M576M431M403M558M538L652J921
61331F08013L80j47p5k78q38j303j760k646l664l869k906j435j85O21R20P01M96
$$ plain form
61438 432314 432945 433821 434388 434198 434060 435231 437879 441048 443850 445984 447395 448151 448550 448834 448959 449038 449589
61421 449589 450831 452112 452717 452922 453544 454728 455951 456998 458002 458578 457884 455894 453903 453261 454003 455010
61405 455010 455230 454475 453217 451944 450718 449311 447635 445830 443895 441639 439254 437511 436970 437236 437488
61390 437488 437445 437309 437073 436617 436345 436922 438317 439796 440984 442197 443557 444644 445465 446998 450012 453785
61374 453785 456772 458419 459635 461473 463945 466301 468021 469266 470595 472476 474910 477346 479080 479897
61360 479897 480263 480838 481898 483390 485350 487932 491033 494225 497269 500471 504337 509037 514449 520615 527817
61345 527817 536145 545193 554203 562407 569338 575028 579934 584510 588941 593344 597902 602440 606092 608013
61331 608013 608393 608246 608171 607893 607055 605752 603992 601346 597682 593813 590907 589472 589287 589908 590828 591529 592025
61314E92025J169K849M680N946O929Q246R895J1363J2294J2676J2656J2490J2456
61301G05674J2626J2868J3079J3069J2272J0120O819L253K4k950n805q289j0186
61288G62574j1591j2518j2751j2348j1831j1539j1251j0649r726q479o766m775
61276F38350l154k209j483m42P49J619K141K657L314L919M197L916L099K298K257
61261F61228L108M247N175N950O526O435N671N200N814O875P008N877M414L341
61247G36869K328Q14r60k214k591k506k567k906l153k984k509k035j609j105o16
61232G12256l06O8R88K350L400L747L946M712N988P233Q181Q856R171R095Q995
61217G88680R258R684R789R528R247Q927Q115O719N352M660M632M791M780M559
$$ plain form
61314 592025 593194 596043 600723 606669 613598 621844 631739 643102 655396 668072 680728 693218 705674
61301 705674 718300 731168 744247 757316 769588 779708 786527 789780 789804 786854 781049 772760 762574
61288 762574 750983 738465 725714 713366 701535 689996 678745 668096 658370 649891 643125 638350
61276 638350 635196 632987 631504 631062 631811 633430 635571 638228 641542 645461 649658 653574 656673 658971 661228
61261 661228 664336 668583 673758 679708 686234 692669 698340 703540 709354 716229 723237 729114 733528 736869
61247 736869 739197 740011 739051 736837 734246 731740 729173 726267 723114 720130 717621 715586 713977 712872 712256
61232 712256 711950 712018 713006 715356 718756 722503 726449 731161 737149 744382 752563 761419 770590 779685 788680
61217 788680 797938 807622 817411 826939 836186 845113 853228 859947 865299 869959 874591 879382 884162 888721
61203H88721M157L598L061K904L401M537O120Q043J0254J2527J4470J5864J6824
61190I94481J7479J7791J7776J7577J6986J5315J2270Q657N650L512J718J60o78
61177A128694q31j210k448m016n053n555o280p738r759j1799j3393j4390j5010
61164A031212j5573j6174j6784j7493j8267j8616j8127j7279j7040j7526j7778
61153H40555j7022j5357j3098j0324p497n575m849m323k949r38P37J530J354K6
61139G62270k324m660n742n429m664m230l945l098j258J291L713N439O846Q752
61125G52961J1133J3104J4435J6180J9131K2421K4645K5833K7262K9590L2156
61114I88851L4087L5212L5825L6264L6798L7303L7057L5381L2590K9729K7357
$$ plain form
61203 888721 892878 896476 899537 902441 905842 910379 916499 924542 934796 947323 961793 977657 994481
61190 994481 1011960 1029751 1047527 1065104 1082090 1097405 1109675 1118332 1123982 1127494 1129212 1129372 1128694
61177 1128694 1127863 1126653 1124205 1120189 1115136 1109581 1103301 1095563 1085804 1074005 1060612 1046222 1031212
61164 1031212 1015639 999465 982681 965188 946921 928305 910178 892899 875859 858333 840555
61153 840555 823533 808176 795078 784754 777257 771682 766833 762510 759561 758623 759360 760890 762244 762270
61139 762270 759946 755286 749544 744115 739451 735221 731276 728178 726920 728211 731924 737363 744209 752961
61125 752961 764094 777198 791633 807813 826944 849365 874010 899843 927105 956695 988851
61114 988851 1022938 1058150 1093975 1130239 1167037 1204340 1241397 1276778 1309368 1339097 1366454
61103A366454K5085K2418J9471J6634J3848J0493N969L46n583j0975j5669j9980
61091A428511k3900k7071k9559l1961l4384l6024l6294l5667l4855l3723l1789
61080A073284k9303k7025k5188k3463k1685j9967j8244j6360j4447j2709j0980
61069H53913r004o903m944l147j516k55O66J679K895L782M193M949O645Q578R805
61054H71336J0648J2061J3960J5421J6224J7074J8433K0184K2382K5171K8088
61043A070982L0347L1870L3199L4554L5801L7118L8698M0040M0494M0328M0294
61032A473725M0427M0343M0332M0865M1405M1127M0580M1083M2648M4123M5383
61021A932041M7582N0965N4248N6654N8865O1474O4134O7000P1414P8381Q7669
$$ plain form
61103 1366454 1391539 1413957 1433428 1450062 1463910 1474403 1480372 1480718 1475135 1464160 1448491 1428511
61091 1428511 1404611 1377540 1347981 1316020 1281636 1245612 1209318 1173651 1138796 1105073 1073284
61080 1073284 1043981 1016956 991768 968305 946620 926653 908409 892049 877602 864893 853913
61069 853913 844909 838006 833062 829915 828399 828144 828810 830489 833384 837166 841359 846308 852953 861531 871336
61054 871336 881984 894045 908005 923426 939650 956724 975157 995341 1017723 1042894 1070982
61043 1070982 1101329 1133199 1166398 1200952 1236753 1273871 1312569 1352609 1393103 1433431 1473725
61032 1473725 1514152 1554495 1594827 1635692 1677097 1718224 1758804 1799887 1842535 1886658 1932041
61021 1932041 1979623 2030588 2084836 2141490 2200355 2261829 2325963 2392963 2464377 2542758 2630427
61010B630427R9093J13302J30546J50115J71663J95828K23134K54037K90553L35878
61000D594576L91595M57310N33685O23091P26308Q41938R70927J118535J290872
60991A1548837J495443J745515K045696K349438K532092K440358K006583J325884
60983B7489846O09657N3592k54455l20575j86949P6899L39064M16738J74385l72087
60973B8026115j055273j666790k075824k263184k276477k174370k003097j796725
60965A2714375j579636j367202j168728r90369q34873p01397n88246m94886m20175
60956D568863l60457l11501k71292k39261k13752j92109j72813j55863j41139
60947B510676j27784j15201j03453r2570q2524p4093o8710o6873o7168o7211o5415
$$ plain form
61010 2630427 2729520 2842822 2973368 3123483 3295146 3490974 3714108 3968145 4258698 4594576
61000 4594576 4986171 5443481 5977166 6600257 7326565 8168503 9139430 10257965 11548837
60991 11548837 13044280 14789795 16835491 19184929 21717021 24157379 26163962 27489846
60983 27489846 28099503 28153095 27898640 27578065 27391116 27468015 27807079 28223817 28398202 28026115
60973 28026115 26970842 25304052 23228228 20965044 18688567 16514197 14511100 12714375
60965 12714375 11134739 9767537 8598809 7608440 6773567 6072170 5483924 4989038 4568863
60956 4568863 4208406 3896905 3625613 3386352 3172600 2980491 2807678 2651815 2510676
60947 2510676 2382892 2267691 2164238 2071668 1989144 1915051 1846341 1779468 1712300 1645089 1579674
60936A579674o1880n7926n4832n2746n0745m8025m4701m1254l7703l3923l0391
60925A065548k7773k5881k3806k1196j8661j6757j5235j3635j2006j0580r284
60914H70734q015p015o487o101n372m311l249k297j412p92o27n78j65L88L95k16
60898H24880p48q96j303k531m122n262n887o472p063p229o813o144n545n113n019
60883G54733n435o201o947p583q260q904r242r309r436r669r668r236q532p748
60869F38563o969o406o184n897m949l513k478k231k129j492m75M72J430K678M044
60854F04464N169O087O907P228O517M958L344K171J416J157J760L182M584M920
60840F63864L817J711o79k895m768o136o711o421n714n218m988m543l711l062
$$ plain form
60936 1579674 1517794 1459868 1405036 1352290 1301545 1253520 1208819 1167565 1129862 1095939 1065548
60925 1065548 1037775 1011894 988088 966892 948231 931474 916239 902604 890598 880018 870734
60914 870734 862719 855704 849217 843116 837744 833433 830184 827887 826475 825683 825056 824478 824313 824701 825096 824880
60898 824880 824132 823236 821933 819402 815280 810018 804131 797659 790596 783367 776554 770410 764865 759752 754733
60883 754733 749298 743097 736150 728567 720307 711403 702161 692852 683416 673747 664079 654843 646311 638563
60869 638563 631594 625188 619004 613107 608158 604645 602167 599936 597807 596315 595840 596312 597742 600420 604464
60854 604464 609633 615720 622627 629855 636372 641330 644674 646845 648261 649418 651178 654360 658944 663864
60840 663864 667681 669392 668713 665818 661050 654914 648203 641782 636068 630850 625862 621319 617608 614546
60826F14546l091l408l205k372j615j493j800j967j736j288r72j020j406j905
60812E87268k333k692l083l556m135m858n576n910n622m966m506m594n105n519
60798E24813n253m154k844k322k925l887m185l646k903k468k290k190k242k507
60784D80997k718k479j747q75k23K16O48J048J096O69K17L35J039J747K065K189
60768D84224K505L086L744M275M522M444M257M193M067L473K511J829J755J843
60754E30728J616J183P61Q9j062k229k779k842l062l503l536k756j599q52r89
60739E09168k012l510m873n645n781n437m756m104m028m557m863m239l125k500
60725D49738k461k286j779j593k005k256j661o21l5j59n87r65j149r65l57L37
$$ plain form
60826 614546 611455 608047 604842 602470 600855 599362 597562 595595 593859 592571 591599 590579 589173 587268
60812 587268 584935 582243 579160 575604 571469 566611 561035 555125 549503 544537 540031 535437 530332 524813
60798 524813 519560 515406 512562 510240 507315 503428 499243 495597 492694 490226 487936 485746 483504 480997
60784 480997 478279 475800 474053 473178 472955 473171 473819 474867 475963 476632 476849 477184 478223 479970 482035 484224
60768 484224 486729 489815 493559 497834 502356 506800 511057 515250 519317 522790 525301 527130 528885 530728
60754 530728 532344 533527 534288 534377 533315 531086 528307 525465 522403 518900 515364 512608 511009 510157 509168
60739 509168 507156 503646 498773 493128 487347 481910 477154 473050 469022 464465 459602 455363 452238 449738
60725 449738 447277 444991 443212 441619 439614 437358 435697 435076 435041 434882 434295 433330 432181 431216 430859 431196
60709D31196P46R34J200J508J567J418J468J890K381K602K627K752L081L492L856
60694D62718M071L973L438K654K080K052K445K862L032K909K504J900J396J364
60680D99398J795K184K102J696J453J520J550J193N59J29K31O45P32M8j149k206
60664E11880k830l350m094m848n141m878m369l841l195k255j051R5P53O73Q5m57
60648D73177n20k4R54K204L184L223K250R77K6p60j774k770l160k899k491k205
60632D69392j867j387r22m63J46O93O98J75k15n2K81J96l00p42q27n45j8M75M80
60613D65198j73j003j279q27j66J44O4n0Q4M46Q19R61O73o4r11j254p49K55J040
60594D63208J315J352J351J124O66N53J210K144K532K439K703L547M039L326J820
$$ plain form
60709 431196 431942 432876 434076 435584 437151 438569 440037 441927 444308 446910 449537 452289 455370 458862 462718
60694 462718 466789 470762 474200 476854 478934 480986 483431 486293 489325 492234 494738 496638 498034 499398
60680 499398 501193 503377 505479 507175 508628 510148 511698 512891 513450 513579 513810 514455 515187 515235 514086 511880
60664 511880 509050 505700 501606 496758 491617 486739 482370 478529 475334 473079 472028 472123 472876 473549 473634 473177
60648 473177 472657 472633 473587 475791 478975 482198 484448 485425 485451 484691 482917 480147 476987 474088 471597 469392
60632 469392 467525 466138 465216 464753 464899 465592 466290 466465 466250 466198 466479 466675 466375 465633 464806 464261 464243 464718 465198
60613 465198 465025 464022 462743 461916 461750 461894 461958 461908 461992 462438 463257 464218 464891 464827 463916 462662 461913 462168 463208
60594 463208 464523 465875 467226 468350 469016 469569 470779 472923 475455 477894 480597 484144 488183 491509 493329
60579D93329P12N73R37J089Q35N13N70J233K373L632M708N551O291P080Q055R312
60563E46793J0751J1957J2429J2026J1193J0563J0306R829Q326N592K231r19l341
60550F47736m844n387n208m807m429l681k078J27K069L253L991M847O003P376
60536F44968Q934J0602J2076J3148J4126J5563J7449J8837J8556J6272J2782R164
60524H12477N775K278j420m700o863p947q593r215r661r614q966p832o440n138
60510G34141m224l690l160k171n59J377L084M302N501P425J0151J2976J5488J8296
60496G98937K2146K6668L0794L4217L7639M1472M5123M7901M9789N0718M9750
60485A235154M5903L9538L1986K3748J3932J886j1284k3459l3479m1634m8358
$$ plain form
60579 493329 494041 494614 495551 496640 497475 497988 498558 499791 502164 505796 510504 516055 522346 529426 537481 546793
60563 546793 557544 569501 581930 593956 605149 615712 626018 635847 644173 649765 651996 651077 647736
60550 647736 642892 637505 632297 627490 623061 619380 617302 617429 619498 622751 626742 631589 637592 644968
60536 644968 653902 664504 676580 689728 703854 719417 736866 755703 774259 790531 803313 812477
60524 812477 818252 820530 819110 814410 807547 799600 791007 781792 772131 762517 753551 745719 739279 734141
60510 734141 729917 726227 723067 720896 720337 721714 724798 729100 734601 742026 752177 765153 780641 798937
60496 798937 821083 847751 878545 912762 950401 991873 1036996 1084897 1134686 1185404 1235154
60485 1235154 1281057 1320595 1352581 1376329 1390261 1392147 1380863 1357404 1323925 1282291 1233933
60474A233933n3245n5680n5830n4435n1998m8754m5115m1413l7332l2394k7132
60463G30605k2988k0671j9348j7851j6032j4362j2884j1338r889q846p996o977
60451E61423o129o051o429o230n139l972l477l502l571l528l292k676j881j550
60437E03996j841j987j316k83P9m90j271j552j319r68p52o36n00l25j77m9J59
60420D90768L71K43l59r36q92l77m4Q1P50K192L361L146J838P54N74Q22R10R94
60402E04196J474K166K451K063J436J201J607K451L347L907L823L095K238J922
60388E37377K194K395K038J521J540K083K500K493K381K349K107J563J258J679
60374E65478K534L141L272L216L161L030K809K693K772K848K673K296K097K438
$$ plain form
60474 1233933 1180688 1125008 1069178 1014743 962745 913991 868876 827463 790131 757737 730605
60463 730605 707617 686946 667598 649747 633715 619353 606469 595131 585242 576396 568400 561423
60451 561423 555294 549243 542814 536584 531445 527473 523996 520494 516923 513395 510103 507427 505546 503996
60437 503996 502155 500168 498852 498569 498648 498158 496887 495335 494016 493048 492296 491660 491160 490835 490658 490609 490768
60420 490768 491139 491382 491023 490087 489195 488818 488774 488855 489605 491797 495158 498304 500142 500896 501470 502292 503202 504196
60402 504196 505670 507836 510287 512350 513786 514987 516594 519045 522392 526299 530122 533217 535455 537377
60388 537377 539571 541966 544004 545525 547065 549148 551648 554141 556522 558871 560978 562541 563799 565478
60374 565478 568012 571153 574425 577641 580802 583832 586641 589334 592106 594954 597627 599923 602020 604458
60360F04458L213L779L516K502J518J265J713K259K439K348K410K863L499L967
60346F41749M260M709N387N751N188L803K390J602J430J388R07l86k363m251n156
60331F66408m918m211l758l710l806l875l924m021m175m242l929l143k278j926
60317F14492k160k408k057j066P3P67Q21P40J399L096N115O585P651R191J1472
60302F53711J3730J5264J6241J7143J7846J7684J6044J2751Q203L309j097n062
60290G85767r199j3413j6424j7057j5564j3272j1212r540q013o440m841l520k965
60277F54307l298l957m284m338m688n460o073o050n664n480n486n136m224l279
60263E86890k845k728k388j834j562j630j545j200j147j526j521o68J34j55j005
$$ plain form
60360 604458 607671 611450 614966 617468 618986 620251 621964 624223 626662 629010 631420 634283 637782 641749
60346 641749 646009 650718 656105 661856 667044 670847 673237 674839 676269 677657 678564 678178 675815 671564 666408
60331 666408 661490 657279 653521 649811 646005 642130 638206 634185 630010 625768 621839 618696 616418 614492
60317 614492 612332 609924 607867 606801 606874 607641 608462 609202 610601 613697 618812 625397 633048 642239 653711
60302 653711 667441 682705 698946 716089 733935 751619 767663 780414 788617 791926 790829 785767
60290 785767 776568 763155 746731 729674 714110 700838 689626 680086 672073 665633 660792 657272 654307
60277 654307 651009 647052 642768 638430 633742 628282 622209 616159 610495 605015 599529 594393 590169 586890
60263 586890 584045 581317 578929 577095 575533 573903 572358 571158 570011 568485 566964 566296 566430 566275 565270
60248E65270r94P7J092J435J603J850J649R15M53O01N81j04o83m24N0k28r50j003
60230E71190m0J337K591L516L886L713L616M092M627M392L604L352M182N590O935
60215F26583P996Q665Q849Q866R271J0017J0385J0031R623J0026J1127J1802J1147
60202G54388R560Q400Q416Q802Q242O720N532N321N055L550J251m18r74j199j763
60187H20883k495l113l813m910o359p862r084r727r748r491r302r018q267p171
60173G20523o347o132o137n628m225k286p99n75j361j975j652q69n50q31j135
60158F80021j078p19j31O09J200J410J504J838K242K342K289K497K851K856K487
60143G02218K214K239K372K643L286M122M709N174O181P862R459J0329J0580J0499
$$ plain form
60248 565270 564276 564353 565445 566880 568483 570333 571982 572897 573350 573951 574532 574428 573745 573321 573371 573143 572193 571190
60230 571190 571150 572487 575078 578594 582480 586193 589809 593901 598528 602920 606524 609876 614058 619648 626583
60215 626583 634579 643244 652093 660959 670230 680247 690632 700663 710286 720312 731439 743241 754388
60202 754388 763948 772348 780764 789566 797808 804528 810060 815381 820436 823986 825237 824819 823845 822646 820883
60187 820883 818388 815275 811462 806552 800193 792331 783247 773520 763772 754281 744979 735961 727694 720523
60173 720523 714176 708044 701907 696279 692054 689768 688969 688394 687033 685058 683406 682537 681987 681156 680021
60158 680021 678943 678224 678093 678702 679902 681312 682816 684654 686896 689238 691527 694024 696875 699731 702218
60143 702218 704432 706671 709043 711686 714972 719094 723803 728977 735158 743020 752479 762808 773388 783887
60129G83887R978Q976P930P189O405N098L568K678K814L450L870L941M079M570
60115H58433N227N679N833N775N347M179K318M68o87j195j688k731m514o854r118
60100H66472j0420j0286r132p810o903o604o865p255p036n845m181k747j640n79
60086G79169L60Q56R69J034J056P40Q8m95o55l55J58K81o96k733m779n917o431
60069G62650p149q145q842r101r248r193q463p204o218n923o041o278o516o324
60055F58005n233l639k556k215j789p63L68J109J784K824M018N024O055P397Q737
60040F79126R528R695R547R279Q944Q603Q183P418O196M676K967J042r10k544
60026G61750l889n330o857p862p994p692p663q189r215j0512j1552j1707j1002
$$ plain form
60129 783887 793865 802841 810771 817960 824365 829463 833031 835709 838523 841973 845843 849784 853863 858433
60115 858433 863660 869339 875172 880947 886294 890473 892791 893259 892572 891377 889689 886958 882444 875590 866472
60100 866472 856052 845766 836634 828824 821921 815317 808452 801197 794161 788316 784135 781388 779748 779169
60086 779169 779529 780385 781354 782388 783444 784184 784272 783777 783122 782767 782925 783206 782510 779777 774998 769081 762650
60069 762650 755501 747356 738514 729413 720165 710972 702509 695305 689087 683164 677123 670845 664329 658005
60055 658005 652772 649133 646577 644362 642573 641810 642178 643287 645071 647895 651913 656937 662992 670389 679126
60040 679126 688654 698349 707896 717175 726119 734722 742905 750323 756519 761195 764162 765204 764294 761750
60026 761750 757861 752531 745674 737812 729818 722126 714463 706274 697059 686547 674995 663288 652286
60013F52286j0178r723r315q544p644p063o678o024m971l798k812k257k293k697
59999E68289k742j804k6J817K984L230K881K626K961L721M383M816N319N857N871
59984F10183N156M368M239M572M464L337J467m37j908l059m250n408n906n442
59970F11376m747m837n636o049n412m142k853j627m80K82O38J188K356L728M568
59955E88353M604L964K804J494O65N98Q94J069J135J269J370J313J230J180R51
59940F12893N07J46j00o54j573k178k044j731j854j907r04J102K932L712L686
59925F12033L580L786M262M914N807P091Q603R610R282P569N235K990J022m45
59911F85339r07k91O90J369J769J933J444K91m09L27J824K508K034J518J765K303
$$ plain form
60013 652286 642108 632385 623070 614526 606882 599819 593141 587117 582146 578348 575536 573279 570986 568289
59999 568289 565547 563743 563717 565534 568518 571748 574629 577255 580216 583937 588320 593136 598455 604312 610183
59984 610183 615339 619707 623946 628518 632982 636319 637786 637349 635441 632382 628132 622724 616818 611376
59970 611376 606629 601792 596156 590107 584695 580553 577700 576073 575593 575875 576513 577701 580057 583785 588353
59955 588353 592957 596921 599725 601219 601884 602482 603376 604445 605580 606849 608219 609532 610762 611942 612893
59940 612893 613400 613546 613446 612792 611219 609041 606997 605266 603412 601505 600601 601703 604635 608347 612033
59925 612033 615613 619399 623661 628575 634382 641473 650076 659686 668968 676537 681772 684762 685784 685339
59911 685339 684432 684141 684831 686200 687969 689902 691346 691637 691228 691555 693379 695887 697921 699439 701204 703507
59895G03507K468K414K524K581K182J632J810L170N151O633O880O115N226M863
59881G57156M955N102N144N137M991M519L797L143K747K493K036R62r25l196m879
59866G93182n356n030m900n402n988n849m870l739l207l274l263k731k025j678
59852G35870j551j118m35K7M13J461L215M687N288N698O696P884Q467Q587Q928
59837G94117R316Q802O994M493K112L91j86O50K399M028M825M591L146L81l180
59822H42879o502q862j0169j0548j0190r621r460r687r661q996p991p103o431
59809G27658n875n369m816m149l587l458l612l394k367q43M22Q19J66j254k764
59794F87577l679l793l426k985k656k438k299k197k172k365k769l083k965k442
$$ plain form
59895 703507 705975 708389 710913 713494 715676 717308 719118 722288 727439 734072 740952 747067 752293 757156
59881 757156 762111 767213 772357 777494 782485 787004 790801 793944 796691 799184 801220 802182 801257 798061 793182
59866 793182 787826 782796 777896 772494 766506 760657 755787 752048 748841 745567 742304 739573 737548 735870
59852 735870 734319 733201 732766 732793 733206 734667 737882 742569 747857 753555 760251 768135 776602 785189 794117
59837 794117 803433 812235 819229 823722 825834 826225 826039 826689 829088 833116 837941 842532 845678 846059 842879
59822 842879 836377 827515 817346 806798 796608 786987 777527 767840 758179 749183 741192 734089 727658
59809 727658 721783 716414 711598 707449 703862 700404 696792 693398 691031 690188 690610 691429 691595 690341 687577
59794 687577 683898 680105 676679 673694 671038 668600 666301 664104 661932 659567 656798 653715 650750 648308
59780F48308j864j551j624k064k576k628j909p82M1K16rk17j29L99J356K438L235
59763F40640L634L922M402N086N699N977N921N861O181O933P824Q580R165R588
59749G29413R780R697R328Q593P525O555O185O204N822M732L473K422J121q16
59735H10034k705l481l119k553k371k314k112k039k407k984l233k886k128j349
59721G74353q48o73p06q63j113j286j141p42m97o84j151j606j961k223k313k137
59705G54409j623p26L20Q76O10K53R57K733M384N154N598O416P351P896Q228Q622
59689H11458Q637P644N722L359Q50j409k731k971k916l051k780j733j019j914
59675H17146l945n621o569p520q550q899q489q107p856o859m912l194k742l140
$$ plain form
59780 648308 646444 644893 643269 641205 638629 636001 634092 633310 633351 633567 633558 633341 633212 633611 634967 637405 640640
59763 640640 644274 648196 652598 657684 663383 669360 675281 681142 687323 694256 702080 710660 719825 729413
59749 729413 739193 748890 758218 766811 774336 780891 787076 793280 799102 803834 807307 809729 810850 810034
59735 810034 807329 803848 800729 798176 795805 793491 791379 789340 786933 783949 780716 777830 775702 774353
59721 774353 773505 772832 772126 771263 770150 768864 767723 766981 766484 765800 764649 763043 761082 758859 756546 754409
59705 754409 752786 752060 752380 753256 753866 754119 755076 757809 762193 767347 772945 779361 786712 794608 802836 811458
59689 811458 820095 827739 833461 836820 837670 836261 833530 830559 827643 824592 821812 820079 819060 817146
59675 817146 813201 807580 801011 793491 784941 776042 767553 759446 751590 744731 739819 736625 733883 730743
59661G30743l261k621j518m52K82P53J373K326L218L756M433N746P041P145O005
59646G64969M649L494J911l55k516l892m808n804o779p347p444p177o552n606
59632G16743m413k947j436o51j046j779j619p85p61k151l855m677m623m247l779
59617F77974l467l684m196m167l442k914l066l089k153o28O59J586K406K934K975
59602F57728K874K900K591J526K14n20o92q44j026q14j91L79O39P10P12O15M11
59585F67212L1o49j500k071k163k149k409k811l043l111l124k994k735k652k875
59570F32957l014k742k339k205k168j758r75k60J68N48J121J674J671Q43l09p72
59554F22440o1J162J890J946J886J953J917J830K077K609K916K887K934L175L473
$$ plain form
59661 730743 727482 724861 723343 722891 723173 723926 725299 727625 730843 734599 739032 744778 751819 758964 764969
59646 764969 769618 773112 775023 774668 772152 768260 763452 757648 750869 743522 736078 728901 722349 716743
59632 716743 712330 709383 707947 707296 706250 704471 702852 702067 701306 699155 695300 690623 686000 681753 677974
59617 677974 674507 670823 666627 662460 659018 656104 653038 649949 647796 647168 647827 649413 651819 654753 657728
59602 657728 660602 663502 666093 667619 667833 667313 666621 665777 664751 663937 663746 664125 664764 665474 666186 666801 667212
59585 667212 667243 666594 665094 663023 660860 658711 656302 653491 650448 647337 644213 641219 638484 635832 632957
59570 632957 629943 627201 624862 622657 620489 618731 617756 617496 617664 618212 619333 621007 622678 623521 623212 622440
59554 622440 622379 623541 625431 627377 629263 631216 633133 634963 637040 639649 642565 645452 648386 651561 655034
59539F55034M339O607R887J2571J4053J5677J8507K1104K0764J6512R922L378
59527H08355j466l995m423l538k031j68J771L214L899M217M433M100K814J007
59513H18189p85k863n690q675j0590j1129j1157j1410j1650j1223r933q230o891
59500G07963o421o516o243n029l269j768r11o37p92j052r38l22M07J019J819K954
59484F80264L863M028L847M134N068O172P087P764Q196Q501R048J0009J1006J1520
59470G80507J1350J0336Q214N245K435N27p93k071l016l014k184j067L90K627
59456H09486N435P991R904J1466J2912J4083J4818J5118J4969J4501J4100J3872
59444I58655J3188J1299Q173M190n16n737j0522j3736j5186j5500j5109j4047
$$ plain form
59539 655034 659373 665980 675867 688438 702491 718168 736675 757779 778543 795055 804977 808355
59527 808355 806889 802894 798471 794933 792902 792734 794505 797719 801618 805835 810268 814368 817182 818189
59513 818189 817404 814541 808851 800176 789586 778457 767300 755890 744240 733017 723084 714854 707963
59500 707963 701542 695026 688783 683754 680485 678717 677806 677169 676377 675325 674387 674065 674472 675491 677310 680264
59484 680264 684127 688155 692002 696136 701204 707376 714463 722227 730423 738924 747972 757981 768987 780507
59470 780507 791857 802193 810407 815652 818087 818614 817821 815750 812734 809720 807536 806469 806859 809486
59456 809486 814921 822912 832816 844282 857194 871277 886095 901213 916182 930683 944783 958655
59444 958655 971843 983142 991315 995505 994989 989252 978730 964994 949808 934308 919199 905152
59432I05152j2617j1365j0422r507q561p671o528m794k863j398j02K064N347Q805
59418H45540J1707J4407J7465K0622K3158K4710K5397K5766K6920K9746L3151
59407A098589L3612K7633J5014n74j4244k2893k6118k5217k1766j6629r785j212
59395A036410P624J3254J2112L614q797k0020k6794k8833k7542k4559k1359j8834
59383H96276j6758j4307j1417q969p347n802l741j806q12m26J56Q15Q55M07L61
59368H27485R06J210P48J15J62R54J936K742L453M227M960N421N668O140P160
59353H73287Q466R603J0735J2457J4770J6926J8530K0061K1885K3419K3879K3306
59341A077324K2307K1238K0151J9023J7487J4813J0693N675M53m663r198j2392
$$ plain form
59432 905152 892535 881170 870748 861241 852680 845009 838481 833687 830824 829426 829324 831388 836735 845540
59418 845540 857247 871654 889119 909741 932899 957609 983006 1008772 1035692 1065438 1098589
59407 1098589 1132201 1159834 1174848 1174274 1160030 1137137 1111019 1085802 1064036 1047407 1037622 1036410
59395 1036410 1044034 1057288 1069400 1073014 1064217 1044197 1017403 988570 961028 936469 915110 896276
59383 896276 879518 865211 853794 844825 837478 831676 827935 826129 825317 824891 825047 825862 826717 827124 827485
59368 827485 828391 829601 830349 830464 830626 831580 833516 836258 839711 843938 848898 854319 859987 866127 873287
59353 873287 881753 891356 902091 914548 929318 946244 964774 984835 1006720 1030139 1054018 1077324
59341 1077324 1099631 1120869 1141020 1160043 1177530 1192343 1203036 1208711 1209164 1204501 1195303 1182911
59329A182911j4287j6118j8694k1162k2367k2635k2942k3030k1811j9423j7364
59318I63078j6492j6123j5337j4109j2904j1996j1443j1126j0696r995r413r238
59306H14206q915p803o350n591n565n262m183k929k056j235J51K193M529O719
59292G77909Q412R687J1224J3599J6277J7626J5964J0679K770n293j0914j3222
59280H54718j3329j2444j0565p566m380j900M77L764P461J0248J2095J4080J6313
59267H68972J7698J7742J7004J5710J3414J0319P408M921K021j632n250q162j0478
59254I49687j2171j2806j2608j2475j2479j1587r417p061n479m263k648p68Q82
59241H46807K293L601M628N361O146P025P673Q294R501J0971J1362J0167Q466
$$ plain form
59329 1182911 1168624 1152506 1133812 1112650 1090283 1067648 1044706 1021676 999865 980442 963078
59318 963078 946586 930463 915126 901017 888113 876117 864674 853548 842852 832857 823444 814206
59306 814206 805291 797488 791138 785547 779982 774720 770537 767608 765552 764317 764468 766661 771190 777909
59292 777909 786321 796008 807232 820831 837108 854734 870698 881377 884147 878854 867940 854718
59280 854718 841389 828945 818380 810814 806434 804534 805011 808775 816236 826484 838579 852659 868972
59267 868972 886670 904412 921416 937126 950540 960859 968267 973188 975209 973577 968327 960165 949687
59254 949687 937516 924710 912102 899627 887148 875561 866144 859083 853604 849341 846693 845925 846807
59241 846807 849100 852701 857329 862690 868836 875861 883534 891828 901329 912300 923662 933829 942295
59228I42295P200N859L666R70j540m053o977r802j1666j2544j3086j3645j4205
59215H72472j4702j4775j3840j2036j0524j0068j0019r324p963o590n471m647
59203G52513m463m963n188m188k419j173q28o18l7N46P39P82J028J372J552J636
59187G36291J938K586L376M066M680N460O421P203P474P353P113O733O086N380
59173H12160M968M858M909N270O074O966P542Q001Q655R203R237R042Q864P879
59159I13628N251J870m93j689l177n505p632r110j0943j3506j5429j5662j5145
59146H22458j5175j5452j4977j3800j2583j1402j0157r347r229r042q140p105
59134F86049o584n948m364k430j423j432j583j497j320p30P01K433L498L910M465
$$ plain form
59228 942295 949495 955354 959020 959990 958450 954397 947420 937618 925952 913408 900322 886677 872472
59215 872472 857770 842995 829155 817119 806595 796527 786508 777184 769221 762631 757160 752513
59203 752513 748050 743087 737899 733711 731292 730119 729291 728673 728636 729182 729921 730703 731731 733103 734655 736291
59187 736291 738229 740815 744191 748257 752937 758397 764818 772021 779495 786848 793961 800694 806780 812160
59173 812160 817128 821986 826895 832165 838239 845205 852747 860748 869403 878606 887843 896885 905749 913628
59159 913628 918879 920749 920256 918567 915390 909885 902253 893143 882200 868694 853265 837603 822458
59146 822458 807283 791831 776854 763054 750471 739069 728912 719565 710336 701294 693154 686049
59134 686049 679465 673517 669153 666723 665300 663868 662285 660788 659468 658738 659439 661872 665370 669280 673745
59119F73745N347O062O606P550Q984J0270J0988J1320J1519J1539J1145J0006
59107G85081P966N653M239M087M246L832L175K868K563J709P19J75m42j917l661
59092H20293m326l737k873k163j149Q0O11N0r00j561k004k462k880l363m275n612
59076G83729o868p659q018p999p538o756n935n197m581m229m074l702l006k551
59062G05616k695k867k434j815j776k006j523l14N31L05o11j570k250k423j941
59047F82227j160o49m43j38K69L34j27q71j663k319k433j793q62k53J30P33J458
59030F72440J969K505L489M590N215N737P106R237J0946J1613J1840J2246J2584
59017G71517J2365J1487R937P655M987K613P58q97k411l393l664l473k893j779
$$ plain form
59119 673745 679092 685154 691760 699310 708294 718564 729552 740872 752391 763930 775075 785081
59107 785081 793047 798700 802939 807026 811272 815104 818279 821147 823710 825419 826138 826313 825871 823954 820293
59092 820293 815967 812230 809357 807194 806045 806125 806736 806786 805886 804325 802321 799859 796979 793616 789341 783729
59076 783729 776861 769202 761184 753185 745647 738891 732956 727759 723178 718949 714875 711173 708167 705616
59062 705616 702921 700054 697620 695805 694029 692023 690500 690186 690717 691022 690411 688841 686591 684168 682227
59047 682227 681067 680418 679975 679837 680106 680440 680313 679442 677779 675460 673027 671234 670372 670119 670249 670982 672440
59030 672440 674409 676914 680403 684993 690208 695945 703051 712288 723234 734847 746687 758933 771517
59017 771517 783882 795369 805306 812961 817948 820561 821319 820422 818011 814618 810954 807481 804588 802809
59003H02809l55Q92K042L597N443O814P468P979Q592Q771Q241P590P226O648N412
58988H89169M127L732M175M513M030K691Q01j144k388k306r57R29K578L667M389
58973I18006N241O669Q723J1008J3028J4550J5666J6567J7212J7290J6589J5440
58961A075989J4423J3572J2349J0488Q424O403L783j86n149r910j3728j6779j9413
58948A080266k1570k2976k3446k2918k1513j9575j7477j5423j3559j1982j0543
58937H79284q995p494o474n759m539k573p40J59M46O91O59m6q87j048o86n13n54
58920H40931m07l40q87j586j408m19K37R5n0N34J665K976M470N930O714O590O202
58903H71247O382P539R775J2864J6000J8284J9711K1007K2346K2974K2322K0876
$$ plain form
59003 802809 802454 803346 805388 808985 814428 821242 828710 836689 845281 854052 862293 869883 877109 883757 889169
58988 889169 893296 897028 901203 905716 909746 912437 913238 912094 909706 907400 906443 907372 909950 913617 918006
58973 918006 923247 929916 938639 949647 962675 977225 992891 1009458 1026670 1043960 1060549 1075989
58961 1075989 1090412 1103984 1116333 1126821 1135245 1141648 1145431 1145245 1140096 1130186 1116458 1099679 1080266
58948 1080266 1058696 1035720 1012274 989356 967843 948268 930791 915368 901809 889827 879284
58937 879284 870289 862795 856321 850562 846023 843450 842710 842869 843315 844006 844665 844619 843732 842684 841998 841485 840931
58920 840931 840524 840184 839297 837711 836303 835884 836121 836216 836166 836700 838365 841341 845811 851741 858455 865045 871247
58903 871247 877629 885168 894943 907807 923807 942091 961802 982809 1005155 1028129 1050451 1071327
58891A071327J9624J9184J9697K0969K2515K3857K5015K6261K7276K7098K5037
58880A327860K1292J6551J1411O265J369l087o920j0095j3107j6692k0730k3871
58868A290246k4907k4149k2788k1360j9702j8001j6794j6009j5027j3819j3081
58857A084609j3083j3211j2921j2457j2371j2751j3171j3043j2058j0577r446
58846I49520r111r187r185r231r545r769r512r132r236r768j0233j0411j0141
58833H25059q992p006n254m704m953m903m160k920j178Q27K140K267K229L163
58819G91615M553N208N337N913O657O498N663N343N409M567K762J460J282J278
58805H53545Q19L47j31j379l213m282m226m314n236n993n815n496n864o455o675
$$ plain form
58891 1071327 1090951 1110135 1129832 1150801 1173316 1197173 1222188 1248449 1275725 1302823 1327860
58880 1327860 1349152 1365703 1377114 1383379 1384748 1381661 1374741 1364646 1351539 1334847 1314117 1290246
58868 1290246 1265339 1241190 1218402 1197042 1177340 1159339 1142545 1126536 1111509 1097690 1084609
58857 1084609 1071526 1058315 1045394 1032937 1020566 1007815 994644 981601 969543 958966 949520
58846 949520 940409 931222 922037 912806 903261 893492 883980 874848 865612 855844 845611 835200 825059
58833 825059 816067 809061 803807 799103 794150 789247 785087 782167 780989 781816 783956 786223 788452 791615
58819 791615 796168 801376 806713 812626 819283 825781 831444 836787 842196 846763 849525 850985 852267 853545
58805 853545 854364 854711 854580 853201 849988 845706 841480 837166 831930 825937 820122 814626 808762 802307 795632
58790G95632o864p142o571m633k410j144n51M04J942L691N626P739R397R893R342
58775H14351Q499P997P999P887O269K227l210p800j0457j1801j2394j1941j0625
58762G87001r604r445r384q777q022p322n976l759j688n25K82J288J959J819J480
58747G29327J467J242M83K49J545L624N005N481N924O693P332P411O827N659M470
58732G92739M160M842N516N453N213N599O375O793O740O609O564O593O662O475
58718H76333N716M928N198O589P854Q156Q060Q129P808O429M338K192kk301m272
58703I45155n761p338r306j1195j2837j4889j7489j9509k0048j9718j9479j9144
58691G68442j7973j5977j3701j1448r446q044p090n906m513l936m670n816o333
$$ plain form
58790 795632 788768 781626 775055 770422 768012 766868 766317 766721 768663 772354 777980 785719 795116 805009 814351
58775 814351 822850 830847 838846 846733 853002 855229 852019 844219 833762 821961 809567 797626 787001
58762 787001 777397 767952 758568 749791 741769 734447 728471 724712 723024 722499 722781 724069 726028 727847 729327
58747 729327 730794 732036 732519 732768 734313 737937 742942 748423 754347 761040 768372 775783 782610 788269 792739
58732 792739 796899 801741 807257 812710 817923 823522 829897 836690 843430 850039 856603 863196 869858 876333
58718 876333 882049 886977 892175 898764 906618 914774 922834 930963 938771 945200 949538 951730 951728 949427 945155
58703 945155 939394 932056 922750 911555 898718 883829 866340 846831 826783 807065 787586 768442
58691 768442 750469 734492 720791 709343 699897 691853 684763 678857 674344 670408 665738 659922 653589
58678F53589o147n414l896j849l49J41N20J601L030M317N726P398Q824J0040J2007
58663F89538J4906J7416J8536J8689J8020J5264R746L115k354o124q803j0545
58651G77404j1368j1872j2208j1496r635q334q777r500q437o003m299m036m113
58638F67326l638k635j150P69K461L299L619L991M136L489K269R98k40j226j289
58623F82179m98j16q03j480r84L13J647L222N235O822P412P813Q658R146Q708
58608G37274Q334Q619Q141N672K541P91K74l56j137j496k144l843n299m790l146
58593G49435k656l614m267l649k234k46K423M985O559P802R817J1970J2802J2540
58579H01667J2572J2965J2674J1831J1546J1772J1523J0935J1037J1639J1628
$$ plain form
58678 653589 647442 642028 638132 636283 635934 636075 636595 638196 641226 645543 651269 658667 667491 677531 689538
58663 689538 704444 721860 740396 759085 777105 792369 802115 805230 802876 796752 787949 777404
58651 777404 766036 754164 741956 730460 720825 712491 703714 694214 685777 679774 675475 671439 667326
58638 667326 663688 661053 659903 660672 663133 666432 670051 674042 678178 681667 683936 684934 684694 683468 682179
58623 682179 681681 681565 680762 679282 678298 678611 680258 683480 688715 695537 702949 710762 719420 728566 737274
58608 737274 745608 754227 762368 768040 770581 771372 771646 771290 770153 768657 766513 762670 757371 752581 749435
58593 749435 746779 743165 738898 735249 733015 732769 735192 740177 746736 754538 764355 776325 789127 801667
58579 801667 814239 827204 839878 851709 863255 875027 886550 897485 908522 920161 931789
58568I31789J1206J1857J4118J7214K0666K4481K8011L0476L2323L4377L6001
58557A192519L5914L4303L2111K8828K3104J5315P455P82m619q384j0092j0521
58545A336715j0786j0599r312p983q278j0023j2072j4849j9413k4581k7885k9084
58533A151850l0097l1432l1503k9533k6578k3425j9897j6348j3639j1495r083
58522I08820p038o552o774n698l503k261k364k215j553j976l619m321l037j425
58508H56484j048j402j614j888k322k245j541r24m25O48J990K368J643P93L2j047
58492H49502j678o41J214J823J325J971M400O789Q079R293J1063J2559J3608J5316
58478I34623J7841J9916K1222K2846K4725K5068K2944J9185J4285P865P51m978
$$ plain form
58568 931789 942995 954852 968970 986184 1006850 1031331 1059342 1089818 1122141 1156518 1192519
58557 1192519 1228433 1262736 1294847 1323675 1346779 1362094 1369549 1370331 1365712 1357328 1347236 1336715
58545 1336715 1325929 1315330 1306018 1298035 1289757 1279734 1267662 1252813 1233400 1208819 1180934 1151850
58533 1151850 1121753 1090321 1058818 1029285 1002707 979282 959385 943037 929398 917903 908820
58522 908820 901782 895230 888456 882758 879255 876994 874630 872415 870862 868886 865267 860946 857909 856484
58508 856484 855436 854034 852420 850532 848210 845965 844424 843500 843075 843723 845713 848081 849724 850517 850549 849502
58492 849502 847824 847183 848397 850220 851545 853516 857916 864705 872784 882077 893140 905699 919307 934623
58478 934623 952464 972380 993602 1016448 1041173 1066241 1089185 1108370 1122655 1130520 1131271 1126293
58466A126293q703j1641j4125j5012j4228j3170j1993r222m762n22K637N859R492
58453A040903J2127J3296J4361J5784J6104J4473J1641P749J993m824j0272j3668
58441A119667j6557j9175j9643j7629j5477j4394j2718r433o160m104k056Q04
58429I83125L035L696M237N880P660Q728J0076J2181J3458J2708J0833Q686N637
58416A089940J623j828m063o341r142j1027j1468j2015j3309j3667j2193j0530
58404I85980r970r542q424p530p193o053l803k251k160j840l35Q93J003J429K838
58389I33042L491K417J297J415J675J289J408K446K822K108K189L738M788M572
58375I68697N236P816J0076J0435J0561J1855J2850J2435J2183J3172J3912J3690
$$ plain form
58466 1126293 1117590 1105949 1091824 1076812 1062584 1049414 1037421 1028199 1023437 1022915 1025552 1031411 1040903
58453 1040903 1053030 1066326 1080687 1096471 1112575 1127048 1138689 1146438 1148431 1143607 1133335 1119667
58441 1119667 1103110 1083935 1064292 1046663 1031186 1016792 1004074 994641 988481 984377 982321 983125
58429 983125 986160 989856 994093 999973 1007633 1016361 1026437 1038618 1052076 1064784 1075617 1084303 1089940
58416 1089940 1091563 1089735 1085672 1079331 1070189 1059162 1047694 1035679 1022370 1008703 996510 985980
58404 985980 976010 966468 958044 950514 943321 937268 933465 931214 929054 927214 926879 927772 928775 930204 933042
58389 933042 936533 938950 940247 941662 943337 944626 946034 948480 951302 953410 955599 959337 964125 968697
58375 968697 973933 981749 991825 1002260 1012821 1024676 1037526 1049961 1062144 1075316 1089228 1102918
58363A102918J4346J6442J7434J6236J5697J7785K0019J9632J7668J5998J3785
58352A287960J0112O621M509K246r12k665j786o86r60l74K552N114N141N045P324
58337A329241J0006J0600J0792J2988J5727J6775J7390J9390K1271K1257K0865
58326A506302K1409K0524J6310J1451Q947P272M075J073P00J409R21P54K855N140
58312A609142N136M756O725R515J0571J1173J3425J5738J6089J6294J8293J9805
58300A756662J8633J7489J9392K2006K1849K0479K1072K2524K2445K2345K4283
58289A989179K6095K5463K4983K7491L0377L0277K9361L0894L2841L2091L0846
58278B309898L2285L4168L3294L2104L4137L7248L8223L9453M3971M8614M9630
$$ plain form
58363 1102918 1117264 1133706 1151140 1167376 1183073 1200858 1220877 1240509 1258177 1274175 1287960
58352 1287960 1298072 1304693 1309202 1311448 1310536 1307871 1306085 1305399 1304439 1304065 1306617 1311731 1316872 1321917 1329241
58337 1329241 1339247 1349847 1360639 1373627 1389354 1406129 1423519 1442909 1464180 1485437 1506302
58326 1506302 1527711 1548235 1564545 1575996 1584943 1592215 1596290 1597363 1598063 1599472 1600393 1601147 1604002 1609142
58312 1609142 1614278 1619034 1625759 1635274 1645845 1657018 1670443 1686181 1702270 1718564 1736857 1756662
58300 1756662 1775295 1792784 1812176 1834182 1856031 1876510 1897582 1920106 1942551 1964896 1989179
58289 1989179 2015274 2040737 2065720 2093211 2123588 2153865 2183226 2214120 2246961 2279052 2309898
58278 2309898 2342183 2376351 2409645 2441749 2475886 2513134 2551357 2590810 2634781 2683395 2733025
58267B733025N0251N4825O0374O2195O2913O7267P2745P4480P4737P8205Q2334
58256C473351Q2032P9543Q0016Q1557P9629P6961P8930Q3391Q5300Q6988R3430
58245D381128J01905J07078J11535J20282J29899J34619J38006J46730J58108
58236E529290J66091J73799J87192K02273K12242K21184K36572K54573K67739
58227G450955K80527L01305L25947L46093L66490L96446M31577M62854M95980
58218A0858174N41742N95245O46021P00317P70692Q52586R35889J030323J152831
58209A8083820J299676J460021J647239J886014K179533K523024K937066L449636
58201C5466029M058113M750289N547969O484285P557529Q762183J0142995J1752153
$$ plain form
58267 2733025 2783276 2838101 2898475 2960670 3023583 3090850 3163595 3238075 3312812 3391017 3473351
58256 3473351 3555383 3634926 3714942 3796499 3876128 3953089 4032019 4115410 4200710 4287698 4381128
58245 4381128 4483033 4590111 4701646 4821928 4951827 5086446 5224452 5371182 5529290
58236 5529290 5695381 5869180 6056372 6258645 6470887 6692071 6928643 7183216 7450955
58227 7450955 7731482 8032787 8358734 8704827 9071317 9467763 9899340 10362194 10858174
58218 10858174 11399916 11995161 12641182 13341499 14112191 14964777 15900666 16930989 18083820
58209 18083820 19383496 20843517 22490756 24376770 26556303 29079327 32016393 35466029
58201 35466029 39524142 44274431 49822400 56306685 63864214 72626397 82769392 94521545
58193I4521545J3577546J5593045J7856965K0484777K3590182K7353623L1916148
58186B44893831L6686663L9591517L7593142K8778019J4259512k160098j6382546
58179C83260040k6184571l1487882l3262861l2559190l0225227k6904286k3033609
58172A79602414j8978380j5240767j2405903j0790346j0205517j0122827j0042020
58165I1816654r712055r115924q351565p524988o696538n888884n123316m427718
58157C4975666l814348l276298k809681k418251k094487j818367j579033j379078
58149A5786123j215669j076441r56056q58413p80295p10186o45191n92325n51158
58140H400389n11317m69090m30862l98221l64739l29568k99654k76051k51694
$$ plain form
58193 94521545 108099091 123692136 141549101 162033878 185624060 212977683 244893831
58186 244893831 281580494 321172011 358765153 387543172 401802684 399642586 383260040
58179 383260040 357075469 325587587 292324726 259765536 229540309 202636023 179602414
58172 179602414 160624034 145383267 132977364 122187018 111981501 101858674 91816654
58165 91816654 82104599 72988675 64637110 57112122 50415584 44526700 39403384 34975666
58157 34975666 31161318 27885020 25075339 22657088 20562601 18744234 17165201 15786123
58149 15786123 14570454 13494013 12537957 11679544 10899249 10189063 9543872 8951547 8400389
58140 8400389 7889072 7419982 6989120 6590899 6226160 5896592 5596938 5320887 5069193
58131E069193k25083k03345j89528j78849j69236j63751j61089j55174j45802
58122C477336j38741j34256j26474j14986j06010j01022r5019q7106q2020p9907
58112B411795p5299o7622o2378o0447n6558m9990m6514m7579m7462m3569m0265
58101A814112m0053l9802l8163l8119l9807l9018l5124l2704l3221l2724k9751
58090A415626k7762k7849k6566k3066k0968k1210k0269j7304j5956j7224j7645
58079A179807j6297j6524j8872j9486j7422j6469j7708j7355j4258j2454j3742
58068I99220j4574j2930j1750j2702j2947j0986r666j0414j0240p465m989n014
58056H75543n669n527o395q976j0682j0225r751j0264r692p530o434p139o774
$$ plain form
58131 5069193 4844110 4640765 4451237 4272388 4103152 3939401 3778312 3623138 3477336
58122 3477336 3338595 3204339 3077865 2962879 2856869 2755847 2660828 2573722 2491702 2411795
58112 2411795 2336496 2268874 2206496 2146049 2089491 2039501 1992987 1945408 1897946 1854377 1814112
58101 1814112 1774059 1734257 1696094 1657975 1618168 1579150 1544026 1511322 1478101 1445377 1415626
58090 1415626 1387864 1360015 1333449 1310383 1289415 1268205 1247936 1230632 1214676 1197452 1179807
58079 1179807 1163510 1146986 1128114 1108628 1091206 1074737 1057029 1039674 1025416 1012962 999220
58068 999220 984646 971716 959966 947264 934317 923331 913665 903251 893011 885546 880557 875543
58056 875543 869874 864347 857952 848976 838294 828069 818318 808054 798362 790832 784398 777259 770485
58043G70485m336k796l613m199l106k771m558n954n286m625n429n832m772m472
58029G08736o223p906q038q185r159r065p316o356p189p476o212n791p123p300
58015F05397m761k323k294k847k067j408k159k507j229m32j618k597j428J01n
58000E77823m16N57J690J598J601K911L995L543L126M088M807L820K679K898K970
57985F17690J315o34j187j430k688l637k880j846k236k942k426j766k477l539
57971E89317l359k666k706k651j397L3L93N43J476K003R13m70l69N91R19Q16J019
57954E84405Q35m20j665j784j558k001k531k452k374k592k065o00J94k13J44K400
57938E67723M683N220N175O212P604Q091Q309R031R196P926O475N935N150L047
$$ plain form
58043 770485 766149 763353 759740 755541 752435 749664 745106 739152 733866 729241 723812 717980 713208 708736
58029 708736 702513 694607 686569 678384 669225 660160 652844 646488 639299 631823 625611 619820 612697 605397
58015 605397 600636 598313 596019 593172 591105 589697 587538 585031 583802 583370 581752 579155 577727 577828 577823
58000 577823 577407 577964 579654 581252 582853 585764 589759 593302 596428 600516 605323 609143 611822 614720 617690
57985 617690 619005 618371 617184 615754 613066 609429 606549 604703 602467 599525 597099 595333 592856 589317
57971 589317 585958 583292 580586 577935 576538 576571 576964 577507 578983 580986 581899 581429 581060 581651 582570 583386 584405
57954 584405 585240 584820 583155 581371 579813 577812 575281 572829 570455 567863 565798 565198 565392 565179 565323 567723
57938 567723 572406 577626 582801 589013 596617 604708 613017 622048 631244 639170 645645 651580 656730 659777
57924F59777Q26l78j668l891n371m726l626m164n510n909n828o411o705n369l380
57909E97667k295j487K73K126K715K741L366L726K757J700K078K762J966N30L84
57894F21009J162J326J284K353L838M042L250K890K766J840P17N81O86l51j771
57879F45622j941j455k103l512l797k907k578l221l549l075k614k447k099j671
57865F08653j492j018J89J183J141J062J987K854K441K066L656O214P218O732
57851F42886P052Q607R371Q349O844N952N247M360L710L292K457J200K06m01j018
57836G08114j634k190l260m891n691m707l247l022l414k776j488j279k160k479
57822F65876j731j013q31o05k54k75m11l4L65j05q94o79M86J515K291L402M270
$$ plain form
57924 659777 660603 660225 658557 654666 649295 644569 640943 636779 631269 625360 619532 613121 606416 601047 597667
57909 597667 595372 593885 594158 596284 598999 601740 605106 608832 611589 613289 615367 618129 620095 620625 621009
57894 621009 622171 623497 624781 627134 630972 635014 638264 641154 643920 645760 646477 647058 647744 647393 645622
57879 645622 643681 642226 640123 636611 632814 629907 627329 624108 620559 617484 614870 612423 610324 608653
57865 608653 607161 606143 606332 607515 608656 609718 611705 614559 617000 619066 622722 628936 636154 642886
57851 642886 649938 658545 667916 676265 683109 689061 694308 698668 702378 705670 708127 709327 709533 709132 708114
57836 708114 706480 704290 701030 696139 690448 685741 682494 679472 676058 673282 671794 670515 668355 665876
57822 665876 664145 663132 662301 661696 661442 661167 660756 660722 661087 660982 660088 659409 659895 661410 663701 667103 671373
57805F71373L569J310j295l735o215q193q723q008o973n826m508l819m230m443
57791F10284l115j202m70m87N24K514L830M197M929O309P163P020O588O156N574
57776F59814N559O902Q633R095Q534Q462Q823Q148O312M666L583K295J074R65
57762G42865J403O20j309k415k099j938k748l390l142k927l333l474k698j630
57748G13785q34n0P32J042J089J575K140J750P47O18J537K116J839J749K332K736
57732G34903K521K385K671K924L208M072M989M786L826L718M654N105M555M293
57718G88610M925N355M880M199L638K469P67o3M23Q16J19q86j368j713k205k280
57702H07686j949k202l052l030j506J87R52J463K457L189K825J873J078K39q45
$$ plain form
57805 671373 674942 676252 674957 671222 665007 656814 648091 640083 633110 627284 622776 618957 614727 610284
57791 610284 607169 605967 605497 605010 605534 608048 611878 616075 621004 627313 634476 641496 648084 654240 659814
57776 659814 665373 672275 680908 690003 698537 706999 715822 723970 730282 734948 738531 740826 741900 742865
57762 742865 744268 744888 743579 741164 739065 737127 734379 730989 727847 724920 721587 718113 715415 713785
57748 713785 712951 712901 713633 714675 715764 717339 719479 721229 721976 722594 724131 726247 728086 729835 732167 734903
57732 734903 737424 739809 742480 745404 748612 752684 757673 762459 766285 770003 774657 779762 784317 788610
57718 788610 793535 798890 803770 807969 811607 814076 814843 814780 815203 816019 816138 815252 813884 812171 809966 807686
57702 807686 805737 803535 800483 797453 795947 796134 797086 798549 801006 804195 807020 808893 809971 810210 809365
57687H09365j572j666j821k309k203r79N17J518K527M177O167Q190J0656J3668
57673H46235J6518J9085K2431K7127L2268L7018M1927M7702N3508N7183N6110
57662A257112M7744L1041Q522j4204l2073m3223m8253m8580m6097m2668l8813
57651A030508l3882k8019k2628j8400j4527j0617p633o137n158l846k638j903
57639H75120r48M98J399J170Q65J457K330K645K781L190L294K778K566L127L259
57624I05531K049P08P82J732K040J717J855K466K572K035J715K012K511K832K819
57609I35376K290J498J362K322L541M043M010M113M318M234L957L688L218K597
57595I80567K505L086L354K629J706J513J647J341R84J328J966J978J542J654
$$ plain form
57687 809365 807793 806127 804306 801997 799794 798815 799332 800850 803377 807554 813721 821911 832567 846235
57673 846235 862753 881838 904269 931396 963664 1000682 1042609 1090311 1143819 1201002 1257112
57662 1257112 1304856 1335897 1344419 1330215 1298142 1254919 1206666 1158086 1111989 1069321 1030508
57651 1030508 996626 968607 945979 927579 913052 902435 894802 888665 883507 879661 877023 875120
57639 875120 874172 874670 876069 877239 878104 879561 881891 884536 887317 890507 893801 896579 899145 902272 905531
57624 905531 907580 908288 909070 910802 912842 914559 916414 918880 921452 923487 925202 927214 929725 932557 935376
57609 935376 937666 939164 940526 942848 946389 950432 954442 958555 962873 967107 971064 974752 977970 980567
57595 980567 983072 986158 989512 992141 993847 995360 997007 998348 999332 1000660 1002626 1004604 1006146 1007800
57581A007800K560L565M123M187L814L271L134L520L768L468L159L285L324K791
57567A055769K284K508L076L280L391M004M787N029M952N259N810N828N166M390
57553A115533L896L798M313N411O449O955P316P979Q500Q298P752P605P695P317
57539A208817O538O091O220O470O507O393O173N875N753N990O296O314O140O105
57525A295682O289O593O852O722O010N293N482O516P345P529P791Q549R074Q837
57511A394564Q537Q798Q953Q215P223P206Q190R219R824J0181J0194R508Q291
57498A508903P209O672O620O802O841O424N783N550N898O460P218Q483R709R627
57484A608199Q146O948P318Q523R192R224R280R401R338R423R951J0377J0129
$$ plain form
57581 1007800 1010360 1013925 1018048 1022235 1026049 1029320 1032454 1035974 1039742 1043210 1046369 1049654 1052978 1055769
57567 1055769 1058053 1060561 1063637 1066917 1070308 1074312 1079099 1084128 1089080 1094339 1100149 1105977 1111143 1115533
57553 1115533 1119429 1123227 1127540 1132951 1139400 1146355 1153671 1161650 1170150 1178448 1186200 1193805 1201500 1208817
57539 1208817 1215355 1221446 1227666 1234136 1240643 1247036 1253209 1259084 1264837 1270827 1277123 1283437 1289577 1295682
57525 1295682 1301971 1308564 1315416 1322138 1328148 1333441 1338923 1345439 1352784 1360313 1368104 1376653 1385727 1394564
57511 1394564 1403101 1411899 1420852 1429067 1436290 1443496 1451686 1460905 1470729 1480910 1491104 1500612 1508903
57498 1508903 1516112 1522784 1529404 1536206 1543047 1549471 1555254 1560804 1566702 1573162 1580380 1588863 1598572 1608199
57484 1608199 1616345 1623293 1630611 1639134 1648326 1657550 1666830 1676231 1685569 1694992 1704943 1715320 1725449
57471A725449R602R393R307R044R078R841J0719J0894J0549J0353J0372J0433
57459A845034J0691J1052J0863J0130J0014J1123J2363J2624J2454J2743J2946
57448A972037J2268J1572J2155J3312J3170J1661J0687J1335J2646J3365J3393
57437B107601J3191J3038J3204J3894J4691J4882J4443J4064J4156J4505J4808
57426B262477J5009J5144J5333J5681J5906J5540J4791J4495J4850J5107J4959
57415B429292J5078J5611J5529J4492J3966J5150J6941J7570J7212J7311J8105
57404B606257J8623J8548J8362J8066J7393J6962J7591J8685J8859J7981J7232
57393B804559J7329J7985J8890J9883K0478K0523K0937K2479K4205K4605K3844
$$ plain form
57471 1725449 1735051 1744444 1753751 1762795 1771873 1781714 1792433 1803327 1813876 1824229 1834601 1845034
57459 1845034 1855725 1866777 1877640 1887770 1897784 1908907 1921270 1933894 1946348 1959091 1972037
57448 1972037 1984305 1995877 2008032 2021344 2034514 2046175 2056862 2068197 2080843 2094208 2107601
57437 2107601 2120792 2133830 2147034 2160928 2175619 2190501 2204944 2219008 2233164 2247669 2262477
57426 2262477 2277486 2292630 2307963 2323644 2339550 2355090 2369881 2384376 2399226 2414333 2429292
57415 2429292 2444370 2459981 2475510 2490002 2503968 2519118 2536059 2553629 2570841 2588152 2606257
57404 2606257 2624880 2643428 2661790 2679856 2697249 2714211 2731802 2750487 2769346 2787327 2804559
57393 2804559 2821888 2839873 2858763 2878646 2899124 2919647 2940584 2963063 2987268 3011873 3035717
57382C035717K3326K3426K3360K3060K3319K4099K4348K3667K2727K1940K1123
57371C290112K0527K0698K1226K1139K0570K0659K1680K2769K3560K4539K5535
57360C533014K5577K4672K4292K5397K7166K8330K8675K8693K8688K8675K8531
57349C831710K7971K7010K6398K6800K7716K8170K8194K8511K8958K8696K7919
57338D138053K7795K8573K9186K9102K9117K9839L0657L0889L0846L1135L1840
57327D467032L2816L3996L4965L5169L4908L5203L6307L7263L7387L7257L7641
57316D859944L8195L7975L6785L5457L4964L5497L6282L6358L5755L5617L6761
57305E259590L8527L9716M0148M0469M0866M0991M0958M1277M1834M1890M1115
$$ plain form
57382 3035717 3059043 3082469 3105829 3128889 3152208 3176307 3200655 3224322 3247049 3268989 3290112
57371 3290112 3310639 3331337 3352563 3373702 3394272 3414931 3436611 3459380 3482940 3507479 3533014
57360 3533014 3558591 3583263 3607555 3632952 3660118 3688448 3717123 3745816 3774504 3803179 3831710
57349 3831710 3859681 3886691 3913089 3939889 3967605 3995775 4023969 4052480 4081438 4110134 4138053
57338 4138053 4165848 4194421 4223607 4252709 4281826 4311665 4342322 4373211 4404057 4435192 4467032
57327 4467032 4499848 4533844 4568809 4603978 4638886 4674089 4710396 4747659 4785046 4822303 4859944
57316 4859944 4898139 4936114 4972899 5008356 5043320 5078817 5115099 5151457 5187212 5222829 5259590
57305 5259590 5298117 5337833 5377981 5418450 5459316 5500307 5541265 5582542 5624376 5666266 5707381
57294E707381L9879L8633L7760L7757L8614L9396L9359L9171L9887M1184M1845
57283F140866M1775M2013M2861M3454M3341M3070M3014M2862M2548M2542M2850
57272F611196M2855M2324M1620M0748L9349L7825L7207L7608L7907L7419L6824
57261G042882L6950L7595L8120L8453L8972L9849M0934M1953M2694M3302M4252
57250G485956M5582M6575M6717M6519M6607M6529M5418M3414M1360L9504L7728
57239G971909L6629L6983L8296L9343M0106M1796M4843M8267N1217N3899N6591
57228H459879N8912O0488O1409O1716O1207N9955N8350N6495N4283N1925M9705
57217I094324M7431M4926M2852M2067M2437M3136M3864M4848M5945M6795M7501
$$ plain form
57294 5707381 5747260 5785893 5823653 5861410 5900024 5939420 5978779 6017950 6057837 6099021 6140866
57283 6140866 6182641 6224654 6267515 6310969 6354310 6397380 6440394 6483256 6525804 6568346 6611196
57272 6611196 6654051 6696375 6737995 6778743 6818092 6855917 6893124 6930732 6968639 7006058 7042882
57261 7042882 7079832 7117427 7155547 7194000 7232972 7272821 7313755 7355708 7398402 7441704 7485956
57250 7485956 7531538 7578113 7624830 7671349 7717956 7764485 7809903 7853317 7894677 7934181 7971909
57239 7971909 8008538 8045521 8083817 8123160 8163266 8205062 8249905 8298172 8349389 8403288 8459879
57228 8459879 8518791 8579279 8640688 8702404 8763611 8823566 8881916 8938411 8992694 9044619 9094324
57217 9094324 9141755 9186681 9229533 9271600 9314037 9357173 9401037 9445885 9491830 9538625 9586126
57206I586126M8251M8588M8126M7394M6961M6312M4845M3249M2446M1850M0365
57195A0084513L8535L7822L8085L7800L6633L5844L5965L5991L5279L4543L4552
57184A0485562L5081L5536L5388L3957L0944K7311K4415K2282J9918J7132J4718
57173A0782244J2905J1061Q856O499L928R43k078m758p613j1132j4507j6685j8121
57160A0751542j9914k1851k3026k3763k5064k6654k7465k7668k8325k9315k9519
57149A0468978k8691k7378k5318k1833j7408j3074q722l978j96M09k866r498j9558
57136A0290867l3101m8554o3916p8744r2835j03883j09059j07961j01689r0135
57126I460990p2977n2313l1389j1744N733J8554K4973K7367K9646L2458L4507
$$ plain form
57206 9586126 9634377 9682965 9731091 9778485 9825446 9871758 9916603 9959852 10002298 10044148 10084513
57195 10084513 10123048 10160870 10198955 10236755 10273388 10309232 10345197 10381188 10416467 10451010 10485562
57184 10485562 10520643 10556179 10591567 10625524 10656468 10683779 10708194 10730476 10750394 10767526 10782244
57173 10782244 10795149 10806210 10815066 10821565 10825493 10826436 10824358 10819600 10811987 10800855 10786348 10769663 10751542
57160 10751542 10731628 10709777 10686751 10662988 10637924 10611270 10583805 10556137 10527812 10498497 10468978
57149 10468978 10440287 10412909 10387591 10365758 10348350 10335276 10326554 10322576 10322380 10322789 10319923 10310425 10290867
57136 10290867 10257766 10209212 10145296 10066552 9973717 9869834 9760775 9652814 9551125 9460990
57126 9460990 9388013 9335700 9304311 9292567 9298300 9316854 9341827 9369194 9398840 9431298 9465805
57115I465805L7095M3117N2603O3777P7734R7730J24635J57439J97416K47187
57105A0564538L06763L75381M56306N54794O72066Q05749R54361J116527J289175
57096A7095660J473945J683325J932890K229124K571262K960334L396198L870037
57088C7212775M371663M899318N447410N989662O490441O915909P187571P115999
57080H5630748O441618N013439K947339N93544j653587l520164m888003n754015
57072H4810919o191991o319991o255577o081237n843441n566636n257604m909014
57064C8385428m515406m086663l642644l201408k778491k390313k049220j757503
57056A3963780j511431j307822j142471j006608q90771p90049p02163o23723n52202
$$ plain form
57115 9465805 9502900 9546017 9598620 9662397 9740131 9837861 9962496 10119935 10317351 10564538
57105 10564538 10871301 11246682 11702988 12257782 12929848 13735597 14689958 15806485 17095660
57096 17095660 18569605 20252930 22185820 24414944 26986206 29946540 33342738 37212775
57088 37212775 41584438 46483756 51931166 57920828 64411269 71327178 78514749 85630748
57080 85630748 92072366 97085805 100033144 100626688 98973101 95452937 90564934 84810919
57072 84810919 78618928 72298937 66043360 59962123 54118682 48552046 43294442 38385428
57064 38385428 33870022 29783359 26140715 22939307 20160816 17770503 15721283 13963780
57056 13963780 12452349 11144527 10002056 8995448 8104677 7314628 6612465 5988742 5436540
57047E436540m88392m33189l84553l40639l02718k71825k45573k21405k00039
57038B548207j82628j67447j52568j39109j28604j19675j10345j01363r4151q7669
57028A264648q0177p2194o4910n7464m8490l8686k9318j9767q783L179J4946K6337
57016H89321L6772M3379M2338L1338J0291j8195m7958p1437q4848q9944q9867
57005F51190q5693p8134o9546o1832n4462m6703l9861l5316l2126k8661k4967
56994I3889k1704j8398j4583j1113q655o302l266l03J990M624Q390J2224J4728
56981E1521J5554J4138R282J723n052q542r996j1593j2887j2269j0133q205F678
56967A322b334k126k26b078C617Q169J0339J2750J4983J6781J8985K1809K3367
$$ plain form
57047 5436540 4948148 4514959 4130406 3789767 3487049 3215224 2969651 2748246 2548207
57038 2548207 2365579 2198132 2045564 1906455 1777851 1658176 1547831 1446468 1352317 1264648
57028 1264648 1184471 1112277 1047367 989903 941413 902727 873409 853642 844859 848038 862984 889321
57016 889321 926093 969472 1011810 1043148 1053439 1035244 987286 915849 831001 741057 651190
57005 651190 565497 487363 417817 355985 301523 254820 214959 179643 147517 118856 93889
56994 93889 72185 53787 39204 28091 19436 13134 9868 9565 11555 16179 24569 36793 51521
56981 51521 67075 81213 90495 92218 87166 78624 68628 57035 44148 31879 21746 13541 6678
56967 1322 -2334 -4460 -4686 -2078 3617 11786 22125 34875 49858 66639 85624 107433 130800
56954A30800K1440J5876Q033q72r533j6052j9262j9818j8912j6912j4123j1458
56942D9207r203o449k855M36K714M984Q147J1479J4270J7435K2027K7373L1853
56929A71418L4126L2571K5326J2667j945j4543k3472k8746l0509k9529k7539k5532
56917I4293k2920j9500j6543j4785G476c028q168p067o229m497k644j875j723
56904c5231j177m84j04O79K349L832M244M563N849P318b03H395J0456J2986J5013
56889D6850J6814J9228K1944K4361K6758K8734K7920K2406J3451M048m089j0493
56877B37932j4491j5838j5608j4587j1962p349k597N94L269P227J1870J5573J8923
56864B12956K3797L0055L5958M1349M7703N4969O0312O0060N1648L4702J2260
$$ plain form
56954 130800 152240 168116 176149 175277 165744 149692 130430 110612 91700 74788 60665 49207
56942 49207 40004 33555 30700 31136 33850 38834 46981 58460 72730 90165 112192 139565 171418
56929 171418 205544 238115 263441 276108 274163 259620 236148 207402 176893 147364 119825 94293
56917 94293 71373 51873 35330 20545 7476 -3028 -11196 -18263 -24492 -28989 -31633 -33508 -35231
56904 -35231 -36408 -36892 -36996 -36317 -33968 -30136 -25892 -21329 -15480 -8162 -203 8395 18851 31837 46850
56889 46850 63664 82892 104836 129197 155955 184689 212609 235015 248466 252514 248425 237932
56877 237932 223441 207603 191995 177408 165446 158097 155500 156094 159363 166590 178460 194033 212956
56864 212956 236753 266808 302766 344115 391818 446787 507099 567159 618807 653509 665769
56853F65769r666k5920l5525m0253m1168l8454l3195k6897j9791j1622l303M161
56841C84136J1484J9752K8186L5561M2784N1703O2171P2730Q3050R2311R5633
56830I79501Q6005O1065K6018j0600m2096o4887p7867q2250q0615p4969o6334
56819F52971n5977m5548l5731k6010j6042o212L130J1932K0119K7878L6036M5069
56807F11615N4172O1728O5579O2191M7668K2077q204l4663n2879o3363o7851o7475
56795F30595o3747n8377n1753m3551l4698k6798j9861j2693n309J058O189J1080
56783C32135J6097K0883K5811L1246L5191L3984K5821J2265l628j8909l0838l7785
56771D42273m0523m1052m0040l7063l2978k9761k7782k5399k1757j8083j5589
$$ plain form
56853 665769 656103 630183 594658 554405 513237 474783 441588 414691 394900 383278 379975 384136
56841 384136 395620 415372 443558 479119 521903 573606 635777 708507 791557 883868 979501
56830 979501 1065506 1126571 1152589 1141989 1099893 1035006 957139 874889 794274 719305 652971
56819 652971 596994 551446 515715 489705 473663 467451 470581 482513 502632 530510 566546 611615
56807 611615 665787 727515 793094 855285 902953 925030 916826 882163 829284 765921 698070 630595
56795 630595 566848 508471 456718 413167 378469 351671 331810 319117 313808 314866 321055 332135
56783 332135 348232 369115 394926 426172 461363 495347 521168 533433 529805 510896 480058 442273
56771 442273 401750 360698 320658 283595 250617 220856 193074 167675 145918 127835 112246
56760A12246j3903j2257j0705r447q189o814n650m752l809k923k543k594k591
56747B6069k370j915r63J87K68j206k595k129m79L95K32K67N93J24j024j395o06
56730A3453J07L1j65RK19L79Q19J238J014N66Q63J697J979J650J675K238K584
56713C0356K491K255J573J21j032n80P76J191O20P32J956K801K363J457R45P25
56697D8750O73Q99R05R4r08j043p08j008j526r01N78J232Q28Q01J604K122J993
56680E4385K176K856L020K489K217K264J590K61l28J11K77l03n43R7P76J099J666
56663G4110K328K015P73j4J41L86N80J464K498K001J33q18J16J251J165O24N99
56646H9352O70M53M76N81k99j843k095n98M45m92j984k131j257o21k98J2k25j202
$$ plain form
56760 112246 98343 86086 75381 65934 57745 50931 45281 40529 36720 33797 31254 28660 26069
56747 26069 23699 21784 20821 21008 21276 20070 17475 15346 14867 15262 15494 15761 16354 16478 15454 14059 13453
56730 13453 13560 13591 13426 13435 13654 14033 14852 16090 17104 17670 18533 20230 22209 23859 25534 27772 30356
56713 30356 32847 35102 36675 36796 35764 35184 35960 37151 37771 38503 40459 43260 45623 47080 48025 48750
56697 48750 49423 50322 51227 51321 50413 49370 48662 47654 46128 45227 45805 47037 47865 48666 50270 52392 54385
56680 54385 56561 59417 62437 64926 67143 69407 70997 71258 70930 71041 71318 71015 70472 70569 71345 72444 74110
56663 74110 76438 78453 79226 79212 79353 79739 80319 81783 84281 86282 86415 85597 85713 86964 88129 88753 89352
56646 89352 90022 90475 90951 91532 91233 89390 87295 86697 87142 86650 84666 82535 81278 80657 80359 80371 80146 78944
56628G8944j764j056P1N07M74N56M70j28p80j099j381j621j262m62j83m77l18
56611G0491M10N64n7j85N32P30j77q44m42r2o21r36j31P74O80L52Q96J843K250
56592G6037K291K363J991R84L69Q54J594J664J413J299Q72N9n8R53J745J179J37
56575I5746QP06J441K215L176L632K999J865J110Q66J152K265L808M588M406M736
56559A34719O707R576J1875J2882J2308J0013O656L419O02k123m059l993k598
56546A95984k094l002l548k918k507l095l439k923k894l929m298k924j425j413
56532A55575j946j620j012j021q01M61J547J128J23P1N82M79ln6m6n78j067r30
56514A50886q72j495j982j667j398j812j948j078k54l81n02K40P43o7j145j154
$$ plain form
56628 78944 77180 76124 76195 76702 77176 77732 78202 78074 77294 76195 74814 73193 71931 71469 71286 70809 70491
56611 70491 70901 71465 71408 71223 71755 72485 72308 71464 71022 70930 70309 69373 69242 70016 70696 71048 71944 73787 76037
56592 76037 78328 80691 82682 83666 84035 84889 86483 88147 89560 90859 91731 91790 91732 92685 94430 95609 95746
56575 95746 95754 96460 97901 100116 103292 106924 109923 111788 112898 113764 114916 117181 120989 125577 129983 134719
56559 134719 141426 151002 162877 175759 188067 198080 204736 208155 208757 206634 202575 198582 195984
56546 195984 193890 190888 187340 184422 181915 178820 175381 172458 169564 165635 161337 158413 156988 155575
56532 155575 153629 152009 150997 149976 149175 149636 151183 152311 152434 152505 153087 153566 153563 153507 153461 152883 151816 150886
56514 150886 150014 148519 146537 144870 143472 141660 139712 138634 138380 137999 137497 137737 138480 138413 137268 136114
56498A36114o79p20o30L27J038L00r42j156o10k68J78J146J611P75j81j5M60J77
56480A36925l2P46J283K70j022o91O02R87N77O72J037O18m1L27J217J223M96J22
56462A45316r1r16j726j454n87j17M26J693K558J774M40L53R93P48M2N11J911
56445A51874K584K331K265K392J872J100J092J292M15j045j464q10l89m07k4N62
56429A63640L60m02n36Q7O42R36J245J213N62J14M47O93K15J50J367K441J841
56412A75015O14M45O71r6r26j95J062O57q72j079L60J627K144K834L453K740J128
56395A89582M34R29J240R28P39O52J78O1J215K489K046M45k33L21Q10J075J870
56378B04781K532J745J56n40n28j078j556l58J750K468J767J678K531K630J645
$$ plain form
56498 136114 135435 134715 134085 134412 135450 135750 134808 133652 133042 132774 132952 134098 135709 136484 136303 136288 136748 136925
56480 136925 136893 137639 138922 139192 138170 137479 138081 139068 139645 140317 141354 141972 141931 142258 143475 144698 145194 145316
56462 145316 145225 144309 142583 141129 140542 140425 140851 142544 145102 146876 147316 147669 148662 149410 149452 149963 151874
56445 151874 154458 156789 159054 161446 163318 164418 165510 166802 167217 166172 164708 163898 163509 163102 163078 163640
56429 163640 164000 163598 163062 163149 163791 164727 165972 167185 167747 167861 168308 169001 169216 169366 170733 173174 175015
56412 175015 175629 176074 176745 176649 175723 175528 176590 177247 176375 175296 175656 177283 179427 182261 185714 188454 189582
56395 189582 190016 190945 192185 193113 193852 194504 194682 194743 195958 198447 200493 200938 200705 201026 201836 202911 204781
56378 204781 207313 209058 209214 208674 208146 207068 205512 205154 206904 209372 211139 212817 215348 217978 219623
56363B19623J094J388J384J079J677K899L028J911J125J093P01j38k76K76L29
56348B37193j11O7P66R52R20J617K245J414J36O24K490L367K911K855L416L188
56332B64050K488L141M778M960L309K092K303K575K352K759L722L635K442J941
56318C06547K447K359J470J423K409K666J872J732K544K587J567J400K690L713
56304C37426L726M083N195N635N199N678P489Q675Q257P620P527O806N041L732
56290D22089L612L592L278L830N384O337O126O102O937P722Q255R451J0998J1382
56276E15095J0786J1070J2471J3340J3507J4743J7340J9431K0278K1204K2732
56265F91997K4008K5340K8115L1821L4589L6896M1082M7000N2046N5866O0963
$$ plain form
56363 219623 220717 222105 223489 224568 226245 229144 232172 234083 235208 236301 237002 236864 236588 236864 237193
56348 237193 237082 237149 237915 238867 239787 241404 243649 245063 245199 245823 248313 251680 254591 257446 260862 264050
56332 264050 266538 269679 274457 279417 282726 284818 287121 289696 292048 294807 298529 302164 304606 306547
56318 306547 308994 311353 312823 314246 316655 319321 321193 322925 325469 328056 329623 331023 333713 337426
56304 337426 341152 345235 350430 356065 361264 366942 374431 383106 391363 398983 406510 413316 418357 422089
56290 422089 425701 429293 432571 436401 441785 448122 454248 460350 467287 475009 483264 492715 503713 515095
56276 515095 525881 536951 549422 562762 576269 591012 608352 627783 648061 669265 691997
56265 691997 716005 741345 769460 801281 835870 872766 913848 960848 1012894 1068760 1129723
56254A129723O8144P5648Q3315R3162J04889J15498J24465J34703J46983J58120
56244B234650J66273J73339J80188J84143J83479J80023J74860J65609J50461
56235C793025J31100J09095Q3319N3423K2267p658l6732o4907q9612j09361j25954
56224C758005j40690j51868j58330j61931j64008j63018j58171j51920j46273
56215B361796j39919j31578j22840j15189j07522r9104r1679q6196q0754p4155
56205A312860o8138o3742n8972n2586m6680m2906l9625l5413l1814k9919k7795
56194H15270k4122k0948j9868j8906j6085j2873j1210j0301r059q491q945q381
56182F46081o052m492n214o003n101m232m665m294j754M09O7p87M3J103P44O34
$$ plain form
56254 1129723 1197867 1273515 1356830 1449992 1554881 1670379 1794844 1929547 2076530 2234650
56244 2234650 2400923 2574262 2754450 2938593 3122072 3302095 3476955 3642564 3793025
56235 3793025 3924125 4033220 4116539 4169962 4192229 4184571 4147839 4082932 3993320 3883959 3758005
56224 3758005 3617315 3465447 3307117 3145186 2981178 2818160 2659989 2508069 2361796
56215 2361796 2221877 2090299 1967459 1852270 1744748 1645644 1553965 1467769 1387015 1312860
56205 1312860 1244722 1180980 1122008 1069422 1022742 979836 940211 904798 872984 843065 815270
56194 815270 791148 770200 750332 731426 715341 702468 691258 680957 671898 663407 654462 646081
56182 646081 640029 635537 630323 624320 619219 614987 610322 606028 604274 604683 604750 603963 604006 605109 605853 606487
56166F06487K253L579K943K529M379O472O538O189P370Q348P274O238P663R885
56152F88147J0475J0799J3090J6073J7596J8698K1130K3798K5500K8157L3429
56141I06892L9218M3356M7591N4081O1280O7323P3989Q2952R1250R4820R3697
56130A656449Q9658Q2134P0810N9196N1027M5674M0900L6983L4223K9750K1213
56119B218017J0692J088p989j7031k3425k5891k8280l4414m2765n0588n9126o9745
56107A870543p9012q2959q2727q1008p6700o8303n8802n1618m5273l7332k9880
56096A176929k5628k2391j7081j1559q897p484m490j417n47K06L134N518M588
56083A090881L465N859R076Q940P485Q785J1185J0900R563J0833J3104J2871J1941
$$ plain form
56166 606487 608740 612319 615262 617791 622170 628642 635180 641369 648739 657087 664361 670599 678262 688147
56152 688147 698622 709421 722511 738584 756180 774878 796008 819806 845306 873463 906892
56141 906892 946110 989466 1037057 1091138 1152418 1219741 1293730 1376682 1467932 1562752 1656449
56130 1656449 1746107 1828241 1899051 1958247 2009274 2054948 2095848 2132831 2167054 2196804 2218017
56119 2218017 2228709 2229797 2221808 2204777 2181352 2155461 2127181 2092767 2050002 1999414 1940288 1870543
56107 1870543 1791531 1708572 1625845 1544837 1468137 1399834 1341032 1289414 1244141 1206809 1176929
56096 1176929 1151301 1128910 1111829 1100270 1091373 1083889 1079399 1077982 1077435 1077641 1080775 1086293 1090881
56083 1090881 1094346 1100205 1109281 1118221 1125706 1134491 1145676 1156576 1166139 1176972 1190076 1202947 1214888
56070A214888J3897J6870J7061J6079J7417J9308J8503J7438J9859K2971K1985
56059A416276J8906J8688K0203J9351J7618J8957K1509K1013J9306K0677K3059
56048A635563K1736J8714J9435K3004K4579K4551K6439K8754K7916K6229K7984
56037A904904L0840L0024K7666K8828L1964L2679L3013L7222M2483M3874M4285
56026B287782M8964N4747N5635N4548N8038O3750O5037O3686O5860O9748O9769
56015B957564O8636P2395P7983P8915P8598Q4273R2615R5708R6358J02476J11194
56004C916715J14376J14938J21307J30582J34282J35934J45096J58614J66377
55995E138221J71052J82768J98816K08802K15525K29758K48666K61200K70597
$$ plain form
56070 1214888 1228785 1245655 1262716 1278795 1296212 1315520 1334023 1351461 1371320 1394291 1416276
56059 1416276 1435182 1453870 1474073 1493424 1511042 1529999 1551508 1572521 1591827 1612504 1635563
56048 1635563 1657299 1676013 1695448 1718452 1743031 1767582 1794021 1822775 1850691 1876920 1904904
56037 1904904 1935744 1965768 1993434 2022262 2054226 2086905 2119918 2157140 2199623 2243497 2287782
56026 2287782 2336746 2391493 2447128 2501676 2559714 2623464 2688501 2752187 2818047 2887795 2957564
56015 2957564 3026200 3098595 3176578 3255493 3334091 3418364 3510979 3606687 3703045 3805521 3916715
56004 3916715 4031091 4146029 4267336 4397918 4532200 4668134 4813230 4971844 5138221
55995 5138221 5309273 5492041 5690857 5899659 6115184 6344942 6593608 6854808 7125405
55986G125405K88892L13423L32455L49719L78399M15130M46190M75188N17125
55977A0641926N69383O17784O66952P33850Q15643Q96883R84058J098264J238587
55968A8263330J390420J565179J791505K072807K397502K784851L271491L858697
55960C7395782M526513N292572O196946P239175Q401859R726651J1282912J3069813
55952A03132223J5047293J7257075J9811704K2811346K6424661L0888466L5874432
55945B71247200L9560016L8823742L1235826J7285211N06268j4764969k5830973
55938C58062321l2264182l4933285l4925095l3150537l0332444k6995660k3488720
55931A41972398k0077564j6973922j4275918j1970519j0024374q423525p129009
$$ plain form
55986 7125405 7414297 7727720 8060175 8409894 8788293 9203423 9649613 10124801 10641926
55977 10641926 11211309 11829093 12496045 13229895 14045538 14942421 15926479 17024743 18263330
55968 18263330 19653750 21218929 23010434 25083241 27480743 30265594 33537085 37395782
55960 37395782 41922295 47214867 53411813 60650988 69052847 78779498 90062410 103132223
55952 103132223 118179516 135436591 155248295 178059641 204484302 235372768 271247200
55945 271247200 310807216 349630958 380866784 398151995 398658263 383893294 358062321
55938 358062321 325798139 290864854 255939759 222789222 192456778 165461118 141972398
55931 141972398 121894834 104920912 90644994 78674475 68650101 60226576 53097567
55924E3097567o067251n184987m465682l883843l392013k962674k599346k296800
55916B2244971k029114j784429j574190j399675j242775j096732r74181q77626
55908A1266249p91243p08457o39946n88084n39592m89620m48460m18655l88663
55899F253529l54779l27003l07820k86509k59821k37896k24290k09630j90292
55890C855489j74794j66352j56831j43096j32579j27664j20673j09051j00086
55881B624363r6154r0223q0161p2857p0108o4723n4585m6751m3889m0373l5418
55870A929121l6187m3910n0281n1719n4099n9339o0514n4985m9659m8225m5271
55859A374932l8066l2599l2569l3170l0930k9454l0607l0024k6148k4142k6265
$$ plain form
55924 53097567 47030316 41845329 37379647 33495804 30103791 27141117 24541771 22244971
55916 22244971 20215857 18431428 16857238 15457563 14214788 13118056 12143875 11266249
55908 11266249 10475006 9766549 9126603 8538519 7998927 7509307 7060847 6642192 6253529
55899 6253529 5898750 5571747 5263927 4977418 4717597 4479701 4255411 4045781 3855489
55890 3855489 3680695 3514343 3357512 3214416 3081837 2954173 2833500 2724449 2624363
55881 2624363 2528209 2437986 2357825 2284968 2214860 2150137 2095552 2048801 2004912 1964539 1929121
55870 1929121 1892934 1849024 1798743 1747024 1692925 1633586 1573072 1518087 1468428 1420203 1374932
55859 1374932 1336866 1304267 1271698 1238528 1207598 1178144 1147537 1117513 1091365 1067223 1040958
55848A040958k7692k6052k5768k8660k9642k6184k3012k3011k2354j8982j7132
55837G72469j8818j9377j6137j3434j4245j4802j2208r801j0223j0385p994o118
55825F18927o801o860m470l305n809q654q991r087j0707j1179q979p267p920p973
55811E10925n709m339n768o586m169j147MJ221L965N622M747M483O919R117Q439
55796E27724O900O546N498K188j278l355n883r476j1116r635q593j0239j1536
55783D77745r684o726n152l796j684j130l196m660l249j384j168k32L499P575
55769D46758R631J1829J6360K0356J9596J3993N758m238j4509k1141k2194k0873
55757D61326k0766k0910j8983j5916j3677j1602q688o552o637p267o800o697q173
$$ plain form
55848 1040958 1013266 987214 961446 932786 903144 876960 853948 830937 808583 789601 772469
55837 772469 753651 734274 718137 704703 690458 675656 663448 653647 643424 633039 625045 618927
55825 618927 612126 605266 600796 597491 591682 583028 574037 564950 554243 543064 534085 526818 518898 510925
55811 510925 505216 500877 495109 488523 484354 483207 483211 484432 488397 494019 498766 503249 510168 519285 527724
55796 527724 534624 541170 546668 548856 547578 544223 538340 528864 517748 508113 499520 489281 477745
55783 477745 468061 461335 456183 452387 450703 449573 446377 441717 438468 437084 435916 435684 439183 446758
55769 446758 456389 468218 484578 504934 524530 538523 544281 540043 525534 504393 482199 461326
55757 461326 440560 419650 400667 384751 371074 359472 350784 344232 337595 330328 323528 316831 308658
55744C08658q951o913m066l359m065l819k707k022j343JP68pr58j042j666l626
55728B64883m869l987l070m135n585n259m133l987m032l069k282k784k932j217
55714B13542P43J182J567L773O378P196P144Q145R245Q316N817L591J530j478
55700B76691m811p157q797j0336j0818r518p843p089o236m326k811l054l666k923
55686A87306j706j384j044M74J980K213K517M320O072N757M428M148M221K743
55672B22045K69j276j916k873l774l470k538k302k497k145j516j099j77J471K285
55657B00487J528J114K548M109L760K678K966L891L426J873Q34J23j269k617k673
55642B22778k221k639l369l377l540m874o073n627m765n345o469o199m994m421
$$ plain form
55744 308658 299707 292794 288728 285369 281304 277485 274778 272756 271413 271414 272182 272175 271217 270175 268509 264883
55728 264883 260014 256027 252957 248822 243237 237978 233845 229858 225826 222757 220475 217691 214759 213542
55714 213542 214285 215467 217034 220807 227185 234381 241525 249670 258915 267231 273048 276639 278169 276691
55700 276691 271880 264723 255926 245590 234772 225254 217411 210322 204086 199760 196949 193895 190229 187306
55686 187306 185600 184216 183172 183646 185626 187839 190356 194676 200748 206505 210933 215081 219302 222045
55672 222045 222314 221038 219122 216249 212475 209005 206467 204165 201668 199523 198007 196908 196731 198202 200487
55657 200487 202015 203129 205677 209786 213546 216224 219190 223081 226507 228380 229214 229337 228068 225451 222778
55642 222778 220557 217918 214549 211172 207632 202758 196685 191058 186293 180948 174479 168280 163286 158865
55628A58865m055k819j809k433l250k123j67K3j072q72O70J186R0q76j030j361
55612A38967j930j727r89q60j058m83K70l01j750k295j744j286j002k55K25n99
55596A23183j646j209m2j19j099j198p72j515k669j744R79K359J250N1P39K315
55580A18863L094K889K075Q37J1O93K490L996N029O448P949Q339P940Q299R464
55565A88416R906R155Q150O871M225N53k221l471m596o358p651p559o709n992
55551A82719n572n576o133o544n937m813m343m335l642k343j548j304p17j9l10
55536A29583j251j235OJ015R93N60O6q37j755j750j116j083j705j885j572j836
55520A16198k738l121k684k271k040j330m35m13j073j157n81m61q40o13J64J91
$$ plain form
55628 158865 154810 151991 150182 147749 144499 142376 142209 142232 141160 140288 140958 142144 142234 141358 140328 138967
55612 138967 137037 135310 134321 133461 132403 131920 132190 131889 130139 127844 126100 124814 123812 123557 123782 123183
55596 123183 121537 120328 120286 120167 119068 117870 117098 115583 112914 111170 112149 114508 115758 115809 116548 118863
55580 118863 121957 124846 126921 127758 127769 128462 130952 134948 139977 146425 154374 162713 170653 178952 188416
55565 188416 198322 207477 215627 222498 226723 227276 225055 221584 216988 210630 202979 195420 188711 182719
55551 182719 177147 171571 165438 158894 152957 148144 143801 139466 135824 133481 131933 130629 129912 129893 129583
55536 129583 128332 127097 127103 128118 129111 129671 129737 128900 127145 125395 124279 123196 121491 119606 118034 116198
55520 116198 113460 110339 107655 105384 103344 102014 101579 101166 100093 98936 98355 97894 97054 96441 96605 96796
55504I6796o35r24k74J64j13k84q6k18o02m14p6q67k274k258o41L44l54j088n10
55485H5686L79L87J37M65P75M03k1J78N57O50Q00J014N58m41o07N67J692J540
55467I4719O16j81r00j586j511n49K8o93j852k128j471n97J95Q76J204J211J354
55450H8735J664J576R04J19n20j066j110k30P94O61l94q39k71J85J02L79J129
55433I1818J046k65j237p00L64O08K43J19J71J2j25p0k34n73k00J097K096J823
55415I5993R24N12O67Q82R96R59N61J06K27P00M98m38q93l84k1o39j498j704j544
55396I5904j417q41L48J041L74p92j097o38n25j116j675j435l01J114J836J397
55380I2177N06J88L01o7q52r78k30L14M6m29o61r26j084m58O10P50k64r57m87
$$ plain form
55504 96796 96161 95237 94963 95127 95014 94730 94644 94426 93824 93410 93334 92467 90193 87935 87294 87638 87284 86196 85686
55485 85686 86065 86452 86589 87054 87829 88232 88211 88389 88946 89596 90396 91410 91968 91527 90920 91487 93179 94719
55467 94719 95335 95154 94254 92668 91157 90608 90636 89943 88091 85963 84492 83895 84090 84966 86170 87381 88735
55450 88735 90399 91975 92879 92998 92478 91412 90302 90072 90866 91527 91133 90294 90023 90208 90310 90689 91818
55433 91818 92864 92599 91362 90662 91026 91634 91877 91996 92167 92179 92054 91984 91750 91177 90977 92074 94170 95993
55415 95993 96917 97429 98096 98978 99974 100933 101494 101600 101827 102527 103025 102587 101694 101310 101289 100650 99152 97448 95904
55396 95904 94487 93646 93994 95035 95409 94617 93520 92882 92357 91241 89566 88131 87830 88944 90780 92177
55380 92177 92683 92871 93172 93105 92253 91275 91045 91359 91405 90976 90315 89389 88305 87847 88457 89207 88943 87986 87499
55361H7499J48M0k24qJ88k3n9J96k23j441j862n93R15J119P39J197K043J829N29
55342I2009o22j090j229j132o86k56j52O2P34J348J444J458J697J548O71q5o3
55325I5656J2n69j083p30k32m99q06n1J031Q32m89j248p81n2J80K53N02O99P29
55306I3354Q34J069J228J250J030K72q25j263m62P55J212Q55L66m9m79o16l09
55289I8222j85o93j089n28M33O63J80j73k63n19o56mJ071J414P21k39r06j344
55271I6105j441q87lM44K85jk31n41o33j1R53J258O96J55L09P59Q07L87l3j05
55251I8272J18L02J91p2j31K6J1k79m51l41l68p78j124j006p19o78p12m99j59
55232I1603J34N42J018R82K13n71o39k27M0J02K26L25K62K80N46P60P61Q96J254
$$ plain form
55361 87499 87647 87687 87463 87455 87643 87620 87561 87757 87534 86093 84231 83638 84553 85672 86411 87608 89651 91480 92009
55342 92009 91387 90297 89068 87936 87250 86994 86842 86904 87638 88986 90430 91888 93585 95133 95804 95719 95656
55325 95656 95668 95099 94016 93286 93054 92555 91749 91698 92729 93561 93072 91824 91043 90991 91171 91424 91926 92625 93354
55306 93354 94188 95257 96485 97735 98765 99037 98212 96949 96487 97242 98454 99309 99675 99626 99147 98531 98222
55289 98222 98037 97344 96255 95727 96160 96823 97003 96830 96567 96048 95392 95388 96459 97873 98594 98355 97449 96105
55271 96105 94664 93777 93774 94218 94503 94502 94271 93730 93097 93086 94039 95297 95993 96148 96457 97216 98023 98410 98377 98272
55251 98272 98390 98692 98883 98811 98680 98706 98717 98438 97987 97646 97278 96500 95376 94370 93651 92973 92261 91762 91603
55232 91603 91737 92279 93297 94279 94492 93921 93282 93055 93095 93197 93423 93748 94010 94290 94836 95596 96357 97253 98507
55213I8507J219M43m22n95j17N95J347J773J286J13n95l82j79o17q96l40J99k01
55195A01138q59o29J86O45Q91J505J901J128l10j072r71q03o93k24K58J40o4N13
55177A02680J222O66q97j710j117k71j09k88l83n26n59K6R52J255P73K95J07k13
55159A01903m70J73J539K265J722P28k2q19j702j813q32K02L10j32k65mL23P15
55141A03821J162J205N70l04q36r37p15j87L60M42P6k09l20p63j593k026j523
55124I8223n54J62M50L75j02p11q56m44j16j83m8P86J785K121J819J583J780K127
55106A08197K155J593N75l11m71j0L74L27K24M36P45Q43Q55R85R86N15k58p89
55088A16971q05n27k57j8L50P61P86J92n03n06R6K77m36j123p45L26R32Q25P49
$$ plain form
55213 98507 99726 100169 99747 99152 99035 99630 100977 102750 104036 104149 103554 103172 102993 102376 101480 101140 101339 101138
55195 101138 100279 99650 99836 100481 101372 102877 104778 105906 105596 104524 103553 102750 102057 101833 102091 102231 102167 102680
55177 102680 103902 104568 103671 101961 100844 100573 100464 100176 99793 99267 98708 98734 99686 100941 101714 102009 102116 101903
55159 101903 101433 101606 103145 105410 107132 107860 107838 107019 105317 103504 102672 102874 103184 103052 102787 102783 103106 103821
55141 103821 104983 106188 106758 106454 105618 104681 103966 103779 104139 104581 104657 104448 104128 103365 101772 99746 98223
55124 98223 97669 97831 98281 98656 98554 97843 96987 96543 96427 96244 96196 96982 98767 100888 102707 104290 106070 108197
55106 108197 110352 111945 112520 112209 111738 111728 112102 112429 112653 113089 113834 114677 115532 116517 117503 118018 117760 116971
55088 116971 116166 115639 115382 115364 115714 116475 117261 117453 116950 116444 116540 116817 116381 115258 114513 114839 115771 116596 117345
55069A17345J076J401J481J486J314O15l32p44n45n22r51j072l90L76K80m87r28
55052A19403n96j2J52j26l06m1L05J07n69r34o63m28p47r60k98O56P29j2m88m96
55032A14676q45j569j540l59Q01R24M84L10K32j86m95j11N44O18K03P2L85N74
55014A14718L53R0J06K45K23k8l50m30L0Q54J358J051K98j18J10O06R68J155J311
54995A22550J407J314J027P12M70J86k59o02l78L43Q16N32n7j78J50L06J33R3
54977A28565L84N71L52kj62k06k86l33l23m66p66p56J2J303K286K231J123k99
54959A33228j138j124p07m07k54q2N2J13L18O76O46j28j064j285p48j04L67Q10
54941A29169J022M95n92j309j073k54M60P21N50K83M99J359K089J873J149J170
$$ plain form
55069 117345 118421 119822 121303 122789 124103 124718 124386 123642 123097 122575 121624 120552 120162 120538 120818 120331 119403
55052 119403 118807 118795 118947 118821 118515 118474 118779 118886 118317 117383 116720 116292 115545 114585 114287 114943 115672 115660 115172 114676
55032 114676 113831 112262 110722 110363 111164 112088 112572 112882 113114 112928 112433 112322 112866 113484 113687 113759 114144 114718
55014 114718 115071 115161 115267 115512 115735 115707 115357 114927 114957 115811 117169 118220 118518 118400 118510 119116 120084 121239 122550
54995 122550 123957 125271 126298 127010 127480 127666 127407 126805 126427 126770 127586 128118 128061 127883 128033 128339 128472 128565
54977 128565 128949 129520 129872 129870 129708 129502 129216 128883 128560 128094 127328 126572 126584 127887 130173 132404 133527 133228
54959 133228 132090 130966 130259 129852 129598 129516 129568 129681 129999 130675 131321 131193 130129 128844 128096 127992 128359 129169
54941 129169 130191 130686 130094 128785 127712 127458 127918 128639 129189 129472 129971 131330 133419 135292 136441 137611
54925A37611K206L165L279L132L512M164M416M410M882N907O549N845L838J545
54911A94461k1q04j527k585l495l770l824m303m945m923m214l643l535l242k317
54896A47313j232n94l14k3K38J97j08l62l97l19l30m47l45L65J549K557L049L375
54878A54172L875M292M422M637N135N338M836M232M063L670K225K25j472l281
54864A96369n853p950p501m825k606k403l042l040k582k284j878j202r99j594
54850A48610k034j597j005j118j532j513j287j345j434j185r32r37p67k62j22
54835A31540o64r93m78J15k8l18P1O50N59J53K04L55r0o11l11L36K50k41O3R64
54815A31526J034R2l55M64J436J350N82J59K56L82K80Kl42m02K51J382K064J772
$$ plain form
54925 137611 139817 142982 146261 149393 152905 157069 161485 165895 170777 176684 183233 189078 192916 194461
54911 194461 194440 193636 192109 189524 186029 182259 178435 174132 169187 164264 160050 156407 152872 149630 147313
54896 147313 146081 145487 145173 145150 145388 145585 145477 145115 144718 144399 144069 143622 143277 143642 145191 147748 150797 154172
54878 154172 158047 162339 166761 171398 176533 181871 186707 190939 195002 198672 200897 201122 199650 196369
54864 196369 190516 182566 175065 170240 167634 165231 162189 159149 156567 154283 152405 151203 150204 148610
54850 148610 146576 144979 143974 142856 141324 139811 138524 137179 135745 134560 133628 132691 131924 131662 131540
54835 131540 130876 129883 129405 129520 129492 129174 129245 129895 130454 130607 130811 131166 131076 130465 130154 130490 130740 130499 130562 131526
54815 131526 132560 132652 132297 132761 134197 135547 136129 136288 136544 136926 137206 137208 136866 136464 136715 138097 140161 141933
54797A41933J018N31L45J01j59r4K84N77N91O42J083J744J992J470N94J59M18
54780A53229Q63R70P95P00Q54J214J705K165K352K253K183K395K865L481M190
54765A82214M829N232N599O298P119P283O397M869L165J254q13k441l167l446
54751B24392m133n408o603o946o276n186m513m457m330l493k345j699j508j121
54737A66374o25p22j247j219n95m53r36o56R66K359K118J254J578K882L592L465
54721A78135L770M941N846N585M639L853L268K372Q00j328l373m463m331l689
54707A96025l345l307l210l057k902k382j403p95j292k279k525j834j020n59k38
54692A65877Rj2j55q5ml60r04q94k04M36L34m89j434j726j005N1K21p10j554j384
$$ plain form
54797 141933 142951 143482 143827 143928 143769 143675 143959 144536 145127 145769 146852 148596 150588 152058 152652 152811 153229
54780 153229 154092 155062 155857 156557 157411 158625 160330 162495 164847 167100 169283 171678 174543 178024 182214
54765 182214 187043 192275 197874 204172 211291 218574 224971 229840 233005 234259 233446 231005 227838 224392
54751 224392 220259 214851 208248 201302 195026 189840 185327 180870 176540 173047 170702 169003 167495 166374
54737 166374 165749 165027 163780 162561 161966 161513 160577 159921 160887 163246 165364 166618 168196 171078 174670 178135
54721 178135 181905 186846 192692 198277 202916 206769 210037 212409 213209 211881 208508 204045 199714 196025
54707 196025 192680 189373 186163 183106 180204 177822 176419 175624 174332 172053 169528 167694 166674 166115 165877
54692 165877 165886 165874 165719 165634 165630 165270 164366 163472 163268 163704 164038 163549 162115 160389 159384 159435 159656 158946 157392 156008
54672A56008p52m56j74N81J112N86l35m70j67o29j611j639m08P98J177J291J583
54655A56495J683J525J654J989J622M45l66m8P42J144J208J200Q54M7o72q37o75
54638A68010m82k20n2m04j128j418j011o55q95j273j164o73j65L15P09P29M13
54621A60636K76M50M03j44p03q49q28r17q53m12L9O2k32m63m39r9M64Q22N89R5
54601A57897J4K61J31m52p93o78o93r99q95j89K07k90r04p13m0K40K3k05l10m17
54581A51195m11j99j8J12N88J363J551O92k84k47N21Q68N28K90O62J229J414J119
54563A60973N67M9j37J24O52J198J621J644R65j20p10l83K09K59j20l50l80n12
54545A65549o05k73K94M87K44J59N41R88J015O65K63n5l53o11o75m70j89n1L8
$$ plain form
54672 156008 155256 154800 154626 155207 156319 156905 156570 156100 155933 155304 153693 152054 151646 152444 153621 154912 156495
54655 156495 158178 159703 161357 163346 164968 165413 165047 164999 165741 166885 168093 169293 170147 170194 169522 168685 168010
54638 168010 167528 167308 167256 166852 165724 164306 163295 162640 161745 160472 159308 158635 158470 158785 159494 160223 160636
54621 160636 160912 161362 161765 161621 160918 160069 159241 158324 157471 157059 157098 157160 156928 156465 156026 155927 156391 157213 157802 157897
54601 157897 157911 158172 158303 157851 157058 156380 155687 154688 153793 153604 153811 153521 152617 151904 151864 152104 152127 151922 151612 151195
54581 151195 150784 150585 150567 150679 151267 152630 154181 154873 154589 154342 154863 155731 156259 156549 157211 158440 159854 160973
54563 160973 161540 161589 161452 161576 162228 163426 165047 166691 167656 167536 166826 166443 166652 166911 166791 166441 166061 165549
54545 165549 164944 164671 164965 165452 165696 165855 166396 167384 168399 169064 169327 169272 168919 168308 167633 167163 166974 166923 166961
54526A66961M13R72R77Oj140j221j91P14O62J13k14m18r42j640k009j881j411
54509A59751p73k98l97q74q29J76J314J481P39O5l4O1q9m04o28p29p95q30p10
54490A56197l58N6J16l72r20p96k0N92M86k8m45p04p97m19M80J316J533J349J245
54471A58511J188Q98N43O05J135J648J651R66k37j434k000j770j108l53M18R84
54455A61645R76N48L72N56L06p91j861j918j267q40o95j89O48R83M40m22r27r33
54437A56631n93j34R6n5k08L7L52O1p63j254r02q2O08R81J031P17K28Q2N62J334
54417A58729J798J719J361J163J310J576J602J419J382J513J240J54j230j995
54403A71741j815j031K8J171J969J928J241P47R16J266J092M41L4L09Q78R67L64
$$ plain form
54526 166961 167374 168346 169323 169329 168189 166968 166777 167491 168153 168266 168052 167634 166692 165052 163043 161162 159751
54509 159751 158978 158680 158283 157409 156580 156756 158070 159551 160290 160355 160321 160382 160293 159889 159261 158532 157737 156907 156197
54490 156197 155839 155895 156011 155639 154719 153923 153903 154495 154981 154953 154508 153804 153007 152588 153068 154384 155917 157266 158511
54471 158511 159699 160597 161140 161745 162880 164528 166179 167145 166908 165474 163474 161704 160596 160243 160661 161645
54455 161645 162621 163169 163541 164097 164403 163612 161751 159833 158566 157726 157031 156842 157490 158473 158913 158491 157564 156631
54437 156631 156038 155904 156000 155945 155737 155774 156126 156187 155424 154170 153268 153186 153794 154775 155806 156523 156751 156833 157395 158729
54417 158729 160527 162246 163607 164770 166080 167656 169258 170677 172059 173572 174812 174966 173736 171741
54403 171741 169926 168895 168923 170094 172063 173991 175232 175979 176895 178161 179253 179694 179728 180037 180915 181882 182246
54386A82246k52q5P32J237Q48P7l33m22o72r47o03L63J015O28l94j141j234q88
54368A80175k23Q37K060K864L025L042L465M113M356M078L815L876L880L390K497
54353B25250J417L0j661l004l382l137l143l573l861l744l536l373l047k661k568
54338A86007k594k147j319r33j230j458j108o25l70O3R10J548J538J472J880K137
54322A83771J411R6p41q53p58o34l13o2l31q65r59n36j38m6j26m11r81j403j146
54303A74975m77k11n98j144j412j295o86L67J242J307Q50O44P41N46m0m28m24
54286A73957m93p65o81Q9J116J877K262K176J437M17N2O65J408J329N48j54m50
54269A84790n88p33p93p87r00j105j070n33L87J309J950K285K383K171J516N83
$$ plain form
54386 182246 181994 181909 182641 183878 184726 184803 184470 184048 183376 182429 181826 182189 183204 183832 183438 182297 181063 180175
54368 180175 179952 180789 182849 185713 188738 191780 195245 199358 203714 207792 211607 215483 219363 222753 225250
54353 225250 226667 226697 225036 222032 218650 215513 212370 208797 204936 201192 197656 194283 191236 188575 186007
54338 186007 183413 181266 179947 179014 177784 176326 175218 174593 174223 174286 175196 176744 178282 179754 181634 183771
54322 183771 185182 185278 184537 183684 182926 182292 181979 181917 181586 180721 179762 179226 179088 179042 178916 178505 177524 176121 174975
54303 174975 174498 174287 173689 172545 171133 169838 169152 169519 170761 172068 172918 173562 174303 174849 174809 174381 173957
54286 173957 173464 172699 172018 172107 173223 175100 177362 179538 180975 181392 181444 182109 183517 184846 185394 185240 184790
54269 184790 184202 183469 182676 181889 180989 179884 178814 178281 178668 179977 181927 184212 186595 188766 190282 190865
54253A90865j67m57n03o21p50n98j62J98J79j20k84J2N91Q61N40J32K26M86M2
54234A90470j073j755j393p08n38o13k98K22L67K05K14L89M33M15M99M29N0q9
54216A87226M25Q85L89o20q90j74N59O61M07R2l83q96j025p86o18o38n82n16p36
54197A82780j022q51l03J30M33Q87J124N48m44p86l87j65m40n18j16J47K0J25
54179A81162O90J064Q93O95P84Q36Q90J514K367K082L29j281j419p83o00o42q3
54162A88498O72O21j01o09p75j018r84n2J145J238J71o51m36P2N3j78K3N46Q77
54143A89112Q18M07l64j228j495p71M63J347J507J170O39L4m91o77m78k50m20
54126A89323r18j189q73l04n1j17PN51J117J234Q95M32J57K75P73J314J461J187
$$ plain form
54253 190865 190698 190241 189738 189117 188367 187769 187607 187805 187984 187864 187580 187592 188183 189044 189584 189716 189942 190428 190470
54234 190470 189397 187642 186249 185541 185003 184390 184092 184314 184681 184886 185100 185489 185922 186337 186836 187265 187315 187226
54216 187226 187651 188536 188925 188305 187415 187241 187800 188461 188868 188960 188577 187681 186656 185870 185252 184614 184032 183516 182780
54197 182780 181758 180907 180604 180734 181167 182054 183178 183726 183282 182496 182109 181944 181504 180986 180870 181017 181037 181162
54179 181162 181852 182916 183809 184504 185288 186124 187014 188528 190895 192977 193306 192025 190606 189823 189223 188581 188498
54162 188498 189170 189791 189690 189081 188306 187288 186304 186252 187397 188635 188806 188155 187719 187791 187844 187666 187689 188235 189112
54143 189112 189930 190337 189973 188745 187250 186479 186942 188289 189796 190966 191605 191639 191148 190471 189993 189743 189323
54126 189323 188405 187216 186343 186039 185988 185871 185878 186429 187546 188780 189675 190107 190264 190539 191312 192626 194087 195274
54108A95274Q27N39J77k89o39p99q72p14k0J012J680J797K050K933L894M019L283
54091B14152K472K236K647L528M696N796O287N733M164K076L7j783l546n078n646
54076B37771m800l128j697r90r55j628k764l238k019J99J558J345O04K26j30q05
54060B19549j187q37l04NO87K047L104K979K412K584L283L569L589M225N280N536
54044B56521M539L127K068J328P52N47Q24J379J970K336K216J898K318L809N243
54029B90875N413M715M393M465L912K690J944K099K243J878J778K404K798J962
54015C33569M16o71j126j592k206k525k496k673l355m180m644m634m420m363m614
54000B90486m899m708l822k656j895j893k455l073l286k990k458k021j733j524
$$ plain form
54108 195274 196101 196640 196817 196528 195889 195090 194218 193504 193484 194496 196176 197973 200023 202956 206850 210869 214152
54091 214152 216624 218860 221507 225035 229731 235527 241814 247547 251711 253787 253824 252041 248495 243417 237771
54076 237771 232971 229843 228146 227156 226201 224573 221809 218571 216552 216751 218309 219654 220258 220484 220354 219549
54060 219549 218362 217525 217221 217226 217913 219960 223064 226043 228455 231039 234322 237891 241480 245705 250985 256521
54044 256521 261060 264187 266255 267583 268335 268882 269706 271085 273055 275391 277607 279505 281823 285632 290875
54029 290875 296288 301003 305396 309861 313773 316463 318407 320506 322749 324627 326405 328809 331607 333569
54015 333569 333985 333314 332188 330596 328390 325865 323369 320696 317341 313161 308517 303883 299463 295100 290486
54000 290486 285587 280879 277057 274401 272506 270613 268158 265085 261799 258809 256351 254330 252597 251073
53986B51073j481j683j824j459o78j34k51o98q70o18k64o5O2K66M11K06l45p61
53968B40887n87rL03Qn16o88l70J40M97N25L30K86P04J422K014K396K793L132
53950B53267L088K875L200M169N027N434O109P569R124R965J0515J1739J3610
53937C45691J5244J5978J5339J2545P385J322l575o724q911j0307j0065q009n418
53924C60495l590k604j838q32O30K386L626L596K813K683L715N047N896O381O679
53909C95083O553O221O495P385P618O327M316K803J832Q02k52r34j455k258l116
53894D37420l517l662m159n001n655n930o035n959n571n178n311o017o883p603
53880C60939q018p838o977n884n006m165l113k423k941m458n722n921n319m410
$$ plain form
53986 251073 249592 247909 246085 244626 243948 243814 243563 242865 241995 241377 241113 241048 241110 241376 241787 241993 241648 240887
53968 240887 240300 240291 240594 240602 240086 239398 239028 239168 239665 240190 240520 240806 241510 242932 244946 247342 250135 253267
53950 253267 256355 259230 262430 266599 271626 277060 283169 290738 299862 309827 320342 332081 345691
53937 345691 360935 376913 392252 404797 412182 413504 409929 403205 394294 383987 373922 365913 360495
53924 360495 356905 354301 352463 351631 352261 354647 358273 361869 364682 367365 371080 376127 382023 388404 395083
53909 395083 401636 407857 414352 421737 429355 435682 439998 442801 444633 445435 445183 444249 442794 440536 437420
53894 437420 433903 430241 426082 421081 415426 409496 403461 397502 391931 386753 381442 375425 368542 360939
53880 360939 352921 345083 338106 332222 327216 323051 319938 317515 314574 310116 304394 298473 293154 288744
53866B88744l259k055j530k131l108l166j978n97k35r66j860k222k224k231k108
53851B59074j605j157j471k340k611j721n14j50o73j214j215q32m69m13q01j390
53835B40498j561r65n0N38Q24J214J617J450N47n44j181j127m94L70R20Q89O45
53818B43590P15J014J054Q02O87P75O77M21O97J829L118L649L388L009K917K964
53802B71306K927K859L015L589M515N349N588N242M866M819M797M370L699L306
53788C30247L320L404L378L344L193K482J117k73r46q86p25j002j685k404k888
53773C39676l165l506m147m960n457n318m828m594m811n066m894m279l507k783
53759B78361k168j701j472j621k285l289l898l245j332P03J594J091o8j100j705
$$ plain form
53866 288744 285485 283430 281900 279769 276661 273495 271517 270920 270685 269719 267859 265637 263413 261182 259074
53851 259074 257469 256312 254841 252501 249890 248169 247655 247505 246832 245618 244403 243571 243102 242689 241888 240498
53835 240498 238937 237972 237922 238460 239284 240498 242115 243565 244112 243568 242387 241260 240766 241136 242056 242945 243590
53818 243590 244305 245319 246373 247175 247862 248637 249314 249735 250432 252261 255379 259028 262416 265425 268342 271306
53802 271306 274233 277092 280107 283696 288211 293560 299148 304390 309256 314075 318872 323242 326941 330247
53788 330247 333567 336971 340349 343693 346886 349368 350485 350212 349266 348380 347655 346653 344968 342564 339676
53773 339676 336511 333005 328858 323898 318441 313123 308295 303701 298890 293824 288930 284651 281144 278361
53759 278361 276193 274492 273020 271399 269114 265825 261927 258682 257350 258053 259647 260738 260670 259570 257865
53744B57865j919j873j713j465j051n74l91n97p17l06L61P10P36Q96J261J411
53728B52634J246J150J264J210P79K86K3o0O8O87J624K082J624Q82O94R77J095
53711B68265J023J377K380L428L881L698L250K807K446K234K252K522K913L187
53697C05663L202L086L078L214L407L684M054M130L448K245J366J166R92K07q52
53682C42090j419j421j447j800k178k162j632q25k65m19j057j347r74o86j110
53667C23348j633j301n06n46j565k135j251K54R45N79Pj63p4j01l96q47j044m77
53649C13094Q47K147K561J965Q42l17j188j438r58j17O07J169J760K268K419K380
53633C28041K628L134L283K809K350K594L319L671L241K439J849J694J916K378
$$ plain form
53744 257865 255946 254073 252360 250895 249844 249270 248879 248282 247565 247259 247620 248330 249066 249962 251223 252634
53728 252634 253880 255030 256294 257504 258283 258569 258592 258532 258600 259287 260911 262993 264617 265499 266193 267170 268265
53711 268265 269288 270665 273045 276473 280354 284052 287302 290109 292555 294789 297041 299563 302476 305663
53697 305663 308865 311951 315029 318243 321650 325334 329388 333518 336966 339211 340577 341743 342735 342942 342090
53682 342090 340671 339250 337803 336003 333825 331663 330031 329206 328941 328522 327465 326118 325144 324458 323348
53667 323348 321715 320414 319908 319362 317797 315662 314411 314665 315610 316189 316196 316033 315959 315858 315462 314615 313571 313094
53649 313094 313941 316088 318649 320614 321456 321139 319951 318513 317555 317438 318045 319214 320974 323242 325661 328041
53633 328041 330669 333803 337086 339895 342245 344839 348158 351829 355070 357509 359358 361052 362968 365346
53619C65346K791K800K436K246K789M012N331O278O863P335P718P714P086O093
53605D36838N395N367N611N407M624L826L358K840J900R08M26K18m41j558k287
53590D72432k185j877k135k797l141k868k292j809j624j864k407k772k576k046
53576D40039j763j871j925j564j020q56j308k027k393k084j421j054j306j866
53562D17581k141j734o75N97J366J197M93J69N25R02P21L80N56J054J085N70L49
53545D22995R67J978K691L055L432L934M373M627M689M516M114L748L848M703
53531D73670O310Q358J0248J1300J1243J0547J0108J0532J1707J3052J4063J4629
53519F05767J4870J4929J5022J5569J6903J8791K0516K1625K2419K3476K4841
$$ plain form
53619 365346 368137 370937 373373 375619 378408 382420 387751 394029 400892 408227 415945 423659 430745 436838
53605 436838 442233 447600 453211 458618 463242 467068 470426 473266 475166 476074 476500 476718 476277 474719 472432
53590 472432 470247 468370 466235 463438 460297 457429 455137 453328 451704 449840 447433 444661 442085 440039
53576 440039 438276 436405 434480 432916 431896 431040 429732 427705 425312 423228 421807 420753 419447 417581
53562 417581 415440 413706 413031 413628 414994 416191 416684 416853 417378 418280 419001 419381 419937 420991 422076 422646 422995
53545 422995 423962 425940 428631 431686 435118 439052 443425 448052 452741 457257 461371 465119 468967 473670
53531 473670 479980 488338 498586 509886 521129 531676 541784 552316 564023 577075 591138 605767
53519 605767 620637 635566 650588 666157 683060 701851 722367 743992 766411 789887 814728
53508H14728K5999K6533K6539K6440K6568K6963K7330K7289K6804K6267K5963
53497A107423K5581K4610K3057K1442K0094J8884J7759J7120J7357J8236J9030
53486A330593J9261J9092J8951J8925J8634J7841J6970J6720J7117J7271J6295
53475A527670J4264J1914R713P577N352L130J007j094l284n608q056j0515j2776
53462A539294j4791j6748j8594j9748j9744j9069j8790j9342k0283k1263k2530
53451A328392k4104k5134k4664k2858k0937j9932j9823j9859j9458j8677j7851
53440A095095j6966j5526j3226j0503q137o381m908l477k215j102J67J639K917
53427A017377L823M834O425Q377J0123J1448J2482J3361J4346J5957J8323K0688
$$ plain form
53508 814728 840727 867260 893799 920239 946807 973770 1001100 1028389 1055193 1081460 1107423
53497 1107423 1133004 1157614 1180671 1202113 1222207 1241091 1258850 1275970 1293327 1311563 1330593
53486 1330593 1349854 1368946 1387897 1406822 1425456 1443297 1460267 1476987 1494104 1511375 1527670
53475 1527670 1541934 1553848 1563561 1571138 1576490 1579620 1580627 1579533 1576249 1570641 1562585 1552070 1539294
53462 1539294 1524503 1507755 1489161 1469413 1449669 1430600 1411810 1392468 1372185 1350922 1328392
53451 1328392 1304288 1279154 1254490 1231632 1210695 1190763 1170940 1151081 1131623 1112946 1095095
53440 1095095 1078129 1062603 1049377 1038874 1030737 1024356 1019448 1015971 1013756 1012654 1012821 1014460 1017377
53427 1017377 1021200 1026034 1032459 1040836 1050959 1062407 1074889 1088250 1102596 1118553 1136876 1157564
53415A157564K2152K2913K4061K6114K8423L0239L1711L3400L5314L6941L8109
53404A486941L9246M0782M2653M4478M5972M7161M8355M9977N2183N4564N6414
53393B008726N7369N7745N8054N8433N8710N8911N9265N9660N9483N8190N5930
53382B650476N3310N0691M7944M4764M0996L6681L2021K7258K2361J6989J1045
53371C034536N148P1m290q949j4629k0983k7260l3299l9403m5439n0675n4545
53359B740283n7182n9103o0631o1762o2265o1850o0373n8204n6191n4978n4358
53348B093386n3480n1763m9418m7095m5279m4106m3510m3172m2474m0977l8884
53337A593228l6771l4822l2757l0540k8545k6836k4829k2155j9343j7141j5585
$$ plain form
53415 1157564 1179716 1202629 1226690 1252804 1281227 1311466 1343177 1376577 1411891 1448832 1486941
53404 1486941 1526187 1566969 1609622 1654100 1700072 1747233 1795588 1845565 1897748 1952312 2008726
53393 2008726 2066095 2123840 2181894 2240327 2299037 2357948 2417213 2476873 2536356 2594546 2650476
53382 2650476 2703786 2754477 2802421 2847185 2888181 2924862 2956883 2984141 3006502 3023491 3034536
53371 3034536 3039684 3039755 3035465 3026516 3011887 2990904 2963644 2930345 2890942 2845503 2794828 2740283
53359 2740283 2683101 2623998 2563367 2501605 2439340 2377490 2317117 2258913 2202722 2147744 2093386
53348 2093386 2039906 1988143 1938725 1891630 1846351 1802245 1758735 1715563 1673089 1632112 1593228
53337 1593228 1556457 1521635 1488878 1458338 1429793 1402957 1378128 1355973 1336630 1319489 1303904
53326A303904j4326j3480j3288j3201j2334j0823r783r678r643q861p770p255
53314A173462p219o704n084k619o4J912L145M217N885Q052R743J0487J1062J2386
53300A218661J4260J5992J7602J9480K1291K2374K3062K4363K6266K7603K7871
53289A458825K8026K8877K9807K9861K9207K8446K7190K4538K0784J7392J5143
53278A738096J3206J0417O716K881o00l823o946r936j2695j5106j7054j8705k0655
53265A665796k3346k6304k8429k9186k9229k9581l0497l1442l1969l2181l2358
53254A341274l2589l2878l3297l3770l3948l3502l2460l1097k9738k8688k8113
53243I91194k7750k7059k5954k5039k4722k4456k3391k1634k0172j9439j8746
$$ plain form
53326 1303904 1289578 1276098 1262810 1249609 1237275 1226452 1216669 1206991 1197348 1188487 1180717 1173462
53314 1173462 1166243 1159539 1154455 1151836 1151772 1153684 1156829 1161046 1166931 1174983 1184726 1195213 1206275 1218661
53300 1218661 1232921 1248913 1266515 1285995 1307286 1329660 1352722 1377085 1403351 1430954 1458825
53289 1458825 1486851 1515728 1545535 1575396 1604603 1633049 1660239 1684777 1705561 1722953 1738096
53278 1738096 1751302 1761719 1768435 1771316 1770716 1766893 1759947 1750011 1737316 1722210 1705156 1686451 1665796
53265 1665796 1642450 1616146 1587717 1558531 1529302 1499721 1469224 1437782 1405813 1373632 1341274
53254 1341274 1308685 1275807 1242510 1208740 1174792 1141290 1108830 1077733 1047995 1019307 991194
53243 991194 963444 936385 910431 885392 860670 836214 812823 791189 771017 751578 732832
53232G32832j7341j5445j3806j2662j1678j0619r598q784q251q076q268q645r060
53219E90599r625j0402j1015j0944j0236r530r391r848j0552j1017j0745r581
53207D67713q054p066o948p156p056o666o370o230n980n532n067m724m540m665
53193C81659n179n670n405m233k968k562l029l481l210k440j921k052k547k919
53179C34043k992k892k692k314j800j424j394j614j883k211k647k895k472j379
53165C03434l37o9n34j026r77m16K60O97P36L84k11p48r04n84j34j33p81j571
53147B97086j840j628j588j956k112j564q18o61q59m18Q40J796J473K94n52n21
53131B86972M4P06J283J583J428J067J019J368J572J197N25J97M48R36J196J065
$$ plain form
53232 732832 715491 700046 686240 673578 661900 651281 641683 632899 624648 616572 608304 599659 590599
53219 590599 580974 570572 559557 548613 538377 528847 519456 509608 499056 488039 477294 467713
53207 467713 459659 452593 445645 438489 431433 424767 418397 412167 406187 400655 395588 390864 386324 381659
53193 381659 376480 370810 365405 361172 358204 355642 352613 349132 345922 343482 341561 339509 336962 334043
53179 334043 331051 328159 325467 323153 321353 319929 318535 316921 315038 312827 310180 307285 304813 303434
53165 303434 303097 303028 302494 301468 300491 300075 300335 301032 301768 302152 301941 301193 300289 299705 299571 299438 298657 297086
53147 297086 295246 293618 292030 290074 287962 286398 285580 284919 284060 283642 284482 286278 287751 288045 287493 286972
53131 286972 287016 287722 289005 290588 292016 293083 294102 295470 297042 298239 298764 298961 299409 300345 301541 302606
53115C02606P17M99P07J381K187K625K419J761J097N80j36j375k681l062k188
53100C07137j045q75j656k189j737r34p62j199j433j135q09q95j131j060p59o76
53084B88842r04j025p05j78J4l11p32p47m13k08k44jR16J964K138J172j22q34
53066B88622q66p31p99j061j337j407j133p01n90r92j500j631j408j108p29j77
53050B72452K56K44J29N68J416J692R01k23p13m86p1K52M93M88P9m14n11k70j07
53031B76175m8K92R00J149N75m73j205j211p28k61r2o9J59O09Q49N16j32m92k76
53012B76237L06R59J463J517Q84j65r17r35m58M5M72J056J851K453K300J288R2
52995B88448l90l5K97j39r90j330r46m63k82q7M17J025J518K104K955L741M032
$$ plain form
53115 302606 303323 303822 304529 305910 308097 310722 313141 314902 315999 316579 316443 315068 312387 309325 307137
53100 307137 306092 305217 303561 301372 299635 298701 297939 296740 295307 294172 293363 292468 291337 290277 289518 288842
53084 288842 287938 286913 286208 286030 286044 285733 285001 284254 283841 283633 283389 283388 284304 286268 288406 289578 289456 288622
53066 288622 287756 287025 286226 285165 283828 282421 281288 280587 279997 279005 277505 275874 274466 273358 272629 272452
53050 272452 272708 272952 273081 273649 275065 276757 277658 277435 276722 276236 276165 276417 276910 277398 277477 277063 276552 276282 276175
53031 276175 276127 276419 277319 278468 279043 278570 277365 276154 275426 275165 275073 275004 275163 275772 276621 277137 277005 276513 276237
53012 276237 276543 277502 278965 280482 281366 281201 280284 279349 278891 278936 279408 280464 282315 284768 287068 288356 288448
52995 288448 288058 288023 288320 288181 287191 285861 284915 284452 284170 284083 284500 285525 287043 289147 292102 295843 299875
52978B99875L784L150K175J010M4n40r67j288j075k03N08J60q88j335n63P25J547
52961C06119J715J651J656J716J664J252L21q42j542j339n85j14m48j362k145
52946C07717k232j683j078r29j192j454j530j627j926k236k197j638p16J78N40
52931B87997J15o81r53k80O09N08q49k402k912k200r93Q8Q79J275J111O29M25
52914B82366O56P38K81k31j86J16n4n74o01N8N93M71J58J57J19l99r69q50j47
52895B81702M18O15P66Q32L30p09j453j289n94j14N1L50R43J319R18j30j008r85
52877B81962j35Q38J409J641J731J589J150P55Q19J187J342J192J250J949L125
52862C01804M231M795M565L558K108P05l56j074j594k080k629l103l174k769k362
$$ plain form
52978 299875 303659 306809 308984 309994 310038 309498 308531 307243 306168 305965 306473 306633 305745 304410 303847 304572 306119
52961 306119 307834 309485 311141 312857 314521 315773 316094 315252 313710 312371 311786 311672 311224 309862 307717
52946 307717 305485 303802 302724 301795 300603 299149 297619 295992 294066 291830 289633 287995 287279 287457 287997
52931 287997 288112 287431 286478 286198 286807 287315 286466 284064 281152 278952 277959 278047 278926 280201 281312 281941 282366
52914 282366 283022 283760 284041 283810 283624 283740 283686 283112 282511 282569 283162 283633 283791 283948 284067 283668 282699 281849 281702
52895 281702 282120 282735 283501 284333 284663 283954 282501 281212 280618 280504 280555 280905 281848 283167 284085 283955 282947 281962
52877 281962 281827 282665 284074 285715 287446 289035 290185 290940 291759 292946 294288 295480 296730 298679 301804
52862 301804 306035 310830 315395 318953 321061 321766 321410 320336 318742 316662 314033 310930 307756 304987 302625
52847C02625k467k914l047k618k037j705j532j262r49q50j091j600k170k518k421
52832B73444j956j378q11k57J07J9m28p45o13j85K74O58Q19M89k53q10o55k2M10
52813B68107L09k4p5M14J271K014K235K017J831J879J775J108M9r02j541j977
52797B78490k127j738r87n64r09j628j957j681j287j250j419j254n75J59L64K7
52781B61664k46J06R99J800J966J510Q73M62L24K81K19K14L13L93K83l1m35q35
52763B69860j155j250r99m88J3L09L89K75m2n04r64j258j195n08Q73K408L124
52746B68888K508J189L75O12J332J692J628J725K222K583K247J461R35R86J360
52731B91743J809K258K432J918Q59M2m6K16K74J81J87O4m84j056j045o79p60j356
$$ plain form
52847 302625 300158 297244 294197 291579 289542 287837 286305 285043 284094 283244 282153 280553 278383 275865 273444
52832 273444 271488 270110 269299 269042 269149 269168 268740 267995 267382 267197 267471 268129 268948 269437 269184 268374 267719 267697 268107
52813 268107 268416 268392 268317 268731 270002 272016 274251 276268 278099 279978 281753 282861 282910 282008 280467 278490
52797 278490 276363 274625 273638 273074 272165 270537 268580 266899 265612 264362 262943 261689 261114 261273 261637 261664
52781 261664 261418 261524 262523 264323 266289 267799 268672 269134 269458 269739 269958 270172 270485 270878 271161 271130 270695 269860
52763 269860 268705 267455 266456 265968 265981 266290 266679 266954 266912 266408 265444 264186 262991 262483 263356 265764 268888
52746 268888 271396 272585 272960 273572 274904 276596 278224 279949 282171 284754 287001 288462 289397 290383 291743
52731 291743 293552 295810 298242 300160 301019 301061 301015 301231 301505 301686 301873 301937 301453 300397 299352 298673 297913 296557
52713B96557j649j261q95j274k104k563k319j655r16l97l62p74j113q88k12L54
52697B78529M82L16J76J93K89L95P62J734K970L202J490j250k856k312p83J05
52681B83442K06L79Q37R70N17m6k64j53J77O29Q65N34j08l63k1L83L95K27L31
52662B88937P60J184J298R89M18jQ8N85J074J325J470J673K005K577L352L779
52646C11513L147J495k67j337j730j760j370m17O64J100O00m02j286j743j750
52631C06457j407q80l47M4J73M7o7J93P41R17J77j179k247k459j923j018l5O93
52613B97880Q29L89j39k80j4L79P05Q79Q38O48N07M61K94K9J87J045J836J397
52595C07870k46j614j440j23R75J192R41P31N52L32K86N43Q76J063J206J490J817
$$ plain form
52713 296557 294908 293647 292752 291478 289374 286811 284492 282837 281921 281524 281162 280388 279275 278387 278175 278529
52697 278529 279011 279327 279503 279696 279985 280380 281142 282876 285846 289048 290538 289288 286432 284120 283337 283442
52681 283442 283648 284027 284864 285834 286351 286305 286041 285888 286065 286694 287559 288093 287985 287622 287601 287984 288379 288606 288937
52662 288937 289697 290881 292179 293168 293586 293585 293673 294258 295332 296657 298127 299800 301805 304382 307734 311513
52646 311513 314660 316155 315888 314551 312821 311061 309691 309274 309938 311038 311638 311236 309950 308207 306457
52631 306457 305050 304170 303823 303867 304040 304087 304020 304213 304954 305871 306048 304869 302622 300163 298240 297222 297187 297880
52613 297880 298709 299098 298959 298679 298665 299044 299749 300628 301466 302114 302621 303082 303376 303405 303592 304637 306473 307870
52595 307870 307624 306010 304570 304447 305422 306614 307555 308286 308838 309170 309456 309999 310875 311938 313144 314634 316451
52578C16451J995J994J802J269M26k85m53l02m62j063j426r32Q0N50n4j052j311
52561C17227n59L69N87J02m82q10r68j020r24q22r52j221j285j122j026r32l47
52544C05815P82J662J562P48M0j89j56q6J5J05J47K81N87P92O27L31L73P42J020
52525C15198J075J218J562J781J674J516J634J944K160K194K147K083K032K087
52511C40305K371K932L680M340M566M295L884L619L170J901k17k396l825m315
52497C64310m119l532k892k599k754l037l132l077k946k528j700r44r09j484j750
52482C26907j005M47J675K056J707J208J096J523K121K273J689P85L43P21J537
52467C45083K143K318K324K450K750L217L896M647N043M745L827K609J251k53
$$ plain form
52578 316451 318446 320440 322242 323511 323937 323652 323199 322897 322435 321372 319946 319014 319094 319644 319590 318538 317227
52561 317227 316668 317037 317624 317726 317244 316434 315466 314446 313522 312700 311748 310527 309242 308120 307094 306162 305815
52544 305815 306597 308259 309821 310569 310609 310420 310264 310178 310193 310298 310445 310726 311313 312105 312732 313063 313436 314178 315198
52525 315198 316273 317491 319053 320834 322508 324024 325658 327602 329762 331956 334103 336186 338218 340305
52511 340305 342676 345608 349288 353628 358194 362489 366373 369992 373162 375063 374846 372450 368625 364310
52497 364310 360191 356659 353767 351168 348414 345377 342245 339168 336222 333694 331994 331050 330141 328657 326907
52482 326907 325902 326349 328024 330080 331787 332995 334091 335614 337735 340008 341697 342482 342825 343546 345083
52467 345083 347226 349544 351868 354318 357068 360285 364181 368828 373871 378616 382443 385052 386303 386050
52453C86050j817l262m476n327n559n072m309l964m172m362m050l494l244l276
52439C29666k950j825k37J055J574J417R73N29J32k26m66m63k40J3J06L2j42m13
52421C28535p71r77o23L93J502J915J480R10R45J579K338L104M073N019N227M528
52405C59177L873M404O220Q450J0321J1614J2224J1836J0276P762M687J316k095
52392D50065n125p289q293q209p492o742o216n625m569l160j965j362j165r58
52378C81895n68j48R0K27O71J752L159M119M326M359M798N272M960L887K877K239
52362D23915J308l08j848k339j913j481j347r19K44J693K635K759K314J700J196
52347D27609R59R66R49O36J68J30R63K391L648M301M566M722M587L977L331L366
$$ plain form
52453 386050 384233 380971 376495 371168 365609 360537 356228 352264 348092 343730 339680 336186 332942 329666
52439 329666 326716 324891 324654 325709 327283 328700 329673 330202 330334 330108 329642 329179 328939 328952 329058 329090 328948 328535
52421 328535 327764 326787 326164 326557 328059 329974 331454 332364 333309 334888 337226 340330 344403 349422 354649 359177
52405 359177 363050 367454 373674 382124 392445 404059 416283 428119 438395 446157 450844 452160 450065
52392 450065 444940 437651 429358 421149 413657 406915 400699 395074 390505 387345 385380 384018 382853 381895
52378 381895 381327 381179 381269 381496 382167 383919 387078 391197 395523 399882 404680 409952 414912 418799 421676 423915
52362 423915 425223 424915 423067 420728 418815 417334 415987 415068 415312 417005 419640 422399 424713 426413 427609
52347 427609 428568 429534 430483 431119 431287 431417 432380 434771 438419 442720 447286 452008 456595 460572 463903 467269
52331D67269M206N285O169O981P993R291J0874J2611J3976J4408J4065J3716J3662
52318F00506J3327J2299J1130J0615J0758J1096J1588J2505J3654J4528J5125
52307G37131J5901J6890J7469J7244J6589J6109J6020J6262J6725J7135J7011
52296I20486J6150J4843J3392J1604R072N826K420m94k479l396l517l514m018
52283I76375n041o005o440o481o574o890p152p011o291m893k842n75J100J825
52269I13105K231L238M834O057O367O390O942P743P844P087O511P113Q708J0340
52255A004510J1451J2318J3444J4838J6020J6620J6813J7005J7120J6421J4332
52244A170892J1240Q227O029M583L541K770K155J338M3j475k759l865n374p556
$$ plain form
52331 467269 471475 476760 482929 489910 497903 507194 518068 530679 544655 559063 573128 586844 600506
52318 600506 613833 626132 637262 647877 658635 669731 681319 693824 707478 722006 737131
52307 737131 753032 769922 787391 804635 821224 837333 853353 869615 886340 903475 920486
52296 920486 936636 951479 964871 976475 985547 991373 993793 993299 990820 987424 983907 980393 976375
52283 976375 971334 965329 958889 952408 945834 938944 931792 924781 918490 913597 910755 910180 911280 913105
52269 913105 915336 918574 923408 929465 935832 942222 949164 956907 964751 971838 978349 985462 994170 1004510
52255 1004510 1015961 1028279 1041723 1056561 1072581 1089201 1106014 1123019 1140139 1156560 1170892
52244 1170892 1182132 1190359 1196388 1200971 1204512 1207282 1209437 1210775 1210818 1209343 1206584 1202719 1197345 1189789
52230A189789r868j1507j2289j2646j2857j2685j1916j0884j0135r673q956p668
52218A058705o202n158m658m326l854l297k838k411j735o60N57J434J755J823
52204A029135K083K609L165L663M186M590M502L981L720M225N139N799O200O791
52190A089788P520P838P667P639P987P901O593M519K774J551K3k241m568o234
52176A138757p486q915j0298j0838j0378r629r068q315o852m896l163k087j548
52163A045284j091j92J407L243M438M751M885N323N337L945J571k67q93j151j906
$$ plain form
52230 1189789 1179921 1168414 1156125 1143479 1130622 1117937 1106021 1095137 1085002 1075329 1066373 1058705
52218 1058705 1052503 1047345 1042687 1038361 1034507 1031210 1028372 1025961 1024226 1023566 1024123 1025557 1027312 1029135
52204 1029135 1031218 1033827 1036992 1040655 1044841 1049431 1053933 1057914 1061634 1065859 1070998 1076797 1082997 1089788
52190 1089788 1097308 1105146 1112813 1120452 1128439 1136340 1142933 1147452 1150226 1151777 1151800 1149559 1144991 1138757
52176 1138757 1131271 1122356 1112058 1101220 1090842 1081213 1072145 1063830 1056978 1052082 1048919 1046832 1045284
52163 1045284 1044193 1044001 1045408 1048651 1053089 1057840 1062725 1068048 1073385 1077330 1078901 1078634 1077741 1076590 1074684
$$ [...]
##END NTUPLES=NMR SPECTRUM
##END=
