##TITLE=AC1506_CUNDCR13313_8126553_ktEYUnGwJc
##JCAMPDX= 6.0         $$ Bruker NMR JCAMP-DX V2.0
##DATA TYPE= NMR SPECTRUM
##DATA CLASS= NTUPLES
##ORIGIN= BRUKER
##OWNER= Administrator
$$ 1.72 TOPSPIN		Version 2.1
$$ 2013-08-16 19:52:43.007 -0700  Administrator@X
$$ Compression mode = diff/dup
##.OBSERVE FREQUENCY= 400.02188249412
##.OBSERVE NUCLEUS= ^1H
##.ACQUISITION MODE= SIMULTANEOUS (DQD)
##.ACQUISITION SCHEME= undefined
##.AVERAGES= 64
##.DIGITISER RES= 22
##SPECTROMETER/DATA SYSTEM= spect
##.PULSE SEQUENCE= noesygpps1d.comp
##.SOLVENT NAME= COFFEE_meoh
##.SHIFT REFERENCE= INTERNAL, COFFEE_meoh, 1, 14.96097
##AUDIT TRAIL= $$ (NUMBER, WHEN, WHO, WHERE, PROCESS, VERSION, WHAT)
$$ ##TITLE= Audit trail, TOPSPIN		Version 2.1
$$ ##JCAMPDX= 5.01
$$ ##ORIGIN= Bruker BioSpin GmbH
$$ ##OWNER= Administrator
$$ $$ E:\/data/COFFEE/nmr/AC1506_CUNDCR13313_8126553_ktEYUnGwJc/22/pdata/1/auditp.txt
$$ ##AUDIT TRAIL=  $$ (NUMBER, WHEN, WHO, WHERE, PROCESS, VERSION, WHAT)
(   1,<2013-08-16 19:52:38.100 -0700>,<Administrator>,<X>,<go>,<TOPSPIN 2.1>,
      <created by zg
	started at 2013-08-16 19:41:08.100 -0700,
	POWCHK enabled, PULCHK disabled,
       configuration hash MD5:
       C8 4E 4E 5D D3 5C D8 9E 9F 52 82 E0 59 8A DE 15
       data hash MD5: 64K
       E1 9A 4D 78 78 32 FD F4 68 6E 47 94 CE 93 FC F2>)
(   2,<2013-08-16 19:52:41.053 -0700>,<Administrator>,<X>,<proc1d>,<TOPSPIN 2.1>,
      <Start of raw data processing
       efp LB = 0.3 FT_mod = 6 PKNL = 1 PHC0 = 0 PHC1 = 0 SI = 128K 
       data hash MD5: 128K
       45 E7 56 2A DA 5D B7 0E 9E 3F 2B 4C 44 35 79 BC>)
(   3,<2013-08-16 19:52:42.053 -0700>,<Administrator>,<X>,<proc1d>,<TOPSPIN 2.1>,
      <pk PHC0 = -80.0354 PHC1 = 0 
       data hash MD5: 128K
       A2 47 78 26 BE 16 28 6C 1D 83 20 0A 19 1F 7A 70>)
(   4,<2013-08-16 19:52:42.444 -0700>,<Administrator>,<X>,<proc1d>,<TOPSPIN 2.1>,
      <abs ABSG = 1 
       data hash MD5: 128K
       05 51 FA 49 61 22 F0 0B 15 48 4D 36 A0 2C A3 5F>)
(   5,<2013-08-16 19:52:42.585 -0700>,<Administrator>,<X>,<proc1d>,<TOPSPIN 2.1>,
      <abs ABSG = 2 
       data hash MD5: 128K
       A8 3C CC AF 28 C1 F7 2E 17 52 65 74 E5 FC 30 0B>)
(   6,<2013-08-16 19:52:42.678 -0700>,<Administrator>,<X>,<proc1d>,<TOPSPIN 2.1>,
      <abs ABSG = 3 
       data hash MD5: 128K
       55 01 1A 5F 65 A3 D8 36 EA 71 6B 19 57 9E 42 0F>)
(   7,<2013-08-16 19:52:42.757 -0700>,<Administrator>,<X>,<proc1d>,<TOPSPIN 2.1>,
      <abs ABSG = 4 
       data hash MD5: 128K
       16 54 BC 7B 94 EC 85 09 4C 24 6A 35 B6 29 E9 08>)
(   8,<2013-08-16 19:52:42.835 -0700>,<Administrator>,<X>,<proc1d>,<TOPSPIN 2.1>,
      <abs ABSG = 5 
       data hash MD5: 128K
       A2 DE 7E 44 D2 AE 9A F0 69 3E 80 78 79 F8 F1 3B>)
$$ ##END=
$$ 
$$ $$ hash MD5
$$ $$ F5 47 B8 9A E4 8B 76 71 4F 01 7D 4B 10 C4 16 1A
##$RELAX= 
##$RELAX= 
##$RELAX= 
##$RELAX= 
##$RELAX= 
##$RELAX= 
##$RELAX= 
##$RELAX= 
$$ Bruker specific parameters
$$ --------------------------
##$DU= <E:\>
##$EXPNO= 22
$$ [...]
##$TP07= 0
##$TPNAME0= <>
##$TPNAME1= <>
##$TPNAME2= <>
##$TPNAME3= <>
##$TPNAME4= <>
##$TPNAME5= <>
##$TPNAME6= <>
##$TPNAME7= <>
##$TPOAL= (0..7)
0.5 0.5 0.5 0.5 0.5 0.5 0.5 0.5
##$TPOFFS= (0..7)
0 0 0 0 0 0 0 0
##$TUNHIN= 0
##$TUNHOUT= 0
##$TUNXOUT= 0
##$USERA1= <user>
##$USERA2= <user>
##$USERA3= <user>
##$USERA4= <user>
##$USERA5= <user>
##$V9= 5
##$VALIST= <valist>
##$VCLIST= <CCCCCCCCCCCCCCC>
##$VD= 0
##$VDLIST= <DDDDDDDDDDDDDDD>
##$VPLIST= <PPPPPPPPPPPPPPP>
##$VTLIST= <TTTTTTTTTTTTTTT>
##$WBST= 2048
##$WBSW= 25
##$XGAIN= (0..3)
0 0 0 0
##$XL= 0
##$YL= 0
##$YMAX_a= 5957742
##$YMIN_a= -12319737
##$ZGOPTNS= <>
##$ZL1= 120
##$ZL2= 120
##$ZL3= 120
##$ZL4= 120
##$ABSF1= 14.96097
##$ABSF2= -5.597212
##$ABSG= 5
##$ABSL= 3
##$ALPHA= 0
##$AQORDER= 0
##$ASSFAC= 0
##$ASSFACI= 0
##$ASSFACX= 0
##$ASSWID= 0
##$AUNMP= <proc_prof1d_extract.lims>
##$AXLEFT= 0
##$AXNAME= <>
##$AXNUC= <1H>
##$AXRIGHT= 0
##$AXTYPE= 0
##$AXUNIT= <>
##$AZFE= 0.1
##$AZFW= 0.1
##$BCFW= 0
##$BC_mod= 0
##$BYTORDP= 0
##$COROFFS= 0
##$CY= 15
##$DATMOD= 1
##$DC= 0
##$DFILT= <>
##$DTYPP= 0
##$F1P= 0
##$F2P= 0
##$FCOR= 0.5
##$FTSIZE= 131072
##$FT_mod= 6
##$GAMMA= 0
##$GB= 0
##$INTBC= 1
##$INTSCL= 1
##$ISEN= 128
##$LB= 0.3
##$LEV0= 0
##$LPBIN= 0
##$MAXI= 10000
##$MC2= 0
##$MEAN= 0
##$ME_mod= 0
##$MI= 0
##$NCOEF= 0
##$NC_proc= -2
##$NLEV= 6
##$NOISF1= 0
##$NOISF2= 0
##$NSP= 0
##$NTH_PI= 0
##$NZP= 0
##$OFFSET= 14.96097
##$PC= 1
##$PHC0= -80.0354
##$PHC1= 0
##$PH_mod= 1
##$PKNL= yes
##$PPARMOD= 0
##$PPDIAG= 0
##$PPIPTYP= 0
##$PPMPNUM= 2147483647
##$PPRESOL= 1
##$PSCAL= 4
##$PSIGN= 0
##$PYNMP= <proc.py>
##$REVERSE= no
##$SF= 400.020009650459
##$SI= 131072
##$SIGF1= 0
##$SIGF2= 0
##$SINO= 400
##$SIOLD= 131072
##$SPECTYP= <>
##$SREGLST= <1H.CDCl3>
##$SSB= 0
##$STSI= 131072
##$STSR= 0
##$SW_p= 8223.68421052631
##$SYMM= 0
##$S_DEV= 0
##$TDeff= 65536
##$TDoff= 0
##$TI= <>
##$TILT= no
##$TM1= 0
##$TM2= 0
##$TOPLEV= 0
##$USERP1= <user>
##$USERP2= <user>
##$USERP3= <user>
##$USERP4= <user>
##$USERP5= <user>
##$WDW= 1
##$XDIM= 131072
##$YMAX_p= 409221580
##$YMIN_p= -11232
##$CURPLOT= <Network HP LaserJet P1505>
##$CURPRIN= <$Network HP LaserJet P1505>
##$DFORMAT= <normdp>
##$LAYOUT= <+/1D_H.xwp>
##$LFORMAT= <normlp>
##$PFORMAT= <normpl>
##$SURQMSG= 1
$$ End of Bruker specific parameters
$$ ---------------------------------
##NTUPLES= NMR SPECTRUM
##VAR_NAME=  FREQUENCY,     SPECTRUM/REAL,   SPECTRUM/IMAG
##SYMBOL=    X,             R,               I
##VAR_TYPE=  INDEPENDENT,   DEPENDENT,       DEPENDENT
##VAR_FORM=  AFFN,          ASDF,            ASDF
##VAR_DIM=   131072,        131072,          131072
##UNITS=     HZ,            ARBITRARY UNITS, ARBITRARY UNITS
##FACTOR=    0.0627417313425164, 1,          1
##FIRST=     8223.62146879497, 1364,         -56625
##LAST=      0,             2372,            -56649
##MIN=       0,             -11232,          0
##MAX=       8223.62146879497, 409221580,    0
$$ Real data points
##PAGE= N=1
##DATA TABLE= (X++(R..R)), XYDATA
$$ [...]
61681D57590l652l585k922k330k176k174k225k638l204l051j975j041j166j882
61667D23569k188j999j876j907j691j204q38o68l49L11J068J558J569J140O59
61652D17154O17J011J300J182J051J383K015K491K644K447J696M97l08J15J484
61637D36779K630K821K325J698J012L4j240k382k847k492j799j438j561j813k024
61622D29703k456l143l568l399l105l225l462l147k363j848j913k138k211k385
61608C91340k892l452l671l551l360l274l324l480l591l465l085k628k211j871
61594C47485j801k262l111l687l486k775k260k209k200j746r54l95m89j190k139
61579C16781k911l160k796k135j624j374j104p13n11o46o58r2O89R48P23Q25J549
$$ plain form
61681 457590 453938 450353 447431 445101 442925 440751 438526 435888 432684 429633 427658 426617 425451 423569
61667 423569 421381 419382 417506 415599 413908 412704 411866 411198 410849 411160 412228 413786 415355 416495 417154
61652 417154 417771 418782 420082 421264 422315 423698 425713 428204 430848 433295 434991 435488 435180 435295 436779
61637 436779 439409 442230 444555 446253 447265 447299 446059 443677 440830 438338 436539 435101 433540 431727 429703
61622 429703 427247 424104 420536 417137 414032 410807 407345 404198 401835 399987 398074 395936 393725 391340
61608 391340 388448 384996 381325 377774 374414 371140 367816 364336 360745 357280 354195 351567 349356 347485
61594 347485 345684 343422 340311 336624 333138 330363 328103 325894 323694 321948 320994 320599 320110 318920 316781
61579 316781 313870 310710 307914 305779 304155 302781 301677 300964 300453 299807 299149 299057 299746 300694 301417 302242 303791
61562C03791K105J762R79P41J107J141L38n90o22K79J245J659J777K084K517K636
61546C22949K344J908J385N73l88r07p77n33o50p82l03P41J759K404K671K492
61530C34886J887J296J051P60o7j004j160o26m80j197j981k014j545j293j399
61515C27114j477j207m99M68J175J133O42N69J160J673J438P04Lo44j396j990
61499C28866k071j721j282q88n46l28j68J72O47Q82P67O52O99O42M09L20L78J30
61481C27560l23j50Q37J450P64l12j35J398K871L356L245L118K826K074J057J56
61465C49792n31j037j250j043m90R9L25on68p44l58Q3K02K83O76J103J066O40
61447C48242L04K34L02N71J157J790K048J936J750J543J276J269J845K578K608
$$ plain form
61562 303791 305896 307658 308637 309378 310485 311626 311964 311374 310752 311031 312276 313935 315712 317796 320313 322949
61546 322949 325293 327201 328586 329159 328771 327864 327087 326554 325904 325122 324819 325560 327319 329723 332394 334886
61530 334886 336773 338069 339120 339880 339813 338809 337649 337023 336543 335346 333365 331351 329806 328513 327114
61515 327114 325637 324430 323931 324399 325574 326707 327349 327918 329078 330751 332189 332893 332896 332252 330856 328866
61499 328866 326795 325074 323792 322904 322358 322030 321862 322034 322681 323563 324330 324982 325681 326323 326732 327052 327430 327560
61481 327560 327237 327087 327924 329374 330138 329826 329691 331089 333960 337316 340561 343679 346505 348579 349636 349792
61465 349792 349261 348224 346974 345931 345441 345540 345865 345859 345291 344547 344189 344272 344474 344757 345433 346536 347602 348242
61447 348242 348546 348780 349082 349653 350810 352600 354648 356584 358334 359877 361153 362422 364267 366845 369453
61432C69453J807J042J126J933K678K690J787L00j089j751j565r26l56j04m4J48
61416C77129O39J233J641J911K238K454K162J430P59K30n98j678k235j925j496
61401C83894j657k045k102k164k712l134k450r67M0J63K67R10J457J121R8p72
61385C69947q95k58P10J355J303Q58O34P69R04Q55Q64J162J660K108K245J928
61369C86149J372J066J148J133O85K84N16J075J190Q61Q60J515K284K604K580
61354D05322K646K993L492L870M016M246N053O299P109O940O287N834N463M846
61340D74416M363M477M686M260L646L927N022N678N275M410L547K347O75p98j577
61325E24354j985k446k819k854k568j952j000k25k65p92o74M66J848K950M308
$$ plain form
61432 369453 371260 372302 373428 375361 378039 380729 382516 382816 381727 379976 378411 377485 377129 377025 376981 377129
61416 377129 377768 379001 380642 382553 384791 387245 389407 390837 391596 391826 391228 389550 387315 385390 383894
61401 383894 382237 380192 378090 375926 373214 370080 367630 366663 366703 366866 367133 368043 369500 370621 370719 369947
61385 369947 369052 368794 369504 370859 372162 373020 373654 374423 375327 376182 377046 378208 379868 381976 384221 386149
61369 386149 387521 388587 389735 390868 391553 391837 392353 393428 394618 395479 396339 397854 400138 402742 405322
61354 405322 407968 410961 414453 418323 422339 426585 431638 437937 445046 451986 458273 464107 469570 474416
61340 474416 478779 483256 487942 492202 495848 499775 504797 510475 515750 520160 523707 526054 526729 525931 524354
61325 524354 522369 519923 517104 514250 511682 509730 508730 508505 508240 507448 506774 507240 509088 512038 516346
61310E16346O302Q227R317R859J0520J1251J1783J2507J3924J5491J6001J5011
61298F56539J3180J1265R303O857L612k52l999o710p941q112q134q755j0145j1785
61284F34923j2790j2642j1653j0498r461q491p723p275o644n117k857q64L07J067
61270E40282J872K536K763K703K626K662L032L889M715M609L532K626K837L921
61256E84605N094O001O603O728O305N618M961M365L866L525L044J957M47p70j519
61241F40830k337l313l732l284k704k631k691k337j718j108k54Q95J648J593J499
61226F20356K343L971N485O477P093P473P836Q626R780J0470J0295J0067J0563
61213G20835J1182J0811R478Q042O831N660M753M418M108L113J889J517J928K091
$$ plain form
61310 516346 522648 530875 540192 550051 560571 571822 583605 596112 610036 625527 641528 656539
61298 656539 669719 680984 690287 697144 700756 700504 696505 689795 681854 673742 665608 656853 646708 634923
61284 634923 622133 609491 597838 587340 577879 569388 561665 554390 547746 542629 539772 538908 539215 540282
61270 540282 542154 544690 547453 550156 552782 555444 558476 562365 567080 571689 575221 577847 580684 584605
61256 584605 589699 595700 602303 609031 615336 620954 625915 630280 634146 637671 640715 642672 643119 642349 640830
61241 640830 638493 635180 631448 628164 625460 622829 620138 617801 616083 614975 614721 615616 617264 618857 620356
61226 620356 622699 626670 632155 638632 645725 653198 661034 669660 679440 689910 700205 710272 720835
61213 720835 732017 742828 752306 760348 767179 772839 777592 782010 786118 789231 791120 792637 794565 796656
61199G96656J919K618M787P454R473J0856J2158J3427J4459J5383J6259J6564
61187I22013J5653J3581J1009Q517O258M182K313Q44m3m49q24j522k450l312m085
61172I71685m999o164p444q586r429j0132j1194j2813j4227j4418j3645j3383
61160H45251j4349j5552j5967j6100j6777j7353j6563j4635j2947j1840j0365
61149F82803q245o491n653m829l148j176j78o23k037l701n027n714n910n901n544
61134F18626m496l003j742q14L50J909L310M349N727Q078J1071J3825J5749J6693
61120F89632J6929J7331J8917K1776K4923K7497K9550L1394L2873L3724L4071
61109I78617L4135L3806L2911L1530K9759K7586K5213K3019K0961J8541J5494
$$ plain form
61199 796656 798575 801193 805980 813434 822907 833763 845921 859348 873807 889190 905449 922013
61187 922013 937666 951247 962256 970773 977031 981213 983526 984370 984327 983878 983054 981532 979082 975770 971685
61172 971685 966686 960522 953078 944492 935063 924931 913737 900924 886697 872279 858634 845251
61160 845251 830902 815350 799383 783283 766506 749153 732590 717955 705008 693168 682803
61149 682803 674558 668067 662414 657585 654437 653261 653083 652460 650423 646722 641695 635981 630071 624170 618626
61134 618626 614130 611127 609385 608571 608921 610830 614140 618489 624216 632294 643365 657190 672939 689632
61120 689632 706561 723892 742809 764585 789508 817005 846555 877949 910822 944546 978617
61109 978617 1012752 1046558 1079469 1110999 1140758 1168344 1193557 1216576 1237537 1256078 1271572
61098A271572J1999Q041L324j956o969j1340j5564j9943k3811k6376k7745k8607
61086A132625k9444l0474l1714l2577l2110l0173k7817k5931k4287k2425k0690
61075H24983j9504j8357j6544j4339j2485j0958r263p564o405n599m446k957j740
61062F94822q25L73J872K953L383L779M584N509O348P500R277J1313J3076J4472
61048G78436J5618J6464J7039J7751J9110K1269K3887K6353K8212K9618L1190
61037A024947L3127L4801L5629L5954L6495L7226L7591L7568L7749L8456L9535
61026A429078M0898M2518M4051M5319M6854M9016N0852N1093N0190N0058N1833
61015A951760N5263O0405O8170P8760R1109J04591J19821J37312J57013J79908
$$ plain form
61098 1271572 1283571 1291612 1294936 1292980 1286011 1274671 1259107 1239164 1215353 1188977 1161232 1132625
61086 1132625 1103181 1072707 1040993 1008416 976306 946133 918316 892385 868098 845673 824983
61075 824983 805479 787122 770578 756239 743754 732796 723533 715969 709564 703965 699519 696562 694822
61062 694822 693997 694370 696242 699195 702578 706357 710941 716450 722798 730298 739575 750888 763964 778436
61048 778436 794054 810518 827557 845308 864418 885687 909574 935927 964139 993757 1024947
61037 1024947 1058074 1092875 1128504 1164458 1200953 1238179 1275770 1313338 1351087 1389543 1429078
61026 1429078 1469976 1512494 1556545 1601864 1648718 1697734 1748586 1799679 1849869 1899927 1951760
61015 1951760 2007023 2067428 2135598 2214358 2305467 2410058 2529879 2667191 2824204 3004112
61005C004112K08264K43499K85861L37248M01834M82326N78478O91834Q28794
60996G062250R95271J191305J415758J671043J949585K209341K371767K356886
60988B1223206K126393J698175J134578N32376J6988k88292l25008j47231R8629
60979B6069814K52194K09876n7247n19967j101721j683266k132107k359105k358520
60970A6319951k194034j947680j679831j422966j192522r93915q25148o81832
60962E382023n61757m63826l84998l21347k70813k32364k03385j80312j61266
60953B601955j45900j33131j21169j09489r8841q9282p9955p0828o3025n7245
60943A633090n3285n1044n0611n1233n1594n1259n0612m9386m6772m3128m0039
$$ plain form
61005 3004112 3212376 3455875 3741736 4078984 4480818 4963144 5541622 6233456 7062250
60996 7062250 8057521 9248826 10664584 12335627 14285212 16494553 18866320 21223206
60988 21223206 23349599 25047774 26182352 26714728 26731716 26443424 26118416 25971185 26069814
60979 26069814 26322008 26531884 26474637 25954670 24852949 23169683 21037576 18678471 16319951
60970 16319951 14125917 12178237 10498406 9075440 7882918 6889003 6063855 5382023
60962 5382023 4820266 4356440 3971442 3650095 3379282 3146918 2943533 2763221 2601955
60953 2601955 2456055 2322924 2201755 2092266 1993425 1904143 1824188 1753360 1690335 1633090
60943 1633090 1579805 1528761 1478150 1426917 1375323 1324064 1273452 1224066 1177294 1134166 1094127
60932A094127l8207l6672l4475l1839k9188k6428k3823k2270k1834k1165j9246
60921G88980j6779j4961j3751j2385j0827r649q951q369p819p382o791n756m543
60908F61017l575k722j652n77N1L88R97J833K106J329K9q10p68l11k44r28k054
60891F54109l086l738l952l732l317l260l860m673n031m916m835n042n499o257
60877E92911p152p403o553n596n988p547q600q400p931p904p548o159m558l768
60863D97804l348k270o13Q26J963L251M502N119N177N205N143M467L194J794M06
60848E32620r28j510n67J474L250L985L912L218J623p67l091m583n242n487n584
60833E22323n600n470n023m270l599l270k957k214j246n54r1N35J125R63j0q68
$$ plain form
60932 1094127 1055920 1019248 984773 952934 923746 897318 873495 851225 829391 808226 788980
60921 788980 772201 757240 743489 731104 720277 710628 701677 693308 685489 678107 671316 665560 661017
60908 661017 657442 654720 653068 652491 652542 652930 653927 655760 657866 659195 659224 658414 657646 657335 657091 656163 654109
60891 654109 651023 647285 643333 639601 636284 633024 629164 624491 619460 614544 609709 604667 599168 592911
60877 592911 585759 578356 571803 566207 560219 552672 544072 535672 527741 519837 512289 506130 501572 497804
60863 497804 494456 492186 491573 492399 494362 497613 502115 507234 512411 517616 522759 527226 530420 532214 532620
60848 532620 531692 530182 529615 531089 534339 538324 542236 545454 547077 546310 543219 538636 533394 527907 522323
60833 522323 516723 511253 506230 501960 498361 495091 492134 489920 488674 488120 488029 488564 489689 490652 490642 489774
60817D89774q14j47J41o05k176l698m274l757k896k480k544k690k863l229l545
60802D54197l405l030l087l645m010l771l380l350l471l239k767k717l430m458
60788D06437n012m734l885k908j998j230p96p38o44r7N78O66K05K5M18O27N9o72
60770C86301o40J63J100J907K723L494M075M551M940M994M755M768N083M807L438
60755D36459J911J319J264O40m58j036j010j353k404l361l550l075k126q02K85
60740D22703K64q72k368l905n636p027p068n928n132n529o173n813m497l068j979
60725C57972j333j285j651j713j065k02K43L50M84N70L59%j40lK31L83K24m48
60707C52976j374j870j515n63N00J422K070K319K213J952J658J499J850K788L572
$$ plain form
60817 489774 488960 488813 488954 488349 486173 482475 478201 474444 471548 469068 466524 463834 460971 457742 454197
60802 454197 450792 447762 444675 441030 437020 433249 429869 426519 423048 419809 417042 414325 410895 406437
60788 406437 401425 396691 392806 389898 387900 386670 385874 385136 384492 384395 384973 385639 385844 385869 386287 386914 386973 386301
60770 386301 385661 385824 386924 388831 391554 395048 399123 403674 408614 413608 418363 423131 428214 433021 436459
60755 436459 438370 439689 440953 441593 441135 440099 439089 437736 435332 431971 428421 425346 423220 422418 422703
60740 422703 422967 422095 419727 415822 410186 403159 396091 390163 385031 379502 373329 367516 363019 359951 357972
60725 357972 356639 355354 353703 351990 350925 350723 350966 351316 351800 352370 352729 352729 352589 352586 352817 353200 353424 352976
60707 352976 351602 349732 348217 347654 348154 349576 351646 353965 356178 358130 359788 361287 363137 365925 369497
60692C69497L388K505J924J949K056K102K579L395L623K973K480L045M149M698
60678D10363M461L940L395K726J993J333P00P3l52n31p62j213j640j868k097k508
60662D18013l009l567m233m716m509l689k951k577k160j496j000q46n51J35P46
60647C83590J024J479K416L153K910J880P36l46j496k513l122l483l805l865l433
60632C75125k731k001j122j13N15M54O5k84p44j316j394o54K69P02Q73J191J270
60615C70105O71rJ21P88Q96J44o66q19l59L37Q53P69J05l94j36M58N90L50M19
60596C74223P82P87L71K31O56J135J388J803K522K907K500J837J651J704J189
60581C95686O6p00m21L93Q07P23Q52J462J938J865J895K865M479N701O317P165
$$ plain form
60692 369497 372885 375390 377314 379263 381319 383421 386000 389395 393018 395991 398471 401516 405665 410363
60678 410363 414824 418764 422159 424885 426878 428211 428911 428984 428632 428101 427339 426126 424486 422618 420521 418013
60662 418013 415004 411437 407204 402488 397979 394290 391339 388762 386602 385106 384106 383260 382709 382844 383590
60647 383590 384614 386093 388509 391662 394572 396452 397188 396842 395346 392833 389711 386228 382423 378558 375125
60632 375125 372394 370393 369271 369158 369673 370127 370192 369908 369164 367848 366454 365800 366069 366771 367644 368835 370105
60615 370105 370776 370767 370888 371676 372572 372716 372050 371231 370872 371209 372062 372831 372936 372542 372406 372864 373454 373804 374223
60596 374223 375005 375792 376163 376394 377050 378185 379573 381376 383898 386805 389305 391142 392793 394497 395686
60581 395686 395752 395052 394631 395024 395831 396554 397406 398868 400806 402671 404566 407431 411910 417611 423928 431093
60565D31093Q787J0720J2269J3219J3530J3191J2566J2072J1207Q854M962J008
60553E53478j764l656n508p243q249q394p852o593m740k862j160R02L539N916
60539E05814P345Q356R726J1221J2336J3446J5048J6559J7109J6947J6704J5860
60527F66471J3383R551N608J887k130n971q130q185p531p496p948q180q035p570
60513F25724o652n449m551m104l557k629j775j266n47R63L062N261P579J0312
60499F22371J3410J6586J9849K3608K8247L3623L8976M3449M6915M9913N2465
60488I89412N3464N1858M7891M2333L5033K5359J3813J903r665k1285l2753m2581
60476A154782m9605n4171n7011n7882n6225n2531m8162m4051m0174l6080l1496
$$ plain form
60565 431093 439880 450600 462869 476088 489618 502809 515375 527447 538654 547508 552470 553478
60553 553478 551714 548058 542550 535307 527058 518664 510812 504219 499479 496617 495457 496359 499898 505814
60539 505814 513159 521515 531241 542462 554798 568244 583292 599851 616960 633907 650611 666471
60527 666471 679854 689405 695013 696900 694770 688799 680669 672484 664953 657457 649509 641329 633294 625724
60513 625724 619072 613623 609072 604968 601411 598782 597007 595741 595194 596157 599219 604480 612059 622371
60499 622371 635781 652367 672216 695824 724071 757694 796670 840119 887034 936947 989412
60488 989412 1042876 1094734 1142625 1184958 1219991 1245350 1259163 1261066 1251401 1230116 1197363 1154782
60476 1154782 1105177 1051006 993995 936113 879888 827357 779195 735144 694970 658890 627394
60465F27394k6635k2192j8850j6575j4709j2863j1260j0094r126q128p272o716
60453D62974o346o090o007n801m863l272k152k470l788m751m588l644k608j753
60439D04841j000k90K77N38M39O1m88j136j690j782j195k20N49P59M65j32q62
60422C99134j581k200k682k831k333j220p9O16J057J600K023J866J371J310J870
60407C97921K393K336J938J719J739J664J311Q79P38J077J698K244K617K863K704
60392D25841J787N80L16J447K855L283K933K711K564J807P16L62Q62J093M83q4
60376D49556L22J378K152K284K069J894K054K587L009K726J881J309J377J581
60362D76179J456J211J144J064P58N11P14J344K174L105M008M596M799M973N467
$$ plain form
60465 627394 600759 578567 559717 543142 528433 515570 504310 494216 485090 476962 469690 462974
60453 462974 456628 450538 444531 438730 433867 430595 428443 425973 422185 417434 412846 409202 406594 404841
60439 404841 403841 403551 403828 404366 404805 404866 404378 403242 401552 399770 398575 398355 398904 399663 400128 399996 399134
60422 399134 397553 395353 392671 389840 387507 386287 386208 386824 387881 389481 391504 393370 394741 396051 397921
60407 397921 400314 402650 404588 406307 408046 409710 411021 411900 412638 413715 415413 417657 420274 423137 425841
60392 425841 427628 428208 428524 429971 432826 436109 439042 441753 444317 446124 446840 447202 448064 449157 449640 449556
60376 449556 449878 451256 453408 455692 457761 459655 461709 464296 467305 470031 471912 473221 474598 476179
60362 476179 477635 478846 479990 481054 481812 482323 483037 484381 486555 489660 493668 498264 503063 508036 513503
60347E13503O201O852P173P095O661N940M824L101R28j065k533l829n189o011
60333E43651n787n228n363n839n454m267l682m226m620l732k241j515j800k353
60319D87544k678k772k621k166j452m13J127K885M131M605M874N476O275O977
60305E11792P667Q461R274J0339J2233J4917J7311J8351J7852J5965J2509P538
60293F64209J923l324p886j1766j4536j5689j5422j4464j3248j1746r856p641
60281E40554n411l784l240l359l126k338k034k962m299m658l939l337l656m427
60267D89984m689m057k948k119k092k787l606l934l514k490j349p60r66j389j219
60252D52065m69O9nk49j67J62N07Q81J230J304J130J082J171Q70j6r24j281j151
$$ plain form
60347 513503 519704 526556 533729 540824 547485 553425 558249 561350 562278 561213 558680 554851 549662 543651
60333 543651 537864 532636 527273 521434 515980 511713 508031 503805 499185 495453 493212 491697 489897 487544
60319 487544 484866 482094 479473 477307 475855 475442 476569 479454 483585 488190 493064 498540 504815 511792
60305 511792 519459 527920 537194 547533 559766 574683 591994 610345 628197 644162 656671 664209
60293 664209 666132 662808 654922 643156 628620 612931 597509 583045 569797 558051 548195 540554
60281 540554 535143 531359 528119 524760 521634 519296 517262 514300 510001 505343 501404 498067 494411 489984
60267 489984 485295 481238 478290 476171 474079 471292 467686 463752 460238 457748 456399 455639 454673 453284 452065
60252 452065 451596 451665 451660 451411 451244 451406 451913 452794 454024 455328 456458 457540 458711 459581 459565 458641 457360 456209
60234D56209p72q7Q55J645K108K586L216L480K980K182J847K101K575L040L529
60219D87494M041M570N064N295N120M936N340O253P025P541Q338R446J0044R761
60205E80268R398R707J0253J0188R488Q742Q234P892P635P167N948L972K121J165
60191F82178Q37L93m25j397k307k957l237l527m461n917o997p348p662q333q595
60176F20245p799o606o056o086n940n414m829m266l702l402l399l096k200j446
60162E56004j559j999j707o77J68L41J57j0n0J09M02N17M42O90J545K548L252
60145E60173L784M134L742K565J697J990K815L272L799N300P310Q463Q449Q186
60131F25679Q200Q144P830P565P396O945O114N181M287L499L065L012K910K694
$$ plain form
60234 456209 455437 455350 456205 457850 459958 462544 465760 469240 472220 474402 476249 478350 480925 483965 487494
60219 487494 491535 496105 501169 506464 511584 516520 521860 528113 535138 542679 551017 560463 570507 580268
60205 580268 589666 599373 609626 619814 629302 638044 646278 654170 661805 668972 674920 678892 681013 682178
60191 682178 683015 683408 682983 681586 679279 676322 673085 669558 665097 659180 652183 644835 637173 628840 620245
60176 620245 612446 605840 599784 593698 587758 582344 577515 573249 569547 566145 562746 559650 557450 556004
60162 556004 554445 552446 550739 550062 550230 550571 550728 550718 550668 550777 551179 551696 552138 552828 554373 556921 560173
60145 560173 563957 568091 571833 574398 576095 578085 580900 584172 587971 593271 600581 609044 617493 625679
60131 625679 633879 642023 649853 657418 664814 671759 677873 683054 687341 690840 693905 696917 699827 702521
60117G02521L114M400N314M737L517L269L824L553K033N92Q3k09j021j953k505
60102G31269l071m209n716p022p854q144p930p551p379p198o438n136l919l092
60088F46610k393j669j037m21L09P75N13n9mP67J364J247Q10M80R3o21j700l199
60070F41865n108o933q040q514q970r550r774r400q662p715o637n880n832n984
60056E34866n375l942k524j590q59j76J82K21L39O61J127K165M220O586P803P478
60040E51182O788O850P610Q498R193R409Q837P747O821O128M989L116J069o24
60026F37613k016l229m256n424p152r001r826r225q049p331p495q646j0548j2112
60012E33303j2051j0490q915q184p650o627n513m773l932k467q68P6M25P36J099
$$ plain form
60117 702521 705635 710035 715349 720086 723603 726872 730696 734249 736282 736874 736957 736748 735727 733774 731269
60102 731269 728198 723989 718273 711251 703397 695253 687323 679772 672393 665195 658757 653621 649702 646610
60088 646610 644217 642548 641511 641090 641399 642174 642687 642628 642624 643391 644755 646002 646812 647292 647385 646764 645064 641865
60070 641865 636757 629824 621784 613270 604300 594750 584976 575576 566914 559199 552562 546682 540850 534866
60056 534866 529491 525549 523025 521435 520576 520400 520582 520803 521142 521803 522930 525095 529315 535901 543704 551182
60040 551182 557970 564820 572430 580928 590121 599530 608367 616114 622935 629063 634052 637168 638237 637613
60026 637613 635597 632368 628112 622688 615536 606535 596709 587484 579435 572104 564609 555963 545415 533303
60012 533303 521252 510762 501847 493663 486013 479386 473873 469100 465168 462701 461833 461909 462334 463070 464169
59997D64169J253J262J367J491J403J109P74N93R29K097L774N094N576N488N205
59982E01584M801M426M308M160L256J430o37k356l797n106o101o666o907o716
59968D85679n879m745l916l177j737K15J376J164O05P35J193J219J106J596K481
59953D77915K826K320J565J172J137J033N16k79o70j01J145K188K557K350J612
59938D97286L06j076j804j950k213k625k422j443n39k07J15Q97J716K236K952
59923D91229M272N686O587P165P778Q159P940P332O668N849M724L457K130O69
59909E69645n34p71j42L90M19N91J253J756J680J559J642J216N2p05k11N93M87
59892E78920MN47K113L388L718L677L897M415N021N420N231M584M308M848N495
$$ plain form
59997 464169 465422 466684 468051 469542 470945 472054 472828 473421 474350 476447 480221 485315 490891 496379 501584
59982 501584 506385 510811 515119 519279 522535 523965 523328 520972 517175 512069 505968 499302 492395 485679
59968 485679 479800 475055 471139 467962 466225 466440 467816 468980 469585 470320 471513 472732 473838 475434 477915
59953 477915 480741 483061 484626 485798 486935 487968 488484 488205 487535 487434 488579 490767 493324 495674 497286
59938 497286 497592 496516 494712 492762 490549 487924 485502 484059 483520 483313 483428 484325 486041 488277 491229
59923 491229 495501 501187 507774 514939 522717 530876 538816 546148 552816 558665 563389 566846 568976 569645
59909 569645 569111 568340 568198 568588 569007 569598 570851 572607 574287 575846 577488 578704 578756 578051 577840 578433 578920
59892 578920 578924 579471 581584 584972 588690 592367 596264 600679 605700 611120 616351 620935 625243 630091 635586
59877F35586N480N129N074M989M183K917J935J144j27j841l424m860o461p753
59863F41971p837o852n883n398m810l748k703k075j509o04L82R59J133J331J878
59848F06235K691L465M008M490N231O321P624R041J0248J0317Q431N154K101J35
59834F85492j228k255k192o88J103J928K018K078J592m88l782o621p960q147p957
59819F52893p835p974q201p956p042o172o040o327o306n966n597m884l523k239
59805E66831j995k397k203j222n36p71j362j624j602j581j645j818k011j856j301
59790E42907j061j722k637k744k230k279l208m009l897l171k351j536r41j067
59776E10054j811k211j567k92P23J114J098J023J147J528J900J975J896K094K678
$$ plain form
59877 635586 641066 646195 651269 656258 660441 663358 665293 666437 666310 664469 661045 656185 649724 641971
59863 641971 634134 627282 621399 616001 611191 607443 604740 602665 601156 600552 600934 601893 603026 604357 606235
59848 606235 608926 612391 616399 620889 626120 632441 640065 649106 659354 669671 678102 683256 685357 685492
59834 685492 684264 682009 679817 679129 680232 682160 684178 686256 687848 687360 683578 676957 668997 660850 652893
59819 652893 645058 637084 628883 620927 613885 607713 601673 595346 589040 583074 577477 572593 569070 566831
59805 566831 564836 562439 560236 559014 558478 557707 556345 554721 553119 551538 549893 548075 546064 544208 542907
59790 542907 541846 540124 537487 534743 532513 530234 527026 523017 519120 515949 513598 512062 511121 510054
59776 510054 508243 506032 504465 504173 504896 506010 507108 508131 509278 510806 512706 514681 516577 518671 521349
59761E21349L333L740L827L738L894M793O305P536P845P637P575P520P016O443
59747F02551O649P567Q173P838O922N966N070M185L352K461J309k7j276k313l023
59732F55404l047k261j258q10j047j666k551l509l824k996j644q26o71n48l10
59717F28436m33j017j573j772j629j109m06l25j401k798l115k250j369j058p03
59702F07478J96J186J714J846J856J866K142K985M063M641M607M578M798M733
59688F48689M030L074K348J795J181N01j25o44j005j249j584k027k274k350k896
59673F47464m228n565o069o055o256o398n766m719m219m132l542k603k403k870
59659E82639k529q06R47J479J247J319J891K764M128N930P254P323O436N339M155
$$ plain form
59761 521349 524682 528422 532249 535987 539881 544674 550979 558515 566360 573997 581572 589092 596108 602551
59747 602551 609200 616767 624940 632778 639700 645666 650736 654921 658273 660734 662043 662016 660740 658427 655404
59732 655404 652357 650096 648838 648028 646981 645315 642764 639255 635431 632435 630791 629965 629294 628746 628436
59717 628436 628003 626986 625413 623641 622012 620903 620497 620172 618771 615973 612858 610608 609239 608181 607478
59702 607478 607674 608860 610574 612420 614276 616142 618284 621269 625332 629973 634580 639158 643956 648689
59688 648689 652719 655793 658141 659936 661117 661618 661493 660849 659844 658595 657011 654984 652710 650360 647464
59673 647464 643236 637671 631602 625547 619291 612893 607127 602408 598189 594057 590515 587912 585509 582639
59659 582639 580110 579304 580251 581730 582977 584296 586187 588951 593079 599009 606263 613586 620022 625361 629516
59644F29516K669R86o76k382m103n431o058o155n965n588n239n093m741l553j863
59629E76324q14q30j084r38r33j747l005l820l887l495k947k541k588l065l603
59614E41027l973m120l696k387q61l44r20j218k49J398K682L428L829L660K783
59599E41039J776J150O29j62q53j016j028j398j740j320l64R5m31j353j744j271
59583E32009l98n1p83k066k678k071j025o78j345k500l454l694l051j931j118
59568E05166j010j322j591j563j035kR58J079M60N7L40P41P18N57O58P60M98J40
59550E05609J52N01Q85J251J644J962K228K636L087L236L295M127O144Q687J0989
59535E56433J3077J5298J7451J8922J9081J7194J2642N980p05n149o511n500l429
$$ plain form
59644 629516 632185 633171 632495 630113 626010 620579 614521 608366 602401 596813 591574 586481 581740 578187 576324
59629 576324 575510 574680 573596 572658 571725 569978 566973 563153 559266 555771 552824 550283 547695 544630 541027
59614 541027 537054 532934 529238 526851 525990 525646 524726 523508 523259 524657 527339 530767 534596 538256 541039
59599 541039 542815 543965 544594 544432 543579 542563 541535 540137 538397 537077 536713 536808 536377 535024 533280 532009
59583 532009 531611 531560 530777 528711 526033 523962 522937 522259 520914 518414 514960 511266 508215 506284 505166
59568 505166 504156 502834 501243 499680 498645 498643 499601 500680 501140 501197 501537 502278 502996 503553 504211 504971 505469 505609
59550 505609 505761 506262 507147 508398 510042 512004 514232 516868 519955 523191 526486 530613 536757 545444 556433
59535 556433 569510 584808 602259 621181 640262 657456 670098 676078 675373 670224 663713 658213 654784
59522F54784j470j91P06J922L490M646M835M178K786M62k492n093o837q274r843
59507F43609j0973j1075j0634j0455j0426r869q745p579o566n496m366l404k657
59494E41364k050j630j362j012o21o14j074j366r75j81N45J291K298L313L944
59479E41870M303M717N196N609O014O361O342N959N758N958N933N079L711K489
59465F15299J456L73m63m89K18R41J181J101J283K263M123O317Q186R633J0893
59450F62315J1710J1587J0857J0537J0850J0867R982Q634P047M484N60l738p233
59437G48459r849j1883j2983j2866j2113j1216r715p492n922o181p144o606m232
59424F30257j668Q1J704L978O659R379J2304J5334J7728J9099K0010K1065K2154
$$ plain form
59522 654784 653314 653123 653829 655751 659241 663887 668722 672900 675686 676148 673656 668563 661726 653452 643609
59507 643609 632636 621561 610927 600472 590046 580177 571432 563853 557287 551791 547425 544021 541364
59494 541364 539314 537684 536322 535310 534689 534075 533001 531635 530660 530479 531024 532315 534613 537926 541870
59479 541870 546173 550890 556086 561695 567709 574070 580412 586371 592129 598087 604020 609099 612810 615299
59465 615299 616755 617128 616665 616176 616394 617335 618516 619617 620900 623163 627286 633603 641789 651422 662315
59450 662315 674025 685612 696469 707006 717856 728723 738705 747339 754386 758870 759430 755692 748459
59437 748459 738610 726727 713744 700878 688765 677549 667834 660342 654420 648239 641095 634489 630257
59424 630257 628589 628670 630374 634352 641011 650390 662694 678028 695756 714855 734865 755930 778084
59411G78084K3034K4003K5367K6527K6093K2791J6185O852l779j3784k1203k4545
59399H85625k3341j8447j1563m334K028O399P690N420o5p920j6743k4173k7754
59386G72822k6904k3404j9406j5643j2057r050p029n408l325j011O45J605K679
59373F54514M034M788M301L095K230K256K928L554L525K763J753J016P92J158
59359F92707K022K850L013K687K876M191O217Q319J0281J1821J2424J2333J2815
59346G84556J4619J6852J8292J9028J9869K0746K0783J9639J7791J5737J3665
59335I81577J1617R208N595N36m885r300j2403j4591j5912j6283j6341j6959j8084
59322H83775j8844j8640j7525j5915j4505j3922j3777j2718j0255p862p166p755
$$ plain form
59411 778084 801118 825121 850488 877015 903108 925899 942084 948936 945157 931373 910170 885625
59399 885625 862284 843837 832274 827940 829968 836367 844057 849477 849412 841492 824749 800576 772822
59386 772822 745918 722514 703108 687465 675408 666358 659329 653921 650596 649585 650230 651835 654514
59373 654514 658548 663336 667637 670732 672962 675218 678146 681700 685225 687988 689741 690757 691549 692707
59359 692707 694729 697579 700592 703279 706155 710346 716563 724882 735163 746984 759408 771741 784556
59346 784556 799175 816027 834319 853347 873216 893962 914745 934384 952175 967912 981577
59335 981577 993194 1002402 1007997 1008533 1003648 994348 981945 967354 951442 935159 918818 901859 883775
59322 883775 864931 846291 828766 812851 798346 784424 770647 757929 747674 739812 732646 724891
59310G24891p995p448p069p330p597p352o725n752m244k603j641j372q05P45K948
59295F60651N170P310R621J2151J4412J5366J3863R546L199l955j0869j6405j9303
59282G00757j9158j6941j3943j0727p528m798k563p2L035N972Q081R933J2151
59269F64199J4100J5009J5446J6269J6866J6068J4139J2235J0323P416L561j28
59257H05503l257o375r437j1632j2777j3394j3385j2137j0021q332p497o705n434
59244F85120m065k809j303M43J895K985M195N573O683P549Q593R649J0138J0090
59230G44736R863R125P415N449M361L783K295k81k741m603o618q943j0669j1472
59216G41700j2065j2555j2112j0764r821r798r585q417p092o418n939n195m798
$$ plain form
59310 724891 716896 709448 702379 695049 687452 680100 673375 667623 663379 660776 659135 657763 656958 657703 660651
59295 660651 665821 673131 682752 694903 709315 724681 738544 748090 751289 747334 736465 720060 700757
59282 700757 681599 664658 650715 639988 632460 627662 625099 625027 628062 634034 642115 652048 664199
59269 664199 678299 693308 708754 725023 741889 757957 772096 784331 794654 802070 805631 805503
59257 805503 802246 795871 786434 774802 762025 748631 735246 723109 713088 704756 697259 690554 685120
59244 685120 681055 678246 676943 677386 679281 682266 686461 692034 698717 706266 714859 724508 734646 744736
59230 744736 754599 763724 771139 776588 780949 784732 787027 786746 784005 779402 772784 763841 753172 741700
59216 741700 729635 717080 704968 694204 684383 674585 665000 656583 649491 643073 637134 631939 627141
59203F27141n252n856n769n108m206k932j535r51j289j261j61Q31M57n04l70J000
59187E94235K362L114L766M601N188N281N236N280N135M588M010L988M605N208
59173F56597N117M573M679O037P817Q755Q767Q840R520J0347J0686J0315R242
59160G61292P805O721O167M984J941k277n623p260q353j0087j2198j3903j5009
59147G14200j5553j5325j4372j3278j2507j2016j1598j0997r789p990o517o102
59135E78156o028n237m306m667n989o222m570k504j347o17M30J341J557J584K097
59120E43678L005M192N995Q165R595R874R980J0524J0648R548P983P121O972O949
59106F54229P032P285P052N786M097L060K942L274L523L190J970L67n71o47q05
$$ plain form
59203 627141 621889 616033 610264 605156 600950 598018 596483 595532 594243 592982 592821 593652 594109 593605 593235 594235
59187 594235 596597 599711 603477 608078 613266 618547 623783 629063 634198 638786 642796 646784 651389 656597
59173 656597 661714 666287 670966 677003 684820 693575 702342 711182 720702 731049 741735 752050 761292
59160 761292 769097 775818 781985 786969 788910 786633 781010 773750 765397 755310 743112 729209 714200
59147 714200 698647 683322 668950 655672 643165 631149 619551 608554 598765 590775 584258 578156
59135 578156 572128 566891 562585 557918 551929 545707 541137 538633 537286 536669 537099 538440 539997 541581 543678
59120 543678 546683 550875 556870 565035 574630 584504 594484 605008 615656 625204 633187 640308 647280 654229
59106 654229 661261 668546 675598 681384 685481 688541 691483 694757 698280 701470 703440 703807 703236 702589 701784
59091G01784j587k335k407k107j756j019R5O05j68j618k898m037n261o195o555
59076F64541o819p354p686p434p107p246p463p095o108m822l525k810l282m447
59062E81343m855m000k977k672k553j954j334j309j568j636j775k151k162j456
59048E48941p10n17m99l50o16j559k209j653m00M99Q42R47Q32N91O99J172J294
59031E47304R00Q71J651K474K853L609N393P427Q731R523J0354J1022J1343J1900
59017F35355J2892J3371J2662J1299R623O864K904n85k206k829l903n073n163
59004F85211m378l681k826r05J754L895N098N827O296O581P149Q024Q092O677
58990G32814M950M367M541M078K816J645P52l46j532k289k657k784k152n19J173
$$ plain form
59091 701784 700197 697862 695455 693348 691592 690573 690668 691273 691105 689487 686589 682552 677291 671096 664541
59076 664541 657722 650368 642682 635248 628141 620895 613432 606337 600229 595407 591882 589072 585790 581343
59062 581343 576488 572488 569511 566839 564286 562332 560998 559689 558121 556485 554710 552559 550397 548941
59048 548941 548231 547714 547215 546865 546249 544690 542481 540828 540428 540927 541769 542716 543548 544139 544838 546010 547304
59031 547304 548204 549075 550726 553200 556053 559662 565055 572482 581213 590736 601090 612112 623455 635355
59017 635355 648247 661618 674280 685579 695202 702066 704970 704385 702179 699350 695447 690374 685211
59004 685211 680833 677152 674326 673421 675175 679070 684168 689995 696291 702872 710021 718045 726137 732814
58990 732814 737764 742131 746672 750750 753566 755211 755963 755617 754085 751796 749139 746355 744203 743684 744857
58975G44857K128L126N158P573R120R968J1072J2332J3130J3915J5384J6745J6703
58962H81211J5708J5234J5246J4322J2064R477P037M200Q95k271n390r205j3482
58949I45046j6814j8387j8786j8892j9011j9167j9307j9078j8126j6465j4195
58938G46818j1395q713p143o536n448l336j601j293j307k57J183J610J259J211
58924G05052J350J060Q34J148Q26j151l297l501k354k027k595k222n95P24J228
58909F94480J979L142L667L638M358N869O751O829P598R580J1582J3065J4898
58896G87436J7139J8423J8293J8059J8482J8729J8376J8437J9447K0460K0973
58885I94254K2039K4334K6678K7513K6521K3918J9624J4134Q876M684Q66l427
$$ plain form
58975 744857 746985 750111 755269 762842 771962 781930 793002 805334 818464 832379 847763 864508 881211
58962 881211 896919 912153 927399 941721 953785 963262 970299 974499 975394 973123 967733 958528 945046
58949 945046 928232 909845 891059 872167 853156 833989 814682 795604 777478 761013 746818
58938 746818 735423 726710 719567 713031 707583 704247 702646 701353 700046 699789 700972 702582 703841 705052
58924 705052 706402 707462 708296 709444 710270 709119 705822 702321 699967 697940 695345 693123 692528 693252 694480
58909 694480 696459 699601 703268 706906 711264 717133 723884 730713 738311 747891 759473 772538 787436
58896 787436 804575 822998 841291 859350 877832 896561 914937 933374 952821 973281 994254
58885 994254 1016293 1040627 1067305 1094818 1121339 1145257 1164881 1179015 1187891 1192575 1193441 1190014
58873A190014p883j1745j4861j7450j9638k1573k3102k3276k1390j8527j6675
58862I93894j6119j5226j3138j1080j0363j0655j0961j1135j1508j2030j2483
58851H59196j2864j3045j2687j1706j0310q610o879n871n981o455o461o420p097
58838G44810q068q482q625r102r209q096o838p010p759o824m335k734k812k679
58824F52237j267P0M22J064K918M642M858M403M827O130P391Q298Q807Q449P124
58809G20373N557M154K570R39J92M68N78k37j408k501m004n922p106o922o236
58794G00495n956n903n928o602p982q970q741p728o454m768k777j225j86J275
58780F28550L484N523O786P749Q613Q636P546O148M923L408J481k86k088m914
$$ plain form
58873 1190014 1182131 1170386 1155525 1138075 1118437 1096864 1073762 1050486 1029096 1010569 993894
58862 993894 977775 962549 949411 938331 927968 917313 906352 895217 883709 871679 859196
58851 859196 846332 833287 820600 808894 798584 789974 783095 777224 771243 764788 758327 751907 744810
58838 744810 736742 728260 719635 710533 701324 693228 686390 679380 671621 664797 660462 657728 654916 652237
58824 652237 650970 651040 651462 652526 655444 660086 664944 669347 674174 680304 687695 695993 704800 713249 720373
58809 720373 725930 730084 732654 733593 733785 734253 734831 734594 733186 730685 726681 720759 713653 706731 700495
58794 700495 694539 688636 682708 676106 668124 659154 650413 642685 636231 631463 628686 627461 627275 628550
58780 628550 632034 637557 644343 652092 660705 669341 676887 683035 687958 691366 692847 692561 690473 685559
58766F85559q475j0933j1473j1320j1384j0788q864o686n335m290k873j716j399
58753E90023j101rJ222J703J812K142K236J630J072J377K117K613L166M230N337
58738F19570N944O345O776O678N861N245N427N608N021M338M596N576O330O479
58724F99794O180N603N161N327N680N183L914L286L990N115N849O582P517P803
58710G76984P009O030N520M799L254J399l77k689n753q497j0263j1946j4384j6839
58696G34247j8276j8848j9073j8735j7628j6276j4880j2795r977p670o685o274
58684E67130n581m939m802m751m498m524m820m398k966j697j393j337p71J2Q58
58669E21523K357M356N622O023P144R710J2213J3376J3966J4843J5024J3384J0486
$$ plain form
58766 685559 677084 666151 654678 643358 631974 621186 612322 605636 600301 596011 593138 591422 590023
58753 590023 588922 588913 590135 591838 593650 595792 598028 599658 600730 602107 604224 606837 610003 614233 619570
58738 619570 625514 631859 638635 645313 651174 656419 661846 667454 672475 676813 681409 686985 693315 699794
58724 699794 705974 711577 716738 722065 727745 732928 736842 740128 744118 749233 755082 761664 769181 776984
58710 776984 783993 790023 795543 800342 803596 804995 804618 801929 796176 787679 777416 765470 751086 734247
58696 734247 715971 697123 678050 659315 641687 625411 610531 597736 587759 580089 573404 567130
58684 567130 561549 556610 551808 547057 542559 538035 533215 528817 525851 524154 522761 521424 520653 520665 521523
58669 521523 523880 528236 533858 539881 547025 556735 568948 582324 596290 611133 626157 639541 650027
58656F50027P205L147j882o314q582r207r629j0098j0080r636r032q081o869n991
58642E64978n304l974k407k201l328l579j937j32M46J016K819M668M995M302L581
58627E63943K349K79j174r15j12m5N0R33J261l8j219j50K319L960M637N691P146
58610E88915Q040Q387Q561P892N948M007L208K646J219j92m46m03j206k028j844
58595F32704j757l019m391m092k882k495k519j601k89K15Q07L009N890P406P793
58580F34779Q723J0073J0454J0121J0430J1151J1079J0613J0946J1473J0811R684
58568G60337J0015J1782J3467J5044J7712K1206K4108K6439K9321L2433L4285
58557I96149L4612L4153L2528K8688K3056J6962J0679M088j561m959o980r184
$$ plain form
58656 650027 657232 660379 658497 652183 643601 634394 624765 614667 604587 594951 585919 577838 570969 564978
58642 564978 559674 555700 553293 551092 547764 544185 542248 542116 542562 543578 546397 551065 556060 560362 563943
58627 563943 566292 566571 565397 564482 564370 564325 564375 565308 566569 566531 565312 565162 567481 571441 576078 581769 588915
58610 588915 596955 605342 613903 621795 627743 631750 634958 637604 638823 638631 638185 637782 636576 634548 632704
58595 632704 630947 627928 623537 619445 616563 614068 611549 609948 609659 609874 610681 613690 619580 626986 634779
58580 634779 643502 653575 664029 674150 684580 695731 706810 717423 728369 739842 750653 760337
58568 760337 770352 782134 795601 810645 828357 849563 873671 900110 929431 961864 996149
58557 996149 1030761 1064914 1097442 1126130 1149186 1166148 1176827 1180915 1179354 1174395 1167415 1158231
58545A158231j1035j0994r541q451q080p889q773j1999j6586k0440k3385k6440
58533I94618k9017k9617k8606k7468k6014k3104j9420j6677j4722j2094q857o201
58521G52821m113k078j108k116l377k668r60p46j765j858j205j873l643m018k398
58506G18895p83l13k99o03j813l066k736j264n10o33l69M8n87j578j161J90N24
58489G03942N3P78K748M044M300N032O678Q371J0350J3406J6416J7658J8132K0140
58475H32048K3067K4097K2662K0640J8424J4582R224M048q04o415j1840j4793
58463I34940j5385j5562j5139j2271p569l884j880L75L521O356Q960J2498J6037
58450I10997J7350J6709J6041J4701J0333L617k256o667j1649j6933j9667j9296
$$ plain form
58545 1158231 1147196 1136202 1126661 1118210 1110130 1102241 1093468 1081469 1064883 1044443 1021058 994618
58533 994618 965601 935984 907378 879910 853896 830792 811372 794695 779973 767879 759022 752821
58521 752821 748708 746630 745522 743406 740029 737361 736401 735655 733890 732032 730827 728954 725311 721293 718895
58506 718895 718112 717799 717500 716897 715084 712018 709282 708018 707508 706875 706506 706554 705967 704389 703228 703418 703942
58489 703942 703995 704773 707521 711565 715865 720897 727575 735946 746296 759702 776118 793776 811908 832048
58475 832048 855115 879212 901874 922514 940938 955520 964744 968792 967988 961573 949733 934940
58463 934940 919555 903993 888854 876583 869014 865130 863250 863625 867146 873502 882462 894960 910997
58450 910997 928347 945056 961097 975798 986131 989748 987492 980825 969176 952243 932576 913280
58438I13280j8206j7182j4715j1180r013q240o313k900l90P77K670N421O929P370
58424H48308R207J2188J3250J1993J1228J1413R810O002K946J461j123n510q867
58411I22306j0110j1531j3737j4114j2024j0455j0689j0334q383p286q060q186
58399G97397o327m534l919k760n69O34O44J959M731N791M251L108L673L570J879
58384H09528J059J963K111P97N77J995K234Q19J009L660N440N125N663P965Q875
58369H58820P633P937J0951J2695J1349J0683J2930J4771J3977J3657J6029J8079
58357A009511J7450J6738J7821J7714J4292J0443Q445N833J017k712l054k985
58345A110513m824n663l155l17R1N55L569O730P606Q320J0810J2740J2558J3208
$$ plain form
58438 913280 895074 877892 863177 851997 842984 834744 828431 825531 825141 825918 828588 834009 840938 848308
58424 848308 857515 869703 882953 894946 906174 917587 927397 933399 936345 937806 936683 931173 922306
58411 922306 912196 900665 886928 872814 860790 850335 839646 829312 820929 813643 805583 797397
58399 797397 791070 786536 782617 779857 779288 779922 780566 782525 787256 793047 797298 800406 804079 807649 809528
58384 809528 810587 812550 814661 815458 816035 818030 820264 821083 822092 825752 831192 836317 841980 849945 858820
58369 858820 866453 874390 885341 898036 909385 920068 932998 947769 961746 975403 991432 1009511
58357 1009511 1026961 1043699 1061520 1079234 1093526 1103969 1112414 1118247 1119264 1116552 1113498 1110513
58345 1110513 1105689 1100026 1096871 1096554 1096645 1097200 1100769 1107499 1115105 1123425 1134235 1146975 1159533 1172741
58331A172741J6433J8787J7823J6626J7743J8329J5994J3487J2820J0815N576
58320A337174J281J110J490j089l506k138M23P50R63L725O386O183N916Q446J0914
58305A378028J0308R379J1174J3144J2484J1717J3312J4541J3314J2977J5593
58294A515971J7015J4672J3367J6830K0573K0041J8820K1439K4865K4832K3934
58283A732359K5796K7757K7016K7419L2344L7565L8818L9584M3654M7276M6634
58272B126222M5514M7395M7825M3368L9802M2266M5555M3855M1602M4587M8843
58261B616834M9009M9297N4996O1414O2523O2267O5826O8426O4764O0707O3114
58250C279177O6926O5203O2860O7018P3034P4057P5185Q3485R3323R6720R8905
$$ plain form
58331 1172741 1189174 1207961 1225784 1242410 1260153 1278482 1294476 1307963 1320783 1331598 1337174
58320 1337174 1338455 1339565 1341055 1339966 1336460 1334322 1334745 1335495 1336458 1340183 1346569 1352752 1358668 1367114 1378028
58305 1378028 1388336 1397715 1408889 1422033 1434517 1446234 1459546 1474087 1487401 1500378 1515971
58294 1515971 1532986 1547658 1561025 1577855 1598428 1618469 1637289 1658728 1683593 1708425 1732359
58283 1732359 1758155 1785912 1812928 1840347 1872691 1910256 1949074 1988658 2032312 2079588 2126222
58272 2126222 2171736 2219131 2266956 2310324 2350126 2392392 2437947 2481802 2523404 2567991 2616834
58261 2616834 2665843 2715140 2770136 2831550 2894073 2956340 3022166 3090592 3155356 3216063 3279177
58250 3279177 3346103 3411306 3474166 3541184 3614218 3688275 3763460 3846945 3940268 4036988 4135893
58239D135893J08056J19260J24675J29612J41796J54972J60742J66059J80614
58230E421679J97779K07453K16470K35662K58187K72615K85939L10543L39994
58221G746321L62143L84453M20556M63612N00180N38305N93225O57857P18007
58212A2384659P83836Q73699R80405J088683J212278J375985J576144J800925
58204B2076614K075011K437757K890428L413292M019734M741005N577187O527262
58196E3758290P651346R034127J0707330J2690073J5079169J7989335K1417025
58189A48326695K5279806K9529524L3948644L7697891L9274232L7189143L0758739
58182C82004674K0303418O913488p658367k1063663l0948190l5984518l6452601
$$ plain form
58239 4135893 4243949 4363209 4487884 4617496 4759292 4914264 5075006 5241065 5421679
58230 5421679 5619458 5826911 6043381 6279043 6537230 6809845 7095784 7406327 7746321
58221 7746321 8108464 8492917 8913473 9377085 9877265 10415570 11008795 11666652 12384659
58212 12384659 13168495 14042194 15022599 16111282 17323560 18699545 20275689 22076614
58204 22076614 24151625 26589382 29479810 32893102 36912836 41653841 47231028 53758290
58196 53758290 61409636 70443763 81151093 93841166 108920335 126909670 148326695
58189 148326695 173606501 203136025 237084669 274782560 314056792 351245935 382004674
58182 382004674 402308092 409221580 401563213 380499550 349551360 313566842 277114241
58175B77114241l3808161k9728442k5468857k1755277j8893741j6866106j5435263
58168A15158394j4282792j3127102j1808487j0339164q861964p517295o349150
58161D2872440n340085m483933l782022l205896k716763k306181j979613j717545
58153A7340402j489896j293165j138248j015039r02364q00741p23238o63972o05630
58144H708109n48999n06338m73476m35691l94229l61218l34677l03075k68847
58135E081559k43836k26539k06284j84967j73127j68886j61643j52343j49927
58126C414007j51578j46308j34835j27021j22754j13810j01737r5589r4174q8170
58116B238031p8007p2721p2571o9229o1977n7938n7234n3244m6767m5151m7937
$$ plain form
58175 277114241 243306080 213577638 188108781 166353504 147459763 130593657 115158394
58168 115158394 100875602 87748500 75940013 65600849 56738885 49221590 42872440
58161 42872440 37532355 33048422 29266400 26060504 23343741 21037560 19057947 17340402
58153 17340402 15850506 14557341 13419093 12404054 11501690 10700949 9977711 9313739 8708109
58144 8708109 8159110 7652772 7179296 6743605 6349376 5988158 5653481 5350406 5081559
58135 5081559 4837723 4611184 4404900 4219933 4046806 3877920 3716277 3563934 3414007
58126 3414007 3262429 3116121 2981286 2854265 2731511 2617701 2515964 2420375 2326201 2238031
58116 2238031 2160024 2087303 2014732 1945503 1883526 1825588 1768354 1715110 1668343 1623192 1575255
58105A575255m7631m4037m3954m7253m6999m3009m1926m3870m2035l5739l1347
58094A107455l0030k6574k0637j7490j7291j4920j0600r665j1737j1055p632p254
58082I22570j0283j1225r612j0660j4615j6010j4119j4017j6478j6813j4535j4355
58070G59848j6722j6911j4402j3822j5649j5216j1941j0446j1453j0539p069n507
58058F10171o689o399l940l539n998p229o383p191r921j0264p656o552p947p642
58044E12821m596l028m306m582k473j630l547m948m417m678o385o463m532m237
58030D52999o321p076n511n356p969r828r099q431r167r020p408o990q017p258
58016C45548m303k852m000m347k614j824k998k970o63O14n41j057N47J410J03
$$ plain form
58105 1575255 1527624 1483587 1439633 1392380 1345381 1302372 1260446 1216576 1174541 1138802 1107455
58094 1107455 1077425 1050851 1030214 1012724 995433 980513 969913 960248 948511 937456 929824 922570
58082 922570 912287 901062 891450 880790 866175 850165 836046 822029 805551 788738 774203 759848
58070 759848 743126 726215 711813 697991 682342 667126 655185 644739 633286 622747 615678 610171
58058 610171 603482 597083 593143 589604 583606 576377 569994 562803 552882 542618 534962 528410 520463 512821
58044 512821 508225 505197 500891 496309 493836 492206 488659 483711 479294 474616 468231 461768 457236 452999
58030 452999 446678 439602 434091 428735 420766 410938 401839 393408 384241 375221 367813 360823 352806 345548
58016 345548 341245 338393 334393 330046 327432 325608 322610 319640 318977 319591 319050 317993 318540 319950 320053
58001C20053n98O90J268j40o74J159K550J653P56J446J639J36o46P21J884J117
57985C33014J49J22p71l225m696l811k752l036l059j947j615k818l320k120j334
57970B98781j940j815n0J056L21k71K52k7j624j972j40J138L29l20O88J366L06
57953B96078p68q62j811m162n259l906k671l071k802m66J355P38j6J430L445L854
57937B81106L735M681N610N340N255O547P737P487O934O918N981L388R51l24k014
57922C49332m683o047n004l866m289m727m143m351o082o763m926k957k611j801
57908B87082J011L343L032K190L166M214L048J321J497K358J626K65K07M29o94
57893C14095j687n32J341J468O48R77J671P15j158j814j478j639j836r31j8p15
$$ plain form
58001 320053 319455 320145 321413 321273 320599 321758 324308 325961 326717 328163 329802 329938 329292 330013 331897 333014
57985 333014 333163 333285 332514 329289 324593 320782 318030 314994 311935 309988 308373 305555 302235 300115 298781
57970 298781 296841 295026 294976 296032 296353 296082 296334 296307 294683 292711 292571 293709 294038 293718 294406 295772 296078
57953 296078 295310 294448 292637 288475 283216 279310 276639 273568 270766 270300 271655 272393 272377 273807 277252 281106
57937 281106 284841 289522 295132 300472 305727 312274 320011 327498 334432 341350 347331 350719 351670 351346 349332
57922 349332 344649 338602 333598 329732 325443 320716 316573 312222 306140 299377 294451 291494 288883 287082
57908 287082 288093 291436 294468 296658 299824 304038 307086 308407 309904 312262 313888 314153 314360 314789 314095
57893 314095 312408 311876 313217 314685 315333 316310 317981 318696 317538 315724 314246 312607 310771 309840 309822 309107
57877C09107k045k183j808k573l814l958l639m259m858l640j378k09k01nL03j70
57861B74670q18n70l3o0M19K491M684N049M495N158O786P490P049O591O078M789
57845C34268L388K965K913J995O48k2l90j394k658l523m599o272p219o515n527
57830C08058n590n601m273k789k607k598j208L12j9j251j087K02O29J16J32O76
57814B83102O53M09J071K105K180J654J629J480l4k240l736n070p475j0008j0733
57799B54987r875r054q242o332l917k612k227j364k02Ll95M8J205J762J795K447
57783B18027L584M164M371N041N723N579N420O388P553P317O308O243O797O278
57769B98793M720L474K550J028n26r51j039k382m323m950m496m711n457n034l592
$$ plain form
57877 309107 307062 304879 303071 300498 296684 292726 289087 284828 279970 276330 274952 274743 274542 274537 274840 274670
57861 274670 273852 273282 273249 273189 273608 276099 280783 285832 290327 295485 302271 309761 316810 323401 329479 334268
57845 334268 337656 340621 343534 345529 346177 346155 345765 344371 341713 338190 333591 327319 320100 313585 308058
57830 308058 302468 296867 292594 289805 287198 284600 283392 283704 283685 282434 281347 281549 282178 282294 282426 283102
57814 283102 283755 284164 285235 287340 289520 291174 292803 294283 294249 292009 288273 283203 275728 265720 254987
57799 254987 245112 236058 227816 221484 217567 214955 212728 211364 211162 211165 210770 210818 212023 213785 215580 218027
57783 218027 221611 225775 230146 235187 240910 246489 251909 258297 265850 273167 279475 285718 292515 298793
57769 298793 303513 306987 309537 310565 310039 309088 308049 305667 301344 296394 291898 287187 281730 276696 273104
57754B73104l041l732m218m193m689n361m627k591j038l78N93J880K082J220R73
57739B45984J779K375K387K768L322K600O84m94o4Q60J534K407L333L402K948
57724B75825L285M135L763K078R87J162J026k69j312r04R0L50j95j124k326l375
57708B83196l611l378l706m610n120n085n228n474n071m293m130m305l589k105
57694B23491j311j620k091k430l182l914l518k404k158k826k779j485j71N58J440
57679A95600K636L350L723M905O929Q685J0279J3136J7488K2122K6925L3180M0787
57666C89745M7664N2405N4980N4160M7007L2210J2092r517k9412m4644n2843n4221
57654D99626n1470m6757m0532l3632k7916k3909k0140j5871j2345j0315q560o146
$$ plain form
57754 273104 270063 266331 262113 257920 253231 247870 243243 240652 239614 239236 239829 241709 243791 245011 245984
57739 245984 247763 250138 252525 255293 258615 261215 261899 261405 261341 262201 263735 266142 269475 272877 275825
57724 275825 279110 283245 287008 289086 290073 291235 292261 291992 290680 289776 289866 290216 290021 288897 286571 283196
57708 283196 279585 276207 272501 267891 262771 257686 252458 246984 241913 237620 233490 229185 225596 223491
57694 223491 222180 220560 218469 216039 212857 208943 205425 203021 200863 198037 195258 193773 193602 194160 195600
57679 195600 198236 201586 205309 210214 217143 225828 236107 249243 266731 288853 315778 348958 389745
57666 389745 437409 489814 544794 598954 645961 678171 690263 680746 651334 606690 553847 499626
57654 499626 448156 401399 360867 327235 299319 275410 255270 239399 227054 216739 208179 202033
57642B02033m009l055k548j617o24L6P78J479J186P3k48O46J096J86o55j84N46
57625A95119J24r25j388j327j351j334j182j505k360k660j958j376j731k222k062
57610A71862j770j768j353l16Q5q89j961j778r16n63o19m41k83n93r97j269k068
57593A54363l530m335l537k195j900k598l104k857k114j219o60r62j782k073j697
57578A19800j618k043j919r60m04q17r34J5O64l76k222l164l023k606k011j045
57562I7337l48n79j251j529j343p98L74J789K182J284O37J324K307K331J990K341
57546A08048K782K116O96k09m08n94q81j025j388k249k789k128p27L62R57J337
57530A03900J231M85p9K06N91Q2q82j125n40M7K59L18L54N04J104J952K142J417
$$ plain form
57642 202033 198024 194969 192421 190804 190180 190216 190994 192473 193659 193732 193484 194130 195226 195412 194757 194573 195119
57625 195119 195243 194318 192930 191603 190252 188918 187736 186231 183871 181211 179253 177877 176146 173924 171862
57610 171862 170092 168324 166971 166655 166740 165851 163890 162112 161196 160633 160014 159573 159290 158697 157700 156431 154363
57593 154363 150833 146498 142961 140766 138866 136268 133164 130307 128193 126974 126314 125352 123570 121497 119800
57578 119800 118182 116139 114220 113260 112856 112039 111105 111120 111784 111408 109186 106022 102999 100393 98382 97337
57562 97337 96989 96410 95159 93630 92287 91489 91863 93652 95834 97118 97755 99079 101386 103717 105707 108048
57546 108048 110830 112946 113642 113433 113025 112431 111550 110525 109137 106888 104099 101971 101244 101606 102563 103900
57530 103900 105131 105616 105537 105743 106334 106416 105534 104409 103869 103916 104175 104493 104847 105351 106455 108407 110549 111966
57512A11966P67Q31Q34J25m69q0N55K87n35p59l50j29k87m23n02o77p15n69q19
57493A09051j654k271k203k236k924l328k509j259r75j635k198k217j780p34P31
57478H1859J528J015R7j82k45q65j493j211n14n33j182j538j461j447j448j205
57462G1175j109j496j742j317r23j273j597q33N53J370J587J879K076J597P73
57447G0720K50k49j080j472p34J75rp36o62n8j53p53n61M21R02N43K55L22Q7m38
57427F6770l99L13Q65R06Q47O55q1r25q27K23J066R54J91o49j099p03L28P87q
57408F9214r05m33R07J463R89O69Q96Q16j5j086k019k745k771j703l18L61O62
57391F3982J405J983J277P0M12K463M117M089L372L198L364L306L119K815J899
$$ plain form
57512 111966 112733 113564 114398 114523 114054 113974 114529 114816 114281 113522 113172 113043 112756 112333 111831 111154 110439 109870 109051
57493 109051 107397 105126 102923 100687 97763 94435 91926 90667 89692 88057 85859 83642 81862 81128 81859
57478 81859 83387 84402 84499 84317 84072 83207 81714 80503 79989 79456 78274 76736 75275 73828 72380 71175
57462 71175 70066 68570 66828 65511 64588 63315 61718 60885 61438 62808 64395 66274 68350 69947 70720
57447 70720 70970 70721 69641 68169 67435 67610 67601 66865 66203 66145 65992 65239 64678 65099 66001 66544 66799 67121 67208 66770
57427 66770 66371 66684 67549 68455 69302 69957 69876 68951 68124 68347 69413 70367 70558 69909 68810 68107 68435 69222 69214
57408 69214 68309 67876 68783 70246 71235 71904 72800 73616 73601 72515 70496 67751 64980 63277 62959 63320 63982
57391 63982 65387 67370 68647 68717 69129 71592 75709 79798 83170 86368 89732 93038 96157 98972 100871
57376A00871L84q44j174q60l43pm87k010l459l540k745k613l163k895j489m62
57360G5164o45r00j34J008J465J282R31K97o51j164o88K46P67O84K53l97j081
57343G6437j422j284q87l92R2J32n69j457j658j154n95k12J46K11k89o50nJ117
57325F7561J319L97o06j227j938k632k478j523q60q11m71N36J287J061K55o33
57309E9237j654k577k658j794p75n3N71Q82K35j018j581j128p78j187j561j230
57293D2931p51p06o77k88j19p02j474j543p84L20J271J637J341J061J503K280
57277D5300K535K499L067L952L886K860K354K954L542L412L322L710L655K686
57263H9734J892K073K274J461K18m77r04j619k020j407n20n65j288j449p17Q2
$$ plain form
57376 100871 101255 100411 99237 98377 98034 98027 97540 95530 92071 88531 85786 83173 80010 77115 75626 75164
57360 75164 74519 73619 73485 74493 75958 77240 78171 78468 77817 76653 75965 76211 76978 77662 77915 77518 76437
57343 76437 75015 73731 72844 72452 72544 72676 72107 70650 68992 67838 67243 67031 67177 67388 67099 66449 66444 67561
57325 67561 68880 69277 68671 67444 65506 62874 60396 58873 58013 57202 56731 57267 58554 59615 59870 59237
57309 59237 57583 55006 52348 50554 49779 49726 50297 51179 51414 50396 48815 47687 46909 45722 44161 42931
57293 42931 42180 41474 40797 40509 40390 39688 38214 36671 35887 36207 37478 39115 40456 41517 43020 45300
57277 45300 47835 50334 53401 57353 61239 64099 66453 69407 72949 76361 79683 83393 87048 89734
57263 89734 91626 93699 95973 97434 97652 97175 96271 94652 92632 91225 90705 90140 88852 87403 86686 86768
57247H6768K93k8n49r04p45k30l0m17q31q19o96q37j051j132j283j563j614j332
57229G3000r74l96P36J804J624M15j07P65J605J134J07j89Q1J26J13M16L46p98
57211G9808k172k450j893j898k819l630l662l449l813m915o242o974o489m932
57197B4470k989q90J750M799P233Q402Q783Q904Q464P266O017N299M662L687L065
57182I8922L641N055O381P405Q313Q913R138R706J1198J3061J4526J5891J7832
57169B29982K0114K1997K3377K4368K4378K2776K0223J8174J7293J7230J7586
57158D57498J8214J8885J9501K0332K1358K1879K1595K1348K1905K2644K2526
57147F87685K1739K1223K1089K0755K0283K0273K0699K0997K1156K1584K2139
$$ plain form
57247 86768 87061 87033 86484 85580 84835 84605 84575 84158 83327 82508 81812 80975 79924 78792 77509 75946 74332 73000
57229 73000 72026 71630 72366 74170 75794 76209 76102 76867 78472 79606 79713 79524 79605 79731 79844 80260 80606 79808
57211 79808 77636 75186 73293 71395 68576 64946 61284 57835 54022 49107 42865 35891 29402 24470
57197 24470 21481 20591 22341 27140 34373 42775 51558 60462 68926 76192 82209 87508 92170 95857 98922
57182 98922 102563 107618 113999 121404 129717 138630 147768 157474 168672 181733 196259 212150 229982
57169 229982 250096 272093 295470 319838 344216 366992 387215 405389 422682 439912 457498
57158 457498 475712 494597 514098 534430 555788 577667 599262 620610 642515 665159 687685
57147 687685 709424 730647 751736 772491 792774 813047 833746 854743 875899 897483 919622
57136I19622K2320K2290K2633K3359K4180K5401K7346K9209K9884K9837L0742
57125A206823L3166L6032L8625M1753M6508N3079O1207P0597Q0301Q8922R6239
57114A853252J03729J12709J22776J32978J43660J56168J71366J89587K11710
57105C197935K39234K73465L15689L67963M32949N12975O09537P22430Q47586
57096G519763R76953J104236J232465J374473J545214J755055K009106K306339
57088A9823604K634791K971157L289743L567483L773686L861512L787004L543545
57080D7252525L166439K693991K132430J471580P29380l5973p61449j414895j991953
57071E3242075k491406k905155l226119l452767l584107l617145l551813l395469
$$ plain form
57136 919622 941942 964232 986865 1010224 1034404 1059805 1087151 1116360 1146244 1176081 1206823
57125 1206823 1239989 1276021 1314646 1356399 1402907 1455986 1517193 1587790 1668091 1757013 1853252
57114 1853252 1956981 2069690 2192466 2325444 2469104 2625272 2796638 2986225 3197935
57105 3197935 3437169 3710634 4026323 4394286 4827235 5340210 5949747 6672177 7519763
57096 7519763 8496716 9600952 10833417 12207890 13753104 15508159 17517265 19823604
57088 19823604 22458395 25429552 28719295 32286778 36060464 39921976 43708980 47252525
57080 47252525 50418964 53112955 55245385 56716965 57446345 57410372 56648923 55234028 53242075
57071 53242075 50750669 47845514 44619395 41166628 37582521 33965376 30413563 27018094
57063B7018094l162804k874901k557939k238031j934357j657205j411239j198186
57055I983432j017094q65116p39223o36226n51901m82216m25457l81477l48917
57046D535805l24501l04653k86322k66795k44639k20897j97891j76786j57218
57037B356103j38847j21825j06058r1293p7846o6167n5973m6767l8796l2420k6955
57026A553156k1096j4223o512J884J1358K3055L8366N6464P1643P5158O1457L1922
57014A882632p559n0222q8659j15070j25366j22339j12362r9654q5580p1689o0033
57003I44099n0796m2552l4898k8670k3815j9314j5141j2189j0315q410o305m831
56991F86863m228m069m387n100n049l425j491q36p45K81J154q37n978j1744j6366
$$ plain form
57063 27018094 23855290 20980389 18422450 16184419 14250062 12592857 11181618 9983432
57055 9983432 8966338 8101222 7361999 6725773 6173872 5691656 5266199 4884722 4535805
57046 4535805 4211304 3906651 3620329 3353534 3108895 2887998 2690107 2513321 2356103
57037 2356103 2217256 2095431 1989373 1898080 1820234 1754067 1698094 1651327 1612531 1580111 1553156
57026 1553156 1532060 1517837 1511325 1513209 1524567 1547622 1585988 1642452 1714095 1789253 1850710 1882632
57014 1882632 1875073 1824851 1736192 1621122 1495756 1373417 1261055 1161401 1075821 1004132 944099
57003 944099 893303 850751 815853 787183 763368 744054 728913 716724 706409 697999 691694 686863
56991 686863 682635 678566 674179 669079 664030 660605 659114 658278 657533 657814 658968 658131 652153 640409 624043
56976F24043k0081k2855k3669k2626k1224k0014j8088j5298j2747j0716q307n509
56964D22909l364j737P77M214O963Q761J1485J5981K0253K1869K0306J5957Q831
56951E53205m55r946j7728k2999k5403k4780k2095j9062j6262j3074r586o821
56939C64994m713j894J961N523Q189J1163J5363K0079K4343K7836K9670K8154
56927E30668K2641J4116L453q889k0943k9300l2451l2269l1152k9438k6650k3348
56915C36438k0326j7460j4578j2226j0586r019p386o358n798m560k702j878k562
56902B20999k864j368P29J700J732J865K120K231K819M341O111P623R522J2157
56888B69717J4637J6461J8541K1139K2491K0988J7279J2665O969j78p253j2050
$$ plain form
56976 624043 603962 581107 557438 534812 513588 493574 475486 460188 447441 436725 428418 422909
56964 422909 419545 417808 418585 422799 429762 438523 450008 465989 486242 508111 528417 544374 553205
56951 553205 552750 542804 525076 502077 476674 451894 429799 410737 394475 381401 371815 364994
56939 364994 360281 358387 360348 365871 374060 385223 400586 420665 445008 472844 502514 530668
56927 530668 553309 567425 570878 561989 541046 511746 479295 447026 415874 386436 359786 336438
56915 336438 316112 298652 284074 271848 261262 252243 244857 238499 232701 228141 225439 223561 220999
56902 220999 218135 216767 217496 219196 220928 222793 224913 227144 229963 234304 240415 248038 257560 269717
56888 269717 284354 300815 319356 340495 362986 383974 401253 413918 420887 420709 413456 401406
56876D01406j4190j4698j3981j1822q648n287j957J351M201O576R520J3828J8868
56863C85167K3831K9107L5328M1890M7519N1279N1957M7621L7113K1480L135j5326
56851G60101l0918m0694m3848m2372l8503l2746k5305j7555j0513l424M474J2256
56839D90953J9222K6866L6777M7833N7848O6914P6379Q4851Q7792Q1330O4800
56828A141565L9823R095k3263n1963p2451q2755q3817p8528o9939n9657m8147
56817F19963l6437k6219j7804r536k77R043J7475K6033L6018M6623N5762O2029
56805G82673O4225O0177M8184K9066N526j9503m2558n9425o7661o8702o5670n9977
56793F06355n1833m2705l4648k7770k0824j3868q101l326K030Q442J4947K1065
$$ plain form
56876 401406 387216 372518 358537 346715 338067 332780 330823 332174 336375 342951 352471 366299 385167
56863 385167 408998 438105 473433 515323 562842 614121 666078 713699 750812 772292 775427 760101
56851 760101 729183 688489 644641 602269 563766 531020 505715 488160 477647 474223 478697 490953
56839 490953 510175 537041 573818 621651 679499 746413 822792 907643 995435 1076765 1141565
56828 1141565 1181388 1190483 1167220 1115257 1042806 960051 876234 797706 727767 668110 619963
56817 619963 583526 557307 539503 529967 529690 538733 556208 582241 618259 664882 720644 782673
56805 782673 846898 907075 955259 984325 989851 970348 927790 868365 800704 732002 666332 606355
56793 606355 554522 511817 477169 449399 428575 414707 406606 403280 405310 413752 428699 449764
56781D49764K6967L1695L3327L1142K5832J7539N752q584k2591l3679m0786m3554
56769D72824m2036l7622l2613k8311k4539k1118j8418j6395j4455j2490j0886
56758B13941r472p741o024n141m858m094k682j572j231j146j062j316j809j896
56744A63897j503j195j124r93r84j520k148j978j229j012j519j746j197n09j72
56729A45068J72Q20J467J849K013J824J058J35j46L32R75J446J872K175K059J565
56713A64684R43K46l81l76L48Q44L34n38o51m8M88Q73J535K307K633K499K077
56696A77817J132j84p85k19J47r18k306k120o57J23m13j092j136q34k08J013K170
56679A71530K211J428J020J087P94K52L38P98M75n11q03p7O05Q52J399K278K385
$$ plain form
56781 449764 476731 508426 541753 572895 598727 616266 622018 613434 590843 557164 516378 472824
56769 472824 430788 393166 360553 332242 307703 286585 268167 251772 237317 224827 213941
56758 213941 204469 196728 190704 185563 180705 176611 173929 172357 171126 169980 168918 167602 165793 163897
56744 163897 162394 161199 160075 159082 158098 156578 154430 152452 151223 150211 148692 146946 145749 145240 145068
56729 145068 145240 146060 147527 149376 151389 153213 154271 154406 154260 154592 155567 157013 158885 161060 163119 164684
56713 164684 165627 165873 165492 165116 165464 166308 166642 166104 165453 165405 165893 166766 168301 170608 173241 175740 177817
56696 177817 178949 178765 177980 177761 177908 176990 174684 172564 171907 172030 171617 170525 169389 168555 168347 169360 171530
56679 171530 173741 175169 176189 177276 178070 178322 178660 179458 179933 179422 178619 178542 179147 179999 181398 183676 186061
56662A86061J364K38k02k31r3L84R14R24P13J091J820J885J254P87N80R8k11O50
56644A98026K143K462J166l39j104j653k393k877k927k907k590j457j15K18k61
56629A85392k47L40K95n60j021o76m10n61n99p05j579k528k106q20p32j982k356
56612A69145r89K19j24q02l91N28R39J075J211O71o24j393r53l28l22k47L63N81
56594A68559j45p64l98K28K89K53O05P10J60k24K30R67J466K080K772K587J363
56577A80738L63K90K56k94m22N13J525J658J466J691J970J968K265L135L874M281
56561B05277N257P067Q710R820J1306J3087J3243J0712O931L522L13k961n079
56548B87205n220m656m766m930m147l174l207l776l716l101k635k249j821k029
$$ plain form
56662 186061 187425 187663 187461 187230 187137 187521 188435 189359 190072 191163 192983 194868 196122 196909 197489 197587 197376 198026
56644 198026 200169 202631 203797 203458 202354 200701 198308 195431 192504 189597 187007 185550 185435 185653 185392
56629 185392 185145 185485 185780 185220 184199 183523 183113 182552 181953 181248 179669 177141 175035 174215 173483 171501 169145
56612 169145 168156 168375 168251 167449 167058 167586 168525 169600 170811 171482 170858 169465 168512 168184 167862 167615 167978 168559
56594 168559 168414 167650 167252 167480 167769 168022 168627 169337 169497 169273 169503 170470 171936 174016 176788 179375 180738
56577 180738 181101 181391 181647 181353 180931 181444 182969 184627 186093 187784 189754 191722 193987 197122 200996 205277
56561 205277 210534 217601 226311 236131 247437 260524 273767 284479 291410 294932 295245 292284 287205
56548 287205 281985 277329 272563 267633 263486 260312 257105 253329 249613 246512 243877 241628 239807 237778
56534B37778l042l589k702j257m36n0L85L40m67r67l88L39J91k59k32k42p66r40
56516B23696j55N24R7o42p30p98j549k067j397m06k01k67P5o4j450k772k542j522
56498B07830j206j205m77K53k94j359j217l7O48N82O60Q96O24K07M72R78Q37M94
56480B08686Q33J201L83j048j446p25k23l67l44J01L71K72J25j45o94r11k44P51
56462B06576J332J753K350K390J303l2n71p04j056j021q0P15M00J4Q24J882J581
56445B17656N60P61K290L439L357K602J590M00m10n09p15j610k139j291p2O9l50
56428B25628n3N09J81n12l00L29K9q37q86l14l34p44m23L08K57k86j30M60L82
56409B23264N0P02J846J931J121Q62J132O94k59l33L86M85j06j26M57L87l43m09
$$ plain form
56534 237778 234736 231147 228445 227188 226752 226702 227087 227427 226960 225993 225605 225944 226135 225876 225644 225402 224636 223696
56516 223696 223541 224065 224162 223520 222790 221992 220443 218376 216979 216573 216372 216105 216180 216116 214666 211894 209352 207830
56498 207830 206624 205419 204942 205195 204901 203542 202325 202288 202936 203518 204178 205074 205698 205905 206377 207355 208192 208686
56480 208686 209519 210720 211103 210055 208609 207884 207661 207294 206950 207051 207422 207694 207819 207674 206980 206069 205825 206576
56462 206576 207908 209661 212011 214401 215704 215672 215101 214397 213341 212320 212240 212955 213355 213369 214193 216075 217656
56445 217656 218216 218977 221267 224706 228063 230665 232255 232655 232245 231736 231021 229411 227272 225981 225909 225978 225628
56428 225628 225575 226084 226265 225753 225453 225782 225811 224974 224088 223774 223440 222696 222273 222581 222838 222552 222422 222882 223264
56409 223264 223314 224016 225862 227793 228914 229776 230908 231602 231343 231010 231396 231881 231775 231649 232106 232493 232150 231741
56391B31741L53P65P02J243K285K360J190K49M44J111J525J680J441P17L22R92
56375B49120J861J613O33J76Q1n77j257p71L47P16P48J805L263L249J938J272
56359B64217J545J162j00n69K93J019P96M75O00O82P43J426K332K409J963K188
56343B81181K854K674J799J498J699J297O36J048K182K519K332L174M646M759
56329C14298L508K961L577L646K725K456L419M113L704L002K224O13j238j555
56315C47453l93L09qm0L13l67j778j653L79J902J610J096J751K810L479M263N092
56298C66218M895L997M230N801O690N974N016M657M137L582M418O337O955N671
56284D38578M823N838P202P495P560Q230Q756Q847R629J1257J2198J2021J2295
$$ plain form
56391 231741 232094 232859 233561 234804 237089 239449 240639 240888 241332 242443 243968 245648 247089 247806 248128 249120
56375 249120 250981 252594 253227 253403 253484 252907 251650 250879 251226 251942 252690 254495 257758 261007 262945 264217
56359 264217 265762 266924 266824 266255 266548 267567 268363 268838 269438 270120 270863 272289 274621 277030 278993 281181
56343 281181 284035 286709 288508 290006 291705 293002 293638 294686 296868 299387 301719 304893 309539 314298
56329 314298 317806 320767 324344 327990 330715 333171 336590 340703 344407 347409 349633 350246 349008 347453
56315 347453 347060 347369 347361 347321 347634 347267 345489 343836 344215 346117 347727 348823 350574 353384 356863 361126 366218
56298 366218 371113 375110 379340 385141 391831 397805 402821 407478 411615 415197 419615 425952 432907 438578
56284 438578 443401 449239 456441 463936 471496 479726 488482 497329 506958 518215 530413 542434 554729
56271E54729J3640J4739J5350J7188K0543K3050K3406K3474K5158K7922L0863
56260G90062L4479L8861M2806M6246N1001N7765O5041P2207Q0788R1345J02158
56249A472759J12534J24281J38197J51977J63505J73420J82610J89931J94267
56240B903481J96131J95352J89778J78129J61767J41946J17884Q9203N7705K5058
56230D256434q671m2614p3865j00445j23050j42418j57578j68029j74936j78691
56220C086137j78166j73721j67905j61734j53530j42965j32748j24431j16047
56211A734890j06072r6324q8711q2250p5688o9906o5393o0419n4106m8404m4624
56200I42993m1059l6282l1778k8906k6331k2916k0140j9137j8271j6126j3980
$$ plain form
56271 554729 568369 583108 598458 615646 636189 659239 682645 706119 731277 759199 790062
56260 790062 824541 863402 906208 952454 1003455 1061220 1126261 1198468 1279256 1370601 1472759
56249 1472759 1585293 1709574 1847771 1999748 2163253 2336673 2519283 2709214 2903481
56240 2903481 3099612 3294964 3484742 3662871 3824638 3966584 4084468 4173671 4231376 4256434
56230 4256434 4247763 4205149 4131284 4030839 3907789 3765371 3607793 3439764 3264828 3086137
56220 3086137 2907971 2734250 2566345 2404611 2251081 2108116 1975368 1850937 1734890
56211 1734890 1628818 1532494 1443783 1361533 1285845 1215939 1150546 1090127 1036021 987617 942993
56200 942993 901934 865652 833874 804968 778637 755721 735581 716444 698173 682047 668067
56189F68067j2963j1775r588q044q007p548n629m415n305o114m963l530l516l328
56175E73342j507q6j108k853k848j814j398q53P97K097J844J659K943M074L552
56160E77841K914L623M205L549L703O173Q680R000Q828J0407J2511J3303J4026
56147F78763J6361J9171K1222K4070K8909L3838L7541M2216M9446N6809O2163
56136A070509O7402P4095P9232P9519P6232P1780O5266N5907M6978M1581L7926
56125A766427L3280K8937K6541K3369J6398P667N67n741j3178j9743k3077k5781
56113A815666l1659l9741m7200n4908o4482p3050p6597p5839p3545o9111o1073
56102A148461n1828m4392l7557k9476k2491j8980j6203j1067o196n181n711l820
$$ plain form
56189 668067 655104 643329 633741 625697 617690 610142 604513 600098 594793 588679 583716 580186 576670 573342
56175 573342 571835 571749 570641 567788 564940 563126 561728 560875 561672 563769 565613 567272 570215 574289 577841
56160 577841 580755 584378 588583 592132 595835 602008 610688 619688 628516 638923 651434 664737 678763
56147 678763 695124 714295 735517 759587 788496 822334 859875 902091 951537 1008346 1070509
56136 1070509 1137911 1212006 1291238 1370757 1446989 1518769 1584035 1639942 1686920 1728501 1766427
56125 1766427 1799707 1828644 1855185 1878554 1894952 1902619 1903186 1897445 1884267 1864524 1841447 1815666
56113 1815666 1784007 1744266 1697066 1642158 1577676 1504626 1428029 1352190 1278645 1209534 1148461
56102 1148461 1096633 1052241 1014684 985208 962717 943737 927534 916467 910271 905090 899379 895559
56090H95559j120j078j944k87K034J642P25K983O028N513L537M983Q511R312P971
56075I44369Q494J0099R246P419Q657J1532J1675J0121J1062J3539J3540J2087
56063A071840J3097J5366J5003J3410J4522J6524J4996J1857J2197J4635J4002
56052A227449J1321J1705J4384J4428J2485J3214J5880J6125J5219J7765K2132
56041A392107K3105K2143K4800K9901L1753L1116L3230L6884L6558L3772L4856
56030A730225L8895L9366L6411L5902L7661L6426L3208L3646L6451L5671L3082
56019B126944L5673M2239M5358M5298M8665N4699N6738N6003N9740O6821O9620
56008B707798O8912P2121P8184P9701P8591Q3315R1970R5207R4719J00802J12522
$$ plain form
56090 895559 894439 893361 891417 891130 893164 894806 895531 898514 904542 910055 913592 918575 927086 936398 944369
56075 944369 952863 962962 972208 979627 988284 999816 1011491 1021612 1032674 1046213 1059753 1071840
56063 1071840 1084937 1100303 1115306 1128716 1143238 1159762 1174758 1186615 1198812 1213447 1227449
56052 1227449 1238770 1250475 1264859 1279287 1291772 1304986 1320866 1336991 1352210 1369975 1392107
56041 1392107 1415212 1437355 1462155 1492056 1523809 1554925 1588155 1625039 1661597 1695369 1730225
56030 1730225 1769120 1808486 1844897 1880799 1918460 1954886 1988094 2021740 2058191 2093862 2126944
56019 2126944 2162617 2204856 2250214 2295512 2344177 2398876 2455614 2511617 2571357 2638178 2707798
56008 2707798 2776710 2848831 2927015 3006716 3085307 3168622 3260592 3355799 3450518 3551320 3663842
55997C663842J19059J20442J27371J40330J48980J52916J62465J77948J89148
55988E002501J96416K10716K31586K47545K59413K79717L07859L30690L49146
55979G415589L77947M17213M52289M83959N29322N89724O49051P07366P83380
55970A2405840Q79563R80245J089254J231944J414578J622691J866748K185127
55962B3675990K592587L071737L624339M280658N050881N928438O954971Q216754
55954F3396355R763819J1609880J3825437J6528315J9748360K3408975K7449518
55947A85730659L1724336L5573290L7625020L6325209L0784042K1140688Q364155
55940C87267399n939452j9585119l0255375l6450983l8160165l6559677l3111112
$$ plain form
55997 3663842 3782901 3903343 4030714 4171044 4320024 4472940 4635405 4813353 5002501
55988 5002501 5198917 5409633 5641219 5888764 6148177 6427894 6735753 7066443 7415589
55979 7415589 7793536 8210749 8663038 9146997 9676319 10266043 10915094 11622460 12405840
55970 12405840 13285403 14265648 15354902 16586846 18001424 19624115 21490863 23675990
55962 23675990 26268577 29340314 32964653 37245311 42296192 48224630 55179601 63396355
55954 63396355 73160174 84770054 98595491 115123806 134872166 158281141 185730659
55947 185730659 217454995 253028285 290653305 326978514 357762556 378903244 387267399
55940 387267399 381327947 361742828 331487453 295036470 256876305 220316628 187205516
55933A87205516k8926483k4690237k0781722j7341036j4357412j1807251r698045
55926E9603330q000841o629752n511621m616931l910641l332635k844215k444379
55918B2312315k125036j853695j612496j412302j254836j117849r89369q81396
55910A1065336p97975p21983o44757n78640n29323m83713m35349l95373l68283
55901F109940l41693l09777k83347k67336k50673k27605k07937j97144j86270
55892C838158j70250j57245j51439j44537j32285j22296j17977j11406r9374r0234
55882B541115q7736q3746p3943o5437o2011n6896m7127m0576m1590m3588m2673
55871A895792m4997n3465o0330o0238n8574o0019o0550n7305n4874n5428n3642
$$ plain form
55933 187205516 158279033 133588796 112807074 95466038 81108626 69301375 59603330
55926 59603330 51602489 44972737 39461116 34844185 30933544 27600909 24756694 22312315
55918 22312315 20187279 18333584 16721088 15308786 14053950 12936101 11946732 11065336
55910 11065336 10267361 9545378 8900621 8321981 7792658 7308945 6873596 6478223 6109940
55901 6109940 5768247 5458470 5175123 4907787 4657114 4429509 4221572 4024428 3838158
55892 3838158 3667908 3510663 3359224 3214687 3082402 2960106 2842129 2730723 2631349 2541115
55882 2541115 2453379 2369633 2295690 2230253 2168242 2111346 2064219 2023643 1982053 1938465 1895792
55871 1895792 1850795 1797330 1737000 1676762 1618188 1558169 1497619 1440314 1385440 1330012 1276370
55860A276370m7475m3093m3263m1847l5503k9930k8562k5995j8851j2670j1497
55849I37684j0856p409n786r236j2866j2803j3018j6681j9429j7726j5630j6859
55837G79385j8059j6028j3965j4588j4582j1629r582j1014j2013r766p955r227
55825F30977r762o902m792o684q772p606o591r140j1941j1164r180r238r401p443
55811E12361n927o856p051m185j707k447l138o86J903J456Q03L246O251O438N755
55796E06216O925P635N034J480J83o23l655o981p681p208q013q744p596o412o898
55781D63662o829m587l121m840o952o631o230q327j0189q452n111l391j750K477
55767C89729P201Q966Q745Q943P992L484k467o313q674j1671j3762j2594j0177
$$ plain form
55860 1276370 1228895 1185802 1142539 1100692 1065189 1035259 1006697 980702 961851 949181 937684
55849 937684 926828 919419 913633 904397 891531 878728 865710 849029 829600 811874 796244 779385
55837 779385 761326 745298 731333 716745 702163 690534 680952 669938 657925 648159 640204 630977
55825 630977 621215 614313 609521 602837 594065 586459 579868 570728 558787 547623 538443 529205 519804 512361
55811 512361 506434 499578 492527 488342 486635 484188 481050 480364 482267 483723 484526 487772 494023 500461 506216
55796 506216 513141 520776 525810 527290 527473 526850 523195 516214 508533 501325 493312 484568 476972 470560 463662
55781 463662 456833 452246 449125 444285 437333 430702 424472 416145 405956 397504 392393 389002 387252 389729
55767 389729 396930 405896 414641 423584 431576 435060 432593 426280 417606 405935 392173 379579 369402
55754C69402r797j0245q464n517m680n662n844n396o227p529p135n773n574n967
55740B75592n183m037m098l955j594J328J783L01m76m47j269k545k792k724l729
55725B46155m648l753k378k857m397m658l891l822m005k892j179n52m55N90J899
55710B09157K089K059L330M910N041M433M678N026L900J958O29p96l519o420p721
55695B28754p780p567o432m160k856l760m579l160j259j265j869p42R86J012L40
55680A85663J288L037L329K773L338M256L537J991J571J435k82k317k228r33j086
55665B05372k281k245j447k029l165k127P08K354K174K154K736K469J570J782
55651B08025K915L156K570K690L068J900l79j657j884k678l780l532k483k761
$$ plain form
55754 369402 359605 349360 340896 335379 330699 325037 319193 313797 307570 300041 292906 287133 281559 275592
55740 275592 270409 266372 262274 258319 256725 258053 259836 260137 259661 259214 257945 255400 252608 249884 246155
55725 246155 241507 237754 235376 232519 228122 223464 219573 215751 211746 208854 207675 207123 206668 207258 209157
55710 209157 211246 213305 216635 221545 226586 231019 235697 240723 244623 246581 247210 246414 242895 236475 228754
55695 228754 220974 213407 206975 202815 199959 196199 191620 188460 187201 185936 184067 183325 184311 185323 185663
55680 185663 186951 189988 193317 196090 199428 203684 207221 209212 210783 212218 211936 209619 207391 206458 205372
55665 205372 203091 200846 199399 197370 194205 192078 192786 195140 197314 199468 202204 204673 206243 208025
55651 208025 210940 214096 216666 219356 222424 224324 223945 222288 220404 217726 213946 210414 207931 205170
55637B05170m210m686l985l866m494m366l590l704m468m185k962k289j897m88
55623A55980R54L03j652k107r57o51j578j624m46j35j183j658r75q11j599j669
55607A40192o39k12q81j099m78n68j656k016j179q43j571j659l52O59J44q15r75
55590A26052o51m00o5J46l46j058r55m30o61j112k29J526K139J531J645K824L198
55573A33154K130J340J857K642K998L718N014N781N667N565N468M198J862J69
55559A81563l04q92k341l781m670n498o169n839m800m271m178l373k110j794k206
55544A29337j622L8J002Q12R06J644J616N67R4P09R34J12m83k22j23n93o42j07
55526A33979j62q86q70K8J86q62j595j366j345j899j823j043j209k569l146k174
$$ plain form
55637 205170 200960 196274 192289 188423 183929 179563 175973 172269 167801 163616 160654 158365 156468 155980
55623 155980 156934 157237 155585 153478 152521 151870 150292 148668 148222 148087 146904 145246 144271 143460 141861 140192
55607 140192 139553 139341 138460 137361 136883 136315 134659 132643 131464 130621 129050 127391 127039 127698 127842 127027 126052
55590 126052 125401 125001 124936 125082 124736 123678 122723 122293 121632 120520 120291 121817 123956 125487 127132 129956 133154
55573 133154 135284 136624 138481 141123 144121 147839 152853 158634 164301 169866 175334 179532 181394 181563
55559 181563 181259 180367 178026 174245 169575 164077 157908 152069 147269 142998 138820 135447 133337 131543 129337
55544 129337 127715 127753 128755 129567 130473 132117 133733 134300 134394 135103 136037 136149 135666 135444 135321 134728 134086 133979
55526 133979 133817 132931 132061 132089 132275 131413 129818 128452 127107 125208 123385 122342 121133 118564 115418 113244
55510A13244j475k123k601j809j052j340j407k50P84M79J1O78J348M23j323j899
55494A01688q86O11J685J939J189K1m68k57m37j154j190k10N23M01M71J207J464
55477A06597O58j7K41M02m09j322j378j020p97l32L64L48m28o15J77M72m64j214
55459A01263o76J18P0o0O32J371J226P81P85O47k18j051j108r11q72k90J012J698
55441A04417R84O0J11M64J64k77j57p6o07r10k17O73Q02O51R18J008K43p08r69
55422A06574r01j103j235r30p05p74l50Q34J650J388R06Q92O48j88n62M8K76q61
55404A05607k070j800p20l96q08r48p11n37k40K97L08n73j332j144p48r37j026
55387I2222j74J025J617J773J882J548P43M95J119J295K65o76m54j19p93j428
$$ plain form
55510 113244 111769 109646 107045 105236 104184 102844 101437 101187 101971 102450 102461 103139 104487 104910 103587 101688
55494 101688 100802 101413 103098 105037 106226 106247 105779 105522 105085 103931 102741 102531 103054 103455 103926 105133 106597
55477 106597 107255 107238 107479 107881 107472 106150 104772 103752 102955 102623 102987 103335 102907 102292 102469 102941 102477 101263
55459 101263 100587 100705 100775 100715 101347 102718 103944 104725 105510 106157 105939 104888 103780 102869 101997 101707 102719 104417
55441 104417 105401 105461 105572 106036 106200 105923 105766 105690 105083 104173 103956 104629 105431 106082 107000 108008 108251 107543 106574
55422 106574 105673 104570 103335 102405 101700 100926 100576 101410 103060 104448 105354 106246 106894 106706 106144 106192 106468 105607
55404 105607 103537 101737 101017 100621 99813 98865 98154 97617 97377 97674 97982 97409 96077 94933 94185 93248 92222
55387 92222 92048 93073 94690 96463 98345 99893 100636 101131 102250 103545 103810 103134 102680 102561 101768 100340
55371A00340o98M60M13l47k83M57N38o7l04k1J42K32N83O32k03j120j072m96m09
55352I8777o35m53j26j85j62M37Q22K52m07q5N90N34K61P48J338Q64q3r0O02O36
55332A03635Pj40L23M72J27j11k24n47o31J9O23J97o45o47mJ87p8n4N5l80p67
55311A01417o3J192J522Q04J47j50o71j246j051k48K15K32M11O22K32n18q69r38
55293A01040j266j408n81P24J356J316J400J524J070M02K85L06l95j266r98K93
55277A03802J357J812K094J908P12o09o82M5p6j109j528q96l46k95J68J213J615
55260A09185P44m15q17n44p8K87J61o04j235r49l26m22q29k91R91J524R26K86
55242A07594J10k61r34j064n54m40j096j609j364q51m96p1M29O09O08R38J291
$$ plain form
55371 100340 99642 100102 100515 100168 99885 100342 100880 100813 100509 100488 100630 100862 101445 102077 101874 100754 99682 99186 98777
55352 98777 98142 97689 97563 97378 97216 97653 98475 98727 98320 98235 98825 99359 99620 100368 101706 102570 102487 102397 102999 103635
55332 103635 103642 103502 103825 104297 104424 104313 104089 103542 102911 102930 103553 103750 103105 102458 102454 102641 102563 102509 102564 102184 101417
55311 101417 101354 102546 104068 104872 105019 104869 104198 102952 101901 101653 101868 102100 102511 103133 103365 102847 101978 101040
55293 101040 99774 98366 97785 98509 99865 101181 102581 104105 105175 105577 105862 106168 105773 104507 103509 103802
55277 103802 105159 106971 109065 110973 111685 111076 110394 110439 110363 109254 107726 106830 106484 106189 106357 107570 109185
55260 109185 109929 109514 108697 108153 108075 108362 108523 107919 106684 105735 105409 104987 104158 103867 104858 106382 107308 107594
55242 107594 107704 107443 106509 105445 104891 104451 103355 101746 100382 99531 99035 98964 99393 100002 100610 101548 102839
55225A02839Q46j13l77K57P24N87O14J142J370P69q1n21n94m82j58J79K90M81
55207A07772J087J540J166M82M34P08K91o04r14o79q18j168p44J84L14k43N3J440
55189A10301K245J552M41j35p16j684k085j209J12P99Q70P61M34j04n01p73j258
55172A09050j556q51M89J029M43JM43R44P69M24M81N69L06q9n39j246j615o07
55154A08445J304K150J101m07r02o75n07k06M95R46O49K50L88N98K24m26p21n80
55136A12126j24O59J285R11l53j274j169o49k75K24Q00O33m10j154q10n5L64Q06
55118A11535J565J782P25q12j495j018N3J198J875J468J82p68n74K46Q55J114
55102A17931J078N86p4r8N65R53N91J73J54l8o99j052n94n9j14k68M8M47N50Q27
$$ plain form
55225 102839 103685 103572 103195 103452 104176 104763 105377 106519 107889 108658 108577 108056 107462 106980 106822 107001 107291 107772
55207 107772 108859 110399 111565 112047 112481 113189 113480 112876 111962 111283 110465 109297 108553 108737 109051 108808 108861 110301
55189 110301 112546 114098 114539 114404 113688 112004 109919 108710 108822 109621 110491 111252 111686 111582 111081 110308 109050
55172 109050 107494 106643 107132 108161 108604 108605 109048 109992 110761 111185 111666 112235 112541 112452 111913 110667 109052 108445
55154 108445 109749 111899 113000 112593 111691 111016 110509 110303 110798 111744 112393 112643 113031 113629 113853 113427 112706 112126
55136 112126 112002 112661 113946 114857 114504 113230 112061 111412 111137 111361 112161 112794 112384 111230 110420 110365 110729 111535
55118 111535 113100 114882 115607 114795 113300 112282 112335 113533 115408 116876 117058 116290 115716 115962 116817 117931
55102 117931 119009 119595 119521 119423 119988 120941 121532 121705 121859 121821 121122 120070 119476 119417 119303 119035 119083 119530 120080 120907
55082A20907J519J828J196L53J03J37m7n6M79R20O57J58Q4J97J25J34K86r2j101
55063A27787j541o22O77J033N88J37k87q17q11L5N86k07j554k009j644j492j587
55046A18272j157k57L27N03P36Q30K64n39n92J45P94R48Q83O18q9r16j158p20
55028A18892j32K86N15M04p7m00j35L12L48J86L77P37N70k37j115j520j230l24
55010A17457O22Q51M20K25O00P03l7q29p48j01M02Q55J477J632Q00k26l90O3K95
54991A24071L61O70P06j44j031n96Q31J638J345R62J011P40k91j294j331m11Q18
54974A28055J663J568M82p86j266q54j48M70R09R05L49k20k34L2L9m0K11M67J27
54955A31729n41p93n82l32O3Q35J355Q54j18k73M06O49r4r06r40m99k53l40n42
$$ plain form
55082 120907 122426 124254 125450 125803 125906 126043 125996 125940 126419 127339 127996 128154 128238 128435 128560 128694 128980 128888 127787
55063 127787 126246 125624 126301 127334 127922 128059 127772 126955 126144 126179 126765 126558 125004 122995 121351 119859 118272
55046 118272 117115 116858 117185 117688 118424 119254 119518 118979 118387 118532 119326 120274 121157 121775 121686 120770 119612 118892
55028 118892 118760 119046 119561 119965 119888 119488 119353 119665 120013 120199 120576 121313 121883 121646 120531 119011 117781 117457
55010 117457 118079 118930 119350 119575 120175 120878 120841 120012 119264 119163 119565 120420 121897 123529 124329 124103 123713 123776 124071
54991 124071 124432 125102 125808 125664 124633 124037 124868 126506 127851 128813 129824 130564 130273 128979 127648 127237 128055
54974 128055 129718 131286 131768 130982 129716 128862 128714 129184 130093 130998 131347 131127 130893 130925 130964 130924 131135 131602 131729
54955 131729 131188 130395 129813 129481 129544 130379 131734 132588 132470 132197 132603 133252 133158 132252 131312 130813 130560 130220 129678
54936A29678o60n29k16k20p36j048m29O34J133J144J509K199K324J798J645K357
54920A40583L230L672M008M615N321N991O659O776N456K994R76K25l45k000m210
54905A83951n396n110m395m203m339m136l526l071l086l086k353j021j79n91j643
54890A37816k080j479m75K72O87R69J267J700K229K519K370K128K242K580K746
54875A55491K796L124L771M482N212N881N865M567K481Q30kq85k612m743o084
54860A80174n903m496k881k044k223k866l356l564l557l192k415j558q80k44L30
54845A41325K85p08k027k768k753k300j519n49N6mj79O6K87j18p03o82l24m37
54827A26948q09n59J79L25l56q38m46K56N67N88P41J141J647J912J435K86l94
$$ plain form
54936 129678 129018 128489 128273 128053 127317 126269 125840 126474 127607 128751 130260 132459 134783 136581 138226 140583
54920 140583 143813 147485 151493 156108 161429 167420 174079 180855 186311 189305 190281 190506 190161 188161 183951
54905 183951 178555 173445 169050 164847 160508 156372 152846 149775 146689 143603 141250 140229 140050 139459 137816
54890 137816 135736 134257 133782 134054 134741 135710 136977 138677 140906 143425 145795 147923 150165 152745 155491
54875 155491 158287 161411 165182 169664 174876 180757 186622 191189 193670 194500 194498 193613 191001 186258 180174
54860 180174 174271 169775 166894 164850 162627 159761 156405 152841 149284 146092 143677 142119 141239 140995 141325
54845 141325 141610 140902 138875 136107 133354 131054 129535 128986 129042 129038 128859 128925 129212 129094 128391 127709 127385 126948
54827 126948 126139 125580 125759 126084 125728 124890 124444 124700 125267 125855 126596 127737 129384 131296 132731 133017 132623
54810A32623L26J593J664L27q87j019p80r27r84l10O14Q77M01k14n45m99r4M24
54792A32590P12Q10J066J380J194M56q4P5M88M95J22j79k83n05j126k006k538
54775A32667k053n40J246K640L672M412M341L194J970J980L196M550N538O355
54761A73168O694N950M610L954M076L644J999O9j348k773m695o338o797o376n830
54746A70007n077l741k253j414j281j401j661k158k568k468j974j459q83r3N85
54731A42161O66K96J06M15J001J567J988K182K140K038K135K576L325M153M699
54716A71448M792M695M674M413L262J153j223l155m387m968n092n151n407n528
54702A59526m965l800k673j945j512j349j490j471o98N04J058N88j14l17k28k99
$$ plain form
54810 132623 132949 134542 136206 136533 135646 134627 133847 132920 131936 131626 132240 133117 133518 133304 132759 132260 132166 132590
54792 132590 133302 134112 135178 136558 137752 138208 138124 138199 138687 139182 139304 139125 138842 138337 137211 135205 132667
54775 132667 130614 130074 131320 133960 137632 142044 146385 149579 151549 153529 156725 161275 166813 173168
54761 173168 179862 185812 190422 194376 198452 202096 204095 204164 202816 200043 195348 189010 182213 175837 170007
54746 170007 164930 161189 158936 157522 156241 154840 153179 151021 148453 145985 144011 142552 141669 141576 142161
54731 142161 142827 143123 143229 143644 144645 146212 148200 150382 152522 154560 156695 159271 162596 166749 171448
54716 171448 176240 180935 185609 190022 193284 194437 193214 190059 185672 180704 175612 170461 165054 159526
54702 159526 154561 150761 148088 146143 144631 143282 141792 140321 139623 140127 141185 141773 141659 141342 141114 140815
54686A40815m25l30j57j55k62l15l54m03l97m01n16n13j56J65j59r34j315j079
54668A33109q58r79r86n78j29J67O74J468J820J172m2r78j273j005m06N8j7l11
54650A30906mJ017J872J913J434Q67J46p28j263j171p98m07K41J104J490J067
54634A37686N18N55Q82Q32M61K50K13Kl54m89l45k73n81j192j673j513o92R7J76
54615A34560k15k46L41R97J236J066N93k5l70k07l6l07m55J72Q28K86r09r82K27
54596A36554Q73P2q30o92l09n42o19K15R52M16o49q29l09j93l99m9P21J001Q00
54577A36184Q77J184R51J33n35p82r49j053q05l50k6L68J100J682J513R74Q40
54560A41306R94Q29M99N57P28K61o08q88l68J46J56k2o1nJ49M05M40J05jO62J526
$$ plain form
54686 140815 140390 140060 139903 139748 139486 139171 138817 138414 138017 137616 137100 136587 136431 136596 136437 135503 134188 133109
54668 133109 132251 131272 130286 129708 129579 129746 130420 131888 133708 134880 134838 133860 132587 131582 131176 131234 131217 130906
54650 130906 130902 131919 133791 135704 137138 138005 138151 137423 136160 134989 134191 133784 134025 135129 136619 137686
54634 137686 138204 138759 139641 140473 140934 141184 141397 141399 141045 140556 140211 139938 139357 138165 136492 134979 134287 134384 134560
54615 134560 134345 134099 134440 135437 136673 137739 138332 138307 137937 137730 137694 137387 136932 137104 137932 138218 137309 136327 136554
54596 136554 137427 137499 136669 135977 135668 135126 134507 134722 135674 136090 135441 134612 134303 134110 133711 133662 134383 135384 136184
54577 136184 137061 138245 139196 139329 138794 138012 137063 136010 135205 134855 134829 135197 136297 137979 139492 140466 141306
54560 141306 142300 143129 143628 144185 144913 145174 144566 143678 143310 143456 143612 143590 143529 143524 143673 144078 144518 144623 144622 145284 146810
54539A46810J622J038O57O96O78N41O08N74j70j255j554q40k7L30O23J123J386
54522A52840J075M23l12j071j504j186m45r1k44k64R3M20O09J024J531J410N22
54505A54830m14r71j445j882j712q79k58l91o34k45L93M39p0l74j27K31J31m95
54487A46127j174j305p28L1L29J76O8J71K05J05J90M96O25L75Q9J13M38R69J639
54468A48939K115J924J129L79P4m4k61l54n6M09O10N15M41N18M54On45m85M74
54449A56242J550J545K64j174j683j372r11m40K38P95N76m23j450j792j296l50
54433A50319K50j64j093r97P41K561K542R39k96k44J62N1k31j48J08L49Q76J665
54415A57390J971J417O92N39P01N23K0k76k23j84m00o61n41J23R15J169Q17O06
$$ plain form
54539 146810 148432 149470 150127 150823 151501 152042 152650 153224 153054 151799 150245 149405 149378 149708 150331 151454 152840
54522 152840 153915 154338 154026 152955 151451 150265 149820 149729 149485 149221 149314 149734 150343 151367 152898 154308 154830
54505 154830 154416 153445 152000 150118 148406 147527 147269 146878 146244 145999 146392 146831 146761 146387 146260 146491 146622 146127
54487 146127 144953 143648 142920 142951 143280 143456 143524 143695 143900 144005 144195 144691 145316 145691 145780 145893 146331 147300 148939
54468 148939 151054 152978 154107 154486 154560 154516 154255 153901 153845 154254 154864 155379 155820 156338 156792 156798 156253 155768 156242
54449 156242 157792 159337 159601 158427 156744 155372 154461 154021 154259 155054 155630 155207 153757 151965 150669 150319
54433 150319 150569 150405 149312 148315 149056 151617 154159 155098 154802 154558 154720 154771 154540 154392 154500 154849 155725 157390
54415 157390 159361 160778 161470 162009 162710 163233 163253 162977 162754 162570 162170 161509 160968 161091 162006 163175 163992 164598
54397A64598J051J544J256N29L92Q73J011N25K52O10Q77N15Q3J99M97M19K26L96
54379A75853O86N45L1m19o57o62j70Q91J838J791O87o65j342q87N62K294L491
54362A83867L927M045M201M271M139M071M248M365M059L280K084M89j140k131
54348B23775k364k614l595n018n990n944m937l415k094j597j832k023j726j302
54334A79324j142r72m73m9k99j059j642j784j739j600j144l74L16O03N32L00j3
54317A68785l70o80q43q26o82m91k27J64M78K46n93j264r60K0N80K90j82l14m82
54298A62649j116j790j825j284o86j28N96J274J372R04N70Q38J290J151L07m07
54282A63715p6J130J950J431J65l93K63J152J212N79J40K57N14M37R6k7M59J322
$$ plain form
54397 164598 165649 167193 168449 168978 169370 170243 171254 171779 172031 172641 173518 174033 174116 174315 174812 175231 175457 175853
54379 175853 176539 177084 177115 176696 176039 175377 175207 176098 177936 179727 180414 179749 178407 177520 178082 180376 183867
54362 183867 187794 191839 196040 200311 204450 208521 212769 217134 221193 224473 226557 227046 225906 223775
54348 223775 221411 218797 215202 210184 204194 198250 193313 189898 187804 186207 184375 182352 180626 179324
54334 179324 178182 177210 176737 176688 176389 175330 173688 171904 170165 168565 167421 167047 167363 167966 168498 168798 168785
54317 168785 168415 167735 166892 166066 165384 164893 164666 164830 165308 165554 164961 163697 162737 162757 163337 163627 163445 163131 162649
54298 162649 161533 159743 157918 156634 155948 155820 156416 157690 159062 159966 160536 161374 162664 163815 164122 163715
54282 163715 163639 164769 166719 168150 168315 167922 168185 169337 170549 171128 171268 171525 172039 172476 172572 172545 173004 174326
54264A74326J760J194k2r46j069n73K62J207J702J174oo80l53K02K19J4J41L22
54246A78874Pm67l20L38N88O7n81p01m20k24k29k35j58j61l55n44l68K41Q00P99
54226A76951M58N07J097J424Q32k41q90r19q22q31o76k34J98M13N81Q37R55O67
54208A80307K8o97j349j829j951j579r46n23n12o06m70k38k58l78l8P71J151M27
54190A71310p88j190l33J007J893K090J838J363P92J79n22j246j576j167k72N15
54174A73893R87J287J311Q09J01p7M02Q22O74K45j3j42l12m46n22p88j331j849
54156A75051k138k309k292j701m91P02J261J176O46k70j278j600p63P31J925K362
54140A71012K184J695J173Q62P47M98o3o89j034r92n91Q8P48J015R12Q03Q11P53
$$ plain form
54264 174326 176086 177280 177258 176312 175243 174670 174932 176139 177841 179015 179009 178329 177976 178178 178397 178411 178552 178874
54246 178874 178881 178414 178094 178432 179020 179087 178506 177805 177385 177161 176932 176697 176539 176378 176023 175479 175111 175352 176152 176951
54226 176951 177409 177916 179013 180437 181269 181028 180138 179219 178397 177566 176890 176656 176854 177267 177848 178685 179640 180307
54208 180307 180335 179638 178289 176460 174509 172930 171984 171461 170949 170343 169873 169635 169377 168999 168961 169732 170883 171310
54190 171310 170522 169332 168999 170006 171899 173989 175827 177190 177982 178161 177639 176393 174817 173650 173378 173893
54174 173893 174880 176167 177478 178287 178388 178311 178713 179535 180209 180454 180441 180299 179987 179541 179019 178231 176900 175051
54156 175051 172913 170604 168312 166611 166120 166822 168083 169259 169905 169635 168357 166757 165994 166725 168650 171012
54140 171012 173196 174891 176064 176926 177673 178171 178108 177419 176385 175393 174802 174890 175638 176653 177565 178368 179179 179932
54122A79932O87Q94J184R43J16m74j89O51J300J407J010L63qL07Q53P25j6k06
54104A89479O89J639J459L74n64r07r28q27o63n81m79Q3J054J615J386J232K045
54087A96106L336L994L982M229N061N843N986N459M262K266k72k547l766l658
54073B30281k648j698j661k349k687k076j087m57j82q8m81j410k020j633q65o44
54057B08295p77m99J0ll92l13K56N43N66J284K865M012L643K333J521J875K967
54040B28186M093M903N453N947O464O961P549Q402R130Q881P438N743M675L940
54026C17765K935K035J973K334J990Q15k17o53j004j455j423p76l55p25j378j707
54010C20154j949k539l243l608l821m418n412o187o185n395m315l561l356l400
$$ plain form
54122 179932 180619 181513 182697 183640 183756 183282 183093 183744 185044 186451 187461 187824 187816 188123 188976 189701 189685 189479
54104 189479 190168 191807 193266 193640 193076 192169 191241 190414 189751 189170 188691 188774 189828 191443 192829 194061 196106
54087 196106 199442 203436 207418 211647 216708 222551 228537 233996 238258 240524 240252 237705 233939 230281
54073 230281 227633 225935 224274 221925 219238 217162 216075 215618 215436 215348 214867 213457 211437 209804 208939 208295
54057 208295 207518 207019 207029 207026 206634 206321 206577 207120 207686 208970 211835 215847 219490 221823 223344 225219 228186
54040 228186 232279 237182 242635 248582 255046 262007 269556 277958 287088 295969 303407 309150 313825 317765
54026 317765 320700 322735 324708 327042 329032 329847 329630 328977 327973 326518 325095 324319 323964 323239 321861 320154
54010 320154 318205 315666 312423 308815 304994 300576 295164 288977 282792 277397 273082 269521 266165 262765
53996B62765l283k965k599k154j686j600k082k471j970q73l66j039k291l213l381
53981B30792k789j756r99j096j677j805j240o57n56o72o35m73k08K86P94Q02L29
53964B18440R5N24J187J533J591J550J267O34J8p1N01J459K281K405J803J423
53948B36640K352M313N762N758N078N043N897O942P701Q296Q974R928J1376J3204
53934C37264J4526J4078J1272O755J886k303n598q115r467q906o501l671j905
53921C39315j175l39J118K572L496M217N113N904O228O340O661P093P271P240
53907D01054P372P770Q033P579O075L762J427k39j188j898k679l483m195m666
53893D24724m675m305m235n010o129o617o431o432o913p167o782o421o751p321
$$ plain form
53996 262765 259482 256517 253918 251764 250078 248478 246396 243925 241955 241082 240716 239677 237386 234173 230792
53981 230792 228003 226247 225248 224152 222475 220670 219430 218773 218217 217545 216910 216437 216229 216515 217309 218111 218440
53964 218440 218535 219059 220246 221779 223370 224920 226187 226821 226839 226768 227269 228728 231009 233414 235217 236640
53948 236640 238992 243305 249067 254825 259903 264946 270843 277785 285486 293782 302756 312684 324060 337264
53934 337264 351790 365868 377140 383895 385781 383478 377880 369765 360298 351392 344891 341220 339315
53921 339315 338140 337801 338919 341491 344987 349204 354317 360221 366449 372789 379450 386543 393814 401054
53907 401054 408426 416196 424229 431808 437883 441645 443072 442833 441645 439747 437068 433585 429390 424724
53893 424724 420049 415744 411509 406499 400370 393753 387322 380890 373977 366810 360028 353607 346856 339535
53879C39535p210o286n223m607m466m497m356l928l506l413l482l340l157l460
53865B78604m122m375l973l546l455l194k500k079k488l047k819k099j898k262
53851B36747k191j230k06n7o17r16m27L52N01k25j045j032k52L82L75K17M73Q66
53833B31715P67J72m07p49j087j530j765j433n70L40O53J25o82p82J47J369J985
53816B28268J960J889K020K025J739J588K050K925L479L273K627K092J723J281
53802B58939J050J785L541N167N584N167N078N564N793N362M866M791M691L975
53788C21353K823J878J436J379J464J380Q79J63k66l79p26j593k502k945l100
53773C21244l401l854m236m611n162n695n782n320m648m240m310m613m524l668
$$ plain form
53879 339535 332325 326039 320816 316209 311743 307246 302890 298962 295456 292043 288561 285221 282064 278604
53865 278604 274482 270107 266134 262588 259133 255939 253439 251360 248872 245825 243006 240907 239009 236747
53851 236747 234556 233326 233120 233063 232446 231530 231103 231455 231956 231731 230686 229654 229402 229784 230159 230376 230849 231715
53833 231715 232482 232654 232247 231498 230411 228881 227116 225683 225113 225453 226106 226231 225549 224767 224914 226283 228268
53816 228268 230228 232117 234137 236162 237901 239489 241539 244464 247943 251216 253843 255935 257658 258939
53802 258939 259989 261774 265315 270482 276066 281233 286311 291875 297668 303030 307896 312687 317378 321353
53788 321353 324176 326054 327490 328869 330333 331713 332592 332755 332489 332110 331384 329791 327289 324344 321244
53773 321244 317843 313989 309753 305142 299980 294285 288503 283183 278535 274295 269985 265372 260848 257180
53759B57180k458j695j585j636j570j726k348k943k817j852n63L95N94P6n91q21
53743B35640o72o75r88j159q04q9O02J038J161J102J158J315J032P3o94k89P80
53726B38531J046K36l20K57J177J352R20O37P14R96J538K243K578K315J992K099
53710B58311K417K598K638K425J657P53Q57K209L515L661L107K763K515J996J765
53695B93187K429L341L548L413L887M651M495L252J960J123K37r28j839k192k363
53680C18201k665k972l171l169k533j044M46P66P8k86K26O73J83q45j587j913
53664C00388k053j884j241n44l64n91n54N8P45P32j13j047j187m82K58L66K0k12
53646B92295j30J39N18R17J081R73R66J235J335R24N01Q36J821K598K658K291
$$ plain form
53759 257180 254722 253027 251442 249806 248236 246510 244162 241219 238402 236550 235987 236382 236976 237052 236461 235640
53743 235640 234968 234293 233305 232146 231342 231253 231855 232893 234054 235156 236314 237629 238661 238734 238040 237751 238531
53726 238531 239577 239813 239493 239750 240927 242279 243199 243836 244550 245546 247084 249327 251905 254220 256212 258311
53710 258311 260728 263326 265964 268389 270046 270799 271656 273865 277380 281041 284148 286911 289426 291422 293187
53695 293187 295616 298957 302505 305918 309805 314456 318951 322203 324163 325286 325523 324595 322756 320564 318201
53680 318201 315536 312564 309393 306224 303691 302647 303093 303859 303937 303651 303877 304550 304733 303888 302301 300388
53664 300388 298335 296451 295210 294666 294302 293711 293157 293215 293960 294692 294579 293532 292345 291863 292121 292487 292507 292295
53646 292295 292165 292304 292822 293739 294820 295793 296759 297994 299329 300253 300754 301590 303411 306009 308667 310958
53630C10958K007K033K312K558K483K206K220K670L063L086L116L518L939M001
53616C50170M084M645N287N376N139N302N911O458O798P086P092O548N912N794
53602D31602N810N037L449J852N68p17j845k103j440o88l93l19l29p50j589k281
53586D35864k526k627k778k789k691k810l068k962k476k210k417k672k654k530
53572C98654k331j805j141r62j354j636j437j178j159j009n00j59m74j121j466
53557C80922j351r27k06P38J546J903J875J703J597J750K157K376K070J696J984
53542C99833K760L085K677K318K579L064L303L557M261N293O298P109P555P480
53528D61172P289P761Q990J0187J0921J1715J2939J4053J4556J4919J5719J6553
$$ plain form
53630 310958 312965 314998 317310 319868 322351 324557 326777 329447 332510 335596 338712 342230 346169 350170
53616 350170 354254 358899 364186 369562 374701 380003 385914 392372 399170 406256 413348 419896 425808 431602
53602 431602 437412 442449 445898 447750 448318 447601 445756 443653 442213 441525 441132 440813 440484 439734 438145 435864
53586 435864 433338 430711 427933 425144 422453 419643 416575 413613 411137 408927 406510 403838 401184 398654
53572 398654 396323 394518 393377 392415 391061 389425 387988 386810 385651 384642 384142 383983 383509 382388 380922
53557 380922 379571 378644 378438 379176 380722 382625 384500 386203 387800 389550 391707 394083 396153 397849 399833
53542 399833 402593 405678 408355 410673 413252 416316 419619 423176 427437 432730 439028 446137 453692 461172
53528 461172 468461 476222 485212 495399 506320 518035 530974 545027 559583 574502 590221 606774
53516F06774J6749J6657J7286J8868K0645K2003K3017K3969K4940K5947K6959
53505H43814K7763K8142K8211K8223K8069K7343K5926K4239K2860K1996K1367
53494A127953K0555J9470J8401J7578J6890J6301J6247J7089J8339J9053J8955
53483A326831J8605J8408J8172J7793J7602J7678J7454J6453J4871J3029J0722
53472A507618P682M301J401o62k288m167o732r879j2988j5404j6905j7644j7761
53459A416572j7432j7143j7413j8220j9217k0384k1898k3366k3990k3666k3197
53448A190646k3154k3157k2621k1634k0665j9906j9206j8255j6652j4165j1167
53437I80064q395o207m496l283k668k224j244K02J263J621K028L214M963O716
$$ plain form
53516 606774 623523 640180 657466 676334 696979 718982 741999 765968 790908 816855 843814
53505 843814 871577 899719 927930 956153 984222 1011565 1037491 1061730 1084590 1106586 1127953
53494 1127953 1148508 1167978 1186379 1203957 1220847 1237148 1253395 1270484 1288823 1307876 1326831
53483 1326831 1345436 1363844 1382016 1399809 1417411 1435089 1452543 1468996 1483867 1496896 1507618
53472 1507618 1515300 1519601 1521002 1520340 1518052 1513885 1507153 1497274 1484286 1468882 1451977 1434333 1416572
53459 1416572 1399140 1381997 1364584 1346364 1327147 1306763 1284865 1261499 1237509 1213843 1190646
53448 1190646 1167492 1144335 1121714 1100080 1079415 1059509 1040303 1022048 1005396 991231 980064
53437 980064 971669 965462 960966 957683 955015 952791 951547 951749 953012 954633 956661 959875 964838 971554
53423I71554Q357J0037J1776J3624J5610J7352J8353J8927K0023K1931K4003K5871
53411A177418K7899L0090L1701L2574L3646L5462L7218L8254L9383M1619M4518
53400A569782M6947M8839N0848N2846N4203N5148N6557N8354N9430N9255N8594
53389B170803N8343N8542N8716N8471N7580N5952N3809N1499M9112M6567M3889
53378B763283M1000L7419L2712K7163K1533J6269J1229O122P52m949j0872j6776
53366B924885k2659k8804l5279m1680m7592n2860n7220o0198o1708o2270o2328
53355B392287o1892o1084o0315n9496n7890n5316n2710n0860m9344m7491m5584
53344A790305m4221m3174m1929m0747m0053l9284l7539l5065l2917l1338k9552
$$ plain form
53423 971554 979911 989948 1001724 1015348 1030958 1048310 1066663 1085590 1105613 1127544 1151547 1177418
53411 1177418 1205317 1235407 1267108 1299682 1333328 1368790 1406008 1444262 1483645 1525264 1569782
53400 1569782 1616729 1665568 1716416 1769262 1823465 1878613 1935170 1993524 2052954 2112209 2170803
53389 2170803 2229146 2287688 2346404 2404875 2462455 2518407 2572216 2623715 2672827 2719394 2763283
53378 2763283 2804283 2841702 2874414 2901577 2923110 2939379 2950608 2956730 2957482 2952533 2941661 2924885
53366 2924885 2902226 2873422 2838143 2796463 2748871 2696011 2638791 2578593 2516885 2454615 2392287
53355 2392287 2330395 2269311 2208996 2149500 2091610 2036294 1983584 1932724 1883380 1835889 1790305
53344 1790305 1746084 1702910 1660981 1620234 1580181 1540897 1503358 1468293 1435376 1404038 1374486
53333A374486k7142k4524k2098j9799j7607j5702j4104j2863j2383j2797j3270
53322A182197j2850j1833j1283j1311j0886r449p626o147m977l842k813j956r43
53309A086281O24K857N542Q050R457R405Q856R273J1094J3495J5565J7059J8134
53296A215692J9187K0864K3500K6382K8351K9186K9771L0792L1961L2588L2283
53285A520557L1014K9055K6933K4895K2498J9311J5804J2828J0327P433L762k03
53273A724214m058p853j1436j4337j6501j8486k0708k3146k5736k8318l0179l0627
53261A492829l0102k9886l0465l1089l1126l0946l1106l1529l1939l2368l2802
53250A149471l2908l2427l1418k9903k7927k6061k5150k5314k5834k6085k5874
$$ plain form
53333 1374486 1347344 1322820 1300722 1280923 1263316 1247614 1233510 1220647 1208264 1195467 1182197
53322 1182197 1169347 1157514 1146231 1134920 1124034 1114585 1106959 1100812 1095835 1091993 1089180 1087224 1086281
53309 1086281 1086905 1089762 1095304 1103354 1112811 1122216 1131072 1140345 1151439 1164934 1180499 1197558 1215692
53296 1215692 1234879 1255743 1279243 1305625 1333976 1363162 1392933 1423725 1455686 1488274 1520557
53285 1520557 1551571 1580626 1607559 1632454 1654952 1674263 1690067 1702895 1713222 1720655 1724417 1724214
53273 1724214 1720156 1712303 1700867 1686530 1670029 1651543 1630835 1607689 1581953 1553635 1523456 1492829
53261 1492829 1462727 1432841 1402376 1371287 1340161 1309215 1278109 1246580 1214641 1182273 1149471
53250 1149471 1116563 1084136 1052718 1022815 994888 968827 943677 918363 892529 866444 840570
53239H40570k4957k3202k1304k0231j9721j8488j6268j4384j3727j3423j2351
53228F42514j0835r822r264q490p552p092p287p829q674r886j1039j1568j1546
53215E21630j1402j1186j0730j0298j0262j0391j0127r484q957q640q061o984
53203D05108n852n273n348n578n345m591m047m483n645o388o018m990m063l416
53189C34071k995l045l651m247m193l578k936k557k532k933l418l198k064r56
53175B91768p82j179j282j213j669k439k531j742r17n23j21M31L95n66j497j326
53159B74807l38K92M7n47r20j080j226j313j179q61n80n43p54r67q25j94O51J179
53141B65649J033L29m03o27k81J80K38j89p41j003q06k54L23N77M79M44R12J778
$$ plain form
53239 840570 815613 792411 771107 750876 731155 712667 696399 682015 668288 654865 642514
53228 642514 631679 621857 612593 604103 596551 589459 582172 574343 565669 555783 544744 533176 521630
53215 521630 510228 499042 488312 478014 467752 457361 447234 437750 428793 420153 412092 405108
53203 405108 399256 393983 388635 383057 377712 373121 369074 364591 358946 352558 346540 341550 337487 334071
53189 334071 331076 328031 324380 320133 315940 312362 309426 306869 304337 301404 297986 294788 292724 291768
53175 291768 290986 289807 288525 287312 285643 283204 280673 278931 278014 277491 277370 277801 278196 277630 276133 274807
53159 274807 274469 274761 274808 274261 273341 272261 271035 269722 268543 267682 267102 266559 265805 264838 264013 263819 264470 265649
53141 265649 266682 267011 266608 265981 265700 265880 266118 265929 265188 264185 263379 263125 263448 264025 264504 264948 265860 267638
53123B67638K442K447J862J047K39m25p28m53L11J120J615J831K022K179J921
53108B85068J007k34j158j485j528j718k053k185j924j528j387j561j676j355
53094B66283o64j0L46N00N94N96M74L63K74j05r41j720j670p27K96O26K57l01
53076B64471o74p90o72l79k4K48L57K76N2j65k68l72p25j366j986k200j902j376
53058B52505j111j353j798j828j287p43p62j047p06O43K357L447L458K665J635
53043B56075P84K01j78l17j80q5m81j235j545j026l93m54q50n96K73O69Q9o28
53025B50123o01j48r2m29m21J79P46O81J94l0J95L51K1l54k7Q85J404J118Q69
53006B54664J445K262K175J192L44R4n1l63m40j02K25L49N57P02P5j246j908r83
$$ plain form
53123 267638 270080 272527 274389 275436 275675 275250 274522 274069 274380 275500 277115 278946 280968 283147 285068
53108 285068 286075 285841 284683 283198 281670 279952 277899 275714 273790 272262 270875 269314 267638 266283
53094 266283 265619 265609 265955 266455 267049 267645 268119 268482 268756 268651 267710 265990 264320 263593 263889 264515 264772 264471
53076 264471 263797 263007 262335 261956 261932 262180 262537 262813 262865 262700 262432 262060 261335 259969 257983 255783 253881 252505
53058 252505 251394 250041 248243 246415 245128 244385 243623 242576 241870 242513 244870 248317 251775 254440 256075
53043 256075 256859 257060 256882 256565 256385 256300 255819 254584 253039 252013 251620 251166 250316 249720 249993 250662 250751 250123
53025 250123 249522 249374 249282 248853 248432 248611 249357 250038 250232 250202 250397 250748 250769 250415 250388 251273 252677 253795 254664
53006 254664 256109 258371 260546 261738 262082 262176 262125 261762 261322 261220 261445 261794 262351 263053 263128 261882 259974 258991
52988B58991O15J238O02j71k44P0J28p5J9Q14K056K958K983K451K158K324K369
52971B79286J796Q16q9p28j055r39m60m7N2J19M94J027J324J288J171J242J519
52954B86816J587Q42p46k230k623k151j837k015k115j942j996k271j926p07L82
52939B67068N26K56L29L79l43j560k343k437k224j795j023k58l5k30j99L10R79
52922B57400J364J098K6j342k002j625j016q67p72k04L10J18j88L97J478J678
52906B55853P69k4P1L73Kq96j652j959j880j467q34j99K87N43M87L11N79J507
52888B51871K399K423J722J038N20k29j078j316p74j34N8J5J42M84R12J363J771
52871B61187K155K664L126K901J806Q24J057K173K930K969K960L055K520J178
$$ plain form
52988 258991 259606 260844 261446 261275 261031 261101 261229 261154 261173 261987 264043 267001 269984 272435 274593 276917 279286
52971 279286 281082 281898 281809 281081 280026 279087 278627 278580 278632 278751 279245 280272 281596 282884 284055 285297 286816
52954 286816 288403 289245 288499 286269 283646 281495 279658 277643 275528 273586 271590 269319 267393 266686 267068
52939 267068 267594 267850 268179 268558 268215 266655 264312 261875 259651 257856 256833 256575 256540 256310 256111 256421 257400
52922 257400 258764 259862 259888 258546 256544 254919 253903 253036 252264 252060 252370 252488 252300 252697 254175 255853
52906 255853 256622 256598 256669 257042 257044 256148 254496 252537 250657 249190 248356 248157 248444 248987 249474 249785 250364 251871
52888 251871 254270 256693 258415 259453 259973 259744 258666 257350 256576 256442 256500 256515 256657 257141 258053 259416 261187
52871 261187 263342 266006 269132 272033 273839 274663 275720 277893 280823 283792 286752 289807 292327 293505
52857B93505kl38l91r11j729k296k647l112l617l875l865l679l292k874k824l159
52841B54894l309k889k188j640j239q97p75r44j088q98m42P2N11O69M26K19O93
52824B41175J647K005J184r3q49j041j209j471j465j022l13M09Q65Q27M91M15
52808B41555Q13J254J369J340J383J249P25J30j66l41p27j230j605j906k138j923
52792B39782j141n00p19j431j654j180o88n83n16k14Q4K28N19J068J452J402J391
52775B37300J988K851K991K009N80l71o13n39m85m54m03l63k98j12L7j89p56j040
52757B42133n22M90J191J245J014Q62O85K55l21o55m55K62J177J914K387K812
52741B54474L240L255K480J189O1n89r00r10m46M01J226J780K062J909J078j28
$$ plain form
52857 293505 293503 293165 292774 291863 290134 287838 285191 282079 278462 274587 270722 267043 263751 260877 258053 254894
52841 254894 251585 248696 246508 244868 243629 242732 241957 241013 239925 239027 238585 238657 239168 239837 240263 240482 241175
52824 241175 242822 244827 246011 245918 245069 244028 242819 241348 239883 238861 238548 238957 239822 240649 241140 241555
52808 241555 242368 243622 244991 246331 247714 248963 249688 249818 249652 249311 248584 247354 245749 243843 241705 239782
52792 239782 238641 238141 237422 235991 234337 233157 232469 231886 231370 231156 231240 231468 231987 233055 234507 235909 237300
52775 237300 239288 242139 245130 247139 247719 247348 246735 246196 245711 245257 244854 244491 244193 244081 244118 243929 243173 242133
52757 242133 241611 242101 243292 244537 245551 246413 247098 247353 247032 246377 245922 246184 247361 249275 251662 254474
52741 254474 257714 260969 263449 264638 264699 264110 263210 262300 261854 262255 263481 265261 267323 269232 270310 270182
52725B70182q47o31JK35j30o90j027j034q57o90n56k92K5j51j146k279k397j340
52707B56376k19l6n87j023r27n03j48k04p21j223j095m38l7k06l00K12Q31P56
52689B50508J19k13J88R50J549J822J910K053K386K703K586J926R70j85j633k958
52673B64681l211k143q72n74r47q59n5O37P23N74N30L55o8k57K00J011J595J772
52655B63092J737J697J773J980K063J722J217J301K152K796K211P55k14k09k75
52640B83798j434l061l586k486q43J02J68j34n04q42r21o38k78n5K76Q15J003
52623B71380M36k69k81K2l85j341j477l13R14J001K93l05p57j363j633q43O15
52606B65694J546J425P64J58k22k66J10N76O48L96L42O66R77R69P61N40L43K01
$$ plain form
52725 270182 269335 268704 268705 268940 268810 268120 267093 266059 265202 264512 263956 263664 263689 263538 262392 260113 257716 256376
52707 256376 256157 256121 255534 254511 253584 253081 252933 252729 252008 250785 249690 249252 249215 249009 248709 248921 249752 250508
52689 250508 250627 250414 250602 251552 253101 254923 256833 258886 261272 263975 266561 268487 269457 269272 267639 264681
52673 264681 261470 259327 258455 257881 256934 256075 256020 256657 257380 257954 258484 258839 258771 258514 258714 259725 261320 263092
52655 263092 264829 266526 268299 270279 272342 274064 275281 276582 278734 281530 283741 284496 284282 284073 283798
52640 283798 282364 279303 275717 273231 272388 272490 272658 272524 272020 271178 270257 269619 269341 269286 269562 270377 271380
52623 271380 271816 271547 271266 271288 270903 269562 268085 267772 268686 269687 269980 269675 268918 267555 265922 265079 265694
52606 265694 267240 268665 269429 269587 269365 269099 269209 269785 270433 270829 271171 271837 272814 273783 274544 275084 275427 275628
52588B75628J73J43rj37J5M17Q81J357J705J467M65m93l02J024K247K401J728
52571B88710R60L75q4k90j69o1l69r98j481j545j240o80p3J80j85q45j204j180
52553B79821j243j553j532p64J33J73o23j196r32m08l08l41J11Q10J042Q38Q57
52536B74885J108Q49k9n67j30N67N46k7k12L25J057J486J633J779K112K620K962
52519B90964K647J650N84O9J50O06J357K160K478K195K103K969M327M915M194
52504C23368K829J730J149P64J40r32k306l542m349m746m754m228l315k653k640
52489B96515k843k550j670o14K72P01L44n80j032k86J008J623J430J286J480J404
52473B96488Q29M44P78J408J659J479J253J236J485J968K567L230M088N036N434
$$ plain form
52588 275628 275801 275944 275935 275798 275813 276230 277111 278468 280173 281640 282105 281612 281310 282334 284581 286982 288710
52571 288710 289670 290045 289961 289671 289502 289441 289072 288074 286593 285048 283808 283128 283055 283235 283050 282205 281001 279821
52553 279821 278578 277025 275493 274729 274862 275035 274412 273216 272284 271876 271568 271227 271338 272148 273190 274028 274885
52536 274885 275993 276842 276813 276246 276116 276683 277229 277202 276990 277315 278372 279858 281491 283270 285382 288002 290964
52519 290964 293611 295261 295845 295914 296064 296670 298027 300187 302665 304860 306963 309932 314259 319174 323368
52504 323368 326197 327927 329076 329840 329980 329048 326742 323200 318851 314105 309351 305123 301808 299155 296515
52489 296515 293672 291122 289452 288838 289110 289811 290155 289575 288543 288257 289265 290888 292318 293604 295084 296488
52473 296488 297317 297761 298539 299947 301606 303085 304338 305574 307059 309027 311594 314824 318912 323948 329382
52458C29382M791L523K326J012j032l379m736m794m674n177n696n478m851m383
52444B96834l817k749j618j015o37L7N91K50o70j086p61m72o00o12j52L73O50
52427B84546R74J475J562Q62L8oN71P70J81n61p21k60M93J354K095K158J222k0
52409B96733k47J092L196M908N995P090Q597J0220J1447J2072J2008J1017Q873
52396C93001N632J625k635o440r006r945r566q564p445o338n198m036k906j852
52382C26327r02j32M01P26R91J343J777K155K371K483K653L033L684M510N311
52367C56731N921O251O038M817K539Q0j427j889k234k983l485k992j845r34n45
52352C64043m10m58o99o37K24J446K030J781J450J487J543J327J107J111J186
$$ plain form
52458 329382 334173 337696 340022 341034 340002 336623 331887 327093 322419 317242 311546 306068 301217 296834
52444 296834 293017 290268 288650 287635 286998 287035 287626 287876 287206 286120 285359 284887 284287 283675 283523 283896 284546
52427 284546 285520 286995 288557 289419 289457 289451 290022 290792 290973 290412 289691 289431 289924 291278 293373 295531 296753 296733
52409 296733 296486 297578 300774 305682 311677 318767 327364 337584 349031 361103 373111 384128 393001
52396 393001 398633 400258 397623 391183 382177 372232 362666 354102 346657 340319 335121 331085 328179 326327
52382 326327 325425 325293 325694 326420 327411 328754 330531 332686 335057 337540 340193 343226 346910 351420 356731
52367 356731 362652 368903 374941 379758 382297 382377 380950 379061 376827 373844 370359 367367 365522 364588 364043
52352 364043 363633 363175 362476 361839 362063 363509 365539 367320 368770 370257 371800 373127 374234 375345 376531
52337C76531J343J919K865L592L903M370N363O426P129P832Q960J0180J0964J1523
52323D62900J2376J3403J4115J4538J5070J5540J5271J4078J2553J1338J0679
52312F11861J0657J1235J2034J2624J3154J4105J5378J6162J6079J5780J6091
52301G65160J6902J7372J6962J5887J4730J3983J3823J3819J2970J0462O674L029
52289I21773N86r64k621m630o236o882o960p152p482p515p131o515n628m301k781
52274H45561j563o16N70K038L100L370L494M359O022P859R354J0291J0519J0115
52260I14473R656R742J0330J0987J1666J2702J4082J5255J5736J5550J4952J4131
52248A069262J3211J2191J0758Q564N780L027O52j518l528m884n161m715m348
$$ plain form
52337 376531 377874 379793 382658 386250 390153 394523 399886 406312 413441 421273 430233 440413 451377 462900
52323 462900 475276 488679 502794 517332 532402 547942 563213 577291 589844 601182 611861
52312 611861 622518 633753 645787 658411 671565 685670 701048 717210 733289 749069 765160
52301 765160 782062 799434 816396 832283 847013 860996 874819 888638 901608 912070 918744 921773
52289 921773 922359 921395 918774 914144 907908 901026 894066 886914 879432 871917 864786 858271 852643 848342 845561
52274 845561 843998 843382 843952 845990 849090 852460 855954 860313 866335 874194 883548 893839 904358 914473
52260 914473 924129 933871 944201 955188 966854 979556 993638 1008893 1024629 1040179 1055131 1069262
52248 1069262 1082473 1094664 1105422 1113986 1119766 1122793 1123445 1121927 1118399 1113515 1108354 1103639 1099291
52235A099291m499n107o023p111q059q579q773q858q638p775o668o333p070p842
52221I97956p498o194m960m237l598k818k281k133j791p29P59J999K737L171L502
52206I73885L896M552N442O185O468O403O182N753N137M692M639M692M601M704
52192A047231N354O182O593O689O926P161O869O214N873N694M575K066q18k908
52178A113701m336o013q149r976j0810j0757j0373r929r206p963o448n343m934
52165A009464m650l781k406j090J28J731L697N242N788N538M839L708K215P21
52151A031144o44k071l324l611k728j593j065p58K28J870L217L599L132K227J193
52136A030816K47n74j417k216k529k040r54M93K456M916P216Q865J0410J2793
$$ plain form
52235 1099291 1094792 1089685 1083662 1076551 1068492 1059913 1051140 1042282 1033644 1025869 1019201 1012868 1005798 997956
52221 997956 990458 984264 979304 975067 971469 968651 966370 964237 962446 961717 962476 964475 967212 970383 973885
52206 973885 977781 982333 987775 993960 1000428 1006831 1013013 1018766 1023903 1028595 1033234 1037926 1042527 1047231
52192 1047231 1052585 1058767 1065360 1072049 1078975 1086136 1093005 1099219 1105092 1110786 1115361 1117427 1116609 1113701
52178 1113701 1109365 1103352 1095203 1085227 1074417 1063660 1053287 1043358 1034152 1026189 1019741 1014398 1009464
52165 1009464 1004814 1001033 998627 997537 997665 999396 1003093 1008335 1014123 1019661 1024500 1028208 1030423 1031144
52151 1031144 1030500 1028429 1025105 1021494 1018766 1017173 1016108 1015350 1015578 1017448 1020665 1024264 1027396 1029623 1030816
52136 1030816 1031063 1030489 1029072 1026856 1024327 1022287 1021333 1021826 1024282 1029198 1036414 1045279 1055689 1068482
52122A068482J5943J8784K0578K1606K2520K3627K4818K5736K5916K5169K3799
52111A316978K2131K0040J7412J4774J2884J1737J0631R173P659O578O232O772
52099A463001P963Q979R122Q678Q378Q073O847M509J958k34k684o095j0094j3748
52085A494653j6615j8581j9342j8812j7699j6802j5975j4492j2243r881p838n981
52073A320392m240k846j781o56O60J867K983M562O754Q656R359R249R548J0601
52059A375108J1418J1044R792Q786Q776R752J1238J2504J2737J1543R327O840
52047A498865M492K319L62j462l614o414r293j1253j2233j3312j5199j7181j8019
52034A398058j7443j6180j4890j3717j2675j1856j1204j0519r736q967q342q044
$$ plain form
52122 1068482 1084425 1103209 1123787 1145393 1167913 1191540 1216358 1242094 1268010 1293179 1316978
52111 1316978 1339109 1359149 1376561 1391335 1404219 1415956 1426587 1435760 1443419 1449997 1456229 1463001
52099 1463001 1470964 1479943 1489065 1497743 1506121 1514194 1521041 1525550 1527508 1527274 1524590 1518495 1508401 1494653
52085 1494653 1478038 1459457 1440115 1421303 1403604 1386802 1370827 1356335 1344092 1334211 1326373 1320392
52073 1320392 1316152 1313306 1311525 1310869 1311529 1313396 1316379 1320941 1327695 1336351 1345710 1354959 1364507 1375108
52059 1375108 1386526 1397570 1407362 1416148 1424924 1434676 1445914 1458418 1471155 1482698 1492025 1498865
52047 1498865 1503357 1505676 1506038 1504576 1500962 1494548 1485255 1474002 1461769 1448457 1433258 1416077 1398058
52034 1398058 1380615 1364435 1349545 1335828 1323153 1311297 1300093 1289574 1279838 1270871 1262529 1254485
52022A254485q261q776q950q490q000q204q811q872q111p253o876o737o422o042
52008A144680n895o022o492p624r450j1321j2632j3641j5060j7007j8872k0137
51996A000527k0701k0499j9398j7661j5967j4680j3455j1851j0025q552p874q131
51984H31733r312j1073j2658j3440j3557j3664j4130j4794j5445j6036j6412j6369
51972F64843j6002j5528j4577j2406r105n942l886k370j73K767N353O943Q065
51959F07982R352J0525J0778R751P792N570L521J448j308m927q403j0278j0095
51946F31708q644o771m599k053N79L020N367P724R819J1439J2818J4316J5887
51933F90610J7141J7605J6873J4862J2075R165O145K539j451m669o226o449o207
$$ plain form
52022 1254485 1246224 1237448 1228498 1220008 1212008 1203804 1194993 1186121 1178010 1170757 1163881 1157144 1150722 1144680
52008 1144680 1138785 1132763 1126271 1118647 1109197 1097876 1085244 1071603 1056543 1039536 1020664 1000527
51996 1000527 979826 959327 939929 922268 906301 891621 878166 866315 856290 847738 839864 831733
51984 831733 822421 811348 798690 785250 771693 758029 743899 729105 713660 697624 681212 664843
51972 664843 648841 633313 618736 606330 597225 591283 587397 585027 584854 587621 592974 599917 607982
51959 607982 617334 627859 638637 648388 656180 661750 665271 666719 665411 660484 652081 641803 631708
51946 631708 623064 616293 611694 609641 610220 613240 618607 626331 636150 647589 660407 674723 690610
51933 690610 707751 725356 742229 757091 769166 778331 784476 787015 785564 780895 774669 768220 762013
51920G62013n831n267m696m466m745n783q013j1402j5042j7955j9955k1186k1307
51907F16365j9840j7037j3709j0342o946l585m60K355M769O495P416P871P993
51894E81345P180M889J566j893n298q943j2399j4536j4811j3757j2096j0162q226
51881D92859o619n202l395j001J485L646N700P989J0332J2151J3035J2952J2140
51868E56072J0846R050O535L385K11k425m577o497p900q235p575o601n701m595
51854E31993k963r52J019K559L363L326K675J760P50l08j317k328l616n222o719
51839E24020p767q526r132r237q658p888p259o116l848j275K12O20J172K264K936
51824D61518K590J887J441P77o29k237l112l156k924k723k436j947j275m87K82
$$ plain form
51920 762013 756182 750915 746219 741753 737008 731225 723212 711810 696768 678813 658858 637672 616365
51907 616365 596525 579488 565779 555437 548491 544906 544446 546801 551570 558065 565481 573352 581345
51894 581345 588525 593414 594980 593087 587789 578846 566447 551911 537100 523343 511247 501085 492859
51881 492859 486240 481038 477643 476642 478127 481773 487473 495462 505794 517945 530980 543932 556072
51868 556072 566918 575968 582503 585888 586099 583674 579097 572600 564700 556465 548890 542289 536588 531993
51854 531993 529030 528078 529097 531656 535019 538345 541020 542780 543530 543222 541905 539577 535961 530739 524020
51839 524020 516253 507727 498595 489358 480700 472812 465553 459437 455589 454314 454526 455146 456318 458582 461518
51824 461518 464108 465995 467436 468213 467584 465347 462235 459079 456155 453432 450996 449049 447774 447287 447569
51809D47569Q86J356J727J818J600J557J999K221J288m18j524j624j724k428k893
51794D51410k262j048k84p3R3K60M6n76j252j720j848j559j085q23p06k71L46
51777D38648L48l72p42n0R14J140J090K020M114O323P798Q669R514J0788J2566
51762E02768J4250J4787J3789J2021J0208P880M248k31m207p128r492j1532j2793
51749E34568j3153j3181j3155j2557j0999q993p337o215n312m397l317j784L98
51736D34566K893N040O521P668R081J0904J2510J2900J1522Q660N122J745p08
51723E28424j561o18J460L428M295L824K289k7k938n918p897p916o144l929k560
51708E04212k246k568l385m646n697n727m814l671k434o42J459K770K823K415
$$ plain form
51809 447569 448455 449811 451538 453356 454956 456513 458512 460733 462021 461603 460079 458455 456731 454303 451410
51794 451410 449148 448100 447816 447743 447836 448096 448142 447566 446314 444594 442746 441187 440102 439279 438573 438302 438648
51777 438648 438996 438624 437882 437832 438746 439886 440976 442996 447110 453433 461231 469900 479414 490202 502768
51762 502768 517018 531805 545594 557615 567823 575703 579951 579720 575513 568385 558893 547361 534568
51749 534568 521415 508234 495079 482522 471523 462530 455193 448978 443666 439269 435952 434168 434566
51736 434566 437459 442499 449020 456688 465769 476673 489183 502083 513605 522265 527387 529132 528424
51723 528424 526863 526245 527705 531133 535428 539252 541541 541514 538576 532658 524761 516845 510701 506772 504212
51708 504212 501966 499398 496013 491367 485670 479943 475129 471458 469024 468382 469841 472611 475434 477849
51694D77849K211J773O56m38n10L52J329K012K418K271J236m28k162l799n352
51679D79418o419o547n820m549k724m21J675K971L815M920O132O661O342N883
51665D91337N969O790Q346J0485J2643J4035J4139J2692R644N449J002l243p484
51652E81804j1293j3054j1689q358n206k867n10J916L110K225j54l150o450r599
51638E16725j1640j2187j1953j1614j0920r471p643o055m675l188j837j139r82
51625D23421n67O98K471L745L774K779J667J020N92m4q28j573k485l629m347m051
51609D22643l323l181l450l028j804j078j650k617k659j676m40O69J846L153M316
51594D07721N121N744O761Q785J1632J3904J4026J1798Q345M558M98l528o412
$$ plain form
51694 477849 480060 481833 482489 482051 481541 481893 483222 485234 487652 489923 491159 490731 488569 484770 479418
51679 479418 472999 466452 460632 456083 453359 452938 454613 457584 461399 466319 472451 479112 485454 491337
51665 491337 497306 504096 512442 522927 535570 549605 563744 576436 586080 591529 592531 589288 581804
51652 581804 570511 557457 545768 537410 532204 529337 528827 530743 533853 536078 535924 532774 526324 516725
51638 516725 505085 492898 480945 469331 458411 448940 441297 435242 430567 427379 425542 424403 423421
51625 423421 422854 423552 426023 429768 433542 436321 437988 439008 439600 439556 438728 437155 434670 431041 426694 422643
51609 422643 419320 416139 412689 409661 407857 406779 405129 402512 399853 398177 397737 398406 400252 403405 407721
51594 407721 412842 418586 425347 434132 445764 459668 473694 485492 493837 498395 498893 495365 488953
51581D88953p347o764n526l849j593J011L597O212R034J1861J4386J6616J8600
51568E45191K0179K1441K2946K4983K7030K8457K9342L0072L0674L1152L2126
51557H43593L4360L7776M1550M4929M7337M7833M5256L9075K9663J7758M147j0017
51545A223260k3172l4030m2256m8315n2682n5243n5549n3645n0388m6671m2504
51534G18805l7347l1294k5322k0253j6070j2503r664p766o643o008n690n321m321
51521E30603k646j051j48L37Q23R24l8j911l880n471o670p273o941n943n060m631
51505D81024m319l943l900m493n334n683n118l796k336j551j830k635k900k116
51491D31070q02K14O55Q12R31R69Q16N51L76L38J93l20j145j935k455k763k883
$$ plain form
51581 488953 481606 474842 469316 465467 463874 464885 468482 474694 483728 495589 509975 526591 545191
51568 545191 565370 586811 609757 634740 661770 690227 719569 749641 780315 811467 843593
51557 843593 877953 915729 957279 1002208 1049545 1097378 1142634 1181709 1211372 1229130 1233277 1223260
51545 1223260 1200088 1166058 1123802 1075487 1022805 967562 912013 858368 807980 761309 718805
51534 718805 681458 650164 624842 604589 588519 576016 566352 558586 551943 545935 540245 534924 530603
51521 530603 527957 526906 526758 527095 527918 528842 528804 526893 523013 517542 510872 503599 496658 490715 485655 481024
51505 481024 476705 472762 468862 464369 459035 453352 448234 444438 442102 440551 438721 436086 433186 431070
51491 431070 430268 430482 431137 431949 432880 433849 434665 435216 435592 435930 436123 435803 434658 432723 430268 427505 424622
51474D24622k628j940j211r94j453k269k954l114k662k000j821k398l180l332
51460C92666k575j303q7P25J074J160J198J029K97q14j401q82J61Q05J108J941
51444C95102L611N512P126Q583J0005J1191J2268J3770J5500J5997J3956R858
51432E22479N424J839p43k258k476j876j836l270n578p397q015p565o332m540
51418D77856k685j408q23m96k18l22j052j931k137j395k52M68L55l30r36j030
51402D63664p72o09o46n71k06K91Q49J682K798L671L898L903M540O117Q201J0347
51386E07157J2515J4832J7360K0212K3546K7450L1968L7281M3474N0135N6520
51375H42450O2126O6919P0921P3702P4267P1292O3817N1969L6900J9890J842j6108
$$ plain form
51474 424622 421994 420054 418843 417849 416396 414127 411173 408059 405397 403397 401576 399178 395998 392666
51460 392666 390091 388788 388701 389426 390500 391660 392858 393887 394184 393370 391969 391087 391248 392053 393161 395102
51444 395102 398713 404225 411351 419934 429939 441130 453398 467168 482668 498665 512621 522479
51432 522479 527903 529742 528999 526741 524265 522389 520553 517283 511705 504308 496293 488728 482396 477856
51418 477856 475171 473763 472940 472444 472226 471904 470852 468921 466784 465389 465137 465605 465960 465630 464694 463664
51402 463664 462892 462283 461637 461066 460860 461151 462000 463682 466480 470151 474049 477952 482492 488609 496810 507157
51386 507157 519672 534504 551864 572076 595622 623072 655040 692321 735795 785930 842450
51375 842450 904576 971495 1042416 1116118 1190385 1261677 1325494 1377463 1414363 1434253 1436095 1419987
51363A419987l2189m5065n4919o2614o8070p0508p0158o8388o5864o1861n5961
51352G64390m9292m3188l7578l1778k6165k1896j9188j7119j5007j3097j1685
51341D78397j0522r397q603q337q117p225n591l861k695k253k265k431k549k476
51327D02075k159j758j518j375r04N3R67J233J071J265K058K951L593M163M620
51312D16335M389L280K107J744J997J991J347M01m76j145j504j629j957k798l702
51297D20380l939l478l005k971l153l195l093l021l068l267l577l667l082j714
51283C76150M8J727L172M417N364N789N685N541O018P183Q100P572N336K325k23
51268D44204j574j550m58Q04J276J008J060J970K841K588J541R00Q96N50p45k356
$$ plain form
51363 1419987 1387798 1342733 1287814 1225200 1157130 1086622 1016464 948076 882212 820351 764390
51352 764390 715098 671910 634332 602554 576389 554493 535305 518186 503179 490082 478397
51341 478397 467875 458478 449875 441538 433421 426196 420605 416744 414049 411796 409531 407100 404551 402075
51327 402075 399916 398158 396640 395265 394361 394414 395381 396614 397685 398950 401008 403959 407552 411715 416335
51312 416335 420724 424004 426111 427855 429852 431843 433190 433591 433115 431970 430466 428837 426880 424082 420380
51297 420380 416441 412963 409958 406987 403834 400639 397546 394525 391457 388190 384613 380946 377864 376150
51283 376150 376198 377925 381097 385514 390878 396667 402352 407893 413911 421094 429194 436766 442102 444427 444204
51268 444204 442630 441080 440622 441426 442702 443710 444770 446740 449581 452169 453710 454610 455506 456056 455311 452955
51252D52955l354l600l542l500l550l744m044m240m193m018l887l755l380k617
51238D01531j706j249j657k529k896k373j647j528j830j749j010m6P81J368J407
51223C84867O12m70o18O31K360L376L484L245K991K673K364K298K397K253J713
51208D14176J137R09R28Q32O14O86J243J901K176K101K008J883J482J011R92J276
51192D35355R46l52j589j606o29R5q1p21j205j334j100n72p6J17K83Q54J561J676
51174D31622J082M15Q2j36m11n35n02o95j146j297q56k58J31P04J944L582M894
51157D38620N522N534N073M331L551K580Q22j782m191n260n086m713m676m562
51143D35763l951l136k646k610k766k790k515k004j547j281r04r9Q02J073O40
$$ plain form
51252 452955 449601 446001 442459 438959 435409 431665 427621 423381 419188 415170 411283 407528 404148 401531
51238 401531 399825 398576 396919 394390 391494 389121 387474 385946 384116 382367 381357 381311 382092 383460 384867
51223 384867 385479 385009 384391 385022 387382 390758 394242 397487 400478 403151 405515 407813 410210 412463 414176
51208 414176 415313 416222 417150 417982 418596 419282 420525 422426 424602 426703 428711 430594 432076 433087 434079 435355
51192 435355 436301 435949 434360 432754 432125 432220 432139 431418 430213 428879 427779 427207 427131 427248 427531 428385 429946 431622
51174 431622 432704 433119 433201 433065 432654 432119 431617 430922 429776 428479 427623 427365 427496 428200 430144 433726 438620
51157 438620 444142 449676 454749 459080 462631 465211 466033 464251 460060 454800 449714 445001 440325 435763
51143 435763 431812 428676 426030 423420 420654 417864 415349 413345 411798 410517 409613 409514 410316 411389 412029
51128D12029K63M68Q47Q83R42J704K896L440L000K579L137M257M770M315L553
51113D49083L030K561J872J214R68J083J300J606K124K694K884K465J610P49K80
51098D75523L16O20Q82J065J316J528J358P34r4j079k421l824m302l330j761r24
51082D65607j082j424j315q42j97O67J529J788J212M19K26P37J352J527J344J401
51066D72949K195L628N177O582Q083R769J1176J2032J3087J5434J8948K2050K3237
51053F24347K2369K0296J7819J5400J3546J2849J3600J5354J6930J6959J4794
51042H04263J0939O469K041k249o296r832j2824j5433j7327j7603j5816j2851
51030G13481j0369r527j0349j2132j4072j5488j5828j4779j2517r733p132m894
$$ plain form
51128 412029 412292 412760 413607 414490 415432 417136 420032 423472 426472 429051 432188 436445 441215 445530 449083
51113 449083 452113 454674 456546 457760 458728 459811 461111 462717 464841 467535 470419 472884 474494 475243 475523
51098 475523 475839 476459 477341 478406 479722 481250 482608 483342 483248 482169 479748 475924 471622 468292 466531 465607
51082 465607 464525 463101 461786 460944 460747 461414 462943 464731 465943 466362 466588 467325 468677 470204 471548 472949
51066 472949 475144 478772 483949 490531 498614 508383 519559 531591 544678 560112 579060 601110 624347
51053 624347 646716 667012 684831 700231 713777 726626 740226 755580 772510 789469 804263
51042 804263 815202 821671 823712 821463 815167 805335 792511 777078 759751 742148 726332 713481
51030 713481 703112 693585 683236 671104 657032 641544 625716 610937 598420 588687 581555 576661
51018E76661k790q52N76J498K522M009N422O098O277O735P681Q690R588J0543
51004F42658J1408J1747J1674J1821J2291J2383J1618J0325Q891P153M913K484
50992G59366K36j860l812n208n778n941o270o700o628n620l679j115J543L827
50978G12361N846Q243J1308J4445J6760J7841J7735J6708J5431J4955J5872J7804
50966H85309K0203K3294K7569L2624L7301M1006M4144M7146M9764N1658N3097
50955A313115N4514N5615N5506N3762N0973M7982M4834M0828L5626K9972K5102
50944A807829K1550J8826J6190J3503J1362J0534J1207J2637J3501J2809J0413
50933A960361O744K391j919n442q092j0676j3981j7855k1728k5742l0493l5863
$$ plain form
51018 576661 573871 573019 573595 575093 577615 581624 587046 593144 599421 606156 613837 622527 632115 642658
51004 642658 654066 665813 677487 689308 701599 713982 725600 735925 744816 751969 756882 759366
50992 759366 759602 757742 753930 748722 742944 737003 730733 724033 717405 711785 708106 706991 708534 712361
50978 712361 718207 726450 737758 752203 768963 786804 804539 821247 836678 851633 867505 885309
50966 885309 905512 928806 956375 988999 1026300 1067306 1111450 1158596 1208360 1260018 1313115
50955 1313115 1367629 1423244 1478750 1532512 1583485 1631467 1676301 1717129 1752755 1782727 1807829
50944 1807829 1829379 1848205 1864395 1877898 1889260 1899794 1911001 1923638 1937139 1949948 1960361
50933 1960361 1967105 1969496 1967577 1962135 1954043 1943367 1929386 1911531 1889803 1864061 1833568 1797705
50921A797705m1011m5544m9753n3523n6009n6757n6322n5324n3669n1154m8108
50910A230531m4848m1206l7195l3496l0562k7870k4806k1843j9931j9009j8066
50899I11699j6512j4721j3221j2057j1061j0186r374q452p275n829m233k830k020
50886G93928j765j526r73m71m70p17n20L78J653K932M061N022N918O916P852Q263
50870H30481Q131Q236R245J0782J2056J3075J4473J6290J7849J8862J9872K1352
50858A000704K3160K5205K7981L1859L6342M0605M4626M9210N4922O1365O7669
50847A463648P3472P9209Q5509R2407R9300J05573J11094J16042J20397J23718
50837B470369J25304J24453J20739J14185J05137R3855Q0375O5005M8809L3376
$$ plain form
50921 1797705 1756694 1711150 1661397 1607874 1551865 1495108 1438786 1383462 1329793 1278639 1230531
50910 1230531 1185683 1144477 1107282 1073786 1043224 1015354 990548 968705 948774 929765 911699
50899 911699 895187 880466 867245 855188 844127 833941 824567 816115 808840 803011 798778 795948 793928
50886 793928 792163 790637 789664 789193 788723 788006 787486 787864 789517 792449 796510 801532 807450 814366 822218 830481
50870 830481 838612 846848 856093 866875 878931 892006 906479 922769 940618 959480 979352 1000704
50858 1000704 1023864 1049069 1077050 1108909 1145251 1185856 1230482 1279692 1334614 1395979 1463648
50847 1463648 1537120 1616329 1701838 1794245 1893545 1999118 2110212 2226254 2346651 2470369
50837 2470369 2595673 2720126 2840865 2955050 3060187 3154042 3234417 3299422 3348231 3381607
50827C381607J9902Q634p24q078j2670j3840j1937q043k871L529J0670J6931K0588
50814C403698K1089J8623J2871L212r940k5129m1331n8325p5396r0932j03998
50803C054442j15229j25336j33500j38212j39047j36633j31336j23162j12787
50794A899200j01652r0806q0352p0075o0127n0924m2754l5606k9218k3360j8191
50783A296135j4035j0757p811n175l643l745m837n762o004n766n400n292n800
50770A212108o716p309p445q074r892j2082j3311j3532j3790j4553j5269j5427
50758A074708j5126j4480j3398j1993j0559r064p246n198l286j600jJ499L015
50745I87271N148Q369J2229J5936J9455K3305K7528L1661L5576L9484M3319M6988
$$ plain form
50827 3381607 3401509 3410143 3409419 3401341 3388671 3374831 3362894 3354851 3351980 3355509 3366179 3383110 3403698
50814 3403698 3424787 3443410 3456281 3459493 3449553 3424424 3383093 3324768 3249372 3158440 3054442
50803 3054442 2939213 2813877 2680377 2542165 2403118 2266485 2135149 2011987 1899200
50794 1899200 1797548 1706742 1626390 1556315 1496188 1445264 1402510 1366904 1337686 1314326 1296135
50783 1296135 1282100 1271343 1263532 1258357 1254714 1250969 1246132 1240370 1234366 1228600 1223200 1217908 1212108
50770 1212108 1205392 1198083 1190638 1182564 1172672 1160590 1147279 1133747 1119957 1105404 1090135 1074708
50758 1074708 1059582 1045102 1031704 1019711 1009152 1000088 992842 987644 984358 982758 982757 984256 987271
50745 987271 992419 1000788 1013017 1028953 1048408 1071713 1099241 1130902 1166478 1205962 1249281 1296269
50733A296269N0888N5196N8947O1034O1845O2611O3275O2573O0335N8005N6443
50722A947421N4816N2411N0026M8388M6433M2486L6428K9402K1908J3371L508
50711B346598o967j6875k5137l0786l3181l2382k9071k4069j8049j1485m614K342
50699B116324Q718J3489J6024J6405J4776J0757L935n508j6899k9522m2565n4883
50687B051051o5233p2707p6901p7892p6206p2507o7186o0538n3289m6404m0127
50676A342061l3758k6656j9127j2012n712J1N475J0620J4949J7930J9549K0394
50664A333724K0939K0955K0076J8723J7692J6974J5843J4279J3356J3873J5406
50653A521840J7144J8953K1056K3319K5462K7554K9754L1964L4183L6863M0415
$$ plain form
50733 1296269 1347157 1402353 1461300 1522334 1584179 1646790 1710065 1772638 1832973 1890978 1947421
50722 1947421 2002237 2054648 2104674 2153062 2199495 2241981 2278409 2307811 2329719 2343090 2346598
50711 2346598 2339631 2322756 2297619 2266833 2233652 2201270 2172199 2148130 2130081 2118596 2113982 2116324
50699 2116324 2125042 2138531 2154555 2170960 2185736 2196493 2200428 2194920 2178021 2148499 2105934 2051051
50687 2051051 1985818 1913111 1836210 1758318 1682112 1609605 1542419 1481881 1428592 1382188 1342061
50676 1342061 1308303 1281647 1262520 1250508 1244796 1244807 1250282 1260902 1275851 1293781 1313330 1333724
50664 1333724 1354663 1375618 1395694 1414417 1432109 1449083 1464926 1479205 1492561 1506434 1521840
50653 1521840 1538984 1557937 1578993 1602312 1627774 1655328 1685082 1717046 1751229 1788092 1828507
50642A828507M4687M9209N3647N7716O1065O3558O5324O6251O5912O4224O1612
50631B481712N8340N4273M9647M5372M2126L9861L8516L8323L8673L7456L2463
50620B956762K2954R220q254k7827m5557n6871n9899n6288m8753l9000k8245j8183
50608B600059j0292m680o22J956K154p61o503j4260k3612l4566m6675n8505o8363
50595B335330p5511q0383q3563q4879q3756q0233p5293p0181o5494o0942n5937
50584A519158n0504m5423m1390l8202l5142l2010k9233k6980k4754k1987j8549
50573A154984j4568j0297o336l306r75J622M886Q026J0197J1646J3139J4802J6209
50560A200029J7287J8464K0079K2128K4415K6515K7888K8381K8416K8295K7743
$$ plain form
50642 1828507 1873194 1922403 1976050 2033766 2094831 2158389 2223713 2289964 2355876 2420100 2481712
50631 2481712 2540052 2594325 2643972 2689344 2731470 2771331 2809847 2848170 2886843 2924299 2956762
50620 2956762 2979716 2988936 2980682 2952855 2907298 2850427 2790528 2734240 2685487 2646487 2618242 2600059
50608 2600059 2589767 2585087 2584465 2586421 2588575 2587814 2581311 2567051 2543439 2508873 2462198 2403693 2335330
50595 2335330 2259819 2179436 2095873 2010994 1927238 1847005 1771712 1701531 1636037 1575095 1519158
50584 1519158 1468654 1423231 1381841 1343639 1308497 1276487 1247254 1220274 1195520 1173533 1154984
50573 1154984 1140416 1130119 1123783 1120477 1119502 1121124 1126010 1134036 1144233 1155879 1169018 1183820 1200029
50560 1200029 1217316 1235780 1255859 1277987 1302402 1328917 1356805 1385186 1413602 1441897 1469640
50549A469640K6545K5227K4448K4062K3397K2325K1419K1200K1830K3490K6423
50538A730006L0565L5492M0845M6552N2700N9457O7030P5496Q4696R4395J04241
50527B421475J13599J21790J28798J35199J41190J46119J49281J50521J49655
50518C657627J46010J39176J29669J18132J04360Q7811O8712M7829K5642K513
50508D527481k0631m2713o3348q2343r8613j10690j18258j22090j22354j18076
50498C628365j08655r4967p8476o0013m0018j9430M21J8601L4696M8063N7234
50487C385821O0255N5815M4109K6522M331k1732n0425p9074j04546j25002j40097
50476C055977j49802j53949j53003j48359j41432j32905j23033j12163j00741
$$ plain form
50549 1469640 1496185 1521412 1545860 1569922 1593319 1615644 1637063 1658263 1680093 1703583 1730006
50538 1730006 1760571 1796063 1836908 1883460 1936160 1995617 2062647 2138143 2222839 2317234 2421475
50527 2421475 2535074 2656864 2785662 2920861 3062051 3208170 3357451 3507972 3657627
50518 3657627 3803637 3942813 4072482 4190614 4294974 4382785 4451497 4499326 4524968 4527481
50508 4527481 4506850 4464137 4400789 4318446 4219833 4109143 3990885 3868795 3746441 3628365
50498 3628365 3519710 3424743 3346267 3286254 3246236 3226806 3227227 3245828 3280524 3328587 3385821
50487 3385821 3446076 3501891 3546000 3572522 3576853 3555121 3504696 3425622 3321076 3196074 3055977
50476 3055977 2906175 2752226 2599223 2450864 2309432 2176527 2053494 1941331 1840590
50467A840590q9235p8233o8171n8906m9990m1534l4317k8916k5129k2395k0282
50456A323482j8324j5923j2854r574o713m364k044P16L919P052R514J1204J2676
50443A298767J4527J6767J9074K1409K3830K5753K6102K4378K1153J7272J3137
50432A522169R012N581L569K902K719K374K113K579L769M816N046M922N496P036
50418A584103Q840J0596J3214J7721K3847L0367L6582M2744M9128N5456O1273
50407A933871O6333P0471P3476P5197P5520P4227P1191O6643O0920N4088M6029
50396B667966L6756K6307J4623J879j1321k4570l8040n1583o3822p3020p8812
50385B406363q2224q3928q3270p9213p1602o1230m9268l6856k4800j3332k393
$$ plain form
50467 1840590 1751355 1673122 1604951 1546045 1496055 1454521 1420204 1391288 1366159 1343764 1323482
50456 1323482 1305158 1289235 1276381 1266807 1260094 1255730 1253686 1254402 1258321 1265373 1274887 1286091 1298767
50443 1298767 1313294 1330061 1349135 1370544 1394374 1420127 1446229 1470607 1491760 1509032 1522169
50432 1522169 1531181 1536762 1540331 1543233 1545952 1548326 1550439 1553018 1556787 1561603 1566649 1571571 1577067 1584103
50418 1584103 1592943 1603539 1616753 1634474 1658321 1688688 1725270 1768014 1817142 1872598 1933871
50407 1933871 2000204 2070675 2144151 2219348 2294868 2369095 2440286 2506929 2567849 2621937 2667966
50396 2667966 2704722 2731029 2745652 2747531 2736210 2711640 2673600 2622017 2558195 2485175 2406363
50385 2406363 2324139 2240211 2156941 2077728 2006126 1944896 1895628 1858772 1833972 1820640 1818247
50374A818247P787J6594K3385K7584K8634K6290K0896J2907K414j0299k3987l7031
50362A913421m8543n8223o5342o9022o9521o8172o5805o2164n7196n1868m7133
50351A250432m2917l8707l4550l0754k7128k3062j8236j2826p250j938K753O498
50339A022315Q789Q962O864L210j142n899j0619j3854j4255j2391j0241q705o952
50326I66082m362j643M99K370M180N196N085M989O142Q061R234Q960P615N667
50312A028075L510J748O73k07j324k156j980r89K35J699L469M711M619L979M484
50297A050546O546R017J1066J3138J5825J8913K2039K5402K9442L4251L9483M4050
50285A319718M5830M2522L3257J8987J462j7258l4178m5647m9451m6443l9624
$$ plain form
50374 1818247 1826034 1842628 1866013 1893597 1922231 1948521 1969417 1982324 1984738 1974439 1950452 1913421
50362 1913421 1864878 1806655 1741313 1672291 1602770 1534598 1468793 1406629 1349433 1297565 1250432
50351 1250432 1207515 1168808 1134258 1103504 1076376 1053314 1035078 1022252 1015002 1013064 1015817 1022315
50339 1022315 1031104 1040066 1046930 1050140 1048998 1043099 1032480 1018626 1004371 991980 981739 973034 966082
50326 966082 961720 960077 960576 962946 967126 972322 977407 982396 988538 996599 1005833 1014793 1022408 1028075
50312 1028075 1031585 1033333 1034006 1033799 1032475 1030319 1028339 1027350 1027585 1029284 1032753 1037464 1042083 1046062 1050546
50297 1050546 1057092 1066109 1077175 1090313 1106138 1125051 1147090 1172492 1201934 1236185 1275668 1319718
50285 1319718 1365548 1408070 1441327 1460314 1461776 1444518 1410340 1364693 1315242 1268799 1229175
50274A229175l1918k4964j9206j4354r979o259l926l152k931k193j168r54j849
50261A106322k964l484l517l418l048k192j153k83P47K419M394N811O626P694
50247A113954R294J0412J0127R016Q400Q703R324R897J0664J1675J2534J3014
50235A237014J3249J3053J1826R322N909J853k848p707j1576j3691j4330j3985
50223A228089j2545r940o980m893m270n033p147j0813j6025k2271k8523l3398
50211A066251l5793l5658l3778l0754k6794k2561j9215j7024j4874j1953r157
50200H08690p831p815p837p330o666n942m812l529k904l097l393l392l461l830
50186G36851m117m124m234m600m723m258l677l593l975m428m774m928m602l648
$$ plain form
50274 1229175 1197257 1172293 1153087 1138733 1128754 1122495 1118569 1115417 1112486 1110293 1109125 1108171 1106322
50261 1106322 1103358 1099874 1096357 1092939 1089891 1087699 1086546 1086263 1087010 1089429 1093823 1099634 1106260 1113954
50247 1113954 1123248 1133660 1143787 1152803 1161203 1169906 1179230 1189127 1199791 1211466 1224000 1237014
50235 1237014 1250263 1263316 1275142 1284464 1290373 1292226 1289378 1281671 1270095 1256404 1242074 1228089
50223 1228089 1215544 1205604 1198624 1193731 1189461 1184428 1177281 1166468 1150443 1128172 1099649 1066251
50211 1066251 1030458 994800 961022 930268 903474 880913 861698 844674 829800 817847 808690
50200 808690 800859 793044 785207 777877 771211 765269 760457 756928 754024 750927 747534 744142 740681 736851
50186 736851 732734 728610 724376 719776 715053 710795 707118 703525 699550 695122 690348 685420 680818 677170
50172F77170k446j589j204r15l92K61O40N10J38Q5O18J511K514L673M867N500
50156F90941N252M729M713N049N132N245O337Q358R927J0077R364Q786Q410P731
50142G90051O650N398M035K797K485L708O066Q758J1737J5513J9981K4228K7497
50129I28904K9725L1095L1647L1518L0987L0128K8892K7612K6881K6658K6036
50118A250083K4245K1447J8015J3482P023j101r254j5969k1142k5333k8443k9785
50106A203268k9358k8131k6911k5456k3154k0114j7088j4601j2720j1579j1527
50095I82629j2608j4287j5864j6964j7465j7274j6306j4578j2223r495o746m258
50083H24561k034O0J961L404M242M587M624M539M608N081N862O508O705O535O193
$$ plain form
50172 677170 674724 673135 671931 671016 670624 670885 671525 672035 672173 672258 672876 674387 676901 680574 685441 690941
50156 690941 696193 700922 705635 710684 715816 721061 727398 735756 745683 755760 765124 773910 782320 790051
50142 790051 796701 802099 806134 808931 811416 815124 821190 829948 841685 857198 877179 901407 928904
50129 928904 958629 989724 1021371 1052889 1083876 1114004 1142896 1170508 1197389 1224047 1250083
50118 1250083 1274328 1295775 1313790 1327272 1334295 1333194 1323940 1307971 1286829 1261496 1233053 1203268
50106 1203268 1173910 1145779 1118868 1093412 1070258 1050144 1033056 1018455 1005735 994156 982629
50095 982629 970021 955734 939870 922906 905441 888167 871861 857283 845060 835565 828819 824561
50083 824561 822527 822587 824548 827952 832194 836781 841405 845944 850552 855633 861495 868003 874708 881243 887436
50068H87436N680M954M191L627L206K591J562K65r47j883k715l786n111o157o246
50053H86667n352m293l974m517n175n092m014k337p09M09J019J612K804M726O772
50038H68546Q193Q949R678J0790J1988J2870J3645J4733J5894J6316J5664J4537
50026A021803J3753J3505J3358J2730J1270R099O870N304M585M413M685N589O958
50013A133922Q051Q300P802O821N329L433J737P16J39l42m45K50J452K562L677
49998A183404N264O875P154N413K511l03k939o278j0777j5730j9939k2746k4201
49985A107708k4501k3699k2169k0973k1094k2275k3163k2853k1768k0749j9941
49974H64523j9082j8266j7601j6603j4772j2603j1099j0349r442p790n827m184
$$ plain form
50068 887436 893116 898070 902261 905888 909094 911685 913247 913512 912565 910682 907967 904181 899070 892913 886667
50053 886667 881315 877022 873048 868531 863356 858264 854250 851913 851204 851613 852632 854244 857048 861774 868546
50038 868546 876739 885688 895366 906156 918144 931014 944659 959392 975286 991602 1007266 1021803
50026 1021803 1035556 1049061 1062419 1075149 1086419 1095518 1102388 1107692 1112277 1116690 1121375 1126964 1133922
50013 1133922 1141973 1150273 1158075 1164896 1170225 1173658 1175395 1176111 1176250 1175908 1175463 1175713 1177165 1179727 1183404
49998 1183404 1188668 1195543 1202697 1208110 1210621 1210318 1207379 1201101 1190324 1174594 1154655 1131909 1107708
49985 1107708 1083207 1059508 1037339 1016366 995272 972997 949834 926981 905213 884464 864523
49974 864523 845441 827175 809574 792971 778199 765596 754497 744148 734706 726916 721089 716905
49962G16905l092k671l027l680l629k469r39L3M49J027K323M406P046R803J2192
49947G34677J4028J5392J6173J5997J4861J3328J1773R836P200M442K527J493
49935H61727K86j920m762p320r390j1684j4729j7980k0296k1076k0642j9553j8033
49922F94628j6124j3956j1520q636n456k701r41N1Q47J599K273L164M434N384
49908F53046N147M050L449M104N523P027Q583J0267J1765J2920J4077J5383J6359
49895G71700J6696J6805J6973J6420J4149J0406O544L412O18k491n746q478j0564
49882H46444j2605j4956j6997j7837j7545j7131j7110j6779j5416j3587j2386
49871F74095j1706j0390q118o002m970m447l350j613l2J011J897L079M521N856
$$ plain form
49962 716905 713813 711142 708115 704435 700806 698337 697398 697431 697880 698907 701230 705636 712682 722485 734677
49947 734677 748705 764097 780270 796267 811128 824456 836229 846065 853265 857707 860234 861727
49935 861727 862013 860093 855331 848011 838621 826937 812208 794228 773932 752856 732214 712661 694628
49922 694628 678504 664548 653028 644392 638936 636235 635294 635345 636192 637791 640064 643228 647662 653046
49908 653046 658193 662243 665692 669796 675319 682346 690929 701196 712961 725881 739958 755341 771700
49895 771700 788396 805201 822174 838594 852743 863149 869693 873105 873723 871232 865486 857008 846444
49882 846444 833839 818883 801886 784049 766504 749373 732263 715484 700068 686481 674095
49871 674095 662389 651999 643881 637879 632909 628462 625112 623499 623467 624478 626375 629454 633975 639831
$$ [...]
##END NTUPLES=NMR SPECTRUM
##END=
