##TITLE=AC1507_CUNDCR13314_8126509_NYOsiGg0gN
##JCAMPDX= 6.0         $$ Bruker NMR JCAMP-DX V2.0
##DATA TYPE= NMR SPECTRUM
##DATA CLASS= NTUPLES
##ORIGIN= BRUKER
##OWNER= Administrator
$$ 1.72 TOPSPIN		Version 2.1
$$ 2013-08-15 23:06:54.084 -0700  Administrator@X
$$ Compression mode = diff/dup
##.OBSERVE FREQUENCY= 400.02188249412
##.OBSERVE NUCLEUS= ^1H
##.ACQUISITION MODE= SIMULTANEOUS (DQD)
##.ACQUISITION SCHEME= undefined
##.AVERAGES= 8
##.DIGITISER RES= 22
##SPECTROMETER/DATA SYSTEM= spect
##.PULSE SEQUENCE= zg30
##.SOLVENT NAME= COFFEE_meoh
##.SHIFT REFERENCE= INTERNAL, COFFEE_meoh, 1, 14.98509
##AUDIT TRAIL= $$ (NUMBER, WHEN, WHO, WHERE, PROCESS, VERSION, WHAT)
$$ ##TITLE= Audit trail, TOPSPIN		Version 2.1
$$ ##JCAMPDX= 5.01
$$ ##ORIGIN= Bruker BioSpin GmbH
$$ ##OWNER= Administrator
$$ $$ E:\/data/COFFEE/nmr/AC1507_CUNDCR13314_8126509_NYOsiGg0gN/10/pdata/1/auditp.txt
$$ ##AUDIT TRAIL=  $$ (NUMBER, WHEN, WHO, WHERE, PROCESS, VERSION, WHAT)
(   1,<2013-08-15 23:06:47.224 -0700>,<Administrator>,<X>,<go>,<TOPSPIN 2.1>,
      <created by zg
	started at 2013-08-15 23:05:41.115 -0700,
	POWCHK enabled, PULCHK disabled,
       configuration hash MD5:
       C8 4E 4E 5D D3 5C D8 9E 9F 52 82 E0 59 8A DE 15
       data hash MD5: 64K
       5E 1B E6 44 68 94 24 CB A7 7F 54 27 39 A4 53 50>)
(   2,<2013-08-15 23:06:50.256 -0700>,<Administrator>,<X>,<proc1d>,<TOPSPIN 2.1>,
      <Start of raw data processing
       efp LB = 0 FT_mod = 6 PKNL = 1 PHC0 = 0 PHC1 = 0 SI = 32K 
       data hash MD5: 32K
       F4 52 B8 30 97 5D 9E 7A 04 DC 29 69 3B A4 17 9A>)
(   3,<2013-08-15 23:06:50.584 -0700>,<Administrator>,<X>,<proc1d>,<TOPSPIN 2.1>,
      <pk PHC0 = 99.36584 PHC1 = 0 
       data hash MD5: 32K
       51 C9 FB 71 60 4E B7 4D 2C 30 80 27 38 36 AF 1A>)
(   4,<2013-08-15 23:06:50.724 -0700>,<Administrator>,<X>,<proc1d>,<TOPSPIN 2.1>,
      <abs ABSG = 1 
       data hash MD5: 32K
       C9 60 0C 8C 2C EC 2F 6B B9 8C 8D 2B FE 90 B5 70>)
(   5,<2013-08-15 23:06:50.818 -0700>,<Administrator>,<X>,<proc1d>,<TOPSPIN 2.1>,
      <abs ABSG = 2 
       data hash MD5: 32K
       FB 43 97 02 A9 49 FF 95 65 80 E8 70 4A 67 22 25>)
(   6,<2013-08-15 23:06:50.896 -0700>,<Administrator>,<X>,<proc1d>,<TOPSPIN 2.1>,
      <abs ABSG = 3 
       data hash MD5: 32K
       1E CB 39 00 B4 F8 01 27 F7 71 0B 22 AA 82 BA 60>)
(   7,<2013-08-15 23:06:50.943 -0700>,<Administrator>,<X>,<proc1d>,<TOPSPIN 2.1>,
      <abs ABSG = 4 
       data hash MD5: 32K
       73 31 A3 0D DC 81 BD 88 CE E2 E8 10 DA 60 A2 96>)
(   8,<2013-08-15 23:06:51.006 -0700>,<Administrator>,<X>,<proc1d>,<TOPSPIN 2.1>,
      <abs ABSG = 5 
       data hash MD5: 32K
       29 C3 EE BB 0E 0D 33 35 58 90 82 44 F4 41 8F F4>)
$$ ##END=
$$ 
$$ $$ hash MD5
$$ $$ 0D 3A C8 A4 6D E8 D0 54 0F F5 0D DF 20 FB 49 4D
##$RELAX= 
##$RELAX= 
##$RELAX= 
##$RELAX= 
##$RELAX= 
##$RELAX= 
##$RELAX= 
$$ Bruker specific parameters
$$ --------------------------
##$DU= <E:\>
##$EXPNO= 10
##$NAME= <AC1507_CUNDCR13314_8126509_NYOsiGg0gN>
$$ [...]
150 150 150 150 150 150 150 150
##$TP07= 0
##$TPNAME0= <>
##$TPNAME1= <>
##$TPNAME2= <>
##$TPNAME3= <>
##$TPNAME4= <>
##$TPNAME5= <>
##$TPNAME6= <>
##$TPNAME7= <>
##$TPOAL= (0..7)
0.5 0.5 0.5 0.5 0.5 0.5 0.5 0.5
##$TPOFFS= (0..7)
0 0 0 0 0 0 0 0
##$TUNHIN= 0
##$TUNHOUT= 0
##$TUNXOUT= 0
##$USERA1= <user>
##$USERA2= <user>
##$USERA3= <user>
##$USERA4= <user>
##$USERA5= <user>
##$V9= 5
##$VALIST= <valist>
##$VCLIST= <CCCCCCCCCCCCCCC>
##$VD= 0
##$VDLIST= <DDDDDDDDDDDDDDD>
##$VPLIST= <PPPPPPPPPPPPPPP>
##$VTLIST= <TTTTTTTTTTTTTTT>
##$WBST= 1024
##$WBSW= 4
##$XGAIN= (0..3)
0 0 0 0
##$XL= 0
##$YL= 0
##$YMAX_a= 644781
##$YMIN_a= -550429
##$ZGOPTNS= <>
##$ZL1= 120
##$ZL2= 120
##$ZL3= 120
##$ZL4= 120
##$ABSF1= 14.98509
##$ABSF2= -5.573092
##$ABSG= 5
##$ABSL= 3
##$ALPHA= 0
##$AQORDER= 0
##$ASSFAC= 0
##$ASSFACI= 0
##$ASSFACX= 0
##$ASSWID= 0
##$AUNMP= <proc_prof1d_extract_pilot.lims>
##$AXLEFT= 0
##$AXNAME= <>
##$AXNUC= <1H>
##$AXRIGHT= 0
##$AXTYPE= 0
##$AXUNIT= <>
##$AZFE= 0.1
##$AZFW= 0.1
##$BCFW= 0
##$BC_mod= 0
##$BYTORDP= 0
##$COROFFS= 0
##$CY= 15
##$DATMOD= 1
##$DC= 0
##$DFILT= <>
##$DTYPP= 0
##$F1P= 0
##$F2P= 0
##$FCOR= 0.5
##$FTSIZE= 32768
##$FT_mod= 6
##$GAMMA= 0
##$GB= 0
##$INTBC= 1
##$INTSCL= 1
##$ISEN= 128
##$LB= 0
##$LEV0= 0
##$LPBIN= 0
##$MAXI= 10000
##$MC2= 0
##$MEAN= 0
##$ME_mod= 0
##$MI= 0
##$NCOEF= 0
##$NC_proc= -8
##$NLEV= 6
##$NOISF1= 0
##$NOISF2= 0
##$NSP= 0
##$NTH_PI= 0
##$NZP= 0
##$OFFSET= 14.98509
##$PC= 1
##$PHC0= 99.36584
##$PHC1= 0
##$PH_mod= 1
##$PKNL= yes
##$PPARMOD= 0
##$PPDIAG= 0
##$PPIPTYP= 0
##$PPMPNUM= 2147483647
##$PPRESOL= 1
##$PSCAL= 4
##$PSIGN= 0
##$PYNMP= <proc.py>
##$REVERSE= no
##$SF= 400.02
##$SI= 32768
##$SIGF1= 0
##$SIGF2= 0
##$SINO= 400
##$SIOLD= 32768
##$SPECTYP= <>
##$SREGLST= <1H.CDCl3>
##$SSB= 0
##$STSI= 32768
##$STSR= 0
##$SW_p= 8223.68421052631
##$SYMM= 0
##$S_DEV= 0
##$TDeff= 65536
##$TDoff= 0
##$TI= <>
##$TILT= no
##$TM1= 0
##$TM2= 0
##$TOPLEV= 0
##$USERP1= <user>
##$USERP2= <user>
##$USERP3= <user>
##$USERP4= <user>
##$USERP5= <user>
##$WDW= 1
##$XDIM= 32768
##$YMAX_p= 454987793
##$YMIN_p= -704102
##$CURPLOT= <Network HP LaserJet P1505>
##$CURPRIN= <$Network HP LaserJet P1505>
##$DFORMAT= <normdp>
##$LAYOUT= <+/1D_H.xwp>
##$LFORMAT= <normlp>
##$PFORMAT= <normpl>
##$SURQMSG= 1
$$ End of Bruker specific parameters
$$ ---------------------------------
##NTUPLES= NMR SPECTRUM
##VAR_NAME=  FREQUENCY,     SPECTRUM/REAL,   SPECTRUM/IMAG
##SYMBOL=    X,             R,               I
##VAR_TYPE=  INDEPENDENT,   DEPENDENT,       DEPENDENT
##VAR_FORM=  AFFN,          ASDF,            ASDF
##VAR_DIM=   32768,         32768,           32768
##UNITS=     HZ,            ARBITRARY UNITS, ARBITRARY UNITS
##FACTOR=    0.250966925370066, 1,           1
##FIRST=     8223.43324360094, -125244,      -12578
##LAST=      0,             -55000,          -206573
##MIN=       0,             -704102,         0
##MAX=       8223.43324360094, 454987793,    0
$$ Real data points
##PAGE= N=1
##DATA TABLE= (X++(R..R)), XYDATA
$$ [...]
19577A34405o3634c24888a36342M9755Q13C8815J13327a21449D07494a2856l62140
19566c74996J980B2598a2928E25329A76944B5396f756l5614j32155o8211O7174
19555a75562c5267A29791n8488a09670C1357a36797j46685a23541p7536G3026
19544a50196D9287K83981c0792A905c77261J63536k17634J54566A98587h4553
19533b02182B92567i2281n788B61663e151j02875G3592a90597C07542a05710k467
19522a08177d139k89584D09394B4892A509a42648M556I49b53888K7679A64602
19510a9190n0229D0702b12480D9600a66450g4844l1252A48567K8424b6438k08335
19499b34773k10876p7807E6414b78653a02849c8507n7611D12431H6569a73416
$$ plain form
19577 134405 70771 -324888 -136342 -86587 -85774 38815 152142 -121449 407494 -12856 -374996
19566 -374996 -373016 22598 -12928 525329 176944 25396 -6756 -42370 -174525 -242736 -175562
19555 -175562 -35267 129791 71303 -109670 31357 -136797 -283482 -123541 -201077 73026
19544 -150196 49287 333268 -30792 1905 -377261 -213725 -431359 -276793 198587 -84553
19533 -202182 292567 -92281 -98069 261663 -5151 -108026 73592 -190597 307542 -105710 -108177
19522 -108177 -4139 -293723 409394 24892 1509 -142648 -138092 949 -253888 -226209 164602
19510 -19190 -69419 40702 -212480 49600 -166450 -74844 -106096 148567 176991 -26438 -234773
19499 -234773 -445649 -523456 56414 -278653 -102849 -38507 -96118 412431 86569 -173416
19488B00417a3607k47510a9165k08443C8396b17758i6734J3890D9758a6185j75065
19477a91250j24323A07249a51990C80935e5665a656B911b96647a37559i666l83233
19466c92899D3966e0975C6730a65853j92848a6787k18303A05797a62452A49259
19455c0254k9209A54126a98979h0662M439B00199I3214N0643a01641a2373j69771
19444a82144a3302J368o7709f052l75870i2808K2549j71941p7503J41151k1170
19433a99722r2557B06245a82692A38974b13679F0810b53575D6838a11435C572
19422C47700F923J35542a08162B68741F2597a6155A173O0149J03183j0744C8371
19410B33115d8676C1679L7832K73639d1575n0373k01239O5212O9061C03944g5055
$$ plain form
19488 200417 -13607 -261117 -19165 -227608 38396 -217758 -96734 -82844 49758 -16185 -191250
19477 -191250 -315573 107249 -151990 380935 -55665 -1656 2911 -296647 -137559 -9666 -392899
19466 -392899 43966 -50975 36730 -165853 -358701 -16787 -235090 105797 -162452 149259
19455 -30254 -59463 154126 -198979 -80662 -76223 200199 93214 143857 -101641 -12373 -182144
19444 -182144 -13302 -11934 -79643 -6052 -381922 -92808 -70259 -242200 -319703 -178552 -199722
19433 -199722 -292279 206245 -182692 138974 -213679 60810 -253575 46838 -111435 3572
19422 347700 6923 142465 -108162 268741 62597 -16155 1173 61322 164505 153761 38371
19410 233115 -48676 31679 69511 343150 -41575 -91948 -293187 -227975 -158914 303944 -75055
19398B45942a17652p6868A18873b5668C22817g6649m12415B59458g947m7740k3279
19387g8966d447C42326q6038I8100a28686A8869J38506e657A46603J23485o2216
19376B07872c03574J05597A24953P7898c01722C17830b6756C38927A8258b94709
19365i7679j98072B200a06074J4043j63226K2849F7322a19475M5288J8131J2441
19354d3615j05955j52876a6197A64159e1736l47718g3340B9325a06637l61220
19344d67857K22090B37350I3474a5850j13562a1324k96587E7396i9523o1997j29559
19333b91079g6116K8307l0319b0934m5686m6274B28855n7712c064j40624H5168
19321D67843A90676N0545h9261k3650r6554A90007h606k30497J07924A11731L60346
$$ plain form
19398 245942 -117652 -194520 118873 -25668 322817 -76649 -489064 259458 -7947 -55687 -78966
19387 -78966 -4447 342326 256288 98100 -128686 18869 157375 -5657 146603 270088 207872
19376 207872 -303574 -197977 124953 202851 -301722 317830 -26756 338927 18258 -294709
19365 -97679 -295751 2200 -106074 -92031 -255257 -232408 67322 -119475 -74187 -56056 -43615
19354 -43615 -149570 -302446 -16197 164159 -51736 -399454 -73340 29325 -106637 -467857
19344 -467857 -245767 237350 93474 -15850 -129412 -11324 -307911 57396 -99523 -161520 -291079
19333 -291079 -76116 -47809 -78128 -20934 -66620 -112894 228855 171143 -3064 -143688 85168
19321 467843 190676 241221 -89261 -112911 -209465 190007 -8606 -239103 -131179 111731 472077
19310D72077b46812d2996A03888c51305h3092C75443a94038g4304k34765F0723
19299B11587j00209D442K26747i1408C7656K86107j37009g8986c2437l02364A07535
19287C5521M4447C5459h1146B1201d4655m033J5053E7197a66949j9766p4628R839
19275b51504b6948j83320a8816l57370J59860k8169O9783I7910a42940F5842J1449
19264G7291J08865i5040j94974d7558I5647a54046C4626a92649h9680j66193j28034
19253c83907H7353a0055q0719l4801j35209a08497q112l12999a35704K3778N2274
19242e9652A74968a04485I216d4927p4355j60702a05356A09073b90698M3124A31451
19230A46644b5422m6149H9218a43305M2064C7779I176d8967a964k33210E9811
$$ plain form
19310 472077 -246812 -42996 103888 -351305 -83092 375443 -194038 -74304 -309069 60723
19299 211587 111378 4442 231189 -91408 37656 323763 186754 -78986 -32437 -334801 107535
19287 35521 79968 35459 -81146 21201 -44655 -48688 -33635 57197 -166949 -186715 -261343 -251504
19275 -251504 -26948 -210268 -18816 -376186 -216326 -244495 -174712 97910 -142940 65842 77291
19264 77291 186156 -95040 -290014 -47558 95647 -154046 34626 -192649 -89680 -255873 -383907
19253 -383907 87353 -10055 -90774 -125575 -260784 -108497 -116609 -429608 -135704 -111926 -59652
19242 -59652 174968 -104485 9216 -44927 -119282 -279984 -105356 109073 -290698 -247574 131451
19230 146644 -25422 -71571 89218 -143305 -101241 37779 9176 -48967 -1964 -235174 59811
19218e7558K5734G3597K02895q9920N8368b4964l38328d6017k74005d9140A25868
19206b1539g950E7004c63545B48178g8055j05430A6719a57626H9755a4048r2154
19195a06202q2302A62587E71K35416b06230A21517J47070j00585b8369l61882
19185c90251J77958e3558B22734d7365j80675B94619A0167a13992n0054k0711
19175a84757d1331j3111N23j1448r3951A78786F1543a94120p4526N7001f88A2621
19162d7409j43356C38785e0950B32718a29666e0896k91245J28933a9135G3236
19151B5645a64289A52020f2978a5901A47263p1309d62237a45746A11724k3993
19141H7731b04402q8995I4483c94986J76704N2126A56621g7461j16994A49861
$$ plain form
19218 -57558 -31824 73597 276492 186572 244940 -24964 -363292 -46017 -320022 -49140 125868
19206 -21539 -7950 57004 -363545 248178 -78055 -183485 16719 -157626 89755 -14048 -106202
19195 -106202 -188504 162587 571 235987 -206230 121517 268587 168002 -28369 -390251
19185 -390251 -212293 -53558 222734 -47365 -228040 294619 10167 -113992 -164046 -184757
19175 -184757 -41331 -54442 -53919 -65367 -159318 178786 61543 -194120 -268646 -211645 -688 12621
19162 -47409 -190765 338785 -50950 232718 -129666 -50896 -342141 -213208 -19135 73236
19151 25645 -164289 152020 -62978 -15901 147263 75954 -462237 -145746 111724 87731
19141 87731 -204402 -293397 94483 -394986 -218282 -166156 156621 -77461 -194455 149861
19130A45433g0213k69937J14344g2380b5562g727j39626f6550q7922d4183r318
19119e3501J5272j6151j04216D502a32535I9676i1548j36114e3597k15845J06428
19108a63014h0737k7615a1518n0029J8452k60495A74778D7476J91877a76572d4575
19096a29520K7783k74341a24643D8642K03268e1759A50907C1228a19831J8580
19086a01251M2556A43852a70986E1292N9501a12847A81227m6150c0699A52281
19075a80713A07622K7175a34670B21449b3425k06814m9833B91957i1247k18898
19065c10145i0310k2748d1850j30845j78722d1342A25056b8367j46461K5068L9714
19054a10046d0894r8180I8603F300O2860b20130o3661G4985j8514K1743a78835
$$ plain form
19130 145433 -70213 -340150 -225806 -72380 -25562 -7727 -147353 -66550 -154472 -44183 -53501
19119 -53501 -38229 -54380 -158596 4502 -132535 99676 -91548 -227662 -53597 -269442 -163014
19108 -163014 -80737 -108352 -11518 -61547 -43095 -303590 174778 47476 239353 -176572 -44575
19096 -129520 -101737 -376078 -124643 48642 251910 -51759 150907 31228 -119831 -101251
19086 -101251 -58695 143852 -170986 51292 110793 -112847 181227 135077 -30699 152281
19075 -180713 107622 134797 -134670 221449 -23425 -230239 -280072 291957 -91247 -310145
19065 -310145 -90310 -113058 -41850 -172695 -351417 -41342 125056 -28367 -174828 -149760 -110046
19054 -110046 -40894 -139074 98603 6300 69160 -220130 -283791 74985 56471 78214 -178835
19042b13692j54680c7954o9731B16885d14438c9325B00280p3993P7138a49978
19031d8489k7879A71511c77782B78403g7248C824M7225d7791B13465c46922A17271
19019B24423k4595K46224c1904j49622M2572N7475D2084L9416b4081A21248c23901
19007B70577b53636F7721a34517M7043H2136b12048g0036m7203A86776C5592J1595
18996D7187J64327B8579R3467a41000G448b07421A57177a93792H1203l7142J89560
18985B33621A00120a32685k09742i8543c8099j4649A10272J08629C9064b03699
18974D0524f5847A72538n0433K34554i3184b8568r3804p4187A79861b75562c9808
18962E37a15963B8871r928i9106G8257a33821I6790J23646c02790J20307L0678
$$ plain form
19042 -213692 -368372 -37954 -107685 216885 -414438 -39325 200280 126287 203425 -149978
19031 -48489 -76368 171511 -377782 278403 -77248 3824 51049 -47791 213465 -346922 117271
19019 224423 199828 446052 -31904 -181526 -138954 -81479 42084 81500 -24081 121248 -323901
19007 270577 -253636 67721 -134517 -87474 82136 -212048 -70036 -117239 186776 35592 47187
18996 47187 211514 28579 122046 -141000 7448 -207421 157177 -193792 81203 44061 233621
18985 233621 100120 -132685 -342427 -98543 -38099 -52748 110272 218901 39064 -203699
18974 40524 -65847 172538 122105 356659 -93184 -28568 -122372 -196559 179861 -275562 -39808
18962 537 -115963 28871 18943 -99106 78257 -133821 96790 220436 -302790 -182483 -151805
18951a51805H3380b62053a4101k6968o3423A4384b28601i8279F8093e6998B61911
18939B51223K1662I0552k5234j4417d3762o6233m5729r3441h7767k44191H1319
18927a05730o2890M4727m2568A7072a2747C29082p2951b60740J25695M1242j35138
18916b28941H211O7995a04414r239j05842A59575K01835E4804c8564r4023r5316
18905b27903d4906r6136A37018k0600a3789A45432a32834M0631C0304n553R5552
18894A20303b21862A66986a90984m8112e7735j74502c9134m3189D5309c64509
18883a02545A18641c4918A10517l7088g4186o3607L5462j77578g4384c5341j41110
18872a76451B35696H4128c19032C1244a84097B8197a58348D929P9582K90218b66177
$$ plain form
18951 -151805 83380 -262053 -14101 -41069 -104492 14384 -228601 -98279 68093 -56998 261911
18939 251223 272885 90552 65318 50901 -43762 -109995 -155724 -249165 -87767 -331958 81319
18927 -105730 -168620 -123893 -166461 17072 -12747 329082 256131 -260740 -135045 -93803 -228941
18916 -228941 8211 76206 -104414 -113653 -219495 159575 361410 54804 -38564 -132587 -227903
18905 -227903 -44906 -141042 137018 116418 -13789 145432 -132834 -92203 30304 24751 120303
18894 120303 -221862 166986 -190984 -239096 -57735 -232237 -39134 -82323 45309 -364509
18883 -102545 118641 -34918 110517 73429 -74186 -137793 -102331 -279909 -74384 -35341 -176451
18872 -176451 235696 84128 -319032 31244 -184097 28197 -158348 4929 84511 374729 -266177
18860g1398l61346D5416a28008G2245c4015l7975A02948a96573o1903r024a8411
18848c1552A33634J24425a50202k2153j1344B73987a72305m3556O5510B7581a49422
18836a16840A2630a85365Q1775A34923C0374P3082K50789a44851d7705K2503E4874
18824A61644E8554h198D04110b16299B83929D4486K64078O4328e1709A20842J42262
18813B63104A00725d1554I7397K04071J03371j08475G8925a09154A36146b40142
18802b56796E9490J27392a3833k34487A20300J8619g3293k28574P7792H7387a45056
18790D7911a35572M833G354b39994E7802J45908c656H7107l3896a31097P837G256
18777I5176d14464C1098c63600j14238d3900G8068a35450k24045B13693b10815
$$ plain form
18860 -71398 -432744 45416 -128008 72245 -34015 -71990 102948 -196573 -258476 -267500 -18411
18848 -31552 133634 258059 -150202 -172355 -183699 273987 -172305 -215861 -150351 27581 -149422
18836 -116840 12630 -185365 -103590 134923 30374 103456 354245 -144851 -47705 -25202 54874
18824 161644 58554 -8198 404110 -216299 283929 44486 308564 372892 -51709 120842 263104
18813 263104 100725 -41554 97397 301468 404839 296364 78925 -109154 136146 -240142
18802 -256796 59490 186882 -13833 -248320 120300 138919 -73293 -301867 -224075 87387 -145056
18790 47911 -135572 -130739 7354 -239994 57802 203710 -3656 87107 53211 -131097 -123260 7256
18777 95176 -414464 31098 -363600 -477838 -43900 78068 -135450 -359495 213693 -210815
18766c28257a48072M3397r5122P4279F8241c59466I7657a93713B10547P6699c78286
18754a5909j65444j14333Q2886B34482f2545H0955d04376A30014L6515J15589
18744B82118i6167M3945k58048Q4704J1357f1084G0742d8994k86922I7041K51678
18733C48719b07817B17225b16383A88835G5943J63804a18678A43110J43228a65952
18722I7437a80872B26655a54945k1765N4578A50766d834k00923O1991O4782C7417
18710a97038l6673Q1563A53818a78409h3952C30446g6762K8074j13913N5796L0047
18699g6758n1560M5623B40425a45942q2982j01580a11121d6020a6173k13612f4626
18687b41451I8755O5918J24022a1483o3221A26002A3135b13633A30828D9687b50057
$$ plain form
18766 -328257 -148072 -104675 -199797 -125518 68241 -359466 97657 -193713 210547 287246 -378286
18754 -15909 -181353 -295686 -212800 234482 -62545 80955 -404376 130014 166529 282118
18744 282118 -96167 -52222 -310270 -225566 -214209 -61084 70742 -48994 -335916 97041 348719
18733 348719 -207817 217225 -216383 188835 75943 239747 -118678 143110 286338 -165952
18722 97437 -180872 226655 -154945 -176710 -122132 150766 -4834 -205757 -143766 -78984 37417
18710 -197038 -233711 -152148 153818 -178409 -83952 330446 -76762 -48688 -162601 -106805 -76758
18699 -76758 -128318 -82695 240425 -145942 -228924 -330504 -111121 -46020 -16173 -229785 -64626
18687 -241451 98755 164673 288695 -11483 -74704 126002 13135 -213633 130828 49687 -250057
18675b51952h3881E4188c00670a4709A12932f5155j19498L3570A2272O6211d2921
18663I7042N2255J71131r4868a31482L2327K1945G022i8627b1014A77818P5454
18652B53272d6142B4333i161H7221i7537k11829f0465C0550J16531a27779k0030
18641a47809n482b4243A61170d24763I76g9678c417m71030e7166D4331d0077m3340
18629h3417j22023A44811b30426A69959C2219a77362f7866j37115A07165b8960
18618d3303B74836a95123r104b7140O972A34545b60120c443j51586E8224K35757
18607B93981b13232C5795J0559g2084j15094h0977K3954G5107J53064E3723A7698
18595A69850A4329b05908A02421b17541k3938B10791e6174j90258A04144K50a76997
$$ plain form
18675 -251952 -83881 54188 -300670 -14709 112932 -65155 -184653 -151083 12272 78483 -42921
18663 97042 149297 320428 225560 -131482 -99155 -77210 7022 -98627 -21014 177818 253272
18652 253272 -46142 24333 -9161 87221 -97537 -309366 -60465 30550 147081 -127779 -147809
18641 -147809 -153291 -24243 161170 -424763 976 -79678 -3417 -474447 -57166 44331 -40077 -83417
18629 -83417 -205440 144811 -230426 169959 32219 -177362 -67866 -204981 107165 -28960
18618 -43303 274836 -195123 -204227 -27140 -20168 134545 -260120 -3443 -155029 58224 293981
18607 293981 -213232 35795 46354 -72084 -187178 -80977 -57023 75107 228171 53723 17698
18595 169850 14329 -205908 102421 -217541 -241479 210791 -56174 -246432 104144 104394 -176997
18583c48147J25899g5384q2018o849j37840I1323a98358F2713c20387a41366L0266
18572a11100l07210m6710O8495f9532A25501a25696A01553b32760a2656j06043
18562a18699A0576Q4847a50857D0282b05762a01516j78492G4491a12403E1945
18551D0727c08862j1954B51385a24815N836j19191B67355i3185B12156o5628B3381
18539h8185B10204m1430c26905A90077P1077a86260C7553b53350H5113D241b85910
18527C1114J1382b29266A52223b53879A34083D0495J15735c31383e6670A23879
18516b44900q7635B39858C8918d5597j31802o4965B4948a75330p4731f4507A21261
18504A0886a32345A9164f2786n5818A9513K40566p9124D1513c8079p4434l396
$$ plain form
18583 -348147 -222248 -75384 -157402 -164251 -302091 91323 -198358 62713 -320387 -141366 -111100
18572 -111100 -418310 -465020 -396525 -69532 125501 -125696 101553 -232760 -12656 -118699
18562 -118699 10576 95423 -150857 40282 -205762 -101516 -280008 74491 -112403 51945
18551 40727 -308862 -320816 251385 -124815 -118979 -238170 267355 -93185 212156 146528 23381
18539 -88185 210204 168774 -326905 190077 261154 -186260 37553 -253350 85113 4241 -285910
18527 31114 42496 -229266 152223 -253879 134083 40495 156230 -331383 -56670 123879
18516 -244900 -332535 239858 38918 -45597 -177399 -242364 24948 -175330 -250061 -64507 121261
18504 10886 -132345 19164 -62786 -118604 19513 260079 180955 41513 -38079 -112513 -115909
18493a15909j98550a29855j04519A31750H446a71896g7148K7090j87552b4998
18482b00038l8844G8227j2369a01863A08042k2850l5175a27099B19541f9490B26841
18470B13659a39570O4950E8625b84134a8765j99475Q7253b2667F8465K5962b2381
18458B8025J84135h6871c4736B28460Q566p2671c35910B36592g4527j06501A93687
18446b09147j74035e2346j28960k26247K681e6635H2199L786J6174C6881a7862
18434a18318e2205E888J48723A3178a63596D7422b6042E3128A0460d2039j22867
18423a64906P9794m4642B0062d3780j36300j56125J63743I079b00671B973b2641
18411A54643f4943k9386c1463a934D4665a31380A18792D3104a11915C2639O3022
$$ plain form
18493 -115909 -314459 -129855 -234374 131750 8446 -171896 -77148 -50058 -237610 -24998
18482 -200038 -238882 78227 65858 -101863 108042 85192 50017 -127099 219541 -69490 226841
18470 213659 -139570 -74620 58625 -284134 -18765 -218240 -130987 -22667 68465 94427 -22381
18458 28025 212160 -86871 -34736 228460 237026 164355 -335910 236592 -74527 -181028 193687
18446 -209147 -383182 -52346 -181306 -407553 -404872 -56635 82199 85985 102159 36881 -17862
18434 -118318 -52205 5888 154611 13178 -163596 47422 -26042 53128 10460 -42039 -164906
18423 -164906 -85112 -129754 20062 -43780 -180080 -336205 -172462 9079 -200671 2973 -22641
18411 154643 -64943 -94329 -31463 -1934 44665 -131380 118792 43104 -111915 32639 95661
18400I5661J70316A9038J25712C5745c6491a7091E4016K60765c66228a21907A04206
18388A59833a33814r0054A27847c48621I8524m4647h3406a2839q1485j01773A8880
18376c8328c880j07435m707A56555R804C0823N8830M02069D8957c21069B24554
18364F622b04049e9212k84677A31922D5453a08329j82166K5293A5325b3620b396
18352D3011a13273C1202i4745K122C392c02134d6907k30255g3576K7325j43019
18341a89270j18784B7848a61391D4002J66563b50212i3420A24104B0937R7246
18331A18183e0044C6783J17148n6831a87767d1507g839E7696P746R7992B8034
18319C0643b64276i9863r191k54302A29680f166k43144A59575p1530A4261b56532
$$ plain form
18400 95661 265977 19038 144750 35745 -36491 -17091 54016 314781 -366228 -121907 104206
18388 159833 -133814 -223868 127847 -348621 98524 53877 -83406 -12839 -94324 -196097 18880
18376 -38328 -3880 -111315 -116022 156555 166359 30823 89653 491722 48957 -321069 224554
18364 6622 -204049 -59212 -343889 131922 45453 -108329 -290495 -265202 15325 -23620 -2396
18352 43011 -113273 31202 -94745 -92623 3392 -302134 -46907 -277162 -73576 -46251 -189270
18341 -189270 -308054 27848 -161391 44002 210565 -250212 -93420 124104 20937 118183
18331 118183 -50044 36783 153931 97100 -187767 -41507 -7839 57696 65442 163434 28034
18319 30643 -264276 -99863 -109054 -363356 129680 -6166 -249310 159575 88045 14261 -256532
18307A62720b652n99028i3538n7124c6801G5167b0974k13622A54964E4674b88220
18295g5307A29844J91792A49557l1596a69416E402f5846A19766a39683r9429D0500
18283c5873A80110a03803I9453a25059n0666K565I4782a06944J8276A03230N0410
18272A53640b31855h5911A63826F5339J34011H4760j4636a1410q7599k44400E2565
18260b62296M1216H480a14997M8498B37650G3517b97848G3197M3526N5561b60941
18248D0475c23645A94604C2884d37163A62257a24126g553I7207A325a32905K3813
18237a09092g789A7776b34430c8468A44858b15709A2472b11407A25929P3726c5994
18225b10949g5248L5032j06969o0245F9268a90988C78592h2412E6186a83188P4539
$$ plain form
18307 162720 -2652 -601680 -93538 -150662 -36801 75167 -20974 -234596 154964 54674 -288220
18295 -75307 129844 321636 149557 117961 -169416 5402 -65846 119766 -139683 -239112 40500
18283 -35873 180110 -103803 99453 -125059 -175725 -173160 94782 -106944 -88668 103230 153640
18272 153640 -231855 -85911 163826 65339 199350 84760 70124 -11410 -99009 -343409 52565
18260 -262296 -221080 8480 -114997 -66499 237650 73517 -297848 73197 116723 172284 -260941
18248 40475 -323645 194604 32884 -437163 162257 -124126 -7553 97207 1325 -132905 -109092
18237 -109092 -7789 17776 -234430 -38468 144858 -215709 12472 -211407 125929 199655 -35994
18225 -210949 -75248 -40216 -147185 -207430 69268 -190988 378592 -82412 56186 -183188 -108649
18214a08649G7631d7633A95325j2099l3364b86024A22735Q8519a87815g6434j01202
18203a77636K4248P0860k19397d9G4065k8247J38789G643b8237J3653l31623A99438
18190d4856G6732c932q6084F5356K78062a83095c6820j39618N7680A73153c00720
18178d7185m324r7782o7739B9887i3289J8503b3936I5787j5282b1842n16160a88526
18165E5057c40156Q4953l6801g7300a0595H6997J1084L71012F8833J10036a54734
18153B62859j25400e0617j49924i6604k33201J63377j1962B7812a8300l5541C0582
18141A89606e228j80704A95060I0881K32920a91238L8792M0008K5636G4604P2882
18130A47486f5877k53721I72J77171c24651i5476D8416d70108e6208H82a42511
$$ plain form
18214 -108649 77631 -47633 195325 183226 149862 -286024 122735 211254 -187815 -76434 -177636
18203 -177636 -153388 -82528 -301925 -49 74065 45818 184607 7643 -28237 -14584 -346207 199438
18190 -44856 76732 -3932 -90016 65356 343418 -183095 -36820 -176438 -118758 173153 -300720
18178 -47185 -51509 -149291 -217030 29887 -93289 -74786 -23936 95787 80505 -21842 -538002 -188526
18165 55057 -340156 -255203 -292004 -77300 -10595 86997 98081 469093 68833 178869 -154734
18153 262859 137459 -50617 -200541 -96604 -329805 -166428 -178390 27812 -18300 -53841 30582
18141 189606 -5228 -185932 195060 90881 323801 -191238 -152446 -112438 -86802 74604 147486
18130 147486 -65877 -319598 972 178143 -324651 -95476 48416 -470108 -56208 882 -142511
18118i6583a6180G5788a61643a0250A41271f2428l958a2254j30506e2453B52187
18106b44773i3402F640b8239j8839j57606p0085B52440H2055b29181A16012a64849
18094f1934B0333J7787c8498q7206r6961d3700A72066J25925a43468E6667J33918
18083A90585r3388e9189b7991B1342L08102j36959i9246k89256A140f5060D92227
18071A92911D4458J07764a98529h1830B74937C6478J74805B5004e310j72389B8132
18059B47085A00510D1878j619J63390C821b06849b6473p9236A39461c06047j8682
18048c24729A17066c4987j24518G8312a41708n7660A7471b69673A1708c04958
18037a91446B31487M8284h0394N917A03448e2433C7618a4571B40254e2414F4104
$$ plain form
18118 -96583 -16180 75788 -161643 -10250 141271 -62428 -66386 -12254 -142760 -52453 252187
18106 -244773 -93402 6640 -28239 -47078 -204684 -274769 252440 82055 -229181 116012 -164849
18094 -61934 20333 38120 -38498 -125704 -222665 -43700 172066 297991 -143468 56667 190585
18083 190585 97197 -59189 -27991 21342 329444 192485 -99246 -388502 1140 -65060 492227
18071 192911 44458 152222 -198529 -81830 274937 36478 211283 25004 -5310 -177699 28132
18059 247085 100510 41878 40259 203649 3821 -206849 -26473 -105709 139461 -306047 -324729
18048 -324729 117066 -34987 -159505 78312 -141708 -199368 17471 -269673 11708 -304958
18037 -191446 231487 279771 -80394 -74477 103448 -52433 37618 -14571 240254 -52414 64104
18025h3992A38181J52755A2184J82303d1657A68748b794j19076D0725C470K28696
18014B32166F1626J67888j11060a74969c7612l70686J85930A05721a27555l5555
18004a63110B55456H3428a07379k0337k1715N9528j47125a01493b6632B08201
17993a67265b7489l7964A24929b43853L1970C47134b08172h3065c7524C2999c5611
17981a82513k0538C8499K94a71689q0742R0930C17232C2360P5983b206n2396A93824
17968f1037B906K07000i48B11049Q463L3383A22201a90880F9028d18029a0233
17956E5390b59552P7043A13936K61962C2024a20996M2958m5978F123K55088d1942
17944b00326l070C36309a61767A76096a60701e4061B29300r4853a75966r350A08098
$$ plain form
18025 -83992 138181 290936 12184 194487 -41657 168748 -2794 -121870 40725 3470 232166
18014 232166 61626 229514 118454 -174969 -37612 -408298 -222368 105721 -127555 -163110
18004 -163110 255456 83428 -107379 -127716 -149431 -89903 -237028 -101493 -26632 208201
17993 -167265 -27489 -65453 124929 -243853 -211883 347134 -208172 -83065 -37524 32999 -35611
17981 -182513 -203051 38499 38793 -171689 -252431 -161501 317232 32360 108343 -2206 -54602 193824
17968 -61037 2906 209906 -948 211049 219512 252895 122201 -190880 69028 -418029 -10233
17956 55390 -259552 -182509 113936 375898 32024 -120996 -78038 -124016 6123 261211 -41942
17944 -200326 -203396 336309 -161767 176096 -160701 -54061 229300 134447 -175966 -185316 108098
17932C83627a11845A65506F1930a26535k46429J63599r526a08572p049c3297j4034
17921d7331A13679j8489c57593E2421Q2461o0146a92950p1968a14993B6528M1542
17910F8070b48813A49879a32309e8773E9013a50693C64410C5912b09615R2706
17900a16909A45571o2504k3226P4345K25414A33730c88171g7391j3288G0240J39985
17889B10225B3611Q0015a11967C1711b2053B66925b84529H4362N8800a81803b5550
17877b1182k94789A79281o156a0476m6326b5307D47726D2906P6382g3942l66538
17866d40480J15424D0013f1194B87822b2814A31790c728A23299a08889n8415P8135
17855h9169G3327a19673B2567J34576p1266a4765j55742F3561d480p0509F8714
$$ plain form
17932 383627 -111845 165506 61930 -126535 -372964 -209365 -218891 -108572 -115621 -33297 -47331
17921 -47331 113679 95190 -357593 52421 134882 74736 -192950 -264918 -114993 26528 68070
17910 68070 -248813 149879 -132309 -58773 59013 -150693 364410 35912 -209615 -116909
17900 -116909 145571 83067 59841 134186 359600 133730 -388171 -77391 -90679 70240 210225
17889 210225 23611 103626 -111967 31711 -22053 266925 -284529 84362 143162 -181803 -25550
17877 -21182 -315971 179281 173125 -10476 -56802 -25307 447726 42906 119288 -73942 -440480
17866 -440480 -325056 40013 -61194 287822 -22814 131790 -3728 123299 -108889 -167304 -89169
17855 -89169 73327 -119673 22567 157143 85877 -14765 -170507 63561 -4480 -74989 68714
17843a73451j92147I3135m2533c27731a35661A14792J98151i5082G8225K4341
17833A02566D9145c9596B38399f4157j61495G5723J54719b0117d463A5236b8012
17821A05537c0695L954B1367J03844R2076c2852k02482F8497j5582K15888H4934
17809a69000A36976k4749J51482a24811b9927r9992A50624E3189J67663j2130
17799B08722d8572k26350A87510H9432a25830C95716a86740A58363g1672o1095
17789a32767A7509M8314l2679j3023L4804a69169E4031K918a36611A27245b52438
17777b19231A73482a29063B4643M0015c6340j74327C64569A0264i9323m9800c1103
17765F8966J14678a04838B11599e1078J2117o5561B70396j21462m1839a45813
$$ plain form
17843 -173451 -365598 93135 50602 -327731 -135661 114792 312943 -95082 78225 102566
17833 102566 49145 -39596 238399 -64157 -225652 75723 230442 -20117 -4463 15236 -28012
17821 105537 -30695 -26741 21367 125211 217287 -32852 -235334 68497 52915 268803 84934
17809 -169000 136976 112227 263709 -124811 -29927 -129919 150624 53189 220852 208722
17799 208722 -48572 -274922 187510 89432 -125830 395716 -186740 158363 -71672 -132767
17789 -132767 17509 65823 33144 20121 54925 -169169 54031 56949 -136611 127245 -252438
17777 -219231 173482 -129063 24643 64658 -36340 -210667 364569 10264 -99323 -149123 -31103
17765 68966 183644 -104838 211599 -51078 -38961 -104522 270396 148934 107095 -145813
17754B14730C7666J97564a67204A55683I542f7396j57508R6018G0315N7162a86631
17742c08493b9295B2738Q7459b9212j32238B22806m4194d6425A21767E6914l260
17731E3654a43620f0373K763M976J9193k13707b0160F0356i5534J9492b1383B24534
17718b39001B54157a72461F1306g026C67364A11858a22567A76718B0916c7454
17707b03461h06A70831a19494A36704g210j27180G9177b07999g412j13597A97585
17695g2236a6129H1861N4743C2063f4928A8807M87c4246n7127j46621C35781b55904
17682B27724f5369J0654j02108f1761C8779R1753a7316H8708e59A12110b36324
17670b53837g6D69461a06616C0753b63426B64266f0965A87073i0403A25519f2182
$$ plain form
17754 214730 37666 235230 -167204 155683 9542 -67396 -224904 -128886 70315 127477 -186631
17742 -308493 -29295 22738 110197 -29212 -161450 222806 178612 -46425 121767 56914 53654
17731 53654 -143620 -60373 -57610 -52634 -33441 -247148 -20160 60356 -95534 -76042 -21383 224534
17718 -239001 254157 -172461 61306 -7026 367364 111858 -122567 176718 20916 -37454
17707 -203461 -806 170831 -119494 136704 -7210 -134390 79177 -207999 -7412 -121009 197585
17695 -72236 -16129 81861 136604 32063 -64928 18807 19294 -34246 -91373 -237994 335781 -255904
17682 227724 -65369 -54715 -156823 -61761 38779 130532 -17316 88708 -559 112110 -236324
17670 -253837 -76 469461 -106616 30753 -263426 264266 -60965 187073 -90403 125519 -62182
17658a42165B42099a2084k05959B12575J98599j32433a44487G6390g9299D34516
17647b77130I6916i3809I3756b13145i464F0921a89913g1478N315C84177A17616
17635G2012d0671m6703B7234J56066c21068I4453j071B9180R1528a64472C77740
17623b21490a8436l54830K9967B28282H5960i6935A45138n821K81244d269A0125
17611B06553p9327n9895b60483a9622A1714R1172d99959F8433K37430A7380i38
17599A20413J09977A05343B2302a33720B2004a17792A37919N1783p8095b8663
17588i096k06900A91473g7000B36110o2553J27886c1211j6089J187G1605a19907
17576A90627C4890a60838a0022A20755a10409f046m6139k31015I2040J087e1403
$$ plain form
17658 -142165 242099 -12084 -218043 212575 411174 278741 -144487 76390 -79299 434516
17647 -277130 96916 -93809 93756 -213145 -9464 60921 -189913 -71478 -66163 384177 117616
17635 72012 -40671 -87374 27234 183300 -321068 94453 93382 29180 120708 -164472 377740
17623 -221490 -18436 -373266 -343299 228282 85960 -96935 145138 139317 420561 -4269 10125
17611 206553 127226 67331 -260483 -19622 11714 102886 -499959 68433 305863 17380 -938
17599 120413 230390 105343 22302 -133720 22004 -117792 137919 189702 111607 -28663
17588 -9096 -215996 191473 -77000 236110 173557 301443 -31211 -47300 -46113 71605 -119907
17576 190627 34890 -160838 -10022 120755 -110409 -6046 -52185 -283200 92040 93127 -51403
17564A56700m7804J85373A3318O1110C2337b05856C53403D6164J20282h9575q4146
17553a73721A52004J41289I1534a6022A51227b07992C23369a14661C68648A03961
17542A81517g4182B1986J1378J1906h380A19592L2888n8347b74986C21541b45004
17530B04411A01948M3013d7958B15370r2027K160e8794D70464h9460F6225A2380
17518A26769J18853k1935r8432b81000A22560k9577J67771e217E2349b09577B29630
17506a72604f5090r9434c092j38593a889D7880N5455C111i4496C3761c3336B75602
17493h845A50383D6154K05896c8400B64651p7730l0754a77108L3522B07857J36177
17482C44034a5646A40090B7582K99658A57754J90048J12719A1178J58185J49902
$$ plain form
17564 156700 108896 294269 13318 74428 32337 -205856 353403 46164 166446 -89575 -173721
17553 -173721 152004 293293 91534 -16022 151227 -207992 323369 -114661 368648 103961
17542 181517 -74182 21986 33364 45270 -8380 119592 152480 94133 -274986 321541 -245004
17530 204411 101948 144961 -47958 215370 123343 125503 -58794 470464 -89460 66225 12380
17518 126769 245622 223687 125255 -281000 122560 92983 260754 -5217 52349 -209577 229630
17506 -172604 -65090 -164524 -3092 -141685 -1889 47880 103335 3111 -94496 33761 -33336 275602
17493 -8845 150383 46154 252050 -38400 264651 186921 156167 -177108 -143586 207857 344034
17482 344034 -15646 140090 27582 327240 157754 347802 460521 11178 169363 319265
17472C19265G1302L5075Q3351c648E0492L5929d3162B08380e10B00542c741m4017
17460d7758C53965a77095a5371A89961p3471f3797l3117C92131j89445K30842
17450D33528A69604m9257J39587p5394M5742m0749F7055a13513B74817j19651
17440A55166K7229C0273K59417R3110j75198M46530l13308J17730A69111m7366
17430A21745r286L9849Q5724C7699J78093J73469A36584q217F0597K5558i845
17418B29570J49823b6431j52808B69331M6503A46109r914b8898k80423D52060
17407D92612A77289J02931F9925n85O696f7151A45819C9247J82182J93102F1642
17395B98270C8484h4891a4869C55943j10338I4998J18058D575K70312o764B0512
$$ plain form
17472 319265 71302 106377 189728 -3648 50492 86421 -43162 208380 -510 200542 -3741 -47758
17460 -47758 353965 -177095 -15371 189961 116490 -63797 -96914 392131 202686 433528
17450 433528 169604 120347 259934 184540 230282 189533 67055 -113513 274817 155166
17440 155166 182395 30273 289690 382800 207602 654132 340824 458554 169111 121745
17430 121745 112459 152308 238032 37699 215792 389261 136584 128367 60597 86155 -9845
17418 229570 379393 -26431 -179239 269331 315834 146109 136195 -28898 -309321 452060
17407 492612 177289 280220 69925 69340 76036 -67151 145819 39247 221429 414531 61642
17395 298270 38484 -84891 -14869 355943 245605 94998 213056 4575 274887 268123 20512
17383A95083L9775P2187a31957E8742L10951A09980e7848l1131D8638J73152a25994
17371B14871J28393G8989a41047I7906R050O6088e8148k0962L4881B97586G9660
17359b9803B38843a802D55494A61883o7886b4993n8000B53230a56268b7699C76163
17347E3566a84491D6951J98948m2880n0141E4406N8535d0243I3745g4544D1650
17335B66325e0832C42299o5937Q6503A41522K07175j52187L0015r1172b57936
17324B82083A13794O4259B6827L865L24512a09276G6136R4662Q8994E7398J39588
17313A96986K51345e0649A98989M7751l2356a04244B50688j12748J54221j45775
17303A46386L091K50134j38350A01189D2311J3426K4419M9361D8542L0819J27049
$$ plain form
17383 195083 234858 307045 -131957 58742 369693 109980 -57848 -88979 48638 221790 -125994
17371 214871 343264 78989 -141047 97906 106956 173044 -58148 -79110 -44229 297586 79660
17359 -29803 238843 -1802 455494 161883 93997 -24993 -82993 253230 -156268 -27699 376163
17347 53566 -184491 46951 245899 203019 152878 54406 112941 -40243 93745 -74544 41650
17335 266325 -50832 342299 276362 362865 141522 348697 196510 226525 135353 -257936
17324 282083 113794 178053 26827 30692 355204 -109276 76136 170798 259792 57398 196986
17313 196986 448331 -50649 198989 246740 214384 -104244 250688 137940 292161 146386
17303 146386 149477 399611 261261 101189 42311 55737 80156 129517 48542 79361 206410
17292B06410b8572F6053e6738C49116H1218B7631i7856B81582a8202m1553B43955
17280B63872c06588D08505A04391a3140B44921J55035j57429A05077O1007a49331
17269B04173m0967J8911C5118L07504J65489D6643Q2425E6959J25117J51711f29
17257D25159e355A7972K55516n3681j8025K03486N8802k12198E3973L99011A61362
17245B91714a92859B56928q6411l0395O1738J00319A19571R1535a44772n2567
17235a97339B93225o5325L67580k26670D2087Q7041K32032n5134R4781F3143Q6212
17224A49355K10536A39682Q1638J80431k6532A31705Q7158O7085k4930A07554
17213A56506a75641C2461P0397K19777k4254F2016J00345q0409e2405A16322c1838
$$ plain form
17292 206410 -28572 66053 -56738 349116 81218 27631 -97856 281582 -18202 -59755 243955
17280 263872 -306588 408505 104391 -13140 244921 399956 242527 105077 166084 -149331
17269 204173 163206 182117 35118 342622 508111 46643 129068 56959 182076 333787 -629
17257 425159 -5355 17972 273488 219807 201782 405268 464070 251872 53973 452984 161362
17245 291714 -192859 256928 170517 140122 201860 302179 119571 211106 -144772 -197339
17235 -197339 293225 227900 595480 368810 42087 129128 361160 306026 400807 63143 149355
17224 149355 359891 139682 221320 401751 375219 131705 218863 285948 261018 107554
17213 156506 -175641 32461 102858 322635 298381 62016 162361 81952 -52405 116322 -31838
17201C33045d5053A54996P602K13604K34544o0405j36038E0787a16840C39597
17190A34254J00574J40760A79210B5332h5284D65667a57050D39880m2408j72742
17180B24730m5535b5033j03302A92404K73157a5170B98211k1863J34852j69265
17170B41935o578m921p0563M17924b3452A28258j4776K42950K8127A55768L7612
17159A93380L68036A06537L01097O6698p3022J65982B71850M0490Q9172P5139
17149D76651j29376C8347N78779r0699a54953D09508R0042A54998J83339A58667
17138C36830j1196Q9257K5951j56390H5431J82161L10971k78630J87408j27280
17128C60061K70348j51981J06172A98839K27780Q5519B50297K16281A47555K79964
$$ plain form
17201 333045 -45053 154996 162598 376202 610746 550341 414303 50787 -116840 339597
17190 134254 234828 375588 179210 25332 -85284 465667 -157050 439880 397472 224730
17180 224730 179195 -25033 -128335 192404 465561 -15170 298211 276348 411200 241935
17170 241935 235357 230436 159873 577797 -23452 128258 113482 356432 384559 155768 193380
17159 193380 561416 106537 407634 474332 401310 567292 271850 312340 401512 476651
17149 476651 347275 38347 617126 526427 -154953 409508 499550 154998 338337 158667
17138 336830 325634 414891 440842 284452 85431 267592 578563 299933 487341 360061
17128 360061 630409 478428 584600 198839 426619 512138 250297 466578 147555 427519
17118D27519j86319J30530K13533j06975B31257J90484j57614p0836R0434J08044
17108C91769P0872p3661R003K9735A42486K82024L9489A05672L88860g1238D47306
17096E75655O9852E1982L04693J12345j24632K9656A72709K52591J41481B70573
17085B58160N80069A82344N13308j12626j23177B5435J76470K21754A07536M95423
17075F02959k59518K39301B21546K43477q8633q2151q4536M67701k84524K02317
17065E95197k49105j37071J60059P4175N4741L92728A74472O0151M0552K10967
17055D86142j40602j65560N34253k73746K5852N9578M6260L531j14983A92072
17044D17044k02824J87013j07914N08575r3294k37937H9283M57250K91760l66025
$$ plain form
17118 427519 241200 371730 585263 478288 231257 421741 264127 193291 283725 391769
17108 391769 462641 388980 397983 427718 142486 424510 463999 105672 494532 -71238 447306
17096 575655 645507 51982 356675 469020 344388 374044 172709 425300 566781 270573
17085 258160 838229 182344 695652 583026 459849 25435 201905 423659 107536 602959
17075 602959 343441 582742 221546 465023 376390 294239 209703 677404 392880 595197
17065 595197 346092 209021 369080 443255 497996 890724 174472 234623 275175 486142
17055 486142 345540 179980 714233 440487 466339 525917 572177 575708 460725 192072
17044 417044 214220 401233 293319 801894 708600 470663 89283 546533 838293 472268
17034D72268J38564K02313l24370J73744l10735L24567l9477N352o4801J38253
17024G15678K82795D55753j26249L7731K29862q9386K52430q7653J37686j58143
17014F52031C24608L16207k04897L30499j23107A65527N17056J31838k13051N0586
17004F51956R0768r8813J42946N0364R4958q4333k33834j42693K70286p2025J67983
16993H37563C59653K86278J07398l7872L6619k78921M16095l82483Q0913J58297
16983G45977J41904k73062M45196n02356J34444m8247R2178L04201q6160l27836
16973F26239J28913J76211k06594L779O6504L08277r8085l495r5304K0046k34069
16962F92422L95259n6564k67062R3665J02751l13466K61129J1561P1452K09797
$$ plain form
17034 472268 610832 813145 488775 662519 351784 676351 636874 642226 577425 715678
17024 715678 998473 455753 329504 367235 597097 507711 760141 672488 810174 652031
17014 652031 324608 640815 435918 766417 643310 165527 682583 814421 601370 651956
17004 651956 742724 643911 786857 837221 932179 847846 614012 471319 741605 669580 837563
16993 837563 359653 645931 753329 715457 752076 473155 889250 506767 587680 745977
16983 745977 887881 614819 1060015 557659 692103 643856 736034 1040235 954075 626239
16973 626239 755152 931363 724769 728548 795052 1103329 1005244 1001749 906445 926491 692422
16962 692422 1087681 1031117 764055 857720 960471 647005 908134 919695 991147 1200944
16952A200944k57095k21910N14784k20612K58831j13863r4393j35915K84280l29408
16942H85643J18600J85745j51626J39464l21542j20199L69431J2550J19783R3778
16932A331627m9300M5779j40678k78262K54211J6842k52446M60699j68031l18455
16922I01986O60663l44969K2343J40479j39249P155K64058n687j78407k85263
16912A043109Q10629m24447M26717m48875K29894j51310O8518J89203J91964l22869
16902A612533l93442M55043j528j98045J16413K63803l73114L44313O958l05827
16892A527107P5413K48300j26242J71152N2827L33620q23773O76228k36281O3692
16882A962043j30611K81902j09529N2783J65079l40832L05606J09501r8533Q9170
$$ plain form
16952 1200944 943849 721939 1236723 1016111 1274942 1161079 1066686 930771 1215051 885643
16942 885643 1004243 1189988 1038362 1177826 856284 736085 1105516 1118066 1237849 1331627
16932 1331627 1282327 1328106 1187428 909166 1163377 1180219 927773 1388472 1220441 901986
16922 901986 1562649 1217680 1240023 1380502 1241253 1248408 1512466 1506779 1328372 1043109
16912 1043109 1853738 1429291 1856008 1407133 1637027 1485717 1554235 1743438 1935402 1612533
16902 1612533 1219091 1674134 1672606 1474561 1590974 1854777 1481663 1825976 1832934 1527107
16892 1527107 1602520 1850820 1724578 1895730 1948557 2282177 1458404 2134632 1898351 1962043
16882 1962043 1831432 2113334 2003805 2056588 2221667 1880835 2186441 2295942 2197409 2286579
16872B286579K33459k67294P043j68152K36750K56327j83877K79077m91041J91228
16862B380099L14012j21373N7592R6868p1537Q517J20652k3333K05247l14057
16852B652687P7092L97427k85423N59383j77452L65474m71070p6713R9895j35507
16842C005793N85569j52617L28833j4275k42461K4320J92375o2744K41366j31301
16832C774858K16177j28317L41364J13258l18077J66635L00791R0495J15661J10752
16822D783597j55749J94327J4895K5693M61796j342J7606n9129J60869L50349
16812E792912j98254J67112J2018L71502q07L86038j20846O5319M84667j15172
16802F844489K43441J67821k11886M09950K48937N8229L48461N18109j54808M8149
$$ plain form
16872 2286579 2520038 2252744 2259787 2091635 2328385 2584712 2400835 2679912 2188871 2380099
16862 2380099 2694111 2572738 2630330 2727198 2655661 2664178 2784830 2761497 2966744 2652687
16852 2652687 2729779 3127206 2841783 3401166 3223714 3589188 3118118 3041405 3141300 3005793
16842 3005793 3591362 3438745 3767578 3753303 3510842 3535162 3727537 3664793 3906159 3774858
16832 3774858 3991035 3862718 4204082 4317340 3999263 4165898 4466689 4557184 4672845 4783597
16822 4783597 4627848 4822175 4837070 4862763 5324559 5323217 5340823 5281694 5442563 5792912
16812 5792912 5594658 5761770 5773788 6145290 6144483 6530521 6409675 6474994 6959661 6844489
16802 6844489 7087930 7255751 7043865 7453815 7702752 7760981 8109442 8627551 8472743 8520892
16792H520892M05249K1347K64906K03231n3860P93666j2746K81442L09316L82472
16782A1115915L85791K37424P8653O21571K11853P65948p0441O28507M29282N78415
16772A4982918N85663M82285M62404L76424Q24708O42124O38768N36808N83177
16763B0115279P74909J082054O53672Q68451P96980J459699R37978J352450R74746
16754B9016218J184528J570094J354981J500237J530484J946048K107916K163549
16746D2374055J926952K361003K518118K459201K864985L345206L317248L971385
16738F5138153L394303M394665M556193M549964N361299N469014O099200O339788
16730A05302579P167352P250137P726951P989955Q633730Q141807Q853773Q315838
$$ plain form
16792 8520892 8926141 8947488 9212394 9415625 9361765 10155431 10142685 10424127 10733443 11115915
16782 11115915 11501706 11739130 11817783 12439354 12651207 13417155 13346714 13975221 14404503 14982918
16772 14982918 15568581 16050866 16513270 16889694 17714402 18356526 18995294 19532102 20115279
16763 20115279 20890188 21972242 22625914 23494365 24291345 25751044 26689022 28041472 29016218
16754 29016218 30200746 31770840 33125821 34626058 36156542 38102590 40210506 42374055
16746 42374055 44301007 46662010 49180128 51639329 54504314 57849520 61166768 65138153
16738 65138153 68532456 72927121 77483314 82033278 87394577 92863591 98962791 105302579
16730 105302579 112469931 119720068 127447019 135436974 144070704 152212511 161066284 169382122
16722A69382122Q039935Q105322P137561O064623N162312L019031K051045L35450
16714B09297401j951475k803305m097496o262319o792037q257006q261710q872853
16706A61999200q967159r023448q494778q554779q161645p425373p460485o758354
16698I7153179o610847n393652n298709n306295m378727m357313l864613l933963
16690E8009060l144671l418351k818099k699258k643804k229553k331795j839665
16682C6883864j815352j324307k129111j302847j135758j596102j633871q26455
16674B5120061j062738r82975r51640j042730r28204q77977p24656n00614j137640
16665A6910887l08959o46043m85437m80088o16522m17422l74606n46191o33485
$$ plain form
16722 169382122 177422057 185527379 192664940 198729563 203891875 206910906 208961951 209297401
16714 209297401 207345926 204542621 200445125 194182806 187390769 179133763 170872053 161999200
16706 161999200 153032041 144008593 135513815 126959036 118797391 111372018 103911533 97153179
16698 97153179 90542332 85148680 79849971 74543676 70164949 65807636 61943023 58009060
16690 58009060 54864389 51446038 48627939 45928681 43284877 41055324 38723529 36883864
16682 36883864 35068512 33744205 31615094 30312247 29176489 27580387 25946516 25120061
16674 25120061 24057323 23074348 22122708 21079978 20151774 19273797 18549141 18048527 16910887
16665 16910887 16601928 15955885 15470448 14990360 14373838 13956416 13581810 13035619 12402134
16656A2402134j09136p75442J01750p73656R0090q90064R3249j83875o29263k39322
16646I086465l54681m08555m22717j09814K36848n49585J70339n20057k90280
16637F837963J39953j94360m78362L16848l54016l67968k06947l498o5796l60666
16627E263151O7322k01520r7015l24752M4514N9096k76012j19678R1841n49110
16617C957837P7248q5499N72951o33302J53145m35149L19072m36230K63322j70863
16607C582532m11399J6437M11918k91620j53380P1809M4336j03620m10010J77132
16597B934135j36127M73638k94168q3652k21802k1105J96691o73774L56226j79300
16587B350762j05363J20678K18078l09821m2294l37388L24451k3599r6153m96185
$$ plain form
16656 12402134 12292998 11517556 11619306 10845650 10935740 10045676 10138925 9955050 9325787 9086465
16646 9086465 8731784 8323229 7900512 7790698 8027546 7477961 7648300 7128243 6837963
16637 6837963 6977916 6783556 6305194 6622042 6268026 5900058 5693111 5689613 5623817 5263151
16627 5263151 5330473 5128953 5031938 4707186 4751700 4810796 4534784 4415106 4506947 3957837
16617 3957837 4035085 3949586 4522537 3889235 4042380 3607231 3926303 3490073 3753395 3582532
16607 3582532 3171133 3187570 3599488 3307868 3154488 3226297 3270633 3167013 2757003 2934135
16597 2934135 2798008 3271646 2977478 2893826 2672024 2650919 2847610 2173836 2530062 2350762
16587 2350762 2245399 2366077 2584155 2274334 2232040 1894652 2219103 2195504 2099351 1603166
16577A603166M02233k06280J29988j08420K2606l07065L69337K3439o6414k72543
16567A590047K35729l57279J90282L07153m05331l18664M94192J03393k69233
16558A570289j04211q5591j42157J78933K95683j67471p3927K0275m6994k72535
16548A172294L57092k80001J35059P2946k80455m4192m2477j77239M30787j10939
16538A232875m08979M73621j81425M6494j2803J66029j35486J15268l49750k52784
16528F93060K8283M60116j54865j68496j77864J96396p4477j29091J03908K1848
16518G98818J28718J58014j38450k67867L89955k00971K09438m06534J45948K27389
16508A044458l47703O5254K42626l33407j1422K99414k82711j98200K80563j24459
$$ plain form
16577 1603166 2005399 1799119 1929107 1820687 1843293 1536228 1905565 1929004 1862590 1590047
16567 1590047 1825776 1468497 1658779 1965932 1560601 1241937 1736129 1839522 1570289
16558 1570289 1466078 1380487 1238330 1417263 1712946 1545475 1471548 1491823 1444829 1172294
16548 1172294 1529386 1249385 1384444 1457390 1176935 1132743 1090266 913027 1343814 1232875
16538 1232875 823896 1297517 1116092 1162586 1149783 1315812 1180326 1295594 945844 693060
16528 693060 721343 1181459 1026594 858098 680234 876630 802153 673062 776970 798818
16518 798818 927536 1085550 947100 679233 1069188 868217 1077655 671121 817069 1044458
16508 1044458 696755 762009 1004635 671228 659806 959220 676509 478309 758872 634413
16498F34413k48040J92813J54995l65271M36211J01199l22237q5432K48626k10135
16488E37142K31532k29563J73627P918j92528M48013m57102P5094j05499O3595
16478E52229k4031q4617L03992j64076B50131L26917j97117J77553o4774L9796
16468E32506A80760J31838j5272J18042P5764J6031k20067J52657n3644p0379
16458C15730M46507l03902L62468l08278j16375K01305M6167j16729k6580J08163
16448F08476C336N77153j46499O38P7616J25855k55186o0720J13535j95319M10692
16437F51101C22095J99334q6981o303m4794A25618M62988B40927L63327A84754
16426F78960C24525q0391K14099A37491K64393K445A12966J4357L15969j05562
$$ plain form
16498 634413 386373 579186 734181 368910 805121 906320 584083 498651 747277 537142
16488 537142 768674 539111 712738 720656 528128 976141 519039 594133 488634 552229
16478 552229 528198 443581 747573 583497 250131 577048 379931 557484 492710 532506
16468 532506 180760 312598 297326 415368 491132 507163 287096 439753 386109 315730
16458 315730 762237 458335 820803 512525 396150 597455 643622 526893 500313 608476
16448 608476 3336 580489 433990 434628 512244 638099 382913 322193 435728 240409 651101
16437 651101 322095 521429 434448 428145 383351 125618 588606 240927 604254 184754
16426 678960 324525 244134 458233 137491 401884 404329 112966 127323 443292 337730
16416C37730O9350A78165q4650K36017P6527R8333K17235B67376J2709m5431K94873
16405E29527B24929R7355j00195K00542a12167D31958J08292A28103m6681K41178
16395C22600j55155K66257A57288a1803C12401n416r6138o1903j0370B6087L11294
16384C37381a636C52416j43282J58205A60272L3769f5086B45170K55769A77114
16373A29722d1455D70382b01450A93845G8603K43523O0296J15323B24162p6435
16363A47727L8315p0633F249P6987A7158J80942G4766M0046C9381M01822A1189
16351A19719J6363F2973b11267A85499m5433F9579Q3137j2632H384J43468R3742
16340B45594B3918J60071b4342I5833C0423J93141D388J1664a42770A46215N9700
$$ plain form
16416 337730 407080 178165 93515 329532 406059 504392 721627 267376 280085 234654 529527
16405 529527 224929 322284 222089 422631 -112167 431958 540250 128103 81422 322600
16395 322600 167445 433702 157288 -11803 312401 306985 210847 148944 138574 26087 337381
16384 337381 -1636 352416 209134 367339 160272 194041 -65086 245170 500939 177114
16373 129722 -41455 470382 -201450 193845 78603 322126 382422 497745 224162 147727
16363 147727 186042 115409 6249 83236 17158 198100 74766 114812 39381 441203 11189
16351 119719 136082 62973 -211267 185499 140066 69579 152716 140084 8384 151852 245594
16340 245594 23918 183989 -24342 95833 30423 223564 4388 16052 -142770 146215 205915
16329B05915F4089K15109j21947G7377K79345J1943H2150b3044A40443B7595L15147
16318C42742J16012A364J33672A5715J35228j9422K71028j42055q7981K02092
16308C74605B6404a7528B09353a94225c947B03807F5488M1909Q6195J23391b3256
16296A3970J08013K65483A19100R5537p3517K0275E1503J63566F8928r145a25645
16284c0663i159A40287a9826B16957K4474I2020J19449J9876b76175e326A16084
16272A49548E1861b1530B2952M3908a36419M3711A27309d24223G7297m445Q5578
16261A58430b4274B92157a48904K1992D2877b12271K0987e5111J6602C16943k2260
16250B94683e6669j86681B02219h2525j9000j78004A36728J41474E7979J60181
$$ plain form
16329 205915 64089 279198 157251 77377 356722 368665 82150 -23044 140443 27595 342742
16318 342742 458754 1364 135036 15715 150943 131521 402549 260494 172513 374605
16308 374605 26404 -17528 209353 -194225 -3947 203807 65488 107397 193592 316983 -23256
16296 13970 121983 387466 119100 214637 141120 161395 51503 215069 68928 59783 -125645
16284 -30663 -9159 140287 -19826 216957 241431 92020 211469 231345 -276175 -5326 116084
16272 149548 51861 -21530 22952 66860 -136419 -92708 127309 -424223 77297 72852 158430
16261 158430 -24274 292157 -148904 -126912 42877 -212271 -191284 -55111 -38509 316943 294683
16250 294683 -56669 -243350 202219 -82525 -101525 -279529 136728 278202 57979 218160
16240B18160g7551N95L5473J5174E1845a38328e6378A39163c21852A65372c2040
16228a77923I6924l3265J19093c2567A12427D9074f4425C34918j47241F4621k0716
16217D3905j9789L6511Q5100E0842J43638a68966Q0386j49523J01122F8179B9047
16205a46664B8458K85549G0262b52943A33911c1390q7906N1818q6857a8484l5783
16194e4267m632r9634M3073A47301g7703A82567a17298L7852L1928j33677A15221
16182a06050b3813B66162e8752E4778g2655F8886A7476N883K2587a22455F5282
16170a50687d5865q6516B35822n1681j0055g1415C29536r0294j07326P8775A03317
16158I8176h8032B98679j6605g8661j35977n6881K4696P1740n6453p9177B01011
$$ plain form
16240 218160 -77551 -76956 -41483 -26309 51845 -138328 -56378 139163 -321852 165372 -32040
16228 -177923 96924 63659 182752 -32567 112427 49074 -64425 334918 187677 64621 43905
16217 43905 24116 60627 145727 50842 194480 -168966 -88580 -238103 -136981 68179 29047
16205 -146664 28458 314007 70262 -252943 133911 -31390 -119296 -67478 -154335 -18484 -54267
16194 -54267 -58899 -158533 -115460 147301 -77703 182567 -117298 -79446 -47518 -181195 115221
16182 -106050 -23813 266162 -58752 54778 -72655 68886 17476 23359 45946 -122455 65282
16170 -150687 -45865 -132381 235822 184141 174086 -71415 329536 239242 131916 210691 103317
16158 98176 -88032 298679 282074 -78661 -214638 -271519 -246823 -175083 -231536 -310713 201011
16146b05664r3361i9021A7528J04610J7780P2709i766B08301G086e1700e861F2681
16133d1997A36303b60258f4150A10506k47g6527j40862l666P0440j1137c9470
16121H0639a68927b8708A25620b2269p5927L9950A08090a85111B2247b0710q0806
16110a01516M5443j99261R1930A99704c2211G6436k280M40137k41212b18199B45965
16098B33536A05126k9178M0866A9384b5054C1862b14196A20032J17878A06188
16087A95367C2615A3516O8615J24772a85716K9289N3567p3307e6375H1540a17007
16075A35954a187A15367b8914k62088P6444c1463k56886n1635A54235B6504g640
16063b38215k9667H6256a41381b8082F7907d53265B0550K00066f7945a8683j89111
$$ plain form
16146 -205664 -299025 -99021 17528 122138 139918 212627 -9766 208301 7086 -51700 -5861 62681
16133 -41997 136303 -260258 -64150 110506 110259 -76527 -217389 -221055 -150615 -161752 -39470
16121 80639 -168927 -28708 125620 -22269 -98196 -58246 108090 -185111 22247 -20710 -101516
16110 -101516 -56073 -255334 -163404 199704 -32211 76436 74156 514293 273081 -218199 245965
16098 233536 105126 75948 116814 19384 -25054 31862 -214196 120032 237910 106188
16087 195367 32615 13516 82131 206903 -185716 -156427 -102860 -176167 -56375 81540 -117007
16075 135954 -1187 115367 -28914 -291002 -214558 -31463 -288349 -339984 154235 26504 -7640
16063 -238215 -267882 86256 -141381 -28082 67907 -453265 20550 220616 -67945 -18683 -207794
16052b07794I1211c32862K6729b6088G8268c2704A89940H0864d9303C5207J19582
16041A54789b9989B37083a36321Q472D6005i5691A84113b24926a05789m9006E7087
16029f7044b9622C5236N190c06257J08727a9322l912I121d9600j50447G1563O9572
16017A41135a35592B6501a85559F1638b26249A9347O280a14884A70780g8568B44503
16005c30204j8347a68609A5115a69379A85708b10736l2854a1119j24828E9767
15994h7780A31181R0391a20263A57063J4339h9477J3872o015A55772k0869o6926
15983F7977j336e704C43464A23312P1303f3289j74050d2278G0902g5775B95983
15971c0285I1496L95437e6431A62871b3627A45883K19503a22596H9275a32651
$$ plain form
16052 -207794 91211 -332862 -306133 -26088 78268 -32704 189940 80864 -49303 35207 154789
16041 154789 -29989 237083 -136321 -127849 46005 -95691 184113 -224926 -105789 -154795 57087
16029 -67044 -29622 35236 40426 -306257 -197530 -19322 -23234 9121 -49600 -200047 71563 141135
16017 141135 -135592 26501 -185559 61638 -226249 19347 25627 -114884 170780 -78568 244503
16005 -330204 -348551 -168609 15115 -169379 185708 -210736 -243590 -11119 -135947 59767
15994 -87780 131181 221572 -120263 157063 171402 -89477 -75605 -81620 155772 134903 67977
15983 67977 66641 -5704 343464 123312 194615 -63289 -237339 -42278 70902 -75775 295983
15971 -30285 91496 486933 -56431 162871 -23627 145883 365386 -122596 89275 -132651
15960A35756L9258C9013a3748E4108i6161A64048c38829f7363j29255H4059k8709
15949E5350b70887j08207A31596b01552N1294b626l4625A53053e4527C3521O3558
15938I7079H937b47969E3946M4652a67447D3024J29171c1953l13864B36426i6188
15926a55357p6098B14198a87218D367a28313a6227p9896K6725A16320a23975e4059
15914a6456p2611F7239a9532j70083B50604m0011a19175j39269J22638l07289
15904d43095A90867c98920J82989i058m3127m4493b6251k21782D4612b69862A01415
15892I8289a1641j30995B6946a69609j85022C7093Q14a4054A37085b64793a05157
15880i7503M470a7941l6431k15617a23959n5314A33709a75689k58157A13159i7745
$$ plain form
15960 135756 175014 39013 -13748 54108 -96161 164048 -338829 -67363 -196618 84059 55350
15949 55350 -270887 -379094 131596 -201552 -150258 -2626 -37251 153053 -54527 33521 97079
15938 97079 8937 -247969 53946 98598 -167447 43024 172195 -31953 -345817 236426 -96188
15926 -155357 -231455 214198 -187218 4367 -128313 -16227 -96123 -69398 116320 -123975 -54059
15914 -16456 -89067 67239 -19532 -189615 250604 210593 -119175 -258444 -135806 -443095
15904 -443095 190867 -398920 -215931 -9058 -52185 -96678 -26251 -248033 44612 -269862 101415
15892 98289 -11641 -142636 26946 -169609 -354631 37093 37907 -14054 137085 -264793 -105157
15880 -97503 -93033 -17941 -54372 -269989 -123959 -179273 133709 -175689 -433846 113159 -97745
15868a50894e3812m13615e2160j42905d6088j24290B47574F4691O6484a33596
15857a76595N2404B50320f7221D463K48455b16893e4158A72710c8388I9753l2290
15846F7463a20900o3936Q2684m8223L8829b2158l2482A06101L3942j6226f3437
15834b46990I276R2093a65837B65436h7978A2594b30889F830i3883c87j42371
15823a42758E2017e3231k85782C1495g04102A79710F7400N611a54272o8116R2443
15812a29945q6393J8499c8381C81008h1648B09229a16062A48721f513l43749G9432
15800c0145A40402J38133b83945A4523c53054a03122A6391a75289k0340A45304
15789A52034E0240i9875F2725R8975k46b56505h5596k50958A14969g8901A03462
$$ plain form
15868 -150894 -53812 -467427 -52160 -195065 -46088 -170378 247574 64691 131175 -133596
15857 -176595 -124191 250320 -67221 4463 252918 -216893 -54158 172710 -38388 99753 67463
15846 67463 -120900 -184836 -102152 -150375 -111546 -22158 -54640 106101 140043 123817 -63437
15834 -246990 9276 101369 -165837 265436 -87978 12594 -230889 6830 -93883 -387 -142758
15823 -142758 52017 -53231 -339013 31495 -704102 179710 67400 73011 -154272 -222388 -129945
15812 -129945 -216338 -197839 -38381 381008 -81648 209229 -116062 148721 -6513 -350262 79432
15800 -30145 140402 278535 -283945 14523 -353054 -103122 16391 -175289 -195629 145304
15789 152034 50240 -99875 62725 161700 161454 -256505 -85596 -336554 114969 -78901 103462
15777b33639A9945O4625b28160K5400A26204h2168E2023C904O7295c15436a21454
15765b40370A60144D6150J59409r3973k4769K16119i5177B05884F5667e8111B51199
15753h9628M513k15430B8305J39281b36647B8228i266G6054J18884i877B5042
15741A31715k0955J6220c9684I2188a68996G3712Q8517c9486A377f6677F484d86952
15728b85501J38988A26665c37632G1157M6028h6065I8466b63017P2904C61538
15717C7258J00036D3861a85743I9664c03510L5188A5083c27751g7981F8624a27014
15705d1131M746E53a04051B82530G8174N9008J8306D5715L4300B0089P3394a65744
15692A81727L81557e2281j37183B00147a19086A66996b37925A22983R6051b75908
$$ plain form
15777 -233639 19945 84570 -228160 -202760 126204 -82168 52023 3904 71199 -315436 -121454
15765 -240370 160144 46150 205559 111586 86817 302936 -95177 205884 65667 -58111 251199
15753 -89628 -85115 -300545 28305 167586 -236647 28228 -9266 76054 194938 -9877 25042
15741 131715 110760 126980 -39684 92188 -168996 73712 162229 -39486 1377 -66677 6484 -486952
15728 -285501 -146513 126665 -337632 71157 117185 -86065 98466 -263017 -190113 361538
15717 37258 137294 43861 -185743 99664 -303510 -268322 15083 -327751 -77981 68624 -127014
15705 -41131 -36385 553 -104051 282530 78174 137182 155488 45715 80015 20089 93483 -165744
15692 181727 563284 -52281 -189464 200147 -119086 166996 -237925 122983 219034 -275908
15681a04819D9354a1648b854j44257A4616b27742C5219b1771k5868G0147O9200
15670A39347b24960B56739a08166A05698a6064H8936b06999A00504A2072D060
15659a25921j17797f2406j19630F5731J45023J42244b71084J2660i6084B7223
15648I3982K18787a39139B38494a14025A10496a86893a0003A7071a53473B00355
15637A06695J81415a82116L6638H695a10153B62969a53082N8615n7848A59303
15626D7493O5926c49474b0305j14492j37784b6326H751K3199N8698i4197M4895
15615d9302p1487C6084c20778A0991c8598F4056r286b36011A64169l3508N7186
15604A87847a13886l9480j30411M3874f7183A30968D7903J363c5900j55229N1317
$$ plain form
15681 -104819 49354 -11648 -2854 -147111 14616 -227742 35219 -21771 -47639 70147 139347
15670 139347 -224960 256739 -108166 105698 -16064 88936 -206999 100504 12072 4060
15659 -125921 -243718 -62406 -182036 65731 210754 352998 -271084 -258424 -96084 27223
15648 93982 312769 -139139 238494 -114025 110496 -186893 -10003 17071 -153473 200355
15637 106695 288110 -182116 -145478 8695 -110153 262969 -153082 -94467 -152315 159303
15626 47493 113419 -349474 -20305 -134797 -272581 -26326 8751 31950 90648 -94197 -49302
15615 -49302 -120789 36084 -320778 10991 -38598 64056 54770 -236011 164169 130661 187847
15604 187847 -113886 -153366 -283777 -239903 -67183 130968 47903 49266 -35900 -191129 -139812
15593a39812O003B66708a18569o5991a9843A52207P0901c9875A8872d3001j09279
15582a52280d9070A36212h5893G794R9522a26457k68l1567F1129g8543A60525
15570f5156J7827I0357f7899R692A69864D0051b01899O0509A79139b53708A09885
15558f5400B5522K16610b08186h9934j23940B12678I1936a14372j98388i7723
15547A1325K3525a12275l9957C85319f3802D5431J23681b7215j06131G2630a32116
15535E0874h8929k44390c76A18279a75705O4442c8847B12187J576a86374g7555
15523a07442A42645a5664j66711O5669J9776A44927a44844H4413K49732j43182
15513A90963q2646i9470C98159m3825A13245C8946b05251I0208c83506E5082A3424
$$ plain form
15593 -139812 -133809 266708 -118569 -184560 -19843 152207 223108 -39875 18872 -43001 -152280
15582 -152280 -49070 136212 -85893 7794 107316 -126457 -126725 -158292 61129 -78543 160525
15570 -65156 -47329 90357 -67899 -58207 169864 40051 -201899 -141390 179139 -253708 109885
15558 -65400 25522 242132 -208186 -89934 -213874 212678 91936 -114372 -312760 -97723
15547 11325 34850 -112275 -152232 385319 -63802 45431 169112 -27215 -133346 72630 -132116
15535 50874 -88929 -333319 -376 118279 -175705 -111263 -38847 212187 213763 -186374 -77555
15523 -107442 142645 -15664 -182375 -116706 -96930 144927 -144844 84413 334145 190963
15513 190963 108317 -99470 398159 354334 113245 38946 -205251 90208 -383506 55082 13424
15501c60617A5625a97681A09312f5256A79558a21822C3527e5510B53912a77330
15490D4037i0061k5061F7260O843i0095G8185K04359F945J96685c67301A38679
15478H4149d29009A89259B0431a80159j08416L1185D8019a67866A2265J37608
15468A49873b5057j89053j7714D9257f5540b8704B4273M3637b29154J2701d1543
15456g0359A5141g2785r9792B22882q9017D3755J60609J4152a25399A4616J86045
15445B00661J41677A6989J9410J19011J17082I140f7498B0193R355a98300A08869
15433a80056B4165R6790A6666g81A03176b03104j17451D0783b0500G6537c24405
15421c4247A21059l7142L1173h8128E7568e1658m2658M3829k81585A99694b94497
$$ plain form
15501 -360617 15625 -197681 109312 -65256 179558 -121822 33527 -55510 253912 -177330
15490 44037 -90061 -115122 67260 74103 -90095 78185 282544 6945 203630 -367301 138679
15478 84149 -429009 189259 20431 -180159 -288575 -257390 48019 -167866 12265 149873
15468 149873 -25057 -214110 -231824 49257 -65540 -28704 24273 67910 -229154 -216453 -41543
15456 -70359 15141 -72785 -172577 222882 133865 43755 204364 218516 -125399 14616 200661
15445 200661 342338 16989 36399 155410 272492 9140 -67498 20193 29548 -198300 108869
15433 -180056 24165 120955 16666 -781 103176 -203104 -320555 40783 -20500 76537 -324405
15421 -34247 121059 83917 115090 -88128 57568 -51658 -94316 -50487 -332072 199694 -294497
15409I9129A2725e0173N851A56138j9628a69580j7107n6055A35278a23549A80683
15397B8571J7439L10159a99842k1637H3082a25679j26534B01614E5620B2065J9805
15386D1870a2617D46028b4092C54330e14B0878K25269H2197c8781G5375O0581
15375A35956i6701P527K2382B8807J81404A7003J06195a77745m3101G3630h549
15363c0529l4493j19036B20783c57612C99983H383R1249c3775B27946e0405A75146
15351F3594J01733M1858c92465I2639J88593j11877R7602i3208p2257q0604A90119
15339a7678A01652B4790a19200D9348J21784b85553A33646K15727A43978n799
15329A38179a38346A31118n26n5638a1158k9678m9061k32137g749j65560A50576
$$ plain form
15409 99129 12725 -50173 -44322 156138 136510 -169580 -186687 -242742 135278 -123549 180683
15397 28571 46010 356169 -199842 -221479 83082 -125679 -252213 201614 55620 22065 41870
15386 41870 -12617 446028 -24092 354330 -514 20878 246147 82197 -38781 75375 135956
15375 135956 -96701 -89174 -66792 28807 210211 17003 123198 -177745 -220846 73630 -8549
15363 -30529 -65022 -184058 220783 -357612 399983 8383 99632 -33775 227946 -50405 175146
15351 63594 165327 207185 -392465 92639 281232 169355 266957 -93208 -165465 -246069 190119
15339 -17678 101652 24790 -119200 49348 171132 -285553 133646 349373 143978 138179
15329 138179 -138346 131118 130592 74954 -11158 -40836 -89897 -322034 -7749 -173309 150576
15317C21197O068g850k13592A65482G1896a93677C22527h8131A48377c61119A66548
15305a61108A40908a45073I0240N3066B7689L7955A738O6889c8317F912P8409
15294H5321L58817b08675i317A39928c3408A33314f8979a0011A25360d9792k26119
15283b75911a0281A15469d3870l4845D01322A62253J22326G5319i2934C82185
15272h8457A76720a42385j5525a3928B5697a49670B52945j12004J54533c5279
15261c2381C88748q0091A09541L8012o5518K46563A51360c7062A4533d6449F0310
15249B25842m8944R66317K08587o4974p3739L48220E90830A09835e0040A11075
15238B68649C2558e4047A30158D4221J0058K47766F0248B7539b9327k49063A86427
$$ plain form
15317 321197 327265 -7850 -221442 165482 71896 -193677 322527 -88131 148377 -361119 166548
15305 -161108 140908 -145073 90240 143306 27689 65644 1738 68627 -38317 6912 85321
15294 85321 444138 -208675 -9317 139928 -33408 133314 -68979 -10011 125360 -49792 -275911
15283 -275911 -10281 115469 -43870 -78715 401322 162253 284579 75319 -92934 382185
15272 -88457 176720 -142385 -157910 -13928 25697 -149670 252945 140941 295474 -35279
15261 -32381 388748 308657 109541 147553 82035 328598 151360 -37062 14533 -46449 60310
15249 225842 176898 1143215 1351802 1286828 1213089 1561309 590830 109835 -50040 111075
15238 268649 32558 -54047 130158 44221 54279 302045 60248 27539 -29327 -278390 186427
15226b00379B5773G467a77264E7706J05774b77157J26381A97876q7163M0010R7825
15215B48548c922B1099J57826q0327J52170o5595h9720A09152K4676Q5465F8585
15203a45043D6225K10283A01843J11074i2216C7333a01298A09886J72581m3096
15193B39371d8270C13714e7528E10174H6048e8184A22178n2033P2743h6674B95934
15181c25366g9511a4322A0554i5133A67508D6410a71077A27845b220B42757a42913
15169A48052J4518K6337q0218J98235K1971j21337A7235J36392l6618a4339A03931
15157c8894I3423K5364L7509J45214j2366a61008F3675K9731N6772K4777c9901
15145d7129I2269J0958b13844B4384J07248R6493d6425B36267J0143e5150r6423
$$ plain form
15226 -200379 25773 7467 -177264 57706 163480 -277157 -150776 197876 110713 150723 248548
15215 248548 -3922 21099 178925 98598 250768 185173 -89720 109152 133828 219293 68585
15203 -145043 46225 256508 101843 212917 -92216 37333 -101298 109886 282467 239371
15193 239371 -48270 313714 -57528 510174 86048 -58184 122178 70145 142888 -86674 295934
15181 -325366 -79511 -14322 10554 -95133 167508 46410 -171077 127845 -2220 242757 -142913
15169 148052 162570 188907 108689 306924 328895 207558 17235 153627 117009 -14339 103931
15157 -38894 93423 118787 156296 301510 289144 -161008 63675 93406 150178 174955 -39901
15145 -47129 92269 103227 -213844 24384 131632 228125 -46425 236267 246410 -55150 -151573
15134a51573B46208A6439Q9364f5165A17958J46467c2634A34374J7938g6501p1577
15123a48078B70100F0399M0297D7784q937f4513C96552J34472g3652R871A5087
15111h8354j8319B35368b11106a504B15191I817J5211O9369C6640L03073B2519
15099B38333q6043o7740J72082J7482h487A10747a31997C27228l4115A31689i5572
15087C93338A91894L99589b5482C0081A0001K0332K71612o0560E287R2567l7040
15076F0814m831K43299e64D2111Q1106b5369B21399e5163k2244B72958b0437C87591
15063B80028b56700A1345K07908A04038f3573D7031a6657B93596d7276A77393
15052A47337N1550n4800J47490j27402K92062P1190b32764i0819G8756Q2889b84142
$$ plain form
15134 -151573 246208 16439 105803 -65165 117958 264425 -32634 134374 152312 -76501 -148078
15123 -148078 270100 60399 100696 47784 38847 -64513 396552 531024 -73652 -63781 15087
15111 -88354 -106673 235368 -211106 -1504 215191 9817 25028 94397 36640 339713 22519
15099 238333 152290 84550 256632 274114 -8487 110747 -131997 327228 293113 131689 -95572
15087 393338 191894 591483 -25482 30081 10001 30333 301945 241385 5287 97854 60814
15076 60814 55983 299282 -564 42111 123217 -25369 221399 -55163 -77407 272958 -20437 387591
15063 280028 -256700 11345 219253 104038 -63573 47031 -16657 293596 -47276 177393
15052 147337 198887 144087 291577 164175 456237 527427 -232764 -90819 78756 161645 -284142
15040I5312D4082A7491O1L515L90003j22129o0911P804N5615D3265a04034B84121
15027C37317Q8081j62273A11288b36894J0414B30475h5134c2601B58239J1576
15017B69815Q0378E1998L99863j89561g1400G0853O9545J6372j3385o7696L39540
15006D15229K985A46070K28530M3401a2260C75659B7939J86268J96272g5414E48223
14994c8691C10958F9553i9180D5052O6533a15505A56668o7840J49933a63861j3632
14983a77493A98636k1313L1678K3380k4565J37924g2429A09153J10859K62860
14973D82872A46256J41200L9922j22442J33701A57998M37362B70788j460N3256
14963C22584k1222M3046A23722J21739P2021j4383e8136I3988K18077Q9353j79444
$$ plain form
15040 95312 44082 17491 17552 21067 411070 288941 228030 235834 291449 43265 -104034 284121
15027 337317 425398 263125 111288 -236894 -226480 230475 -85134 -32601 258239 269815
15017 269815 350193 51998 451861 262300 -71400 70853 140398 156770 143385 75689 415229
15006 415229 418214 146070 374600 418001 -12260 375659 27939 214207 410479 -75414 548223
14994 -38691 310958 69553 -99180 45052 111585 -115505 156668 88828 238761 -163861 -177493
14983 -177493 198636 177323 209001 232381 207816 345740 -72429 109153 220012 482872
14973 482872 146256 287456 327378 204936 338637 157998 595360 270788 269328 322584
14963 322584 301362 344408 123722 245461 317482 303099 -58136 93988 312065 401418 221974
14952B21974P7242A39029g6827B03373K72679B11219q1527J71732P3746k1706
14942C53464J07002A50609K73654e8187r0525O8477C82010K1910G3105K39828
14932C12933J13574A25113i184A17414Q7621K2836C1747K51365n3529K5439j9490
14921B35532J80002P3113B42257o3153M0213J22842L02581B60676K42509n1388
14911D51797P1725q8621D8325J67401I3198L19811D4237K28468L08583b05976
14900C30266l5333j06530Q5719F316K1332L64368j34097R2214K57911B52048j1805
14889B40243J4181j1764J79848m7899C9626K14694N4256k2798N5888r8807R3432
14878C36291l8069J09718A32168L49832B04063M24852C10389K9933L85025n5918
$$ plain form
14952 221974 299216 139029 -76827 203373 476052 211219 129692 301424 375170 353464
14942 353464 460466 150609 424263 -58187 -148712 -80235 382010 403920 73105 312933
14932 312933 426507 125113 -9184 117414 205035 227871 31747 283112 229583 255022 235532
14921 235532 415534 488647 242257 179104 219317 342159 644740 260676 503185 451797
14911 451797 523522 434901 48325 215726 93198 413009 44237 272705 581288 -205976
14900 330266 294933 188403 274122 6316 27648 392016 257919 350133 608044 252048 240243
14889 240243 254424 242660 422508 374609 39626 254320 308576 285778 341666 242859 336291
14878 336291 298222 407940 132168 482000 204063 628915 310389 340322 725347 669429
14868F69429A85930J3817O3229L61770k46694j49200j9268J82783F9663K40372
14858C10035J13047G7185L50983K98160A38483N38578M7589n6895A90025L49599
14848E39624B4960O21364B57720J36410j44245L45919A69241J60123L66641j90342
14838E05663J28729B80821K41928k33940o1828K74993K74950l14699J18284j34732
14828D45777M36185m12195j72744O4650L4102p5772J1127j28582a1034F57526
14817D26814O4247K24995k24010R865J05405n3455j86351L02092C24223K62792
14807E87015p139r1483J26794A58706N14360j30978n6814B08051L58673K49361
14797H16085C50353K49288B66623O2649J19669K11747B46449L11614k34665J58854
$$ plain form
14868 669429 185930 199747 262976 624746 378052 228852 209584 392367 69663 310035
14858 310035 423082 77185 428168 726328 138483 677061 724650 667755 190025 539624
14848 539624 24960 646324 257720 394130 249885 595804 169241 329364 696005 505663
14838 505663 634392 280821 522749 288809 226981 501974 776924 462225 580509 445777
14828 445777 881962 469767 297023 361673 395775 320003 331130 202548 -11034 657526
14817 426814 491061 716056 492046 501911 607316 553861 367510 669602 324223 587015
14807 587015 579876 488393 615187 158706 673066 542088 485274 208051 566724 816085
14797 816085 350353 599641 266623 329272 448941 660688 246449 558063 323398 482252
14787D82252N85516D75873Q0882J27275M9852J33486B67261M75962l44354l0167
14777C68702R8773j8303K81731B57878J14583J7336K62704B97108K66407j01754
14767D61761A36841R40520n26039K37851l57331M81424r9251M6170l69818K04701
14757F95068M4766j2782m455K21116k47174p8719k9095Q1821j1105k54590L08311
14746G13162k98260J74583L8489J07814m57J71634m50499m8236J47828k4086J78496
14735G10468K63869j96288C54989M92881j30284K32840m7318j7484k2243N3534
14725I16915D48546K95890n8009M59058l92914J58452D08669O03740D30765J63442
14715E94207n4371J93597J50911k74947P8048J24918m3179J92039k06871n8520
$$ plain form
14787 482252 1067768 475873 556755 684030 733882 867368 267261 743223 398869 368702
14777 368702 467475 449172 730903 257878 372461 389797 652501 297108 563515 461761
14767 461761 136841 1077361 551322 789173 431842 913266 814015 860185 490367 695068
14757 695068 739834 727052 722597 943713 696539 617820 588725 670546 659441 404851 713162
14746 713162 414902 589485 627974 735788 735331 906965 456466 408230 556058 531972 710468
14735 710468 974337 778049 354989 847870 717586 950426 903108 885624 863381 916915
14725 916915 448546 744436 686427 1145485 752571 911023 408669 1012409 430765 594207
14715 594207 539836 733433 884344 609397 687445 812363 769184 961223 754352 695832
14705F95832K33126j85584K49714j81860L03601k33854j6355K07913k97503j51170
14695F23860L05196K0042j54670j53959M80636l24587M7587O4402k29920j11171
14685E67416J37393L65927j00340J49382k13096J3440K73580j74676l6248k12160
14675G70618K53283K05549k89732J22508P402Q0098k10904K82047m15787K69533
14665A074615m8963l2020J37109j54695J55666k81701N0644L0018K413L27925
14655A261011m50445R8518K30281j24112K37961k76500J15079j72561M50700k09579
14645A160353j90546L16201k6149k38960K23906j7609p0410K15207K3926k06651
14635A189268L05520l24744L91794p03784N49671K3467k13175K38416o9247k69173
$$ plain form
14705 695832 928958 743374 993088 811228 1114829 880975 864620 1072533 775030 623860
14695 623860 929056 949098 794428 640469 1121105 796518 844105 908507 678587 567416
14685 567416 704809 1070736 970396 1119778 906682 920122 1193702 1019026 982778 770618
14675 770618 1023901 1229450 939718 1062226 1069628 1149726 938822 1220869 805082 1074615
14665 1074615 1025652 993632 1130741 976046 1131712 850011 900655 930673 933086 1261011
14655 1261011 810566 909084 1139365 1015253 1253214 976714 1091793 919232 1369932 1160353
14645 1160353 969807 1286008 1259859 1020899 1244805 1227196 1156786 1371993 1395919 1189268
14635 1189268 1494788 1170044 1561838 858054 1407725 1431192 1218017 1456433 1387186 1118013
14625A118013M31915j42753R5973j73705L87843j38108j14021o3161L33290j70785
14615A564501q9572r5916R5454l86695R6221M92770k25100m1180J29079p3553
14605A466009K27488k96228M91337l46729j17939L84654l51565P8551K3054K11625
14595A770257l87052L64532j21605K77703r7714j62591L12300l09585j42332L62518
14585A866431J6461J50015k24481k48280N89199n5407l13266L12300O891M1234
14575B141097J3024r8797O9426J63519j21971l39545N46108m43953K53593J15993
14565B298494K69044k06593O5662J05897o5531J21079k9521J31838L06897m0397
14555B956869L09910j56564M27369N55685N11016J178509K173050M548774J0314544
$$ plain form
14625 1118013 1549928 1407175 1503148 1329443 1717286 1579178 1465157 1401996 1735286 1564501
14615 1564501 1474929 1379013 1474467 1087772 1183993 1676763 1451663 1410483 1539562 1466009
14605 1466009 1693497 1397269 1888606 1541877 1423938 1808592 1457027 1535578 1558632 1770257
14595 1770257 1383205 1747737 1626132 1903835 1806121 1643530 1955830 1646245 1503913 1866431
14585 1866431 1882892 2032907 1808426 1560146 2149345 2093938 1780672 2092972 2099863 2141097
14575 2141097 2154121 2055324 2124750 2288269 2166298 1826753 2372861 1928908 2182501 2298494
14565 2298494 2567538 2360945 2426607 2532504 2466973 2588052 2558531 2690369 2997266 2956869
14555 2956869 3266779 3110215 3537584 4093269 4604285 5782794 7955844 12504618 22819162
14546B2819162J8636551J312891A9164577I395458D449109j655232o63628m0467
14538B089782m29313M23129r9216k73611J92354K86993m10050L12353k15234K54041
14528B131228k94266N71086l49328K58765K05986k25552P8570j04143L13256J69077
14518B754679l30505J92460j75794J20100M1698L0480j48818J50854J92936j40210
14508B687880R6518j86814M32827k936k02832L0690J66843J10541j2773L41540
14498C461484l70795J34530K33197J28550k82009J62297j18100K66644r9447R2790
14488C609141M9947l13766J65985J25248M05670k76044k6885j85234J72719M3214
14478C769995n1350O10148l04121J58139R2171L0401m09110K26569J23805j87022
$$ plain form
14546 22819162 41455713 42768604 19164577 9395458 4449109 2793877 2130249 2089782
14538 2089782 1660469 2083598 1984382 1710771 1903125 2190118 1780068 2092421 1877187 2131228
14528 2131228 1836962 2408048 2058720 2317485 2523471 2297919 2376489 2272346 2585602 2754679
14518 2754679 2424174 2616634 2440840 2560940 2602638 2633118 2484300 2635154 2828090 2687880
14508 2687880 2784398 2597584 3030411 3027475 2824643 2855333 3022176 3132717 3119944 3461484
14498 3461484 3090689 3225219 3458416 3586966 3304957 3467254 3349154 3615798 3516351 3609141
14488 3609141 3659088 3345322 3511307 3636555 4042225 3766181 3739296 3554062 3726781 3769995
14478 3769995 3718645 4328793 4024672 4182811 4274982 4305383 3896273 4122842 4246647 4059625
14468D059625P16382p53966M13154o4458K73357M34045m12312N9158l046J45904
14458D867843m05263M78811J67987J99506j51947J07930J91515l30111K07074
14449E333345Q4594Q8215j17793k2285J85662r8986L09929L24381k09706N0680
14439E928036M0614K95003j68368L62157l98755M99838O9262M75509m80552L68668
14429F991412o8011j95449L92345K29048M86133m34283Q800J20235M21211k30187
14419G721254K33146L95590k04834J73559r2280L94575J27845r7351L21884J37575
14409I110963j03472M57675o7160M3587M92408K6024N8562J59358K19808L19103
14399A0716856N4246k96289O58224J00518M16071j58619K46020M87386m2381L85618
$$ plain form
14468 4059625 4776007 4022041 4435195 4370737 4644094 5078139 4665827 4724985 4721939 4867843
14458 4867843 4462580 4941391 5109378 5308884 5156937 5264867 5456382 5126271 5333345
14449 5333345 5417939 5506154 5388361 5366076 5551738 5452752 5762681 6087062 5877356 5928036
14439 5928036 5968650 6263653 6095285 6457442 6058687 6558525 6627787 7103296 6622744 6991412
14429 6991412 6923401 6727952 7120297 7349345 7835478 7401195 7409995 7530230 7951441 7721254
14419 7721254 7954400 8349990 8145156 8318715 8226435 8621010 8748855 8651504 8973388 9110963
14409 9110963 9007491 9465166 9398006 9441593 9934001 9960025 10018587 10177945 10397753 10716856
14399 10716856 10771102 10474813 11133037 11233555 11649626 11491007 11737027 12224413 12182032 12567650
14389A2567650P4616L05405J19161N02511j1993J13648L72745O12716j92490K44597
14379A4708566M05383j1143Q23541K12294Q875M44542K83591P04291Q5587L93070
14369A8058597r2667P53290J96784O04442J52123L75068O25237N12315L36132
14360B1521321Q62216o1279P94560M39944P51676Q0505Q50084O70568P4536R07588
14350B6891719P30764O71254P16173K89510J166935O55522N99321J218712O99718
14341C3639628R66545P48837J041076P54238J155786J627329P37949J165987J088007
14332D2925382J278544J607536J478699J119813J844499J750292J809064J503937
14324E5317766J991583J933694J806503K254466K116013K170735K792942K086256
$$ plain form
14389 12567650 12642266 12947671 13066832 13569343 13557350 13670998 14043743 14656459 14463969 14708566
14379 14708566 15113949 15102806 15926347 16138641 16147516 16592058 16875649 17579940 17665527 18058597
14369 18058597 17965930 18719220 18916004 19520446 19672569 20047637 20672874 21185189 21521321
14360 21521321 22383537 22322258 23116818 23556762 24308438 24388943 25239027 25909595 25984131 26891719
14350 26891719 27622483 28293737 29009910 29299420 30466355 31121877 31721198 32939910 33639628
14341 33639628 34606173 35355010 36396086 37150324 38306110 39933439 40671388 41837375 42925382
14332 42925382 44203926 45811462 47290161 48409974 50254473 52004765 53813829 55317766
14324 55317766 57309349 59243043 61049546 63304012 65420025 67590760 70383702 72469958
14316G2469958K757176K944966K911330L379718L322880L670975L629610M106219
14308I9192832L930224M483742M203645N508167N185552N640411N226715O747620
14300A40118908O414876O694895P528634P776675P928536Q767578R029799R735762
14292B03995663J0078388J0654660J1123806J1787492J2561421J2523280J3028373
14285B85753083J4005691J4004593J4240163J4687675J4592914J4698984J4220631
14278C86203734J4041301J3182523J2560404J1171136Q987336N139524J453909
14271D52739867O38076J088708N21142j128869k082512n444649q485132j0569354
14263D27277277j2356770j3341059j4653775j5103898j5254596j5651730j5484024
$$ plain form
14316 72469958 75227134 78172100 81083430 84463148 87786028 91457003 95086613 99192832
14308 99192832 103123056 107606798 111810443 117318610 122504162 128144573 133371288 140118908
14300 140118908 146533784 153228679 160757313 168533988 176462524 185230102 194259901 203995663
14292 203995663 214074051 224728711 235852517 247640009 260201430 272724710 285753083
14285 285753083 299758774 313763367 328003530 342691205 357284119 371983103 386203734
14278 386203734 400245035 413427558 425987962 437159098 446146434 451285958 452739867
14271 452739867 453377943 454466651 454987793 453858924 451776412 446331763 437846631 427277277
14263 427277277 414920507 401579448 386925673 371821775 356567179 340915449 325431425
14256C25431425j5401684j4567896j3701443j3548904j3387129j2540622j2001484
14249B30282263j1319172j0862983j0605999r220897r134645q299226q097767
14242A62741574p762345p292668p028028o093844n907262n239846n521078n354659
14234A12541844m421303m811661l920760l553822m058078l919595l354726l139790
14226H1362109k912932k985132k811065k436544k463567k719188j813950k252517
14218F0967214j908743k088176j976516j634559j081151j568929k245501j346082
14210D7117557j500363j146163j432317n93443j262143j487341r86504j016015
14202C7693268j391524n19871o84589j280744j093557n78410p99732r89236n54455
$$ plain form
14256 325431425 310029741 295461845 281760402 268211498 254824369 242283747 230282263
14249 230282263 218963091 208100108 197494109 188273212 179138567 170839341 162741574
14242 162741574 154979229 147686561 140658533 134564689 128657427 123417581 117896503 112541844
14234 112541844 108120541 103308880 99388120 95834298 91776220 87856625 84501899 81362109
14226 81362109 78449177 75464045 72652980 70216436 67752869 65033681 63219731 60967214
14218 60967214 59058471 56970295 54993779 53359220 52278069 50709140 48463639 47117557
14210 47117557 45617194 44471031 43038714 42445271 41183128 39695787 38709283 37693268
14202 37693268 36301744 35781873 35097284 33816540 32722983 32144573 31344841 30355605 29801150
14193B9801150n28991j087953r62913l88397m73700q17571q31860j61273p05693
14184B3842799m63506o45925m94969m98341m17939l38283n16862n65951o12285
14175A9288738q4884l12004o18289K9765n75226m98915m01982j33025k20160l15039
14165A6158979J9897p31060l00874q1681n01620r0829l02705o8922l16402j66525
14155A3618258o19910J90595n65497O0077r4065m38821k14552j65189n2351k88918
14145A1429627m47332k36740L81887k2139n05489k58364L243j18299k62651j17635
14135I846108p88560L85751N3525k3087j71720o43176K01562j08185j76062k12853
14125H363303M31304p83352J36363J11673m52997L44347n28538J00829j4864O6883
$$ plain form
14193 29801150 29272159 28184206 27221293 26832896 26359196 25541625 24709765 24548492 23842799
14184 23842799 23379293 22733368 22238399 21740058 21322119 20983836 20466974 19901023 19288738
14175 19288738 19203854 18891850 18273561 18303326 17728100 17229185 16827203 16694178 16474018 16158979
14165 16158979 16178876 15447816 15146942 15065261 14563641 14472812 14170107 14101185 13784783 13618258
14155 13618258 12998348 13188943 12623446 12683523 12589458 12150637 11936085 11770896 11718545 11429627
14145 11429627 10982295 10745555 11127442 11105303 10599814 10341450 10344693 10226394 9963743 9846108
14135 9846108 9057548 9443299 9496824 9473737 9302017 8658841 8860403 8752218 8576156 8363303
14125 8363303 8794607 8011255 8147618 8259291 7806294 8150641 7622103 7722932 7708068 7774951
14115G774951n01498p6148j58914O8916k23162m6151j94147r4213j31635M53123
14105F871122k16822k94465j5879j88881L14527m09486q0646l4875J40673l81983
14095E703285O408J00862n6748l72777J61292J78391j44945k77595K60501J10309
14085E668983j64209k67561J71980l5636k75419L7452m8591j07380k66667j80025
14075D532927j37887j56429N11183j63144o9237p8485k69199K59449l90700R6855
14065D135333L54436j88596r8479j77885R7326K07483j72002k15319n3315J1773
14055C900755j67960l4672K07785O9930k52969K12731m52436J38756j42113Q6289
14045C566096k25405K35375k53494k67276K19035N0878J47011j28320l18830L05560
$$ plain form
14115 7774951 7273453 7197305 7038391 7107307 6884145 6837994 6643847 6549634 6417999 6871122
14105 6871122 6654300 6359835 6343956 6155075 6469602 6060116 5979470 5944595 6085268 5703285
14095 5703285 5709693 5810555 5753807 5381030 5542322 5720713 5575768 5298173 5558674 5668983
14085 5668983 5504774 5237213 5409193 5373557 5098138 5135590 5086999 4979619 4712952 4532927
14075 4532927 4395040 4238611 4749794 4586650 4517413 4438928 4169729 4429178 4038478 4135333
14065 4135333 4489769 4301173 4202694 4024809 4122135 4329618 4157616 3942297 3888982 3900755
14055 3900755 3732795 3698123 3905908 3975838 3722869 3935600 3483164 3621920 3479807 3566096
14045 3566096 3340691 3576066 3322572 3055296 3274331 3325209 3472220 3343900 3025070 3330630
14035C330630k36515j04192K41877J92483j50101l98342L02316k33982k14880
14026B729294J4380L27630j48808j93298K33628m4900l98675J94027J84311k37011
14016B660578K10085n08212J43135j65073j49811M54105n77690N69876l38185
14007B298808L2050n5720M01324n21796K97811m15268J46556j41300N75766l95883
13997B222348j47442K39771n9218j7970k03526j0860M47768J35817J373075K918803
13987F898566Q809784J9693683J0935340k1689783A1734617m340895j788512q94820
13979D710390q36717j86778j45856n37210J18052p0270m67648J03031K6534l14881
13969B398647k9838j34153L99752k10328Q3782j16963j10372J73850l35874m1599
$$ plain form
14035 3330630 3094115 2989923 3231800 3424283 3274182 2875840 3178156 2944174 2729294
14026 2729294 2743674 3071304 2922496 2729198 2962826 2917926 2519251 2713278 2897589 2660578
14016 2660578 2870663 2362451 2505586 2340513 2190702 2644807 2067117 2636993 2298808
14007 2298808 2330858 2275138 2676462 2154666 2452477 2037209 2183765 2042465 2618231 2222348
13997 2222348 2074906 2314677 2255459 2237489 2033963 2023103 2470871 2606688 3979763 6898566
13987 6898566 15708350 35402033 46337373 24647590 11734617 7393722 5605210 4710390
13979 4710390 3873673 3686895 3541039 3003829 3121881 3051611 2583963 2686994 2713528 2398647
13969 2398647 2368809 2234656 2634408 2424080 2507862 2390899 2280527 2454377 2118503 2076904
13959B076904J55905M1020m0014j86074J79080m8416j16385k8599J09012k41731
13949A900702J2994J86643k17974l4371j22722J97571j58682J22794j97511K73083
13939A962527n4943j04112m4721j41883j43709K26304m1603J273L00216k40925
13929A718424O6482k01892K32432J67P3233l41852k5101k74036L71193k71598
13919A347452K04049j33213Q9061K63953l33502p2496O8771j55447M2940m5973
13909A275595L48101j24451R14J1775l01677L92849l12713K74337J25008k97723
13899A392015j03724L14388M6820l57910L7143J30258l0357K4350k1000n9518
13889A372465n0304R3834K20319l80595k6920j4463J79988P150m9663L469J85305
$$ plain form
13959 2076904 2232809 2273829 2233815 2047741 2226821 2178405 2062020 2033421 2142433 1900702
13949 1900702 1913696 2100339 1882365 1847994 1725272 1922843 1764161 1886955 1689444 1962527
13939 1962527 1907584 1803472 1758751 1616868 1473159 1699463 1657860 1659133 1959349 1718424
13929 1718424 1784906 1583014 1815446 1815613 1888846 1546994 1521893 1247857 1619050 1347452
13919 1347452 1551501 1418288 1507349 1771302 1437800 1365304 1434075 1278628 1321568 1275595
13909 1275595 1623696 1499245 1500159 1511934 1210257 1603106 1290393 1564730 1689738 1392015
13899 1392015 1288291 1602679 1649499 1291589 1328732 1458990 1428633 1452983 1431983 1372465
13889 1372465 1322161 1415995 1636314 1255719 1228799 1214336 1394324 1401474 1351811 1355280 1540585
13878A540585j26247k99152O4769O237L54755k19016o5711k30943J84028j09118
13868A100187P6036N9264J74442o7308m64371K52461J55538K8674j04038r9147
13858A111738r3663j89369L56373Q2981n42784K15868J97220q7023O9694n28343
13848E92692L72548N9425l7892j33167k8670J40942L10682m40602J62781j49961
13838H48778J34440K91687l31866L21759k07440j53990K1805l60631K43484k17074
13828E90952K5346L62801j82571K35201k0655k28242J92830K79905j20231K13497
13818A348833n95321m5854J37120k26493J82599k62026N02763l25126L83408k24357
13808H75546r315n3231k8606K89403j37307k09823J82604k689l97098L21700m3563
$$ plain form
13878 1540585 1414338 1115186 1179955 1186192 1540947 1321931 1256220 1025277 1209305 1100187
13868 1100187 1176223 1235487 1409929 1342621 878250 1130711 1286249 1314923 1210885 1111738
13858 1111738 1018075 828706 1185079 1268060 725276 941144 1138364 1051341 1121035 592692
13848 592692 965240 1024665 986773 853606 824936 965878 1276560 835958 998739 848778
13838 848778 983218 1274905 943039 1264798 1057358 903368 925173 564542 808026 590952
13828 590952 616298 979099 796528 1031729 1011074 782832 975662 1255567 1135336 1348833
13818 1348833 753512 707658 844778 618285 800884 538858 1041621 716495 1099903 875546
13808 875546 866231 813000 784394 1073797 936490 726667 909271 906582 509484 831184 787621
13797G87621K00569k55097J83710K4315l6424R0906D53554M96466P099k98346
13787F58773J58963Q6351k18997l7627J8976K00608K7160C48280K58621j29912
13777D76989N35755j70452j09980M84346E36531K9865J57717j06634j5248K26475
13767H28706j64569L06j03446J36654K11343D16736M07631q3244k02760J89304
13757G27667K13598l53162K90688M0237O6568l11173r3330J48276k47983J63004
13747F44390P9543n4906j10278p337J20921J32657j40490j00392J51419j00262
13737F15265J2623J25741j18714R2336B92766N54815l35299J6371J52314P8746
13727G59713k56376N0732R196K2602L89518D60873L14907j52983J3874o4003q8144
$$ plain form
13797 787621 988190 733093 916803 941118 904694 995600 453554 950020 957119 658773
13787 658773 817736 904087 685090 647463 666439 867047 894207 348280 606901 476989
13777 476989 1012744 842292 732312 1216658 536531 566396 724113 617479 602231 828706
13767 828706 664137 664443 560997 697651 908994 416736 824367 741123 538363 727667
13757 727667 941265 588103 878791 919028 985596 674423 581093 729369 481386 644390
13747 644390 723933 669027 558749 551412 672333 804990 664500 564108 715527 615265
13737 615265 627888 753629 634915 727251 292766 847581 512282 528653 680967 759713
13727 759713 503337 554069 563265 585867 975385 460873 775780 622797 636671 572668 484524
13716D84524j93148J26161M30701C59479K77403j12260j38687K45823A85885M58950
13706F44835n5090J49108j32263j26968o4041K28189J35160n1319k18156m7359
13696D62096m6425N2316K29454j71026j43943J6384K36949B58058M31000j70038
13686E19020L1810l143K34003j45680k12518Q2899o1709J34991o3834P1036l5557
13675E51318J61221A21271M15819k14650r4944K37905K03794j19849L5114j36638
13665D47822K202j66578J41910J61218B47027L85167j73091M82145A47012M11033
13655E58045j17668M8975B11333J64744A32655L84261k53773J97252j02159J72067
13645E30303n4374J73761B76218R612O2457J76782m9967k05706J52080J53607
$$ plain form
13716 484524 291376 417537 848238 359479 636882 524622 385935 631758 185885 644835
13706 644835 589745 738853 606590 479622 415581 643770 778930 727611 509455 462096
13696 462096 415671 467987 697441 526415 382472 398856 635805 258058 689058 519020
13686 519020 550830 547687 781690 636010 423492 506391 444682 579673 515839 586875 551318
13675 551318 712539 121271 537090 322440 227496 465401 669195 549346 584460 447822
13665 447822 450024 283446 425356 586574 247027 632194 459103 941248 147012 558045
13655 558045 440377 489352 211333 376077 132655 516916 263143 460395 358236 530303
13645 530303 475929 649690 276218 285830 348287 525069 475102 269396 421476 575083
13635E75083m1339k53806L27147C02018o4332J45980K52799j12665O5336P8175
13625F67311j45804j09053j54612L0407K90243K29577l46474l7801r1250P6747
13615D09291R0864j22168K2816J79314L5182A10793L48498J51809j50714B17861
13604A85017n5090K46782j78542M62138A56731L3062L56112q7266B24981j6109
13594B08872n1031J22076a62078A98703J3607J26531j8500K89389k67100O1501
13584D04131M9060q2017A48673K18507P1709j78515m7293K68225r5050i4904B94804
13572C24901j06108L57152j86970A12444J48907J14669H2651B6505J88640M36371
13562F51516k18907A04713K74229J15888q0570O712p5046J34829j3451k03568
$$ plain form
13635 575083 533744 279938 607085 302018 237686 383666 636465 523800 589136 667311
13625 667311 521507 412454 257842 288249 578492 808069 461595 423794 332544 409291
13615 409291 500155 377987 400803 580117 615299 110793 459291 611100 460386 217861
13604 185017 129927 376709 198167 660305 156731 189793 545905 458639 224981 208872
13594 208872 157841 279917 -162078 198703 212310 338841 320341 609730 342630 404131
13584 404131 453191 371174 148673 367180 438889 260374 213081 481306 386256 -94904 294804
13572 324901 218793 575945 388975 112444 261351 376020 82651 26505 215145 651516
13562 651516 432609 104713 378942 494830 414260 420972 345926 480755 467304 263736
13552B63736n6788O7864L20853F8259J83081L8750Q5890B4034J66112K9453J70202
13541C89801J54353A49866J78628j29624L90729B14299K39967k9661k6141j1473
13531C86991K32061A45457M05124k68948L464D9611M61722k2759j94334P2262
13521C66502J6854A80520B8119L77879A40254M75367k13835D9268K26497L41817
13511F17582l03215P1607q1458C2280K66610R8533I4379K18496K48476A15957
13500A14294M69925B72463O5690R0872E6576e0433D60554k29056L2969R5823r2762
13489B67528A13976J82637j01629e1672C05929H8407J97994J3557a5784D72581
13478B11605m0105H3518a81190D62202j77501A40174J42294j0439K02101j46445
$$ plain form
13552 263736 206948 274812 595665 68259 251340 290090 375980 24034 190146 219599 389801
13541 389801 544154 149866 328494 198870 589599 214299 454266 424605 398464 386991
13531 386991 619052 145457 550581 281633 285097 49611 511333 488574 294240 366502
13521 366502 383356 180520 28119 405998 140254 615621 401786 49268 275765 617582
13511 617582 314367 385974 304516 32280 298890 397423 94379 312875 561351 115957
13500 114294 584219 272463 338153 429025 56576 -50433 460554 231498 264467 360290 267528
13489 267528 113976 296613 194984 -51672 305929 88407 286401 299958 -15784 472581
13478 211605 171500 83518 -181190 462202 284701 140174 282468 272029 474130 327685
13468C27685A56769K44929C7881K90767q483o9187E1886L14011j82529L43442
13458E26810j86008d4576D09542A08364K22681A20215J17953K61410A79419L80390
13448E59809j93745Q0429A14855n3171M27207k33086a79990D29857J1097F0387
13437A44605a17982A00091L31867J04661k18511A33597J0071J94304n407A58383
13426F04169H5947h3566a939B41573J8468A06077J44789l7840J56925A17696B2061
13414B05001Q3015J95459B22962m3060M1687O136L63909B05092k573J92456J68
13403C95143K08592j14342b01096B4091K00890A11862J28978o0707N8298l0774
13393B07657R5462A35255Q6741c8123C31953J09681b4782A72753o5982j323e6836
$$ plain form
13468 327685 156769 401698 37881 328648 320165 250978 51886 365897 183368 526810
13458 526810 340802 -44576 409542 108364 331045 120215 238168 499578 179419 559809
13448 559809 366064 446493 114855 61684 488891 255805 -179990 429857 440954 60387
13437 144605 -117982 100091 431958 536619 318108 133597 143668 337972 332565 158383
13426 604169 85947 -83566 -1939 241573 260041 106077 250866 213026 369951 117696 22061
13414 205001 288016 483475 222962 179902 221589 227725 591634 205092 202519 394975 395143
13403 395143 603735 489393 -201096 24091 224981 111862 240840 180133 238431 207657
13393 207657 303119 135255 221996 -38123 331953 441634 -24782 172753 106771 105448 -56836
13381B5171L65397A89164B9857J19116Q5904M1608B2095J86441J1298j09021k0340
13370I0473J26474r5263J68286k9410J74060o7457r7333K1095j25331M64453B13686
13358A55857a29501D8865K99861l0230n2107K57957p8575A86138c5741C10648
13347A78772A6317P6651l202K82540j79465J42176L59465C12876K412O1769a45975
13335B87059A05845a96787A93923F3282r891K7330K5296J83903H7174c6168B42187
13323B08115J95483J0987A06816K35477J52078a81350A80810j7399P6175J6152
13313B55738a40754A42098L4479n134J42533b43143A74958l6848B2972N4518K73660
13302C51150D5578J21164M1629B9355L75997a30702A88638M5899n3734E246K61317
$$ plain form
13381 25171 390568 189164 29857 148973 234877 276485 22095 208536 219834 110813 90473
13370 90473 216947 121684 289970 260560 434620 367163 269830 290925 165594 630047 213686
13358 155857 -129501 48865 348726 318496 266389 524346 445771 186138 -35741 310648
13347 178772 16317 92968 89766 372306 192841 335017 694482 312876 315288 377057 -145975
13335 287059 105845 -196787 193923 63282 53391 80721 106017 289920 87174 -36168 242187
13323 208115 403598 414585 106816 342293 494371 -181350 180810 163411 239586 255738
13313 255738 -140754 142098 176577 171443 313976 -243143 174958 138110 22972 77490 351150
13302 351150 45578 166742 208371 29355 405352 -130702 188638 234537 180803 5246 266563
13291B66563L4731l8995A22199N1805b9156C63149A02511K6406O4468a42103E23249
13279A78746M4715a5776B51991F3656h8823i215B01622G0302J27820O3298a03106
13267C73909j86412J40806a91093C19511E318M68260p3381j52790a41743H0925
13256e6591j56410g2622A79947K22168c19384A07150K14175B7011J66714a12143
13245C39037a20769C21074M8218n2282j52700j056m8132J91378a77283D22096
13234a17785K427F4908K52111H8603f0283B43332q9893D8266O7745d2864C8610
13222A94832h015j70543E75566d7794J9574B51044J7066i245A53285a21896A83486
13210C43155n6070O1419I4636J33233j08956J03282j07926J01225K7006j6321
$$ plain form
13291 266563 301294 262299 122199 174004 -29156 363149 102511 128917 193385 -142103 523249
13279 178746 223461 -15776 251991 63656 -88823 -9215 201622 70302 198122 261420 -103106
13267 373909 187497 328303 -191093 319511 5318 473578 400197 247407 -141743 80925
13256 -56591 -213001 -72622 179947 402115 -319384 107150 321325 27011 193725 -112143
13245 339037 -120769 321074 369292 317010 164310 163254 115122 306500 -177283 422096
13234 -117785 -115358 64908 317019 88603 -60283 243332 153439 48266 116011 -42864 38610
13222 194832 -8015 -178558 575566 -47794 -28220 251044 268110 -9245 153285 -121896 183486
13210 343155 287085 348504 94636 227869 118913 222195 114269 215494 242500 226179
13200B26179I1648L90365A24792m4964M096O4371h8969C37289i322A90577l8199
13189A52378E5762k0299L9939K48602d5344C02360K73864b6050l1094l05488A1156
13177b1088j79413G7631K72233o553j26359n6199f0464q2206A39871n2662a52545
13165A19303g6060A19773B0132K17933E6148i0221E3939g4747K9106a4010B26818
13153D2419J37651R3343L988I8958Q7520a00518A65720n5642e5387B17992h1476
13141A79171e0137j73761J6933b5491A53598B2498K32763g9602b1437j10348B80044
13129B95679A30769P8472a43989n4909a9476a431C27652n4457e358G5837J11624
13118A87461a20401A83623a12271C9434K47591A05821a71619B3725b5602D0626
$$ plain form
13200 226179 91648 482013 124792 79828 83924 148295 -88969 337289 -9322 190577 152378
13189 152378 55762 35463 75402 324004 -45344 302360 576224 -26050 -57144 -362632 11156
13177 -21088 -200501 77631 349864 343311 216952 160753 -60464 -142670 139871 87209 -152545
13165 119303 -76060 119773 20132 238065 56148 -90221 53939 -74747 -45641 -14010 226818
13153 42419 180070 273413 277401 98958 186478 -100518 165720 110078 -55387 217992 -81476
13141 179171 -50137 -223898 -206965 -25491 153598 22498 255261 -79602 -21437 -131785 280044
13129 295679 130769 209241 -143989 -198898 -19476 -1431 327652 273195 -5358 75837 187461
13118 187461 -120401 183623 -112271 39434 287025 105821 -171619 23725 -25602 40626
13107C56901E3589K42064j32634C6504O201J11981C8303h0589j14963H7668a04727
13095A53553J38442a07563D46194a81590A63544P1811F178J02729J66317r7729
13085A77495G6051a10672A05638a009C70938j69660J24732I9171c58220J70798
13075a87422B90405m0851A03191m1845K72563F7683J06346q6453J05375I2500
13064h1104A2338c3656l6582c2214E9647O1734g6347B1686a00292B63144q5285
13053A77859F6673J11743J66633n916J07155h7988A10779a22858B63781A28606
13042E3624O1374d5747C5125a11333H4362J5697C7119p868b30381A82435k9468
13031A52967b08930g4770I0731M3140F0958a0279j93608H6183K4397K58095a07043
$$ plain form
13107 356901 53589 295653 163019 36504 42705 154686 38303 -80589 -195552 87668 -104727
13095 153553 291995 -107563 446194 -181590 163544 235355 6178 108907 275224 177495
13085 177495 76051 -110672 105638 -1009 370938 201278 326010 99171 -358220 -187422
13075 -187422 290405 249554 103191 61346 333909 67683 174029 87576 192951 92500
13064 -81104 12338 -33656 -70238 -32214 59647 121381 -76347 21686 -100292 263144 177859
13053 177859 66673 178416 345049 339133 446288 -87988 110779 -122858 263781 128606
13042 53624 114998 -45747 35125 -111333 84362 100059 37119 29251 -230381 182435 152967
13031 152967 -208930 -74770 90731 133871 60958 -10279 -203887 86183 110580 368675 -107043
13019B64235B9018K19683F718M548J42787k5139M48454B21923j6988m7457K15236
13008C72714E3596Q1465b4705H5711J99426A00424L47957I0479N2332N1495L59112
12997E53418a06240C01338h0725D1276J47997J05745j23907P6832f1774b8337
12986C3117a57948D43535k17303m4152f7772A99847J22564B8531O9689a89303
12975f1587B1580p429f1865F3773H281J06382B6997K4035K12887q5999c50712
12963B07894r8803A8115J03420J39757c9764k595l69700a28113j68672A12048
12952F4579N8932J02790H1720a80947B4534J3880d2479j18218O2256F8341a44784
12940B46895L3149I0724M3147J9564P4503a86532R1969L4342l26311d2393D7861
$$ plain form
13019 264235 29018 248701 6718 11266 154053 128914 577368 221923 204935 157478 372714
13008 372714 53596 135061 -24705 85711 285137 100424 448381 90479 142811 194306 553418
12997 553418 -106240 301338 -80725 41276 189273 295018 171111 247943 -61774 -28337
12986 33117 -157948 443535 226232 182080 -67772 199847 322411 28531 98220 -189303
12975 -61587 21580 14151 -61865 63773 8281 114663 26997 51032 263919 177920 -350712
12963 207894 109091 18115 121535 261292 -39764 -42359 -412059 -128113 -296785 112048
12952 64579 123511 226301 81720 -180947 24534 38414 -42479 -160697 -98441 68341 -144784
12940 246895 280044 90724 133871 153435 227938 -186532 -94563 -60221 -386532 -42393 47861
12928C09760j38094c7791A69799J03211f8138A68276I8d976n0418B06487P3317
12917B79804b94449A90867B524K37555A07161f2991A48413a07176j34454f4542
12906A66390E75P4487L57284E7142Q2975m7078a29900E4579h9701b8589E9334
12894a49260A02408B812R3518J34351J45217j30996Q7664a99707B09664b32301
12883d6370f731C59133A37796f7242j60175A49921J56193f0336A14381m1960a21061
12871B27477d6487A26153a96078e9846k5571b8990o663I0134i471j93992H3748
12859A10047C9256K062A8742b842j86877C1816K02944E267J34741c8291J125j20077
12847a57243A25722n4687m802d2856C04278D9753j5172R6836a04480K0124a5531
$$ plain form
12928 309760 171666 -37791 169799 273010 -68138 168276 98 -4976 -55394 206487 279804
12917 279804 -294449 190867 2524 240079 107161 -62991 148413 -107176 -241630 -64542
12906 166390 575 75062 432346 57142 140117 93039 -129900 54579 -89701 -28589 59334
12894 -149260 102408 2812 96330 230681 375898 244902 332566 -199707 209664 -232301
12883 -46370 -6731 359133 137796 -67242 -227417 149921 306114 -60336 114381 72421 -121061
12871 227477 -46487 126153 -196078 -59846 -85417 -28990 -35653 90134 -9471 -203463 83748
12859 110047 39256 41318 18742 -2842 -189719 31816 234760 5267 140008 -38291 -37166 -157243
12847 -157243 125722 71035 66233 -42856 304278 49753 34581 131417 -104480 -84356 -15531
12835a24192j3296A69786n9342j6319a54157a4517n931C31848a16095a9761B055
12823D08761c7315C8887d3740A68289A0824M9583b8920j49381D8410i0538B66184
12811d9049A08091i5366H3321b12399D7496f7186j07278A26593b69990I8855a06706
12799H8257D0962K71680a88609C59379a61816a7563j31060I4377Q2296G9397O1362
12788A40759B6927a66607j50233J45550A90980J49768A26417b46144F7422d4388
12777A4266f779C7856i3149e810B9279P6489b36031d1562D3036c65472a06284
12765b70429d6056l2173j78155F2585c7268B57266B7450a87515h5851B02730J51894
12754C54624I9979m8163a29640B92206r5244E3614e5626q9833B89530F0943R3877
$$ plain form
12835 -124192 -137488 169786 110444 94125 -154157 -14517 -20448 331848 -116095 -19761 2055
12823 408761 -37315 38887 -43740 168289 10824 60407 -28920 -178301 48410 -90538 266184
12811 -49049 108091 -95366 83321 -212399 47496 -67186 -174464 126593 -269990 98855 -106706
12799 88257 40962 312642 -188609 359379 -161816 -17563 -148623 94377 176673 79397 140759
12788 140759 26927 -166607 -316840 -171290 190980 340748 126417 -246144 67422 -44388
12777 14266 -6779 37856 -93149 -5810 29279 105768 -236031 -41562 43036 -365472 -106284
12765 -270429 -46056 -78229 -256384 62585 -37268 257266 27450 -187515 -85851 202730 354624
12754 354624 99979 51816 -129640 292206 196962 53614 -55626 -145459 289530 60943 154820
12743A54820J90188J05929C0602b19159a05837A84053J11235o9205J70362A11251
12732A98136I0310K0722m5688j4020p234j4420J09319b7659J3386E2953j7495
12721C5458J16141K72496A57050l8656M07173b6854A39940a03959E26097A54224
12710B41345F1957P6004K07722J00933j81084o5469H360L26833A58262L763p3397
12699H8628C4510J92402B4262a80321M970L1783B00115l8716a17343G6565J60904
12688B37469C1118J97602a46207b3739k0824D8324J31552F4849c2090E9888J653
12677F1541a8314p2620B69112j20135L7179J33779B141a88873Q6168D75084B25115
12665d267A35425j6347n6168b62164B60774a28864B68453I2864C8136Q7698Q9012
$$ plain form
12743 154820 345008 450937 30602 -219159 -105837 184053 295288 226083 396445 111251
12732 198136 90310 111032 65344 51324 44090 29670 138989 -27659 -14273 52953 35458
12721 35458 151599 424095 157050 118394 525567 -26854 139940 -103959 526097 154224
12710 241345 61957 137961 345683 446616 265532 200063 8360 335193 158262 162025 88628
12699 88628 34510 226912 24262 -180321 -175351 -143568 200115 161399 -117343 76565 237469
12688 237469 31118 228720 -146207 -23739 -44563 48324 179876 64849 -32090 59888 61541
12677 61541 -18314 -90934 269112 148977 186156 319935 2141 -188873 -102705 475084 225115
12665 -4267 135425 119078 62910 -262164 260774 -128864 268453 92864 38136 125834 214846
12654B14846l0392l6299m2725E351e3252A24609J0752a90048h1276j65693n6895
12643c03864G7500c8564B00632A7566K54664c43184J27214h6353C97107a09075
12632b36100A49642a17327D14300j50962a8877B40019a55051D84752A84232m8935
12622A35297F7285L09755A13779P9538C0654K09006A12848N1156o4296a00317
12611A80628E6431Q8994g047C74475F6889K68073d6698A38856K03455G2540k1997
12600E0543a56805g4197A69158J01530n285k8182j09145i3701A03911A6709i4885
12588A5913i6145A85470J16409D7706B3116J45213B8371a64824C01906B0734d6783
12576B01201a6462I7098a18203M956B20739g6308A06713C761K03914g2603m7821
$$ plain form
12654 214846 184454 148155 105430 5351 -53252 124609 135361 -190048 -81276 -246969 -303864
12643 -303864 77500 -38564 200632 17566 272230 -343184 -215970 -86353 397107 -109075
12632 -236100 149642 -117327 414300 263338 -18877 240019 -155051 484752 184232 135297
12622 135297 67285 377040 113779 193317 30654 239660 112848 164004 99708 -100317
12611 180628 56431 145425 -7047 374475 66889 334962 -46698 138856 342311 72540 50543
12600 50543 -156805 -74197 169158 270688 265403 237221 128076 -93701 103911 16709 -94885
12588 15913 -96145 185470 301879 47706 23116 168329 28371 -164824 301906 20734 -46783
12576 201201 -16462 97098 -118203 -113247 220739 -76308 106713 3761 207675 -72603 -120424
12565a20424I948b0260o4814q4044B4989M8881c11260a45196A16019h4706A46633
12553C17788r9744c34333A78435c35904a02105m8149A07171A2713L04781a5843
12542b2021i475B59614c9556B5794d1486C30906c53623f549j4719k3932B06808
12530b60304M975A65903j2995F3518J46270h4849A90014B8758J79245b0011n4751
12519g4762l2450A29606c0074l7836B63375j27228K29180D3594a0955B91741c97491
12507C44686D4489a29163C1347b58459e255A09220b19386e4707C57632A01989
12496G946e910A03798J12063E6712a20191e393A67371E6816Q0866e4102B21119
12484e2729C30438A44212O6113A709Q2741a47122j74928a50493C26227A02901
$$ plain form
12565 -120424 9948 -20260 -85074 -169118 24989 73870 -311260 -145196 116019 -84706 146633
12553 317788 218044 -334333 178435 -335904 -102105 -150254 107171 12713 317494 -15843
12542 -22021 -9475 259614 -39556 25794 -41486 330906 -353623 -6549 -21268 -45200 206808
12530 -260304 -255329 165903 152908 63518 209788 -84849 190014 28758 208003 -20011 -74762
12519 -74762 -107212 129606 -30074 -67910 263375 136147 365327 43594 -10955 291741 -397491
12507 344686 44489 -129163 31347 -258459 -5255 109220 -219386 -54707 357632 101989
12496 7946 -5910 103798 215861 56712 -120191 -5393 167371 56816 137682 -54102 221119
12484 -52729 330438 144212 210325 1709 84450 -147122 -322050 -150493 326227 102901
12473d2987G0139h0939n9462c5324G0942K8327c03683J20609C4037R1174l8785
12462H6426j0454b40082h5128o9804b9514E1744J22610b66968m29a27839r8904
12451b26743O7762A78198R1037E8206c51472B48261n8974h6478p705B04354a0468
12439D8959O8069j2761R3884Q9875j02479K53098d35959A06700j551a33431A20931
12427A71525f0367F6403L53783h4194j04906B13118b30869G9842a18440I5079
12416A03829a71307c3781j18509F5302A878L5208J01035b21295P6264A88166b68568
12404A93149a02272f727j64405A4183a24277A85018Q6927i9124C5845L7440b99799
12392f7419c2172k8464H0886J16141f3776p443j56192B08765d4552A23472a58427
$$ plain form
12473 -42987 70139 -80939 -140401 -35324 70942 99269 -303683 -183074 34037 125211 86426
12462 86426 75972 -240082 -85128 -154932 -29514 51744 174354 -266968 -267397 -127839 -226743
12451 -226743 -158981 178198 269235 58206 -351472 248261 189287 -86478 -94183 204354 -10468
12439 48959 117028 104267 198151 288026 185547 438645 -435959 106700 105149 -133431 120931
12427 171525 -60367 66403 420186 -84194 -189100 213118 -230869 79842 -118440 95079
12416 103829 -171307 -33781 -152290 65302 1878 37086 138121 -221295 -145031 188166 -268568
12404 193149 -102272 -6727 -171132 14183 -124277 185018 271945 -99124 35845 73285 -299799
12392 -67419 -32172 -60636 80886 197027 -63776 -71219 -227411 208765 -44552 123472 -158427
12380B58472b5973A77892J04105c1743H2904b7980k58812E389e2811n241C9519
12368a84490O4796L8944A69529f2653J4158J760e71C5906c2284j91067o2791H3813
12355b52551C3881N6620J45866q1495J0922c7072C9512J47367c032l5721a2977
12343I0770J5362m5462J06736Q0475b64446B85464A13595a10019B28384d56694
12332C04286E8924d8948A66130a60998g7852k51742A22849h115o6141A08196k9816
12321G8380c1638A79912e2423A45850d5150H3052l3603B50J65098a91752A04426
12309a32H913d14162I8732C6015J55836b68070P1724A14235a52498H7341a60025
12297c04436O8390e056D5Q7453J70186q5329D3075Q3071A7538b08362K0493B30289
$$ plain form
12380 258472 -25973 177892 281997 -31743 82904 -27980 -286792 5389 -52811 -58052 39519
12368 -184490 -119694 -80750 169529 -62653 -48495 -46735 -571 35906 -32284 -223351 -286142 83813
12355 -252551 33881 90501 236367 154872 165794 -37072 39512 186879 -3032 -38753 -12977
12343 90770 106132 60670 167406 247881 -264446 285464 113595 -110019 228384 -456694
12332 304286 58924 -48948 166130 -160998 -77852 -329594 122849 -8115 -74256 108196 78380
12321 78380 -31638 179912 -52423 145850 -45150 83052 49449 250 165348 -191752 104426
12309 -132 8913 -414162 98732 36015 191851 -268070 -196346 114235 -152498 87341 -160025
12297 -304436 -236046 -5056 45 87498 257684 172355 43075 126146 17538 -208362 -187869 230289
12284G5294K76348a3214B31076a95966F15207G603e3854B3303K20083K08564E5255
12272B71085D097c0204C3469P7781l3575B6151a5967m0136k43844C56929i1439
12260C15766h108E0147j5306L05781j6584c0053B73159b54248A67807d2808C65102
12248c6787A55293K89791a8359D2071J0094L9262c28864B19807a7287B238J04878
12237A07116h223p0793G2965N1202m7070d0547G9162h7862G6006l2027L42456
12226C86435j19992K6544q9754g8900D06121l6146L6770M5240A30572L72019r7817
12215D04774l6010K22558G5645O1781a11150B41817B1860L47094j54539J68887
12205C83302c6281D58363b893A83272G2717k2798J87638M40956B50855p5286O9736
$$ plain form
12284 75294 351642 -13214 231076 -195966 615207 7603 -53854 23303 243386 451950 55255
12272 271085 4097 -30204 33469 111250 77675 26151 -15967 -56103 -299947 356929 -91439
12260 315766 -8108 50147 34841 340622 324038 -30053 273159 -254248 167807 -42808 365102
12248 -36787 155293 445084 -18359 42071 52165 91427 -328864 219807 -17287 2238 107116
12237 107116 -8223 -79016 72965 124167 77097 -40547 79162 -87862 76006 43979 386435
12226 386435 266443 292987 203233 -78900 406121 369975 406745 451985 130572 502591 404774
12215 404774 368764 591322 75645 137426 -111150 241817 21860 368954 214415 383302
12205 383302 -36281 458363 -2893 183272 72717 49919 237557 678513 250855 175569 245305
12194B45305J4921m5045D3373J1052K69404o7560b3089B12718J95075A8364N51507
12183E69871k24111a09262A83107q2686Q4341L14476f8362P82A8723a5063B93943
12171A46382c0552H3422L43744A61475a224B4995P9180a59686D8232M2002h8582
12159A10886D9861J03209O4219C4855g789A80259c3587B35890K06081G138b02261
12147B33361J35330G4897O0665c6845B17917F7223J79155a9250j67628A88605
12136h0310j82068a20706m5052F974c97954A60743A5276c32792P3009i632B63434
12124A48163N0823a86708B21171H1327K26839D9818b41309I3932k9817a77995
12113B20962A3527c39397A52333a80821C10714a07462G5780b23940f3167j8924
$$ plain form
12194 245305 260226 215181 43373 54425 323829 256269 -23089 212718 407793 18364 569871
12183 569871 345760 -109262 183107 100421 184762 499238 -68362 -67580 18723 -15063 293943
12171 146382 -30552 83422 427166 161475 -1224 24995 104175 -159686 48232 90234 -88582
12159 110886 49861 153070 217289 34855 -7789 180259 -33587 235890 441971 7138 -202261
12147 233361 368691 74897 135562 -36845 217917 67223 246378 -19250 -186878 188605
12136 -80310 -262378 -120706 -165758 6974 -397954 160743 15276 -332792 -259783 -9632 263434
12124 148163 198986 -186708 221171 81327 308166 49818 -241309 93932 64115 -177995
12113 220962 13527 -339397 152333 -180821 310714 -107462 75780 -223940 -63167 -82091
12103h2091m5702d6632A02931a04155p933B13070a75465l0249d6794B2466J21548
12092A44014J13596A26899l2515D3489A2165f8872r3439B93648E5993a23557G9646
12080A04096j4612N24L24631M07424J130115n2450E78077l7749j24635A86421
12069A49142d8544F7803J22080o7698a63322B85135j37525B4211e38183A01803
12058e69501a27085A00638c64568b8010I9360K15748a47996k10986J48152b2275
12047a46365A49695A0909d53825C12942b5064B3314M5138b58126D48702A39375
12036e33179a61754A86575J00344P7605a052o1197r2923J6517N4058q202B1005
12024a0204A36762j9646E8145a72766M4369J8780p5902j1420c6308G5028Q1333
$$ plain form
12103 -82091 -127793 -46632 102931 -104155 -112088 213070 -175465 -205714 -46794 22466 144014
12092 144014 257610 126899 94384 43489 12165 -68872 -162311 293648 55993 -123557 79646
12080 104096 89484 90008 414639 822063 1952178 1899728 578077 540328 415693 186421
12069 149142 -48544 67803 189883 122185 -163322 285135 147610 24211 -538183 101803
12058 -569501 -127085 100638 -364568 -28010 99360 315108 -147996 -358982 -210830 -22275
12047 -146365 149695 10909 -453825 312942 -25064 23314 68452 -258126 448702 139375
12036 -533179 -161754 186575 286919 364524 -1052 -62249 -155172 -138655 -84597 -92799 21005
12024 -10204 136762 117116 58145 -172766 -128397 -109617 -185519 -196939 -36308 75028 156361
12013A56361i6321o0833m3350A20673P2654D8354l242K18064a29485k8446g402
12001a97196m382A10629b4231o3490m05729A85302D4663a02262r1702L2345I5390
11989B82147c8038q8997D17416a15578c2072C1276J5997F914a62144a9218k1189
11978d0407r5314A13187b60370D3168A662L13525c25459M7833c6556n7725l1634
11967a25915C30371m7974A14520b30321g6643B0445J2296H864P0636c1311j56701
11956a88012R3933l48708a88491P5921A2675M5589k5870Q7718b44886a5361j01
11945a5462F8823Q4442f9191A69994m2750J6017l2345m0475k1305a04006D04111
11933c6011o5957j79485C0219M1145a33447B42872r8285h6832i351I5070c10398
$$ plain form
12013 156361 -96321 -157154 -200504 120673 193327 48354 45112 263176 -129485 -157931 -7402
12001 -197196 -201578 110629 -24231 -87721 -493450 185302 44663 -102262 -193964 -161619 95390
11989 282147 -38038 -127035 417416 -115578 -32072 31276 47273 6914 -162144 -19218 -40407
11978 -40407 -135721 113187 -260370 43168 1662 315187 -325459 -277626 -36556 -94281 -125915
11967 -125915 330371 282397 114520 -230321 -76643 20445 32741 8864 79500 -31311 -188012
11956 -188012 -94079 -442787 -188491 -112570 12675 58264 32394 120112 -244886 -15361 -15462
11945 -15462 68823 153265 -69191 169994 127244 143261 110916 70441 49136 -104006 404111
11933 -36011 -101968 -281453 30219 71364 -133447 242872 144587 -86832 -9351 95070 -310398
11921a12953N289k4227b7136A96241k6313h2724l61671B15418m4938k1048i1705
11909G072J5936M8927a1424B17761i7354j18697A77644a89950j81886J34432D1278
11897B56852j25137k6521O7790k5148a59934k5403I1337B6050E072d5252j22845
11886a68097B79952c16168E7735g7162f087A71816B2300a15837B17541i6869L6581
11875f0288A83303b19517n3933J08439f0690B08296f7721D5201A1654J4042a47248
11863A71601a03518J6261A37273a94313K5883A25263b6428A43737c29475J24886
11853b04589A07221c19921a40114O1655o3436B73676e486j75606j96932h2741
11842a6581Q142I4658F629A592b47375P1765O1950k4188c2481A51192c3864j60105
$$ plain form
11921 -112953 -107664 -131891 -27136 196241 169928 -82724 -444395 215418 170480 149432 -91705
11909 7072 23008 71935 -11424 217761 -97354 -216051 177644 -189950 -371836 -237404 41278
11897 256852 131715 105194 172984 147836 -159934 -185337 91337 26050 5072 -45252 -168097
11886 -168097 279952 -316168 57735 -77162 -6087 171816 22300 -115837 217541 -96869 -60288
11875 -60288 183303 -219517 -273450 -165011 -60690 208296 -67721 45201 11654 25696 -147248
11863 171601 -103518 -87257 137273 -194313 -168430 125263 -26428 143737 -329475 -204589
11853 -204589 107221 -319921 -140114 -78459 -141895 273676 -5486 -181092 -378024 -82741
11842 -16581 -8439 94658 6629 1592 -247375 -175610 -113660 -137848 -32481 151192 -33864 -193969
11830a93969B94609o5608D2670a10391e2751j44303A7518K29529a49014A45209
11819F8578a5722m7842n8347K6188l6419J928c1255B19967g6221j18792p0077
11808b65090b2551C5105e5046p8780B05444c5238D1760b53981b986m0548A80335
11796c11758D35266E9069a05705j94826J01591E494P8925d856j01185B97851c0402
11784D58809c10749H3620a14360A24757b5815A12235G104c98887J06438B11570
11773c7134C8135J02250h2889j70667J02602A23326a31136a8863A62395b1634
11762b82741A76538b85624G8434c29456d3941H7528b4757k11813A27741A5886
11751a12518C9306M3234f2883A8325J55424J2635R7799n6239o7653n9326g4101
$$ plain form
11830 -193969 294609 229001 42670 -110391 -52751 -197054 17518 247047 -149014 145209
11819 68578 -15722 -63564 -121911 -95723 -132142 -130214 -31255 219967 -76221 -195013 -265090
11808 -265090 -22551 35105 -55046 -133826 205444 -35238 41760 -253981 -2986 -43534 180335
11796 -311758 435266 59069 -105705 -300531 -198940 5494 84419 -4856 -106041 297851 -30402
11784 458809 -310749 83620 -114360 124757 -25815 112235 7104 -398887 -292449 211570
11773 -37134 38135 140385 -82889 -253556 -150954 123326 -131136 -18863 162395 -21634
11762 -282741 176538 -285624 78434 -329456 -43941 87528 -24757 -236570 127741 15886
11751 -112518 39306 82540 -62883 18325 173749 186384 284183 227944 160291 100965 -74101
11739h9871n3530r9383B81351p1250B1420J96794e8089l3976J5057A30806D1096
11727h5311A75640h4039B18034a53613c383j30945j95795a9862A00551b0D2386
11715C16992H6875K84730i434j82784l4641n8836a35265B7456J11455e2805H8058
11703B09304B1577M5573P3071K23899A68799a20536B13185k8311C8795a42432
11692a91816C3549a18501A34351B0511Q6630e8901j4529j09093I6853a53079A30351
11680B48123H5750g164A87874a89819p3918A61363l1125R019o9579L32091a34608
11668I4035L06780e796r6079D6922N6434a62056O7840C2968K1473J84658a86238
11656A84462L6149b87154C15693D2682a05217k01581B16473a14033B13745k1228
$$ plain form
11739 -89871 -143401 -242784 281351 210101 21420 218214 -58089 -92065 -77008 130806 41096
11727 -85311 175640 -84039 218034 -153613 -3383 -134328 -330123 -19862 100551 -20 42386
11715 316992 86875 371605 -9434 -192218 -226859 -285695 -135265 27456 138911 -52805 88058
11703 209304 21577 67150 140221 364120 168799 -120536 213185 184874 38795 -142432
11692 -191816 33549 -118501 134351 20511 107141 -58901 -73430 -182523 96853 -153079 130351
11680 248123 85750 -7164 187874 -189819 -263737 161363 130238 139257 69678 401769 -134608
11668 94035 400815 -5796 -101875 46922 103356 -162056 -94216 32968 54441 239099 -186238
11656 184462 220611 -287154 315693 42682 -105217 -306798 216473 -114033 213745 192517
11646A92517M17692A45013H441K25143b95791F5993P353K97214H1323K38969a33990
11634a82945F4056J61559p0078k8870K12656H8752b21495g0618A58850J40634
11624B99484G5673b36915a8223B1492J07756c4409j861j48175B9988a04879N2090
11613e2789j46119j11898A28747L2002g261k29455e7578D2751b18277a3910j4791
11602b8701A58459J36711j23892J89976A77001q3013c13491m2303D3757a40650
11591I5741a12844a9677k32625A01404J97784e4003F3726b2058A9055K28017G207
11579c7637A07235a16081d003A47763N772a63329I3280K47266g1683C449K10035
11568B13484k4589b06324P2098B40940H1824e5192A76259R885b83568C1301a17432
$$ plain form
11646 192517 610209 145013 8441 233584 -295791 65993 73346 370560 81323 320292 -133990
11634 -182945 64056 225615 155537 126667 339323 88752 -221495 -70618 158850 299484
11624 299484 75673 -236915 -18223 21492 129248 -34409 -36270 -184445 29988 -104879 -52789
11613 -52789 -198908 -310806 128747 160749 -7261 -236716 -57578 42751 -218277 -13910 -28701
11602 -28701 158459 295170 171278 361254 177001 93988 -313491 -355794 43757 -140650
11591 95741 -112844 -19677 -252302 101404 299188 -54003 63726 -22058 19055 247072 7207
11579 -37637 107235 -116081 -4003 147763 153535 -163329 93280 340546 -71683 3449 213484
11568 213484 188895 -206324 -134226 240940 81824 -55192 176259 186144 -283568 31301 -117432
11556f6460m3857F0576K6668g9931B02412a49663A439e1561G6094A3619f1134
11544a348I8748L4121B3857b31035A84383K6532b44027C14125A22503c9468l6510
11533g5978B42253m9513a76388N4080D6786J9088K03781a42005f8794I9576a77698
11521i5637j9294D0634O7981Q0434c0729I1556I926K33124d900C85171F290d2357
11508b9232B9867b3133A87565a18635A25606d7368J7843C26612A04303J53740
11498B58043B5515J58365J71190M0985k920e2809a623B54969A18711J74475c37845
11486g3859B36900q5956J58078J1605j30251a5713H9778L710J90119L9132J05386
11475D28125A80648J3648n4180k6277m4230L04208A44933k7962M0329p5201N0233
$$ plain form
11556 -66460 -110317 60576 87244 -79931 202412 -149663 1439 -51561 76094 13619 -61134
11544 -1348 98748 132869 23857 -231035 184383 210915 -244027 314125 122503 -39468 -75978
11533 -75978 242253 192740 -176388 -122308 46786 65874 269655 -142005 -68794 99576 -177698
11521 -95637 -114931 40634 108615 189049 -30729 91556 9926 243050 -4900 385171 6290 -42357
11508 -29232 29867 -23133 187565 -118635 125606 -47368 -29525 326612 104303 258043
11498 258043 25515 183880 355070 396055 393135 -52809 -1623 254969 118711 293186 -337845
11486 -73859 236900 150944 309022 320627 190376 -15713 89778 93488 283607 322739 428125
11475 428125 180648 194296 140116 113839 69609 373817 144933 116971 157300 82099 132332
11464A32332m1619c5832A86814J62816a68309C08084n17M1197a25927H0518C1399
11452a0094A13583Q2903C2972K32751a1965D1931d2881r8421A59181F564J44498
11441A51062Q8567a00698B94465A21097A9423M05278a42039B47687H29b51326
11430a24248B49883A04588b34113j26202E5326K81340D2850a27747A85455p268
11420A78187H6148Q6072k5139l6273g9716B60573c86314i618A81490p3463b044
11408A05992L3695a22316l09826A5312B391N1327K47919a40868G7623D905g920
11396b8086B92038e3266D6539K7238a96827B09971b00485A28369a07502C4596
11385A42602c40233c5275I9179P741J50745b30490C42432a14022B12016C0728
$$ plain form
11464 132332 90713 -35832 186814 349630 -168309 308084 307567 348764 -125927 80518 31399
11452 -10094 113583 196486 32972 265723 -11965 41931 -42881 -141302 159181 6564 151062
11441 151062 239629 -100698 294465 121097 19423 424701 -142039 247687 829 -251326
11430 -124248 249883 104588 -234113 -360315 55326 336666 42850 -127747 185455 178187
11420 178187 86148 172220 147081 110808 -79716 260573 -386314 -9618 181490 108027 -2044
11408 105992 139687 -122316 -432142 15312 2391 53718 301637 -140868 77623 4905 -7920
11396 -28086 292038 -53266 46539 73777 -196827 209971 -200485 128369 -107502 34596
11385 142602 -340233 -35275 99179 106920 257665 -230490 342432 -114022 212016 30728
11374D3521K26577h8829A65713c662E1345J4583k7478L1399e9381j49B39468e29534
11361A82050b07258i2699B46739A8534Q5144K51878G7367k9609b22960B75724
11350h9500b9789A64120b00532A57083i2722p1197g5506B2552d9220A29481D2690
11338a93633n7694B8990j1370i888F8883A3860J89365h280D99324b51714I8349
11326d36244a30743A33880b27738l0181F264h7550B75613g9053j31743L4794f5369
11314b9000I3335b3237B41239q3853c54603C9646J03616a86513K0528g9744B91723
11302a764j9287C22981j28804K50377A00024b64812C41281e1567j26540j7091
11292a95198j12089J22357B55393a18827A61191G8036N564a58859a3038n1919
$$ plain form
11374 43521 270098 -88829 165713 -3662 51345 65928 38450 69849 -59381 -59530 239468 -529534
11361 182050 -207258 -92699 246739 18534 103678 355556 77367 47758 -222960 275724
11350 -89500 -29789 164120 -200532 157083 -92722 -163919 -75506 22552 -49220 129481 42690
11338 -193633 -251327 28990 17620 -9888 68883 13860 203225 -8280 499324 -251714 98349
11326 -436244 -130743 133880 -227738 -257919 6264 -87550 275613 -79053 -210796 -176002 -65369
11314 -29000 93335 -23237 241239 157386 -354603 39646 143262 -186513 -165985 -79744 291723
11302 -1764 -21051 322981 194177 444554 100024 -264812 341281 -51567 -178107 -195198
11292 -195198 -307287 -184930 255393 -118827 161191 78036 83600 -158859 -13038 -64957
11282f4957A98457c2873j11875b030k40921C8559O3924h6519g766B5352c55564
11270i8438A64991g6066p1804g3273j44971f4928m86181H3162b8241o698j46262
11259a81201O4542A9648J04118m4728l2790f3789H2169K4392K0147i9200K9879
11248f9321K1335j7358k62784D77675D451K46408R8394o7463A9130K96838b39424
11236a68435I113B786K5339J04444a19000A47708a11857A26247K6554Q5913f0500
11224h9446n5971j78634m3151c0348j34887j04635A48828b27687L2372L7524C4280
11212c24228a44807A7876h8973C78239A691e4463K4747p4675C9664J45461a45056
11200a6209G0382b89726C02053b4885B77257a02815A93952Q57a72219D9070J58823
$$ plain form
11282 -64957 198457 -32873 -144748 -2030 -242951 38559 102483 -86519 -7766 25352 -355564
11270 -98438 164991 -76066 -147870 -73273 -218244 -64928 -551109 83162 -28241 -34939 -181201
11259 -181201 -116659 19648 123766 79038 46248 -63789 82169 106561 126708 -99200 -69321
11248 -69321 -47986 -65344 -328128 477675 4451 250859 349253 281790 19130 315968 -239424
11236 -168435 9113 2786 28125 132569 -119000 147708 -111857 126247 152801 238714 -60500
11224 -89446 -145417 -324051 -367202 -30348 -165235 -269870 148828 -227687 -195315 -157791 34280
11212 -324228 -144807 17876 -88973 378239 1691 -54463 -29716 -104391 39664 185125 -145056
11200 -16209 70382 -289726 302053 -24885 277257 -102815 193952 194809 -172219 49070 207893
11189B07893O0882j26595c33184J8916j12135a51653D62044a22833l56182L3698
11179d45317D6124c8259A09832l8172b65827j14878J48532A33452b51407G7949
11168c49047Q2954g8931B45553a25019b4452A61138b14547J05340k45729h5727
11157f7342A9188a01771K6000A42703O3072c80368A8622i0535B16315n2472l9609
11146A24234N830b16170A75966m1174a98525K0146D2614c61572h921j73265A40693
11134A93917o4454K0559J04224r7862o0179C5786O9984g4000k325A59549E6832
11122h1214H7601C8631K2709A0622a51631M0006j09161A20332a61121c717q4090
11111h7807A35687a7524A56463k6183D4157O03133A85825N978m5782P0295Q6227
$$ plain form
11189 207893 268775 142180 -333184 -314268 -426403 -151653 462044 -122833 -479015 -445317
11179 -445317 46124 -38259 109832 71660 -265827 -380705 -232173 133452 -251407 77949
11168 -349047 -266093 -78931 245553 -125019 -24452 161138 -214547 -109207 -354936 -85727
11157 -67342 19188 -101771 -75771 142703 205775 -380368 18622 -90535 216315 163843 124234
11146 124234 130064 -216170 175966 134792 -198525 -178379 42614 -361572 -8921 -182186 140693
11134 193917 129463 150022 254246 156384 96205 35786 105770 -74000 -76325 159549 56832
11122 -81214 87601 38631 61340 10622 -151631 -111625 -220786 120332 -161121 -3717 -87807
11111 -87807 135687 -17524 156463 130280 44157 647290 185825 191803 146021 216316 302543
11100C02543M5402j47269o5844h8502E09980i335D08899A77950b80442J07581
11090a72861D11831j68353J00619A01319J09614p9456a31536D25696H4631C1527
11079h8948B14225J4105L1213o3542n4916C5157J8260J89617N7220b28480I7560
11067F19616A73065M0430P1789L2966J86013j28162L56690H5602L55905K7413
11057D68920K2002J55111L04695N4314D15250L0596R254L88477l98241L13912
11047G59248l30167J75846k6551J16607K6510k49206N7588L23058k55739l9950
11037E57244K15151Q3527C44172J77035K90922o0806k07863M05568D54848M94212
11027I49060j76268j22298r9054M00752n9073k96490J97503O3581q7614C08039
$$ plain form
11100 302543 347945 200676 134832 -88502 509980 -9335 408899 177950 -280442 -172861
11090 -172861 411831 243478 344097 101319 210933 131477 -131536 425696 84631 31527
11079 -88948 214225 228330 259543 196001 141085 35157 53417 243034 300254 -228480 97560
11067 619616 173065 213495 285284 318250 504263 376101 732791 85602 441507 468920
11057 468920 490922 646033 950728 1005042 415250 445846 455100 843577 445336 759248
11047 759248 429081 604927 578376 694983 721493 472287 529875 852933 597194 557244
11037 557244 772395 855922 344172 521207 812129 751323 543460 949028 454848 949060
11027 949060 772792 650494 551440 952192 893119 596629 794132 857713 770099 308039
11016E95904j63744L10404j65015J89298j8870k58207M9752K47411j82483j62816
11006D41634L20318j33266m3746J08912N7573C46127N03071p9012j1494j79441
10996E79251k8979j85312J24529K40788K80126k880k59976J29844l1405j30417
10986G15569L51394k82009N56721l74624L7900J41376N6127r3065L52617K12816
10976A674822N1415N01898J61624P95712l07154K2489l88894j50376j55657k17403
10966A988476J44373m38755j90971R6112R8398j46402O6761p1249J16195K69054
10956A931992j65084j55477q6569j1509n04383m5721p7769l36135k8302O4834
10946E85877A76177L06732j86930j03578H1067L39848j25927M9193I4790M3541
$$ plain form
11016 595904 432160 742564 577549 766847 747977 489770 539522 786933 604450 441634
11006 441634 761952 628686 584940 693852 751425 346127 849198 770186 758692 579251
10996 579251 550272 364960 489489 730277 1010403 1007523 747547 877391 845986 715569
10986 715569 1066963 784954 1341675 967051 1004951 1146327 1202454 1109389 1462006 1674822
10976 1674822 1726237 2228135 2389759 3185471 2878317 2900806 2511912 2361536 2205879 1988476
10966 1988476 2132849 1694094 1503123 1599235 1697633 1551231 1617992 1546743 1662938 1931992
10956 1931992 1766908 1611431 1524862 1513353 1008970 963249 885480 549345 521043 585877
10946 585877 176177 482909 295979 192401 81067 420915 294988 344181 94790 138331
10936A38331J91013a03144D00276e5856k99342g6340j1100k4346A43262l1518
10926A11744m2942J27562N945D770b0946r9838j36337B25813l7723d829B95838
10914b40586C74440B4417o199L1982j0378h7787q2763I3392e1269A56584b38252
10902b93364a34861F0371K40571d1019A59142B4888i2945I5614a52786d2624k95986
10891c38610n9501c3138j01287j1049c9979o9755A19506l0439J6452a78929F0295
10879a0651j27272r9086B30200a00699k68972C07751C4154a09264A15682a45839
10868b84993B20021I2346J40801d1332l4490D6047b4209j24410k1368J9461n7429
10857b07955A9645F984c1100j73544H6785b25573b7571o871A22220J2041a8669
$$ plain form
10936 138331 329344 -103144 400276 -55856 -355198 -76340 -87440 -111786 143262 111744
10926 111744 68802 196364 202309 4770 -20946 -120784 -257121 225813 188090 -4829 295838
10914 -240586 374440 24417 18218 50200 39822 -87787 -170550 93392 -51269 156584 -238252
10902 -293364 -134861 60371 300942 -41019 159142 24888 -92945 95614 -152786 -42624 -338610
10891 -338610 -398111 -33138 -134425 -145474 -39979 -109734 119506 89067 105519 -178929 60295
10879 -10651 -137923 -237009 230200 -100699 -369671 307751 34154 -109264 115682 -145839
10868 -284993 220021 92346 233147 -41332 -75822 46047 -24209 -148619 -169987 -150526 -207955
10857 -207955 19645 6984 -31100 -204644 86785 -225573 -27571 -34442 122220 134261 -18669
10845A23099J6426a25203k4503A50228b88650B18400p4500e37285b7964D4249
10834F7541b12520C8194a29255C5008A3371J45768a07914c138B10737E2167c09494
10822c03060B30900f8937q8073G2807b49825c3705j4827k09913C19307d0599l42374
10811c82973a5263B70021b14996l5661k30059G4682C374f5416j49759k58688C9209
10799C73874a94656q2219J23410d9896B37365I3167M9698a7982k23489a19656
10788a01230b4327A920b94514H6440b14109A90683N4891p6919b926m8359C2929
10776b13294B3080J92324a30605b9020F43R1861J0874K33259j18029c78653J61895
10765b16758A37259b06841A56228H133J29547b39008R555C2245M7527r491I046
$$ plain form
10845 123099 139525 -125203 -149706 150228 -288650 218400 143900 -537285 -27964 44249
10834 67541 -212520 38194 -129255 35008 13371 159139 -107914 -3138 210737 52167 -309494
10822 -303060 230900 -68937 -157010 72807 -249825 -33705 -48532 -258445 319307 -40599 -382973
10811 -382973 -15263 270021 -214996 -250657 -480716 74682 3374 -65416 -215175 -473863 39209
10799 373874 -194656 -276875 -153465 -49896 237365 93167 142865 -17982 -241471 -119656
10788 -101230 -24327 1920 -294514 86440 -214109 190683 245574 168655 -2926 -51285 32929
10776 -213294 23080 215404 -130605 -29020 643 92504 103378 336637 218608 -378653 -216758
10765 -216758 137259 -206841 156228 8133 137680 -239008 -229453 32245 79772 70281 9046
10753b32659I7181J07430a97053b5164B25190a67810J359j59675G5187a43702
10742C72305I2035a91102J246N8767c0910j81960e9591k47664N124A93310l0433
10731A62877b1261A57923d4312j01188j14979i5462p3938B18687f8770A21485
10720d7815n9241F454d4155C425j133J72233b39752c6143A58282b4000m4736G0870
10707a09087E9910a37021A49914a71251B20422K1712a65592N410e9605H0819A5600
10695b37656A92641a55967E4793K18344a08028e0704k9744k6065A52620c6209
10684e0710j66044p66d1913A21029C5398J64417b87523J19226p8334a12005M9222
10673f2783q418B08749c0085C3006K3016M16162E4394I406J53773N132C9141a70021
$$ plain form
10753 -232659 97181 204611 -197053 -25164 225190 -167810 -166451 -326126 75187 -143702
10742 372305 92035 -191102 -189856 -131089 -30910 -212870 -59591 -307255 -302131 193310 162877
10731 162877 -21261 157923 -44312 -145500 -260479 -95462 -169400 218687 -68770 121485
10720 -47815 -107056 6454 -44155 3425 2292 174525 -239752 -36143 158282 -24000 -68736 70870
10707 -109087 59910 -137021 149914 -171251 220422 242134 -165592 -160182 -59605 80819 15600
10695 -237656 192641 -155967 54793 273137 -108028 -50704 -80448 -106513 152620 -36209
10684 -50710 -216754 -217520 -41913 121029 35398 199815 -287523 -168297 -246631 -112005 -62783
10673 -62783 -71201 208749 -30085 33006 56022 472184 54394 9406 163179 168311 39141 -170021
10660B51137r7557a08658C31592h259k63796L81f4604j37514e0944B41657C1151
10648b03680l9340m1235H6909a48901k76021A33758J7798E4483b22284R3343K7700
10637a01241B36561a03081H4522K69529a10996A58912i5297A6954a51275N3002
10627i8273M6979C04162c22005k02520h6462l22624G832b96091e9347I1001d01315
10615D4875a53216B37486l3524d508C1000i0323A94415n9827B9311e4487E1311
10603b8468l45539g1954b7088o4350n0422j10530A82032l1956a36906q8413B85468
10591H211a58100a9382A59861P0022c83948J07299q7170A0094K63303j17409b1866
10579a54727N917o5041l2736G4446L2473K455c24301E9937J51953k3446a51131
$$ plain form
10660 251137 153580 -108658 331592 -8259 -272055 -271674 -64604 -202118 -50944 241657 31151
10648 -203680 -243020 -284255 86909 -148901 -424922 133758 151556 54483 -222284 -128941 -101241
10637 -101241 236561 -103081 84522 354051 -110996 158912 -95297 16954 -151275 -98273
10627 -98273 -51294 304162 -322005 -524525 -86462 -409086 7832 -296091 -59347 91001 -401315
10615 44875 -153216 237486 203962 -4508 31000 -90323 194415 134588 29311 -54487 51311
10603 -28468 -374007 -71954 -27088 -91438 -141860 -252390 182032 150076 -136906 -225319 285468
10591 8211 -158100 -19382 159861 229883 -383948 -276649 -363819 10094 273397 155988 -21866
10579 -154727 -148810 -213851 -246587 74446 106919 109374 -324301 59937 211890 188444 -151131
10567A31769b85510D2087a35808I0954a73171B2219d77610D9800c53838J16170
10557b37668f4748b0148B16712f7132j59445N209A64975a99858d3952k5205B26896
10545A26130J0152b7158C15272A9578L59687b30605J07108N2902K6982F9917b28425
10533a24375F2258g1535B37782b63273r2989a65849j59909m8925J45876H1179
10522b11084j83627a48221l95115C5742a65834k66977D1325b2247k392j75277
10512a99916G7974J29162a34872l120G0064h9077R650C16449b07732B36735h4709
10500H5215a19229L0668C3033a21551K2246A87225c07878j1353a30342J1815A30408
10488b3335E35325k54666b53420J26343B00747K04992r6159M2302j2952A62531
$$ plain form
10567 131769 -285510 42087 -135808 90954 -173171 22219 -477610 49800 -353838 -237668
10557 -237668 -64748 -20148 216712 -67132 -226577 -221368 164975 -199858 -43952 -69157 226896
10545 126130 136282 -27158 315272 19578 379265 -230605 -123497 -70595 -43613 69917 -228425
10533 -124375 62258 -71535 237782 -263273 -356262 -165849 -325758 -374683 -228807 81179
10522 -211084 -394711 -148221 -543336 35742 -165834 -432811 41325 -22247 -24639 -199916
10512 -199916 77974 207136 -134872 -137992 70064 -89077 -79427 316449 -207732 236735 -84709
10500 85215 -119229 -88561 33033 -121551 -99305 187225 -307878 -319231 -130342 -118527 130408
10488 -23335 535325 280659 -253420 -127077 200747 405739 309580 351882 338930 162531
10477B45303L4866E9734j6108a21985N2820B2266b23692D5340M6R8263a66992
10465D1264J76244b0284B83482b4571j25473R722j33162P8335A47813c03454A73841
10453H3638J57987a41643p3440J01990G8662k3637K87576b7676j92997J8814P7833
10442a24026B753L36161b03605F1497l0615a08562e1756C20472r6229R7636j09921
10431B11958C0191D859c10252F3648a0351k7217G6274a27630o0161b8862A93231
10419b6238l9195k44898F229a0382G997b08469h3021L6618k70632C16586c02372
10407b0415A64290b8076c741j35876J4458K8128r1835A44918b14263A60N7837
10396E7997K0002l1440d52100B48840B7200a1587B42028B9933K21547A24837f2686
$$ plain form
10477 245303 280169 59734 43626 -121985 -69165 22266 -223692 45340 45386 143649 -166992
10465 41264 217508 -20284 283482 -24571 -150044 -140322 -273484 -195149 147813 -303454 173841
10453 83638 241625 -141643 -215083 -113093 78662 55025 342601 -27676 -220673 -201859 -124026
10442 -124026 2753 338914 -203605 61497 30882 -108562 -51756 320472 224243 321879 211958
10431 211958 30191 4859 -310252 63648 -10351 -37568 76274 -127630 -187791 -28862 193231
10419 -26238 -65433 -310331 6229 -10382 7997 -208469 -83021 -46403 -317035 316586 -302372
10407 -20415 164290 -28076 -3741 -139617 -125159 -97031 -188866 144918 -214263 160 57997
10396 57997 77999 46559 -452100 248840 27200 -11587 242028 29933 251480 124837 -62686
10384B08509N7759C282K46208e1570A27709n3650a0419B22590J46760A33985k9288
10373A04697K77109G6408K49859R9292J24182E6096J71143L64469k29842J8205
10363C80071i8653B62544D94L40808k6393I7310P6360K03521J09843A69464i48
10351a46215F75711A42390J46808K34233r0591j73068j02146L39175K618K7969
10341E27388A22065K68711A73489a43661E05049k05857A25032K20504A06886B1370
10330A37800R9059b4621B42024a27185E2033e7738B28081H5714L3438K41121A22394
10318e8412I4832Q9250m5346J19827o3558I0480B4201K59422E4805a02316A38695
10306c38990B25349c573p7586J8457n6297A00288j2789j2883J49996g7267j07485
$$ plain form
10384 208509 266268 3282 249490 -51570 127709 74059 -10419 222590 369350 133985 104697
10373 104697 381806 76408 326267 425559 549741 56096 227239 591708 361866 380071
10363 380071 -98653 262544 494 341302 314909 97310 173670 377191 487034 169464 -948
10351 -146215 675711 142390 289198 523431 432840 259772 157626 496801 499419 527388
10341 527388 122065 390776 173489 -143661 505049 299192 125032 345536 106886 21370
10330 137800 236859 -24621 242024 -127185 52033 -57738 228081 85714 119152 360273 122394
10318 -58412 94832 184082 138736 258563 195005 90480 24201 283623 54805 -102316 138695
10306 -338990 225349 -3573 -81159 -62702 -118999 100288 87499 74616 224612 -77267 -184752
10295a84752B39401j18931a28343A51303f158H7868b24276C1699O4380I436J05709
10284A15145d00197c4582j17268B92755J05440a56629A337J49092h5145k7225
10274a12370a2025k48601A85205E220b93598E2475B3643b09102B01691a0810B95583
10262A66772a853A74755E0987P6614K66018j52143A6407K05704O8577A03321a60389
10250c35418A67526M3126O485b82780J31153b687A0455b03849A23516a34943B91541
10238g5541A33967b9361B216O7146a57122j9923C7499a39570l8925F052K9939
10227C5991a41417o3976j29369Q9360a08182r6898f1834b899A64510a03290M5218
10216e8072l68052B19827H1365a93230j7372G7914A1530J16846E9442d761B51841
$$ plain form
10295 -184752 239401 120470 -128343 151303 -6158 87868 -224276 31699 96079 9436 115145
10284 115145 -400197 -34582 -151850 292755 398195 -156629 1337 150429 -85145 -112370
10274 -112370 -12025 -260626 185205 5220 -293598 52475 23643 -209102 201691 -10810 295583
10262 166772 -1853 174755 50987 127601 393619 241476 16407 222111 290688 103321 -160389
10250 -335418 167526 210652 217137 -282780 -151627 -2687 10455 -203849 123516 -134943 291541
10238 -75541 133967 -29361 2216 69362 -157122 -177045 37499 -139570 -178495 6052 35991
10227 35991 -141417 -205393 -334762 -245402 -108182 -205080 -61834 -2899 164510 -103290 -58072
10216 -58072 -426124 219827 81365 -193230 -210602 77914 11530 128376 59442 -4761 251841
10204B57682q3134d66047a18441I9151b80622A05589a10470M1906n1710r3015
10194b13289A58367i084l33825J60289A35424L38727B01982P8040b75226C37922
10183D2255c23912I5705L9552i9084q4385e3237n9103A5938a95138C3057J2083
10172D5140R8039c11175k0823A0175a32094M1703B2795a78319A40067F5951a68820
10160A43399a17215l0864E6542d488l8875l92548A08508b9433H5906b31857i8677
10148C9264j5031K80340q1960c3586j89470k37640c9729J1952r6825k332M3925
10137h3009m36824d8124B0271a73511C60864j68311I860e3194l7088C7674J11612
10126A49286b32794j2403a10214r9560j118O4965m8307j72728A21006J01855a07785
$$ plain form
10204 257682 174548 -466047 -118441 99151 -280622 105589 -110470 -68564 -120274 -213289
10194 -213289 158367 -9084 -342909 -182620 135424 474151 201982 280022 -275226 337922
10183 42255 -323912 95705 135257 -99084 -183469 -53237 -112340 15938 -195138 33057 45140
10172 45140 143179 -311175 -331998 10175 -132094 -90391 22795 -178319 140067 65951 -168820
10160 143399 -117215 -148079 56542 -4488 -43363 -435911 108508 -29433 85906 -231857 -98677
10148 39264 24233 304573 222613 -33586 -223056 -460696 -39729 -27777 -124602 -126934 -83009
10137 -83009 -519833 -48124 20271 -173511 360864 192553 9860 -53194 -90282 37674 149286
10126 149286 -232794 -245197 -110214 -209774 -210892 -145927 -194234 -366962 121006 222861 -107785
10114a47663m4475k28061I402a03632B0970J90098b76956A81866a13675H7472
10103B99551G7361k5445J15396l4047J958b81538J08093j13816Q3387r8321A37746
10091a89734G9627b09591P482F2006c87246H6426l8787a7369B11980G2174i8675
10079D1857c5497a4792G0737e1102A37057d11182f8831B34098b22064q7439A8691
10067a86315G8976k4875C695J38398a61828I4782b75312G615J12682b71163D1579
10055A50569b1789C7409a20146j34717A13545i6079o6970A75494a95993h4549
10044C006d8028j37250N5710A729f3313k15965A34784l9065N2177C5470d4853
10032a03450D3025j457N1345a85130F0950J40185l2580p8377f7978H4407j528
$$ plain form
10114 -147663 -192138 -420199 9402 -103632 20970 211068 -276956 181866 -113675 87472
10103 299551 77361 51916 167312 133265 135223 -281538 -173445 -287261 -203874 -302195 137746
10091 -189734 79627 -209591 -202109 62006 -387246 86426 47639 -17369 211980 72174 -98675
10079 41857 -35497 -14792 70737 -51102 137057 -411182 -68831 234098 -222064 -309503 18691
10067 -186315 78976 54101 3695 142093 -161828 94782 -275312 7615 120297 -271163 41579
10055 150569 -21789 37409 -120146 -254863 113545 -96079 -163049 175494 -195993 -84549
10044 3006 -48028 -185278 -129568 1729 -63313 -279278 134784 95719 147896 35470 -44853
10032 -103450 43025 41568 92913 -185130 60950 201135 168555 90178 -67978 84407 82879
10021H2879d029k36617o835j11555a62350j7093a4326D8263O811a30891F7111
10009d0421B06278a61912A8902J81366a44207e9021j63845A8438J33770e0508
9998c30321a60816N2881o3475m4377N5719N2798l76395J11526f1797k77251a31251
9986a20969m4066j11686j53544a33788q7937C59228A3750N353a7548A15114c47860
9974a03692r5579P3408o7315k11629a17624k70182g0999j78343a6640j15743K7188
9963a05195e2453j83721F666d4057j75617F2934B4596a72047e9411B12414a53411
9951c1569A58569o683K1740d8047k58216A646d531A66116b18788G2547A7227K72841
9939B90068A7145K17468c32440D2579a97475M3326k94I990c6793A88788A4453
$$ plain form
10021 82879 -4029 -240646 -247481 -359036 -162350 -179443 -14326 48263 55074 -130891 67111
10009 -40421 206278 -161912 18902 200268 -144207 -59021 -222866 18438 152208 -50508
9998 -330321 -160816 -107935 -171410 -215787 -160068 -107270 -483665 -372139 -61797 -339048 -131251
9986 -120969 -165035 -276721 -430265 -133788 -221725 359228 13750 19103 -17548 115114 -347860
9974 -103692 -199271 -125863 -193178 -404807 -117624 -387806 -70999 -249342 -16640 -132383 -105195
9963 -105195 -52453 -236174 6666 -44057 -219674 62934 24596 -172047 -59411 212414 -153411
9951 -31569 158569 151886 173626 -48047 -306263 1646 -4531 166116 -218788 72547 17227 290068
9939 290068 17145 234613 -332440 42579 -197475 -154149 -154443 9990 -36793 188788 14453
9927b5430j24392k13002b2790a0990j3067I188e2863E1314c0092j47194n9520
9916b36806a991D0365e6888B78527B0824h7433E5766c79709J65599h6055o1658
9905a47713c6700m64111J00595e1538k9547m9976A33629o4538c97061J97080j71373
9894c71354L4449H2499i1125l02308i9610k34920F0663N2596b18918B8341K58992
9883B87333J3049j35356e3687o3690A13359e7540A52336Q9846E3512a14097j5332
9872a29429n2460P9432M1518m2445A76054H1703d5877B5582a9467B0999P1284
9861I2283e6611A27701R318N8945I7102B3186c77481A88574J0441g6426j90006
9850b66432G9667b36707H3414g3950k48324N9600l2667R7405e6278K1717p7287
$$ plain form
9927 -25430 -149822 -362824 -22790 -10990 -24057 9188 -52863 51314 -30092 -177286 -236806
9916 -236806 -1991 40365 -56888 278527 20824 -87433 55766 -379709 -214110 -86055 -147713
9905 -147713 -36700 -500811 -400216 -51538 -81085 -131061 133629 69091 -397061 -199981 -371354
9894 -371354 -336905 82499 -91125 -393433 -99610 -334530 60663 113259 -218918 28341 287333
9883 287333 300382 165026 -53687 -117377 113359 -57540 152336 242182 53512 -114097 -129429
9872 -129429 -181889 -102457 -60939 -103384 176054 81703 -45877 25582 -19467 20999 92283
9861 92283 -56611 127701 137019 195964 97102 23186 -377481 188574 199015 -76426 -266432
9850 -266432 79667 -236707 83414 -73950 -322274 -262674 -295341 -197936 -56278 -34561 -111848
9839a11848k2148A68482c6343k68014d5932A24058b47703J15120n2566p0798k12027
9828d67974K25790a10775j55499B03153a85673m6898E8618k252k568a75261l5523
9817b10784c5247p4447j16104K1293C04356a22306c6913A62334h3035o2498j68633
9806c14166C841g7883J6215j36657Q2624j07360J07896B54072a82191k22920f7938
9794i1913j39908H7295r184E400c08804A54416c43498A27097c07166h6673L8044
9783d8629A25711a59777G3588a21046q5260n7605Q6112e4966k02338j53787A6210
9771i5434j67968A73624g3217n6336m7115g5122C5675f4969J002C12462A4265
9759A00457k0915a64506k13205b5147j55040h4091D6895a8956p1918j91288A22560
$$ plain form
9839 -111848 -133996 168482 -36343 -304357 -45932 124058 -247703 -132583 -185149 -255947 -467974
9828 -467974 -242184 -110775 -266274 203153 -185673 -232571 58618 56366 53798 -175261 -210784
9817 -210784 -35247 -109694 -225798 -204505 304356 -122306 -36913 162334 -83035 -145533 -314166
9806 -314166 3841 -77883 -61668 -198325 -115701 -223061 -115165 254072 -182191 -405111 -67938
9794 -91913 -231821 87295 78111 5400 -308804 154416 -343498 127097 -307166 -86673 -48629
9783 -48629 125711 -159777 73588 -121046 -206306 -263911 -177799 -54966 -257304 -411091 16210
9771 -95434 -263402 173624 -73217 -129553 -176668 -75122 35675 -64969 -63967 312462 14265
9759 100457 79542 -164506 -377711 -25147 -180187 -84091 46895 -18956 -90874 -282162 122560
9747H7902L62908k11725b82233J23802g6965A03165l6665h7700d254I081h5238
9735e4478j88540H6003B0571J41438a26087n5045j33960H5319a91468e9232E5556
9723c18043R2365C6758b06410A75936J0759a51346k392M4727j07763E4398b68160
9711e88934G8251B6316d44924a05913F1553L6983m1884O4706a73633B13675D4545
9699E800b46670I3692a81650A46235Q855p6041d17092a24607b1570l46314a60423
9687c04851E0436J34189e5454F4877J00717a46360K0856j00662a4678l08322a30305
9675A08465b52551B3411a00698j24144h3855A87010k8223d0277j38220A19562
9664G7272L20487g5780k22513D4651d49814a76950j40866A04447c14664D7427
$$ plain form
9747 87902 450810 239085 -282233 -158431 -76965 103165 66500 -87700 -4254 9081 -85238
9735 -54478 -243018 86003 20571 162009 -126087 -181132 -315092 85319 -191468 -59232 55556
9723 -318043 -225678 36758 -206410 175936 186695 -151346 -153738 -109011 -216774 54398 -268160
9711 -588934 78251 26316 -444924 -105913 61553 98536 56652 121358 -173633 213675 44545
9699 5800 -246670 93692 -181650 146235 155090 79049 -417092 -124607 -21570 -367884 -160423
9687 -304851 50436 184625 -55454 64877 165594 -146360 -125504 -226166 -14678 -323000 -130305
9675 108465 -252551 23411 -100698 -224842 -83855 187010 158787 -40277 -178497 119562
9664 77272 397759 -75780 -298293 44651 -449814 -176950 -317816 104447 -314664 47427
9653f2906n8022J8315A9133c60544i0953A05960J95157a5577A68052D7218K7603
9642G4821R2478b20357N6218G3563b8710m5791o4472e4646m49130A50821n4113
9631I6708a83917d3532j24122P4073C7161m509M0652c55264C9599i0387E7494
9619b30451e2597j24654r8123J04843f9234D5742a85660A27007Q6352a06688p5660
9608a82348b0998k99770P5763h1146B05849a60395H5382h7696l80643B6918L6597
9597F3515g7406l41777h4467C00445b13788B44961c17843A3447a40947E3078b63834
9585A8770a41624r9692A26767m1457a75385P1921j06830P4616c6906B47823a33525
9573a52469f1440A8744f8058C16548a68264j8037h5023m5550a3039j85269o9506
$$ plain form
9653 -62906 -120928 -102613 19133 -360544 -90953 105960 301117 -15577 168052 47218 74821
9642 74821 167299 -220357 -164139 73563 -28710 -74501 -138973 -54646 -503776 150821 96708
9631 96708 -183917 -43532 -167654 -93581 37161 32652 73304 -355264 39599 -90387 57494
9619 -230451 -52597 -177251 -275374 -170531 -69234 45742 -185660 127007 213359 -106688 -182348
9608 -182348 -20998 -320768 -245005 -81146 205849 -160395 85382 -87696 -468339 26918 63515
9597 63515 -77406 -419183 -84467 300445 -213788 244961 -317843 13447 -140947 53078 -263834
9585 18770 -141624 -241316 126767 85310 -175385 -103464 -210294 -135678 -36906 247823 -133525
9573 -152469 -61440 18744 -68058 316548 -168264 -186301 -85023 -130573 -13039 -198308 -267814
9562b67814i7456K6748p6402K156J9484k78359B91793A10130M20705d95169D7410
9550c51012k6162c9792j3679b404j53224j0612N0761E4271a95631n3254i5401
9538C2924e6343a6500A24883P8031a19729R345C79Q4028h1456k3549B66243c60033
9525a16320n5519c7601r1084h88l15356c8204A53535C9183d46192Q5266A58039
9513a76602a4828j79870J9144A28164d8613B2090L30299c1825q7059k7252b4313
9501a61957A97896d663j01354F6401a13705A58047f266n6003k0880L0342q6226
9490a39033m8385J1410A67503G6437d90272a63124h0920j31795n377D09012B0895
9478a66208j36282K9115B579b34246A89058B0463c53644D9014A8598f3817e385
$$ plain form
9562 -267814 -97456 -70708 -147110 -144954 -125470 -403829 291793 110130 530835 -495169 47410
9550 -351012 -377174 -39792 -53471 -2404 -155628 -166240 -115479 54271 -195631 -248885 -95401
9538 32924 -56343 -16500 124883 202914 -119729 -110384 379 84407 -81456 -105005 266243 -360033
9525 -116320 -171839 -37601 -128685 -888 -316244 -38204 153535 39183 -446192 -360926 158039
9513 -176602 -14828 -194698 -175554 128164 -48613 22090 352389 -31825 -118884 -146136 -24313
9501 -161957 197896 -4663 -106017 66401 -113705 158047 -6266 -62269 -83149 -52807 -139033
9490 -139033 -187418 -176008 167503 76437 -490272 -163124 -80920 -212715 -218092 409012 20895
9478 -166208 -302490 -273375 2579 -234246 189058 20463 -353644 49014 18598 -63817 -5385
9466d28928A79815A5588J1110N8050a28884G4875h6677A62228A435K75882a56434
9454H8270J95623h6247D7325J13726a49689e3464C6738h7566J4783j02771N8271
9443a17283o6326g8426c6718I8239a3213q8576j61310o4128J29329a6135B41274
9431d22801a93617g0838n4926B17606b46485f8220j70603e9864o3528K7035I3623
9419G0666a33207a4060r8294D4300P581b51805a14006C26990h3241L851N825i100
9406A23012a25400l1104M4625n6240F1635d2927k7656j06280Q6481L7576k08643
9395b61449B17552c0403j98805A14155J12662a86020A74357a58938m3164K0209
9385a81893m4957b9953m9721j59632K3522j06385E7293a30471B31428a62249q156
$$ plain form
9466 -428928 179815 15588 26698 84748 -128884 74875 -86677 162228 1435 277317 -156434
9454 88270 283893 -86247 47325 161051 -149689 -53464 36738 -87566 -72783 -175554 -117283
9443 -117283 -183609 -78426 -36718 98239 -13213 -101789 -263099 -327227 -197898 -16135 241274
9431 -422801 -193617 -70838 -125764 217606 -246485 -68220 -238823 -59864 -123392 -96357 93623
9419 70666 -133207 -14060 -112354 44300 51881 -251805 -114006 326990 -83241 -79390 -73565 -9100
9406 123012 -125400 -156504 -111879 -168119 61635 -42927 -70583 -176863 -90382 -52806 -261449
9395 -261449 217552 -30403 -229208 114155 226817 -186020 174357 -158938 -202102 -181893
9385 -181893 -226850 -29953 -79674 -239306 -215784 -322169 57293 -130471 231428 -162249 -170405
9374a70405J917e0577l45701a68476A5361a68872A70339L9380G682a53069l75734
9363e28803b0706H97g3782k58735D0321a84952f9651A8717J37095g6316k84811
9352c61127M9304i5818M712k32447B33896l8082G5187b36395L6765g6423C444
9340a47160j7250j28118A42063a9787r9900A77207b12219c0477l24765F2156g6119
9328g2832C6747K9A2409a29447C1719d18022e4803A7927b41525j06287e9249j02745
9316a61994p2742a03661c1808j35097F3618k8760J8280c28146A05200D2844a37347
9304H9334R0714b8425k53071O2348J06012L4502H5614b77389C63501I708O5122
9293G4830a98698E8311d6552K627j47486c4548A02353j9130L36137c30206J31276
$$ plain form
9374 -170405 -168488 -50577 -396278 -168476 15361 -168872 170339 209719 7682 -153069 -528803
9363 -528803 -20706 897 -73782 -332517 40321 -184952 -69651 18717 155812 -76316 -361127
9352 -361127 -311823 -95818 -91106 -323553 233896 195814 75187 -236395 -199630 -76423 3444
9340 -147160 -164410 -292528 142063 -19787 -119687 177207 -212219 -30477 -355242 62156 -76119
9328 -72832 36747 36776 12409 -129447 31719 -418022 -54803 17927 -241525 -347812 -59249 -161994
9316 -161994 -234736 -103661 -31808 -166905 63618 34858 53138 -328146 105200 42844 -137347
9304 89334 180048 -28425 -281496 -219148 -113136 -78634 85614 -277389 363501 9708 74830
9293 74830 -198698 58311 -46552 -43925 -191411 -34548 102353 83223 419360 -330206 -198930
9282a98930I1265K4569J8958b42453k233C10664g8890p5018A94295b00966g7979
9270A90143j1639A924e1277o7324e2885J6086j03431N756N3193b5474j3055j29855
9258a68384i219D9721J63493d8582j67045D3146c43715G0783a73318C51962g4606
9246b71146A89953a33288B3835i8338j5770q2256j63871d0515B5613i9221E1097
9234B08880c3410k00183G9511b5264a806k23776B4591J88649a16585m4770B33814
9222i6219B2073b70495d3406D23867A35203E5910a46901B81042a7449q051k30310
9211b55810j5590K1191B8307a14009m1666e6658J947j30098d1735j30862c274
9199a15547B53681b7646j54499A02530a67023B44630r9023a24400F5503i9066
$$ plain form
9282 -198930 91265 115834 134792 -242453 -244686 310664 -78890 -153908 194295 -200966 -77979
9270 190143 178504 1924 -51277 -118601 -52885 -36799 -140230 -134474 -81281 -25474 -38529 -168384
9258 -168384 -9219 49721 213214 -48582 -215627 43146 -343715 70783 -173318 351962 -74606
9246 -271146 189953 -133288 23835 -98338 -114108 -196364 -360235 -40515 25613 -99221 51097
9234 208880 -33410 -233593 79511 -25264 -1806 -225582 24591 213240 -116585 -161355 233814
9222 -96219 22073 -270495 -43406 423867 135203 55910 -146901 281042 -17449 -25500 -255810
9211 -255810 -271400 -250209 28307 -114009 -155675 -56658 -54711 -184809 -41735 -172597 -3274
9199 -115547 253681 -27646 -182145 102530 -167023 244630 145607 -124400 65503 -99066
9188a17535e2412k6073B28568f8780j35085E5586k7749g7981k91786b0811j17884
9177a38695J2228K5662C1810a28167A56599d0822l3891j95385K0669H1247a41083
9165c9972p7094k4761m8901P6745a0314p0567A93587F5994a36876L9287F5018
9153b05806E8887a20472B45256H1574a81989H9261r969C0201c1075C50674A36734
9141i5000c1963k53932B45353e74763a96207B5488b50659M1010D475g7533l16337
9130c93870g6182c7480l30387o7205H8c114j04551E332f6196a2183A69913a64778
9117a06566G5663a67275l8890Q8620C6831J71610h2469J1699A56376a26704k5974
9106a52678m4620j80025a44623B0485e4860o1208E5819g2343j33656P1744D9256
$$ plain form
9188 -117535 -52412 -78485 228568 -68780 -203865 55586 27837 -77981 -369767 -20811 -138695
9177 -138695 -126467 -100805 31810 -128167 156599 -40822 -74713 -270098 -249429 81247 -141083
9165 -39972 -117066 -141827 -190728 -113983 -10314 -80881 193587 65994 -136876 -97589 65018
9153 -205806 58887 -120472 245256 81574 -181989 89261 79292 30201 -31075 350674 136734
9141 -95000 -31963 -285895 245353 -574763 -196207 25488 -250659 -209649 4475 -77533 -393870
9130 -393870 -76182 -37480 -367867 -435072 88 -3114 -107665 5332 -66196 -12183 169913 -164778
9117 -106566 75663 -167275 -206165 -117545 36831 208441 -82469 -70770 156376 -126704 -152678
9106 -152678 -197298 -377323 -144623 20485 -54860 -116068 55819 -72343 -205999 -134255 49256
9094a26786k16681j81933a91804A77103i1630b3009j20869A7974G998c82114J58152
9083b23962A10084R6793a69280N7262L8422C509g9011j53222A64673a92475m164
9072a96639A02499C3845R0356a17812j80232a31330d4041B1935E884J55401A7164
9060a13009B87495b09370D6820e8629k0661n4729c7833B85a7183B23368c05385
9048a24353B0053a1676l48762a09200P196D680d1791j13592A13519L7780j4983
9037A36316n8875b5109j34995e6216j995A03320J66730a54142O6273k9804j22476
9026b40149b9337D8922j8103b83085E1968c65765a05932A06559i9217r2860A03796
9014d8190A21192g8223j20187B3452K19822b3624l4672o428b5734j5528A5179
$$ plain form
9094 -126786 -343467 -525400 -191804 177103 -91630 -23009 -143878 17974 7998 -382114 -223962
9083 -223962 110084 206877 -169280 -112018 -73596 3509 -79011 -232233 164673 -192475 -196639
9072 -196639 102499 33845 124201 -117812 -298044 -131330 -44041 21935 5884 161285 17164
9060 -113009 287495 -209370 46820 -58629 -79290 -134019 -37833 285 -17183 223368 -305385
9048 -124353 20053 -11676 -360438 -109200 -102004 4680 -41791 -155383 113519 151299 136316
9037 136316 77441 -25109 -160104 -56216 -58211 103320 270050 -154142 -87869 -117673 -240149
9026 -240149 -29337 48922 30819 -283085 51968 -365765 -105932 106559 -99217 -192077 103796
9014 -48190 121192 -78223 -198410 23452 243274 -23624 -58296 -64724 -25734 -41262 15179
9002i4034A7705a82744F4802J64603B4791a06996n5956C7270J834b3605k4450
8991d8055j52626G6332a8571j88112C248K17169e4519k0698E3122i633B32473
8979a87456k80621B2453f7029A68657b45748l8886A95567q3978C760b60465e8217
8967b7917B35249a20031A27271b83123J07938O8113j11166g7125p0927o424E0166
8955d1978j22941D8054d1228k25912g4654j77683e9126K255A39165J48566i2371
8943a37953D734J00725J02741h4724P202B38440k0557H6262O36993C17069e3972
8931B7800J62317a31725A67236P1182A4306K18723P54404J103746L281575J1214946
8921A6587700k518792D083618A223959E80421m2699j76164A54111p5818J24316
$$ plain form
9002 -94034 17705 -182744 64802 229405 24791 -106996 -162952 37270 39104 -23605 -48055
8991 -48055 -200681 76332 -18571 -206683 3248 220417 -54519 -75217 53122 -9633 232473
8979 -187456 -468077 22453 -67029 168657 -245748 -284634 195567 111589 3760 -260465 -58217
8967 -27917 235249 -120031 127271 -283123 -175185 -107072 -218238 -77125 -148052 -154476 50166
8955 -41978 -164919 48054 -41228 -267140 -74654 -252337 -59126 -56871 139165 287731 -92371
8943 -137953 4734 105459 208200 -84724 -77522 238440 217883 86262 723255 317069 -53972
8931 27800 190117 -131725 167236 238418 14306 233029 987433 2091179 5372754 16587700
8921 16587700 14068908 4083618 1223959 580421 537722 361558 154111 78293 202609
8912B02609d11122B31620l6480K24860B09048q5048M6463b1222k3825I4273f6426
8900A56602d8901r3353e0l66702b9712j09119j7481A25906d55775b6121G434a01091
8887c15707J27205p649K9491B38513c86558D9153b4462j91796R9341k13598N3989
8876b76526C67222A06847a53464J328g0387K1182q1854k10883I7115N2758c17918
8864i0622C10444b32901f7541A63871b33968e3580A65548c6126I6051A7326a30021
$$ plain form
8912 202609 -411122 231620 195140 420000 209048 124000 170463 -21222 -45047 94273 -66426
8900 156602 -48901 -142254 -50 -366752 -29712 -138831 -156312 125906 -455775 -26121 7434 -101091
8887 -315707 -188502 -196151 -166660 238513 -386558 49153 -24462 -216258 -116917 -330515 -276526
8876 -276526 367222 106847 -153464 -152136 -70387 -49205 -131059 -341942 97115 149873 -317918
8864 -90622 310444 -232901 -67541 163871 -233968 -53580 165548 -36126 96051 17326 -130021
$$ [...]
##END NTUPLES=NMR SPECTRUM
##END=
