##TITLE=AC1507_CUNDCR13314_8126509_NYOsiGg0gN
##JCAMPDX= 6.0         $$ Bruker NMR JCAMP-DX V2.0
##DATA TYPE= NMR SPECTRUM
##DATA CLASS= NTUPLES
##ORIGIN= BRUKER
##OWNER= Administrator
$$ 1.72 TOPSPIN		Version 2.1
$$ 2013-08-15 23:19:52.178 -0700  Administrator@X
$$ Compression mode = diff/dup
##.OBSERVE FREQUENCY= 400.02188249412
##.OBSERVE NUCLEUS= ^1H
##.ACQUISITION MODE= SIMULTANEOUS (DQD)
##.ACQUISITION SCHEME= undefined
##.AVERAGES= 64
##.DIGITISER RES= 22
##SPECTROMETER/DATA SYSTEM= spect
##.PULSE SEQUENCE= noesygpps1d.comp
##.SOLVENT NAME= COFFEE_meoh
##.SHIFT REFERENCE= INTERNAL, COFFEE_meoh, 1, 14.9608
##AUDIT TRAIL= $$ (NUMBER, WHEN, WHO, WHERE, PROCESS, VERSION, WHAT)
$$ ##TITLE= Audit trail, TOPSPIN		Version 2.1
$$ ##JCAMPDX= 5.01
$$ ##ORIGIN= Bruker BioSpin GmbH
$$ ##OWNER= Administrator
$$ $$ E:\/data/COFFEE/nmr/AC1507_CUNDCR13314_8126509_NYOsiGg0gN/12/pdata/1/auditp.txt
$$ ##AUDIT TRAIL=  $$ (NUMBER, WHEN, WHO, WHERE, PROCESS, VERSION, WHAT)
(   1,<2013-08-15 23:19:47.334 -0700>,<Administrator>,<X>,<go>,<TOPSPIN 2.1>,
      <created by zg
	started at 2013-08-15 23:08:18.068 -0700,
	POWCHK enabled, PULCHK disabled,
       configuration hash MD5:
       C8 4E 4E 5D D3 5C D8 9E 9F 52 82 E0 59 8A DE 15
       data hash MD5: 64K
       38 CF 9C BD CD F5 D5 D0 7A DF 9C 88 24 8C 1D 61>)
(   2,<2013-08-15 23:19:50.209 -0700>,<Administrator>,<X>,<proc1d>,<TOPSPIN 2.1>,
      <Start of raw data processing
       efp LB = 0.3 FT_mod = 6 PKNL = 1 PHC0 = 0 PHC1 = 0 SI = 128K 
       data hash MD5: 128K
       02 D0 6C 65 3D A0 D5 69 07 2E 69 4A C1 AB 70 F9>)
(   3,<2013-08-15 23:19:51.178 -0700>,<Administrator>,<X>,<proc1d>,<TOPSPIN 2.1>,
      <pk PHC0 = -78.70605 PHC1 = 0 
       data hash MD5: 128K
       64 AE 9B 2C 35 D1 4B FA 8E 86 7C D9 4D AD 48 A0>)
(   4,<2013-08-15 23:19:51.631 -0700>,<Administrator>,<X>,<proc1d>,<TOPSPIN 2.1>,
      <abs ABSG = 1 
       data hash MD5: 128K
       5D 19 52 62 A7 C1 F7 92 6E B8 5A 0E 14 03 F0 AC>)
(   5,<2013-08-15 23:19:51.724 -0700>,<Administrator>,<X>,<proc1d>,<TOPSPIN 2.1>,
      <abs ABSG = 2 
       data hash MD5: 128K
       BF 1B 82 CF B1 3F 4A DB 40 96 A2 22 DE 6A 5F C4>)
(   6,<2013-08-15 23:19:51.818 -0700>,<Administrator>,<X>,<proc1d>,<TOPSPIN 2.1>,
      <abs ABSG = 3 
       data hash MD5: 128K
       A7 4D D7 E1 41 52 B0 84 46 95 2F C8 D6 D3 31 C2>)
(   7,<2013-08-15 23:19:51.896 -0700>,<Administrator>,<X>,<proc1d>,<TOPSPIN 2.1>,
      <abs ABSG = 4 
       data hash MD5: 128K
       6B 24 3F DC EE F0 5F D8 6B 92 BE 5E F3 BA 54 8E>)
(   8,<2013-08-15 23:19:51.990 -0700>,<Administrator>,<X>,<proc1d>,<TOPSPIN 2.1>,
      <abs ABSG = 5 
       data hash MD5: 128K
       E4 17 37 38 15 47 EC 6B AB A1 0F E5 79 92 FA 53>)
$$ ##END=
$$ 
$$ $$ hash MD5
$$ $$ BE 33 E9 8A 6D 5E 27 ED 04 B9 55 60 0E C5 5A F4
##$RELAX= 
##$RELAX= 
##$RELAX= 
##$RELAX= 
##$RELAX= 
##$RELAX= 
##$RELAX= 
##$RELAX= 
$$ Bruker specific parameters
$$ --------------------------
##$DU= <E:\>
##$EXPNO= 12
$$ [...]
150 150 150 150 150 150 150 150
##$TP07= 0
##$TPNAME0= <>
##$TPNAME1= <>
##$TPNAME2= <>
##$TPNAME3= <>
##$TPNAME4= <>
##$TPNAME5= <>
##$TPNAME6= <>
##$TPNAME7= <>
##$TPOAL= (0..7)
0.5 0.5 0.5 0.5 0.5 0.5 0.5 0.5
##$TPOFFS= (0..7)
0 0 0 0 0 0 0 0
##$TUNHIN= 0
##$TUNHOUT= 0
##$TUNXOUT= 0
##$USERA1= <user>
##$USERA2= <user>
##$USERA3= <user>
##$USERA4= <user>
##$USERA5= <user>
##$V9= 5
##$VALIST= <valist>
##$VCLIST= <CCCCCCCCCCCCCCC>
##$VD= 0
##$VDLIST= <DDDDDDDDDDDDDDD>
##$VPLIST= <PPPPPPPPPPPPPPP>
##$VTLIST= <TTTTTTTTTTTTTTT>
##$WBST= 1024
##$WBSW= 4
##$XGAIN= (0..3)
0 0 0 0
##$XL= 0
##$YL= 0
##$YMAX_a= 6456968
##$YMIN_a= -13561210
##$ZGOPTNS= <>
##$ZL1= 120
##$ZL2= 120
##$ZL3= 120
##$ZL4= 120
##$ABSF1= 14.9608
##$ABSF2= -5.597382
##$ABSG= 5
##$ABSL= 3
##$ALPHA= 0
##$AQORDER= 0
##$ASSFAC= 0
##$ASSFACI= 0
##$ASSFACX= 0
##$ASSWID= 0
##$AUNMP= <proc_prof1d_extract.lims>
##$AXLEFT= 0
##$AXNAME= <>
##$AXNUC= <1H>
##$AXRIGHT= 0
##$AXTYPE= 0
##$AXUNIT= <>
##$AZFE= 0.1
##$AZFW= 0.1
##$BCFW= 0
##$BC_mod= 0
##$BYTORDP= 0
##$COROFFS= 0
##$CY= 15
##$DATMOD= 1
##$DC= 0
##$DFILT= <>
##$DTYPP= 0
##$F1P= 0
##$F2P= 0
##$FCOR= 0.5
##$FTSIZE= 131072
##$FT_mod= 6
##$GAMMA= 0
##$GB= 0
##$INTBC= 1
##$INTSCL= 1
##$ISEN= 128
##$LB= 0.3
##$LEV0= 0
##$LPBIN= 0
##$MAXI= 10000
##$MC2= 0
##$MEAN= 0
##$ME_mod= 0
##$MI= 0
##$NCOEF= 0
##$NC_proc= -2
##$NLEV= 6
##$NOISF1= 0
##$NOISF2= 0
##$NSP= 0
##$NTH_PI= 0
##$NZP= 0
##$OFFSET= 14.9608
##$PC= 1
##$PHC0= -78.70605
##$PHC1= 0
##$PH_mod= 1
##$PKNL= yes
##$PPARMOD= 0
##$PPDIAG= 0
##$PPIPTYP= 0
##$PPMPNUM= 2147483647
##$PPRESOL= 1
##$PSCAL= 4
##$PSIGN= 0
##$PYNMP= <proc.py>
##$REVERSE= no
##$SF= 400.020009714671
##$SI= 131072
##$SIGF1= 0
##$SIGF2= 0
##$SINO= 400
##$SIOLD= 131072
##$SPECTYP= <>
##$SREGLST= <1H.CDCl3>
##$SSB= 0
##$STSI= 131072
##$STSR= 0
##$SW_p= 8223.68421052631
##$SYMM= 0
##$S_DEV= 0
##$TDeff= 65536
##$TDoff= 0
##$TI= <>
##$TILT= no
##$TM1= 0
##$TM2= 0
##$TOPLEV= 0
##$USERP1= <user>
##$USERP2= <user>
##$USERP3= <user>
##$USERP4= <user>
##$USERP5= <user>
##$WDW= 1
##$XDIM= 131072
##$YMAX_p= 427834568
##$YMIN_p= -29494
##$CURPLOT= <Network HP LaserJet P1505>
##$CURPRIN= <$Network HP LaserJet P1505>
##$DFORMAT= <normdp>
##$LAYOUT= <+/1D_H.xwp>
##$LFORMAT= <normlp>
##$PFORMAT= <normpl>
##$SURQMSG= 1
$$ End of Bruker specific parameters
$$ ---------------------------------
##NTUPLES= NMR SPECTRUM
##VAR_NAME=  FREQUENCY,     SPECTRUM/REAL,   SPECTRUM/IMAG
##SYMBOL=    X,             R,               I
##VAR_TYPE=  INDEPENDENT,   DEPENDENT,       DEPENDENT
##VAR_FORM=  AFFN,          ASDF,            ASDF
##VAR_DIM=   131072,        131072,          131072
##UNITS=     HZ,            ARBITRARY UNITS, ARBITRARY UNITS
##FACTOR=    0.0627417313425164, 1,          1
##FIRST=     8223.62146879497, -30,          -66112
##LAST=      0,             3290,            -66256
##MIN=       0,             -29494,          0
##MAX=       8223.62146879497, 427834568,    0
$$ Real data points
##PAGE= N=1
##DATA TABLE= (X++(R..R)), XYDATA
$$ [...]
$$ plain form
63892 951661 924398 899516 876860 855707 834851 813538 791921 770498 749511 729046 709376
63881 709376 690926 674075 659171 646617 636671 629208 623871 620488 619241 620469 624438 631267 640843
63868 640843 652663 665942 680169 695599 712939 732401 753251 774516 795909 817720 839928
63857 839928 861887 882958 902969 921745 938578 952575 963348 971036 975740 977360 975948 971825
63845 971825 965262 956251 944652 930322 913081 892849 869940 845064 818863 791556 763093 733542
63833 733542 703248 672778 642783 613841 586263 560100 535367 512286 491307 472857 456947
63822 456947 442902 429649 416511 403773 392265 382417 373899 366141 358904 352184 345856 339703 333796
63809 333796 328627 324776 322431 321183 320263 319105 317730 316536 315694 314839 313419 311219 308501 305727 303178
$$ packed form
63892I51661k7263k4882k2656k1153k0856k1313k1617k1423k0987k0465j9670
63881G09376j8450j6851j4904j2554r946p463n337l383j247J228L969O829R576
63868F40843J1820J3279J4227J5430J7340J9462K0850K1265K1393K1811K2208
63857H39928K1959K1071K0011J8776J6833J3997J0773P688M704J620j412m123
63845I71825o563r011j1599j4330j7241k0232k2909k4876k6201k7307k8463k9551
63833G33542l0294l0470k9995k8942k7578k6163k4733k3081k0979j8450j5910
63822D56947j4045j3253j3138j2738j1508r848q518p758p237o720o328o153n907
63809C33796n169l851k345j248r20j158j375j194q42q55j420k200k718k774k549
$$ plain form
63794 303178 300743 298015 294738 291155 287801 284862 282005 278992 276195 274178 272914 271816 270534 269325
63780 269325 268492 267796 266766 265390 264200 263673 263788 264186 264535 264683 264613 264345 263869 263129 262169 261256 260653 260238
63762 260238 259553 258430 257313 256666 256223 255253 253661 252345 252185 252955 253642 253694 253555 253961 255079 256446 257427
63745 257427 257594 256928 255905 255217 255196 255647 256453 258139 261434 266298 271733 276647 280612 283705 285965 287397
63729 287397 288316 289345 290935 293034 295251 297313 299392 302059 305810 310518 315431 319898 323946 327968
63715 327968 331979 335465 337901 339058 338830 337198 334628 332150 330683 330351 330581 330645 329974 328283 325860 323674
63699 323674 322785 323546 325493 327905 330236 332173 333661 335036 336848 339441 342761 346491 350195 353391 355846
63684 355846 357804 359647 361291 362169 361896 360664 358973 357262 355884 355067 354691 354408 354202 354544 355720 357275
$$ packed form
63794C03178k435k728l277l583l354k939k857l013k797k017j264j098j282j209
63780B69325q33o96j030j376j190n27J15L98L49J48p0k68m76p40r60r13o03m15
63762B60238o85j123j117o47m43r70j592j316j60P70O87N2j39M06J118J367R81
63745B57427J67o66j023o88k1M51Q06J686L295M864N435M914L965L093K260J432
63729B87397R19J029J590K099K217K062K079K667L751M708M913M467M048M022
63715C27968M011L486K436J157k28j632k570k478j467l32K30O4o71j691k423k186
63699C23674q89P61J947K412K331J937J488J375J812K593L320L730L704L196K455
63684C55846J958J843J644Q78k73j232j691j711j378q17l76k83k06L42J176J555
$$ plain form
63668 357275 358471 359189 360014 361470 363409 365144 365944 365396 363521 360710 357551 354571 351982 349500 346540
63653 346540 342827 338823 335300 332499 329993 327401 324809 322389 320092 318070 316986 317399 319041 321143
63639 321143 323321 325743 328583 331778 335312 339263 343509 347719 351753 355793 360075 364741 370006 376188
63625 376188 383451 391664 400532 409782 419318 429351 440258 452173 464864 478250 492796 509120
63613 509120 527459 547869 570666 596098 623756 652977 683806 716902 752480 789902 828294
63602 828294 866746 903675 936794 964199 985059 999099 1006206 1007050 1003283 996388 986794 974802 961736
63589 961736 949167 937207 924486 909713 892366 871990 847997 820628 791342 761727 732497
63578 732497 703867 676352 650684 627341 606650 589041 574736 563320 554057 546597 541148 538112
$$ packed form
63668C57275J196P18Q25J456J939J735Q00n48j875k811l159k980k589k482k960
63653C46540l713m004l523k801k506k592k592k420k297k022j084M13J642K102
63639C21143K178K422K840L195L534L951M246M210M034M040M282M666N265O182
63625C76188P263Q213Q868R250R536J0033J0907J1915J2691J3386J4546J6324
63613E09120J8339K0410K2797K5432K7658K9221L0829L3096L5578L7422L8392
63602H28294L8452L6929L3119K7405K0860J4040P107Q44l767o895r594j1992j3066
63589I61736j2569j1960j2721j4773j7347k0376k3993k7369k9286k9615k9230
63578G32497k8630k7515k5668k3343k0691j7609j4305j1416r263p460n449l036
$$ plain form
63566 538112 537759 539992 544106 548971 553895 559258 565923 574081 583010 592011 601164 611060 622122 634443
63552 634443 648174 663816 682145 703879 729415 758824 792040 828994 869505 913104 958995
63541 958995 1005925 1051848 1093790 1128395 1152848 1165560 1166565 1157773 1142653 1124850 1106625 1088704
63529 1088704 1071498 1055767 1041738 1028120 1012755 994145 971912 945979 916075 882276 845471
63518 845471 806950 767799 728921 691316 655919 623229 593355 566351 542266 520888 501720
63507 501720 484350 468828 455612 445088 437026 430549 424772 419437 414772 410754 406870 402745 398628
63494 398628 394997 391940 389304 387264 386309 386618 387763 389063 390026 390444 390385 390197 390281 390771 391515 392409 393523
63477 393523 394957 396792 399223 402432 406186 409777 412517 414129 414592 413886 412091 409520 406534 403337 400127
$$ packed form
63566E38112l53K233M114M865M924N363O665Q158Q929R001R153R896J1062J2321
63552F34443J3731J5642J8329K1734K5536K9409L3216L6954M0511M3599M5891
63541I58995M6930M5923M1942L4605K4453J2712J005q792j5120j7803j8225j7921
63529A088704j7206j5731j4029j3618j5365j8610k2233k5933k9904l3799l6805
63518H45471l8521l9151l8878l7605l5397l2690k9874k7004k4085k1378j9168
63507E01720j7370j5522j3216j0524q062o477n777n335m665m018l884m125m117
63494C98628l631l057k636k040r55L09J145J300R63M18n9j88Q4M90P44Q94J114
63477C93523J434J835K431L209L754L591K740J612M63p06j795k571k986l197l210
$$ plain form
63462 400127 397229 394811 392669 390666 389313 389467 391367 394321 397499 400662 403844 406734 408905 410576
63448 410576 412570 415415 418947 423039 428188 434950 443147 452218 462119 473212 485314 497744 510574
63435 510574 525139 542768 563514 586697 612249 640734 672171 705385 738409 769004 795098
63424 795098 815724 831866 845806 859335 872971 886962 902409 921044 944342 973071 1007152
63413 1007152 1045494 1086293 1127835 1168703 1206975 1239887 1264983 1281383 1289480 1289757 1282667 1269574
63401 1269574 1252993 1235505 1218546 1202175 1185572 1167623 1147283 1123648 1095876 1063462 1026821
63390 1026821 987244 945949 903495 860561 818871 780457 746081 715098 686924 661841 640189
63379 640189 621584 605512 592144 581997 575087 570914 569080 569482 572041 576644 583240 591755 602010
$$ packed form
63462D00127k898k418k142k003j353J54J900K954L178L163L182K890K171J671
63448D10576J994K845L532M092N149O762Q197R071R901J1093J2102J2430J2830
63435E10574J4565J7629K0746K3183K5552K8485L1437L3214L3024L0595K6094
63424G95098K0626J6142J3940J3529J3636J3991J5447J8635K3298K8729L4081
63413A007152L8342M0799M1542M0868L8272L2912K5096J6400Q097K77p090j3093
63401A269574j6581j7488j6959j6371j6603j7949k0340k3635k7772l2414l6641
63390A026821l9577m1295m2454m2934m1690l8414l4376l0983k8174k5083k1652
63379F40189j8605j6072j3368j0147o910m173j834M02K559M603O596Q515J0255
$$ plain form
63366 602010 613979 627953 644136 662223 681666 702340 724751 749730 778095 810336 846217
63355 846217 884774 925036 966689 1009735 1053618 1097048 1138583 1176788 1209764 1235122 1250989
63344 1250989 1257096 1254814 1246329 1233810 1218989 1203020 1186524 1169756 1152645 1134679 1114929 1092422
63332 1092422 1066533 1037129 1004499 969246 932125 893902 855426 817820 782397 750254 722021
63321 722021 697977 678173 662314 649822 640295 633689 629652 626657 622134 613697 600348 582737 562555
63308 562555 541623 521122 501445 482853 466154 452338 441453 432345 423939 416469 410936 407461
63296 407461 404841 401807 398182 394447 390705 386633 382270 378226 374975 372327 369757 366987 364068 361090
63282 361090 358087 355157 352557 350677 349892 350208 350979 351186 350254 348562 347034 346328 346516 347309 348287 349053 349513
$$ packed form
63366F02010J1969J3974J6183J8087J9443K0674K2411K4979K8365L2241L5881
63355H46217L8557M0262M1653M3046M3883M3430M1535L8205L2976K5358J5867
63344A250989O107k282q485j2519j4821j5969j6496j6768j7111j7966j9750k2507
63332A092422k5889k9404l2630l5253l7121l8223l8476l7606l5423l2143k8233
63321G22021k4044j9804j5859j2492r527o606m037k995m523q437j3349j7611k0182
63308E62555k0932k0501j9677j8592j6699j3816j0885r108q406p470n533l475
63296D07461k620l034l625l735l742m072m363m044l251k648k570k770k919k978
63282C61090l003k930k600j880p85L16P71K07r32j692j528p06J88P93R78P66M60
$$ plain form
63265 349513 350065 351231 353079 355223 357375 359603 362053 364757 367852 371590 375917 380348 384542 388713
63251 388713 393211 397969 402740 407650 413067 419042 425443 432563 441028 450882 461270 471315 481079 491440
63237 491440 503328 517310 533577 551895 571591 591924 612556 633617 655365 677862 700842
63226 700842 723802 746355 768594 790936 813478 835718 857131 877835 898492 919747 941970
63215 941970 965270 989222 1012607 1033874 1052017 1066783 1077971 1084853 1086487 1082429 1072992 1058920
63203 1058920 1040967 1019710 995644 969359 941607 913227 885097 858188 833473 811635 792939
63192 792939 777458 765267 756277 750138 746643 746062 748788 754733 763391 774401 787680 803028 819976
63179 819976 838048 856879 876095 895453 915099 935318 955910 976234 995927 1015143 1033888
$$ packed form
63265C49513N52J166J848K144K152K228K450K704L095L738M327M431M194M171
63251C88713M498M758M771M910N417N975O401P120Q465R854J0388J0045R764J0361
63237D91440J1888J3982J6267J8318J9696K0333K0632K1061K1748K2497K2980
63226G00842K2960K2553K2239K2342K2542K2240K1413K0704K0657K1255K2223
63215I41970K3300K3952K3385K1267J8143J4766J1188O882J634m058r437j4072
63203A058920j7953k1257k4066k6285k7752k8380k8130k6909k4715k1838j8696
63192G92939j5481j2191q990o139l495n81K726N945Q658J1010J3279J5348J6948
63179H19976J8072J8831J9216J9358J9646K0219K0592K0324J9693J9216J8745
$$ plain form
63168 1033888 1051528 1067168 1080198 1090268 1097052 1100280 1099683 1094746 1084863 1069963 1050610 1027287
63156 1027287 1000078 969480 936966 904135 871545 838989 806703 775687 746921 720784 697232
63145 697232 676017 656709 638958 622833 608604 596270 585650 576827 569946 564620 560121 556244
63133 556244 553410 551806 551019 550736 551207 552642 554609 556550 558605 561542 566029 572232 579806 587901 595426
63118 595426 601821 607548 613489 619926 626346 632132 637081 641314 645042 648493 651751 654582 656609 657765
63104 657765 658379 658729 658714 658104 657004 655846 654922 654058 652855 651203 649403 647760 646288 645009 644375 644995
63088 644995 646867 649145 650889 651872 652540 653379 654485 655655 656754 658064 660236 663665 667933 672251 676558
63073 676558 681677 688110 695202 702021 708659 715977 724383 733689 744113 756490 771219 787801 805812
$$ packed form
63168A033888J7640J5640J3030J0070O784L228n97m937r883j4900j9353k3323
63156A027287k7209l0598l2514l2831l2590l2556l2286l1016k8766k6137k3552
63145F97232k1215j9308j7751j6125j4229j2334j0620q823o881n326m499l877
63133E56244k834j604p87k83M71J435J967J941K055K937M487O203P574Q095P525
63118E95426O395N727N941O437O420N786M949M233L728L451L258K831K027J156
63104F57765O14L50j5o10j100j158r24q64j203j652j800j643j472j279o34O20
63088F44995J872K278J744R83O68Q39J106J170J099J310K172L429M268M318M307
63073F76558N119O433P092O819O638P318Q406R306J0424J2377J4729J6582J8011
$$ plain form
63060 805812 825621 847603 871254 895883 921904 950673 983125 1019154 1058299 1100320 1144991
63049 1144991 1191876 1240617 1291109 1343262 1396893 1451946 1508353 1565454 1622027 1677276 1731541
63038 1731541 1785664 1839898 1893850 1947266 2000330 2053113 2105138 2155508 2203053 2246153 2282838
63027 2282838 2311424 2330981 2340949 2340473 2328481 2304456 2268860 2222699 2166982 2102945 2032720 1959342
63015 1959342 1885804 1814167 1745681 1681515 1623021 1571316 1526963 1490148 1460921 1439206 1424864
63004 1424864 1417866 1418144 1425099 1437615 1454789 1476345 1501939 1530441 1560472 1591570 1624174 1658418
62992 1658418 1693474 1728260 1762308 1795685 1828461 1860557 1891814 1921772 1949448 1973450 1992270
62981 1992270 2004495 2009177 2006179 1995827 1977977 1951739 1916449 1872658 1821905 1765836 1705973 1643987
$$ packed form
63060H05812J9809K1982K3651K4629K6021K8769L2452L6029L9145M2021M4671
63049A144991M6885M8741N0492N2153N3631N5053N6407N7101N6573N5249N4265
63038A731541N4123N4234N3952N3416N3064N2783N2025N0370M7545M3100L6685
63027B282838K8586J9557R968m76j1992k4025l5596m6161n5717o4037p0225p3378
63015A959342p3538p1637o8486o4166n8494n1705m4353l6815k9227k1715j4342
63004A424864o998K78O955J2516J7174K1556K5594K8502L0031L1098L2604L4244
62992A658418L5056L4786L4048L3377L2776L2096L1257K9958K7676K4002J8820
62981A992270J2225M682k998j0352j7850k6238l5290m3791n0753n6069n9863o1986
$$ plain form
62969 1643987 1581544 1519719 1458934 1399521 1342129 1287660 1237094 1191212 1150057 1112697 1077946
62958 1077946 1045454 1015795 989463 966060 944489 923577 902479 880890 859096 837632 816823
62947 816823 796856 778125 761024 745267 729916 714355 698913 684323 670931 658721 647725
62936 647725 638026 629587 622420 616669 612184 608244 604173 600117 596803 594632 593395 592739 592393 591965 591079
62921 591079 589886 588952 588472 588028 587301 586487 585674 584334 582050 579333 576978 574716 571388 566608 561573 557776
62905 557776 555433 553648 551686 549491 547202 544840 542536 540520 538821 537367 536445 536562 537673 539008 539890
62890 539890 540307 540388 539840 538416 536614 535269 534598 534184 533808 533712 533945 534065 533798 533538 533827 534581 535225 535432
62872 535432 535367 535213 534803 533876 532532 531166 529949 528584 526776 524822 523456 523066 523406 524145 525267 526616
$$ packed form
62969A643987o2443o1825o0785n9413n7392n4469n0566m5882m1155l7360l4751
62958A077946l2492k9659k6332k3403k1571k0912k1098k1589k1794k1464k0809
62947H16823j9967j8731j7101j5757j5351j5561j5442j4590j3392j2210j0996
62936F47725r699q439p167n751m485l940m071m056l314k171j237o56l46m28q86
62921E91079j193r34m80m44p27q14q13j340k284k717k355k262l328m780n035l797
62905E57776k343j785j962k195k289k362k304k016j699j454r22J17J111J335Q82
62890E39890M17Q1n48j424j802j345o71m14l76r6K33J20k67k60K89P54O44K07
62872E35432o5j54m10r27j344j366j217j365j808j954j366l90L40P39J122J349
$$ plain form
62856 526616 527545 527654 527646 528725 531057 533517 535101 535970 536817 537802 538623 539212 539752 540223 540449 540555 540925 541668
62838 541668 542409 542607 541946 540542 538993 538024 537775 537569 536747 535599 535058 535475 536170 536314 535865 535459 535723 536897
62820 536897 538913 541503 544300 547035 549657 552233 554830 557589 560737 564388 568427 572678 577111 581694
62806 581694 586135 590017 593324 596687 600901 606203 612198 618576 625702 634254 644373 655485 667036
62793 667036 679073 691889 705450 719629 734948 752642 773868 799113 828401 861693 898909
62782 898909 939983 985306 1035895 1092680 1155685 1224277 1298096 1377152 1460825 1547313 1634557
62771 1634557 1721400 1807237 1890539 1968272 2037020 2094417 2139343 2171144 2189087 2192477 2180972
62760 2180972 2154766 2114694 2062231 1999248 1927729 1849719 1767390 1682869 1597904 1513768 1431490
$$ packed form
62856E26616R29J09qJ079K332K460J584Q69Q47R85Q21N89N40M71K26J06L70P43
62838E41668P41J98o61j404j549r69k49k06q22j148n41M17O95J44m49m06K64J174
62820E36897K016K590K797K735K622K576K597K759L148L651M039M251M433M583
62806E81694M441L882L307L363M214N302N995O378P126Q552J0119J1112J1551
62793F67036J2037J2816J3561J4179J5319J7694K1226K5245K9288L3292L7216
62782H98909M1074M5323N0589N6785O3005O8592P3819P9056Q3673Q6488Q7244
62771A634557Q6843Q5837Q3302P7733O8748N7397M4926L1801J7943L390j1505
62760B180972k6206m0072n2463o2983p1519p8010q2329q4521q4965q4136q2278
$$ plain form
62749 1431490 1352002 1276058 1204115 1136446 1073325 1015094 962065 914330 871638 833491 799363
62738 799363 768819 741431 716802 694776 675443 658749 644227 631315 619837 609983 601921 595633
62726 595633 591002 587775 585528 583948 583098 583144 583936 585228 587231 590464 595021 600489 606727 614325 624022
62711 624022 635999 649946 665511 682487 700891 721188 744256 770895 801489 836241 875397
62700 875397 919028 966881 1018644 1074136 1133093 1195163 1260367 1329144 1401442 1475963 1550634
62689 1550634 1623569 1693250 1758052 1816130 1865663 1904857 1931909 1945534 1945458 1932035 1905538 1866294
62677 1866294 1815409 1754811 1686599 1612840 1535905 1458245 1381595 1306826 1234739 1166404 1102465
62666 1102465 1042688 986709 934890 887956 845998 808286 774010 742826 714667 689367 666582
$$ packed form
62749A431490p9488p5944p1943o7669o3121n8231n3029m7735m2692l8147l4128
62738G99363l0544k7388k4629k2026j9333j6694j4522j2912j1478r854q062o288
62726E95633m631l227k247j580q50M6P92J292K003L233M557N468O238P598R697
62711F24022J1977J3947J5565J6976J8404K0297K3068K6639L0594L4752L9156
62700H75397M3631M7853N1763N5492N8957O2070O5204O8777P2298P4521P4671
62689A550634P2935O9681O4802N8078M9533L9194K7052J3625p6j3423k6497l9244
62677A866294n0885o0598o8212p3759p6935p7660p6650p4769p2087o8335o3939
62666A102465n9777n5979n1819m6934m1958l7712l4276l1184k8159k5300k2785
$$ plain form
62655 666582 645988 627483 611206 597255 585343 574878 565454 557033 549485 542215 534604 526737 519323
62642 519323 512892 507371 502553 498591 495720 493725 492112 490844 490514 491595 493766 496223 498401 500078
62628 500078 500892 500270 498041 494815 491541 488859 486953 485856 485603 486210 487596 489503 491494 493299 495223
62613 495223 497962 501826 506471 511535 517183 523739 531147 539201 547996 557715 568168 579116 590917
62600 590917 604340 619708 636716 655117 675239 697829 723784 753847 787998 825111 863744
62589 863744 903369 944318 986432 1028379 1068336 1104737 1136159 1161295 1179572 1191202 1196116 1193363
62577 1193363 1182235 1163597 1139392 1110993 1078713 1042781 1004091 963905 923391 883575 845277
62566 845277 808914 774666 742862 713848 687487 663269 641082 621432 604687 590430 577884
$$ packed form
62655F66582k0594j8505j6277j3951j1912j0465r424q421p548p270p611p867p414
62642E19323o431n521m818l962k871j995j613j268l30J081K171K457K178J677
62628E00078Q14o22k229l226l274k682j906j097k53O07J386J907J991J805J924
62613D95223K739L864M645N064N648O556P408Q054Q795R719J0453J0948J1801
62600E90917J3423J5368J7008J8401K0122K2590K5955L0063L4151L7113L8633
62589H63744L9625M0949M2114M1947L9957L6401L1422K5136J8277J1630M914k753
62577A193363j1128j8638k4205k8399l2280l5932l8690m0186m0514l9816l8298
62566H45277l6363l4248l1804k9014k6361k4218k2187j9650j6745j4257j2546
$$ plain form
62555 577884 566702 557056 549130 542762 537480 532677 527905 523216 519091 515841 513263 511081 509481 508758
62541 508758 508513 507831 506444 505231 505125 505854 506296 506000 505771 506563 508264 509969 511250 512736 515454 519941
62525 519941 526078 533570 542376 552697 564751 578665 594537 612429 632221 653638 676719 702258
62513 702258 731485 765130 802905 843973 887653 933480 980784 1028500 1075360 1120072 1161473
62502 1161473 1198754 1231523 1259396 1281582 1297137 1305702 1307855 1304703 1297240 1286131 1272107 1256696
62490 1256696 1242494 1232331 1227834 1228977 1235204 1246698 1264235 1288214 1318445 1354706 1396778 1443859
62478 1443859 1494549 1547473 1601230 1653427 1700394 1738491 1765631 1781460 1786455 1781157 1765836 1740271
62466 1740271 1703866 1656297 1598221 1531440 1458562 1382440 1305423 1228839 1153378 1080175 1011203
$$ packed form
62555E77884j1182r646p926o368n282m803m772m689m125l250k578k182j600p23
62541E08758k45o82j387j213j06P29M42k96k29P92J701J705J281J486K718M487
62525E19941O137P492Q806J0321J2054J3914J5872J7892J9792K1417K3081K5539
62513G02258K9227L3645L7775M1068M3680M5827M7304M7716M6860M4712M1401
62502A161473L7281L2769K7873K2186J5555Q565K153l152p463j1109j4024j5411
62490A256696j4202j0163m497J143O227J1494J7537K3979L0231L6261M2072M7081
62478A443859N0690N2924N3757N2197M6967L8097K7140J5829M995n298j5321k5565
62466A740271l6405m7569n8076o6781p2878p6122p7017p6584p5461p3203o8972
$$ plain form
62455 1011203 948423 892766 844115 801848 765192 733464 706475 684512 667561 654773 645031
62444 645031 637809 633055 630508 629654 630254 632402 636073 641050 647237 654532 662327 669647 675978 681473 686082
62429 686082 688891 688755 685476 680050 673704 666853 658971 649342 637852 625122 611964 598958 586575
62416 586575 575428 565972 557937 550432 542826 535359 528714 523167 518365 513896 509777 506264 503376 500806
62402 500806 498250 495704 493411 491729 491036 491544 492989 494689 496127 497368 498736 500296 502001 504146 507079
62387 507079 510454 513379 515546 517667 520478 523833 527272 531092 536157 542780 550375 558224 566108 574187
62373 574187 582732 592071 602368 613272 624207 635215 647219 661167 677225 695074 714832 737244
62361 737244 762995 792190 824719 860942 901689 947612 998731 1054686 1115092 1179308 1245919
$$ packed form
62455A011203o2780n5657m8651m2267l6656l1728k6989k1963j6951j2788r742
62444F45031p222m754k547q54O00K148L671M977O187P295P795P320O331N495M609
62429F86082K809j36l279n426o346o851p882r629j1490j2730j3158j3006j2383
62416E86575j1147r456q035p505p606p467o645n547m802m469m119l513k888k570
62402E00806k556k546k293j682o93N08J445J700J438J241J368J560J705K145K933
62387E07079L375K925K167K121K811L355L439L820N065O623P595P849P884Q079
62373E74187Q545R339J0297J0904J0935J1008J2004J3948J6058J7849J9758K2412
62361G37244K5751K9195L2529L6223M0747M5923N1119N5955O0406O4216O6611
$$ plain form
62350 1245919 1312849 1378072 1440010 1497100 1547348 1588647 1619530 1639423 1648360 1646740 1635399 1615619
62338 1615619 1588826 1556180 1518422 1476084 1429850 1380725 1329887 1278579 1228264 1180629 1137002
62327 1137002 1097744 1062471 1030832 1002708 977625 954582 932670 911513 890888 870341 849541
62316 849541 828643 807903 787219 766371 745494 724995 705287 686922 670610 656680 644733
62305 644733 634249 625276 618145 612869 609347 607825 608472 610714 613715 617471 622747 629902 638396 647544
62291 647544 657068 666743 676076 684648 692387 699352 705578 711245 716567 721399 725297 728085 729978 731110
62277 731110 731413 730973 730014 728515 726462 724573 724036 725171 727059 728978 731662 736555 744229 754223 766174
62262 766174 780526 798179 819980 846562 878207 914804 956167 1002431 1053929 1110758 1172664
$$ packed form
62350A245919O6930O5223O1938N7090N0248M1299L0883J9893Q937j620j1341j9780
62338A615619k6793l2646l7758m2338m6234m9125n0838n1308n0315m7635m3627
62327A137002l9258l5273l1639k8124k5083k3043k1912k1157k0625k0547k0800
62316H49541k0898k0740k0684k0848k0877k0499j9708j8365j6312j3930j1947
62305F44733j0484q973p131n276l522j522O47K242L001L756N276P155Q494R148
62291F47544R524R675R333Q572P739O965O226N667N322M832L898K788J893J132
62277G31110L03m40r59j499k053j889n37J135J888J919K684M893P674R994J1951
62262G66174J4352J7653K1801K6582L1645L6597M1363M6264N1498N6829O1906
$$ plain form
62251 1172664 1239128 1309118 1380686 1451125 1517722 1578318 1631216 1674821 1707638 1728702 1737977
62240 1737977 1736160 1723943 1701567 1669261 1628021 1579552 1525375 1466279 1402822 1336123 1268032
62229 1268032 1200710 1136154 1075798 1020333 969977 924966 885576 851597 822189 796480 774121
62218 774121 755038 738927 725235 713448 703099 693627 684559 675821 667700 660488 654250 648851 644148
62205 644148 640176 637132 635007 633336 631635 630167 629965 631903 635900 641079 646442 651408 656110 661336
62191 661336 667815 675408 683308 691146 699384 708396 717823 727255 737056 747864 759509 771107 782104
62178 782104 792723 803452 814513 825834 837147 848142 858840 869838 882008 896142 913074
62167 913074 933800 958984 988563 1022230 1060078 1102269 1148235 1196816 1247040 1298113 1348605
$$ packed form
62251A172664O6464O9990P1568P0439O6597O0596N2898M3605L2817K1064R275
62240A737977j817j2217k2376l2306m1240m8469n4177n9096o3457o6699o8091
62229A268032o7322o4556o0356n5465n0356m5011l9390l3979k9408k5709k2359
62218G74121j9083j6111j3692j1787j0349r472r068q738q121p212o238n399m703
62205F44148l972l044k125j671j701j468k02J938L997N179N363M966M702N226
62191F61336O479P593P900P838Q238R012R427R432R801J0808J1645J1598J0997
62178G82104J0619J0729J1061J1321J1313J0995J0698J0998J2170J4134J6932
62167I13074K0726K5184K9579L3667L7848M2191M5966M8581N0224N1073N0492
$$ plain form
62156 1348605 1396268 1438809 1474341 1501119 1517671 1523711 1520549 1510138 1493882 1472398 1445987 1414916
62144 1414916 1379503 1340302 1298224 1254387 1210007 1166499 1125355 1087692 1053989 1024300 998499
62133 998499 976272 957221 941175 928182 918012 909881 902841 896229 889638 882737 875435 868071 861208
62120 861208 855240 850304 846429 843661 842152 842157 843806 846829 850712 855040 859322 862432 862854 859856 854200
62105 854200 847378 840524 834303 829286 825683 822842 819700 815764 811184 806001 800068 793830 788457 784763
62091 784763 782456 780849 779899 780095 781631 784259 787834 792438 797975 804119 810824 818545 827774 838562
62077 838562 850650 863867 878289 894158 911710 930939 951437 972628 994164 1015959 1037884
62066 1037884 1059845 1082314 1106379 1132914 1161906 1192853 1225539 1259933 1295407 1330551 1363830
$$ packed form
62156A348605M7663M2541L5532K6778J6552O040l162j0411j6256k1484k6411l1071
62144A414916l5413l9201m2078m3837m4380m3508m1144l7663l3703k9689k5801
62133I98499k2227j9051j6046j2993j0170q131p040o612o591o901p302p364o863
62120H61208n968m936l875k768j509NJ649L023L883M328M282L110M22k998n656
62105H54200o822o854o221n017l603k841l142l936m580n183n933o238n373l694
62091G84763k307j607r50J96J536K628L575M604N537O144O705P721R229J0788
62077H38562J2088J3217J4422J5869J7552J9229K0498K1191K1536K1795K1925
62066A037884K1961K2469K4065K6535K8992L0947L2686L4394L5474L5144L3279
$$ plain form
62055 1363830 1393987 1419713 1439415 1451748 1456296 1453589 1444559 1430087 1410726 1386548 1357199 1322346
62043 1322346 1282204 1237678 1190061 1140615 1090385 1040362 991740 945782 903204 863856 827340
62032 827340 793857 764039 737932 714716 693660 674867 658716 644908 632600 621310 611198
62021 611198 602514 595137 588664 582598 576405 569728 562743 556104 550364 545467 540759 535489 529470 523413
62007 523413 518476 515316 513669 513007 513290 514743 517121 519772 522483 525783 530144 535201 539957 543608 546037
61992 546037 547671 548999 550170 551003 551402 551526 551273 549726 545653 538762 530157 521354 513109 505316 497669
61977 497669 490024 482410 475118 468777 463902 460263 456969 453312 449378 445777 442942 440832 439170 437700
61963 437700 436223 434607 432964 431714 431256 431490 431842 431877 431783 432091 433006 434240 435533 437122 439563 443152
$$ packed form
62055A363830L0157K5726J9702J2333M548k707r030j4472j9361k4178k9349l4853
62043A322346m0142m4526m7617m9446n0230n0023m8622m5958m2578l9348l6516
62032H27340l3483k9818k6107k3216k1056j8793j6151j3808j2308j1290j0112
62021F11198q684p377o473o066o193o677o985o639n740m897m708n270o019o057
62007E23413m937l160j647o62K83J453K378K651K711L300M361N057M756L651K429
61992E46037J634J328J171Q33L99J24k53j547m073o891q605q803q245p793p647
61977D97669p645p614p292o341m875l639l294l657l934l601k835k110j662j470
61963D37700j477j616j643j250m58K34L52L5r4L08R15J234J293J589K441L589
$$ plain form
61947 443152 447720 452996 459028 466036 473843 481755 489282 496886 505615 515896 527059 538239 549363
61934 549363 560850 572623 583923 594133 603350 612054 620521 628592 635774 641526 645697 648685 650911
61921 650911 652158 651740 649306 645084 639383 632428 624934 618287 613661 611176 610223 610408 611843 614715 619056
61906 619056 624917 632413 641417 651310 661115 669892 677168 683066 687814 691082 692111 690692 687602 683694
61892 683694 678825 672254 663942 654835 645816 636983 628197 619813 612407 606139 600805 596322 592656 589258
61878 589258 585092 579470 572692 565652 558908 552297 545410 538281 531528 525906 521779 519001 517197 516102
61864 516102 515718 516279 518079 521279 525816 531511 538211 545777 553987 562612 571680 581564 592758 605570
61850 605570 620057 636152 653726 672595 692504 713038 733493 752955 770748 786814 801421
$$ packed form
61947D43152M568N276O032P008P807P912P527P604Q729J0281J1163J1180J1124
61934E49363J1487J1773J1300J0210R217Q704Q467Q071P182N752M171K988K226
61921F50911J247m18k434m222n701o955p494o647m626k485r53J85J435K872M341
61906F19056N861P496R004R893R805Q777P276N898M748L268J029j419l090l908
61892F83694m869o571q312r107r019q833q786q384p406o268n334m483l666l398
61878E89258m166n622o778p040o744o611o887p129o753n622m127k778j804j095
61864E16102l84N61J800L200M537N695O700P566Q210Q625R068R884J1194J2812
61850F05570J4487J6095J7574J8869J9909K0534K0455J9462J7793J6066J4607
$$ plain form
61839 801421 814431 824987 832049 835138 834530 830906 825037 817691 809632 801593 794276 788332 784226 782133
61825 782133 782041 783901 787599 792904 799554 807301 815673 823755 830473 835159 837620 837631 834628 828007 817656
61810 817656 804134 788464 771742 754702 737579 720586 704455 690164 678028 667468 657829 649023
61798 649023 641064 633509 625939 618758 612758 607901 603174 597847 592274 587143 582420 577640 572981 569357
61784 569357 567211 565680 563377 559964 556581 554585 554109 554090 553521 552213 550381 548080 545495 543382 542530
61769 542530 542776 543042 542575 541769 541571 542371 543814 545489 547403 549681 552088 554164 555811 557505 559750 562416
61753 562416 564856 566680 568148 569718 571404 572728 573134 572309 570363 567903 565726 564112 562494 560033 556437
61738 556437 552083 547585 543536 540397 538200 536422 534585 532967 532365 533093 534605 536138 537450 538815 540546
$$ packed form
61839H01421J3010J0556P062L089o08l624n869p346q059q039p317n944m106k093
61825G82133r2J860L698N305O650P747Q372Q082O718M686K461J1l003o621j0351
61810H17656j3522j5670j6722j7040j7123j6993j6131j4291j2136j0560r639q806
61798F49023p959p555p570p181o000m857m727n327n573n131m723m780m659l624
61784E69357k146j531k303l413l383j996m76j9n69j308j832k301k585k113q52
61769E42530K46K66m67q06j98Q00J443J675J914K278K407K076J647J694K245K666
61753E62416K440J824J468J570J686J324M06q25j946k460k177j614j618k461l596
61738E56437m354m498m049l139k197j778j837j618o02P28J512J533J312J365J731
$$ plain form
61723 540546 542568 544368 545433 545847 546282 547167 548201 549037 550069 551935 554435 556653 558059 558804 558956 558239
61707 558239 556691 554791 552724 550168 547053 543799 540552 536922 532856 528992 525619 522106 517971 513778
61693 513778 510191 506794 502782 498323 494188 490378 486202 481657 477624 474544 471798 468710 465416 462426
61679 462426 459922 457753 455661 453303 450534 447887 446253 445803 445650 444865 443510 442369 441964 442110 442296 442314
61663 442314 442576 443786 446120 448838 451051 452679 454179 455491 456064 455985 456267 457573 459394 460988 462517
61648 462517 464584 467070 469227 470724 471855 472767 473104 472566 471407 470319 470104 471286 473547 475570 476010
61633 476010 474793 473048 471705 470661 469441 468051 466736 465324 463388 460885 458258 455963 454196 452916
61619 452916 451738 449944 447058 443433 439915 436916 434197 431598 429482 428212 427522 426724 425263 422849 419265
$$ packed form
61723E40546K022J800J065M14M35Q85J034Q36J032J866K500K218J406P45J52p17
61707E58239j548j900k067k556l115l254l247l630m066l864l373l513m135m193
61693E13778l587l397m012m459m135l810m176m545m033l080k746l088l294k990
61679D62426k504k169k092k358k769k647j634m50j53p85j355j141m05J46J86J8
61663D42314K62J210K334K718K213J628J500J312N73p9K82J306J821J594J529
61648D62517K067K486K157J497J131R12L37n38j159j088k15J182K261K023M40
61633D76010j217j745j343j044j220j390j315j412j936k503k627k295j767j280
61619D52916j178j794k886l625l518k999k719k599k116j270o90p98j461k414l584
$$ plain form
61604 419265 414431 408584 402166 395662 389696 385033 382084 380435 379158 377601 375734 373890 372405 371329
61590 371329 370249 368579 366338 364314 363059 362028 360401 358476 357386 357417 357563 356950 355811 354653 353374
61575 353374 351876 350749 350540 350837 350909 350839 351143 351623 351571 350997 350677 350902 351091 350873 350812 351676 353598 356220 359129
61556 359129 361798 363574 364166 363942 363542 363429 363848 364822 366051 367204 368446 370188 372192 373500 373570 373005
61540 373005 372795 373285 374276 375610 377127 378412 379278 380337 382442 385578 388767 391006 391924 391591 390261 388387
61524 388387 386394 384276 381741 378909 376526 375274 375070 375226 375128 374663 374165 374071 374445 374725 374147 372614 370980
61507 370980 370249 370541 371024 370829 369858 368705 368005 367941 368232 368392 367987 366824 365055 363201 361978 361887 362816 364050
61489 364050 364860 365197 365771 367362 370061 373203 375946 377821 378898 379657 380708 382362 384358 386201 387839
$$ packed form
61604D19265m834n847o418o504n966m663k949j649j277j557j867j844j485j076
61590C71329j080j670k241k024j255j031j627j925j090L1J46o13j139j158j279
61575C53374j498j127k09K97P2p0L04M80n2n74l20K25J89k18o1Q64J922K622K909
61556C59129K669J776N92k24m00j13M19R74J229J153J242J742K004J308P0n65
61540C73005k10M90R91J334J517J285Q66J059K105L136L189K239R18l33j330j874
61524C88387j993k118k535k832k383j252k04J56r8m65m98r4L74K80n78j533j634
61507C70980p31K92M83j95r71j153p00o4K91J60m05j163j769j854j223r1R29J234
61489C64050Q10L37N74J591K699L142K743J875J077P59J051J654J996J843J638
$$ plain form
61474 387839 389768 392357 395302 397941 399890 401123 401656 401540 401031 400427 399741 398846 397884 397150 396614 396012 395521
61457 395521 395847 397301 399084 399862 399020 397104 395162 393857 393247 393134 393391 393874 394228 394114 393742 393831 394764
61440 394764 396031 396928 397586 398796 400867 403265 405420 407226 408624 409375 409645 410187 411410 412706 413241 413057
61424 413057 412782 412607 412287 411977 412274 413335 414619 415696 416803 418344 420297 422359 424333 426064 427327
61409 427327 428080 428645 429322 429853 429553 428074 425928 424223 423806 424582 425668 426202 425993 425423 424947 424802 424943
61392 424943 425033 424681 423961 423517 423859 424782 425834 427099 428894 430845 432050 432317 432527 433461 434886 436233 437575
61375 437575 439355 441630 444278 447575 451767 456180 459652 462008 464407 467888 472137 476045 479039 481354
61361 481354 483278 484708 485545 486139 487098 488665 490388 491521 491840 491990 492882 494814 497416 500407 504044 508685
$$ packed form
61474C87839J929K589K945K639J949J233N33j16n09o04o86q95r62p34n36o02m91
61457C95521L26J454J783P78q42j916j942j305o10j13K57M83L54j14l72Q9R33
61440C94764J267Q97O58J210K071K398K155J806J398P51K70N42J223J296N35j84
61424D13057k75j75l20l10K97J061J284J077J107J541J953K062J974J731J263
61409D27327P53N65O77N31l00j479k146j705m17P76J086N34k09n70m76j45J41
61392D24943R0l52p20m44L42R23J052J265J795J951J205K67K10R34J425J347J342
61375D37575J780K275K648L297M192M413L472K356K399L481M249L908K994K315
61361D81354J924J430Q37N94R59J567J723J133L19J50Q92J932K602K991L637M641
$$ plain form
61345 508685 514191 519944 525250 529566 532577 534357 535365 536146 537131 538722 541218 544364 547279 549215 550216
61330 550216 550663 550438 549109 546883 544762 543527 542965 542277 540890 538794 536548 535198 535749 538282 541806
61315 541806 545303 548766 552990 558560 565447 573416 582433 592637 604162 616979 630773 645088 659775
61302 659775 675167 691477 708078 723665 737066 747687 755281 759694 760927 759174 754737 748091 740075
61289 740075 731671 723398 714921 705363 694082 681319 668231 656159 645724 636707 628823 622257 617155
61276 617155 612994 609037 605304 602472 600838 599938 599378 599456 600665 602950 605800 608773 611626 614138 616172
61261 616172 617917 619935 622943 627424 633196 639401 645238 650690 656174 661535 665971 669083 671294 672909
61247 672909 673389 672128 669555 666780 664404 662256 660181 658433 657260 656538 655863 654710 652674 650008 647817
$$ packed form
61345E08685N506N753N306M316L011J780J008P81R85J591K496L146K915J936J001
61330E50216M47k25j329k226k121j235n62o88j387k096k246j350N51K533L524
61315E41806L497L463M224N570O887P969R017J0204J1525J2817J3794J4315J4687
61302F59775J5392J6310J6601J5587J3401J0621P594M413J233j753m437o646q016
61289G40075q404q273q477r558j1281j2763j3088j2072j0435r017p884o566n102
61276F17155m161l957l733k832j634r00n60P8J209K285K850K973K853K512K034
61261F16172J745K018L008M481N772O205N837N452N484N361M436L112K211J615
61247F72909M80j261k573k775k376k148k075j748j173p22o75j153k036k666k191
$$ plain form
61232 647817 647205 648141 649636 651113 653160 656766 662252 669187 677049 685708 695391 706300 718109 729829
61218 729829 740429 749751 758592 767761 777260 786471 794948 802800 810425 818007 825288 831782 837254 841900
61204 841900 845966 849357 851954 854260 857354 862066 868440 876124 884975 895106 906617 919510 933678
61191 933678 948752 964108 979220 993891 1007899 1020561 1030948 1038554 1043579 1046483 1047449 1046352 1043215
61178 1043215 1038599 1033428 1028336 1023210 1017445 1010629 1002843 994299 984929 974508 963019 950741 937980
61165 937980 924818 911099 896625 881403 865736 850001 834381 818906 803725 789163 775512
61154 775512 762985 751898 742585 735038 728889 723942 720410 718442 717670 717596 718158 719416 720801 721220 720063
61139 720063 717680 714754 711574 708166 704825 702112 700500 700259 701575 704510 708914 714575 721386 729300
$$ packed form
61232F47817o12R36J495J477K047L606N486O935P862Q659R683J0909J1809J1720
61218G29829J0600R322Q841R169R499R211Q477P852P625P582P281O494N472M646
61204H41900M066L391K597K306L094M712O374P684Q851J0131J1511J2893J4168
61191I33678J5074J5356J5112J4671J4008J2662J0387P606N025K904R66j097l137
61178A043215m616n171n092n126n765o816p786q544r370j0421j1489j2278j2761
61165I37980j3162j3719j4474j5222j5667j5735j5620j5475j5181j4562j3651
61154G75512j2527j1087r313p547o149m947l532j968p72p4N62J258J385M19j157
61139G20063k383k926l180l408l341k713j612k41J316K935M404N661O811P914
$$ plain form
61125 729300 738314 748811 761716 777843 797057 818437 841322 865833 892260 920414 949886 980564
61113 980564 1012452 1045194 1078261 1111502 1145001 1178399 1210825 1241700 1271175 1299527 1326386
61102 1326386 1350867 1372256 1390292 1404908 1415933 1423022 1425664 1423368 1416073 1404420 1389471 1372156
61090 1372156 1353016 1332355 1310442 1287576 1264109 1240434 1216939 1194081 1172534 1153003 1135757
61079 1135757 1120523 1107102 1095891 1087536 1082219 1079589 1079275 1081065 1084694 1089945 1097037 1106505 1118510
61066 1118510 1132662 1148647 1166592 1186490 1207651 1229226 1251133 1274048 1298424 1323846 1349451
61055 1349451 1374798 1400270 1426676 1454423 1482986 1511251 1538491 1564894 1591004 1616762 1641366
61044 1641366 1664089 1684988 1704729 1723842 1742281 1759609 1775492 1789989 1803446 1816219 1828568
$$ packed form
61125G29300R014J0497J2905J6127J9214K1380K2885K4511K6427K8154K9472L0678
61113I80564L1888L2742L3067L3241L3499L3398L2426L0875K9475K8352K6859
61102A326386K4481K1389J8036J4616J1025P089K642k296p295j1653j4949j7315
61090A372156j9140k0661k1913k2866k3467k3675k3495k2858k1547j9531j7246
61079A135757j5234j3421j1211q355n317k630l14J790L629N251P092R468J2005
61066A118510J4152J5985J7945J9898K1161K1575K1907K2915K4376K5422K5605
61055A349451K5347K5472K6406K7747K8563K8265K7240K6403K6110K5758K4604
61044A641366K2723K0899J9741J9113J8439J7328J5883J4497J3457J2773J2349
$$ plain form
61033 1828568 1840759 1853128 1865978 1879483 1893692 1908606 1924316 1941194 1959915 1981054 2004641
61022 2004641 2030278 2057627 2086477 2116456 2147307 2179818 2216125 2258752 2309703 2370697 2443603
61011 2443603 2529912 2630282 2745741 2879602 3037644 3226729 3454325 3729462 4062953 4466299
61001 4466299 4951485 5532385 6225055 7045913 8011757 9143812 10469533 12013336 13777015
60992 13777015 15720244 17749466 19717529 21439845 22737567 23503452 23756268 23641092
60984 23641092 23367378 23123963 23019785 23064979 23175433 23190075 22912291 22180551 20938556
60975 20938556 19258758 17303608 15256152 13266151 11431539 9803956 8400504 7214643
60967 7214643 6226298 5410077 4739869 4190832 3740744 3370807 3065310 2810998 2597072
$$ packed form
61033A828568J2191J2369J2850J3505J4209J4914J5710J6878J8721K1139K3587
61022B004641K5637K7349K8850K9979L0851L2511L6307M2627N0951O0994P2906
61011B443603Q6309J00370J15459J33861J58042J89085K27596K75137L33491M03346
61001D466299M85186N80900O92670Q20858R65844J132055J325721J543803J763679
60992A3777015J943229K029222J968063J722316J297722P65885K52816j15176
60984B3641092k73714k43415j04178M5194J10454J4642k77784p31740j241995
60975B0938556j679798j955150k047456j990001j834612j627583j403452j185861
60967G214643r88345q16221o70208n49037m50088l69937l05497k54312k13926
$$ plain form
60958 2597072 2415185 2258646 2121775 2000293 1891852 1795392 1709974 1634487 1568089 1510159
60948 1510159 1459775 1415654 1376555 1341343 1308686 1277116 1245473 1213127 1179942 1146380 1113451
60937 1113451 1082012 1052018 1022771 993900 965764 938945 913792 890518 869353 850438 833743
60926 833743 819120 806191 794233 782510 770787 759376 748756 739372 731566 725279 719919 714958
60914 714958 710542 707041 704114 700935 697370 694172 691865 690167 688815 688179 688523 689278 689755 690114 690933 692094
60898 692094 692873 692987 692793 692326 690796 687301 681716 674688 667046 659358 651804 644189 636141 627403 617972
60883 617972 608027 597845 587751 578048 568923 560456 552674 545588 539257 533777 529106 524967 521152 517880
60869 517880 515535 514000 512665 511282 510466 511038 513121 516197 519800 523806 528214 533033 538352 544196 550295
$$ packed form
60958B597072j81887j56539j36871j21482j08441r6460q5418p5487o6398n7930
60948A510159n0384m4121l9099l5212l2657l1570l1643l2346l3185l3562l2929
60937A113451l1439k9994k9247k8871k8136k6819k5153k3274k1165j8915j6695
60926H33743j4623j2929j1958j1723j1723j1411j0620r384p806o287n360m961
60914G14958m416l501k927l179l565l198k307j698j352o36L44P55M77L59Q19J161
60898F92094P79J14j94m67j530l495n585p028p642p688p554p615q048q738r431
60883F17972r945j0182j0094r703r125q467p782p086o331n480m671m139l815l272
60869E17880k345j535j335j383q16N72K083L076L603M006M408M819N319N844O099
$$ plain form
60854 550295 556177 561463 565968 569667 572752 575585 578408 581176 583829 586490 589232 591807 593835 595040
60840 595040 595117 593653 590501 586054 580795 574794 568021 560950 554395 548727 543619 538588 533488 528523 524035
60825 524035 520259 516977 513502 509259 504359 499324 494394 489499 484873 481159 478656 476710 474086 469985
60811 469985 464722 459494 455371 452409 449750 446638 443143 439785 436754 433776 430580 427305 424572 423201
60797 423201 423495 424623 425190 424720 424139 424440 425433 426373 427235 428474 429909 430883 431443 432402 434086 435964 437685
60780 437685 439655 442191 444873 447159 449040 450670 451907 452735 453635 454967 456287 456805 456430 455929 456122 457150
60764 457150 458491 459538 460220 461029 462269 463349 463209 461517 459082 456926 455302 453737 451665 448847 445473
60749 445473 442084 439230 437141 435867 435536 436020 436519 436162 435099 434287 434006 433305 431232 427900 423886 419324
$$ packed form
60854E50295N882N286M505L699L085K833K823K768K653K661K742K575K028J205
60840E95040P7j464l152m447n259o001o773p071o555n668n108n031n100m965m488
60825E24035l776l282l475m243m900n035m930m895m626l714k503j946k624m101
60811D69985n263n228m123k962k659l112l495l358l031k978l196l275k733j371
60797D23201K94J128N67m70n81L01R93R40Q62J239J435R74N60R59J684J878J721
60780D37685J970K536K682K286J881J630J237Q28R00J332J320N18l75n01J93J028
60764D57150J341J047O82Q09J240J080j40j692k435k156j624j565k072k818l374
60749D45473l389k854k089j274l31M84M99l57j063q12k81p01k073l332m014m562
$$ plain form
60733 419324 414340 409829 406864 405418 404434 403189 402035 401624 401850 401800 400605 398284 395789 394233 394088 395171
60717 395171 397278 400378 404133 407669 410130 411287 411503 411436 411844 413232 415387 417609 419612 421794 424370
60702 424370 426730 428074 428300 427834 426984 425961 425260 425430 426466 427824 428923 429411 429132 428206 427010 425770
60686 425770 424331 422572 420792 419391 418461 418059 418602 420479 423373 426374 428740 430324 431459 432696 434461
60671 434461 436581 438327 439242 439694 440276 440903 440956 440080 438370 435920 432763 429265 426097 423722 422148 421160
60655 421160 420521 420023 419647 419668 420433 422046 424336 426877 429027 430427 431657 433838 437143 440196 441543 441188
60639 441188 440016 438203 435251 431389 427807 425239 423214 421027 418755 416904 415676 415030 415054 415798 416928
60624 416928 417879 418318 418321 418227 418366 418762 419106 419149 419046 419111 419329 419444 419390 419339 419437 419802 420639 421888 422953 423235 422878
$$ packed form
60733D19324m984m511k965j446r84j245j154m11K26n0j195k321k495j556j45J083
60717C95171K107L100L755L536K461J157K16o7M08J388K155K222K003K182K576
60702D24370K360J344K26m66q50j023p01J70J036J358J099M88k79r26j196j240
60686D25770j439j759j780j401r30m02N43J877K894L001K366J584J135J237J765
60671D34461K120J746R15M52N82O27N3q76j710k450l157l498l168k375j574r88
60655D21160o39m98l76K1P65J613K290K541K150J400J230K181L305L053J347l55
60639D41188j172j813k952l862l582k568k025k187k272j851j228o46K4P44J130
60624D16928R51M39Lr4J39L96L44M3j03O5K18J15n4n1R8L65Q37J249J065K82l57
$$ plain form
60603 422878 422445 421961 420934 419381 418165 418050 418952 420342 421922 423618 425329 427018 428833 430912 433251
60588 433251 435823 438593 441312 443613 445369 446705 447690 448389 449119 450164 451212 451693 451814 452616 454721 457639
60572 457639 460728 464330 469384 476230 484323 492923 501667 510592 520068 530573 542125 553862 564488
60559 564488 573211 580090 585470 589227 590662 589103 584661 578385 571620 565287 559876 555907 553885 553732
60545 553732 554673 555927 557364 559392 562566 567454 574550 583951 595254 607977 621979 637311 653860
60532 653860 671332 689369 707401 724477 739519 751786 760949 766798 769092 767793 763350 756650 748668
60519 748668 740123 731394 722618 713799 704893 696040 687749 680643 674909 670198 666256 663427 662379 663524
60505 663524 666922 672491 680023 689222 700151 713558 730436 751381 776583 806194 840286 878589
$$ packed form
60603D22878m33m84j027j553j216j15R02J390J580J696J711J689J815K079K339
60588D33251K572K770K719K301J756J336R85O99P30J045J048M81J21Q02K105K918
60572D57639L089L602N054O846Q093Q600Q744Q925R476J0505J1552J1737J0626
60559E64488Q723O879N380L757J435j559m442o276o765o333n411l969k022j53
60545E53732R41J254J437K028L174M888P096R401J1303J2723J4002J5332J6549
60532F53860J7472J8037J8032J7076J5042J2267R163N849K294j299m443o700p982
60519G48668q545q729q776q819q906q853q291p106n734m711l942k829j048J145
60505F63524L398N569P532R199J0929J3407J6878K0945K5202K9611L4092L8303
$$ plain form
60493 878589 920639 965894 1013289 1060991 1107233 1151208 1192481 1229698 1260718 1284024 1299208
60482 1299208 1305896 1303088 1289936 1266596 1234029 1193594 1147146 1096876 1044568 991350 938466 887680
60470 887680 840512 797487 758541 723736 693161 666520 643287 622992 605027 588630 573552
60459 573552 560438 549958 541684 534281 526752 519217 512500 507177 502967 498947 494482 489904 486003 482928
60445 482928 480097 477276 475067 474042 473885 473849 473598 473169 472444 471174 469323 467058 464597 462300 460531 459124
60429 459124 457408 455146 453080 452126 452342 453104 453964 454823 455548 455919 455886 455520 454898 454315 454350 455368 457177 459401
60411 459401 461842 464241 466161 467565 469034 470930 472783 474015 474845 475906 477415 479359 481995 485315
60397 485315 488366 490099 490792 491810 493974 497015 500516 504440 508515 512033 514677 516963 519488 522225
$$ packed form
60493H78589M2050M5255M7395M7702M6242M3975M1273L7217L1020K3306J5184
60482A299208O688k808j3152k3340l2567m0435m6448n0270n2308n3218n2884n0786
60470H87680m7168m3025l8946l4805l0575k6641k3233k0295j7965j6397j5078
60459E73552j3114j0480q274p403p529p535o717n323m210m020m465m578l901l075
60445D82928k831k821k209j025j57l6k51m29p25j270j851k265k461k297j769j407
60429D59124j716k262k066r54K16P62Q60Q59P25L71l3l66o22n83L5J018J809K224
60411D59401K441K399J920J404J469J896J853J232Q30J061J509J944K636L320
60397D85315L051J733O93J018K164L041L501L924M075L518K644K286K525K737
$$ plain form
60383 522225 524824 527150 529269 531300 533481 536006 538636 540866 542612 544321 546243 548101 549710 551550
60369 551550 554320 558117 562331 566245 569614 572736 575981 579224 581938 583978 585984 588618 591715 594720
60355 594720 597730 601405 605985 611172 617031 624087 632231 640365 647685 654668 662045 669224 674499 676752
60341 676752 676387 674573 672078 669015 665360 661372 657424 653592 649637 645509 641615 638284 635186 631701
60327 631701 627826 624174 620988 617676 613515 608403 602703 596837 591366 587016 584197 582775 582653 584190
60313 584190 587563 592066 596732 601644 608001 616809 627933 640604 654341 669020 684347 699675 714359
60300 714359 728044 740512 751378 759929 765252 766536 763410 756021 744811 730266 713035 694305
60288 694305 675841 659359 645779 635097 626869 620592 615777 612097 609650 608737 609102 609667 609303 607662
$$ packed form
60383E22225K599K326K119K031K181K525K630K230J746J709J922J858J609J840
60369E51550K770L797M214L914L369L122L245L243K714K040K006K634L097L005
60355E94720L010L675M580N187N859P056Q144Q134P320O983P377P179N275K253
60341F76752l65j814k495l063l655l988l948l832l955m128l894l331l098l485
60327F31701l875l652l186l312m161n112n700n866n471m350k819j422j22J537
60313E84190L373M503M666M912O357Q808J1124J2671J3737J4679J5327J5328J4684
60300G14359J3685J2468J0866Q551N323J284l126p389j1210j4545j7231j8730
60288F94305j8464j6482j3580j0682q228o277m815l680k447r13L65N65l64j641
$$ plain form
60274 607662 604924 601011 595644 589189 582878 577879 574341 571458 568256 564208 559441 554575 550272 546739
60260 546739 543688 540816 538175 536038 534556 533701 533423 533659 534195 534649 534750 534696 535152 536672 539057 541379
60244 541379 542732 542868 542127 541039 540167 539996 540635 541653 542498 542938 542939 542334 541088 539752 539179 539667 540766
60227 540766 542040 543685 546168 549515 553183 556550 559444 562227 565449 569384 573888 578668 583593 588729
60213 588729 594348 601008 609320 619313 630236 641300 652460 664104 676204 688234 699832 710988
60201 710988 721562 731105 739321 746439 752965 759268 765307 770510 774062 775710 776154 776217 775750 773932 770549
60186 770549 766290 761672 756443 750262 743234 735411 726528 716807 707427 699393 692273 684778 676468 668209
60172 668209 661082 655475 651305 648445 646615 645316 644210 643309 642524 641287 638984 635722 632338 629607 627681
$$ packed form
60274F07662k738l913n367o455o311m999l538k883l202m048m767m866m303l533
60260E46739l051k872k641k137j482q55k78K36N36M54J01n4M56J520K385K322
60244E41379J353J36p41j088q72j71O39J018Q45M40Jo05j246j336n73M88J099
60227E40766J274J645K483L347L668L367K894K783L222L935M504M780M925N136
60213E88729N619O660Q312R993J0923J1064J1160J1644J2100J2030J1598J1156
60201G10988J0574R543Q216P118O526O303O039N203L552J648M44O3m67j818l383
60186G70549m259m618n229o181p028p823q883r721r380q034p120p495q310q259
60172F68209p127n607m170k860j830j299j106r01p85j237k303l262l384k731j926
$$ plain form
60157 627681 626328 625431 624971 624763 624649 624931 626138 628171 630121 631261 631866 632688 633968 635538 637618 640734
60141 640734 644789 648948 652691 656467 660999 666468 672762 680068 688684 698433 708686 718882 728687 737808
60127 737808 746039 753497 760482 766986 772539 776657 779391 781418 783602 786458 789969 793804 797582 800943
60113 800943 803692 806113 808914 812446 816020 818424 819224 819203 819379 819806 819538 817569 813681 808464 802644 796406
60097 796406 789512 782123 775202 769720 765695 762430 759557 757210 755244 753067 750500 748166 746637 745710
60083 745710 744930 744375 744375 744754 744868 744265 742888 740734 737734 733946 729558 724638 719020 712392 704465 695232
60067 695232 685219 675279 665951 657175 648774 640955 634068 628092 622639 617383 612265 607364 602812 598793
60053 598793 595478 592982 591439 591018 591835 593954 597465 602330 608137 614349 620842 627852 635317 642726 649870
$$ packed form
60157F27681j353q97m60k08j14K82J207K033J950J140O05Q22J280J570K080L116
60141F40734M055M159L743L776M532N469O294P306Q616R749J0253J0196R805R121
60127G37808Q231P458O985O504N553M118K734K027K184K856L511L835L778L361
60113H00943K749K421K801L532L574K404Q00k1J76M27k68j969l888n217n820o238
60097G96406o894p389o921n482m025l265k873k347j966k177k567k334j529r27
60083G45710p80n55%L79J14o03j377k154l000l788m388m920n618o628p927r233
60067F95232j0013r940r328q776q401p819o887n976n453n256n118m901m552m019
60053E98793l315k496j543m21Q17K119L511M865N807O212O493P010P465P409P144
$$ plain form
60038 649870 657278 665431 673871 681586 688146 693929 699227 703635 706537 707847 707927 706929 704529 700426 694818
60023 694818 688115 680272 670781 659426 646688 633222 619373 605537 592519 580884 570322 560349
60011 560349 551429 544476 539341 534811 530298 526519 524104 522556 521181 520231 520263 521007 521714 522206 522786 523454
59995 523454 524015 524710 525916 527399 528696 530147 532773 537003 542163 547345 552182 556717 561103 565648 570563
59980 570563 575382 579032 580757 580631 578996 575812 571000 565168 559464 554624 550419 546218 541909 538067
59966 538067 535218 533251 531771 530773 530618 531428 532943 535001 537679 540836 543978 546833 549663 552659 555366
59951 555366 557038 557393 556800 555974 555661 556282 557538 558637 559122 559243 559378 559535 559623 559709 559636 558930 557611 556569
59933 556569 556496 556868 556734 556321 557098 560234 565527 571836 578023 583492 588293 592823 597163 600772 602977 603537
$$ packed form
60038F49870P408Q153Q440P715O560N783N298M408K902J310Q0r98k400m103n608
60023F94818o703p843r491j1355j2738j3466j3849j3836j3018j1635j0562r973
60011E60349q920o953n135m530m513l779k415j548j375r50L2P44P07M92N80O68
59995E23454N61O95J206J483J297J451K626M230N160N182M837M535M386M545M915
59980E70563M819L650J725j26j635l184m812n832n704m840m205m201m309l842
59966E38067k849j967j480r98j55Q10J515K058K678L157L142K855K830K996K707
59951E55366J672L55n93q26l13O21J256J099M85J21J35J57Q8Q6p3p06j319j042
59933E56569p3L72j34m13P77L136N293O309O187N469M801M530M340L609K205N60
$$ plain form
59917 603537 602508 599973 596384 592756 589929 587893 586346 585592 586161 587795 589624 591325 593378 596104 599118
59902 599118 601892 604317 606510 608422 609791 610276 609787 608959 609053 610904 614170 618002 622147 626896 632336
59887 632336 638406 645366 653324 661495 668890 675725 683200 691813 700840 709624 718376 727327 735923 743363
59873 743363 749351 753948 757199 759226 760117 759502 756825 752286 746945 741645 736394 730992 725517 719868 713616
59858 713616 706803 700331 695024 690822 687379 684879 683655 683418 683536 683865 684855 686951 690235 694511 699544
59843 699544 705410 712577 721121 729815 736680 740723 742542 743046 742565 741731 742237 745571 751366 757844 763610
59828 763610 768233 771483 773025 772879 771371 768570 764344 758974 753005 746498 739035 730550 721495 712180
59814 712180 702590 693098 684686 678057 672917 668480 664339 660492 656789 652778 648122 643003 638104 634192
$$ packed form
59917F03537j029k535l589l628k827k036j547p54N69J634J829J701K053K726L014
59902E99118K774K425K193J912J369M85m89q28R4J851L266L832M145M749N440
59887F32336O070O960P958Q171P395O835P475Q613R027Q784Q752Q951Q596P440
59873G43363N988M597L251K027Q91o15k677m539n341n300n251n402n475n649o252
59858G13616o813o472n307m202l443k500j224k37J18L29R90K096L284M276N033
59843F99544N866P167Q544Q694O865M043J819N04m81q34N06L334N795O478N766
59828G63610M623L250J542j46j508k801m226n370n969o507p463q485r055r315
59814G12180r590r492q412o629n140m437m141l847l703m011m656n119m899l912
$$ plain form
59800 634192 631560 629774 628058 625984 623623 621085 618235 615011 611767 609001 606788 604757 602580 600311
59786 600311 598164 596204 594410 592920 591980 591648 591723 592031 592588 593420 594447 595714 597505 599963 602711 605122
59770 605122 606948 608492 610212 612376 615035 618041 621132 624174 627313 630748 634511 638655 643378 648645
59756 648645 653934 658825 663613 668816 674297 679576 684887 691079 698425 706374 714657 723614 732945 741122
59742 741122 746882 750697 753968 757252 760166 762561 764696 766341 766826 766188 765416 765209 765142 764506 763370 762377
59726 762377 761906 761920 762391 763360 764702 766273 768162 770388 772423 773545 773805 774037 774597 774590 772930 769859 766644
59709 766644 763827 760680 756689 752743 750156 749056 748509 747951 747639 747834 748400 749391 751287 754350 758277 762784
59693 762784 768077 774478 781857 789575 796616 801711 803879 803124 800265 795966 790456 784304 778707 774505
$$ packed form
59800F34192k632j786j716k074k361k538k850l224l244k766k213k031k177k269
59786F00311k147j960j794j490r40l32P5L08N57Q32J027J267J791K458K748K411
59770F05122J826J544J720K164K659L006L091L042L139L435L763M144M723N267
59756F48645N289M891M788N203N481N279N311O192P346P949Q283Q957R331Q177
59742G41122N760L815L271L284K914K395K135J645M85o38p72k07o7o36j136r93
59726G62377m71J4M71R69J342J571J889K226K035J122K60K32N60pj660l071l215
59709G66644k817l147l991l946k587j100n47n58l12J95N66R91J896L063L927M507
59693G62784N293O401P379P718P041N095K168p55k859m299n510o152n597m202
$$ plain form
59679 774505 771329 768210 764651 760668 756186 750997 745159 738894 732110 724493 716172 708045 701271 696415
59665 696415 692982 689796 686065 682073 678641 676054 673940 672145 671065 670952 671522 672591 674518 677616 681591
59650 681591 686003 690782 695811 700425 703893 706104 707279 707306 705853 702870 698507 692825 686159 679490 673820
59635 673820 669306 665531 662445 660417 659422 658826 658057 657023 655779 654314 652779 651521 650619 649599 647773
59620 647773 644783 640835 636478 632151 627888 623602 619612 616535 614526 613001 611380 609793 608761 608583
59606 608583 609340 611084 613569 616074 617954 619111 619605 619248 618152 617226 617426 618679 620174 621507 622847
59591 622847 624215 625334 626228 627242 628400 629340 629940 630410 630694 630369 629250 627563 625480 623014 620395 617911
59575 617911 615322 612107 608505 605577 603917 602897 601553 599702 597741 595867 594026 592302 590819 589469
$$ packed form
59679G74505l176l119l559l983m482n189n838o265o784p617q321q127o774m856
59665F96415l433l186l731l992l432k587k114j795j080j13N70J069J927L098L975
59650F81591M412M779N029M614L468K211J175K7j453k983m363n682o666o669n670
59635F73820m514l775l086k028r95n96p69j034j244j465j535j258r02j020j826
59620F47773k990l948m357m327m263m286l990l077k009j525j621j587j032j78
59606F08583P57J744K485K505J880J157M94l57j096r26K00J253J495J333J340
59591F22847J368J119Q94J014J158R40O00M70K84l25j119j687k083k466k619k484
59575F17911k589l215l602k928j660j020j344j851j961j874j841j724j483j350
$$ plain form
59561 589469 588196 587392 587548 588551 589670 590269 590251 589831 589154 588289 587414 586882 587074 588208 590239 592931 596047
59544 596047 599524 603537 608395 614285 621107 628694 637241 647334 659494 673842 690200 708080 726257
59531 726257 742614 754914 761810 763201 760007 753953 747235 741713 738226 736794 737256 739366 742490 745763
59517 745763 748567 750542 751237 750161 747165 742379 735832 727555 718048 708175 698514 689170 680271 672134
59503 672134 664762 657611 650192 642782 636294 631513 628463 626377 624314 621972 619935 618999 619359 620627 622430
59488 622430 624652 627159 629705 632202 634886 638199 642622 648398 655157 662025 668542 675335 683456 693142
59474 693142 703642 714148 724335 733955 742501 749476 754671 758038 759636 759800 759058 757782 756179 754581
59460 754581 753407 752843 752956 754177 757272 762731 770434 779886 790427 801348 812308 823638 835691
$$ packed form
59561E89469j273q04J56J003J119N99j8m20o77q65q75n32J92J134K031K692L116
59544E96047L477M013M858N890O822P587Q547J0093J2160J4348J6358J7880J8177
59531G26257J6357J2300O896J391l194o054o718n522l487j432M62K110L124L273
59517G45763K804J975O95j076k996m786o547q277r507r873r661r344q899q137
59503F72134p372p151p419p410o488m781l050k086k063k342k037r36L60J268J803
59488F22430K222K507K546K497K684L313M423N776O759O868O517O793Q121R686
59474F93142J0500J0506J0187R620Q546O975N195L367J598J64p42j276j603j598
59460G54581j174n64J13J221L095N459P703R452J0541J0921J0960J1330J2053
$$ plain form
59447 835691 847851 858802 867878 875556 882292 887367 889298 887069 880727 871135 859540 847139 834776
59434 834776 822989 812271 802938 794715 786920 779265 772111 765852 760558 756516 754630 755750 759839 766256
59420 766256 774771 785946 800509 818596 839582 862512 886751 912321 939626 968854 999745 1031741
59408 1031741 1063784 1093611 1117506 1131412 1132871 1122350 1103055 1079593 1056547 1037713 1025830
59397 1025830 1022241 1026441 1036145 1047979 1058019 1062005 1056205 1039264 1013317 982755 951676 922523
59385 922523 896505 874304 856125 841698 830541 821976 815010 808821 803526 799917 798177 797272 795869
59372 795869 793492 790565 787624 784841 782254 780185 779253 779778 781201 782499 783468 785082 788212 792447 796905
59357 796905 801740 807886 815513 823866 832707 842871 855045 868930 883988 900193 917563 935691
$$ packed form
59447H35691J2160J0951R076P678O736N075J931k229o342r592j1595j2401j2363
59434H34776j1787j0718r333q223p795p655p154o259n294m042j886J120M089O417
59420G66256Q515J1175J4563J8087K0986K2930K4239K5570K7305K9228L0891L1996
59408A031741L2043K9827K3895J3906J459j0521j9295k3462k3046j8834j1883
59397A025830l589M200R704J1834J0040L986n800j6941k5947l0562l1079k9153
59385I22523k6018k2201j8179j4427j1157q565o966o189n295l609j740r05j403
59372G95869k377k927k941k783k587k069r32N25J423J298R69J614L130M235M458
59357G96905M835O146P627Q353Q841J0164J2174J3885J5058J6205J7370J8128
$$ plain form
59345 935691 954294 973608 993650 1013656 1032809 1051044 1068585 1084999 1099223 1110188 1117036 1119145
59333 1119145 1116480 1109719 1099620 1086397 1069985 1050571 1028698 1005192 981278 958280 936785 916379
59321 916379 896477 877052 858405 840820 824866 811390 800609 791492 782619 773395 764097 755187
59309 755187 747113 740337 734862 729934 724801 719707 715708 713653 713698 715548 718743 722984 728699 737041 748704
59294 748704 762827 777413 790566 800745 806201 805306 797900 785797 771582 757123 743380 731142
59282 731142 721325 714483 710366 708274 707905 709681 714150 721256 730442 741343 753992 768354 784046
59269 784046 800623 817787 835221 852480 869084 884387 897429 907442 914527 919250 921470 920249
59257 920249 915219 907297 897724 887093 875875 865171 856098 848715 842322 836625 832058 829134 828042
$$ packed form
59345I35691J8603J9314K0042K0006J9153J8235J7541J6414J4224J0965O848K109
59333A119145k665o761j0099j3223j6412j9414k1873k3506k3914k2998k1495k0406
59321I16379j9902j9425j8647j7585j5954j3476j0781r117q873r224r298q910
59309G55187q074o776n475m928n133n094l999k055M5J850L195M241N715Q342J1663
59294G48704J4123J4586J3153J0179N456q95p406j2103j4215j4459j3743j2238
59282G31142r817o842m117k092l69J776M469P106R186J0901J2649J4362J5692
59269G84046J6577J7164J7434J7259J6604J5303J3042J0013P085M723K220j221
59257I20249n030p922r573j0631j1218j0704r073p383o393n697m567k924j092
$$ plain form
59244 828042 828729 830836 833688 836843 840613 845592 851790 858658 865807 873186 880509 887021 891978 895094
59230 895094 896437 896098 894067 890307 884887 878013 869871 860489 849920 838422 826228 813254 799467
59217 799467 785485 772190 759757 747704 736050 725725 717493 711150 706172 702467 699962 697995 695837
59204 695837 693468 691355 689741 688632 688147 688374 689123 690162 691458 692976 694690 696945 700190 704000 707164
59189 707164 709243 711364 714800 719438 724367 729283 734367 739297 743363 746322 748334 749441 749934 750836 752973
59174 752973 755743 757798 758833 759757 761153 762646 763946 765627 768505 772864 778463 784698 790537 794878
59160 794878 797280 798088 797773 796439 793874 789721 783694 775916 766881 756786 745270 732296 718886 706335
59146 706335 694983 684350 674190 664666 655762 647250 639192 631837 625194 619288 614475 610816 607508
$$ packed form
59244H28042O87K107K852L155L770M979O198O868P149P379P323O512M957L116
59230H95094J343l39k031l760n420o874q142r382j0569j1498j2194j2974j3787
59217G99467j3982j3295j2433j2053j1654j0325q232o343m978l705k505j967k158
59204F95837k369k113j614j109m85K27P49J039J296J518J714K255L245L810L164
59189G07164K079K121L436M638M929M916N084M930M066K959K012J107M93R02K137
59174G52973K770K055J035R24J396J493J300J681K878M359N599O235N839M341
59160G94878K402Q08l15j334k565m153o027p778r035j0095j1516j2974j3410j2551
59146G06335j1352j0633j0160r524q904q512q058p355o643n906m813l659l308
$$ plain form
59133 607508 603853 600476 598590 598193 598117 597767 597740 598591 600154 602360 605704 610447 616145 622456 629680 638125
59117 638125 647492 657282 667258 677221 686839 696035 705076 714035 722561 730329 737314 743558 749156 754544
59103 754544 760137 765518 769534 771505 771936 771906 772122 772632 772947 772304 770268 767241 764039 761029 758101 755414
59087 755414 753514 752644 752445 752426 752239 751444 749550 746427 742299 737317 731525 725109 718239 710851 703091 695663
59071 695663 689147 683259 677479 672017 667292 662873 658110 653584 650630 649332 648265 646456 644411 642905
59057 642905 641989 641600 641967 642761 642870 641703 639910 638245 636555 634552 632728 631759 631544 631498 631240 630502 629018
59040 629018 627100 625737 625487 625759 625727 625427 625423 625880 626584 627529 628941 631031 634084 638464 644301 651511 660270
59023 660270 670853 682810 695051 707020 719085 731405 743223 753740 762893 770731 776763 780582
$$ packed form
59133F07508l655l377j886l97p6l50k7Q51J563K206L344M743N698O311P224Q445
59117F38125R367R790R976R963R618R196R041Q959Q526P768O985O244N598N388
59103G54544N593N381M016J971M31l0K16N10L15o43k036l027l202l010k928k687
59087G55414j900q70j99j9j87p95j894l123m128m982n792o416o870p388p760p428
59071F95663o516n888n780n462m725m419m763m526k954j298j067j809k045j506
59057F42905r16l89L67P94J09j167j793j665j690k003j824r69k15m6k58p38j484
59040F29018j918j363k50K72l2l00mM57P04R45J412K090L053M380N837P210Q759
59023F60270J0583J1957J2241J1969J2065J2320J1818J0517R153P838O032L819
$$ plain form
59011 780582 782435 782576 780720 776888 772141 767720 763909 760466 757663 756108 755918 756875 759158 763197 768924
58996 768924 775734 783001 790240 797001 803073 808549 813426 817450 820635 823413 825938 827774 828670 829032 829199
58981 829199 828919 828113 827520 827917 829210 831002 833566 837577 843353 851018 860935 873206 887199 902231
58967 902231 918303 935421 952693 969027 984357 999297 1013787 1026961 1038139 1047097 1053466 1056710
58955 1056710 1056773 1054057 1048702 1040395 1028846 1014024 996129 975917 954846 934262 914517 895341
58943 895341 876835 859574 843994 830376 819164 810549 803847 797985 792591 788036 784589 782246 781219
58930 781219 781742 783287 784701 785354 785574 785815 785923 785436 784229 782706 781586 781415 781915 781948 780621 778447 776975
58913 776975 777251 779024 781381 783649 785674 787773 790611 794771 800303 806907 814585 823830 835122 848542
$$ packed form
59011G80582J853J41j856l832m747m421l811l443k803j555j90R57K283M039N727
58996G68924O810P267P239O761O072N476M877M024L185K778K525J836Q96L62J67
58981H29199k80q06n93L97J293J792K564M011N776P665R917J2271J3993J5032
58967I02231J6072J7118J7272J6334J5330J4940J4490J3174J1178Q958O369L244
58955A056710O3k716n355q307j1549j4822j7895k0212k1071k0584j9745j9176
58943H95341j8506j7261j5580j3618j1212q615o702n862n394m555l447k343j027
58930G81219N23J545J414O53K20K41J08m87j207j523j120j71N00L3j327k174j472
58913G76975K76J773K357K268K025K099K838M160N532O604P678R245J1292J3420
$$ plain form
58899 848542 863927 881087 899713 919204 938770 957770 975979 993510 1010443 1026739 1042784
58888 1042784 1059714 1078576 1099130 1120108 1140727 1161208 1181506 1200359 1216180 1228351 1237023
58877 1237023 1242184 1243669 1241736 1236952 1229602 1219681 1207258 1192518 1175791 1157961 1140405 1124078
58865 1124078 1109052 1095357 1083599 1074053 1065659 1056840 1047070 1036861 1026499 1015628 1003941 991484
58853 991484 978258 964224 949725 935373 921555 908490 896529 885797 875726 865595 855449
58842 855449 845876 836967 828170 819151 810182 801554 793080 784362 775292 766333 758336 751802 746166 740326
58828 740326 734206 729237 726740 726375 726771 727171 727715 728677 730361 733437 738374 744659 751341 758160 765374
58813 765374 772708 779392 785129 790115 794160 796674 797615 797698 797567 797318 796735 795342 792420 787763 782311 777230
$$ packed form
58899H48542J5385J7160J8626J9491J9566J9000J8209J7531J6933J6296J6045
58888A042784J6930J8862K0554K0978K0619K0481K0298J8853J5821J2171Q672
58877A237023N161J485j933m784p350r921j2423j4740j6727j7830j7556j6327
58865A124078j5026j3695j1758r546q394q819r770j0209j0362j0871j1687j2457
58853I91484j3226j4034j4499j4352j3818j3065j1961j0732j0071j0131j0146
58842H55449r573q909q797r019q969q628q474q718r070q959p997o534n636n840
58828G40326o120m969k497l65L96M00N44R62J684L076M937O285O682O819P214
58813G65374P334O684N737M986M045K514R41Q3j31k49n83j393k922m657n452n081
$$ plain form
58797 777230 772478 767137 760991 754727 748562 741764 733908 725703 718204 711888 706805 702963 700257 698531
58783 698531 697951 698888 701360 705158 710411 717275 724971 731997 737540 741994 745749 748207 748352 745713 740368
58768 740368 732553 722831 712243 701822 691973 682524 673289 664499 656825 650886 646606 643320 640757 639541
58754 639541 640211 642098 643953 645501 647603 650834 654644 658075 660738 662940 665342 668561 672715 677354
58740 677354 682160 687493 693768 700568 707073 713155 719291 725546 731478 737016 742613 748446 754247 760025
58726 760025 766180 772762 779265 785385 791439 797926 805209 813622 823253 833620 844209 855280 867497
58713 867497 880696 893698 905366 915275 923406 929930 935164 938957 940124 937284 930282 920041 907106
58700 907106 891312 872859 852657 831334 808815 785200 761260 737842 715566 695298 678028
$$ packed form
58797G77230m752n341o146o264o165o798p856q205p499o316n083l842k706j726
58783F98531n80R37K472L798N253O864P696P026N543M454L755K458J45k639n345
58768G40368p815r722j0588j0421r849r449r235q790p674n939m280l286k563j216
58754F39541O70J887J855J548K102L231L810L431K663K202K402L219M154M639
58740F77354M806N333O275O800O505O082O136O255N932N538N597N833N801N778
58726G60025O155O582O503O120O054O487P283Q413R631J0367J0589J1071J2217
58713H67497J3199J3002J1668R909Q131O524N234L793J167k840p002j0241j2935
58700I07106j5794j8453k0202k1323k2519k3615k3940k3418k2276k0268j7270
$$ plain form
58689 678028 663916 652139 641962 633262 625912 619493 613877 609270 605419 601524 597221 592858 588646
58676 588646 584472 580802 578749 578667 579569 580509 581751 584000 587208 590932 595385 601419 609620 619853 631408
58661 631408 643294 654540 664371 671978 676367 677003 674526 670186 664631 657869 650246 642545 635045 627351
58647 627351 619323 611388 603901 597048 591379 587418 584603 581725 578719 577018 577686 580159 583159 585936
58633 585936 588240 590073 592002 594823 598399 601544 603464 604424 604756 604213 602837 601392 600354 599350 598244
58618 598244 597902 599187 601981 605797 610584 616289 622412 628711 635602 643222 650801 657573 663574 668867
58604 668867 672807 674874 675620 675928 675878 675054 673562 671942 670397 668676 666484 663662 660399 657505 655905
58589 655905 655586 655734 656197 658064 662387 669148 677872 688352 700216 712634 725111 737811 750508
$$ packed form
58689F78028j4112j1777j0177q700p350o419n616m607l851l895m303m363m212
58676E88646m174l670k053q2R02R40J242K249L208L724M453O034Q201J0233J1555
58661F31408J1886J1246R831P607M389O36k477m340n555o762p623p701p500p694
58647F27351q028p935p487o853n669l961k815k878l006j701O68K473L000K777
58633E85936K304J833J929K821L576L145J920R60L32n43j376j445j038j004j106
58618E98244l42J285K794L816M787N705O123O299O891P620P579O772O001N293
58604F68867L940K067P46L08n0q24j492j620j545j721k192k822l263k894j600
58589F55905l19J48M63J867M323O761Q724J0480J1864J2418J2477J2700J2697
$$ plain form
58576 750508 762071 771738 780177 788558 797286 806364 816280 827692 840879 856292 875029 897888 924353
58563 924353 953254 984037 1016744 1051215 1086912 1123090 1158469 1191120 1219267 1241899 1258378
58552 1258378 1268101 1271043 1268037 1260073 1247945 1232994 1217441 1203314 1191514 1182145 1174851 1168283 1160140
58539 1160140 1148603 1133248 1114223 1091433 1065146 1036545 1006902 976861 947154 919122 893769
58528 893769 871069 850957 834162 821168 811105 802610 795279 789379 784750 780883 777668 775207 773149
58515 773149 770842 767859 764099 759829 755927 753302 751727 750056 747908 746141 745231 744378 742913 741454 740817
58500 740817 740811 740997 741655 743043 744563 745603 746349 746973 746987 746341 746225 747720 750466 753641 757416 762505 769185
58483 769185 777674 788600 802041 817030 832993 850725 870884 892511 914171 935522 956452 975558
$$ packed form
58576G50508J1563R667Q439Q381Q728R078R916J1412J3187J5413J8737K2859K6465
58563I24353K8901L0783L2707L4471L5697L6178L5379L2651K8147K2632J6479
58552A258378R723K942l006p964j2128j4951j5553j4127j1800r369p294o568q143
58539A160140j1537j5355j9025k2790k6287k8601k9643l0041k9707k8032k5353
58528H93769k2700k0112j6795j2994j0063q495p331n900m629l867l215k461k058
58515G73149k307k983l760m270l902k625j575j671k148j767r10q53j465j459o37
58500G40817oJ86O58J388J520J040P46O24J4o46j16J495K746L175L775N089O680
58483G69185Q489J0926J3441J4989J5963J7732K0159K1627K1660K1351K0930J9106
$$ plain form
58471 975558 990865 1001383 1006897 1007112 1002297 993940 983472 971141 957327 943999 933411 926079 921414
58458 921414 919511 920830 924869 930813 938995 950226 964134 979480 995568 1011915 1027017 1038845
58446 1038845 1046167 1048269 1044119 1033324 1017472 999095 979692 959881 940771 923674 908924 896343
58434 896343 886405 879614 875304 872436 871125 872066 875036 879375 885405 893899 904558 916369 928940 942087
58420 942087 954560 964625 971609 975675 976614 974115 968666 960965 951060 939281 927173 916101 905734
58407 905734 895282 885326 876827 869220 861312 853384 846623 841109 836154 832039 829625 828685 828352 828703 830279
58392 830279 832620 834932 837550 841061 844615 846956 848549 850871 854170 857713 861606 866489 872049 877717
58378 877717 884244 892648 902203 911403 920315 929923 939764 948348 955521 962457 969713 977183 985357 994677
$$ packed form
58471I75558J5307J0518N514K15m815q357j0468j2331j3814j3328j0588p332m665
58458I21414j903J319M039N944Q182J1231J3908J5346J6088J6347J5102J1828
58446A038845P322K102m150j0795j5852j8377j9403j9811j9110j7097j4750j2581
58434H96343r938o791m310k868j311R41K970M339O030Q494J0659J1811J2571J3147
58420I42087J2473J0065O984M066R39k499n449p701r905j1779j2108j1072j0367
58407I05734j0452r956q499p607p908p928o761n514m955m115k414r40l33L51J576
58392H30279K341K312K618L511L554K341J593K322L299L543L893M883N560N668
58378H77717O527Q404R555R200Q912R608R841Q584P173O936P256P470Q174R320
$$ plain form
58364 994677 1004304 1013497 1023463 1035767 1049808 1064102 1079114 1096264 1114844 1132520 1148237 1162072
58352 1162072 1172954 1179493 1182642 1184697 1185890 1184754 1181619 1178893 1177922 1178199 1179622 1182871 1187582 1192757
58338 1192757 1198921 1207512 1218389 1230428 1244076 1260551 1278962 1297158 1315109 1334408 1354665 1373597
58326 1373597 1390630 1407210 1423371 1437065 1447184 1454476 1459387 1461807 1462940 1464598 1466706 1468215 1470043
58313 1470043 1474043 1479543 1484312 1488684 1495256 1504732 1515608 1527687 1542071 1557764 1572303 1585976
58301 1585976 1601552 1619654 1638216 1656625 1676255 1696633 1715376 1732463 1750482 1770101 1789516
58290 1789516 1808927 1831151 1856876 1883490 1909591 1936618 1965197 1993985 2022970 2053862 2086455
58279 2086455 2118694 2150947 2185954 2224049 2262919 2302529 2345551 2392318 2440356 2489524 2542412
$$ packed form
58364I94677R627R193R966J2304J4041J4294J5012J7150J8580J7676J5717J3835
58352A162072J0882O539L149K055J193j136l135k726r71K77J423L249M711N175
58338A192757O164Q591J0877J2039J3648J6475J8411J8196J7951J9299K0257J8932
58326A373597J7033J6580J6161J3694J0119P292M911K420J133J658K108J509J828
58313A470043M000N500M769M372O572R476J0876J2079J4384J5693J4539J3673
58301A585976J5576J8102J8562J8409J9630K0378J8743J7087J8019J9619J9415
58290A789516J9411K2224K5725K6614K6101K7027K8579K8788K8985L0892L2593
58279B086455L2239L2253L5007L8095L8870L9610M3022M6767M8038M9168N2888
$$ plain form
58268 2542412 2598854 2655443 2711480 2769983 2831725 2894001 2956480 3022488 3092977 3165081 3238135
58257 3238135 3315090 3396262 3477856 3558544 3641334 3726992 3812033 3895505 3981435 4072283 4166308
58246 4166308 4263563 4367805 4480076 4597098 4718348 4847805 4986482 5130685 5280150 5440101
58236 5440101 5612484 5793307 5981649 6182925 6399978 6629576 6871321 7131059 7411611
58227 7411611 7709216 8023291 8360518 8725216 9115382 9532414 9984544 10476315 11005571
58218 11005571 11575409 12197676 12880116 13622751 14432182 15326005 16317701 17412389 18624457
58209 18624457 19984194 21520654 23256348 25228695 27500120 30140234 33221053 36842871
58201 36842871 41144560 46277547 52394580 59677896 68352062 78656681 90841117 105202202
$$ packed form
58268B542412N6442N6589N6037N8503O1742O2276O2479O6008P0489P2104P3054
58257C238135P6955Q1172Q1594Q0688Q2790Q5658Q5041Q3472Q5930R0848R4025
58246D166308R7255J04242J12271J17022J21250J29457J38677J44203J49465J59951
58236E440101J72383J80823J88342K01276K17053K29598K41745K59738K80552
58227G411611K97605L14075L37227L64698L90166M17032M52130M91771N29256
58218A1005571N69838O22267O82440P42635Q09431Q93823R91696J094688J212068
58209A8624457J359737J536460J735694J972347K271425K640114L080819L621818
58201C6842871M301689N132987O117033P283316Q674166J0304619J2184436J4361085
$$ plain form
58193 105202202 122083575 141816810 164720870 191179291 221572282 255900748 293311621
58186 293311621 331861142 368548824 399494143 420432353 427834568 420338684 399483646
58179 399483646 369066828 333595740 296934823 261739033 229465706 200592288 174946966
58172 174946966 152126071 131812513 113843568 98116544 84510916 72872526 63010889
58165 63010889 54703274 47724189 41872764 36968194 32839698 29340389 26360558 23813863
58157 23813863 21620830 19715999 18056849 16610642 15340280 14212146 13206466 12308389
58149 12308389 11497554 10756059 10077592 9458815 8889682 8361071 7873715 7430304 7025645
58140 7025645 6652787 6311726 6003608 5722640 5461622 5219666 4997019 4787928 4585953
$$ packed form
58193A05202202J6881373J9733235K2904060K6458421L0392991L4328466L7410873
58186B93311621L8549521L6687682L0945319K0938210P402215p495884k0855038
58179C99483646l0416818l5471088l6660917l5195790l2273327k8873418k5645322
58172A74946966k2820895k0313558j7968945j5727024j3605628j1638390r861637
58165F3010889q307615o979085n851425m904570m128496l499309k979831k546695
58157B3813863k193033j904831j659150j446207j270362j128134j005680q98077
58149A2308389q10835p41495o78467o18777n69133n28611m87356m43411m04659
58140G025645l72858l41061l08118k80968k61018k41956k22647k09091k01975
$$ plain form
58131 4585953 4391301 4206360 4029101 3857306 3694178 3543241 3402182 3267628 3141366
58122 3141366 3025959 2918849 2816729 2721447 2635659 2556543 2479557 2404844 2334630 2267899 2202891
58111 2202891 2141471 2085849 2033995 1983068 1934224 1889499 1847078 1804195 1761676 1721219 1681224
58100 1681224 1639740 1598659 1560715 1525125 1490217 1457445 1428609 1401898 1374855 1348585 1325070
58089 1325070 1303092 1280894 1260085 1242694 1226841 1209501 1191174 1173705 1155877 1135493 1113770
58078 1113770 1093432 1074146 1053838 1032907 1013246 994582 975541 956967 940642 925930 911008
58067 911008 896118 882548 869808 856827 844507 834124 824726 814942 805725 798340 791372 782731 772990
58054 772990 763788 754646 744445 734300 725739 717623 708140 698365 690555 684367 678102 672314 668637 666099
$$ packed form
58131D585953j94652j84941j77259j71795j63128j50937j41059j34554j26262
58122C141366j15407j07110j02120r5282q5788p9116p6986p4713p0214o6731o5008
58111B202891o1420n5622n1854n0927m8844m4725m2421m2883m2519m0457l9995
58100A681224m1484m1081l7944l5590l4908l2772k8836k6711k7043k6270k3515
58089A325070k1978k2198k0809j7391j5853j7340j8327j7469j7828k0384k1723
58078A113770k0338j9286k0308k0931j9661j8664j9041j8574j6325j4712j4922
58067I11008j4890j3570j2740j2981j2320j0383r398r784r217p385o968q641r741
58054G72990r202r142j0201j0145q561q116r483r775p810o188o265n788l677k538
$$ plain form
58040 666099 662124 656503 651116 646372 641063 635275 630393 626432 621994 616558 610483 603300 594298 584196
58026 584196 574122 563724 552431 541565 532883 525968 519365 513221 508415 504132 498909 493267 488837
58013 488837 485640 482566 479671 477610 475721 473065 470515 469385 468990 467936 466757 466641 466655 465158 463123
57998 463123 462979 464661 465731 465059 463592 461851 459577 457761 458110 460295 462223 463173 464288 465893 466800
57983 466800 466545 466050 465693 464794 463309 462140 461457 460434 458782 457012 455211 453159 451468 450934 451010 450595
57967 450595 449999 450347 451442 452103 452305 452950 453766 453561 452507 452096 452685 452954 452011 450254 448000 444949 441283
57950 441283 437790 434705 431649 428713 426372 424598 423294 423115 424461 426258 427389 428747 432057 437172
57936 437172 442509 447790 454224 462110 470270 477916 485173 491752 496893 500714 503880 505907 505492 502538
$$ packed form
58040F66099l975n621n387m744n309n788m882l961m438n436o075p183r002j0102
58026E84196j0074j0398j1293j0866q682o915o603o144m806m283n223n642m430
58013D88837l197l074k895k061j889k656k550j130l95j054j179j16J4j497k035
57998D63123j44J682J070o72j467j741k274j816L49K185J928R50J115J605R07
57983D66800k55m95l57q99j485j169o83j023j652j770j801k052j691n34P6m15
57967D50595n96L48J095O61K02O45Q16k05j054m11N89K69r43j757k254l051l666
57950D41283l493l085l056k936k341j774j304j79J346J797J131J358L310N115
57936D37172N337N281O434P886Q160P646P257O579N141L821L166K027m15k954
$$ plain form
57922 502538 498127 492504 484903 475495 465742 456574 447769 439270 431555 424568 417747 411277 405908 401571
57908 401571 397624 394375 392850 393062 393961 395001 396292 397415 397657 397272 396922 396135 394046 391417 390078 390427
57892 390427 391346 392452 394390 396929 398909 400495 403418 408442 414298 419629 424387 428877 433055 437250
57878 437250 442064 447112 451244 454295 457206 460190 462347 463326 463756 463743 462535 460181 457996 456801 455958
57863 455958 454487 451962 448190 443396 438880 436059 434730 433714 433119 434243 437167 440390 443158 446248
57849 446248 449954 453201 455348 457198 459464 461695 463340 464432 464713 463635 461724 460411 459904 458872 456839
57834 456839 455231 455245 456277 457376 458763 460929 463482 465931 468563 471688 474950 477953 480530 481977 481328
57819 481328 478979 476724 475481 474264 472034 469234 466684 464204 461210 457625 453352 447848 440940 433252
$$ packed form
57922E02538m411n623p601r408r753r168q805q499p715o987o821o470n369m337
57908D01571l947l249j525K12Q99J040J291J123K42l85l50p87k089k629j339L49
57892C90427R19J106J938K539J980J586K923N024N856N331M758M490M178M195
57878D37250M814N048M132L051K911K984K157R79M30j3j208k354k185j195q43
57863D55958j471k525l772m794m516k821j329j016n95J124K924L223K768L090
57849D46248L706L247K147J850K266K231J645J092K81j078j911j313n07j032k033
57834D56839j608J4J032J099J387K166K553K449K632L125L262L003K577J447o49
57819D81328k349k255j243j217k230k800k550k480k994l585m273n504o908p688
$$ plain form
57805 433252 425319 417174 409038 401287 393427 384569 375303 367586 362142 357483 352327 347414 343982 341836
57791 341836 340095 338663 337829 337405 337241 337663 338555 339075 339189 340405 343872 348661 353012 356544 360188 364582
57775 364582 369487 374383 378896 383017 387308 392377 397885 402734 406352 408922 410305 410007 408505 407200
57761 407200 406540 405514 403563 401572 400311 399312 398199 397745 398597 400109 401501 403130 405622 408783 412290
57746 412290 416497 421510 426415 430360 433564 436439 438663 439921 440575 440777 439958 438075 436270 435341 434595
57731 434595 433219 431700 430817 430277 429444 428430 427345 425494 422606 419949 418896 419087 419176 418694 418014 417262
57715 417262 416561 416684 418187 420397 422375 424261 426547 428666 429624 429521 429279 429252 429276 429712 431238 433842 436995
57698 436995 440583 444786 449395 454068 458874 463717 467634 469524 469148 466672 461832 454533 445865 437446
$$ packed form
57805D33252p933q145q136p751p860q858r266p717n444m659n156m913l432k146
57791C41836j741j432q34m24j64M22Q92N20J14J216L467M789M351L532L644M394
57775C64582M905M896M513M121M291N069N508M849L618K570J383k98j502j305
57761D07200o60j026j951j991j261r99j113m54Q52J512J392J629K492L161L507
57746D12290M207N013M905L945L204K875K224J258O54K02q19j883j805r29p46
57731D34595j376j519q83n40q33j014j085j851k888k657j053J91Q9m82o80p52
57715D17262p01J23J503K210J978J886K286K119R58j03k42k7K4M36J526K604L153
57698D36995L588M203M609M673M806M843L917J890l76k476m840p299q668q419
$$ plain form
57684 437446 429997 423272 417076 411617 407190 404233 403379 404952 408857 415386 425396 439237 456393 476924
57670 476924 502231 533536 570497 612242 658648 709065 760200 806352 841415 860141 858929 837419
57658 837419 799368 750858 697553 643867 593460 548804 510508 478167 451643 430698 414042
57647 414042 400029 388049 378281 370560 364439 359833 356536 353652 350576 348004 346800 346436 345782 344904
57633 344904 344746 345347 345755 345511 344986 344435 343855 343602 344043 344723 344880 344559 344263 343878 342994 341938 341333 340947
57615 340947 340112 338957 338067 337277 336030 334633 333850 333443 332395 330512 328596 327135 326009 325358 325483 325911
57599 325911 325707 324691 323308 321512 319000 316391 314845 314446 314161 313413 312443 311163 309023 306225 303789
57584 303789 302101 300503 298613 296950 295940 295327 294891 294878 295365 295945 296263 296223 295637 294405 292983 291945 291159
$$ packed form
57684D37446p449o725o196n459m427k957q54J573L905O529J0010J3841J7156K0531
57670D76924K5307L1305L6961M1745M6406N0417N1135M6152L5063J8726j212k1510
57658H37419l8051m8510n3305n3686n0407m4656l8296l2341k6524k0945j6656
57647D14042j4013j1980r768p721o121m606l297k884l076k572j204l64o54q78
57633C44904j58O01M08k44n25n51n80k53M41O80J57l21k96l85q84j056o05l86
57615C40947q35j155q90p90j247j397p83m07j048j883j916j461j126o51J25M28
57599C25911k04j016j383j796k512k609j546l99k85p48r70j280k140k798k436
57584C03789j688j598j890j663j010o13m36j3M87N80L18m0n86j232j422j038p86
$$ plain form
57567 291159 290152 289019 288100 287076 285490 283888 283240 283344 283085 282231 281707 282013 282724 283703 285522 288377
57551 288377 291737 295335 299417 303748 307501 310337 312558 314014 314079 312935 311689 310894 310169 309620 310238 312328
57535 312328 314752 316441 317602 318735 319512 319425 318723 317921 317095 316381 316483 317887 320055 322002 323329 324237
57519 324237 324996 325828 326895 328062 329051 330045 331673 334159 336999 339670 342189 344783 347514 350358 353170
57504 353170 355517 357024 357916 358647 359144 359017 358414 357884 357507 356960 356333 355980 355642 354729 353440 352564 352169 351630
57486 351630 351032 351321 352742 354345 355363 356058 356730 357027 356722 356265 356043 355915 355842 356120 356663 357013 357282 358037
57468 358037 358968 358913 357741 356971 357852 359878 361868 363414 364564 365184 365573 366766 369208 371977 374199 376419
57452 376419 379513 382975 385490 386762 387709 389132 391118 393522 396174 398700 400903 403214 406255 410070
$$ packed form
57567B91159j007j133r19j024j586j602o48J04k59q54n24L06P11R79J819K855
57551B88377L360L598M082M331L753K836K221J456O5j144j246p95p25n49O18K090
57535C12328K424J689J161J133P77q7p02q02q26p14J02J404K168J947J327R08
57519C24237P59Q32J067J167R89R94J628K486K840K671K519K594K731K844K812
57504C53170K347J507Q92P31M97j27o03n30l77n47o27l53l38r13j289q76l95n39
57486C51630n98K89J421J603J018O95O72K97l05m57k22j28p3K78N43L50K69P55
57468C58037R31n5j172p70Q81K026J990J546J150O20L89J193K442K769K222K220
57452C76419L094L462K515J272R47J423J986K404K652K526K203K311L041L815
$$ plain form
57438 410070 414199 418277 422136 425648 428906 432277 435907 439465 442761 446181 450087 454104 457463 459845
57424 459845 461593 463308 465466 468174 471140 474134 477449 481432 485649 489176 491786 494119 496609 499104
57410 499104 501721 505093 509391 513970 518434 523163 528277 532951 536449 539131 541810 544814 548260 552514
57396 552514 557618 562900 567871 573001 578927 585381 591626 597476 603234 609055 615052 621632 629046 636869
57382 636869 644487 651808 658992 665836 671967 677392 682384 687110 691746 696677 702136 707836 713217 717828
57368 717828 721434 724202 726884 730276 734439 738983 744060 750171 756973 763402 769318 775859 783631 791682
57354 791682 799016 806099 813958 822656 831634 840818 850408 860133 869619 879048 888701 898368 907896 917638
57340 917638 927615 937018 945418 953750 963018 972707 981673 990080 999190 1009531 1020494 1031579 1042827
$$ packed form
57438D10070M129M078L859L512L258L371L630L558L296L420L906M017L359K382
57424D59845J748J715K158K708K966K994L315L983M217L527K610K333K490K495
57410D99104K617L372M298M579M464M729N114M674L498K682K679L004L446M254
57396E52514N104N282M971N130N926O454O245N850N758N821N997O580P414P823
57382F36869P618P321P184O844O131N425M992M726M636M931N459N700N381M611
57368G17828L606K768K682L392M163M544N077O111O802O429N916O541P772Q051
57354G91682P334P083P859Q698Q978R184R590R725R486R429R653R667R528R742
57340I17638R977R403Q400Q332R268R689Q966Q407R110J0341J0963J1085J1248
$$ plain form
57327 1042827 1054019 1064619 1074731 1085237 1096769 1109163 1122000 1135040 1148079 1160981 1173895
57316 1173895 1187079 1200614 1214678 1229693 1245617 1261469 1276352 1290748 1305987 1322579 1339847
57305 1339847 1357171 1374699 1392694 1410921 1428979 1446738 1464252 1481596 1498971 1516698 1535022
57294 1535022 1554067 1573988 1594913 1616790 1639349 1662115 1684409 1705695 1726121 1746428 1767212
57283 1767212 1788627 1810839 1834217 1858783 1883990 1909333 1934723 1960042 1984965 2009611 2034769
57272 2034769 2061026 2088120 2115402 2142401 2168724 2194184 2219382 2245328 2272054 2298522 2324409
57261 2324409 2350941 2379184 2408485 2437627 2466651 2496443 2527205 2558520 2590438 2623338 2657060
57250 2657060 2691168 2725755 2760957 2796064 2830188 2863587 2897376 2932104 2967497 3003363 3039798
$$ packed form
57327A042827J1192J0600J0112J0506J1532J2394J2837J3040J3039J2902J2914
57316A173895J3184J3535J4064J5015J5924J5852J4883J4396J5239J6592J7268
57305A339847J7324J7528J7995J8227J8058J7759J7514J7344J7375J7727J8324
57294A535022J9045J9921K0925K1877K2559K2766K2294K1286K0426K0307K0784
57283A767212K1415K2212K3378K4566K5207K5343K5390K5319K4923K4646K5158
57272B034769K6257K7094K7282K6999K6323K5460K5198K5946K6726K6468K5887
57261B324409K6532K8243K9301K9142K9024K9792L0762L1315L1918L2900L3722
57250B657060L4108L4587L5202L5107L4124L3399L3789L4728L5393L5866L6435
$$ plain form
57239 3039798 3076661 3113777 3151530 3190475 3230469 3270923 3311731 3353179 3395257 3437856 3481361
57228 3481361 3526188 3571962 3617946 3664036 3710429 3756548 3801224 3843877 3884742 3924122 3962227
57217 3962227 3999569 4036786 4074162 4111915 4150601 4190529 4231292 4272709 4315651 4360898 4407684
57206 4407684 4454544 4501274 4548787 4597311 4646089 4694755 4743701 4793045 4842512 4892482 4943942
57195 4943942 4997100 5051097 5105176 5159065 5212001 5262609 5310252 5355627 5399637 5442522 5484428
57184 5484428 5525987 5567779 5609742 5651413 5692268 5731708 5769310 5805251 5839966 5873399 5905156
57173 5905156 5935314 5964378 5992417 6019011 6044160 6068625 6093236 6118298 6143522 6167991 6190477
57162 6190477 6210552 6229229 6247726 6265744 6281698 6294365 6303430 6308752 6310167 6308017 6302866 6294693
$$ packed form
57239C039798L6863L7116L7753L8945L9994M0454M0808M1448M2078M2599M3505
57228C481361M4827M5774M5984M6090M6393M6119M4676M2653M0865L9380L8105
57217C962227L7342L7217L7376L7753L8686L9928M0763M1417M2942M5247M6786
57206D407684M6860M6730M7513M8524M8778M8666M8946M9344M9467M9970N1460
57195D943942N3158N3997N4079N3889N2936N0608M7643M5375M4010M2885M1906
57184E484428M1559M1792M1963M1671M0855L9440L7602L5941L4715L3433L1757
57173E905156L0158K9064K8039K6594K5149K4465K4611K5062K5224K4469K2486
57162F190477K0075J8677J8497J8018J5954J2667R065N322J415k150n151q173
$$ plain form
57150 6294693 6283211 6268857 6252479 6234149 6213333 6190252 6166189 6142478 6120140 6100253 6083511
57139 6083511 6069425 6057124 6046934 6040040 6036617 6035449 6035358 6035700 6035418 6033010 6027775 6019908 6009237 5995269
57125 5995269 5978802 5962116 5947146 5934596 5925016 5919126 5916383 5914652 5912214 5909217 5906834 5906482 5910843
57112 5910843 5924510 5952402 5997902 6062831 6148202 6254479 6382539 6536053 6723127 6955518
57102 6955518 7246933 7612284 8067298 8627586 9307837 10121675 11081790 12201039 13495777
57093 13495777 14989252 16710438 18687033 20936314 23457066 26223436 29182842 32260054
57085 32260054 35362792 38379882 41173311 43580941 45444247 46652620 47176541 47066744
57077 47066744 46419831 45332346 43870898 42072523 39966404 37593994 35012287 32284823
$$ packed form
57150F294693j1482j4354j6378j8330k0816k3081k4063k3711k2338j9887j6742
57139F083511j4086j2301j0190o894l423j168r1L42k82k408n235p867j0671j3968
57125E995269j6467j6686j4970j2550r580n890k743j731k438k997k383l52M361
57112E910843J3667K7892M5500O4929Q5371J06277J28060J53514J87074K32391
57102F955518K91415L65351M55014N60288O80251Q13838R60115J119249J294738
57093A3495777J493475J721186J976595K249281K520752K766370K959406L077212
57085C2260054L102738L017090K793429K407630J863306J208373N23921j09797
57077D7066744o46913j087485j461448j798375k106119k372410k581707k727464
$$ plain form
57069 32284823 29474131 26641180 23846836 21150181 18604133 16250731 14117631 12217151
57061 12217151 10548504 9101391 7858576 6797876 5895140 5127435 4474375 3917863 3442202
57052 3442202 3034563 2684402 2382280 2119815 1890484 1689527 1512958 1357301 1220086
57043 1220086 1099657 994195 901430 819365 746711 682462 625517 574883 529996 490738 457304
57032 457304 429982 408905 394065 385560 383547 388007 399050 417587 445135 482529 528725 580269
57020 580269 630884 671760 694097 692891 668450 624448 565635 497591 426733 358580 296046 240125
57008 240125 191564 150896 117527 90180 68139 51193 38589 29086 21936 16953 13608 10840
56996 10840 7815 4308 436 -3356 -6168 -7043 -5662 -2253 2953 9895 18457 28522 39913 52017
$$ packed form
57069C2284823k810692k832951k794344k696655k546048k353402k133100j900480
57061A2217151j668647j447113j242815j060700r02736p67705o53060n56512m75661
57052C442202m07639l50161l02122k62465k29331k00957j76569j55657j37215
57043A220086j20429j05462r2765q2065p2654o4249n6945n0634m4887l9258l3434
57032D57304k7322k1077j4840q505k013M460J1043J8537K7548L7394M6196N1544
57020E80269N0615M0876K2337j206k4441m4002n8813o8044p0858o8153o2534n5921
57008B40125m8561m0668l3369k7347k2041j6946j2604r503p150m983l345k768
56996A0840l025l507D36c356k812q75J381b253B953O942Q562J0065J1391J2104
$$ plain form
56982 52017 63746 74116 82315 87002 86403 79927 69101 56187 42398 28158 14416 2542 -6852
56968 -13973 -18764 -20653 -19372 -15251 -8651 369 11821 25708 42209 61463 83235 106904 131383
56955 131383 154575 173366 184850 187639 181926 168865 150351 128842 106593 85183 65964 50401
56943 50401 39349 32499 29138 29136 32727 39909 50659 65288 83946 106250 131867 160757 192123
56930 192123 223686 252577 276228 291800 296041 287324 267549 240866 210825 179603 149101 121050
56918 121050 96011 73623 53930 37428 23896 12382 2464 -5553 -11810 -17136 -21915 -25625 -27824
56905 -27824 -28852 -29318 -29494 -29351 -28645 -26940 -24111 -20694 -17087 -12664 -6421 1699 11130 22107 35684
56890 35684 52192 70761 90727 112573 136922 163120 189122 212279 229991 240259 242310 236866
$$ packed form
56982E2017J1729J0370Q199M687n99o476j0826j2914j3789j4240j3742B542f852
56968a3973m791j889J281M121O600C69J1452J3887J6501J9254K1772K3669K4479
56955A31383K3192J8791J1484K789n713j3061j8514k1509k2249k1410j9219j5563
56943E0401j1052o850l361kL591P182J0750J4629J8658K2304K5617K8890L1366
56930A92123L1563K8891K3651J5572M241q717j9775k6683l0041l1222l0502k8051
56918A21050k5039k2388j9693j6502j3532j1514B464e553o257n326m779l710k199
56905b7824j028m66j76J43P06J705K829L417L607M423O243A699R431J0977J3577
56890C5684J6508J8569J9966K1846K4349K6198K6002K3157J7712J0268K051n444
$$ plain form
56878 236866 225805 211528 196260 181530 168379 158065 152033 150908 154190 161409 172971 189289
56866 189289 209929 234553 264028 299602 341454 388938 441393 497137 551877 599491 634570
56855 634570 653603 654606 637624 605872 564994 520603 477076 438043 406232 382441 366043 357029
56843 357029 356557 365349 382901 408832 443889 489045 544530 610251 686062 770696 860595 949851
56831 949851 1030541 1093251 1128956 1132111 1102584 1045232 968328 881772 794684 713133 640023 576914
56819 576914 525124 485177 456595 438936 432223 435958 448794 469953 500272 541064 592322 652307
56807 652307 718039 785213 847751 898095 928503 933094 910140 863145 799318 726551 651533 579642
56795 579642 514839 459001 412181 374086 344875 324492 312102 306626 307308 313612 325251 342501
$$ packed form
56878B36866j1061j4277j5268j4730j3151j0314o032j125L282P219J1562J6318
56866A89289K0640K4624K9475L5574M1852M7484N2455N5744N4740M7614L5079
56855F34570J9033J003j6982l1752m0878m4391m3527l9033l1811k3791j6398r014
56843C57029m72Q792J7552K5931L5057M5156N5485O5721P5811Q4634Q9899Q9256
56831I49851Q0690O2710L5705L155k9527n7352p6904q6556q7088q1551p3110o3109
56819E76914n1790l9947k8582j7659o713L735J2836K1159L0319M0792N1258N9985
56807F52307O5732O7174O2538N0344L0408M591k2954m6995o3827p2767p5018p1891
56795E79642o4803n5838m6820l8095k9211k0383j2390n476O82O304J1639J7250
$$ plain form
56783 342501 365787 394716 427961 463766 499427 530213 550178 554993 543800 518592 482919 441182
56771 441182 397580 354681 313544 275357 241831 213533 189172 167414 148479 133136 121006
56760 121006 110815 101711 93468 85944 79188 73636 69531 66400 63590 60898 58322 55783 53561 52318
56746 52318 52190 52407 52331 52144 51993 51235 49343 46976 45254 44342 43517 42372 41261 40751 41178 42526 44248
56729 44248 45422 45525 44937 44443 44538 45389 47022 49180 51380 53363 55171 56711 57742 58461 59377 60436
56713 60436 61015 61139 61900 64114 67192 69902 71717 72856 73566 73963 74294 74868 75933 77790 80520 83438
56697 83438 85409 86030 85956 85870 85859 86103 87287 89686 92443 94317 94794 94150 93002 92167 92363 93609 95268
56680 95268 96824 98106 98831 98810 98681 99350 100484 100721 99749 98893 99033 99263 98468 97034 95993 95542 95505 96271
$$ packed form
56783C42501K3286K8929L3245L5805L5661L0786J9965M815j1193k5208l5673m1737
56771D41182m3602m2899m1137l8187l3526k8298k4361k1758j8935j5343j2130
56760A21006j0191r104q243p524o756n552m105l131k810k692k576k539k222j243
56746E2318j28K17p6j87j51p58j892k367j722r12q25j145j111n10M27J348J722
56729D4248J174J03n88m94R5Q51J633K158K200J983J808J540J031P19R16J059
56713F0436N79J24P61K214L078K710J815J139P10L97L31N74J065J857K730K918
56697H3438J971O21p4q6j1K44J184K399K757J874M77o44j148q35J96J246J659
56680I5268J556J282P25k1j29O69J134K37r72q56J40K30p95j434j041m51l7P66
$$ plain form
56662 96271 98004 99679 100151 99626 99017 98453 97631 97024 97428 98583 99428 99565 99474 99527 99677 99933 100175 99725 98000
56643 98000 95506 93459 92573 92833 94028 95674 96742 96431 95165 94120 93931 94424 95246 96043 96381 96255 96428
56626 96428 97507 98939 99656 99368 98521 97390 96129 95395 95889 97305 98555 98984 98681 97808 96418 94858
56610 94858 93584 92591 91573 90536 89700 89049 88626 88976 90511 92596 94023 94372 94297 94577 95451 96742 98055
56593 98055 99000 99715 100958 103181 105804 107962 109597 111182 112691 113636 113982 114270 114938 116012 117336 118591
56577 118591 119347 119584 119924 120900 122307 123722 125209 127080 129467 132649 137143 142794 148437 153372 158654
56562 158654 166054 176148 188253 201648 215866 230233 244147 257524 269986 280046 286258 288997
56550 288997 290046 290516 290190 288758 286576 284146 281751 279660 277869 275661 272240 267776 263171 258873 254660
$$ packed form
56662I6271J733J675M72n25o09n64q22o07M04J155Q45J37r1N3J50K56K42m50j725
56643I8000k494k047q86K60J195J646J068l11j266j045j89M93Q22P97L38j26J73
56626I6428J079J432P17k88q47j131j261p34M94J416J250M29l03q73j390j560
56610I4858j274r93j018j037q36o51m23L50J535K085J427L49p5K80Q74J291J313
56593I8055R45P15J243K223K623K158J635J585J509R45L46K88O68J074J324J255
56577A18591P56K37L40R76J407J415J487J871K387L182M494N651N643M935N282
56562A58654P400J0094J2105J3395J4218J4367J3914J3377J2462J0060O212K739
56550B88997J049M70l26j432k182k430k395k091j791k208l421m464m605m298m213
$$ plain form
56535 254660 250351 245919 241041 235411 229398 223671 218315 213001 207720 202542 197039 190923 184994 180422
56521 180422 177265 174689 172412 170832 169840 168728 167361 166328 165759 164923 163259 161041 158874 157170 156076
56506 156076 155238 153809 151453 149131 148018 147937 147806 147364 147289 147724 147956 147629 147158 146799 146366 146009 146204 146831
56488 146831 147239 147365 147833 148841 149969 151145 152662 154100 154479 153856 153627 154715 156408 157542 157951 158232
56472 158232 158788 159699 160943 162259 163147 163340 162977 162303 161598 161289 161562 162011 162268 162693 163682 164615 164555 163847
56454 163847 163860 165142 166922 168500 169945 171269 172166 172912 174363 176589 178528 179542 180380 182016 184254
56439 184254 186025 186493 185540 183751 182210 181671 181722 181290 180036 178622 177580 176784 176146 175927 176125 176345 176446
56422 176446 176600 176601 176033 175262 175373 176860 179151 181559 183853 185721 186663 186746 186667 186756 186682 186336 186192 186533 187047
$$ packed form
56535B54660m309m432m878n630o013n727n356n314n281n178n503o116n929m572
56521A80422l157k576k277j580r92j112j367j033n69q36j664k218k167j704j094
56506A56076q38j429k356k322j113q1j31m42p5M35K32l27m71l59m33l57J95O27
56488A46831M08J26M68J008J128J176J517J438L79o23k29J088J693J134M09K81
56472A58232N56R11J244J316Q88J93l63o74p05l09K73M49K57M25R89R33o0p08
56454A63847J3J282J780J578J445J324Q97P46J451K226J939J014Q38J636K238
56439A84254J771M68r53j789j541n39N1m32j254j414j042p96o38k19J98K20J01
56422A76446J54Jn68p71J11J487K291K408K294J868R42Q3p9Q9p4l46j44L41N14
$$ plain form
56403 187047 187376 187398 186976 186223 185989 187157 189406 191581 193233 194741 195966 196145 195352 194776 195146 195987 196777
56386 196777 197686 198754 199470 199693 199997 200663 201361 202214 204009 206748 209052 209769 209393 209278 210165 211912 213922
56369 213922 215339 215589 215189 215406 216803 218773 220598 222101 223109 223320 223080 223342 224595 226563 229065 232085
56353 232085 234882 236315 236390 236367 237044 238092 239299 241059 243146 244419 244453 244278 244849 245887 246898 248184
56337 248184 250072 252186 254188 256397 259030 261794 264715 268395 272885 277253 280754 283487 285615 287132
56323 287132 288794 291850 296199 300092 302350 303635 304871 305796 305970 305929 306312 306886 307314 307923 308982 310264
56307 310264 312052 315356 320305 325437 329507 332970 336974 342006 348256 356022 364781 373037 379985 386238
56293 386238 392225 397290 401292 405550 410994 416721 421717 426705 432926 440203 447646 455225 463210 471084
$$ packed form
56403A87047L29K2m22p53k34J168K249K175J652J508J225J79p93n76L70Q41P90
56386A96777R09J068P16K23L04O66O98Q53J795K739K304P17l76j15Q87J747K010
56369B13922J417K50m00K17J397J970J825J503J008K11k40K62J253J968K502L020
56353B32085K797J433P5k3O77J048J207J760K087J273L4j75N71J038J011J286
56337B48184J888K114K002K209K633K764K921L680M490M368L501K733K128J517
56323B87132J662L056M349L893K258J285J236R25J74m1L83N74M28O09J059J282
56307C10264J788L304M949N132M070L463M004N032O250P766Q759Q256O948O253
56293C86238N987N065M002M258N444N727M996M988O221P277P443P579P985P874
$$ plain form
56279 471084 478505 486493 496155 506945 517568 528019 539406 552331 566657 582428 599917 619170
56267 619170 640336 663833 689460 716175 743609 772931 805393 841056 879882 922959 971520
56256 971520 1025759 1085786 1152820 1228266 1312555 1406065 1510234 1626533 1755146 1895678 2048150
56245 2048150 2212106 2385743 2567085 2754952 2947470 3140703 3330138 3512553 3684969
56236 3684969 3842812 3980753 4094731 4181775 4238749 4262969 4253785 4212455 4141099 4042830 3921966
56225 3921966 3782774 3628592 3463024 3290857 3116493 2942472 2770708 2603902 2444265
56216 2444265 2292027 2146922 2010214 1883583 1766901 1658776 1558604 1466561 1382318 1305249
56206 1305249 1235127 1171317 1112237 1057016 1006593 961671 920794 882256 846771 816212 790532
$$ packed form
56279D71084P421P988R662J0790J0623J0451J1387J2925J4326J5771J7489J9253
56267F19170K1166K3497K5627K6715K7434K9322L2462L5663L8826M3077M8561
56256I71520N4239O0027O7034P5446Q4289R3510J04169J16299J28613J40532J52472
56245B048150J63956J73637J81342J87867J92518J93233J89435J82415J72416
56236C684969J57843J37941J13978Q7044N6974K4220r184m1330p1356r8269j20864
56225C921966j39192j54182j65568j72167j74364j74021j71764j66806j59637
56216B444265j52238j45105j36708j26631j16682j08125j00172r2043q4243p7069
56206A305249p0122o3810n9080n5221n0423m4922m0877l8538l5485l0559k5680
$$ plain form
56195 790532 767887 747102 728107 710615 694253 679518 666922 655690 644784 634509 625661 618001
56183 618001 611073 605441 601470 597956 593774 589751 587047 584894 581991 578929 577033 575881 574369 573199
56169 573199 573836 575883 577986 580505 584701 589982 594640 598775 603844 609757 615153 620204 626481 634210
56155 634210 642294 650893 661383 673807 686924 700851 717182 736361 757347 780074 805996 835983
56143 835983 869761 907632 950778 999789 1054762 1116609 1186252 1262633 1343390 1427052 1512370
56132 1512370 1595978 1673263 1741651 1801076 1851745 1893955 1929856 1962709 1993967 2022834 2048197
56121 2048197 2068751 2081704 2084124 2075839 2059072 2035576 2006164 1972079 1933859 1889148 1834468 1769280
56109 1769280 1696169 1617723 1536030 1454635 1377678 1306939 1242358 1185107 1137171 1098213 1065950
$$ packed form
56195G90532k2645k0785j8995j7492j6362j4735j2596j1232j0906j0275q848p660
56183F18001o928n632l971l514m182m023k704k153k903l062j896j152j512j170
56169E73199O37K047K103K519M196N281M658M135N069N913N396N051O277P729
56155F34210Q084Q599J0490J2424J3117J3927J6331J9179K0986K2727K5922K9987
56143H35983L3778L7871M3146M9011N4973O1847O9643P6381Q0757Q3662Q5318
56132A512370Q3608P7285O8388N9425N0669M2210L5901L2853L1258K8867K5363
56121B048197K0554J2953K420q285j6767k3496k9412l4085l8220m4711n4680o5188
56109A769280p3111p8446q1693q1395p6957p0739o4581n7251m7936l8958l2263
$$ plain form
56098 1065950 1039464 1019122 1003604 990526 979976 973947 972052 971255 970215 970455 972746 975727 978753
56085 978753 982945 988623 994637 1000794 1008188 1016725 1025164 1033785 1044056 1055649 1066876 1078128 1091506
56072 1091506 1106956 1122184 1136521 1151439 1167217 1182766 1198751 1216952 1236350 1253941 1269735
56061 1269735 1286791 1305915 1324712 1342436 1361179 1381317 1400305 1417222 1434159 1451841 1468210
56050 1468210 1482718 1497824 1514784 1532048 1549217 1568490 1590781 1614367 1638645 1665098 1693417
56039 1693417 1721001 1747587 1776015 1807209 1838972 1871043 1906566 1946910 1989723 2033626 2080119
56028 2080119 2129281 2178523 2227287 2278071 2331166 2383513 2434529 2487787 2545027 2603866 2663424
56017 2663424 2726651 2794857 2865448 2937327 3013043 3093403 3175706 3259581 3348701 3444309 3543084
$$ packed form
56098A065950k6486k0342j5518j3078j0550o029j895p97j040K40K291K981L026
56085I78753M192N678O014O157P394Q537Q439Q621J0271J1593J1227J1252J3378
56072A091506J5450J5228J4337J4918J5778J5549J5985J8201J9398J7591J5794
56061A269735J7056J9124J8797J7724J8743K0138J8988J6917J6937J7682J6369
56050A468210J4508J5106J6960J7264J7169J9273K2291K3586K4278K6453K8319
56039A693417K7584K6586K8428L1194L1763L2071L5523M0344M2813M3903M6493
56028B080119M9162M9242M8764N0784N3095N2347N1016N3258N7240N8839N9558
56017B663424O3227O8206P0591P1879P5716Q0360Q2303Q3875Q9120R5608R8775
$$ plain form
56006 3543084 3643815 3749910 3862864 3979700 4099459 4225524 4358903 4496334 4637856
55997 4637856 4788832 4951399 5121597 5298192 5486249 5688412 5901122 6123530 6361552
55988 6361552 6618751 6891898 7180124 7489550 7824221 8181873 8563469 8977155 9427753
55979 9427753 9912822 10434466 11003926 11628852 12308074 13045477 13856574 14754784 15745271
55970 15745271 16840493 18067808 19453862 21017998 22792009 24831610 27200406 29963575
55962 29963575 33211832 37074038 41694499 47220466 53826627 61727054 71147674 82317992
55954 82317992 95509006 111040251 129225073 150363134 174821553 203007389 235043977
55947 235043977 270298827 307082675 342607748 373123179 394375985 402669318 396261228
$$ packed form
56006C543084J00731J06095J12954J16836J19759J26065J33379J37431J41522
55997D637856J50976J62567J70198J76595J88057K02163K12710K22408K38022
55988F361552K57199K73147K88226L09426L34671L57652L81596M13686M50598
55979I427753M85069N21644N69460O24926O79222P37403Q11097Q98210R90487
55970A5745271J095222J227315J386054J564136J774011K039601K368796K763169
55962B9963575L248257L862206M620461N525967O606161P900427R420620J1170318
55954H2317992J3191014J5531245J8184822K1138061K4458419K8185836L2036588
55947B35043977L5254850L6783848L5525073L0515431K1252806Q293333o408090
$$ plain form
55940 396261228 376190778 345834996 309525847 271223609 233884209 199410191 168812716
55933 168812716 142419785 120113403 101534764 86204057 73596542 63220788 54666589
55926 54666589 47594240 41711546 36780520 32624653 29106289 26104032 23519148 21284045
55918 21284045 19346383 17653484 16161178 14843624 13681128 12647662 11719833 10887082
55910 10887082 10142221 9470784 8858993 8303132 7801488 7344650 6922252 6531839 6173056
55901 6173056 5840195 5528130 5238721 4973811 4728159 4496154 4279234 4079870 3894359
55892 3894359 3718300 3553392 3402130 3261136 3126233 2999105 2882744 2775093 2673229
55883 2673229 2579207 2495865 2421049 2351541 2288426 2233045 2181670 2129574 2076598 2023660 1967855
$$ packed form
55940C96261228k0070450l0355782l6309149l8302238l7339400l4474018l0597475
55933A68812716k6392931k2306382j8578639j5330707j2607515j0375754q554199
55926E4666589p072349n882694m931026m155867l518364l002257k584884k235103
55918B1284045j937662j692899j492306j317554j162496j033466r27829q32751
55910A0887082p44861o71437o11791n55861n01644m56838m22398l90413l58783
55901F173056l32861l12065k89409k64910k45652k32005k16920j99364j85511
55892C894359j76059j64908j51262j40994j34903j27128j16361j07651j01864
55883B673229r4022q3342p4816o9508o3115n5381n1375n2096n2976n2938n5805
$$ plain form
55872 1967855 1906561 1842911 1781793 1723372 1665365 1608506 1554872 1503684 1453553 1406315 1364246
55861 1364246 1326031 1289571 1256081 1227295 1201332 1175422 1150141 1126967 1104333 1080170 1055880
55850 1055880 1033681 1012336 989428 965678 943153 921289 898490 875642 854358 833671 811994
55839 811994 790494 771146 753359 735765 719308 705184 691791 677153 662519 650215 639781
55828 639781 629522 619986 612513 606146 599301 592744 587585 582046 573676 563191 552856 542693 531637
55815 531637 520790 511953 504322 496168 488538 483721 481169 478563 476027 475726 477833 480324 482525 485802
55801 485802 490946 497555 505689 515547 525878 535019 543054 550735 557089 560434 560954 559862 556778 550372
55787 550372 540959 530109 518400 505854 493808 483872 475674 467858 460590 454775 449719 444117 438790
$$ packed form
55872A967855o1294o3650o1118n8421n8007n6859n3634n1188n0131m7238m2069
55861A364246l8215l6460l3490k8786k5963k5910k5281k3174k2634k4163k4290
55850A055880k2199k1345k2908k3750k2525k1864k2799k2848k1284k0687k1677
55839H11994k1500j9348j7787j7594j6457j4124j3393j4638j4634j2304j0434
55828F39781j0259r536p473o367o845o557n159n539q370j0485j0335j0163j1056
55815E31637j0847q837p631q154p630m817k552k606k536l01K107K491K201L277
55801D85802N144O609Q134R858J0331R141Q035P681O354L345N20j092l084o406
55787E50372r413j0850j1709j2546j2046r936q198p816p268n815n056n602n327
$$ plain form
55774 438790 435986 436490 439715 446060 456749 471688 489599 509581 530171 547421 556500 555262 544512
55761 544512 525535 499754 470346 441527 415853 393678 374782 358720 344247 330549 318646
55750 318646 309712 302639 295301 287584 280947 275614 270624 266191 263497 262269 260927 259200 258446 259318 261117
55735 261117 263370 266023 268054 267955 265758 262794 259465 255051 249665 244434 239609 234283 228192 222176 216814
55720 216814 212091 208400 206291 205315 204572 204341 205690 208807 213212 219210 227403 237045 246631 255777 264653
55705 264653 271922 275325 274385 270609 265064 257641 248740 239621 230709 221305 211357 201958 193847 186882
55691 186882 181190 177306 175009 173423 172413 172528 173622 174920 176352 178314 180345 181710 183148 186176
55677 186176 190604 194574 197225 199434 201676 202981 202537 200744 198124 194650 190649 187086 184535 182958
$$ packed form
55774D38790k804N04L225O345J0689J4939J7911J9982K0590J7250R079j238j0750
55761E44512j8977k5781k9408k8819k5674k2175j8896j6062j4473j3698j1903
55750C18646q934p073p338p717o637n333m990m433k694j228j342j727p54Q72J799
55735B61117K253K653K031r9k197k964l329m414n386n231m825n326o091o016n362
55720B16814m723l691k109r76p43k31J349L117M405N998Q193R642R586R146Q876
55705B64653P269L403r40l776n545p423q901r119q912r404r948r399q111o965
55691A86882n692l884k297j586j010J15J094J298J432J962K031J365J438L028
55677A86176M428L970K651K209K242J305m44j793k620l474m001l563k551j577
$$ plain form
55663 182958 182651 184104 186782 189411 191623 194091 196996 199763 202380 205498 209081 212357 215185 218051
55649 218051 220682 222296 223315 225160 228032 230476 231451 231252 230081 227392 223174 218328 213209 207139 199907
55634 199907 192425 185395 178605 171954 165965 160847 156228 152074 148724 145872 142824 139882 138007 137032
55620 137032 135746 133955 132709 132241 131546 130457 130211 131172 131796 130793 128746 126680 124597 122449 121063
55605 121063 120915 121137 120759 119796 118280 115568 111717 108344 106822 106591 106362 106048 106318 106976 107049 106045 104225
55588 104225 102079 100263 99526 100013 101130 102586 104824 107950 111071 113438 115487 118074 121370 125221 129917
55573 129917 135854 142957 151047 160261 170567 181320 191785 201650 210663 218306 224145 227915 229132
55560 229132 227379 223181 217709 211322 203315 193469 182910 172947 163932 155734 148430 142005 136173 131040
$$ packed form
55663A82958l07J453K678K629K212K468K905K767K617L118L583L276K828K866
55649B18051K631J614J019J845K872K444R75j99j171k689m218m846n119o070p232
55634A99907p482p030o790o651n989n118m619m154l350k852l048k942j875r75
55620A37032j286j791j246m68o95j089k46R61O24j003k047k066k083k148j386
55605A21063j48K22l78r63j516k712l851l373j522k31k29l14K70O58P3j004j820
55588A04225k146j816p37M87J117J456K238L126L121K367K049K587L296L851M696
55573A29917N937P103Q090R214J0306J0753J0465R865R013P643N839L770J217
55560B29132j753m198n472o387q007r846j0559r963r015q198p304o425n832n133
$$ plain form
55546 131040 127155 124518 122322 120082 118225 117231 117037 117541 118669 119619 119251 117748 116748 117220 118324 118950
55530 118950 119129 119164 118594 117069 115251 113846 112570 110947 109204 107481 105091 101668 98235 96001 94709
55515 94709 93313 91659 90397 89658 88908 87867 86670 85373 84074 83239 83191 83543 83702 83600 83401 83036 82590
55498 82590 82597 83285 84059 84333 84366 84635 85011 85249 85689 86577 87242 86838 85567 84334 83471 82593 81484 80413 79716
55479 79716 79569 79991 80638 80910 80710 80728 81561 82953 84262 85198 85678 85556 84978 84469 84128 83293 81519 79340
55461 79340 77512 76138 75111 74813 75638 77288 79160 80946 82322 82673 81850 80680 80037 79866 79724 79698 80060
55444 80060 80548 80779 80955 81390 81748 81469 80615 79697 79054 78982 79879 81570 83013 83520 83747 84608 85643 85511
55426 85511 83912 82079 81384 82126 83602 84735 84706 83549 82132 81258 81022 81303 82329 84229 86524 88686
$$ packed form
55546A31040l885k637k196k240j857r94j94N04J128R50l68j503j000M72J104O26
55530A18950J79L5n70j525j818j405j276j623j743j723k390l423l433k234j292
55515I4709j396j654j262p39p50j041j197j297j299q35m8L52J59j02j99l65m46
55498H2590PO88P74K74L3K69L76K38M40Q88O65m04j271j233q63q78j109j071o97
55479G9716j47M22O47K72k00J8Q33J392J309R36M80j22n78n09l41q35j774k179
55461G9340j828j374j027k98Q25J650J872J786J376L51q23j170o43j71j42k6L62
55444H0060M88K31J76M35L58k79q54r18o43p2Q97J691J443N07K27Q61J035j32
55426H5511j599j833o95P42J476J133k9j157j417q74k36K81J026J900K295K162
$$ plain form
55410 88686 90829 93217 95471 96894 97239 96626 95088 92815 90456 88597 87168 85840 84616 83584 82599
55395 82599 81738 81527 82113 82748 82731 82377 82383 82765 83041 82956 82351 80937 78990 77674 77819 78858 79754 80405 81230
55376 81230 81950 81888 81184 80679 80813 81498 82714 84312 85548 85810 85617 85966 86941 87816 88277 88560 88596 88053 87167
55357 87167 86619 86566 86568 86371 86062 85654 85232 85215 85674 85728 84558 82753 81646 81577 81829 82085 82733 83780 84654 85223
55337 85223 85921 86672 86722 85868 84944 84690 84857 84752 84093 83112 82382 82661 84248 86348 87574 87263 85911 84383
55319 84383 83178 82341 81488 80071 78201 76984 77277 78289 78245 76488 74159 72828 73194 75055 77687 80081
55303 80081 81514 82127 82531 82958 83324 83848 84854 86080 86923 87251 87296 87039 86522 86521 87782 89702 90815 90600
55285 90600 89814 89100 88379 87752 87723 88185 88197 87224 85748 84315 82888 81538 80909 81445 82781 84296 85662
$$ packed form
55410H8686K143K388K254J423L45o13j538k273k359j859j429j328j224j032r85
55395H2599q61k11N86O35j7l54OL82K76q5o05j414j947j316J45J039Q96O51Q25
55376H1230P20o2p04n05J34O85J216J598J236K62j93L49R75Q75M61K83L6n43q86
55357H7167n48n3Kj97l09m08m22j7M59N4j170j805j107o9K52K56O48J047Q74N69
55337H5223O98P51N0q54r24k54J67j05o59r81p30K79J587K100J226l11j352j528
55319H4383j205q37q53j417j870j217K93J012m4j757k329j331L66J861K632K394
55303H0081J433O13M04M27L66N24J006J226Q43L28M5k57n17jJ261J920J113k15
55285I0600p86p14p21o27k9M62J2r73j476j433j427j350o29N36J336J515J366
$$ plain form
55268 85662 86589 86708 86088 85317 84790 84449 84358 84841 85853 86911 87851 88956 90149 90818 90716 90331 90110 90044
55250 90044 90202 90898 91928 92443 91987 91018 90089 89222 88454 88199 88518 88670 87944 86515 85084 84158 84006 84727
55232 84727 85925 86787 86889 86529 86081 85577 85164 85256 85793 85962 85227 84172 83857 84646 86050 87379 88247 88758
55214 88758 89435 90630 91868 92190 91251 89651 88116 86948 86335 86419 86822 86785 86148 85619 85781 86415 87037 87462
55196 87462 87572 87204 86616 86438 86809 87179 87217 87215 87331 87242 86949 87068 87831 88615 89036 89682 90991 92183 92224 91285
55176 91285 90353 89823 89384 88998 89073 89762 90828 92162 93804 95469 96646 97233 97623 98095 98464 98424 98021 97705
55158 97705 97910 98543 98967 98681 97886 97066 96263 95353 94797 95208 96188 96582 96151 95991 96839 97907 98005 96986 95385
55139 95385 93501 91656 90665 90989 91843 92050 91511 91030 91048 91350 91779 92390 92987 93249 93266 93428 93892 94704 96130
$$ packed form
55268H5662R27J19o20p71n27l41r1M83J012J058R40J105J193O69j02l85k21o6
55250I0044J58O96J030N15m56r69r29q67p68k55L19J52p26j429j431r26j52P21
55232H4727J198Q62J02l60m48n04m13R2N37J69p35j055l15P89J404J329Q68N11
55214H8758O77J195J238L22r39j600j535j168o13Q4M03l7o37n29J62O34O22M25
55196H7462J10l68n88j78L71L70L8kJ16q9k93J19P63P84M21O46J309J192M1r39
55176I1285r32n30m39l86P5O89J066J334J642J665J177N87L90M72L69m0m03l16
55158I7705K05O33M24k86p95q20q03r10n56M11R80L94m31j60Q48J068R8j019j601
55139I5385j884j845r91L24Q54K07n39m81J8L02M29O11N97K62J7J62M64Q12J426
$$ plain form
55120 96130 98196 100016 100375 99090 97284 96187 96059 96332 96496 96750 97799 99904 102171 103272 103049 102836
55104 102836 103810 105535 106650 106450 105242 103667 102412 102232 103380 105150 106548 107299 107718 107959 108085 108558
55088 108558 109780 111229 111910 111716 111622 112336 113418 113917 113376 111996 110318 108988 108481 108701 108998 108753 107960
55071 107960 107244 107310 108275 109447 109996 109917 110047 110955 112231 113117 113437 113478 113335 112905 112298 111749 111248 110642 109927
55052 109927 109089 107931 106471 105273 104909 105276 105905 106704 107825 109025 109752 109858 109652 109294 108646 107816 107320
55035 107320 107494 108017 108188 107560 106339 105205 104660 104496 104165 103699 103779 104630 105412 105189 104160 103402 103616 104612
55017 104612 105776 106534 106538 105878 105042 104349 103646 102853 102414 102713 103381 103697 103460 102990 102604 102562 103180 104388 105512
54998 105512 106108 106658 107738 108872 109094 108476 108149 108835 110222 111837 113624 115376 116382 116151 115098 114191
$$ packed form
55120I6130K066J820L59j285j806j097j28K73J64K54J049K105K267J101k23k13
55104A02836R74J725J115k00j208j575j255j80J148J770J398P51M19K41J26M73
55088A08558J222J449O81j94r4P14J082M99n41j380j678j330n07K20K97k45p93
55071A07960p16O6R65J172N49p9J30R08J276Q86L20M1j43m30o07n49n01o06p15
55052A09927q38j158j460j198l64L67O29P99J121J200P27J06k06l58o48q30m96
55035A07320J74N23J71o28j221j134n45j64l31m66Q0Q51P82k23j029p58K14R96
55017A04612J164P58Mo60q36o93p03p93m39K99O68L16k37m70l86m2O18J208J124
54998A05512N96N50J080J134K22o18l27O86J387J615J787J752J006k31j053r07
$$ plain form
54982 114191 114117 114818 115590 115618 114770 113802 113476 113703 113923 114031 114347 114953 115722 116763 118074 118926 118483 117044
54964 117044 115822 115448 115519 115724 116385 117531 118353 118217 117636 117622 118450 119484 119916 119391 118232 117319 117417 118375
54946 118375 119300 119657 119766 120052 120333 120175 119546 118739 117962 117376 117256 117759 118640 119422 119784 119744 119628 119881 120651
54927 120651 121569 122257 122975 124366 126579 129177 131991 135471 139936 144985 150031 154973 159945 164766 169056
54912 169056 172715 175829 178190 179249 178559 176107 172202 167248 161666 155919 150465 145597 141346 137685
54898 137685 134810 132943 131802 130657 129143 127686 126742 126034 125039 123933 123437 123862 124925 126350 128037
54883 128037 129675 130865 131720 132802 134491 136919 140379 145034 150240 154980 159150 163608 168725 173663
54869 173663 177397 179703 180727 180369 178670 176210 173462 170207 166179 161849 157949 154561 151362 148498
$$ packed form
54982A14191p4P01P72K8q48r68l26K27K20J08L16O06P69J041J311Q52m43j439
54964A17044j222l74P1K05O61J146Q22j36n81j4Q28J034M32n25j159r13R8R58
54946A18375R25L57J09K86K81j58o29q07p77n86j20N03Q81P82L62m0j16K53P70
54927A20651R18O88P18J391K213K598K814L480M465N049N046M942M972M821M290
54912A69056L659L114K361J059o90k452l905m954n582n747n454m868m251l661
54898A37685k875j867j141j145j514j457r44p08r95j106m96M25J063J425J687
54883A28037J638J190Q55J082J689K428L460M655N206M740M170M458N117M938
54869A73663L734K306J024l58j699k460k748l255m028m330l900l388l199k864
$$ plain form
54855 148498 146469 145155 143599 140932 137198 133185 129782 127560 126651 126758 127252 127363 126503 124603 122168
54840 122168 119841 117918 116428 115523 115419 115894 116205 115659 114152 112182 110563 109991 110480 111204 111307 110894 110811
54823 110811 111506 112594 113563 114294 114770 114873 114715 114608 114477 113889 112969 112669 113638 115339 116765 117634 118327 119036
54805 119036 119593 119952 120289 120645 120945 121322 122105 123452 125233 127162 128864 129929 130158 129675 128705 127437 126180
54788 126180 125367 125124 125094 124956 124847 125043 125445 125748 125995 126590 127785 129358 130834 131905 132690 133651 135174
54771 135174 137280 139867 143095 147142 151610 155684 159083 162462 166644 171823 177732 184167 190897 197290
54757 197290 202393 205431 206083 204462 200985 196121 190174 183422 176392 169724 163728 158418 153920 150425
54743 150425 147732 145355 143198 141613 140697 140019 139241 138440 137651 136701 135758 135359 135583 135806 135723 135886 136723 137743
$$ packed form
54855A48498k029j314j556k667l734m013l403k222r09J07M94J11q60j900k435
54840A22168k327j923j490r05j04M75L11n46j507j970j619n72M89P24J03m13q3
54823A10811O95J088R69P31M76J03j58j07j31n88r20l00R69J701J426Q69O93P09
54805A19036N57L59L37L56L00L77P83J347J781J929J702J065K29m83r70j268j257
54788A26180q13k43l0j38j09J96M02L03K47N95J195J573J476J071P85R61J523
54771A35174K106K587L228M047M468M074L399L379M182N179N909O435O730O393
54757A97290N103L038O52j621l477m864n947o752p030o668n996n310m498l495
54743A50425k693k377k157j585r16o78p78q01p89r50r43l99K24K23q3J63Q37J020
$$ plain form
54725 137743 138416 139264 141209 144254 147649 151052 154722 158732 162831 167033 171526 175937 179345 181155 181401
54710 181401 180178 177417 173392 168923 164754 161032 157519 154012 150407 146667 142935 139511 136638 134350
54696 134350 132565 131169 130076 129303 128948 129036 129504 130331 131439 132365 132439 131511 130208 129204 128506 127704 126589
54679 126589 125224 123742 122453 121840 121995 122318 122197 121745 121431 121256 120859 120277 119993 120241 120761 121254 121674 122009
54661 122009 122117 121902 121459 121065 121126 121931 123276 124506 125179 125439 125542 125387 124882 124431 124553 125225 126042 126819
54643 126819 127597 128273 128671 128842 128861 128549 127840 127171 127055 127459 128026 128629 129180 129218 128368 127044 126083 125802 125966
54624 125966 126483 127422 128482 129136 129262 129042 128390 127201 126004 125543 125686 125646 125320 125517 126618 127853 128290
54607 128290 127827 126859 125627 124330 123320 122758 122466 122398 122773 123449 123749 123295 122569 122208 122152 121953 121595 121490
$$ packed form
54725A37743O73Q48J945L045L395L403L670M010M099M202M493M411L408J810K46
54710A81401j223k761m025m469m169l722l513l507l605l740l732l424k873k288
54696A34350j785j396j093p73l55Q8M68Q27J108R26P4r28j303j004o98q02j115
54679A26589j365j482j289o13J55L23j21m52l14j75l97n82k84K48N20M93M20L35
54661A22009J08k15m43l94O1Q05J345J230O73K60J03j55n05m51J22O72Q17P77
54643A26819P78O76L98J71J9l12p09o69j16M04N67O03N51L8q50j324r61k81J64
54624A25966N17R39J060O54J26k20o52j189j197m61J43m0l26J97J101J235M37
54607A28290m63r68j232j297j010n62k92o8L75O76L00m54p26l61n6j99l58j05
$$ plain form
54589 121490 121798 122218 122460 122629 123087 123992 124982 125434 125119 124390 123510 122190 120319 118809 118840 120266 121659
54572 121659 122103 122145 122618 123355 123626 123317 123088 123661 125323 127768 130119 131488 131841 131930 132209 132386 132270 132337
54554 132337 132918 133518 133617 133613 134179 135083 135467 135100 134574 134413 134715 135611 137276 139337 140953 141729 142071 142469 142869
54535 142869 143008 142997 143250 143980 144947 145641 145665 145092 144418 144062 143950 143702 143154 142449 141709 140912 140043 139179 138357
54516 138357 137525 136616 135570 134356 133109 132148 131689 131662 131986 132821 134241 135751 136532 136272 135513 135113 135478
54499 135478 136343 137125 137444 137355 137088 136534 135234 133091 130910 129843 130257 131374 132147 132283 132335 132972 134309
54482 134309 135873 137118 137924 138582 139342 140139 140816 141449 142247 143240 144272 145288 146393 147599 148691 149410
54466 149410 149674 149568 149261 148969 148946 149389 150337 151625 152896 153674 153551 152427 150638 148830 147591 147058 146838
$$ packed form
54589A21490L08M20K42J69M58R05R90M52l15p29q80j320j871j510L1J426J393
54572A21659M44M2M73P37K71l09k29N73J662K445K351J369L53Q9K79J77j16O7
54554A32337N81O00R9mN66R04L84l67n26j61L02Q96J665K061J616P76L42L98M00
54535A42869J39j1K53P30R67O94K4n73o74l56j12k48n48p05p40p97q69q64q22
54516A38357q32r09j046j214j247r61m59k7L24Q35J420J510P81k60p59m00L65
54499A35478Q65P82L19q9k67n54j300k143k181j067M14J117P73J36N2O37J337
54482A34309J564J245Q06O58P60P97O77O33P98R93J032J016J105J206J092P19
54466A49410K64j06l07k92k3M43R48J288J271P78j23j124j789j808j239n33k20
$$ plain form
54449 146838 146375 145460 144330 143356 142742 142519 142650 143083 143821 144961 146483 147928 148479 147624 145689 143568 141958
54432 141958 140963 140365 140006 139878 140006 140483 141479 143044 144827 146191 146779 146824 146769 146703 146465 146175 146204 146536 146661
54413 146661 146407 146373 147082 148052 148327 147743 147061 146939 147413 148350 149673 150947 151514 151418 151615 152774 154374 155484
54395 155484 156026 156661 157749 159044 160342 161776 163423 165063 166443 167436 167885 167654 166954 166306 165940 165453
54379 165453 164325 162741 161696 162098 163794 165632 166633 166977 167641 169190 171377 173870 176827 180420 184299
54364 184299 188007 191649 195611 199716 203177 205414 206476 206644 206045 204721 202766 200248 197253 194042 190887
54349 190887 187678 184051 179988 176001 172559 169648 167085 164917 163268 162033 161050 160363 159990 159573 158714
54334 158714 157599 156892 156926 157428 158179 159490 161633 164065 165697 165939 165098 163770 162245 160671 159373 158617
$$ packed form
54449A46838m63r15j130r74o14k23J31M33P38J140J522J445N51q55j935k121j610
54432A41958r95n98l59j28J28M77R96J565J783J364N88M5n5o6k38k90K9L32J25
54413A46661k54l4P09R70K75n84o82j22M74R37J323J274N67r6J97J159J600J110
54395A55484N42O35J088J295J298J434J647J640J380R93M49k31p00o48l66m87
54379A65453j128j584j045M02J696J838J001L44O64J549K187K493K957L593L879
54364A84299L708L642L962M105L461K237J062J68n99j324j955k518k995l211l155
54349A90887l209l627m063l987l442k911k563k168j649j235r83o87l73m17q59
54334A58714j115p07L4N02P51J311K143K432J632K42q41j328j525j574j298p56
$$ plain form
54318 158617 158199 157637 156817 156275 156698 158246 160312 161968 162658 162527 162066 161541 160933 160332 159992 159876 159444 158206
54300 158206 156329 154468 153178 152635 152706 152994 153075 152994 153296 154247 155341 155991 156405 157206 158412 159501 160341 161296
54282 161296 162371 163060 163250 163502 164131 164702 164837 164864 165163 165432 165216 164725 164494 164569 164628 164669 164932 165321 165525 165672
54262 165672 166254 167310 168235 168557 168524 168681 169141 169520 169572 169678 170575 172477 174627 175989 176397 176640 177318 178045
54244 178045 178067 177234 175919 174270 172135 169678 167612 166680 167067 168285 169536 170291 170658 171031 171379 171288 170806
54227 170806 170688 171399 172368 172815 172896 173379 174441 175504 176122 176292 175909 174712 172954 171479 170837 170728 170502
54210 170502 169790 168558 167037 165804 165499 166126 166933 167152 166609 165591 164539 164000 164383 165453 166424 166814 166831
54193 166831 166733 166318 165456 164683 164685 165380 166065 166374 166530 166675 166546 165988 165374 165147 165252 165382 165651 166585 168368
$$ packed form
54318A58617m18n62q20n42M23J548K066J656O90j31m61n25o08o01l40j16m32j238
54300A58206j877j861j290n43P1K88Q1q1L02R51J094O50M14Q01J206J089Q40R55
54282A61296J075O89J90K52O29N71J35K7K99K69k16m91k31P5N9M1K63L89K04J47
54262A65672N82J056R25L22l3J57M60L79N2J06Q97J902K150J362M08K43O78P27
54244A78045K2q33j315j649k135k457k066r32L87J218J251P55L67L73L48r1m82
54227A70806j18P11R69M47Q1M83J062J063O18J70l83j197j758j475o42j09k26
54210A70502p12j232j521j233l05O27Q07K19n43j018j052n39L83J070R71L90J7
54193A66831r8m15q62p73KO95O85L09J56J45j29n58o14k27J05J30K69R34J783
$$ plain form
54174 168368 170375 171713 172123 172085 172076 171988 171419 170340 169202 168401 167893 167419 166922 166605 166640 166993 167535 168173 168715
54155 168715 168734 167865 166335 164957 164363 164387 164455 164433 164697 165405 166156 166514 166456 166120 165472 164514 163537 162876 162600 162622
54135 162622 162850 163082 163071 162953 163155 163656 163816 163408 163269 164215 165707 166464 166288 166311 167356 168956 170307 171419
54117 171419 172758 174249 175313 175749 176113 177213 179390 182236 184929 186983 188712 190817 193541 196497 199316
54102 199316 202069 204907 207688 210214 212620 215210 218015 220582 222102 221771 219358 215557 211561 208120
54088 208120 205247 202862 201368 201282 202560 204602 206859 209180 211558 213682 214827 214278 212048 209111 206714
54073 206714 205377 204730 204234 203705 203080 202098 200558 198722 197173 196367 196389 196934 197345 196892 195349 193331 191852
54056 191852 191526 192287 193791 195801 198077 200096 201264 201580 201884 203114 205331 207766 209858 211862 214281
$$ packed form
54174A68368K007J338M10l8rq8n69j079j138q01n08m74m97l17L5L53N42O38N42
54155A68715J9q69j530j378n94K4O8k2K64P08P51L58n8l36o48r58r77o61k76K2
54135A62622K28K32j1j18K02N01J60m08j39R46J492P57j76K3J045J600J351J112
54117A71419J339J491J064M36L64J100K177K846K693K054J729K105K724K956K819
54102A99316K753K838K781K526K406K590K805K567J520l31k413l801l996l441
54088B08120k873k385j494q6J278K042K257K321K378K124J145n49k230k937k397
54073B06714j337o47m96n29o25r82j540j836j549q06K2N45M11m53j543k018j479
54056A91852l26P61J504K010K276K019J168L16L04J230K217K435K092K004K419
$$ plain form
54041 214281 217162 220316 223873 228153 233210 238858 244962 251358 257767 264191 271000 278091 284398 289085
54027 289085 292844 297068 301855 305928 308540 310231 311459 311734 310747 309306 308364 307939 307688 307745 308067 307731
54011 307731 305906 303028 299991 296617 292025 286232 280263 274765 269576 264661 260415 256886 253639 250671
53997 250671 248564 247420 246438 244989 243364 242100 241215 240533 240097 239690 238552 236244 233464 231403 230505 230362
53981 230362 230545 230975 231612 232290 232879 233232 233071 232291 231326 230850 231149 232010 233125 234255 235194 236016 237336 239890
53963 239890 243769 248481 253801 260157 267964 276952 286438 295953 305230 313637 319942 322839 321772 317370
53949 317370 311107 304427 298099 292397 287631 284123 281794 280297 279686 280470 282737 285768 288927 292441 296661
53934 296661 300970 304220 306099 307186 307709 307250 306010 305385 306608 309375 312522 315592 319060 323304 328142
$$ packed form
54041B14281K881L154L557M280N057N648O104O396O409O424O809P091O307M687
54027B89085L759M224M787M073K612J691J228K75r87j441r42m25k51N7L22l36
54011C07731j825k878l037l374m592n793n969n498n189m915m246l529l247k968
53997B50671k107j144r82j449j625j264q85o82m36m07j138k308k780k061q98j43
53981B30362J83M30O37O78N89L53j61p80r65m76K99Q61J115J130R39Q22J320K554
53963B39890L879M712N320O356P807Q988R486R515R277Q407O305K897j067m402
53949C17370o263o680o328n702m766l508k329j497o11P84K267L031L159L514M220
53934B96661M309L250J879J087N23m59j240o25J223K767L147L070L468M244M838
$$ plain form
53919 328142 333266 338454 343417 348000 352635 358071 364567 371770 379378 387382 395547 403144 409502 414520
53905 414520 418504 421739 424307 425996 426300 424881 422201 419336 416908 414477 411324 407562 404046 401122
53891 401122 397836 392690 385213 376545 368267 360855 353627 346063 338519 331438 324646 317962 311936 307126
53877 307126 303082 298956 294922 291981 290325 288923 286921 284512 282091 279492 276544 273567 270717 267448
53863 267448 263286 258573 253932 249526 245482 242469 241033 240659 240221 239202 237883 236547 235169 233765 232424
53848 232424 231031 229485 228186 227748 228206 228889 229107 228659 227678 226378 224983 223641 222442 221650 221739 222910
53832 222910 224697 226364 227564 228401 229030 229476 229713 229739 229683 229933 230862 232247 233361 233822 233943 234025 233872 233394
53814 233394 233080 233311 233766 234161 235071 237196 240181 243055 245630 248630 252516 257011 261744 266552 271196
$$ packed form
53919C28142N124N188M963M583M635N436O496P203P608Q004Q165P597O358N018
53905D14520L984L235K568J689L04j419k680k865k428k431l153l762l516k924
53891D01122l286n146p477q668q278p412p228p564p544p081o792o684o026m810
53877C07126m044m126m034k941j656j402k002k409k421k599k948k977k850l269
53863B67448m162m713m641m406m044l013j436l74m38j019j319j336j378j404j341
53848B32424j393j546j299m38M58O83K18m48r81j300j395j342j199p92Q9J171
53832B22910J787J667J200Q37O29M46K37K6n6K50R29J385J114M61J21Q2j53m78
53814B33394l14K31M55L95R10K125K985K874K575L000L886M495M733M808M644
$$ plain form
53799 271196 275480 279732 284487 289689 294838 299835 304913 309793 313751 316659 319188 321817 324365 326627
53785 326627 328733 330683 332192 333164 333701 333584 332481 330696 328800 326428 322496 316918 311002 305711 300597
53770 300597 295093 289752 285278 281264 276964 272675 269250 266678 264244 261785 259748 258143 256411 254359
53756 254359 252355 250539 248535 246068 243301 240585 238397 237413 237888 238931 239052 237625 235316 233067 231264
53741 231264 229982 229344 229306 229584 230071 230925 232044 232924 233279 233422 233717 234130 234606 235546 237367 239780 241937
53724 241937 243337 244259 245344 246929 248842 250658 252095 253223 254326 255565 256857 258056 259193 260515
53710 260515 262390 265156 268811 272760 276094 278318 279812 281416 283615 286210 288726 290947 293039 295324
53696 295324 298036 301213 304700 308307 312013 315887 319684 322641 324075 324262 324357 325168 326241 326483 325453
$$ packed form
53799B71196M284M252M755N202N149M997N078M880L958K908K529K629K548K262
53785C26627K106J950J509R72N37j17j103j785j896k372l932n578n916n291n114
53770C00597n504n341m474m014m300m289l425k572k434k459k037j605j732k052
53756B54359k004j816k004k467k767k716k188r84M75J043J21j427k309k249j803
53741B31264j282o38l8K78M87Q54J119Q80L55J43K95M13M76R40J821K413K157
53724B41937J400R22J085J585J913J816J437J128J103J239J292J199J137J322
53710B60515J875K766L655L949L334K224J494J604K199K595K516K221K092K285
53696B95324K712L177L487L607L706L874L797K957J434J87R5Q11J073K42j030
$$ plain form
53681 325453 323554 321160 318284 315250 312982 312100 312082 311848 310947 309756 308701 307822 307074 306533 306208 305958 305751
53664 305751 305699 305777 305785 305748 306031 306840 307749 307947 306945 304929 302565 300588 299533 299591 300562 301976 303361 304519
53646 304519 305562 306650 307704 308495 309051 309835 311355 313638 316194 318473 320252 321658 323008 324663 326899
53631 326899 329800 333290 337214 341346 345378 349101 352630 356359 360572 365167 369770 374077 378017 381647
53617 381647 385025 388228 391411 394726 398163 401564 404876 408288 411995 415859 419444 422432 424889 427080
53603 427080 429167 431198 433258 435474 437876 440283 442290 443392 443299 442289 441142 440516 440340 439963 438867
53588 438867 437101 434996 432676 430037 427101 424180 421568 419206 416779 414124 411425 408970 406782 404617
53574 404617 402285 399922 397913 396493 395413 394068 392088 389813 388078 387436 387685 388123 388119 387428 386264 385209
$$ packed form
53681C25453j899k394k876l034k268q82j8k34r01j191j055q79p48n41l25k50k07
53664C05751n2P8Ql7K83Q09R09J98j002k016k364j977j055N8R71J414J385J158
53646C04519J043J088J054P91N56P84J520K283K556K279J779J406J350J655K236
53631C26899K901L490L924M132M032L723L529L729M213M595M603M307L940L630
53617C81647L378L203L183L315L437L401L312L412L707L864L585K988K457K191
53603D27080K087K031K060K216K402K407K007J102r3j010j147o26j76l77j096
53588D38867j766k105k320k639k936k921k612k362k427k655k699k455k188k165
53574D04617k332k363k009j420j080j345j980k275j735o42K49M38mo91j164j055
$$ plain form
53558 385209 384847 385243 385932 386596 387519 389068 390962 392515 393582 394792 396758 399387 402125 404609 406955
53543 406955 409615 413047 417307 421948 426469 430907 435744 441234 447171 453369 460004 467332 475341 483947
53529 483947 493251 503436 514544 526485 539115 552222 565677 579670 594488 609951 625422 640606
53517 640606 656054 672634 690738 710227 730879 752585 775305 799085 824004 849889 876262
53506 876262 902813 929818 957802 986864 1016370 1045174 1072099 1096609 1119269 1141292 1163330
53495 1163330 1184916 1205238 1224111 1241892 1258853 1275171 1291336 1307994 1325388 1343324 1361639
53484 1361639 1380329 1399268 1418179 1436878 1455213 1472812 1489219 1504295 1518104 1530332 1540148
53473 1540148 1546828 1550349 1551282 1550154 1546927 1541012 1531933 1520019 1506266 1491386 1475329 1457985 1439999
$$ packed form
53558C85209l62L96O89O64R23J549J894J553J067J210J966K629K738K484K346
53543D06955K660L432M260M641M521M438M837N490N937O198O635P328Q009Q606
53529D83947R304J0185J1108J1941J2630J3107J3455J3993J4818J5463J5471J5184
53517F40606J5448J6580J8104J9489K0652K1706K2720K3780K4919K5885K6373
53506H76262K6551K7005K7984K9062K9506K8804K6925K4510K2660K2023K2038
53495A163330K1586K0322J8873J7781J6961J6318J6165J6658J7394J7936J8315
53484A361639J8690J8939J8911J8699J8335J7599J6407J5076J3809J2228R816
53473A540148O680L521R33j128l227n915r079j1914j3753j4880j6057j7344j7986
$$ plain form
53460 1439999 1422366 1405416 1388630 1371286 1352818 1332769 1311116 1288707 1266741 1245574 1224484
53449 1224484 1202737 1180460 1158322 1136876 1116523 1097680 1080530 1064907 1050736 1038409 1028406
53438 1028406 1020694 1014782 1010273 1007123 1005437 1005214 1006253 1008164 1010610 1013680 1017966 1024101 1032230 1041987
53424 1041987 1052897 1064714 1077479 1091409 1106736 1123557 1141754 1161075 1181394 1203012 1226718
53413 1226718 1253290 1282804 1314566 1347895 1382782 1419539 1458084 1497960 1538940 1581199 1624888
53402 1624888 1669974 1716596 1765170 1815956 1868745 1923115 1978738 2035402 2092975 2151451 2210773
53391 2210773 2270564 2330280 2389646 2448614 2506855 2563693 2618653 2671676 2722584 2770685 2815176
53380 2815176 2855649 2891964 2923929 2951365 2974273 2992599 3005954 3013768 3015594 3011225 3000762 2984681
$$ packed form
53460A439999j7633j6950j6786j7344j8468k0049k1653k2409k1966k1167k1090
53449A224484k1747k2277k2138k1446k0353j8843j7150j5623j4171j2327j0003
53438A028406p712n912m509l150j686k23J039J911K446L070M286O135Q129R757
53424A041987J0910J1817J2765J3930J5327J6821J8197J9321K0319K1618K3706
53413A226718K6572K9514L1762L3329L4887L6757L8545L9876M0980M2259M3689
53402A624888M5086M6622M8574N0786N2789N4370N5623N6664N7573N8476N9322
53391B210773N9791N9716N9366N8968N8241N6838N4960N3023N0908M8101M4491
53380B815176M0473L6315L1965K7436K2908J8326J3355P814J826m369j0463j6081
$$ plain form
53368 2984681 2963478 2936999 2904404 2865136 2819686 2769251 2714952 2657695 2598399 2537853 2476459
53357 2476459 2414543 2352823 2292268 2233618 2177272 2123383 2071633 2021242 1971754 1923727 1878060
53346 1878060 1834705 1792623 1751051 1710222 1670740 1632862 1596682 1562466 1530369 1500189 1471677
53335 1471677 1444819 1419578 1395797 1373712 1354096 1337343 1322659 1308717 1294940 1281559 1268544
53324 1268544 1255271 1241478 1227897 1215504 1204472 1194287 1184625 1175698 1167810 1160988 1155127 1150305
53312 1150305 1146926 1145639 1147006 1151009 1156838 1163390 1170071 1177136 1185363 1195537 1208090 1222906 1239402
53299 1239402 1257028 1275798 1296199 1318564 1342706 1368213 1394885 1422778 1451970 1482289 1513086
53288 1513086 1543258 1571805 1598566 1624114 1648693 1671425 1690917 1706501 1718546 1727561 1733366 1735296
$$ packed form
53368B984681k1203k6479l2595l9268m5450n0435n4299n7257n9296o0546o1394
53357B476459o1916o1720o0555n8650n6346n3889n1750n0391m9488m8027m5667
53346A878060m3355m2082m1572m0829l9482l7878l6180l4216l2097l0180k8512
53335A471677k6858k5241k3781k2085j9616j6753j4684j3942j3777j3381j3015
53324A268544j3273j3793j3581j2393j1032j0185r662q927p888o822n861m822
53312A150305l379j287J367M003N829O552O681P065Q227J0174J2553J4816J6496
53299A239402J7626J8770K0401K2365K4142K5507K6672K7893K9192L0319L0797
53288A513086L0172K8547K6761K5548K4579K2732J9492J5584J2045R015N805J930
$$ plain form
53276 1735296 1733094 1727394 1719269 1709292 1697152 1682286 1664784 1645336 1624274 1601177 1575747 1548678
53264 1548678 1521046 1493019 1463772 1432761 1400568 1368313 1336644 1305550 1274797 1244147 1213299
53253 1213299 1181996 1150332 1118846 1088265 1059081 1031295 1004509 978346 952726 927719 903229
53242 903229 879027 855074 831656 809190 787997 768221 749737 732217 715530 700065 686447
53231 686447 674901 665119 656705 649390 642721 635896 628228 619648 610566 601323 591861 581778 570601
53218 570601 558173 544918 531646 518962 506944 495459 484632 474745 465735 457061 448228 439372
53206 439372 431113 423787 416990 410062 402855 395756 389047 382650 376558 370954 365628 359804 353110 346371
53192 346371 340850 336858 333658 330594 327601 324642 321390 317786 314308 311353 308766 306266 303967 302104
$$ packed form
53276A735296k202n700q125r977j2140j4866j7502j9448k1062k3097k5430k7069
53264A548678k7632k8027k9247l1011l2193l2255l1669l1094l0753l0650l0848
53253A213299l1303l1664l1486l0581k9184k7786k6786k6163k5620k5007k4490
53242I03229k4202k3953k3418k2466k1193j9776j8484j7520j6687j5465j3618
53231F86447j1546r782q414p315o669o825p668q580r082r243r462j0083j1177
53218E70601j2428j3255j3272j2684j2018j1485j0827r887r010q674q833q856
53206D39372q259p326o797o928p207p099o709o397o092n604n326n824o694o739
53192C46371n521l992l200l064k993k959l252l604l478k955k587k500k299j863
$$ plain form
53178 302104 300487 298593 296159 293541 291542 290748 290816 290509 288841 286166 283727 282221 281342 280681 280320 280292
53162 280292 280136 279472 278576 277974 277821 277899 277795 276829 274368 270699 267171 265067 264597 265246 266572 268199 269492
53145 269492 269838 269105 267514 265427 263498 262494 262472 262634 262526 262855 264481 267058 269401 270802 271315 271138
53129 271138 270592 270411 271132 272315 273133 273593 274382 275661 276931 277948 278881 279639 280073 280868 283077 286562 289922
53112 289922 292310 294280 296420 298234 299087 299259 299200 298487 296533 293849 291593 290094 288675 286815 284665
53097 284665 282478 280255 278164 276655 275922 275594 275205 274758 274592 274770 274783 273969 272265 270370 268969 267985 266990
53080 266990 266162 266205 267199 268253 268618 268495 268315 267817 266530 264639 262683 260708 258548 256705 256039 256478 256833
53063 256833 256148 254715 253524 253242 253932 255269 256645 257376 257220 256595 256157 256254 256793 257393 257604 257290 256940 257262
$$ packed form
53178C02104j617j894k434k618j999p94O8l07j668k675k439j506q79o61l61k8
53162B80292j56o64q96o02j53P8j04r66k461l669l528k104m70O49J326J627J293
53145B69492L46p33j591k087j929j004k2J62j08L29J626K577K343J401N13j77
53129B71138n46j81P21J183Q18M60P89J279J270J017R33P58M34P95K209L485L360
53112B89922K388J970K140J814Q53J72n9p13j954k684k256j499j419j860k150
53097B84665k187k223k091j509p33l28l89m47j66J78J3q14j704j895j401r84r95
53080B66990q28M3R94J054L65j23j80m98j287j891j956j975k160j843o66M39L55
53063B56833o85j433j191k82O90J337J376P31j56o25m38R7N39O00K11l14l50L22
$$ plain form
53045 257262 258341 259512 260209 260631 261274 262100 262529 262099 260853 259168 257495 256188 255302 254575 253806 253164 252931
53028 252931 253023 253092 253063 253252 253901 254861 255839 256685 257324 257698 257959 258477 259382 260291 260725 260650 260344 259887 259170 258388
53008 258388 258119 258759 260124 261716 263202 264493 265587 266488 267198 267633 267639 267157 266297 265236 264168 263333 262924
52991 262924 262922 263197 263739 264550 265373 265966 266701 268396 271299 274631 277472 279700 281738 283781 285786 287858
52975 287858 289985 291565 291856 290897 289434 287958 286410 284874 283895 283816 284269 284656 284870 285297 286370 288246
52959 288246 290627 292825 294282 295097 295716 296097 295724 294584 293491 293049 292731 291560 289406 287116 285470 284460
52943 284460 283585 282453 281061 279695 278665 278023 277561 277140 276895 276993 277339 277704 278007 278271 278380 278095 277335 276339
52925 276339 275449 274763 273972 272677 270910 269237 268215 267875 267925 268221 268671 268957 268894 268972 269846 271256 272077 271684
$$ packed form
53045B57262J079J171O97M22O43Q26M29m30j246j685j673j307q86p27p69o42k33
53028B52931R2O9k9J89O49R60R78Q46O39L74K61N18R05R09M34p5l06m57p17p82
53008B58388k69O40J365J592J486J291J094R01P10M35Om82q60j061j068q35m09
52991B62924kK75N42Q11Q23N93P35J695K903L332K841K228K038K043K005K072
52975B87858K127J580K91r59j463j476j548j536r79p9M53L87K14M27J073J876
52959B88246K381K198J457Q15O19L81l73j140j093m42l18j171k154k290j646j010
52943B84460q75j132j392j366j030o42m62m21k45R8L46L65L03K64J09k85p60r96
52925B76339q90o86p91j295j767j673j022l40N0K96M50K86o3P8Q74J410Q21l93
$$ plain form
52907 271684 270621 269655 268863 268099 267721 268170 269186 270082 270570 270787 270748 270285 269415 268322 267149 266138 265734
52890 265734 266135 267030 268196 269945 272397 274647 275466 274722 273397 272284 271365 270492 269901 269832 270222 270992 272193
52873 272193 273688 275207 276813 278866 281365 283808 285845 287670 289569 291542 293536 295607 297655 299377
52859 299377 300607 301358 301461 300659 299084 297058 294301 290119 284745 279698 276201 273826 271349 268398 265441
52844 265441 262582 259404 256017 253318 251875 251206 250497 249556 248692 248070 247589 247236 247127 247250 247431 247569 247697
52827 247697 247787 247717 247490 247376 247678 248422 249423 250550 251712 252583 252680 251893 250743 249907 249664 250018 250992 252375
52809 252375 253409 253388 252619 252260 253077 254752 256539 258007 258958 259165 258688 258054 257643 257112 255815 253637 251059
52792 251059 248576 246397 244566 243002 241480 239879 238446 237627 237730 238798 240532 242206 243050 243068 243179 244175
$$ packed form
52907B71684j063r66p92p64l78M49J016Q96M88K17l9m63q70j093j173j011m04
52890B65734M01Q95J166J749K452K250Q19p44j325j113r19q73n91o9L90P70J201
52873B72193J495J519J606K053K499K443K037J825J899J973J994K071K048J722
52859B99377J230P51J03q02j575k026k757m182n374n047l497k375k477k951k957
52844B65441k859l178l387k699j443o69p09r41q64o22m81l53j09J23J81J38J28
52827B47697R0p0k27j14L02P44J001J127J162Q71R7p87j150q36k43L54R74J383
52809B52375J034k1p69l59Q17J675J787J468R51K07m77o34m11n31j297k178k578
52792B51059k483k179j831j564j522j601j433q19J03J068J734J674Q44J8J11R96
$$ plain form
52776 244175 245834 247400 248579 249556 250372 250924 251351 251781 251821 251021 249779 249052 249131 249392 249336 249142 249007 248757
52758 248757 248429 248532 249288 250247 251065 252048 253432 254787 255762 256819 258449 260182 261291 262099 263516 265406
52742 265406 266590 266656 266663 267570 268857 269415 269155 268914 269152 269593 270081 270992 272612 274555 276046 276486 275707 274020
52724 274020 272205 271117 270924 270894 270215 268979 268022 267756 267558 266566 264824 263257 262586 262702 263191 263959 264986
52707 264986 265846 266016 265481 264556 263249 261475 259914 259803 261428 263474 264539 264818 265533 266979 268077 268046
52691 268046 267589 267911 269083 270041 270005 269317 268791 268675 268478 267709 266554 265723 265650 265973 265965 265411 264861 264991 265949
52672 265949 267363 268762 269847 270611 271389 272585 274143 275436 275910 275696 275366 275270 275363 275577 275923 276283 276483
52655 276483 276689 277416 278972 281075 283174 284973 286579 288305 290404 292801 294925 295992 295652 294285 292567
$$ packed form
52776B44175J659J566J179R77Q16N52M27M30M0q00j242p27P9K61n6j94j35k50
52758B48757l28J03P56R59Q18R83J384J355R75J057J630J733J109Q08J417J890
52742B65406J184O6PR07J287N58k60k41K38M41M88R11J620J943J491M40p79j687
52724B74020j815j088j93l0o79j236r57k66j98r92j742j567o71J16M89P68J027
52707B64986Q60J70n35r25j307j774j561j11J625K046J065K79P15J446J098l1
52691B68046m57L22J172R58l6o88n26j16j97p69j155q31p3L23qn54n50J30R58
52672B65949J414J399J085P64P78J196J558J293M74k14l30r6R3K14L46L60K00
52655B76483K06P27J556K103K099J799J606J726K099K397K124J067l40j367j718
$$ plain form
52640 292567 290844 289047 287117 285267 283808 282825 282110 281358 280446 279532 278967 279140 280349 282606 285440 288069
52624 288069 290039 291623 293381 295343 296938 297652 297419 296364 294633 292705 291381 291045 291213 291181 290872 290615
52608 290615 290352 289701 288753 288175 288351 288870 289119 288932 288403 287490 286271 285325 285350 286396 287872 289295 290695
52591 290695 292189 293509 294155 293903 293029 292136 291816 292334 293501 294891 296227 297494 298668 299541 299938 299975 299929
52574 299929 299926 299918 299970 300329 301162 302333 303475 304196 304206 303451 302216 300940 299809 298645 297310 296086 295468 295593
52556 295593 296068 296377 296326 296067 295831 295672 295378 294619 293284 291673 290304 289529 289398 289734 290147 290172 289741 289497
52538 289497 290191 291609 292560 292242 291291 291034 291963 293410 294609 295465 296200 296840 297410 298221 299446 300601 300934
52521 300934 300450 300119 300872 302581 304307 305425 306205 307253 308712 310289 311927 314088 317218 321148 325232
$$ packed form
52640B92567j723j797j930j850j459r83p15p52r12r14n65J73J209K257K834K629
52624B88069J970J584J758J962J595P14k33j055j731j928j324l36J68l2l09k57
52608B90615k63o51r48n78J76N19K49j87n29r13j219r46K5J046J476J423J400
52591B90695J494J320O46k52q74q93l20N18J167J390J336J267J174Q73L97L7m6
52574B99929lqN2L59Q33J171J142P21J0p55j235j276j131j164j335j224o18J25
52556B95593M75L09n1k59k36j59k94p59j335j611j369p75j31L36M13K5m31k44
52538B89497O94J418R51l18r51k57R29J447J199Q56P35O40N70Q11J225J155L33
52521C00934m84l31P53J709J726J118P80J048J459J577J638K161L130L930M084
$$ plain form
52506 325232 328981 332380 335585 338490 340687 341711 341265 339278 335860 331265 325889 320269 315013 310631
52492 310631 307323 304903 302978 301301 299998 299362 299377 299602 299646 299642 299949 300524 300906 300840 300555 300317 300134 300102 300608
52473 300608 301752 302942 303586 304035 305250 307605 310517 313361 316162 319232 322624 326257 330179 334311 338144
52458 338144 341066 342881 343733 343640 342377 339855 336310 332088 327433 322636 318281 315048 313092 311707 309908
52443 309908 307464 305072 303393 302254 301163 300216 299881 300109 300359 300485 300810 301210 300974 299959 299066 299001 299191
52426 299191 298655 297427 296369 295969 296132 296870 298282 299944 301176 301996 303048 304557 306109 307573 309403
52411 309403 311795 314346 316955 320381 325426 332088 339962 348912 358820 369147 379325 389194 398445 405889
52397 405889 410008 410142 406715 400548 392563 383976 376023 369233 363383 358228 353854 350288 347294 344808
$$ packed form
52506C25232L749L399L205K905K197J024m46j987l418m595n376n620n256m382
52492C10631l308k420j925j677j303o36J5K25M4mL07N75L82o6k85k38j83l2N06
52473C00608J144J190O44M49J215K355K912K844K801L070L392L633L922M132L833
52458C38144K922J815Q52r3j263k522l545m222m655m797m355l233j956j385j799
52443C09908k444k392j679j139j091r47l35K28K50J26L25M00k36j015q93o5J90
52426B99191n36j228j058m00J63P38J412J662J232Q20J052J509J552J464J830
52411C09403K392K551K609L426N045O662P874Q950R908J0327J0178R869R251P444
52397D05889M119J34l427o167p985q587p953o790n850n155m374l566k994k486
$$ plain form
52383 344808 343158 342566 342676 342829 342719 342621 343066 344370 346394 348745 351344 354685 359263 364810 370472 375832
52367 375832 381305 387263 393128 397730 400420 401413 401108 399548 396739 393159 389609 386590 384035 381675 379537
52352 379537 378039 377673 378582 380394 382478 384452 386445 388733 391163 393201 394735 396536 399608 404130 409333
52337 409333 414354 418902 423120 427275 431760 437102 443715 451820 461683 473580 487325 502204 517675
52324 517675 533855 550985 568654 585990 602525 618499 634418 650623 667222 684069 700835
52313 700835 717341 733801 750519 767491 784585 801904 819532 837106 854124 870673 887288
52302 887288 904079 920466 935883 950191 963310 975024 985475 995293 1004729 1012916 1018442 1020587
52290 1020587 1019704 1016531 1011466 1004483 995514 984863 973366 962130 952116 943856 937420 932402 928109
$$ packed form
52383C44808j650n92J10J53j10r8M45J304K024K351K599L341M578N547N662N360
52367C75832N473N958N865M602K690R93l05j560k809l580l550l019k555k360k138
52352C79537j498l66R09J812K084J974J993K288K430K038J534J801L072M522N203
52337D09333N021M548M218M155M485N342O613Q105R863J1897J3745J4879J5471
52324E17675J6180J7130J7669J7336J6535J5974J5919J6205J6599J6847J6766
52313G00835J6506J6460J6718J6972J7094J7319J7628J7574J7018J6549J6615
52302H87288J6791J6387J5417J4308J3119J1714J0451R818R436Q187N526K145
52290A020587q83l173n065o983q969j0651j1497j1236j0014q260o436n018m293
$$ plain form
52277 928109 924156 920899 919019 918745 919863 922431 926848 933134 940743 949357 959275 970597 982574 994278
52263 994278 1005557 1016853 1028415 1040241 1052507 1065431 1078841 1092369 1105991 1119967 1134375
52252 1134375 1149045 1163714 1177769 1190106 1199836 1207018 1212159 1215180 1215548 1213304 1209119 1203272 1195411
52239 1195411 1185590 1174746 1163718 1152437 1140619 1128709 1117442 1106798 1096081 1084926 1073707
52228 1073707 1062923 1052710 1043034 1034024 1025879 1018592 1011885 1005422 999142 993506 989307 987035 986426 986686
52214 986686 987147 987692 988711 990820 994465 999493 1005026 1009996 1013998 1017594 1021674 1026506 1031524 1036063 1040087
52199 1040087 1043996 1047900 1051503 1054801 1058424 1062960 1068262 1073845 1079702 1086162 1093037 1099577 1105390 1110841
52185 1110841 1116297 1121406 1125422 1127813 1128282 1126623 1122984 1117962 1111905 1104359 1094744 1083515 1072189 1062143
$$ packed form
52277I28109l953l257j880k74J118K568M417O286P609Q614R918J1322J1977J1704
52263I94278J1279J1296J1562J1826J2266J2924J3410J3528J3622J3976J4408
52252A134375J4670J4669J4055J2337R730P182N141L021L68k244m185n847p861
52239A195411r821j0844j1028j1281j1818j1910j1267j0644j0717j1155j1219
52228A073707j0784j0213r676r010q145p287o707o463o280n636m199k272o09K60
52214I86686M61N45J019K109L645N028N533M970M002L596M080M832N018M539M024
52199A040087L909L904L603L298L623M536N302N583N857O460O875O540N813N451
52185A110841N456N109M016K391M69j659l639n022o057p546r615j1229j1326j0046
$$ plain form
52171 1062143 1053709 1046439 1039797 1033571 1027973 1023570 1020894 1019928 1020141 1021072 1022661 1024967 1027915 1031525 1036064
52156 1036064 1041548 1047173 1051614 1054070 1054853 1054904 1054908 1054956 1054872 1054636 1054478 1054742 1055714 1057464 1059711 1061925 1063681
52139 1063681 1065008 1066350 1068126 1070308 1072422 1074003 1075119 1076455 1078936 1083244 1089684 1098345 1109215 1122196
52125 1122196 1137242 1154594 1174694 1197738 1223354 1250832 1279513 1308882 1338457 1367821 1396669
52114 1396669 1424628 1451113 1475595 1497916 1518139 1536140 1551655 1564650 1575332 1583779 1589922 1594026
52102 1594026 1596860 1599323 1602039 1605381 1609436 1613674 1616999 1618549 1618379 1617018 1614456 1609849 1602259 1591343
$$ packed form
52171A062143q434p270o642o226n598m403k676r66K13R31J589K306K948L610M539
52156A036064N484N625M441K456P83N1MM8q4k36j58K64R72J750K247K214J756
52139A063681J327J342J776K182K114J581J116J336K481M308O440Q661J0870J2981
52125A122196J5046J7352K0100K3044K5616K7478K8681K9369K9575K9364K8848
52114A396669K7959K6485K4482K2321K0223J8001J5515J2995J0682Q447O143M104
52102A594026K834K463K716L342M055M238L325J550j70j361k562m607p590j0916
$$ [...]
##END NTUPLES=NMR SPECTRUM
##END=
