##TITLE=AC1507_CUNDCR13314_8126509_NYOsiGg0gN
##JCAMPDX= 6.0         $$ Bruker NMR JCAMP-DX V2.0
##DATA TYPE= NMR SPECTRUM
##DATA CLASS= NTUPLES
##ORIGIN= BRUKER
##OWNER= Administrator
$$ 1.72 TOPSPIN		Version 2.1
$$ 2013-08-16 20:26:04.007 -0700  Administrator@X
$$ Compression mode = diff/dup
##.OBSERVE FREQUENCY= 400.02188249412
##.OBSERVE NUCLEUS= ^1H
##.ACQUISITION MODE= SIMULTANEOUS (DQD)
##.ACQUISITION SCHEME= undefined
##.AVERAGES= 64
##.DIGITISER RES= 22
##SPECTROMETER/DATA SYSTEM= spect
##.PULSE SEQUENCE= noesygpps1d.comp
##.SOLVENT NAME= COFFEE_meoh
##.SHIFT REFERENCE= INTERNAL, COFFEE_meoh, 1, 14.96088
##AUDIT TRAIL= $$ (NUMBER, WHEN, WHO, WHERE, PROCESS, VERSION, WHAT)
$$ ##TITLE= Audit trail, TOPSPIN		Version 2.1
$$ ##JCAMPDX= 5.01
$$ ##ORIGIN= Bruker BioSpin GmbH
$$ ##OWNER= Administrator
$$ $$ E:\/data/COFFEE/nmr/AC1507_CUNDCR13314_8126509_NYOsiGg0gN/22/pdata/1/auditp.txt
$$ ##AUDIT TRAIL=  $$ (NUMBER, WHEN, WHO, WHERE, PROCESS, VERSION, WHAT)
(   1,<2013-08-16 20:25:59.163 -0700>,<Administrator>,<X>,<go>,<TOPSPIN 2.1>,
      <created by zg
	started at 2013-08-16 20:14:28.694 -0700,
	POWCHK enabled, PULCHK disabled,
       configuration hash MD5:
       C8 4E 4E 5D D3 5C D8 9E 9F 52 82 E0 59 8A DE 15
       data hash MD5: 64K
       68 29 1F 95 73 DF 72 11 3C C5 10 51 2E CC E9 3F>)
(   2,<2013-08-16 20:26:02.132 -0700>,<Administrator>,<X>,<proc1d>,<TOPSPIN 2.1>,
      <Start of raw data processing
       efp LB = 0.3 FT_mod = 6 PKNL = 1 PHC0 = 0 PHC1 = 0 SI = 128K 
       data hash MD5: 128K
       E9 9E 7B 09 86 41 E3 7C 2F AA 10 95 AC 60 83 F8>)
(   3,<2013-08-16 20:26:03.116 -0700>,<Administrator>,<X>,<proc1d>,<TOPSPIN 2.1>,
      <pk PHC0 = -78.58521 PHC1 = 0 
       data hash MD5: 128K
       93 FE 56 A9 E6 1C 61 01 A2 E7 C3 BB 0D 23 1E F9>)
(   4,<2013-08-16 20:26:03.491 -0700>,<Administrator>,<X>,<proc1d>,<TOPSPIN 2.1>,
      <abs ABSG = 1 
       data hash MD5: 128K
       CF C4 47 32 87 8F 76 BC 2A 67 39 BD 9E FC B2 A0>)
(   5,<2013-08-16 20:26:03.600 -0700>,<Administrator>,<X>,<proc1d>,<TOPSPIN 2.1>,
      <abs ABSG = 2 
       data hash MD5: 128K
       57 1B EE 36 21 ED 79 8D E4 86 0F 56 BA DF ED E6>)
(   6,<2013-08-16 20:26:03.678 -0700>,<Administrator>,<X>,<proc1d>,<TOPSPIN 2.1>,
      <abs ABSG = 3 
       data hash MD5: 128K
       49 79 95 0B BE BD 6B BF 82 50 47 5D E7 AA 12 20>)
(   7,<2013-08-16 20:26:03.757 -0700>,<Administrator>,<X>,<proc1d>,<TOPSPIN 2.1>,
      <abs ABSG = 4 
       data hash MD5: 128K
       4C 41 84 B4 A7 F3 3B 87 82 4A 4F A7 52 63 EE 8C>)
(   8,<2013-08-16 20:26:03.835 -0700>,<Administrator>,<X>,<proc1d>,<TOPSPIN 2.1>,
      <abs ABSG = 5 
       data hash MD5: 128K
       90 62 FA 95 EF 61 EF F9 79 77 85 5C 47 D3 7D 2B>)
$$ ##END=
$$ 
$$ $$ hash MD5
$$ $$ 6D C4 69 2F D8 65 AE 98 B0 58 E4 5D 17 C1 2A 7B
##$RELAX= 
##$RELAX= 
##$RELAX= 
##$RELAX= 
##$RELAX= 
##$RELAX= 
##$RELAX= 
##$RELAX= 
$$ Bruker specific parameters
$$ --------------------------
##$DU= <E:\>
##$EXPNO= 22
$$ [...]
150 150 150 150 150 150 150 150
##$TP07= 0
##$TPNAME0= <>
##$TPNAME1= <>
##$TPNAME2= <>
##$TPNAME3= <>
##$TPNAME4= <>
##$TPNAME5= <>
##$TPNAME6= <>
##$TPNAME7= <>
##$TPOAL= (0..7)
0.5 0.5 0.5 0.5 0.5 0.5 0.5 0.5
##$TPOFFS= (0..7)
0 0 0 0 0 0 0 0
##$TUNHIN= 0
##$TUNHOUT= 0
##$TUNXOUT= 0
##$USERA1= <user>
##$USERA2= <user>
##$USERA3= <user>
##$USERA4= <user>
##$USERA5= <user>
##$V9= 5
##$VALIST= <valist>
##$VCLIST= <CCCCCCCCCCCCCCC>
##$VD= 0
##$VDLIST= <DDDDDDDDDDDDDDD>
##$VPLIST= <PPPPPPPPPPPPPPP>
##$VTLIST= <TTTTTTTTTTTTTTT>
##$WBST= 2048
##$WBSW= 25
##$XGAIN= (0..3)
0 0 0 0
##$XL= 0
##$YL= 0
##$YMAX_a= 6338113
##$YMIN_a= -13338106
##$ZGOPTNS= <>
##$ZL1= 120
##$ZL2= 120
##$ZL3= 120
##$ZL4= 120
##$ABSF1= 14.96088
##$ABSF2= -5.597301
##$ABSG= 5
##$ABSL= 3
##$ALPHA= 0
##$AQORDER= 0
##$ASSFAC= 0
##$ASSFACI= 0
##$ASSFACX= 0
##$ASSWID= 0
##$AUNMP= <proc_prof1d_extract.lims>
##$AXLEFT= 0
##$AXNAME= <>
##$AXNUC= <1H>
##$AXRIGHT= 0
##$AXTYPE= 0
##$AXUNIT= <>
##$AZFE= 0.1
##$AZFW= 0.1
##$BCFW= 0
##$BC_mod= 0
##$BYTORDP= 0
##$COROFFS= 0
##$CY= 15
##$DATMOD= 1
##$DC= 0
##$DFILT= <>
##$DTYPP= 0
##$F1P= 0
##$F2P= 0
##$FCOR= 0.5
##$FTSIZE= 131072
##$FT_mod= 6
##$GAMMA= 0
##$GB= 0
##$INTBC= 1
##$INTSCL= 1
##$ISEN= 128
##$LB= 0.3
##$LEV0= 0
##$LPBIN= 0
##$MAXI= 10000
##$MC2= 0
##$MEAN= 0
##$ME_mod= 0
##$MI= 0
##$NCOEF= 0
##$NC_proc= -2
##$NLEV= 6
##$NOISF1= 0
##$NOISF2= 0
##$NSP= 0
##$NTH_PI= 0
##$NZP= 0
##$OFFSET= 14.96088
##$PC= 1
##$PHC0= -78.58521
##$PHC1= 0
##$PH_mod= 1
##$PKNL= yes
##$PPARMOD= 0
##$PPDIAG= 0
##$PPIPTYP= 0
##$PPMPNUM= 2147483647
##$PPRESOL= 1
##$PSCAL= 4
##$PSIGN= 0
##$PYNMP= <proc.py>
##$REVERSE= no
##$SF= 400.0200096833
##$SI= 131072
##$SIGF1= 0
##$SIGF2= 0
##$SINO= 400
##$SIOLD= 131072
##$SPECTYP= <>
##$SREGLST= <1H.CDCl3>
##$SSB= 0
##$STSI= 131072
##$STSR= 0
##$SW_p= 8223.68421052631
##$SYMM= 0
##$S_DEV= 0
##$TDeff= 65536
##$TDoff= 0
##$TI= <>
##$TILT= no
##$TM1= 0
##$TM2= 0
##$TOPLEV= 0
##$USERP1= <user>
##$USERP2= <user>
##$USERP3= <user>
##$USERP4= <user>
##$USERP5= <user>
##$WDW= 1
##$XDIM= 131072
##$YMAX_p= 399558946
##$YMIN_p= -11699
##$CURPLOT= <Network HP LaserJet P1505>
##$CURPRIN= <$Network HP LaserJet P1505>
##$DFORMAT= <normdp>
##$LAYOUT= <+/1D_H.xwp>
##$LFORMAT= <normlp>
##$PFORMAT= <normpl>
##$SURQMSG= 1
$$ End of Bruker specific parameters
$$ ---------------------------------
##NTUPLES= NMR SPECTRUM
##VAR_NAME=  FREQUENCY,     SPECTRUM/REAL,   SPECTRUM/IMAG
##SYMBOL=    X,             R,               I
##VAR_TYPE=  INDEPENDENT,   DEPENDENT,       DEPENDENT
##VAR_FORM=  AFFN,          ASDF,            ASDF
##VAR_DIM=   131072,        131072,          131072
##UNITS=     HZ,            ARBITRARY UNITS, ARBITRARY UNITS
##FACTOR=    0.0627417313425164, 1,          1
##FIRST=     8223.62146879497, -4871,        -61359
##LAST=      0,             -3849,           -62272
##MIN=       0,             -11699,          0
##MAX=       8223.62146879497, 399558946,    0
$$ Real data points
##PAGE= N=1
##DATA TABLE= (X++(R..R)), XYDATA
$$ [...]
67857 88749 88325 87820 86847 85092 82883 80917 79510 78419 77378 76469 75838 75324 74617 73732 73105 73106 73478 73400
67839 73400 72274 70506 69354 69832 71771 74032 75575 76168 76203 76187 76595 77905 80379 83725 87127 89808
67823 89808 91543 92696 93806 95224 97016 99057 101092 102795 103906 104402 104517 104490 104306 103695 102394 100396
67807 100396 97925 95209 92359 89530 87090 85419 84442 83573 82350 81068 80493 80912 81712 81978 81253 79578
67791 79578 77105 74144 71421 69763 69281 69191 68701 67924 67597 68007 68563 68561 68092 67929 68634 70020 71451 72378
67773 72378 72498 71733 70376 69163 68876 69771 71482 73414 75123 76412 77377 78383 79713 81189 82319 82909
67757 82909 83282 83862 84796 86055 87503 88713 89038 88228 86769 85392 84419 83800 83463 83259 82802 81883 80932
67740 80932 80697 81449 82845 84376 85518 85613 84255 81931 79719 78082 76416 74018 71142 68713 67250
67725 67250 66419 65587 64537 63588 63099 62907 62398 61262 59970 59244 59210 59476 59879 60585 61452 61979 62122 62562
67707 62562 63797 65451 66782 67414 67243 66216 64696 63504 62986 62428 61124 59625 59118 59734 60357 60136
67691 60136 59320 58456 57580 56646 56109 56501 57671 58869 59467 59397 59111 59260 60240 61847 63502 64802 65662 66050
67673 66050 66020 66031 66692 67920 68846 68870 68446 68481 69265 70405 71531 72604 73673 74735 75813 76852 77612 77962
67655 77962 78172 78645 79355 79866 79830 79158 77828 75926 73973 72747 72547 72866 72972 72671 72302 72123 71949 71460
67637 71460 70737 70367 70921 72291 73657 74190 73761 72910 72286 72262 72922 74049 75109 75574 75411 75080 74957 74974
67619 74974 74917 74852 75024 75506 76193 77040 78025 78925 79410 79515 79778 80715 82189 83468 83965 83826 83702 84003 84484
67600 84484 84565 83887 82442 80392 78064 76107 75210 75400 75834 75603 74627 73513 72643 71803 70740 69678 69039
67583 69039 68893 68919 68785 68394 67873 67494 67448 67521 67142 66036 64691 63846 63587 63346 62822 62400 62423 62479 61913 60856
67563 60856 60221 60578 61482 62132 62354 62614 63205 63852 64171 64195 64241 64478 64838 65236 65618 65833 65728 65406 65150 65021
67543 65021 64754 64204 63665 63530 63754 63841 63335 62290 61339 61285 62295 63445 63461 62167 60798 60558 61304 62108
67525 62108 62626 63121 63419 62908 61680 60723 60652 60963 60959 60680 60467 60257 59889 59585 59497 59279 58719 58374 58815 59574
67505 59574 59629 58781 57824 57451 57650 58092 58459 58413 57865 57273 57118 57193 57009 56753 57042 57767 58037 57420 56429 55576
67485 55576 54786 54054 53856 54451 55429 56384 57400 58435 58919 58546 57875 57559 57499 57334 57184 57248 57187 56710 56333
67466 56333 56707 57467 57632 56950 56037 55327 54785 54573 55049 55955 56427 56112 55595 55510 55888 56583 57612 58771 59588
67447 59588 60048 60706 61651 62002 61087 59631 59039 59795 61206 62477 63279 63422 62829 62013 61921 62930 64445 65809
67429 65809 67178 68990 70839 71530 70449 68492 67301 67641 68759 69304 68631 67162 65734 64881 64637 64703
67413 64703 64673 64281 63579 62799 62035 61193 60291 59591 59266 59120 58847 58501 58504 59156 60287 61403 62065 62124 61720 61092
67393 61092 60413 59770 59294 59125 59158 59017 58529 58156 58604 59893 61120 61403 60841 60292 60295 60594 60708 60648 60842 61592
67373 61592 62829 64324 65897 67399 68635 69393 69504 68915 67726 66149 64445 62934 62024 62033 62872 63989
67357 63989 64750 64808 64154 63013 61802 60919 60390 59896 59362 59265 60040 61412 62728 63755 64658 65277 65125 64225
67339 64225 63356 63188 63669 64518 65805 67565 69269 70289 70735 71306 72387 73705 74829 75603 76032 76192 76365
67322 76365 76957 78040 79105 79445 78824 77694 76740 76179 75597 74558 73232 72177 71633 71385 71301 71425 71426 70614
67304 70614 68932 67412 67068 67679 68241 68354 68501 69134 70169 71370 72548 73278 73083 72130 71256 71088 71523
67287 71523 72227 73170 74362 75401 75698 75084 74019 73249 73236 73749 74012 73489 72455 71597 71224 71235 71678 72670
67269 72670 73776 74199 73926 74086 75681 78342 80795 82273 83023 83554 83874 83587 82499 80999 79799 79249
67253 79249 79015 78583 77924 77332 76776 76000 75258 75252 76027 76530 75753 73895 71956 70562 69740 69526 70097 71285
67235 71285 72513 73358 73917 74574 75605 76991 78388 79365 79792 79872 79685 79000 77788 76637 76232 76579 77102
67218 77102 77404 77627 78127 79103 80383 81308 81065 79570 77815 76889 76824 76963 77216 78127 79628 80631 80378 79585
67200 79585 79692 81247 83559 85650 87059 87775 87981 88029 88354 89219 90635 92502 94646 96642 97858 97910 97068
67183 97068 96118 95749 96119 96954 97871 98527 98554 97740 96379 95250 94919 95183 95407 95413 95684 96648 98082 99441 100502
67164 100502 101365 101976 102038 101482 100671 99969 99357 98685 98177 98374 99553 101366 103056 103939 103747 102784 101724 101070
67146 101070 100774 100557 100509 100973 101858 102580 102920 103456 104743 106482 108006 109194 110321 111300 111807 112056 112643
67129 112643 113616 114435 114931 115544 116374 116808 116526 116154 116402 117110 117681 118001 118305 118526 118393 117986 117668 117667 118099
67110 118099 119167 120901 122961 125036 127075 128767 129384 128744 127886 127994 128936 129667 129796 129888 130356 131062 132036
67093 132036 133631 135745 137676 139010 139986 140786 141271 141667 142688 144492 146212 147092 147481 148134 149036 149682
67077 149682 150144 151132 153006 155297 157232 158331 158556 158255 158073 158615 160064 162121 164309 166295 168083 169938
67061 169938 171966 173739 174671 174826 174996 175776 176930 177949 178860 180052 181516 182776 183593 184343 185578 187442
67045 187442 189647 191870 194007 196011 197646 198648 199206 200018 201560 203503 205211 206672 208407 210562 212749
67030 212749 214895 217466 220482 223005 224281 224930 226284 228775 231654 234195 236453 238708 240842 242634
67016 242634 244338 246531 249449 252679 255549 257777 259740 262155 265521 269813 274537 278935 282320 284590
67002 284590 286458 288902 292235 295952 299463 302660 305706 308707 311791 315070 318312 321002 323063 325144
66988 325144 327877 331229 334920 339025 343651 348340 352379 355537 358052 360179 362295 365166 369372 374501
66974 374501 379527 384005 388339 392913 397648 402533 407950 414159 420901 427733 434413 440810 446915 453064
66960 453064 459702 466704 473407 479564 485799 492787 500432 508220 515989 523842 531656 539311 547229 556064
66946 556064 565806 575663 584973 593890 603042 612837 623290 634268 645687 657518 669831 682752 696274
66933 696274 710127 723945 737552 751081 764854 779284 794789 811599 829516 847974 866483
66922 866483 885052 904091 923958 944694 966111 988007 1010296 1033067 1056508 1080582 1104876
66911 1104876 1129090 1153670 1179599 1207408 1236692 1266749 1297300 1328352 1359794 1391608 1424223
66900 1424223 1458131 1493246 1529075 1565503 1602930 1641617 1681266 1721376 1761731 1802520 1844187
66889 1844187 1887060 1930786 1974187 2016135 2056666 2096905 2137801 2179213 2220196 2259798 2297567
66878 2297567 2333740 2369069 2404112 2438525 2471331 2501801 2529600 2554158 2574710 2591376 2605498
66867 2605498 2618225 2629110 2636723 2640441 2640920 2638882 2634050 2625568 2613069 2597037 2578287 2557321 2534145
66854 2534145 2508541 2480367 2449651 2416567 2381480 2344899 2307104 2267870 2226818 2184088 2140389
66843 2140389 2096378 2052276 2008137 1964099 1920241 1876549 1833190 1790455 1748296 1706358 1664677
66832 1664677 1623852 1584197 1545253 1506634 1468857 1432642 1397682 1362922 1327996 1293642 1260594
66821 1260594 1228702 1197432 1166729 1136985 1108404 1080708 1053423 1026384 1000011 975050 951841
66810 951841 929876 908233 886379 864388 842679 821862 802619 785103 768410 751169 732862
66799 732862 714211 696206 679207 663129 647942 633615 619877 606507 593675 581696 570557
66788 570557 559910 549434 538951 528336 517584 506929 496700 487040 477871 469083 460633 452507
66776 452507 444698 437194 429935 422817 415701 408346 400440 391946 383414 375628 368883 362853 357255 352240
66762 352240 347900 343721 338973 333527 327971 322904 318358 313897 309123 304124 299490 295739 292592 289019
66748 289019 284286 278807 273691 269521 265903 262110 257833 253250 248727 244584 240889 237394 233856 230518
66734 230518 228003 226525 225425 223778 221414 219069 217493 216609 215619 213772 210895 207295 203423 199692 196389
66719 196389 193540 190952 188575 186709 185549 184630 183195 181227 179630 179017 178771 177785 175897 173916 172316
66704 172316 170581 168080 165028 162220 160144 158690 157469 156089 154326 152396 150926 150285 150016 149239 147586
66689 147586 145451 143378 141612 140309 139728 139837 140025 139610 138607 137616 136880 135854 133957 131453 129177 127508
66673 127508 126091 124650 123515 123001 122728 122147 121509 121606 122499 123185 122818 121713 120769 120341 120177 120064 119891 119207
66655 119207 117459 114815 112281 110713 110010 109466 108648 107662 106742 105894 105044 104375 104343 105223 106667 107912 108517
66638 108517 108618 108346 107375 105444 103127 101472 100889 100872 100846 100746 100610 100176 99240 98010 96786 95586 94427
66621 94427 93637 93501 93818 94143 94242 94022 93338 92289 91455 91309 91572 91635 91440 91427 91711 91932 91919 91836 91560 90608
66601 90608 88970 87425 86599 86153 85373 84211 83211 82656 82302 81924 81624 81541 81584 81519 81150 80426 79594 79155 79420
66582 79420 80116 80729 81175 81802 82681 83283 83083 82216 81271 80636 80293 80135 80141 80176 79890 79015 77702 76420 75453
66563 75453 74561 73250 71503 70150 70255 71922 73922 74805 74388 73786 73951 74631 75065 75220 75691 76538 77011
66546 77011 76604 75749 75062 74377 73144 71431 69916 68950 68258 67606 67170 67050 66939 66632 66498 67002 67936 68534
66528 68534 68333 67612 66969 66651 66410 65896 65119 64497 64483 65218 66548 68182 69672 70427 70173 69402 68974 69166
66510 69166 69461 69390 69123 68901 68362 66950 64885 63172 62618 63194 64368 65676 66855 67727 68193 68262 67963 67302
66492 67302 66341 65248 64255 63586 63338 63283 62899 61829 60351 59228 59064 59889 61312 62832 64015 64602 64662
66475 64662 64541 64585 64846 65034 64749 63840 62713 62209 62958 64770 66693 67762 67730 67169 66926 67381 68090 68199
66457 68199 67320 65909 64753 64227 64227 64592 65248 66050 66840 67695 68731 69611 69641 68615 67301 66803 67499 68810
66439 68810 69878 70259 70033 69534 69088 68922 69129 69656 70298 70783 70932 70775 70483 70223 70060 69938 69679 69137 68440
66420 68440 67968 67952 68197 68347 68301 68164 67918 67478 67010 66840 66986 67085 66844 66264 65382 64216 63133 62869 63778
66401 63778 65289 66459 66941 67083 67235 67314 67076 66507 65861 65502 65702 66370 66953 66881 66230 65761 66124 67078 67677
66382 67677 67224 65956 64754 64277 64508 65108 65949 67093 68310 68983 68693 67779 67122 67331 68238 69129 69439 69195
66364 69195 68846 68720 68741 68740 68909 69637 70873 71878 71794 70336 67899 65196 62983 61865 61939 62578 62876 62447
66346 62447 61726 61408 61718 62314 62797 63203 63917 65169 66675 67839 68275 68066 67541 66927 66269 65561 64813 64028
66328 64028 63190 62319 61501 60881 60606 60788 61492 62721 64278 65636 66176 65800 65172 65098 65722 66588 67378 68153
66310 68153 68913 69410 69569 69713 70138 70838 71802 73145 74614 75430 75109 74184 73651 73920 74737 75780 76696 76827
66292 76827 75736 74053 73033 73045 73179 72590 71568 70826 70392 69882 69478 69794 70823 71684 71619 70838 70166 70118
66274 70118 70471 70545 69775 68117 66082 64352 63336 63049 63327 64009 64960 66052 67208 68371 69461 70451 71434
66257 71434 72430 73136 73084 72175 70957 70174 70115 70482 70855 71118 71388 71721 72039 72277 72452 72536 72353 71703 70611
66238 70611 69445 68757 68892 69730 70809 71742 72394 72669 72375 71509 70567 70227 70707 71657 72653 73572 74429 75189
66220 75189 75817 76311 76562 76478 76318 76529 77077 77323 76871 76168 75889 76058 76227 76231 76212 76107 75760 75473 75799 76699
66200 76699 77474 77717 77734 77835 77728 77030 75974 75171 74835 74616 74093 73225 72370 71988 72337 73349 74831 76599
66182 76599 78216 78890 78152 76577 75292 74660 74027 72942 72012 72140 73414 75137 76618 77540 77887 77898 77873
66165 77873 77713 77028 75894 74982 74595 74160 73190 72160 71757 71847 72053 72810 74670 76788 77412 76099 74351
66148 74351 73657 73881 74039 73817 73614 73707 74039 74500 74915 75083 75219 75900 77159 78080 77865 76924 76384 76809 77974
66129 77974 79561 81416 83195 84401 84801 84439 83377 81833 80391 79490 78872 78126 77670 78377 80135 81635
66113 81635 81980 81808 82242 83256 83759 83104 81882 81160 81381 82136 82746 82928 82959 83230 83707 83940 83677 83197 82881
66094 82881 82698 82369 81890 81578 81739 82555 84143 86349 88506 89869 90382 90641 90983 91049 90529 89885 89848 90388
66076 90388 90746 90480 90035 90099 90714 91287 91263 90607 89676 88800 88022 87235 86605 86701 87954 89981 91745 92521 92473
66057 92473 92171 91858 91476 91149 91153 91409 91371 90546 88960 87098 85567 84806 84866 85378 85869 86162 86369 86567 86759
66038 86759 87099 87765 88497 88637 87969 87261 87573 89103 91025 92473 93356 94121 94988 95688 95909 95802 95979 96958
66020 96958 98686 100650 102501 104373 106475 108545 110035 110889 111781 113354 115388 117034 117828 118112 118417 118812
66004 118812 119118 119496 120412 122081 124296 126793 129438 132066 134580 137342 140980 145525 150127 154010 157318
65989 157318 160572 163681 166133 167963 169721 171495 172728 173210 173529 174117 174436 173607 171482 168613 165519
65974 165519 162437 159543 156895 154236 151296 148151 145037 141927 138721 135702 133329 131588 129944 128019
65960 128019 126093 124847 124787 125818 127153 127783 127335 126474 126198 126851 128047 129342 130607 131842 133132 134731
65944 134731 136755 138793 140314 141512 143254 145992 149189 152023 154229 155922 156990 157140 156473 155712 155807
65929 155807 157314 159925 162550 164135 164679 165225 166689 168879 170870 172119 172951 174092 176050 178972 182826
65914 182826 187566 193138 199350 205808 212046 217691 222467 226234 229212 231958 234794 237327 238891 239404
65900 239404 239310 238798 237698 236289 235520 236016 237312 238429 238784 238243 236807 234778 232747 230824 228202 224140
65884 224140 219080 214168 209858 205688 201230 196451 191226 185378 179399 174333 170626 167684 164777 161835
65870 161835 159066 156473 154124 152322 151009 149521 147463 145438 144302 144050 144023 143930 143958 144025 143678 142809 141841
65853 141841 141005 139994 138609 137325 136830 137267 138192 139102 139763 140233 140757 141549 142454 143040 143236 143698 145137
65836 145137 147342 149293 150312 150804 151665 153315 155572 158168 160945 163590 165698 167310 169078 171658 175098
65821 175098 179034 183328 188210 193864 200135 206622 212831 218266 222668 226265 229501 232348 234084 234007 232281
65806 232281 229887 227704 225743 223254 219532 214575 209086 203851 199180 194915 190893 187260 184313 182194
65792 182194 180801 179906 179241 178521 177517 176162 174638 173356 172766 173102 174308 176290 179212 183376 188806
65777 188806 195078 201687 208537 215977 224352 233539 242866 251591 259466 266694 273186 278066 280253 279475
65763 279475 276343 271425 264787 256620 247754 239045 230588 222107 213931 206988 201831 198344 196493 196731
65749 196731 199257 203424 208449 214446 222219 232142 243772 256544 270204 284342 298070 310648 322174
65736 322174 333130 343366 352037 358565 363116 365825 365961 362388 354761 343913 331071 317036 302194
65723 302194 286949 271874 257587 244583 233070 222777 213072 203500 194171 185519 177746 170715 164352
65710 164352 158851 154406 150871 147854 145101 142651 140645 139048 137631 136211 134871 133943 133689 133988 134332
65695 134332 134214 133583 132895 132656 132986 133694 134694 136074 137721 139173 140110 140766 141569 142537 143443 144508 146379
65678 146379 149243 152442 155364 158375 162472 168156 175102 182838 191330 200805 211322 222650 234413
65665 234413 246431 259093 273344 289885 308240 326867 344302 359975 373956 386378 397425
65654 397425 407476 416720 424737 430911 435290 438618 441419 443456 444386 444622 445151 446515 448370 450076 451427
65639 451427 452535 453149 452386 449167 442874 433635 422081 408825 394037 377481 359081 339413 319548
65626 319548 300438 282558 266037 250849 236819 223760 211760 201152 192005 183913 176528 170079
65614 170079 165001 161182 157969 154904 152002 149279 146488 143566 140924 138955 137545 136411 135653 135499 135660
65599 135660 135495 134865 134355 134462 134996 135542 136175 137264 138755 140102 140900 141267 141523 141804 142071 142250 142272 142250
65581 142250 142726 144456 147680 151887 156594 162178 169428 178344 187926 197363 207038 218047 230991 245586
65567 245586 261230 277461 293786 309488 323930 336911 348482 358424 366167 371250 373695 373706 371139
65554 371139 365570 356928 345773 332802 318384 302892 287192 272276 258418 245183 232338 220263
65542 220263 209322 199425 190603 183516 178771 175982 174109 172588 171555 171051 170699 170341 170383 171136 172210
65527 172210 172958 173268 173539 173932 173964 172882 170332 166639 162447 158105 153539 148845 144742 142032 140643 139691
65511 139691 138584 137616 137254 137323 137328 137234 137448 138194 139344 140765 142369 143827 144630 144596 144044 143451 143115 143148 143488
65492 143488 143836 143906 143886 144451 146148 148870 152024 155104 158065 161283 165239 170076 175330 180159 183909 186414
65476 186414 187828 188370 188303 187870 187066 185637 183526 181126 178816 176323 172946 168512 163822 159934 157178
65461 157178 155076 153063 150958 148707 146078 142938 139689 137091 135513 134588 133713 132742 132034 131908 132280 132838
65445 132838 133375 133845 134272 134755 135463 136473 137584 138421 138783 138875 139217 140341 142506 145602 149274 153228 157404
65428 157404 161793 166066 169551 171679 172364 171914 170704 169082 167385 165761 163982 161711 158986 156223 153724
65413 153724 151502 149678 148605 148328 148266 147854 147316 147341 148103 149090 149912 150734 151819 153142 154758 157058 160190
65396 160190 163531 166205 168007 169400 170701 171784 172673 174008 176629 180774 185699 189920 191910 191051 188207
65381 188207 185132 182968 181400 179444 176890 174585 173325 172905 172500 171693 170784 170176 169890 169806 170112 171189
65365 171189 173081 175358 177631 180072 183183 187053 191079 194674 198169 202690 208984 216617 224626 232690
65351 232690 241166 250034 258470 265768 272186 278330 284026 288385 290917 291996 292185 291568 289900 286944 282555
65336 282555 276798 270254 263826 257956 252254 246105 239399 232422 225348 218153 210896 203769 196972 190766
65322 190766 185513 181451 178505 176469 175126 174047 172644 170820 169284 168692 168633 168019 166466 164730 163654
65307 163654 163235 163014 162888 163123 163799 164700 165639 166544 167183 167173 166460 165629 165539 166673 168908 171867 175244 178730
65289 178730 181871 184367 186468 188739 191270 193418 194485 194408 193618 192498 191297 190338 189863 189698 189358 188455
65273 188455 186800 184325 181276 178415 176529 175655 175125 174361 173274 171906 170230 168459 167037 166033 164997
65258 164997 163720 162744 162663 163213 163625 163701 163974 164705 165293 164994 163923 162953 162638 162538 161717 159763 157159 154653
65240 154653 152490 150383 148132 146004 144448 143600 143191 142848 142412 142006 141877 142174 142874 143953 145538 147753
65224 147753 150419 152995 154866 155635 155269 154103 152689 151501 150773 150607 151034 151790 152265 152050 151439 151079 151194
65207 151194 151522 151913 152532 153418 154313 155051 155669 156031 155874 155404 155261 155602 155723 155053 153990 153212 152617 151619
65189 151619 150306 149571 150058 151466 152930 153793 154069 154539 156250 159457 163134 165933 167518 168527 169435 170185
65173 170185 170838 171765 172972 173934 174446 175014 176023 177101 177810 178510 179927 182146 184603 186913 189167 191512
65157 191512 194010 196970 200942 206138 212089 218005 223389 228349 233559 239902 247964 257729 268808 280914
65143 280914 294096 308669 325029 343281 362856 382736 402394 422253 442802 463396 482507
65132 482507 499210 513899 527454 540192 551873 562136 570489 576176 578543 577418 572951 565384 555382
65119 555382 544240 533080 521780 509151 494211 476945 457903 437639 416790 396163 376313
65108 376313 357205 338570 320468 303332 287658 273822 261985 251894 242919 234520 226648 219537
65096 219537 213284 207789 202960 198704 194811 191088 187556 184360 181669 179794 179180 179882 181160 181996 182077
65081 182077 181983 182355 183143 183758 183742 183226 182748 182633 182507 181673 180091 178692 178373 178960 179590 179821 179776 179413 178494
65062 178494 177312 176617 176520 176237 175337 174546 174732 175639 176338 176536 176723 177167 177499 177347 176824 176320 176166 176562 177481
65043 177481 178561 179309 179455 179023 178210 177333 176645 175929 174587 172466 170343 169116 168741 168426 167671 166583 165358
65026 165358 164074 162921 161918 160430 157754 154360 151784 150922 151091 151261 151509 152530 154108 154999 154416 153033
65010 153033 152216 152689 154164 156055 158208 160869 164110 167526 170627 173415 176383 179836 183420 186439 188562
64995 188562 190101 191612 193311 194931 196128 196943 197727 198660 199610 200525 201596 202793 203596 203669 203571 204279 206006
64978 206006 207990 209478 210436 211178 211790 212152 212164 211727 210698 209004 206623 203466 199615 195609 192076 189015
64962 189015 185953 182833 180172 178203 176476 174606 172805 171293 169771 167968 166192 164782 163518 162173
64948 162173 161189 161076 161468 161553 161235 161117 161468 161958 162376 162812 163096 162829 162129 161621 161507 161384 161246 161880 163756
64929 163756 166098 167649 167914 167150 165683 163973 162992 163560 165186 166333 166085 164985 164008 163321 162580 162001
64913 162001 162403 164199 166926 169846 172581 174941 176653 177705 178670 180199 182248 184239 185944 187784 190280
64898 190280 193697 198272 204199 211069 217859 223960 229920 236688 244292 251658 257582 261586 264048 265956
64884 265956 268297 271163 273571 274663 274955 275774 277470 278904 278846 277282 274998 272476 269610 266133 261866
64869 261866 256837 251582 247113 244153 242458 241236 240103 239283 238927 238624 237749 236084 233929 231590 228859
64854 228859 225078 219869 213752 207811 202738 198416 194466 190868 187793 185118 182511 179893 177524 175629
64840 175629 174189 173092 172280 171721 171409 171465 172068 173222 174601 175717 176293 176513 176825 177348 177551 176789 175225
64823 175225 173905 173730 174641 176091 177971 180580 183804 186992 189834 192885 196852 201691 206852 212206 218207
64808 218207 225051 232206 239091 245916 253418 261847 270612 278998 286773 293865 299733 303529 304791 303663
64794 303663 300456 295364 288723 281209 273580 266368 259860 254097 248703 243022 236790 230639 225623 222273
64780 222273 220338 219317 218914 218824 218567 217968 217728 219048 222438 227139 231978 236638 241744 247784 254438 261112
64764 261112 267651 274114 280264 285925 291722 298745 307233 316039 323708 329720 334449 338325 341530 344310
64750 344310 347024 349726 351959 353121 353035 352154 351236 350693 350122 348555 345269 340309 334245 327615 320703 313632
64734 313632 306469 299258 292007 284582 276739 268582 261025 255307 251828 249837 248496 247766 247825 248167 248088 247851
64718 247851 248544 250632 253415 256122 258861 262084 265633 268927 271803 274606 277532 280317 282606 284229
64704 284229 285042 284787 283360 281085 278493 275701 272151 267126 260608 253510 246957 241394 236529 231998 227783
64689 227783 223986 220567 217468 214795 212682 211077 209838 208889 208238 208016 208677 210923 215117 220796 226986
64674 226986 232959 238584 244090 249843 256368 264149 273128 282576 291684 300210 308344 316037 322732 327754
64660 327754 330678 331223 329081 324169 316986 308462 299422 290413 282001 274882 269521 265763 262992 260656
64646 260656 258615 257152 256706 257458 259105 261153 263540 266761 271278 276995 283539 290841 299193 308859 319887
64631 319887 332213 345657 359820 374164 388124 400983 411858 420182 426026 429520 430131 427149 420949
64618 420949 413074 404770 395984 386272 376142 366827 358897 351755 344562 337172 330058 323740 318522 314492
64604 314492 311464 308998 306628 304102 301345 298327 295066 291669 288214 284569 280451 275777 270912 266445
64590 266445 262651 259269 255903 252611 249937 248407 248081 248574 249338 249939 250294 250840 252366 255485 260205 265988
64574 265988 272216 278579 285063 291540 297384 301718 304172 305330 306123 306865 307098 306262 304183 300856 296188
64559 296188 290117 282803 274571 265976 257914 251194 245750 240668 235328 230162 225949 222704 219767 216816
64545 216816 214269 212696 212235 212642 213567 214772 216315 218497 221375 224381 226707 228084 228905 229577 230000 229700
64529 229700 228297 225928 223373 221607 220932 220677 220055 219121 218501 218421 218570 218833 219468 220422 221130 221269 221217 221405
64511 221405 221707 221849 222079 222996 224901 227623 230786 233991 236980 239983 243732 248824 255180 262331 270032
64496 270032 278308 287108 296262 305634 314947 323516 330498 335423 338292 339252 338453 336177 332794 328573 323717
64481 323717 318590 313684 309391 305847 302894 300007 296518 292260 287842 283967 280531 276862 272795 269002
64467 269002 266098 263887 261830 259944 258799 258698 259242 259810 260276 261078 262629 264815 267123 269164 270894
64452 270894 272386 273628 274632 275502 276216 276547 276475 276489 277204 278772 280968 283737 287332 291951 297626 304420
64436 304420 312318 320897 329571 338373 348113 359576 372877 387846 404724 424149 446746 473090
64424 473090 503909 539902 581402 628531 681682 741594 808888 883682 965559 1053634 1146568
64413 1146568 1242578 1339349 1433936 1523101 1604314 1676578 1739970 1794123 1837215 1866510 1879802
64402 1879802 1876412 1857134 1823521 1777241 1719915 1653286 1579187 1499097 1413857 1324163 1231464
64391 1231464 1138196 1047037 960053 878598 803656 735847 675124 620867 572496 529915 493303
64380 493303 462516 436791 414951 395949 379367 365499 354796 347057 341176 335753 329889 323442
64368 323442 316732 310252 304419 299215 294084 288528 282792 277590 273088 268660 263879 259223 255402 252430
64354 252430 249965 248206 247704 248384 249562 251090 253747 258112 263632 269240 274524 279814 285373 290916 295741
64339 295741 299098 300634 300747 300220 299279 297350 294053 290028 286331 283410 281227 279968 279782 279980 279404 277823
64323 277823 276266 275745 276239 277139 278041 278690 278654 277605 275736 273568 271606 270328 270127 270897 271908 272427 272218
64306 272218 271244 269235 265976 261771 257229 252734 248402 244251 240054 235336 230060 225093 221436 219133
64292 219133 217500 216311 216028 216841 218222 219726 221583 224091 226973 229848 232981 236980 241855 246869 251368
64277 251368 255421 259618 264482 270111 276204 282394 288674 295464 303114 311333 319262 326093 331496 335497
64263 335497 338145 339460 339607 338988 338094 337273 336634 336164 335863 335690 335447 334842 333704 332028 329773 326705 322474
64246 322474 316834 309800 301737 293293 285121 277576 270703 264467 258869 253854 249368 245546 242646 240697
64232 240697 239441 238728 238762 239696 241102 242134 242247 241639 240990 240818 241045 241119 240649 239892 239505 239762 240323 240848
64214 240848 241475 242339 242897 242262 240206 237384 234480 231539 228377 225358 223388 223136 224404 226305 228037
64199 228037 229471 230919 232405 233449 233825 234318 236252 240258 245792 251884 258055 264431 271412 279433 288724
64184 288724 298972 309471 319917 330829 342827 355598 367891 378506 386880 392641 394975 392825
64172 392825 385799 374779 361557 347850 334591 322050 310364 299690 289960 280833 272084 263896
64160 263896 256687 250822 246485 243466 240952 237922 234141 230513 228150 227248 227233 227712 228768 230438 232437
64145 232437 234547 236873 239624 242958 247002 251635 256216 259985 262828 265214 267309 268714 269231 269299 269229
64130 269229 268609 266970 264681 262536 260822 259412 258527 258583 259313 259885 260101 260866 263162 267068 272077 277896
64114 277896 284522 291902 299931 308573 317680 326960 336409 346434 357129 367758 377485 386425 395295
64101 395295 404082 411732 417364 421299 424671 428452 433121 438860 445595 453007 460811 468934 477189 484940
64087 484940 491363 495889 498179 497846 494605 488635 480539 470977 460502 449591 438468 426936 414782
64074 414782 402383 390604 380026 370590 362011 354176 347058 340631 335020 330396 326536 322840 319039
64061 319039 315589 313103 311706 311218 311588 312730 314187 315475 316662 318206 320338 323058 326582 331247 336908
64046 336908 342963 349109 355693 363166 371520 380456 389794 399598 410085 421468 433572 445596 456605
64033 456605 466364 475324 483705 490976 496387 499605 500632 499559 496681 492488 487294 481289 475162 470093
64019 470093 466629 464023 461279 458435 456150 454352 452084 448611 443935 438190 431257 423149 414262 405063
64005 405063 396008 387761 380864 375080 369695 364653 360688 358008 355650 352752 349839 348033 347438 347198 347000
63990 347000 347537 349303 351779 354241 356811 360156 364436 369153 373960 379128 385058 391712 398800 406362
63976 406362 414772 424097 433755 443126 452368 462382 473943 487125 501567 516911 532839 549089
63964 549089 565863 584044 604564 627496 652135 678068 705864 736487 770319 807087 846705
63953 846705 889819 937493 990718 1050563 1118618 1196815 1286650 1388934 1504504 1634845 1781621
63942 1781621 1945702 2126937 2324611 2537492 2763377 2999251 3242187 3489700 3738859
63933 3738859 3985354 4223846 4448980 4655776 4839389 4995207 5119420 5209301 5263051 5279659
63923 5279659 5258878 5201068 5107107 4978755 4819069 4632190 4422774 4195845 3956936 3711689
63913 3711689 3464991 3220685 2982102 2752440 2534522 2330542 2142196 1970655 1816134
63904 1816134 1677870 1554846 1446379 1351759 1269601 1198041 1135561 1081325 1034738 994941 960763
63893 960763 930929 904190 879398 855696 832761 810868 790480 771534 753173 734460 715364
63882 715364 696743 679364 663401 649057 637027 627835 621071 615948 612440 611301 612961 617033 623006
63869 623006 630864 640766 652553 665848 680344 695805 712071 729248 747538 766618 785551 803622
63857 803622 820945 837860 853974 868311 880251 889839 897215 902250 904868 905264 903524 899348 892415
63844 892415 882845 871083 857387 841610 823499 803118 780997 757845 734066 709534 683955 657444
63832 657444 630612 604119 578314 553340 529357 506501 484766 464098 444614 426654 410575
63821 410575 396444 383896 372415 361852 352558 344759 337937 331159 324041 317066 310868 305573 301021
63808 301021 297255 294487 292740 291793 291301 290795 289767 288075 286142 284512 283262 282047 280558 278729 276620
63793 276620 274367 272105 269735 266944 263736 260708 258398 256543 254414 251754 248957 246408 244187 242382
63779 242382 241091 240010 238565 236653 234766 233191 231589 229717 228094 227506 228037 228986 229585 229508 228827 227801
63763 227801 226674 225517 224300 223188 222566 222704 223562 224973 226667 228031 228308 227348 225907 224943 224859 225566
63747 225566 226875 228451 229746 230443 230825 231400 232343 233589 235198 237235 239500 241766 244110 246717 249562
63732 249562 252594 255928 259474 262723 265419 268095 271361 274909 277935 280319 282597 284960 287187 289624
63718 289624 293197 298104 303317 307821 311613 314958 317402 318312 318013 317529 317266 316593 314816 312133 309399
63703 309399 307245 305617 304123 302691 301698 301434 301663 301975 302384 303199 304433 305831 307404 309399 311714 313998
63687 313998 316451 319736 323743 327218 329253 330522 332320 334780 336875 337916 338171 338046 337513 336585 335789
63672 335789 335770 336721 338344 340124 341574 342499 343124 343756 344344 344625 344667 344859 345298 345487 344784 342908 339959 336276
63654 336276 332382 328762 325418 321848 317660 313071 308646 304668 301031 297690 294943 293184 292543 292916 294247
63639 294247 296498 299279 301823 303708 305511 308363 312691 317684 322177 325838 329335 333571 339039 345748
63625 345748 353393 361501 369581 377263 384482 391713 399968 410143 422181 435182 448504 462504 478093
63612 478093 495965 516470 539656 564956 591303 618243 646642 677599 710830 744843 778533
63601 778533 811689 843831 873462 898902 919209 933882 942420 944914 942750 937941 931753 924312 915382
63588 915382 905011 893379 880463 866018 849681 831018 809688 785785 759931 732937 705363
63577 705363 677515 649980 624017 601115 581913 565690 551208 538015 526769 518370 513110 510633
63565 510633 510330 511660 514300 518154 523077 528644 534506 540944 548668 557941 568305 579342 591327 604860
63551 604860 620218 637499 657106 679658 705469 734417 766226 800566 836962 874996 914519
63540 914519 955217 995701 1033214 1064470 1086934 1099651 1103354 1099967 1091691 1080152 1066285 1050947
63528 1050947 1035383 1020736 1007093 993337 978071 960489 940067 915779 886401 851932 814259
63517 814259 775910 738319 701649 665989 631996 600340 571205 544640 520951 500366 482537
63506 482537 466714 452287 439050 427144 416900 408475 401459 395018 388613 382397 376822 372178 368610
63493 368610 366155 364468 362904 361283 360226 360229 360679 360400 359118 357820 357583 358591 360485 363164 366770 371048
63477 371048 375131 378111 379824 381047 382848 385624 388740 391176 392435 392821 392928 393030 392809 391551 388751
63462 388751 384731 380584 377287 374927 372999 371322 370322 370428 371507 372988 374330 375342 376272 377700 380137
63447 380137 383637 387891 392623 397740 403181 408946 415335 422863 431795 442028 453525 466548 481266
63434 481266 497431 514844 534020 555957 581143 609021 638427 668167 696957 723231 745665
63423 745665 764113 779706 793862 807442 821119 836192 854403 876821 903339 933395 966721
63412 966721 1003039 1041353 1080024 1117397 1151954 1181958 1205593 1221773 1230608 1232950 1229680 1221604
63400 1221604 1209755 1195410 1179715 1163359 1146495 1128757 1109266 1086828 1060472 1029980 995886
63389 995886 958927 919662 878750 837430 797341 759771 725277 694051 666208 641564 619535
63378 619535 599741 582518 568429 557378 548663 541966 537857 537109 539737 544885 551551 559344 568669
63365 568669 580255 594462 611002 629350 649260 670755 693815 718517 745474 775712 809782
63354 809782 847149 886626 927319 968921 1011085 1052668 1091725 1126227 1154733 1176424 1190815
63343 1190815 1197844 1198265 1193577 1185233 1174063 1160596 1145583 1129750 1113141 1095088 1074877 1052125
63331 1052125 1026551 997849 966052 931834 896253 860280 824613 789801 756434 725265 697127
63320 697127 672648 652020 635104 621670 611420 603855 598171 593097 586755 577173 563476 546531
63308 546531 528057 509202 490328 471933 455007 440254 427480 416089 405903 397219 390276 384859
63296 384859 380365 376177 372064 368200 364668 361200 357650 354419 351879 349571 346633 342972 339325 336100
63282 336100 332971 329800 327118 325240 323681 322044 320854 320766 321450 322001 322096 322030 321911 321692 321815 322942 324963
63265 324963 327030 328749 330649 333229 336172 338841 341104 343258 345524 347975 350760 354035 357739 361683
63251 361683 365836 370369 375467 381172 387366 393857 400591 407820 415929 425039 434867 445077 455742 467460
63237 467460 481017 496858 514770 534068 554134 574735 595813 617172 638616 660330 682874
63226 682874 706604 731165 755675 779482 802730 826073 849833 873631 896982 920001 943182
63215 943182 966581 989635 1011721 1032337 1050691 1065728 1076921 1084499 1088490 1087988 1081910 1070124
63203 1070124 1053353 1032309 1007588 980195 951439 922232 893034 864523 837801 813816 792953
63192 792953 775289 760907 749932 742524 738785 738463 740947 745957 753971 765391 779437 794604 810245
63179 810245 827012 845580 865678 886609 908030 929758 951381 972561 993322 1013534 1032428
63168 1032428 1049128 1063468 1075812 1086156 1093813 1097887 1097754 1093105 1083835 1069949 1051463 1028430
63156 1028430 1001189 970555 937620 903409 868726 834220 800503 768221 737972 710050 684362
63145 684362 660760 639330 620096 602666 586570 571899 559186 548647 539993 532935 527317 522724
63133 522724 518580 514869 512161 510671 509877 509403 509666 511156 513567 516200 518883 522007 525907 530636 536037
63118 536037 541665 546962 551855 556853 562236 567703 573218 579454 586565 593192 597749 600468 603021 606245
63104 606245 609342 611462 612880 614185 615268 615777 615897 616014 615989 615355 614020 612384 610899 609785 608964 608165
63088 608165 607353 607127 608241 610543 612838 614101 614405 614499 614947 616078 618207 621323 624878 628454 632431 637467
63072 637467 643528 650020 656807 664539 673873 684849 697095 710184 723681 737337 751595 767600
63060 767600 786303 807605 830685 855153 881692 911488 945124 982174 1021796 1063569 1107690
63049 1107690 1154540 1204331 1257108 1312753 1370802 1430406 1490701 1551119 1611279 1670763 1729291
63038 1729291 1786945 1844042 1900794 1957321 2013853 2070496 2126628 2180760 2231129 2276335 2315291
63027 2315291 2346774 2369326 2381678 2383107 2373309 2352090 2319424 2275872 2222805 2162097 2095648 2025294
63015 2025294 1953032 1881029 1811239 1745107 1683757 1628378 1580213 1540050 1507764 1482556 1463855
63004 1463855 1451994 1447820 1451540 1462100 1477859 1497637 1520981 1547704 1577658 1610754 1646628 1684185
62992 1684185 1722017 1759419 1796531 1833322 1869052 1903099 1935676 1966985 1995971 2020681 2039733
62981 2039733 2052698 2059006 2057354 2046617 2026842 1998864 1963250 1920029 1869319 1811889 1749200 1683182
62969 1683182 1615902 1549161 1484215 1421822 1362412 1306205 1253373 1204237 1159151 1118063 1080437
62958 1080437 1045795 1014154 985585 959486 934723 910586 887281 865301 844566 824443 804524
62947 804524 785127 766954 750334 734827 719495 703610 687195 671011 656037 642893 631634
62936 631634 621879 613103 604911 597223 590248 584228 579162 574825 571010 567678 564882 562647 560943 559701
62922 559701 558753 557845 556804 555672 554606 553654 552638 551266 549355 547008 544629 542641 541065 539449 537318
62907 537318 534620 531555 528073 523843 518819 513619 509177 506067 504213 503092 502086 500783 499199 497736
62893 497736 496821 496543 496645 496838 497010 497173 497287 497212 496865 496414 496193 496332 496499 496201 495334 494321 493670 493576 493927
62874 493927 494418 494581 494005 492786 491602 491057 491013 490781 489931 488705 487658 487033 486529 485633 484207 482709 481672
62857 481672 481031 480328 479655 479871 481541 484038 486211 487636 488624 489198 488902 487697 486365 485641 485467 485397 485341
62840 485341 485529 486060 486795 487478 487713 487120 485814 484492 483733 483447 483270 483151 483130 482874 482052 481124 481125 482518 484688
62821 484688 486779 488660 490769 493229 495517 497143 498449 500462 503835 508069 512094 515581 519279 523949
62807 523949 529429 535102 540879 547088 553679 560187 566541 573263 580704 588571 596549 605014 614878 626883
62793 626883 641176 657320 674622 692741 712132 733619 757534 783704 812442 845013 882687
62782 882687 925742 973840 1027000 1085591 1149576 1218497 1292305 1371571 1456508 1546015 1637904
62771 1637904 1729819 1819795 1906123 1986988 2060286 2123772 2175393 2213558 2237136 2245435 2238361 2216483
62759 2216483 2180756 2132249 2072359 2003045 1926399 1843998 1757133 1667779 1578804 1492774 1410732
62748 1410732 1332431 1257605 1186672 1120307 1058753 1001763 949087 900840 857326 818496 783665
62737 783665 751931 722950 697115 674855 655848 639137 623973 610425 599133 590540 584355 579693
62725 579693 575732 572258 569555 567869 567143 567247 568236 570300 573564 577992 583335 589186 595425 602712 612236
62710 612236 624748 640066 657715 677686 700237 725327 752890 783539 818424 858243 902845
62699 902845 951898 1005519 1064047 1127505 1195431 1266947 1340902 1416269 1492479 1569042 1644701
62688 1644701 1717366 1784983 1846015 1898880 1941535 1972188 1990080 1995080 1986785 1964649 1928924 1880978
62676 1880978 1822709 1756129 1683471 1607053 1528717 1449621 1370749 1293377 1218933 1148527 1082667
62665 1082667 1021305 964163 911202 862740 819018 779852 744902 713996 686779 662290 639485
62654 639485 618170 598884 581835 566541 552600 540187 529486 520119 511460 503140 495005 487032
62642 487032 479502 472796 466744 460712 454711 449833 447003 445799 445149 444772 445150 446354 447707 448593 448861
62627 448861 448531 447803 447387 447952 449080 449483 448519 446872 445491 444570 443974 444004 445113 447278 450210 453896 458476
62610 458476 463911 470233 477809 486788 496525 506145 515591 525600 536767 549211 563109 578897 596832
62597 596832 616927 639519 665357 694768 727138 761618 798138 837233 878907 921990 964716
62586 964716 1005827 1045002 1082163 1116339 1145405 1167204 1180884 1186861 1185565 1176739 1160190 1136702
62574 1136702 1107711 1074357 1037393 997879 957364 917226 878206 840633 804674 770225 737016
62563 737016 705202 675515 648509 623924 601177 580269 561752 545949 532694 521790 513109 506103
62551 506103 499772 493529 487735 483047 479499 476634 474246 472502 471415 470709 470196 469869 469601 469204 468921 469396
62535 469396 470862 472713 474217 475388 476801 478749 480989 483374 486310 490489 496378 504096 513560 524529
62521 524529 536628 549621 563833 580227 599920 623465 650562 680473 712723 747351 784543
62510 784543 824168 865769 908920 953399 998945 1044855 1089899 1132634 1171785 1206344 1235417
62499 1235417 1258147 1273859 1282274 1283636 1278786 1269057 1255820 1239915 1221794 1202420 1183778 1168113
62487 1168113 1156727 1149870 1147690 1150777 1159654 1174301 1194445 1219943 1250536 1285514 1323947 1365073
62475 1365073 1408048 1451377 1492835 1529869 1560044 1581486 1593410 1596184 1590561 1576790 1554550 1523515
62463 1523515 1483672 1435422 1379872 1319027 1255271 1190503 1125981 1062831 1002227 945051 891799
62452 891799 843027 799464 761570 729208 701859 678869 659419 642795 628989 618754 612661 610226
62440 610226 610176 611378 613278 615695 618632 622278 626821 632076 637369 641872 645039 646790 647296 646491 643777
62425 643777 638431 630435 620738 610459 599956 588885 577060 564956 553312 542473 532288 522544
62413 522544 513378 505238 498422 492732 487632 482732 477987 473363 468543 463201 457545 452372 448490 446189
62399 446189 445226 445146 445462 445656 445353 444710 444507 445522 447750 450433 452973 455545 458567 461884 464938 467642
62383 467642 470562 474145 478268 482703 487523 492740 497988 503022 508258 514363 521478 529341 537998 547841
62369 547841 558896 570653 582785 595711 610189 626629 645043 665487 688346 714253 743902
62358 743902 777854 816376 859407 906635 957574 1011651 1068426 1127718 1189283 1252160 1314380
62347 1314380 1373385 1426768 1472759 1510298 1538770 1557647 1566433 1565134 1554737 1536916 1513114 1483930
62335 1483930 1449472 1410076 1366594 1320189 1272150 1223883 1176855 1132303 1090938 1052885 1017970
62324 1017970 986094 957343 931735 908946 888312 868943 849800 829938 809026 787557 766163
62313 766163 744755 722692 699913 677460 656665 638121 621642 606897 593674 581736 570890
62302 570890 561266 553225 546932 542175 538541 535609 533053 530831 529270 528746 529347 530999 533752 537609 542175
62287 542175 546964 552136 558484 566525 575970 586258 597177 608647 620302 631774 643129 654517
62275 654517 665535 675467 684212 692500 701089 710093 719190 728040 736345 743903 751023 758650 767863 779368
62261 779368 793637 811166 832232 856688 884573 916864 955021 999529 1049296 1102785 1159451
62250 1159451 1219654 1283177 1348161 1411590 1470639 1523450 1568801 1605470 1632302 1648857 1655622
62239 1655622 1653277 1641859 1620971 1590709 1552052 1506256 1454273 1396950 1335579 1271915 1207772
62228 1207772 1144823 1084569 1028145 976063 928365 885103 846433 812207 781743 754261 729479
62217 729479 707656 689092 673704 661043 650482 641307 632823 624595 616650 609326 602865 597194 592112
62204 592112 587594 583888 581353 580236 580470 581651 583310 585323 587978 591552 595975 601024 606642 612794
62190 612794 619155 625328 631420 638036 645616 654044 663035 672590 682844 693714 704939 716284 727471
62177 727471 738114 748025 757535 767215 777313 787678 798199 809161 821154 834879 851092 870586
62165 870586 894113 922261 955234 992649 1033647 1077358 1123225 1170731 1218896 1266138 1310544
62154 1310544 1350186 1383336 1408723 1425701 1434171 1434429 1427178 1413494 1394468 1370794 1342729 1310442
62142 1310442 1274401 1235545 1195163 1154513 1114565 1076295 1041039 1009970 983055 959165 937655
62131 937655 919270 904888 893855 884470 875835 868241 861735 855418 848543 841444 834840 828871 823426
62118 823426 818895 815883 814465 814275 815081 816751 818818 820596 821631 821691 820482 817872 814285 810371 806296
62103 806296 801743 796610 791266 786005 780584 774435 767215 759206 751386 745008 740743 738179 736383 734906
62089 734906 734052 734342 736043 739182 743541 748646 754180 760501 768306 777689 787976 798684 810174 823059
62075 823059 837424 853057 870051 888556 908090 927739 947134 966781 987352 1009117 1032186
62064 1032186 1056810 1083056 1110545 1138914 1168350 1199236 1231344 1263759 1295469 1325558 1352779
62053 1352779 1375483 1392320 1402778 1406873 1404669 1396365 1382465 1363358 1338890 1308786 1273442 1233903
62041 1233903 1191111 1145574 1097783 1048525 998749 949489 901981 857401 816334 778842 745125
62030 745125 715598 690099 667605 647168 628778 612823 599071 586668 575003 564053 553999
62019 553999 545017 537314 530873 525127 519386 513645 508560 504491 500975 497283 493197 489088 485555 483154
62005 483154 482137 482169 482451 482344 481827 481395 481734 483515 487041 491745 496272 499501 501494 503247 505522 508135
61989 508135 510316 511467 511430 510292 508174 505220 501613 497473 492767 487329 480972 473614 465453 457057 449146
61974 449146 442134 435928 430304 425373 421465 418588 416329 414304 412373 410318 407735 404556 401386 398925
61960 398925 397235 395899 394738 393959 393648 393570 393566 393773 394331 395138 396077 397284 399003 401281 403929 406813 410185
61943 410185 414730 421147 429534 439313 449878 461220 473661 487090 500775 513980 526558 538880
61931 538880 551292 563684 575517 586297 595981 604758 612453 618549 622976 626369 629105 630459 629328
61918 629328 625625 620371 614546 608556 602771 597820 594077 591377 589518 588700 589259 591365 595047 600135 606116
61903 606116 612488 619296 626803 634539 641375 646724 650999 654522 656653 656502 653959 649525 643647 636788
61889 636788 629704 622985 616520 609959 603395 597057 590657 583751 576562 569815 563770 557984 551985 545562
61875 545562 538419 530203 521173 512382 504863 498803 493677 489043 485053 482154 480380 479151 478020 477407
61861 477407 478093 480026 482385 485121 489583 496906 506395 516384 526333 537114 549499 563419 578765
61848 578765 595929 615169 636066 657854 679714 700674 719866 737166 753004 767310 779209
61837 779209 787977 793727 796839 797269 794885 790079 783635 776323 768974 762619 758084 755508 754498 754711 756171
61822 756171 759223 764203 770955 778627 786237 793302 799527 803996 805378 803071 797523 789263 778351 765086
61808 765086 750478 735404 719824 703373 686333 669459 653275 638076 624286 612179 601515
61797 601515 591989 583694 576625 570097 563395 556724 550736 545333 539802 534069 528904 524713 520959 517135
61783 517135 513579 510868 508939 507282 505666 504188 502872 501596 500271 498829 497167 495384 493900 493017
61769 493017 492477 491728 490594 489454 488761 488575 488617 488612 488510 488487 488842 489854 491609 493891 496293 498517 500528
61752 500528 502390 504036 505297 506116 506562 506687 506593 506575 506882 507264 507043 505704 503175 499556 495103 490612 487266
61735 487266 485632 485217 485352 486011 487222 488180 487875 486508 485472 485829 487396 489385 491318 493151 495097 497499
61719 497499 500431 503234 504968 505503 505698 506336 507431 508782 510554 512800 514890 515963 515689 514253 511930
61704 511930 509072 506194 503516 500632 497039 492878 488782 485154 481961 479009 475999 472539 468617 464922
61690 464922 462107 459789 456867 452874 448455 444352 440515 436547 432561 429150 426690 425041 423776 422425
61676 422425 420650 418500 416451 414903 413657 412158 410212 408231 406708 405716 405012 404397 403791 403218 402927 403312
61660 403312 404397 405507 405855 405474 405198 405731 407099 409095 411633 414369 416587 418113 419925 423072 427112
61645 427112 430451 432329 433625 435420 437493 438770 438732 437855 436954 436590 436884 437448 437622 437088 436151 435189 434140
61628 434140 432835 431498 430423 429425 428089 426400 424589 422487 419646 416126 412685 410036 408253 406904
61614 406904 405414 403301 400491 397500 394936 392789 390518 387829 384903 381842 378357 374200 369524 364657
61600 364657 359884 355599 352223 349725 347569 345407 343516 342293 341627 341064 340262 339027 337130 334554 331806
61585 331806 329643 328493 328264 328487 328460 327493 325442 322980 321056 320042 319558 319017 318111 316868 315552 314619
61569 314619 314520 315326 316445 316870 315971 314275 313275 314035 315976 317502 317872 317919 318699 320122 321454 322604 324113
61552 324113 325999 327510 328137 328251 328512 329112 329820 330358 330497 330191 329800 329898 330608 331473 332148 332891 334073 335586
61534 335586 337155 338947 341312 343990 346112 347096 347210 347118 347124 347026 346513 345476 344030 342408 340916 339923 339802
61517 339802 340615 341755 342057 340626 337709 334561 332314 331132 330539 330246 330293 330475 330157 328926 327191 325803
61501 325803 325126 324758 324182 323436 322951 322932 323138 323320 323626 324382 325517 326436 326598 326143 325802 326190 327308 328726
61483 328726 330033 331000 331564 331974 332800 334485 336856 339362 341789 344388 347219 349835 351889 353714 355865
61468 355865 358259 360247 361426 361952 362018 361529 360504 359377 358617 358227 357944 357717 357655 357633 357337 356789 356470 356731
61450 356731 357299 357594 357453 357226 357171 356999 356226 354818 353295 352234 351835 351999 352628 353721 355266 357111 358924
61433 358924 360293 361038 361521 362469 364270 366497 368279 369136 369296 369263 369294 369334 369272 369124 369093 369567 370902 373046
61415 373046 375427 377367 378626 379423 379981 380287 380398 380729 381737 383315 384765 385509 385661 385774 386182 386785 387364
61398 387364 387792 387942 387655 386923 385959 384981 384105 383525 383614 384624 386326 388053 389131 389305 388879 388487 388625 389328
61380 389328 390317 391390 392518 393662 394721 395696 396660 397615 398654 400229 402779 406050 409245 412051 414932
61365 414932 418129 421026 423040 424618 426637 429119 431316 432851 433990 434914 435590 436397 438037 440604 443526
61350 443526 446660 450671 455922 461750 467322 472564 477614 482021 485248 487557 489621 491520 492929 494086
61336 494086 495680 497756 499574 500782 502010 503949 506374 508464 509671 509870 509028 507249 504972 502687 500489
61321 500489 498244 496168 494872 494731 495482 496632 498054 500029 502870 506813 512234 519603 529006 539863
61307 539863 551359 563138 575490 588892 603522 619061 634761 649722 663332 675469 686085
61296 686085 694653 700384 703069 703366 702081 699401 695058 689036 681759 673649 664785 655016 644318 633018
61282 633018 621748 611124 601461 592853 585455 579403 574408 569772 565052 560598 557246 555591 555569 556509
61268 556509 557490 557953 558179 558961 560622 562607 564212 565394 566627 568309 570719 574191 578816 584110 589464
61253 589464 594782 600182 605192 608828 610645 611336 612164 614020 616892 619877 621748 621952 621095 620129 619177 617643
61237 617643 615345 612880 610805 609120 607806 607154 607196 607412 607557 608305 610513 614144 618539 623495 629382 636314
61221 636314 643862 651758 660283 669725 679799 689884 699585 708856 717844 726842 736239 746105 755855 764586
61207 764586 771856 777977 783471 788410 792491 795655 798387 801390 805215 810260 816828 824930 834186 844177
61193 844177 854811 866112 877830 889617 901475 913592 925572 936268 944622 950493 954469 957105
61181 957105 958548 958723 957615 955387 952383 948909 944908 939881 933299 925091 915758 906089 896746 887858
61167 887858 878873 868977 857854 845987 834140 822618 811117 799156 786552 773523 760373 747104
61155 747104 733489 719708 706771 695848 687116 679668 672718 666469 661504 657824 654971 652803 651484
61142 651484 650744 649719 647736 644837 641388 637595 633678 630232 628017 627317 627754 628770 630199 632298 635315
61127 635315 639172 643701 649153 656296 665874 678042 692425 708602 726357 745569 766186 788390
61115 788390 812538 838696 866313 894586 923150 952235 982102 1012514 1042883 1072754 1101791
61104 1101791 1129351 1154508 1176781 1196613 1214740 1231188 1245169 1255840 1262816 1265946 1265132 1260519
61092 1260519 1252505 1241315 1226935 1209685 1190490 1170227 1149103 1127120 1104882 1083318 1062684
61081 1062684 1042422 1022178 1002532 984525 968868 955770 945157 936668 929720 924018 919924 917984
61069 917984 918117 919684 922433 927040 934469 944881 957396 970831 984572 998800 1014066 1030693 1048558
61056 1048558 1067467 1087662 1109799 1134283 1160695 1188115 1215948 1244322 1273783 1304776 1337317
61045 1337317 1370830 1404357 1437326 1470178 1503793 1538229 1572530 1605984 1638860 1671402 1702733
61034 1702733 1731714 1758641 1785187 1812544 1840369 1867696 1894165 1920064 1945838 1971990 1999019
61023 1999019 2026973 2055335 2083702 2112431 2142507 2175182 2212001 2254789 2305236 2364711 2434693
61012 2434693 2517116 2614045 2727506 2860255 3016957 3204779 3433262 3713656 4057690 4476388
61002 4476388 4980134 5579773 6286954 7113134 8069061 9165509 10412747 11816338 13369990
60993 13369990 15046480 16785698 18483616 19997172 21179975 21940464 22286350 22320818 22192383
60984 22192383 22034924 21931047 21899862 21892441 21794158 21452944 20739579 19609736 18124167 16414831
60974 16414831 14627491 12880402 11252180 9786478 8499722 7388996 6440652 5637048
60966 5637048 4959450 4389246 3909743 3507376 3170706 2888648 2650322 2446392 2270038
60957 2270038 2116694 1983111 1866422 1763759 1672614 1591416 1519398 1455996 1400614 1352728
60947 1352728 1311485 1275092 1241195 1208107 1175318 1142878 1110906 1079826 1050286 1022448 995822
60936 995822 970080 945469 922062 899216 876364 853919 832830 813523 795815 779600 764924
60925 764924 751475 738569 725855 713686 702617 692753 683748 675331 667641 660946 655195 650084 645617
60912 645617 642242 640134 638644 636890 634702 632518 630577 628869 627728 627601 628129 628338 628067 628392 630073
60897 630073 632255 633343 632670 630688 627934 624527 620444 615642 609969 603434 596449 589444 582391 575057
60883 575057 567477 559802 551929 543793 535783 528344 521262 513872 505982 498165 491185 485481 481169 478102
60869 478102 475866 474026 472484 471510 471482 472657 474903 477482 479471 480727 482107 484386 487323 490305 493478
60854 493478 497461 502116 506433 509741 512407 515129 518157 521429 524958 528648 531999 534360 535416 535311
60840 535311 534397 532989 531258 529339 527466 525785 523891 520863 516116 510095 503841 498069 492956 488505
60826 488505 484542 480534 476119 471812 468544 466361 464147 460864 456574 452024 447693 443622 439747 435974
60812 435974 432131 428150 424175 420266 416213 411865 407464 403426 399925 396901 394365 392487 391388 390940
60798 390940 390729 390250 389288 388150 387350 387043 386946 386798 386643 386592 386593 386614 386843 387501 388591 389964 391520 393221 395052
60779 395052 397110 399563 402320 404836 406503 407299 407894 408976 410598 412347 414124 416398 419424 422462 424321
60764 424321 424747 424748 425224 425733 425099 422972 420205 417790 415997 414604 413416 412273 410922 409215 407316 405529
60748 405529 403992 402589 401163 399815 399058 399446 400820 402103 402184 400973 399247 397522 395478 392537 388666
60733 388666 384430 380412 376724 373071 369299 365845 363327 361619 359856 357721 356175 356225 357337 357992 357707
60718 357707 357522 358357 359867 361242 362331 363393 364407 365242 366144 367431 369030 370700 372451 374325 376082
60703 376082 377549 379018 380862 382937 384824 386544 388587 391229 394090 396354 397305 396806 395432 393992 392736
60688 392736 391258 389268 387164 385565 384574 383873 383341 383196 383514 383923 383884 383266 382678 383117 384979 387425 389097
60671 389097 389513 389390 389549 390013 390429 390762 391156 391458 391346 390667 389358 387365 384973 382854 381398 380303 379146
60654 379146 377987 377070 376392 376031 376456 377932 380011 382211 384784 388082 391508 394011 395417 396371 397021 396738
60638 396738 395307 393457 391813 390083 387783 385219 383157 381819 380705 379341 377881 376978 377166 378310 379657
60623 379657 380500 380670 380284 379350 378037 377021 376920 377406 377545 377121 377007 377933 379428 380372 380273 379631 379238 379406
60605 379406 379836 380095 380171 380419 380865 380921 380185 379260 379131 379881 380728 381388 382594 385012 388350 391917 395445 398874
60587 398874 401831 403905 405154 405981 406747 407741 409071 410274 410561 409945 409628 410649 412592 414392 416087 418862
60571 418862 423417 429213 435496 442277 449851 457957 466109 474511 484068 495340 507683 519504 529311
60558 529311 536487 541180 543618 543722 541333 536642 530324 523374 516804 511187 506406 502173 498989 498150 500441
60543 500441 505091 510571 516245 522706 530609 539813 549833 560585 572331 585221 599224 614249 629967
60530 629967 645575 660003 672443 682588 690410 695843 698703 698843 696314 691393 684538 676404 667820
60517 667820 659464 651430 643318 634961 626872 619769 613914 609252 606058 604866 605732 608085 611506 616284
60503 616284 623015 632056 643692 658467 676867 698808 723838 751827 783076 817726 855380 895388
60491 895388 937229 980361 1023726 1065557 1103779 1136728 1163531 1183749 1196717 1201482 1197498 1185013
60479 1185013 1164512 1136085 1099895 1057237 1010590 962446 914391 867342 822094 779293 739319
60468 739319 702592 669728 640970 615699 593010 572618 554753 539298 525650 513452 502829
60457 502829 493712 485432 477355 469501 462279 455988 450864 447183 444772 442671 439841 436160 432388 429194
60443 429194 426610 424329 422124 419932 417861 416127 414717 413260 411578 410230 409956 410542 410830 410024 408545
60428 408545 407323 406729 406539 406509 406492 406160 405162 403618 402172 401460 401587 402099 402482 402779 403634 405514 407949 409987
60410 409987 411434 413014 415098 416938 417726 417895 418580 420078 421710 423106 424701 426768 428804 430370 431897
60395 431897 434021 436516 438588 440073 441693 443999 446598 448710 450221 451781 453940 456464 458637 460108
60381 460108 461323 463121 466037 469896 473941 477341 479840 481983 484481 487213 489199 489875 490092 491254 493618
60366 493618 496057 497647 498818 500547 502952 505294 507122 508779 510755 513072 515487 517953 520683 523965
60352 523965 528125 533482 540124 547770 555949 564283 572466 580040 586326 590636 592605 592423 590781 588479
60338 588479 585880 582728 578541 573254 567398 561664 556376 551427 546613 541891 537362 533148 529300 525705
60324 525705 522091 518301 514636 511703 509765 508399 507017 505595 504688 504825 506185 508806 512682 517617 523366
60309 523366 530141 538646 549291 561590 574590 587770 601243 615193 629403 643276 655956 666430
60297 666430 673895 678225 679877 679158 675665 668604 657700 643717 628123 612258 596907 582625 570168
60284 570168 560194 552538 546287 540881 536716 534237 532811 531238 529222 527492 526323 524825 522222 519070
60270 519070 516432 514266 511569 507926 504036 500552 497295 493907 490582 487568 484503 480940 477303 474558
60256 474558 472907 471373 468991 466000 463551 462462 462532 462987 463296 463525 464049 465012 466089 466845 467388 468429
60240 468429 470489 473104 475153 476029 476150 476199 476267 476091 475796 475797 476038 476026 475759 476005 477300 479181 480941 482755
60222 482755 485345 488766 492217 495170 498043 501601 506157 511617 517823 524554 531503 538542 545821 553426
60208 553426 561269 569476 578446 588222 598142 607529 616436 625288 634024 642077 649061 655079 660421 665435
60194 665435 670582 676104 681572 686080 688972 690103 689564 687673 685177 682865 680767 678148 674413 669546
60180 669546 663555 656153 647436 638347 629909 622204 614675 607244 600613 595424 591579 588450 585433 582190
60166 582190 578640 574921 571321 568154 565655 563867 562557 561377 560236 559319 558606 557603 555853 553632 551846
60151 551846 551279 552108 553995 556318 558420 559957 561101 562243 563620 565466 568269 572345 577198 581878 586078
60136 586078 590367 595174 600160 604987 610116 616240 623241 630402 637450 644729 652305 659564 665958 671626
60122 671626 676958 681900 686050 689245 691754 694021 696503 699634 703645 708311 713012 717154 720573 723601
60108 723601 726684 729734 731880 732182 730707 728597 726800 725035 722307 718140 712803 706596 699679 692675
60094 692675 686740 682590 679873 677833 676164 674820 673466 671788 670194 669509 669879 670500 670582 670105 669395 668446
60078 668446 667048 665273 663338 661070 657988 653956 649396 644682 639600 633623 626617 619016 611313 603613
60064 603613 595770 587763 579774 571986 564570 557830 552091 547307 542952 538506 533971 529894 526977 525731
60050 525731 526236 527961 529984 531623 532948 534579 537121 540862 545776 551532 557645 563991 571051 579275
60036 579275 588255 596925 604570 611180 616819 621238 624326 626378 627549 627482 625924 623339 620377 616944 612414
60021 612414 606626 600034 592752 584048 573196 560552 547478 535294 524513 515002 506526 499030 492511
60008 492511 486848 481881 477550 473834 470599 467720 465343 463811 463226 463289 463681 464299 464981 465350 465332 465579 466927
59991 466927 469490 472676 476013 479491 483062 486354 489134 491676 494402 497367 500321 502999 505138 506464
59977 506464 506922 506765 506121 504707 502328 499446 496778 494291 491165 486978 482551 479178 477245 476005 474699
59962 474699 473472 472980 473448 474452 475575 476919 478828 481293 483801 485773 487044 487912 488803 489922 491185
59947 491185 492372 493296 493893 494315 494941 496098 497639 498975 499714 500087 500472 500652 500039 498560 496843 495361
59931 495361 493992 492722 492174 492884 494492 496339 498625 502170 507073 512419 517463 522270 526835 530298 531754
59916 531754 531382 530141 528592 526677 524510 522696 521767 521778 522616 524215 526314 528354 529869 530777 531179 531212
59900 531212 531296 532144 534153 536901 539523 541557 543193 544829 546638 548638 550951 553920 557987 563389 569877
59885 569877 576825 583779 590801 598177 605928 613782 621410 628432 634435 639485 644529 650684 657950 665007
59871 665007 670437 673718 674927 674180 671872 668936 666175 663465 660152 656071 651656 647235 642840 638650
59857 638650 634889 631219 626884 621792 616997 613860 613020 614242 616809 619899 623043 626502 630871 636207
59843 636207 641941 647620 653061 657617 660177 660502 659942 660208 661841 664404 667487 670754 673487 675092 675881
59828 675881 676502 676769 675872 673706 671120 668784 666595 664231 661417 657509 651692 643965 635332 626697 618242
59813 618242 610081 602746 596591 591350 586788 583120 580300 577469 573829 569692 566049 563411 561583 560241
59799 560241 559094 557659 555522 552807 550031 547562 545501 543778 542041 539760 536906 534263 532538 531429
59785 531429 530102 528366 526774 525747 525225 525098 525333 525638 525601 525297 525234 525683 526500 527587 529022 530658 532186
59768 532186 533685 535598 538042 540715 543600 547091 551139 554922 557760 559887 561976 564401 567363 571240
59754 571240 576192 581746 587329 593024 599281 606077 612884 619355 625560 631574 637329 642923 648682 654780
59740 654780 660979 666733 671381 674444 676086 677162 678445 679859 680802 681046 680836 680273 679225 677955 677162
59725 677162 677156 677497 677735 677994 678437 678678 678283 677587 677409 678061 679091 679915 680198 679643 678008 675547 672995 670807
59707 670807 668669 666012 662827 659703 657188 655425 654378 654085 654556 655534 656589 657447 658173 658963 659865 660793
59691 660793 661775 663037 664819 667178 669989 672970 675651 677490 678180 677798 676599 674846 672866 670972 669070
59676 669070 666639 663439 659959 656659 652969 647809 641227 634759 629727 625752 621495 616459 611377 607049
59662 607049 603549 600656 598345 596549 594906 593177 591724 591224 591929 593400 594978 596409 598068 600647 604522
59647 604522 609302 613946 617383 619073 619070 617723 615407 612498 609393 606359 603342 600078 596541 593199 590613
59632 590613 588861 587514 586162 584629 582744 580400 578008 576342 575535 574595 572509 569527 566744 564593 562484
59617 562484 559957 557364 555127 552965 550355 547270 544031 540821 537862 535761 535082 535639 536712 537927 539426
59602 539426 541211 542846 544000 544862 545738 546543 547003 547202 547582 548394 549356 549932 549858 549394 549127 549517 550528 551656
59584 551656 552354 552467 552239 551934 551577 551053 550298 549245 547671 545337 542321 539061 536054 533576 531649 530034
59568 530034 528257 526018 523687 522112 521664 521789 521752 521512 521375 521121 520144 518479 516950 516066 515377 514296 513096
59551 513096 512507 512634 512915 513223 514427 517497 522257 527379 531739 535611 540332 546852 554883 563597 572806
59536 572806 583052 594716 607583 621357 635979 650935 664515 674304 678662 677792 673476 667879 662441
59523 662441 657678 653794 651214 650359 651059 652538 654014 655081 655549 655275 654160 652034 648482 643154 636355
59508 636355 628934 621477 613960 606312 598884 592133 586191 580975 576299 571646 566363 560544 555341 551889
59494 551889 550096 548915 547583 546177 545116 544629 544736 545391 546583 548348 550591 552856 554678 556357 558879
59479 558879 562741 567264 571544 575635 580243 585603 591339 597152 602877 607992 611920 614900 617876 621356
59465 621356 624931 627986 630294 631772 632294 632030 631566 631485 632118 633757 636635 640621 645459 651410 659081 668426
59449 668426 678436 688019 696700 704249 710255 714515 717424 719497 720737 720723 718998 715124 708864 700745
59435 700745 692085 684027 676763 669985 663694 658128 653304 649222 646274 644844 644642 645054 646161 648879 654033
59420 654033 661749 671829 684197 698743 715091 732862 752031 772835 795379 819395 844295 869402
59408 869402 894129 917748 938831 955048 963991 964492 957285 944626 929501 914932 903238 895422
59396 895422 891339 890594 892963 897547 901681 901409 893656 878162 857403 834766 812826 792878 775387
59383 775387 760510 748311 738747 731502 725889 721129 716885 713367 710760 708759 706976 705627 705329 706140
59369 706140 707229 707696 707422 706840 706150 705165 703892 702862 702707 703577 705167 707286 710237 714538 720352 727300
59353 727300 734850 742807 751425 761176 772442 785233 799061 813219 827389 841910 857300 873560
59341 873560 890068 906020 920872 934488 946989 958279 967585 973777 976326 975606 972009 965284 955365
59328 955365 943353 930704 917543 902749 885867 867992 850436 833468 816943 801327 787221
59317 787221 774283 761551 748665 736091 724263 713230 703143 694389 687033 680638 674894 670080
59305 670080 666615 664428 663061 662291 662421 663918 666931 671298 676984 684251 693143 702845 711780 718294 721027
59290 721027 718909 711566 700015 686445 672850 660100 648482 638487 630546 624508 620124 617812 618181
59277 618181 620941 625084 630196 636818 645320 655139 665575 676759 689221 702793 716520 729639 742168
59264 742168 754412 766170 776605 784826 790476 793749 794958 794223 791586 787216 781339 774099 765748 756943
59250 756943 748652 741648 736163 732012 728967 727018 726420 727376 729623 732468 735398 738514 742245 746839 752422
59235 752422 759255 767344 775767 782973 788045 791346 793670 795072 794908 792804 789096 784213 777976 769831
59221 769831 759737 748556 737385 726600 715793 704623 693441 682925 673372 664648 656687 649644
59209 649644 643541 638066 632800 627505 622254 617497 613923 611913 611100 610679 610181 609676 609366 609431 610259 612252
59193 612252 615147 618029 620386 622771 625969 629887 633819 637569 641614 646151 650637 654542 658009 661481
59179 661481 665063 668623 672160 675612 678507 680371 681532 683003 685390 688295 690972 693272 695563 697995
59165 697995 700316 702437 704743 707628 710921 713970 716176 717308 717409 716568 714745 711690 707022 700515 692413
59150 692413 683409 674286 665490 656973 648396 639480 630202 620683 610996 601234 591718 582961 575326 568817
59136 568817 563278 558665 554968 551928 549064 546088 543207 540935 539624 539248 539622 540646 542239 544187 546348
59121 546348 549032 552884 558198 564531 571216 578076 585341 593022 600797 608556 616652 625377 634451 643188
59107 643188 651006 657633 663030 667381 671089 674578 678073 681606 685141 688598 691794 694440 696220 696944
59093 696944 696736 695999 695029 693760 692112 690472 689455 689165 689082 688789 688383 687926 686855 684356 680194 674843
59077 674843 668885 662561 655905 649030 642157 635421 628805 622316 616241 611052 606914 603472 600306 597385
59063 597385 594679 591564 587314 582232 577641 574483 572492 571043 570143 569980 570003 569232 567355 564965 562773
59048 562773 561111 560098 559751 559793 559773 559500 559122 558822 558630 558519 558379 557946 557059 556048 555645 556426 558310 560554
59030 560554 562267 563261 564507 567418 572441 578691 585275 592541 601526 612463 624455 636490 648185
59017 648185 659510 670342 680489 689783 697977 704688 709476 711866 711487 708531 703982 699089 694577 690605
59003 690605 687297 684993 684055 684725 687101 690957 695741 701035 706827 713006 718869 723648 727410 730889 734455
58988 734455 737749 740359 742363 744063 745514 746408 746280 744896 742714 740797 740013 740511 742266 745696 751144
58973 751144 758054 765465 773227 782064 792437 804063 816577 829936 843997 858323 872639 886898
58961 886898 900734 913377 924294 933376 940428 945087 947374 947634 945711 940892 932992 922849 911343
58948 911343 898531 884184 868586 852288 835560 818673 802345 787373 774038 762223 751772
58937 751772 742417 733780 725931 719585 715256 712501 710464 708831 707747 707117 706693 706677 707532 709105 710537
58922 710537 711211 711325 711339 711225 710605 709420 708087 706990 706125 705443 705363 706519 708841 711326 713071 714331 716110
58905 716110 718993 722995 728386 735817 745354 756120 767326 779147 792120 806184 820830 835880
58893 835880 851532 867795 884314 900758 917118 933667 950818 968817 987449 1006175 1024646
58882 1024646 1042724 1059902 1075141 1087607 1097294 1104574 1109495 1111860 1111738 1109479 1105332 1099346 1091483
58869 1091483 1081678 1069981 1056914 1043427 1030290 1017740 1005857 994847 984685 974858 964884 954803
58857 954803 944789 934621 923988 913037 902117 891107 879506 867182 854691 842866 832228
58846 832228 822638 813279 803257 792504 781885 772192 763348 754883 746701 738821 730748 721891 712536
58833 712536 703712 695994 688999 682227 675924 670832 667397 665392 664163 663096 662008 661253 661421 662914 665738
58818 665738 669545 673812 678197 682828 688087 693971 699983 705762 711401 716825 721327 724248 725920 727326
58804 727326 728869 729983 729940 728561 726050 722636 718553 714021 709026 703355 697055 690615 684470 678475 672081
58789 672081 664987 657480 650156 643543 638033 633959 631479 630389 630289 631012 632623 634922 637345 639611 642099
58774 642099 645122 648129 650237 651336 651926 651822 649902 645392 638816 631337 623711 616204 608962 601982 595098
58759 595098 588423 582560 578083 575110 573565 573380 574181 575226 576120 577191 578840 580851 582749 584446 586142
58744 586142 587900 589727 591866 594716 598606 603738 609921 616305 621931 626754 631551 636614 641252 644954
58730 644954 648301 652173 656764 661902 667652 673902 680010 685715 691844 699310 707806 716321 724554 733025
58716 733025 742113 751786 762011 772653 783220 793373 803386 813385 822443 829235 833308 835019 834535
58703 834535 831703 826581 819243 809322 796597 781795 765929 749077 730716 711047 691073 671552
58691 671552 652811 635439 620114 606786 594996 584854 576675 569742 562657 555124 548240 542767 538136
58678 538136 533531 528988 524944 521530 518764 516833 515831 515754 516840 519272 522471 525576 528780 533320 539792
58663 539792 547372 554981 562403 569759 576726 582865 588064 592125 594419 594506 592694 589580 585499 580783 576072
58648 576072 571803 567690 563089 557741 551931 546204 541131 537111 534196 532218 531031 530434 530056 529726 529801
58633 529801 530658 532081 533625 535342 537471 539681 541446 542994 544959 547101 548304 547937 546441 544543 542798
58618 542798 541921 542487 544096 545816 547708 550892 555828 561586 567255 573001 579098 584871 589403 592705 595483
58603 595483 598221 600983 603641 605873 607354 608187 608619 608260 606381 603246 600288 598579 597875 597506 597351 597520
58587 597520 598021 599330 602464 607833 614648 621987 629769 638258 647390 657187 667989 679604 690925 701044
58573 701044 710114 718613 726621 734560 743815 755642 769941 785855 803055 821805 842388 865261
58561 865261 891118 919886 950070 979901 1008751 1036686 1063139 1086827 1106592 1121562 1130975 1134756
58549 1134756 1133958 1129821 1122689 1112619 1100743 1089036 1078745 1069644 1060670 1050697 1038977 1025512 1010860
58536 1010860 995012 976817 955217 930835 905611 881015 857333 834596 813415 794659 778773
58525 778773 765560 754405 744773 736650 730318 725553 721386 716978 712457 708560 705720 703707 701838 699342
58511 699342 695963 692381 689543 687443 685247 682761 680852 679941 679117 677533 675867 675433 676408 677861 679097
58496 679097 680050 680722 681116 681541 682228 682856 683124 683559 685062 687875 691629 696164 701685 708370 716424 726304
58480 726304 738272 751889 766542 782207 799193 817325 835858 853938 870738 885399 897278
58469 897278 906033 911188 912076 908640 901878 893108 883255 873144 863829 856081 850075 846068 844752 846456
58455 846456 850678 857004 865790 877250 890496 904117 917117 928730 938044 944605 948651 950020 947550
58442 947550 940379 929184 915363 899829 883536 868220 855372 844936 836067 828654 823086 819242
58430 819242 816878 816471 818480 822251 826805 832255 839261 847573 856337 865347 874679 883472 890446 895409
58416 895409 898873 900408 898831 894052 887398 879996 871994 863453 854825 846251 837395 828250 819409 811364
58402 811364 804174 797800 792213 787374 783647 781873 782371 784244 786357 788452 790619 792475 793919 795953
58388 795953 799470 803723 807254 809828 812231 814692 816960 819466 822814 826390 829091 831343 834812 840063
58374 840063 845960 851556 857200 863546 870684 878555 887193 896328 905604 915217 925534 936281 947092
58361 947092 958589 971806 986658 1001995 1016931 1031131 1044162 1055789 1066641 1077400 1087466
58350 1087466 1095543 1101189 1104736 1106292 1106196 1105942 1107044 1109230 1111243 1113155 1116347 1121478 1128078 1136045 1145920
58335 1145920 1157615 1170283 1183465 1197233 1211436 1226068 1241934 1259562 1277913 1295571 1312466
58324 1312466 1328814 1343214 1353975 1361767 1368704 1375152 1379787 1382583 1385262 1388682 1392111 1395368 1399505
58311 1399505 1405022 1411439 1418923 1428400 1439870 1452432 1466025 1481148 1496966 1511904 1526189 1541567
58299 1541567 1558442 1575584 1592713 1610924 1630347 1649874 1669436 1690063 1711460 1732140 1752304
58288 1752304 1773913 1797454 1821366 1845194 1870493 1897868 1925880 1953790 1982752 2013475 2045263
58277 2045263 2078159 2113387 2150806 2188641 2226608 2266570 2309157 2352598 2396021 2441163 2489561
58266 2489561 2540735 2594308 2651224 2711641 2774248 2838800 2906702 2977918 3050095 3122021 3195271
58255 3195271 3271310 3349623 3429725 3512129 3596222 3680230 3764435 3851485 3942554 4036490 4133738
58244 4133738 4237452 4349359 4468152 4593370 4727110 4870392 5021718 5180981 5350938
58235 5350938 5532946 5725165 5926847 6140474 6367834 6608157 6862171 7133705 7425186
58226 7425186 7735894 8066756 8422266 8805617 9216935 9658614 10137158 10657321 11220106
58217 11220106 11829413 12494727 13224286 14021991 14894982 15858199 16928039 18118510 19448216
58208 19448216 20944730 22638484 24560928 26755323 29283977 32222798 35660998 39715930
58200 39715930 44541887 50317994 57234572 65494069 75309087 86885033 100410423 116068736
58192 116068736 134041937 154482724 177481817 203050244 231077957 261225712 292759560
58185 292759560 324349491 353865921 378350181 394471973 399558946 392712512 375227992
58178 375227992 349986821 320285841 288884766 257663977 227746448 199765894 174092046
58171 174092046 150953315 130457013 112567395 97122035 83894994 72645940 63127893
58164 63127893 55090911 48304966 42574815 37730097 33616692 30106076 27100592 24519943
58156 24519943 22289809 20347570 18647671 17152966 15827517 14642597 13580994 12628551
58148 12628551 11767396 10982159 10265964 9614720 9021052 8478251 7984153 7536022 7126682
58139 7126682 6750132 6405923 6093433 5806510 5538224 5286597 5051327 4828998 4616123
58130 4616123 4413486 4223199 4044267 3874755 3715408 3567534 3429739 3299869 3177790
58121 3177790 3063521 2955291 2852073 2755457 2666402 2582694 2502027 2425026 2352853 2284470 2218644
58110 2218644 2156078 2097221 2040583 1985488 1933820 1886668 1841887 1797391 1754240 1713920 1675145
58099 1675145 1636084 1597411 1560441 1524421 1488389 1453691 1421929 1392189 1362877 1334535 1308326
58088 1308326 1283422 1258462 1234075 1211502 1190125 1168673 1147496 1127351 1107222 1085618 1062977
58077 1062977 1040812 1019625 999403 980743 963624 946525 928642 911507 896470 882162 866663
58066 866663 850692 836299 823666 811577 800005 789845 780857 772101 763788 756663 750169 742989 734810
58053 734810 725913 715865 704330 692392 681379 671213 661515 653325 647801 644021 639979 635157 630334
58040 630334 625526 619983 613752 607553 601454 595146 589008 583481 577964 571724 565153 558735 551615 542789
58026 542789 532944 523397 513994 503812 493335 484027 476222 469209 463039 458413 455003 451590 447814 444302
58012 444302 441212 438111 435125 432813 431065 429392 428035 427527 427461 426987 426183 425586 424809 423098 420963 419732
57996 419732 419722 420247 421162 422843 424788 425815 425686 425152 424393 422804 420322 417583 414701 411239 407476 404388
57980 404388 402224 400319 398390 396769 395194 392741 389266 385771 382980 380597 378271 376325 375128 374616
57966 374616 374719 375515 376762 377980 379154 380622 382203 383228 383495 383405 383070 382088 380293 378029 375511 372582
57950 372582 369183 365527 361831 358442 356036 355011 354860 354853 355143 356335 358212 359975 361659 364237 368106
57935 368106 372477 376603 380802 385852 391943 398569 404979 410519 414911 418332 420914 422212 421510 418589
57921 418589 413838 407829 401158 394385 387566 380136 371852 363605 356629 351189 346664 342667 339261 336273
57907 336273 333332 330643 328943 328503 328623 328283 326984 325064 323458 322872 322882 322257 320575 318946 318600 319408
57891 319408 320568 322122 324704 328198 331748 334998 338348 342044 345871 349733 353756 357832 361693 365330
57877 365330 368742 371529 373401 374755 376031 376871 376722 375902 375140 374403 373154 371487 369945 368434 366399
57862 366399 363930 361604 359330 356500 353307 350816 349579 349156 349141 349685 350837 352278 354029 356650 360480
57847 360480 365201 370128 374409 377137 378059 378048 378143 378339 378081 377554 377401 377445 376881 375676 374651 374230 374271 375062
57829 375062 377186 380226 382783 384083 384560 384740 384670 384618 385174 386353 387489 388147 388194 387118 384566 381615 379966
57812 379966 379552 378361 375011 370048 364261 357323 348925 339806 330651 321180 311400 302645 296230 291817
57798 291817 288120 284500 280972 277439 273923 270979 268957 267357 265692 264353 263848 263828 263721 263761 264493 265810
57782 265810 267348 269398 272449 276193 279860 283311 286953 290771 294274 297353 300529 304322 308771 313471
57768 313471 317750 320988 323097 324425 325071 324766 323647 322460 321571 320447 318724 317188 316966 318208 320208
57753 320208 322407 324642 326855 329248 332349 336224 339997 342825 344966 347142 349228 350450 350679 350617 350716
57738 350716 350698 350233 349445 348645 348065 347882 348010 347867 346829 344975 342969 341247 339752 338501 337919 338381 339717
57721 339717 341272 342389 342815 342800 342763 342789 342568 341872 340895 340027 339551 339621 340233 341038 341540 341616 341523 341256 340444 339116
57701 339116 338035 337805 338049 337915 337096 335970 335013 334492 334443 334537 334183 333078 331454 329540 327182 324268 321103
57684 321103 317966 314690 311142 307720 304943 302971 302081 303187 307183 313990 322923 333922 347821 365475
57670 365475 387120 412536 441333 473032 507220 543492 580781 616581 647042 667881 675457 667886
57658 667886 646045 613528 575088 534775 495253 458162 424448 394542 368767 347506 330637
57647 330637 317133 305776 296194 288690 283203 279012 275505 272729 271009 270299 270044 269593 268749 267920 267551
57632 267551 267418 266937 266259 266400 267843 269618 270411 270151 269699 269253 268031 265543 262369 259402 256929 254729
57616 254729 252640 250698 249011 247762 247181 247271 247583 247352 246014 243784 241682 240667 240644 240666 240205 239695 239586
57599 239586 239478 238708 237312 235747 234065 232056 229961 228262 226851 225116 222830 220322 217780 215037 212141
57584 212141 209477 207171 204880 202389 199972 198045 196830 196448 196928 197918 198734 198879 198307 197201 195826 194581
57568 194581 193759 193080 191805 189555 186839 184674 183787 184155 185071 185712 185828 185852 186228 186842 187446 188299 189883
57551 189883 192088 194271 196215 198387 201081 203723 205401 205833 205533 205103 204533 203252 200888 197981 195707
57536 195707 194743 194654 194620 194443 194423 194516 194247 193469 192620 192123 191986 192125 192652 193625 194859 196148 197447 198664 199529
57517 199529 199872 199939 200314 201544 203722 206290 208385 209622 210460 211557 212889 213850 214101 213884 213525 213045 212438
57500 212438 211917 211696 211688 211587 211105 210119 208759 207358 206149 204980 203529 201777 200106 198903 198176 197555 196568
57483 196568 195041 193319 191946 191082 190496 190205 190674 192071 193734 194794 195015 194610 193684 192397 191356 191042
57467 191042 191081 190725 189924 189138 188277 186819 185088 184339 185139 186461 186977 186625 186262 186252 186124 185487 184675 184383
57449 184383 184968 186216 187655 189078 190709 192782 195053 197010 198481 199640 200426 200441 199606 198518 197934 198162
57433 198162 199152 200800 202896 205013 206767 208094 209087 209742 210007 209963 209830 209921 210602 212027 213838 215362 216274
57416 216274 216893 217662 218539 219118 219261 219403 220189 221815 223772 225382 226580 227954 229859 231797 233023 233489
57400 233489 233673 233643 232872 231141 229122 227865 228012 229587 232174 235099 237761 240010 242125 244431 247161
57385 247161 250544 254638 259070 263338 267396 271545 275746 279541 282758 285748 288679 291124 292684 293632
57371 293632 294534 295519 296226 296293 295640 294483 293340 292820 293099 293711 294042 293928 293625 293385 293276 293351 293807 294999
57353 294999 297264 300551 304217 307457 310056 312535 315457 318814 322172 325165 327717 329968 332154 334432
57339 334432 336711 338748 340463 342067 343863 346046 348669 351691 355008 358564 362302 365937 368971 371180
57325 371180 372903 374614 376434 378345 380597 383485 386891 390479 394099 397608 400623 403068 405718 409422
57311 409422 413954 418416 422631 427225 432355 437340 441768 446037 450505 454958 459305 463918 468906 473836
57297 473836 478612 483779 489514 495212 500683 506817 514269 522265 529718 536836 544540 552769 560548 567591
57283 567591 574773 582958 592203 602158 612551 623158 633849 644734 655803 666561 676521 686002 695908
57270 695908 706801 718682 731432 744864 758473 771860 785423 799950 815473 831085 845962
57259 845962 860049 873745 887511 901857 917062 932748 948250 963576 979417 996121 1013271
57248 1013271 1030569 1048484 1067562 1087552 1107784 1128143 1149148 1171194 1194059 1217166 1240004
57237 1240004 1262304 1284061 1305538 1327234 1349777 1373696 1399073 1425420 1452096 1478903 1506162
57226 1506162 1534205 1562990 1592235 1621680 1651081 1680153 1708677 1736589 1763888 1790550 1816697
57215 1816697 1842790 1869517 1897370 1926335 1956051 1986426 2018062 2051927 2088543 2127621 2168473
57204 2168473 2210498 2253107 2295573 2337384 2378646 2419803 2460918 2501487 2540879 2578766 2615169
57193 2615169 2650456 2685347 2720625 2756675 2793420 2830688 2868560 2907372 2947590 2989623 3033485
57182 3033485 3078605 3124198 3169956 3216128 3262909 3310008 3357046 3404225 3452286 3501789 3552500
57171 3552500 3603462 3653540 3701963 3748599 3793852 3838278 3882117 3925142 3966921 4007189 4045935
57160 4045935 4083208 4119011 4153383 4186306 4217441 4246146 4272035 4295444 4317142 4337606 4356723
57149 4356723 4373977 4388676 4400145 4408252 4413868 4418482 4423210 4428437 4434482 4442188 4452568 4466081 4482587
57136 4482587 4501929 4524278 4549899 4578667 4609866 4642342 4674730 4705460 4732652 4754349 4769192
57125 4769192 4776890 4778244 4775187 4771003 4769814 4775036 4788229 4809704 4839751 4878522 4924926 4976735
57113 4976735 5032216 5091322 5155425 5226866 5309220 5407351 5526445 5671009 5844975 6052593
57103 6052593 6299249 6592042 6940325 7356297 7855728 8458656 9189288 10074800 11143981
57094 11143981 12426264 13950038 15739697 17813215 20181709 22849574 25814267 29068134
57086 29068134 32603249 36414460 40495878 44831868 49381350 54045947 58623776 62785981
57078 62785981 66126393 68285524 69076415 68526894 66822418 64210067 60930761 57196064
57070 57196064 53186279 49049188 44897724 40811783 36845559 33038309 29424417 26037701
57062 26037701 22908660 20059481 17501985 15238252 13260943 11553438 10091797 8848154
57054 8848154 7793492 6899483 6140227 5493414 4940163 4464444 4053142 3695933 3384151
57045 3384151 3109919 2866732 2650193 2457203 2284623 2129338 1989256 1863326 1750576
57036 1750576 1649797 1560123 1481196 1412576 1353417 1302950 1260959 1227603 1202846 1186181 1176893
57025 1176893 1174461 1178385 1187386 1198934 1209738 1216343 1214813 1200570 1170143 1123769 1065654 1001356
57013 1001356 935318 870799 810653 756882 709852 668853 633325 603029 577398 555485 536495
57002 536495 519939 505370 492415 480907 470607 460929 451318 441750 432591 424160 416650 410129 404262
56989 404262 398347 392089 386156 381609 378998 378336 379494 382022 384769 386272 385502 381858 374672 363476
56975 363476 348898 332688 316528 301087 286457 273154 262231 254401 249445 246717 246059 247849 252139
56962 252139 258250 265588 274516 285785 299192 313361 326908 339252 350079 358520 363172 362765 356807
56949 356807 345985 332077 317016 301869 287012 273156 261531 252884 247026 243677 243166 245872 251534
56936 251534 259603 269894 282486 297420 314860 335088 357654 380678 401308 416761 424943 424741
56924 424741 416287 400747 379611 354480 327557 301446 277837 256721 237375 219646 203906 190395
56912 190395 179218 170567 164341 159869 156503 154039 152182 150263 148148 146737 146754 147578 148223 148940 150802
56897 150802 154089 158229 163188 169671 177866 187129 197196 208774 222605 238660 256471 275439 294555
56884 294555 312484 328279 341395 350820 355007 353176 346203 335873 323792 311345 300027 291124
56872 291124 285194 282274 282436 285891 292838 303533 318322 337348 360342 386820 416286 448256 482316
56859 482316 518173 555128 591178 622911 646548 659161 659175 646624 623496 593548 561093 529622
56847 529622 501405 478005 460770 450816 448756 454569 467770 487881 514749 548362 588410 634256
56835 634256 685318 741134 800773 862093 921412 973641 1012856 1033495 1032005 1008116 965062 908661
56823 908661 845691 782176 722335 668666 622680 585360 557001 537085 524706 519324 521071 530369
56811 530369 547335 571565 602326 638531 678367 719254 758443 793372 820962 836978 837279 820315
56799 820315 788137 744811 694431 640729 587460 537977 494502 458241 429758 408591 393095
56788 393095 381738 374609 372986 377454 387196 400974 417896 437026 457047 476671 494761 509649
56776 509649 518769 519473 510218 491195 464328 432722 399452 366467 334769 305417 279620 257672
56764 257672 238573 221237 205556 191821 179607 168022 156954 147326 139979 134706 130575 126801
56752 126801 123081 119387 115841 112799 110690 109630 109339 109498 109889 110079 109366 107510 105281 103731 103033 102595
56736 102595 102214 102326 103012 103647 103890 104232 105036 105806 106021 106004 106185 106174 105528 104935 105567 107418 109285 110294
56718 110294 110625 110851 111440 112886 115387 118275 120435 121398 121470 121064 120677 121266 123534 126770 129399 130821
56702 130821 131779 132852 133649 133811 133726 133759 133665 133298 133127 133534 134254 134992 135995 137477 139032 140032 140228 139690
56684 139690 138684 137815 137673 138116 138564 139171 140853 143908 147487 150755 153584 155675 156214 155191 154011 153798
56668 153798 153897 153131 151764 150942 150747 150176 148961 148099 148433 149679 151087 152283 153203 153856 154396 155011 155611
56651 155611 155945 156028 156081 156100 155886 155461 155055 154743 154423 154033 153456 152375 150677 148891 147819 147703 148102 148478
56633 148478 148631 148686 148968 149776 151002 152117 152810 153365 154109 154822 155142 155257 155595 155935 155482 153885 151770 150115
56615 150115 149336 149031 148400 146977 145161 143945 143933 144735 145483 145687 145430 145014 144770 144907 145138 144650 142869 140209
56597 140209 137721 136134 135470 135409 135634 135957 136410 137170 138217 139264 140225 141444 143117 144761 145680 145819 145827
56580 145827 146409 147866 150067 152538 154757 156632 158505 160543 162509 164388 166730 169893 173356 176405
56566 176405 179266 182964 188140 194565 201749 209582 218390 228697 240854 254581 268848 282408 294273
56553 294273 303701 310218 313982 315681 315673 313719 309983 305739 302338 299853 297429 294624 291619 288435 284902
56538 284902 281395 278726 277046 275489 273056 269438 264961 260209 255726 251611 247399 242738 238129 234445
56524 234445 231833 229580 227068 224259 221228 217827 214024 210165 206692 203813 201465 199391 197298 195138
56510 195138 193083 191060 188706 186083 183938 182769 182099 181295 180601 180508 180567 179906 178733 178166 178497 178743 178239
56493 178239 177626 177768 178470 178885 178668 178112 177535 177061 176827 177019 177666 178501 179044 179048 179017 179942 182053 184171 184925
56474 184925 184417 184005 184585 185897 187482 189386 191618 193686 195080 195721 195684 194983 193901 193020 192616 192367 191897
56457 191897 191266 190811 190821 191440 192556 193747 194680 195520 196562 197616 198267 198631 199252 200334 201687 203297 205259
56440 205259 207193 208507 209284 210146 211208 211946 212090 211825 211087 209640 208035 207442 208166 209216 209674 209584 209193
56423 209193 208403 207508 207419 208395 209348 209240 208447 207985 208039 208119 208190 208717 209871 211391 213052 214714 216154 217289
56405 217289 218286 219095 219240 218467 217184 215930 214924 214439 214879 215957 216536 216017 215276 215475 216498 217411 217976
56388 217976 218676 219556 220061 219978 219734 219782 220357 221716 223875 226160 227766 228739 229773 231073 232141 232730 233278
56371 233278 234203 235421 236788 238448 240430 242335 243733 244597 245106 245296 245203 245169 245772 247376 249760 252180
56355 252180 253908 254830 255536 256716 258534 260566 262235 263278 263991 265025 266701 268475 269455 269522 269539 270274
56339 270274 271527 272605 273288 273926 274953 276732 279612 283628 288238 292747 296928 300936 304828 308534 312235
56324 312235 316323 320914 325613 329797 333011 335139 336377 336997 337075 336541 335510 334394 333588 333200 333160 333413
56308 333413 333945 334820 336280 338592 341793 345699 350136 354913 359700 364303 369011 374258 379967 385562 390590
56293 390590 394971 398818 402547 406949 412476 418531 424213 429698 436024 443507 451391 459261 467693 477048
56279 477048 486682 496023 505599 516208 527723 539516 551589 564559 578841 594391 611022 628562
56267 628562 647063 667144 689704 715037 742682 772417 804731 840123 878664 920675 967121
56256 967121 1018961 1076861 1141876 1215478 1298378 1390241 1491172 1602561 1725752 1860850 2007560
56245 2007560 2166106 2336190 2515772 2701967 2892413 3084841 3275992 3462118 3639867
56236 3639867 3805602 3954565 4081985 4184599 4260013 4305351 4318130 4298259 4247940 4169844
56226 4169844 4066565 3941522 3798907 3642635 3476289 3303846 3129174 2954883 2782762
56217 2782762 2615154 2454650 2302421 2158108 2021514 1893327 1774112 1663736 1561985
56208 1561985 1468810 1383761 1306043 1235244 1171181 1113023 1059463 1009773 963917 921747 883054
56197 883054 848279 818035 791845 768381 747022 728151 711796 697067 683187 670161 658181
56186 658181 647266 637646 629616 622791 616335 610103 604731 600453 596698 593054 589694 586642 583472 580106
56172 580106 577232 575597 575373 576312 577904 579440 580647 582309 585551 590435 595857 600810 605143 609235 613702
56157 613702 619282 626286 634273 642902 652765 664508 677661 691430 706349 723877 744585 768014
56145 768014 794166 823773 857044 893529 933410 977705 1026986 1080979 1139457 1202224 1268026
56134 1268026 1334651 1400308 1463822 1523511 1577292 1624221 1664844 1699974 1730357 1757479 1782957
56123 1782957 1806572 1826147 1839693 1846502 1846139 1838145 1823337 1803804 1780671 1752958 1719128 1678616
56111 1678616 1631319 1577050 1516455 1451679 1385533 1320689 1259719 1204630 1155879 1112860 1075551
56100 1075551 1044489 1019122 997801 979784 965672 955440 947654 941261 936586 933936 932773 932962 935187
56087 935187 939308 943886 948189 953065 958920 964548 969248 974490 981975 991262 1000762 1010075 1019972 1030900
56073 1030900 1042765 1055500 1068817 1082052 1095155 1109138 1124759 1141523 1158570 1175708 1192904
56062 1192904 1209768 1226207 1242762 1259747 1276962 1294607 1313319 1332889 1352163 1370590 1388599
56051 1388599 1406239 1423070 1439799 1458211 1478769 1499937 1520535 1541071 1562124 1583332 1604851
56040 1604851 1627875 1652769 1678458 1704542 1732056 1761242 1790666 1819676 1849669 1881754 1915265
56029 1915265 1949848 1986848 2027224 2070131 2115005 2162862 2214010 2266649 2319457 2373524 2430048
56018 2430048 2488266 2547450 2608852 2673786 2741721 2812011 2885534 2962949 3043433 3126808 3214629
56007 3214629 3307493 3403707 3502458 3605709 3715121 3829870 3949566 4076363 4211764 4354298
55997 4354298 4502911 4659726 4826840 5003477 5189107 5386137 5596416 5818403 6051229
55988 6051229 6298327 6563502 6846737 7147820 7470768 7820356 8197330 8601447 9036490
55979 9036490 9508061 10019512 10574438 11179999 11843340 12568188 13359932 14230837 15195858
55970 15195858 16267792 17462317 18803973 20322045 22046143 24013661 26278868 28910608
55962 28910608 31989963 35621834 39946377 45131325 51357010 58813962 67702580 78217104
55954 78217104 90529993 104799267 121179394 139803179 160747781 184016446 209516987
55947 209516987 236983546 265821919 294895491 322298856 345283385 360627597 365577239
55940 365577239 358960673 341732969 316539091 286653042 255033171 223901885 194725502
55933 194725502 168321164 144994000 124712415 107273164 92394101 79755189 69039813
55926 69039813 59970614 52309925 45842029 40372949 35740905 31811221 28463355 25592616
55918 25592616 23118423 20978351 19115760 17480736 16037676 14761242 13626502 12610139
55910 12610139 11697513 10879709 10145067 9480144 8876446 8329172 7831058 7373711 6953218
55901 6953218 6568434 6215145 5887283 5582340 5300313 5038810 4794245 4566421 4356919
55892 4356919 4164071 3984096 3815923 3660430 3516140 3380214 3252729 3135589 3027993
55883 3027993 2927066 2832108 2744204 2662328 2583838 2508215 2436394 2366821 2296038 2223111 2150160
55872 2150160 2078714 2008785 1941217 1877595 1817730 1760100 1704691 1652726 1603912 1556770 1511527
55861 1511527 1469919 1432264 1397258 1364470 1334477 1306729 1279809 1253744 1229664 1207312 1185132
55850 1185132 1162599 1140233 1117602 1093635 1068659 1043862 1019049 993225 967063 942316 919009
55839 919009 895743 872707 851845 833832 817257 801071 785590 770831 756025 741247 727583
55828 727583 715298 703583 692291 682145 673064 664081 655032 646508 638077 628471 617734 607298 597671
55815 597671 587962 577985 568910 561376 554745 548652 543617 539620 535834 532283 530113 529587 529421 528806 528697
55800 528697 530395 534101 539465 546271 553812 560657 565752 569074 570954 571639 571610 571239 569937 566705 561679
55785 561679 556034 550305 543980 536897 529647 522388 514547 506017 497370 488602 478991 468644 459009 451384
55771 451384 446073 443277 443531 446739 451935 458438 465990 473217 477241 475771 468836 458052 445176 431889
55757 431889 419762 409343 399869 390547 381528 373149 365000 356509 347953 340151 333430 327391 321489 315573
55743 315573 309966 305074 300733 296215 291294 286955 284269 282830 281177 278630 275782 273243 270929 268661
55729 268661 266525 264469 262345 260387 258811 256978 253894 249605 245198 241413 238177 235435 233382 231883
55715 231883 230764 230633 232188 234732 236747 238117 240328 244188 248760 253000 256914 260447 262623 262749 261403
55700 261403 259350 256442 252314 247277 241745 235631 229024 222629 216862 211409 206359 202751 201160 200599
55686 200599 199790 198781 198310 198290 198048 197674 198026 199520 201728 204056 206233 208240 210194 212081 213344 213149
55670 213149 211427 209200 207423 205996 204351 202540 201171 200609 200695 200989 201023 200645 200359 200935 202520 204568
55654 204568 206744 209252 212140 215030 217760 220518 223095 224807 225524 225874 226138 225867 225026 224365 224001 222795
55638 222795 220026 216720 214152 211841 208216 202753 196280 189586 182962 176934 172261 169090 166922 165421
55624 165421 164552 163996 163186 161992 160764 159671 158530 157295 156150 155057 153647 151722 149599 147919 147161
55609 147161 147174 147100 146089 144161 142003 139831 137070 133450 129722 126836 124998 124016 123946 124683 125424 125327 124447
55592 124447 123439 122660 122200 122370 123380 124679 125395 125365 125143 125064 124912 124477 123890 123361 123029 123121 123914 125470
55574 125470 127540 129719 131650 133362 135511 138943 143809 149437 155116 160504 165154 168383 169988 170429
55560 170429 169888 167941 164704 161397 158898 156445 152822 148340 144524 142036 140067 137753 135193 132873
55546 132873 130941 129328 127987 126796 125649 124721 124275 124208 124142 123921 123630 123320 123131 123504 124699 126227 127261
55529 127261 127572 127547 127413 126969 126001 124457 122269 119477 116488 113759 111280 108815 106586 105185 104814 105052
55513 105052 105352 105400 105033 104250 103317 102554 102025 101596 101109 100292 98871 97157 96161 96580 97956 99290 100166 100703
55495 100703 100846 100446 99904 99883 100399 100853 100905 100721 100321 99405 97916 96221 94622 93132 91828 91039 91137 92386
55477 92386 94827 97943 100667 102267 103022 103584 103994 103941 103634 103546 103465 102680 101124 99541 98454 97736 97237 97000
55459 97000 96752 96000 94895 94206 94168 94042 93178 91828 90593 89624 88799 88132 87634 87210 87063 87723 89316 91199
55441 91199 92704 93924 95393 97205 98765 99292 98490 96917 95665 95367 95540 95233 94239 93146 92407 92018
55425 92018 92090 92847 93850 94138 93585 93288 94021 95063 95269 94737 94513 94998 95591 95784 95756 95710 95354 94402 93222
55406 93222 92594 92936 93945 94903 95243 94871 94089 93290 92772 92716 93186 94013 94770 94925 94165 92727 91413 90980
55388 90980 91310 91453 90783 89884 89906 91179 92923 94241 94847 94865 94467 93938 93672 93874 94485 95382 96327 96790 96345
55369 96345 95355 94748 94939 95414 95550 95316 94931 94360 93611 93132 93389 94211 94997 95494 96006 96845 97844 98436 98162
55350 98162 97171 96234 96139 96891 97651 97540 96479 95216 94624 94917 95450 95365 94550 93856 94193 95540 97096 98161
55332 98161 98539 98320 97799 97526 97878 98569 98996 99069 99186 99476 99674 99773 100123 100725 101040 100724 100021 99199 98186
55313 98186 97052 96252 95997 95852 95369 94715 94295 94121 93931 93613 93188 92662 92187 92099 92543 93354 94404 95651
55295 95651 96667 96733 95736 94426 93420 92532 91597 91314 92516 94915 97273 98684 99114 98922 98471 98060 97677
55278 97677 96881 95411 93771 92675 92100 91483 90774 90561 91085 91816 92197 92234 92083 91605 90760 90053 90083 90814 91710
55259 91710 92570 93810 95783 98101 99930 100860 101227 101450 101425 100855 100040 99811 100582 101811 102620 102670 102243 101721
55241 101721 101311 101117 101139 101227 101207 101048 100817 100547 100251 99945 99598 99141 98587 97950 97032 95598 93869 92543 92064
55222 92064 92073 91857 91181 90441 90094 90170 90348 90365 90353 90781 91938 93486 94692 95131 95018 94893 95242 96324 97974
55203 97974 99490 100134 99901 99496 99407 99406 99083 98477 97926 97698 98011 99056 100634 102071 102769 102675 102066 101207 100387
55184 100387 99843 99397 98618 97634 97272 97985 99117 99727 99738 99645 99456 98676 97280 96024 95664 96264 97329 98338
55166 98338 99105 99823 100704 101503 101673 101187 100756 100918 101304 101278 100911 100720 100744 100534 99952 99355 99095 99325 100208 101693
55146 101693 103111 103638 103266 102811 102902 103385 103800 103939 103801 103444 103038 102782 102657 102537 102520 102761 103036 102904 102353
55127 102353 101827 101549 101304 101055 101263 102231 103467 104083 103751 102944 102316 102029 101770 101281 100700 100293 100005 99596
55109 99596 99185 99237 99795 100178 99851 99281 99437 100631 102352 104044 105525 106673 107315 107524 107611 107718 107674 107351
55091 107351 106892 106636 107036 108496 110833 113050 114110 114001 113666 113898 114758 116038 117676 119491 120917 121355
55075 121355 120684 119372 118153 117541 117388 117088 116391 115789 115775 116058 116042 115768 115679 115661 115183 114354 113967 114250 114429
55056 114429 113848 112840 112078 111712 111598 111784 112201 112331 111757 110810 110195 110234 110825 111793 112851 113483 113409 113004 112818
55037 112818 112840 112695 112437 112556 113111 113351 112523 110872 109524 109303 109861 110155 109773 109434 109956 111081 111867 112125
55019 112125 112766 114502 116789 118431 118846 118286 117154 115676 114160 113052 112595 112652 113000 113596 114412 115128 115220
55002 115220 114523 113620 113419 114190 115259 115865 116062 116387 116893 117103 116845 116518 116389 116181 115624 114957 114547 114406
54984 114406 114441 114915 116256 118489 121062 123148 124104 123878 123103 122555 122420 122311 121962 121586 121478 121701 122211 122840
54966 122840 123122 122660 121864 121704 122412 123057 122801 122023 121687 122069 122679 123070 123121 122842 122471 122503 123043 123357 122666
54947 122666 121201 119889 119168 118733 118311 117995 117851 117929 118645 120402 122558 123551 122512 120349 118773 118566 119188
54930 119188 119785 120097 120390 120955 121869 123125 124823 127135 130054 133228 136182 138731 141145 143896 147242
54915 147242 150975 154542 157518 160050 162735 165947 169384 172303 173995 174033 172340 169273 165425 161138 156399
54900 156399 151353 146579 142547 139117 136027 133579 132242 131693 130932 129456 127837 126959 127139 128139 129518
54885 129518 130675 130997 130512 130237 131380 134088 137275 139727 141233 142548 144529 147527 151482 156156 160959
54870 160959 164827 166888 167426 167806 169097 171043 172651 173423 173472 172687 170543 166913 162503 158205 154375 150976
54854 150976 148010 145447 143009 140436 137857 135545 133414 131090 128451 125806 123501 121600 120030 118787
54840 118787 117853 117115 116578 116530 117213 118268 118784 118108 116530 114973 114011 113442 112839 112228 111977 112213 112744 113542
54822 113542 114842 116563 117946 118191 117405 116556 116385 116673 116749 116472 116318 116591 116984 117095 117048 117302 117995 118823
54804 118823 119537 120264 121244 122432 123521 124277 124784 125367 126229 127095 127313 126466 124892 123450 122764 122810 123120 123229
54786 123229 122970 122644 122922 124335 126680 129012 130277 129968 128392 126564 125671 126237 127719 129165 130205 131142
54770 131142 132265 133596 135247 137457 140134 142938 145950 149717 154394 159422 164347 169327 174406 178938
54756 178938 182349 184997 187523 189661 190397 189172 186282 182186 177080 171202 165065 159286 154440 150917
54742 150917 148513 146357 143769 141087 139166 138228 137801 137613 137812 138312 138689 138903 139392 140199 140666 140418 140042
54725 140042 140357 141460 142971 144874 147488 150737 153993 156746 159142 161728 164784 167993 170799 173003
54711 173003 174830 176293 176866 176130 174451 172402 169690 165510 160150 155357 152470 150817 148683 145507 142353
54696 142353 140313 139323 138697 138119 137628 137025 135925 134341 132842 131967 131704 131686 131742 131982 132387 132629 132413 131805
54678 131805 131019 130104 129104 128349 128201 128494 128557 127878 126555 125093 124024 123685 124055 124713 125172 125318 125342 125265
54660 125265 124896 124241 123628 123297 123211 123372 123933 124815 125549 125774 125686 125793 126408 127477 128614 129161 128589 127150
54642 127150 125895 125702 126418 127164 127323 127046 126989 127762 129453 131450 132900 133528 133820 134245 134615 134463 133740 132759
54624 132759 131676 130470 129356 128788 128994 129763 130691 131452 131904 132140 132385 132742 133156 133671 134397 135016 134744 133214
54606 133214 131095 129382 128325 127577 127130 127360 128236 129203 129965 130703 131368 131464 130886 130302 130306 130646 130773 130697 130783
54587 130783 131076 131413 131932 132783 133457 133090 131580 129853 128854 128665 128828 129098 129518 130001 130192 129852 129233 128997
54569 128997 129663 131064 132421 133097 133109 132715 131785 130104 128258 127547 128639 130757 132621 133864 135018 136352
54553 136352 137378 137587 137105 136379 135597 134731 133942 133623 134039 135119 136603 138331 140347 142642 144774 145981
54537 145981 145960 145387 145253 145658 145726 144913 143922 143931 145166 146694 147510 147440 146943 146408 145783 144793 143399 142032 141278
54518 141278 141265 141530 141608 141513 141438 141272 140758 140035 139607 139740 140209 140629 140734 140325 139334 138086 137237 137276 138164 139466
54498 139466 140633 141167 140804 139694 138273 136914 135850 135310 135444 136017 136471 136395 135730 134616 133380 132666 133099
54481 133099 134556 136146 137160 137772 138561 139661 140692 141364 141728 141957 142184 142531 143068 143764 144660 145978 147778
54464 147778 149597 150707 150802 150285 149877 150079 150995 152457 154184 155854 157116 157677 157522 157004 156513 155994 154995
54447 154995 153257 151098 149049 147356 146000 145031 144617 144827 145558 146598 147574 147996 147678 147077 146926 147430 148045
54430 148045 148160 147796 147492 147645 148220 149109 150442 152277 154068 154879 154345 153206 152592 152933 153827 154796 155691
54413 155691 156390 156597 156140 155171 153982 152948 152655 153528 155139 156401 156775 156846 157320 157940 157895 156953 155630 154521
54395 154521 154007 154368 155576 157127 158593 160156 162069 163832 164677 164773 165092 165998 166756 166655 165864 164862 163784
54378 163784 162742 162100 161927 161764 161523 161988 163755 166135 167969 169179 170643 172692 174680 176136 177504
54363 177504 179400 181795 184297 186698 188856 190470 191415 192017 192603 193000 192829 192089 191035 189655 187708 185249
54347 185249 182754 180653 179021 177720 176567 175319 173780 172069 170540 169314 168071 166475 164733 163568
54333 163568 163602 164743 166154 166884 166619 165768 164801 163703 162339 161109 160713 161255 162071 162609 162946 163172 162842
54316 162842 161584 159847 158396 157285 156047 154805 154372 155066 156083 156431 155972 155221 154564 154092 153903 154042
54300 154042 154314 154508 154698 154999 155145 154672 153505 152152 151307 151427 152502 153994 155074 155214 154580 153706 152915
54283 152915 152270 151919 152168 153193 154905 157032 159113 160521 160822 160219 159412 158990 159083 159533 160150 160747 161164
54266 161164 161348 161344 161263 161372 162069 163488 165171 166413 166985 167296 167876 168905 170218 171493 172409 172932 173489 174567
54248 174567 176028 177100 177171 176352 175140 173823 172404 170905 169519 168561 168335 168788 169226 168710 167058 165234
54232 165234 164432 164951 166228 167748 169385 170903 171714 171492 170705 170145 170057 170007 169616 169059 168695 168458 167931 167031
54214 167031 166303 166358 167162 168079 168501 168231 167364 166177 165225 165112 165903 166962 167634 167897 168062 168073 167610 166870 166636
54195 166636 167307 168268 168619 168312 168150 168747 169920 171089 171884 172183 171911 171135 170166 169292 168440 167383 166223
54178 166223 165452 165458 166177 167312 168709 170300 171778 172638 172705 172461 172578 173104 173350 172776 171781 171276 171531 171848
54160 171848 171472 170471 169480 168856 168411 167777 166758 165471 164405 164205 165047 166326 167234 167468 167066 165855 163730
54143 163730 161354 159883 159828 160688 161834 163049 164019 164064 162978 161601 160983 161328 162213 163414 164831 165910
54127 165910 165974 165118 164167 163736 163846 164445 165637 167253 168738 169750 170519 171390 172373 173301 174144 174947 175719 176563
54109 176563 177732 179341 181157 182807 184074 184953 185582 186274 187485 189638 192893 196989 201198 204611 206752
54094 206752 207925 208732 209314 209296 208412 206863 204979 202838 200347 197517 194634 192265 191028 191047 191694 192183
54078 192183 192474 193250 194989 197447 200135 202837 205408 207473 208811 209845 211300 213313 215180 216086 215908
54063 215908 215140 214197 213032 211508 209849 208442 207279 206014 204670 203852 203957 204501 204674 204318 203916 203800
54047 203800 203961 204600 206271 209255 213177 217312 221004 223888 226224 229058 233457 239351 245560 251127 256159
54032 256159 261192 266377 271718 277569 284200 291060 297060 301638 305232 308674 312353 315951 318795 320466
54018 320466 321147 321387 321571 321710 321638 321050 319432 316381 312124 307321 302251 296629 290420 284361 279325 275450
54002 275450 272143 268650 264459 259597 254815 251058 248442 246192 243850 241930 240882 240046 238415 236049
53988 236049 233923 232558 231624 230764 230016 229338 228464 227408 226491 225706 224616 223094 221626 220653 220095 219792 219911
53971 219911 220550 221369 222087 223095 225085 228137 231551 234609 237293 240222 244052 249016 254929 261509 268617
53956 268617 276144 283790 291091 297584 302805 306141 306924 304888 300575 295254 290324 286499 283503 280686
53942 280686 278025 276284 276076 277088 278539 280096 281951 284209 286727 289492 292620 295866 298628 300599
53928 300599 302149 303961 306520 309980 314100 318151 321354 323725 326250 329939 334858 340343 345934 351808
53914 351808 358364 365725 373686 381902 390026 397739 404811 411172 416900 422053 426477 429815 431826 432617
53900 432617 432502 431685 430204 428124 425616 422833 419767 416222 411915 406762 401115 395488 389872 383508 375667
53885 375667 366552 357206 348622 341171 334668 328641 322615 316567 311101 306830 303605 300672 297540 294297
53871 294297 291143 288128 285323 282677 279565 275131 269411 263625 258975 255526 252618 249911 247476 245212
53857 245212 242822 240353 238201 236511 234934 233074 230924 228838 227285 226629 226850 227374 227402 226604 225390 224418
53841 224418 223887 223412 222649 221872 221771 222618 223844 224631 224779 224710 224699 224488 223689 222264 220518 218951 218210 218748
53823 218748 220302 222031 223388 224540 225709 226599 226929 227161 228036 229477 230596 230889 230986 232008 234443 237818
53807 237818 241297 244495 247791 251846 256766 261897 266628 271171 276208 281912 287699 292956 297613 301955
53793 301955 306206 310452 314708 318893 322863 326520 329762 332379 334209 335321 335782 335382 333984 332083 330399
53778 330399 328770 326043 321446 315668 310069 305171 300460 295499 290582 286189 282344 278802 275551 272778
53764 272778 270424 268114 265588 263003 260663 258557 256364 253887 251260 248559 245498 241884 238270 235662
53750 235662 234422 233862 233130 232163 231448 231141 230901 230413 229674 228805 228030 227743 228155 228815 228968 228524 228256 228833
53732 228833 230064 231369 232592 233943 235415 236793 238079 239494 241050 242517 243850 245247 246768 248229
53718 248229 249595 251073 252663 253949 254644 255073 255795 256931 258216 259572 261221 263227 265361 267532 270003
53703 270003 273005 276372 279746 282917 285758 288079 289933 291923 294756 298450 302285 305614 308420 310950
53689 310950 313221 315181 317029 318972 320751 321806 321903 321294 320284 318995 317641 316615 316131 316021 316060 316179
53673 316179 316155 315421 313566 310903 308218 306020 304325 303092 302411 302200 302113 301998 302220 303220 304790 306055
53657 306055 306234 305330 303988 302772 301718 300628 299598 299049 299230 299951 300788 301378 301455 300958 300334 300457 301871
53640 301871 304203 306620 308786 311039 313745 316829 319994 323015 325708 327934 329855 332002 334861 338471
53626 338471 342524 346740 351051 355486 359999 364407 368559 372510 376443 380361 384070 387542 391011 394516
53612 394516 397681 400318 402907 405950 409115 411713 413903 416613 420142 423631 426247 428222 430228 432290
53598 432290 433809 434372 434083 433393 432944 433232 434021 434318 433274 430906 427806 424544 421637 419520 418084 416639
53582 416639 414834 413208 412302 411618 410133 407524 404261 400841 397705 395614 395095 395422 395062 393364 391164
53567 391164 389479 388292 386996 385442 384042 383157 382838 383034 383744 384954 386452 387736 388270 388066 387807 388066
53551 388066 388598 388852 389013 389947 392117 395129 398382 401631 404792 407779 410745 414012 417534 420920 424161
53536 424161 427901 432696 438435 444785 451843 459998 469325 479373 489466 499234 509074 520016 532716
53523 532716 546614 560539 574146 588204 603468 619952 637400 655716 674608 693651 713137
53512 713137 734168 757304 781747 806479 831604 857766 884761 911676 938204 964913 992160
53501 992160 1019460 1046061 1071516 1095596 1118180 1139496 1160109 1180489 1200725 1220595 1239670
53490 1239670 1257526 1274280 1290868 1308390 1327147 1346600 1366131 1385458 1404412 1422842 1440797
53479 1440797 1458309 1474930 1489951 1503230 1515332 1526527 1536044 1542674 1545941 1546320 1544465 1540562 1534465
53466 1534465 1526119 1515627 1503019 1488268 1471635 1453872 1435889 1418184 1400706 1383185 1365355
53455 1365355 1346903 1327486 1306977 1285521 1263316 1240562 1217674 1195221 1173484 1152360 1131939
53444 1131939 1112803 1095466 1079805 1065401 1052273 1040929 1031808 1024965 1020113 1016675 1013999 1011906
53432 1011906 1010896 1011478 1013477 1016337 1019948 1024700 1030881 1038560 1047972 1059383 1072460 1086340 1100556
53419 1100556 1115507 1131834 1149783 1169467 1191306 1215687 1242352 1270583 1300000 1330859 1363488
53408 1363488 1397706 1433082 1469686 1508255 1549421 1592945 1638043 1684402 1732446 1782531 1834395
53397 1834395 1887703 1942642 1999439 2057596 2116220 2174992 2234196 2293809 2353198 2411833 2469661
53386 2469661 2526556 2581943 2635287 2686504 2735455 2781433 2823630 2861939 2896811 2928332 2955816
53375 2955816 2978282 2995083 3006032 3011221 3010872 3005237 2994471 2978468 2956761 2928650 2893696 2852262
53363 2852262 2805501 2754743 2700958 2644872 2587243 2528730 2469610 2410023 2350572 2292325 2236066
53352 2236066 2181827 2129412 2079125 2031521 1986474 1942962 1899967 1857246 1815077 1773646 1733065
53341 1733065 1693641 1655589 1618683 1582807 1548774 1517860 1490342 1465138 1441229 1418867 1398847
53330 1398847 1381101 1364682 1348931 1333984 1320061 1306745 1293196 1278872 1264025 1249594 1236511
53319 1236511 1224958 1214413 1204546 1195730 1188366 1182089 1176177 1170638 1166386 1164330 1164648 1166923 1170581 1175211
53305 1175211 1180881 1188174 1197615 1209018 1221770 1235686 1251172 1268500 1287423 1307662 1329328 1352627
53293 1352627 1377503 1403819 1431594 1460745 1490716 1520574 1549414 1576612 1601898 1625385 1647386
53282 1647386 1667971 1686657 1702642 1715310 1724533 1730515 1733396 1733028 1729141 1721632 1710642 1696466 1679666
53269 1679666 1661165 1641749 1621287 1598803 1573629 1546208 1517562 1488382 1458958 1429547 1400196
53258 1400196 1370468 1339913 1308714 1277365 1245930 1214188 1182365 1151064 1120468 1090282 1060562
53247 1060562 1032031 1005366 980552 956986 933888 910675 887327 864400 842320 820870 799779
53236 799779 779476 760611 743129 726765 712179 700407 691039 682161 672579 663005 654467 646599 638341
53223 638341 629521 620606 611397 601036 589195 576486 563677 551113 538825 526656 514244 501319
53211 501319 488098 475233 463437 453232 444665 437071 429473 421549 413904 407162 401221 395671 390357
53198 390357 385076 379273 372675 365838 359433 353333 347032 340632 334696 329359 324325 319570 315355 311590
53184 311590 307954 304580 301890 299700 297197 294007 290671 287865 285675 283884 282425 281213 279954 278451
53170 278451 276943 275916 275692 276242 277150 277697 277292 275949 274212 272657 271628 271277 271459 271610 271156 270116
53154 270116 268951 267820 266484 264991 263879 263380 262887 261705 260114 259171 259448 260314 260637 259964 258895 258365
53138 258365 258781 259942 261544 263452 265421 266917 267457 266991 265860 264572 263799 264211 265858 267838 269038
53123 269038 269286 269462 270439 272163 273858 274874 275306 275927 277589 280483 283920 286893 288844 289860 290323 290537
53107 290537 290582 290285 289421 288067 286646 285455 284309 282869 281104 279190 277206 275231 273534 272250 271056
53092 271056 269564 267921 266637 265904 265529 265354 265280 264928 263896 262433 261353 261126 261497 262060 262727 263399 263659
53075 263659 263135 262003 260876 260317 260421 260654 260110 258314 255871 253955 253117 252928 252790 252589 252347 251858 251055
53058 251055 250353 250144 250152 249672 248437 246986 246222 246723 248342 250314 251858 252806 253559 254458 255438 256276 256880 257228
53040 257228 257310 257243 257118 256662 255458 253682 252202 251621 251595 251426 251014 250768 250832 250881 250593 249937 249065 248251 247878
53021 247878 248121 248641 248922 248860 248763 248815 248907 249058 249595 250735 252169 253270 253664 253578 253688 254532 255889 256841 256675
53002 256675 255708 254926 254780 254707 254013 252848 252027 252095 252923 254156 255618 257199 258654 259734 260435 260978 261618
52985 261618 262566 263944 265704 267602 269396 271020 272502 273826 274959 275965 276905 277695 278198 278389 278292 277850
52969 277850 277104 276396 276094 276177 276375 276709 277482 278719 280039 281196 282303 283284 283640 283120 282247 281723 281557 281188
52951 281188 280202 278550 276333 273861 271735 270321 269208 267643 265411 262879 260358 257956 255983 254877
52937 254877 254704 255229 256434 258357 260409 261556 261420 260631 259878 259208 258485 257883 257463 256779 255478 253965 252974
52920 252974 252708 252874 253356 254361 255869 257417 258538 259246 259933 260839 261680 261881 261288 260379 259543 258381 256297
52903 256297 253674 251790 251347 251752 252122 252344 252635 252687 252031 250968 250358 250568 251214 251888 252521 253011 253145 253099
52885 253099 253548 254886 256596 257717 257840 257440 257267 257614 258301 259213 260531 262266 263844 264662 265070 266215
52869 266215 268639 271469 273451 274485 275615 277612 280139 282363 283900 284936 285731 286276 286368 285844 284743
52854 284743 283250 281504 279509 277225 274641 271750 268603 265433 262517 259879 257378 255117 253418 252234
52840 252234 250976 249222 247225 245404 243756 242242 241352 241549 242325 242585 242079 241745 242439 243891 245222 245969
52824 245969 246177 245933 245357 244844 244791 245078 245212 245028 244887 245080 245307 244980 243897 242426 241096 240242 240062 240745
52806 240745 242300 244361 246432 248324 250095 251549 252120 251507 250149 248722 247295 245361 242725 239998 238068
52791 238068 237271 237231 237291 236926 235877 234276 232701 231881 232096 232932 233807 234690 236028 237881 239457 239850 239034
52774 239034 237778 236617 235367 233730 231947 230620 230159 230635 231882 233431 234508 234507 233529 232310 231606 231657
52758 231657 232162 232673 233035 233437 234009 234552 234966 235725 237403 239729 241700 242835 243713 244961 246365 247538
52742 247538 248908 251269 254544 257714 259893 261013 261510 261917 262666 263720 264402 264075 262948 261778 260880 260065
52726 260065 259464 259655 260789 262200 263123 263234 262371 260379 257651 255236 253907 253430 253085 252553 251967 251476 251181
52709 251181 251203 251429 251536 251606 252339 254095 256002 256671 255768 254326 253494 253503 253926 254439 255032 255738 256465 257022 257261
52690 257261 257253 257307 257608 257868 257611 256835 256160 256167 256756 257334 257486 257316 257163 257123 256931 256340 255547 255050 255030 255055 254670
52669 254670 254094 254016 254697 255681 256472 257138 257993 258997 259800 260224 260373 260387 260432 260901 262248 264548 267439 270555
52651 270555 273738 276759 279198 280795 281725 282281 282461 282020 280801 278858 276471 274237 272852 272454 272351 271778
52635 271778 270770 269871 269122 267935 266061 264124 262956 262833 263599 265130 267274 269629 271779 273601 275068
52620 275068 275948 276047 275576 274971 274394 273704 272805 271773 270722 269872 269629 270256 271399 272217 272094 271139 269999 269355
52602 269355 269471 270046 270491 270544 270534 270909 271632 272288 272701 273161 274001 275133 276089 276451 276308 276314 277100 278518 279695
52583 279695 280074 280117 280682 281908 283140 283805 283898 283713 283586 283960 285156 286886 288390 289257 289833 290652 291714
52566 291714 292486 292408 291289 289461 287666 286570 286216 286113 285911 285699 285607 285451 284998 284303 283498 282455 280947
52549 280947 279146 277703 277246 277788 278683 279225 279322 279495 280138 281031 281777 282455 283334 284134 284241 283747 283607 284374
52531 284374 285306 285278 284247 283257 283154 283865 284908 286026 287168 288220 289085 289806 290430 290881 291170 291611 292600
52514 292600 294207 296144 298194 300441 302986 305597 307904 309905 311988 314442 317141 319840 322408 324520
52500 324520 325338 323963 320338 315525 311007 307681 305343 302955 299549 295134 290718 287377 285394 284396 284016
52485 284016 284140 284684 285534 286621 287721 288324 288126 287594 287638 288709 290489 292354 293744 294281 294134 294269 295722
52468 295722 298455 301411 303781 305682 307536 309520 311847 314868 318358 321257 322717 323036 323107 323237 323042
52453 323042 322187 320685 318614 316056 313217 310188 306728 302670 298501 295079 292773 291171 289645 287945
52439 287945 286320 285322 285445 286637 288226 289518 290374 290986 291245 290727 289289 287408 285840 285077 285034 285135 284807
52422 284807 284081 283612 283939 284948 286243 287759 289621 291617 293311 294679 296163 298031 300144 302536 305870
52407 305870 310920 317769 325789 334384 343505 353283 363364 372815 380757 386831 390963 392840 391929 387998
52393 387998 381398 373001 364066 355955 349434 344195 339545 335522 332789 331358 330225 328640 327080 326447
52379 326447 326857 327805 329105 330960 333430 336409 339916 343789 347422 350458 353539 357619 362706 367974 373000
52364 373000 377984 382694 386070 387292 386630 384990 383146 381614 380697 380229 379663 378774 377976 377750 378045 378455
52348 378455 378691 378770 379114 380564 383828 388643 393851 398479 402383 405771 408742 411703 415642 421350 428580
52333 428580 436459 444572 453211 462761 473354 485110 498192 512520 527679 543247 559055 575213
52321 575213 592046 610018 629529 650624 672870 695418 717194 737322 755609 772621 789213
52310 789213 806054 823484 841519 859809 877767 894947 911244 926764 941727 956486 971204
52299 971204 985355 997980 1008679 1017972 1026375 1033550 1038806 1042011 1043352 1042489 1038728 1032077 1023441 1013698
52285 1013698 1003232 992573 982767 974568 967635 961085 954678 949097 945202 943404 943698 945899 949736 954940
52271 954940 961369 969005 977891 988156 999906 1012895 1026390 1039689 1052790 1066272 1080412 1094669
52259 1094669 1108192 1120684 1132607 1144654 1157154 1169908 1182469 1194590 1206458 1218386 1230167
52248 1230167 1240875 1249446 1255278 1258122 1257589 1253328 1245791 1236397 1226572 1216716 1206287 1194715 1181969
52235 1181969 1168415 1154542 1140934 1128163 1116447 1105508 1094921 1084570 1074614 1065099 1055840 1046796
52223 1046796 1038417 1031400 1026009 1021797 1018098 1014722 1011995 1010196 1009273 1009131 1009921 1011767 1014377 1017278 1020431
52208 1020431 1024321 1029349 1035337 1041729 1048091 1054272 1060274 1066226 1072384 1078806 1084945 1089851 1093075 1095332
52194 1095332 1098017 1102020 1107134 1112580 1117789 1122573 1126816 1130438 1133599 1136602 1139445 1141697 1143018 1143559
52180 1143559 1143627 1142967 1140714 1136217 1129787 1122373 1114558 1106183 1097152 1088217 1080410 1073800 1067528 1061308 1056205
52165 1056205 1053315 1052219 1051553 1050837 1050808 1051916 1053516 1054931 1056523 1059152 1063021 1067521 1071810 1075108 1076886
52150 1076886 1077325 1077358 1077809 1078694 1079678 1080824 1082381 1084176 1085871 1087617 1089809 1092264 1094296 1095634 1096762
52135 1096762 1098273 1100328 1102845 1105867 1109662 1114729 1121679 1130813 1141902 1154714 1169658 1187472 1208400
52122 1208400 1232086 1258131 1286182 1315569 1345511 1375776 1406508 1437261 1466849 1494468 1520466
52111 1520466 1545569 1569669 1591705 1610529 1625649 1637335 1646230 1652722 1656699 1658118 1657713 1656675 1655588
52098 1655588 1654211 1652372 1650437 1648560 1646045 1641929 1635852 1627936 1618204 1606663 1593753 1580105 1565805
52085 1565805 1550308 1533118 1514447 1495266 1476913 1460503 1446541 1435171 1426792 1422001 1420672 1421508
52073 1421508 1423116 1425461 1429802 1437154 1447203 1458842 1471336 1484661 1498900 1513678 1528326 1542411
52061 1542411 1555910 1568915 1581401 1593392 1605073 1616458 1627051 1636148 1643411 1648854 1652403 1653903
52049 1653903 1653655 1652414 1650552 1647416 1641744 1632624 1620001 1604533 1587084 1568083 1547315 1524538 1500303
52036 1500303 1475842 1452061 1429111 1407044 1386351 1367516 1350501 1335030 1320983 1308095 1295663
52025 1295663 1283178 1271011 1259905 1249852 1240001 1229705 1219147 1208751 1198381 1187458 1175738
52014 1175738 1163754 1152460 1142425 1133375 1124495 1115111 1105015 1094243 1082834 1070779 1057957 1044046
52002 1044046 1028804 1012504 995749 978741 961064 942386 923056 903819 885290 867912 852067
51991 852067 837895 825263 814111 804478 795947 787520 778500 769115 759891 750788 741422 731767 721972
51978 721972 711740 700637 688897 677250 665852 654018 641220 627870 614948 603275 593329 585401
51966 585401 579670 576247 575245 576601 579765 583832 588172 592886 598584 605711 613965 622239 629240 634296
51952 634296 637447 638743 637833 634530 629462 623754 618282 613604 610400 609429 611099 615401 622255 631614 643353
51937 643353 657343 673470 691283 709907 728733 747893 767459 786398 802999 816149 825446 830093
51925 830093 828630 820130 805125 785130 761746 736398 710281 684126 658350 633584 610594 589563
51913 589563 570111 552322 537129 525181 515832 507773 500325 493633 488033 483922 482032 483061 486856
51900 486856 492367 498558 505073 511946 518974 525527 530839 534380 536028 535927 534183 530679 525187 517620
51886 517620 508281 498038 488203 479942 473644 468919 465210 462270 460192 459329 460237 463304 468263 474321
51872 474321 480875 487827 495096 502253 508936 515268 521408 526822 530464 531750 531099 529448 527309 524400
51858 524400 520216 514893 509438 504953 501815 499826 499007 499726 502006 505236 508784 512387 515597 517359 516749
51843 516749 514007 510290 506434 502330 497463 491620 484961 477776 470410 463296 456900 451635 447753 445173
51829 445173 443452 442098 440944 440158 439967 440481 441683 443289 444573 444604 442893 439843 436492 433693 431468
51814 431468 429169 426310 423260 421015 420296 421002 422529 424437 426687 429380 432456 435588 438227 439788 439973
51799 439973 438999 437490 436077 434993 434034 432923 431719 430778 430242 429791 429066 428121 427142 425912 424072 421958
51783 421958 420593 420571 421311 421800 421840 422167 423469 425631 427945 429867 431461 433240 435575 438281 440851 443163
51767 443163 445837 449783 455449 462474 470007 477376 484591 492129 500062 507496 513139 516344 517194 515677
51753 515677 511407 504364 495329 485266 474697 463992 453750 444371 435664 427487 420466 415404 412153
51740 412153 409816 408069 407580 408945 411899 415940 421207 428204 436834 446159 455143 463371 470980 477981
51726 477981 483797 487569 489056 489155 489350 490575 492633 494596 495539 494919 492599 488723 483611 477726 471783
51711 471783 466673 462947 460292 457724 454419 450275 445741 441441 438052 436183 435980 436898 438190 439672 441792
51696 441792 444848 448325 451224 452914 453488 453346 452815 452243 452126 452738 453775 454686 455270 455545 455137 453342 450013
51679 450013 445976 442277 439361 437247 436064 435873 436272 436798 437782 440274 444992 451721 459766 468529 477504
51664 477504 486174 494331 502294 510414 518389 525269 530098 532388 532077 529320 524508 518376 511921 506072
51650 506072 501428 498309 497024 497902 500945 505462 510193 513787 515160 513596 508877 501492 492564 483314
51636 483314 474524 466500 459427 453561 449077 445826 443377 441335 439534 437900 436200 434101 431549 428966
51622 428966 426914 425450 423931 421548 418083 414084 410260 406793 403307 399451 395334 391452 388330 386303
51608 386303 385353 384996 384500 383394 381773 380053 378709 378333 379546 382392 386027 389517 392884 396965 402341
51593 402341 408938 416651 425636 435712 445930 455070 462170 466411 467104 464388 459657 454723 450594 447311
51579 447311 444792 443348 443444 445306 448931 454341 461776 471591 483826 497964 513369 529951 548004
51566 548004 567405 587566 608336 630369 654204 679541 705870 733281 762110 792215 823291
51555 823291 855532 889231 923804 957748 989363 1016899 1038304 1051641 1055932 1051173 1037709 1016225
51543 1016225 988186 955501 919663 881774 843282 805869 770509 737428 707176 680911 659290
51532 659290 641766 627397 615686 606137 597540 588432 578155 567088 555960 545228 534982 525191
51520 525191 516040 507872 500620 493450 485472 476789 468333 460722 453899 447825 442628 437851 432523 426516
51506 426516 421057 417203 414495 411835 409097 406908 405306 403731 402222 401634 402429 404065 405870 407915 410635
51491 410635 413972 417260 419823 421506 422716 423984 425424 426692 427546 428192 428810 429023 428273 426606 424614
51476 424614 422604 420271 417212 413404 409073 404506 400157 396559 393839 391484 388804 385546 381928 378227
51462 378227 374556 371055 368109 366145 365169 364665 364144 363722 363879 364727 365885 367137 368748 370875 373149 375265
51446 375265 377637 381008 385619 391248 397884 405787 415002 425399 437152 450480 464649 477769 487982
51433 487982 494680 498470 500331 501061 501222 501149 500924 500357 498963 496063 491200 484546 476764 468539 460472 453264
51417 453264 447432 442703 438147 433253 428502 424638 421725 419315 417270 415943 415652 416442 418315 421222 424662
51402 424662 427643 429352 429851 430019 430904 433080 436443 440458 444643 448911 453487 458564 464219 470694 478546
51387 478546 488322 500177 514060 530329 549914 573736 602071 634661 671261 711814 756141 803847
51375 803847 854604 908211 964163 1021296 1077895 1131721 1179683 1217939 1243121 1253764 1250477 1234807
51363 1234807 1208279 1172385 1128868 1079579 1026191 970206 913142 856575 802031 750811 703718
51352 703718 660882 622122 587539 557570 532333 511196 493231 477951 465312 455107 446593 438882
51340 438882 431572 424936 419488 415370 412204 409579 407567 406582 406731 407527 408228 408302 407607 406457 405565 405464
51324 405464 405690 404919 402360 398774 395617 393317 390990 387946 384849 383005 382860 383655 384405 384802 385187 385962
51308 385962 387225 388764 390279 391579 392572 393088 392890 391985 390817 389927 389488 389315 389180 388812 387681 385375
51292 385375 382409 380191 379692 380314 380513 379463 377703 376277 375833 376689 379150 383246 388364 393602 398479
51277 398479 403086 407666 412309 416988 421543 425557 428506 430198 431025 431747 433013 434996 437322 439403 440960
51262 440960 442256 443729 445470 447129 448212 448307 447128 444641 441188 437322 433425 429585 425760 421918 418009
51247 418009 413987 409903 405860 401895 397977 394070 390128 386099 382116 378593 375969 374424 374022 374885 376849
51232 376849 379108 380731 381563 382165 382789 382956 382320 381385 380954 381172 381564 381783 381857 381858 381818 381919 382377 383078 383653
51213 383653 383970 384244 384632 385045 385455 386144 387445 389298 391189 392552 393315 394136 395973 399218 403318 407371
51197 407371 410968 414249 417363 420223 422719 424719 425861 425769 424665 423411 422700 422478 422319 422054 421725 421236
51181 421236 420463 419622 419110 418919 418519 417449 415890 414572 414194 414937 416376 417796 418659 418856 418586 418120 417724
51164 417724 417662 418051 418753 419534 420321 421206 422250 423441 424763 426104 427074 427152 426161 424507 422845 421543 420503
51147 420503 419405 418032 416435 414846 413408 412021 410543 409108 408065 407516 407164 406766 406507 406669 407088 407388
51131 407388 407712 408749 410765 412973 414316 414736 415231 416631 418689 420521 421604 422117 422521 423184 424327 426021
51115 426021 428075 430148 432082 434067 436404 439119 441878 444261 446130 447703 449223 450583 451461 451915 452676
51100 452676 454543 457501 460693 463280 465115 466523 467726 468688 469365 469833 470232 470724 471479 472550 473794 474997
51084 474997 476069 477060 478015 478853 479325 479150 478357 477503 477293 477910 478938 480003 481126 482298 483190 483744 484706
51067 484706 486991 490701 495331 500904 508235 517904 529595 542760 557534 574628 594564 617143 641320
51054 641320 665320 687230 705957 721549 734600 745672 755461 764993 775000 785129 794102 800642
51042 800642 804142 804685 802755 798778 792659 783966 772793 760243 747788 736402 726541 718396 711427
51029 711427 703903 693734 679984 663246 644774 625935 608398 593836 582906 574965 569081 564962
51017 564962 562786 562743 565086 570089 577532 586573 596541 607461 619441 632006 644488 656676 668481
51004 668481 679362 688735 696750 703981 710365 715145 717884 718955 718923 717987 716204 713737 710659 706952 703003
50989 703003 699680 697592 696544 696095 696468 698493 702697 708770 716008 724154 733762 745764 760651 777973
50975 777973 796667 815824 835074 854430 874158 894959 917897 943784 972718 1004497 1039396
50964 1039396 1078189 1121455 1169212 1221280 1277600 1337898 1401262 1466493 1532811 1599898 1667188
50953 1667188 1733473 1797419 1858147 1914993 1966880 2012451 2050968 2082793 2108795 2129477 2144944
50942 2144944 2155581 2162476 2167112 2170703 2173792 2176234 2177410 2176526 2172902 2166165 2156274 2143418 2127920
50929 2127920 2110191 2090558 2068829 2044073 2015143 1981679 1944340 1903845 1860056 1812396 1760954
50918 1760954 1706640 1650325 1592467 1533673 1475046 1417757 1362811 1311404 1264775 1223123 1185168
50907 1185168 1149539 1116324 1086610 1060713 1037622 1016201 996206 977894 961163 945488 930509
50896 930509 916428 903868 893238 884171 875785 867776 860933 856236 853697 852544 852206 852412 852625 852376
50882 852376 852183 853153 855424 857972 860331 863445 868172 873930 879803 886280 894641 904963 915950 926788
50868 926788 938102 950919 965543 981855 999944 1020036 1042309 1067132 1094985 1125793 1158858
50857 1158858 1193897 1231796 1273864 1320650 1371987 1427993 1489571 1558041 1634721 1720678 1816279
50846 1816279 1920841 2033164 2152701 2279847 2414878 2556808 2703583 2853193 3004242
50837 3004242 3155381 3304445 3448221 3582928 3704929 3811284 3900111 3970683 4023190 4058332
50827 4058332 4077045 4080562 4070641 4049741 4021022 3988128 3954661 3923477 3896207 3873404 3855111 3841224
50815 3841224 3831280 3823930 3816616 3805747 3787347 3757958 3715367 3658722 3587947 3503081 3404279 3292407
50803 3292407 3169369 3037658 2899707 2757916 2615180 2474935 2340365 2213581 2095637
50794 2095637 1987092 1888309 1799369 1720052 1650040 1588974 1536334 1491509 1454029 1423511 1399245
50783 1399245 1380039 1364598 1351904 1341143 1331600 1322897 1315164 1308560 1302633 1296470 1289528 1281996 1274227
50770 1274227 1266135 1257393 1247985 1238200 1228113 1217378 1205627 1192877 1179459 1165714 1151872 1138113
50758 1138113 1124558 1111263 1098388 1086336 1075591 1066411 1058862 1053169 1049792 1049015 1050632 1054328 1060315
50745 1060315 1069360 1082152 1098818 1119112 1142888 1170282 1201570 1236987 1276608 1320283 1367737
50734 1367737 1418851 1473733 1532428 1594673 1660103 1728579 1799991 1873719 1948601 2023631 2098420
50723 2098420 2172730 2245797 2316526 2384246 2448741 2509331 2564359 2611894 2650640 2679717 2697884
50712 2697884 2703752 2697027 2679062 2652030 2618037 2579365 2538979 2499985 2464541 2433746 2408501 2389788
50700 2389788 2377815 2371342 2368305 2366951 2366079 2364372 2359891 2350289 2333260 2306796 2269421 2220685 2161629
50687 2161629 2094568 2022179 1946637 1869594 1792780 1718303 1648186 1583764 1525698 1474401 1430193
50676 1430193 1393146 1363044 1339585 1322488 1311487 1306387 1307042 1313025 1323361 1336867 1352740 1370527
50664 1370527 1389590 1409067 1428486 1447916 1467275 1485903 1503260 1519776 1536493 1553968 1572002
50653 1572002 1590430 1609784 1630942 1654454 1680416 1708808 1739691 1773104 1809036 1847624 1889289
50642 1889289 1934462 1983143 2034865 2089191 2146032 2205243 2266024 2327113 2387692 2447842 2507972
50631 2507972 2567965 2626928 2683596 2736924 2786624 2833241 2877394 2918712 2955675 2986391 3008905
50620 3008905 3020569 3018085 2999451 2966072 2922564 2874493 2826604 2782598 2745180 2715562 2693374
50609 2693374 2677623 2667521 2662176 2659911 2658401 2655348 2648723 2636660 2617588 2590434 2554365 2508509
50597 2508509 2452423 2386969 2314357 2237118 2157217 2076100 1995195 1915918 1839236 1765487 1694784
50586 1694784 1627513 1564375 1505968 1452385 1403254 1358182 1317111 1280324 1248201 1220997 1198657
50575 1198657 1180677 1166189 1154405 1145171 1139036 1136708 1138358 1143372 1150740 1159748 1170385 1183093 1198069
50562 1198069 1214835 1232602 1251049 1270649 1292139 1315807 1341356 1368303 1396266 1424865 1453599
50551 1453599 1481914 1509342 1535588 1560680 1585078 1609379 1633797 1658139 1682488 1707682 1734842
50540 1734842 1764590 1797121 1832947 1873074 1918368 1969150 2025643 2088433 2158186 2235244 2319843
50529 2319843 2412481 2513583 2622826 2739228 2862022 2991085 3126377 3267117 3411599 3557549
50519 3557549 3702504 3844059 3980037 4108440 4227104 4333420 4424478 4497612 4550822 4582867
50509 4582867 4593131 4581539 4548593 4495454 4423990 4336796 4237178 4129014 4016487 3903827 3795213
50498 3795213 3694687 3605906 3531818 3474508 3435161 3413928 3409830 3421014 3445153 3479289 3519203
50487 3519203 3559306 3593656 3617136 3625592 3615247 3582807 3526563 3447239 3347532 3231032 3101714
50476 3101714 2964036 2822706 2681799 2544096 2411418 2285438 2167862 2059787 1961200 1871291
50466 1871291 1789169 1714199 1645928 1583996 1528123 1477984 1433219 1393747 1359939 1332072 1309626
50455 1309626 1291531 1277198 1266950 1261288 1260104 1262829 1268975 1278186 1290042 1304200 1320659 1339559
50443 1339559 1360812 1384072 1408916 1434772 1460885 1486606 1511474 1534707 1554835 1570432 1581225
50432 1581225 1588110 1592055 1593414 1592350 1589514 1586009 1582897 1580873 1580238 1581041 1583271 1586969 1592236 1599362
50418 1599362 1609121 1622695 1640981 1664077 1691777 1724460 1763049 1808165 1859715 1917336 1980642
50407 1980642 2048784 2120234 2193362 2267054 2340502 2412628 2481959 2547011 2606518 2659385 2704619
50396 2704619 2741372 2768927 2786488 2792851 2786337 2765450 2729999 2681556 2622586 2555227 2481168 2402500
50384 2402500 2322134 2243247 2168640 2100649 2041181 1991583 1952639 1924719 1907670 1900534 1901824 1910135
50372 1910135 1924103 1941700 1960088 1976436 1988455 1994008 1990855 1977365 1953250 1919297 1876640 1826630
50360 1826630 1771085 1712174 1652043 1592656 1535666 1482147 1432653 1387723 1347941 1313239 1282610
50349 1282610 1254960 1229881 1207114 1185608 1163746 1140401 1115401 1089197 1062672 1037063 1013497
50338 1013497 992564 974652 960362 950064 943314 939358 938013 939343 942713 947063 952096 958292 965690
50325 965690 973638 981951 991223 1001488 1011563 1020472 1028725 1037369 1046387 1054907 1062495 1069240 1074894 1078966
50311 1078966 1081568 1083178 1083596 1082163 1079276 1076728 1076027 1077097 1079074 1081800 1085914 1091955 1100043 1110231
50297 1110231 1122658 1137501 1155223 1176643 1202277 1231733 1264240 1299650 1338347 1380125 1423647
50286 1423647 1466792 1506608 1538593 1557077 1557749 1540365 1508898 1469146 1426255 1383873 1344375 1309083
50274 1309083 1278304 1251639 1228522 1208618 1191814 1177910 1166416 1156789 1148934 1143240 1139890 1138357
50262 1138357 1137922 1138561 1140863 1145030 1150458 1156559 1163544 1172040 1182208 1193652 1206019 1219218 1233080
50249 1233080 1247181 1261101 1274635 1287693 1300185 1311998 1322910 1332493 1340262 1345888 1349079 1349360
50237 1349360 1346327 1340201 1331882 1322343 1312179 1301848 1292028 1283360 1275872 1268844 1261221 1252007 1240292
50224 1240292 1225133 1205673 1181500 1152993 1121363 1088251 1055155 1023082 992647 964358 938729
50213 938729 916074 896242 878674 862935 849208 838088 829686 823086 816967 810762 804945 800177 796443
50200 796443 793218 790157 787289 784632 782011 779344 776838 774697 772682 770141 766554 762026 757240 752896
50186 752896 749182 745728 741949 737400 731896 725541 718736 711988 705613 699699 694396 690058 686851 684411
50172 684411 682174 680015 678291 677253 676822 677022 678150 680168 682282 683682 684644 686373 689640 694016 698634
50157 698634 703259 708268 713903 720087 726953 735085 745059 756979 770591 785635 801926 819281 837644
50144 837644 857254 878407 900916 923981 946907 969988 994397 1020946 1049067 1077330 1104883
50133 1104883 1132036 1159476 1187381 1215552 1243894 1272209 1299635 1324768 1346316 1363345 1374985
50122 1374985 1380392 1379127 1371271 1357164 1337384 1313023 1285580 1256373 1226316 1196315 1167422 1140392
50110 1140392 1115417 1092590 1072299 1054783 1039472 1025138 1010736 995952 981109 966729 953093
50099 953093 940079 927524 915824 905824 897836 891055 884342 877519 871547 867498 865710 865834 867267
50086 867267 869384 871723 874295 877599 882109 887726 893822 899854 905859 912258 919176 926139 932530 938150
50072 938150 943075 947130 949941 951523 952280 952250 950855 947752 943517 939027 934487 929574 924318 919220 914589
50057 914589 910308 906241 902368 898463 894201 889776 886009 883616 882609 882599 883371 885043 887920 892369 898584
50042 898584 906292 914859 923821 933195 943220 953982 965387 977290 989546 1002067 1014884 1027979
50030 1027979 1041066 1053819 1066357 1079186 1092548 1106105 1119435 1132576 1145820 1159157 1172218
50019 1172218 1184807 1197269 1210204 1223723 1237015 1248787 1258286 1265771 1271871 1276704 1279943 1281457
50007 1281457 1281314 1279158 1274205 1266059 1254999 1241144 1223783 1202034 1176095 1147576 1118732 1091484
49995 1091484 1066936 1045410 1026912 1011536 999338 989831 982014 974983 968207 961162 953241 944275 934660
49982 934660 924522 913178 899919 884983 869201 852995 836341 819532 803173 787464 772204
49971 772204 757652 744687 733767 724282 715389 707095 700023 694370 689610 685206 681132 677546 674299
49958 674299 671103 668158 666269 666115 667497 669583 671957 675116 679833 686359 694580 704566 716373 729412
49944 729412 742588 755216 767288 778704 788793 796924 803156 807856 811002 812321 811874 809962 806483
49931 806483 800860 792737 782332 770022 755914 740066 722927 705420 688756 674259 662965 654983
49919 654983 649334 644761 640807 637856 636203 635444 635001 634960 636009 638516 641948 645309 648056 650563 653792
49904 653792 658579 665121 673047 681964 691840 702798 714680 727120 740041 753673 767864 781638
49892 781638 793811 803859 811884 817912 821733 823364 823090 820863 816163 808790 799413 788879 777336
49879 777336 764556 750895 737278 724121 710866 696901 682596 669130 657535 648161 640872 635388
49867 635388 631410 628608 626627 625219 624510 625099 627496 631380 635769 640233 645590 652988 662550 673351
49853 673351 684527 695894 707618 719976 733501 748556 764317 778731 790008 797944 803479 807387
49841 807387 809842 810839 810286 807740 802741 795626 787503 779212 770594 760950 749972 738107 726332 715745
49827 715745 707047 700084 694019 688216 682950 679147 677478 677861 679770 682845 687100 692695 699686 708064
49813 708064 717863 729032 741191 753642 765713 776983 787195 796152 803769 810013 814645 817338 818225
49800 818225 818016 817214 815465 812061 806930 800662 793675 785835 776874 766660 755046 742035 728306 715068
49786 715068 703090 692198 681952 672421 664024 656981 651315 647142 644499 642994 641942 640846 639600
49773 639600 638361 637476 637442 638752 641728 646474 652804 660188 668041 676197 684846 693903 702779 710958 718460
49758 718460 725459 731754 736961 740958 743791 745341 745484 744384 742256 738907 733874 726957 718367 708553
49744 708553 698265 688628 680548 673950 668010 662232 657002 653004 650447 649023 648337 648136 648308 648906 650202
49729 650202 652623 656545 661943 668174 674246 679538 684238 689008 694422 700873 708701 718023 728558 740026
49715 740026 752635 766763 782135 797631 811889 823746 832164 836382 836436 833282 828157 821973 815389
49702 815389 809027 803284 798157 793543 789627 786751 784927 783616 781941 779034 774300 767583 759196 749801
49688 749801 740227 731306 723803 718480 716068 716863 720213 724785 729736 735505 743112 752899 764402 777318
49674 777318 791953 808578 826848 846099 865692 884758 901893 915502 924413 928275 927784 924718
49662 924718 921275 918966 918210 918984 921354 925164 929733 934299 938252 940375 938282 929567 913794 893009
49648 893009 870238 847755 826592 807033 789217 773477 760256 749704 741493 735203 730735 728047
49636 728047 726687 726039 725931 726512 727503 728074 727617 726180 723997 721025 717171 712585 707374 701385 694616 687612
49620 687612 681102 675389 670418 666230 662937 660314 657805 655082 652407 650392 649508 649784 650832 652198 653763
49605 653763 655698 657924 659869 661032 661636 662344 663388 664365 664883 665013 665043 665218 665826 667134 668922 670439
49589 670439 671147 671258 671262 671147 670552 669548 668785 668758 669322 670087 671003 672295 673987 675737 677228 678625 680530
49572 680530 683442 687307 691764 696810 702944 710520 719248 728596 738438 748831 759328 769058 777611 785305
49558 785305 792331 797999 801182 801244 798317 792978 786054 778635 771799 766125 761551 757630 753885 750153 746823
49543 746823 744641 744045 744720 745973 747409 748988 750642 752254 754124 757011 761460 767257 773747 780592 788026
49528 788026 796438 805977 816704 828958 843250 859634 877395 895647 914144 933098 952085 969538
49516 969538 983708 994019 1001230 1006460 1010395 1013392 1015898 1018521 1021830 1026195 1031711 1038144 1044929 1051161
49502 1051161 1055610 1056946 1054197 1047065 1035801 1020965 1003426 984362 964915 945818 927552 910735
49490 910735 895986 883411 872553 863068 855244 849652 846316 844396 842768 840987 839658 839770 841605 844431
49476 844431 847243 849564 851400 852817 853967 855279 857153 859430 861544 863178 864433 865429 866178 866969 868428
49461 868428 871001 874609 878913 883548 888014 891723 894466 896596 898493 900048 900903 900917 900145 898491 895784
49446 895784 892201 888346 884782 881577 878413 875150 872226 870390 869944 870397 871018 871651 872758 874799 877884
49431 877884 882042 887445 894287 902752 913177 925963 941161 958447 977626 998849 1022170 1047134
49419 1047134 1073013 1099246 1125473 1151264 1175720 1196900 1211618 1216626 1210804 1196324 1177495 1158633
49407 1158633 1142863 1132050 1126801 1126514 1130050 1136637 1145959 1157555 1170620 1184396 1198355 1211923
49395 1211923 1224449 1235678 1246010 1256014 1265719 1274468 1281401 1286071 1288644 1289511 1288660 1285533 1279575
49382 1279575 1270815 1259819 1247252 1233689 1219725 1205998 1193050 1181206 1170542 1160945 1152441 1145564
49370 1145564 1141075 1139066 1138687 1139170 1140798 1144237 1149019 1153367 1155732 1156052 1155287 1154176 1152744 1150667 1147669
49355 1147669 1143580 1138278 1131677 1123832 1115215 1106828 1099718 1094203 1089807 1086037 1082965 1080859 1079499 1078175
49341 1078175 1076287 1073710 1070622 1067232 1063612 1059616 1054879 1049036 1042062 1034488 1027326 1021686 1018221 1016841
49327 1016841 1017088 1018850 1022521 1028442 1036464 1046313 1058095 1071985 1087421 1103010 1117350 1129632 1139246
49314 1139246 1145191 1146378 1142539 1134585 1123939 1111647 1098088 1083280 1067340 1050884 1035155 1021527
49302 1021527 1010597 1001818 994324 988042 983627 981327 980403 979981 980139 981746 985353 990653 996957 1003711
49288 1003711 1010376 1016167 1020277 1022350 1022609 1021589 1019843 1017741 1015388 1012662 1009418 1005709 1001850 998296
49274 998296 995488 993716 993110 993738 995590 998323 1001135 1003262 1004700 1006203 1008276 1010345 1011296 1010845 1010028
49259 1010028 1010079 1011115 1012282 1013185 1014792 1018732 1025962 1036471 1050134 1067323 1088268 1112005 1136400
49246 1136400 1159344 1179672 1196824 1209901 1217481 1218380 1212440 1200647 1184810 1167094 1149344 1132436
49234 1132436 1116330 1100990 1087083 1075559 1066806 1060684 1057253 1056775 1058821 1062007 1065126 1068179 1071808
49221 1071808 1076005 1080011 1083408 1086723 1090839 1096229 1102866 1110484 1118709 1127330 1136695 1147538 1160114
49208 1160114 1173647 1186927 1199402 1211538 1224189 1237831 1252341 1267328 1282573 1298128 1314059
49197 1314059 1330212 1346285 1362009 1377096 1391182 1404125 1416259 1427974 1439027 1448650 1456429 1462731
49185 1462731 1468173 1473085 1477736 1482705 1488674 1496056 1505133 1516400 1530440 1547570 1567839 1591283 1618012
49172 1618012 1648126 1681730 1718903 1759523 1803285 1849986 1899314 1949782 1997873 2038805 2068638
49161 2068638 2085929 2091763 2088699 2079747 2067914 2055917 2045692 2037918 2032227 2028140 2025714 2025055 2025476
49148 2025476 2025771 2025410 2024952 2025179 2026426 2029027 2033660 2040616 2049136 2058237 2067957 2079152 2092152 2106334
49134 2106334 2121090 2136558 2153116 2170644 2188661 2206946 2225660 2244848 2264026 2282434 2299814
49123 2299814 2316903 2334886 2354293 2374652 2395328 2416418 2438654 2462866 2489856 2520431 2555064
49112 2555064 2593780 2636919 2685829 2742355 2807807 2883036 2969408 3068971 3183325 3312462 3454217
49101 3454217 3603885 3754224 3897192 4027348 4144240 4250866 4348402 4431001 4485577 4498392
49091 4498392 4464313 4390934 4293402 4184466 4068624 3944274 3809772 3667217 3522152 3381326
49081 3381326 3250728 3134490 3034538 2950773 2881549 2824429 2777211 2738601 2707784 2683424 2663492
49070 2663492 2646126 2630272 2615392 2601081 2587264 2574338 2562724 2552343 2542771 2533688 2525050 2517015
49058 2517015 2509867 2503870 2499115 2495619 2493487 2492672 2492651 2492812 2493245 2494687 2497585 2501657 2506530 2512273 2519048
49043 2519048 2526735 2535235 2544683 2554877 2564798 2573115 2579001 2582231 2582869 2581384 2578920 2576907 2576288 2577202
49029 2577202 2579255 2581942 2584941 2588210 2591688 2594825 2596704 2596818 2595485 2593406 2591143 2589204 2588157 2588276
49015 2588276 2589307 2590979 2593515 2597341 2602497 2608600 2615189 2621854 2628276 2634419 2640479 2646486 2652248 2657874
49001 2657874 2663902 2670551 2677243 2683225 2688235 2692104 2694227 2694120 2692232 2689470 2686017 2681204 2674484 2665993
48987 2665993 2656232 2645774 2635268 2625232 2615818 2607108 2599458 2593053 2587409 2582012 2577288 2574114 2572343
48974 2572343 2570697 2568380 2566028 2564726 2564697 2565326 2565851 2565556 2563945 2561338 2559003 2558099 2558691 2560208 2562535 2566082
48958 2566082 2571028 2577206 2584721 2594039 2605180 2617314 2629599 2642267 2656587 2673751 2693989 2716750
48946 2716750 2741464 2767902 2795937 2825408 2856438 2889510 2924769 2961364 2998014 3034376 3071342
48935 3071342 3109782 3149490 3189830 3231126 3274714 3321566 3371455 3423715 3478329 3535734 3595711
48924 3595711 3657072 3718752 3780883 3844379 3909532 3975476 4041172 4106522 4172080 4237853 4302830
48913 4302830 4365772 4426118 4483972 4539515 4592736 4643554 4691902 4737578 4780217 4819487 4855376
48902 4855376 4888252 4918649 4946929 4973158 4997362 5019776 5040599 5059519 5075779 5088827 5098719
48891 5098719 5105595 5108985 5107978 5102204 5092409 5079983 5065957 5050469 5032901 5012408 4988451 4961096
48879 4961096 4930866 4898316 4863731 4827181 4788643 4748005 4705152 4660237 4613659 4565464 4514923
48868 4514923 4461170 4404321 4345613 4286311 4226853 4167218 4107702 4048940 3991511 3936006 3883265
48857 3883265 3834039 3788420 3745998 3706550 3670221 3637174 3607535 3581561 3559250 3539772 3521966
48846 3521966 3505624 3491747 3481252 3474007 3469469 3467655 3468907 3473137 3479983 3489445 3501712 3516460 3532926
48833 3532926 3550753 3570262 3591814 3615292 3640242 3666125 3692322 3718251 3743634 3768405 3792313
48822 3792313 3815022 3836783 3858611 3881383 3904869 3928018 3950182 3971717 3993254 4014695 4035336
48811 4035336 4054932 4074175 4093853 4113871 4133556 4152808 4172421 4193167 4215026 4237475 4260152
48800 4260152 4282972 4305968 4329370 4353596 4378766 4404395 4429876 4455064 4480001 4504216 4526713
48789 4526713 4546719 4564192 4579588 4593358 4605636 4616227 4624836 4631271 4635239 4635893 4631973 4622651 4607946
48776 4607946 4587944 4561967 4529084 4489397 4444289 4395338 4343365 4288596 4231304 4172077 4111666
48765 4111666 4050798 3990013 3929577 3869624 3810382 3752217 3695560 3640840 3588425 3538458 3490823
$$ [...]
##END NTUPLES=NMR SPECTRUM
##END=
