##TITLE=AC1508_CUNDCR13315_8126600_pgbkpb7KZe
##JCAMPDX= 6.0         $$ Bruker NMR JCAMP-DX V2.0
##DATA TYPE= NMR SPECTRUM
##DATA CLASS= NTUPLES
##ORIGIN= BRUKER
##OWNER= Administrator
$$ 1.72 TOPSPIN		Version 2.1
$$ 2013-08-15 23:40:36.849 -0700  Administrator@X
$$ Compression mode = diff/dup
##.OBSERVE FREQUENCY= 400.02188249412
##.OBSERVE NUCLEUS= ^1H
##.ACQUISITION MODE= SIMULTANEOUS (DQD)
##.ACQUISITION SCHEME= undefined
##.AVERAGES= 8
##.DIGITISER RES= 22
##SPECTROMETER/DATA SYSTEM= spect
##.PULSE SEQUENCE= zg30
##.SOLVENT NAME= COFFEE_meoh
##.SHIFT REFERENCE= INTERNAL, COFFEE_meoh, 1, 14.98509
##AUDIT TRAIL= $$ (NUMBER, WHEN, WHO, WHERE, PROCESS, VERSION, WHAT)
$$ ##TITLE= Audit trail, TOPSPIN		Version 2.1
$$ ##JCAMPDX= 5.01
$$ ##ORIGIN= Bruker BioSpin GmbH
$$ ##OWNER= Administrator
$$ $$ E:\/data/COFFEE/nmr/AC1508_CUNDCR13315_8126600_pgbkpb7KZe/10/pdata/1/auditp.txt
$$ ##AUDIT TRAIL=  $$ (NUMBER, WHEN, WHO, WHERE, PROCESS, VERSION, WHAT)
(   1,<2013-08-15 23:40:29.896 -0700>,<Administrator>,<X>,<go>,<TOPSPIN 2.1>,
      <created by zg
	started at 2013-08-15 23:39:23.693 -0700,
	POWCHK enabled, PULCHK disabled,
       configuration hash MD5:
       C8 4E 4E 5D D3 5C D8 9E 9F 52 82 E0 59 8A DE 15
       data hash MD5: 64K
       AB F3 F8 65 91 87 91 67 D5 53 0F 86 5D F3 B1 AA>)
(   2,<2013-08-15 23:40:32.881 -0700>,<Administrator>,<X>,<proc1d>,<TOPSPIN 2.1>,
      <Start of raw data processing
       efp LB = 0 FT_mod = 6 PKNL = 1 PHC0 = 0 PHC1 = 0 SI = 32K 
       data hash MD5: 32K
       96 B1 B9 80 35 07 DF 00 39 D9 DA AE A4 37 D9 2D>)
(   3,<2013-08-15 23:40:33.178 -0700>,<Administrator>,<X>,<proc1d>,<TOPSPIN 2.1>,
      <pk PHC0 = 99.62402 PHC1 = 0 
       data hash MD5: 32K
       9E 39 27 C4 37 B1 71 44 A2 44 2F 65 C8 BD 1F 82>)
(   4,<2013-08-15 23:40:33.412 -0700>,<Administrator>,<X>,<proc1d>,<TOPSPIN 2.1>,
      <abs ABSG = 1 
       data hash MD5: 32K
       09 21 43 74 89 A9 7F 85 C9 69 DA 22 AF 74 31 A8>)
(   5,<2013-08-15 23:40:33.459 -0700>,<Administrator>,<X>,<proc1d>,<TOPSPIN 2.1>,
      <abs ABSG = 2 
       data hash MD5: 32K
       74 A0 2D CC A6 AD 78 2E 5A 69 37 8F 2C 50 35 BF>)
(   6,<2013-08-15 23:40:33.506 -0700>,<Administrator>,<X>,<proc1d>,<TOPSPIN 2.1>,
      <abs ABSG = 3 
       data hash MD5: 32K
       1C 87 3F A9 76 41 F1 FB AC 0C 6A 93 60 F7 C4 82>)
(   7,<2013-08-15 23:40:33.615 -0700>,<Administrator>,<X>,<proc1d>,<TOPSPIN 2.1>,
      <abs ABSG = 4 
       data hash MD5: 32K
       21 46 41 82 D1 36 58 13 EC 8D 29 8E 73 AC C6 7D>)
(   8,<2013-08-15 23:40:33.678 -0700>,<Administrator>,<X>,<proc1d>,<TOPSPIN 2.1>,
      <abs ABSG = 5 
       data hash MD5: 32K
       1F 3D 2D 0D 75 FE 21 1C 00 EE C7 8B F8 00 59 E3>)
$$ ##END=
$$ 
$$ $$ hash MD5
$$ $$ 9F 9D 57 6B 52 72 4B B0 B2 5C BD 7D 6C EC DA 3E
##$RELAX= 
##$RELAX= 
##$RELAX= 
##$RELAX= 
##$RELAX= 
##$RELAX= 
##$RELAX= 
$$ Bruker specific parameters
$$ --------------------------
##$DU= <E:\>
##$EXPNO= 10
##$NAME= <AC1508_CUNDCR13315_8126600_pgbkpb7KZe>
$$ [...]
##$TP= (0..7)
150 150 150 150 150 150 150 150
##$TP07= 0
##$TPNAME0= <>
##$TPNAME1= <>
##$TPNAME2= <>
##$TPNAME3= <>
##$TPNAME4= <>
##$TPNAME5= <>
##$TPNAME6= <>
##$TPNAME7= <>
##$TPOAL= (0..7)
0.5 0.5 0.5 0.5 0.5 0.5 0.5 0.5
##$TPOFFS= (0..7)
0 0 0 0 0 0 0 0
##$TUNHIN= 0
##$TUNHOUT= 0
##$TUNXOUT= 0
##$USERA1= <user>
##$USERA2= <user>
##$USERA3= <user>
##$USERA4= <user>
##$USERA5= <user>
##$V9= 5
##$VALIST= <valist>
##$VCLIST= <CCCCCCCCCCCCCCC>
##$VD= 0
##$VDLIST= <DDDDDDDDDDDDDDD>
##$VPLIST= <PPPPPPPPPPPPPPP>
##$VTLIST= <TTTTTTTTTTTTTTT>
##$WBST= 1024
##$WBSW= 4
##$XGAIN= (0..3)
0 0 0 0
##$XL= 0
##$YL= 0
##$YMAX_a= 649765
##$YMIN_a= -554000
##$ZGOPTNS= <>
##$ZL1= 120
##$ZL2= 120
##$ZL3= 120
##$ZL4= 120
##$ABSF1= 14.98509
##$ABSF2= -5.573092
##$ABSG= 5
##$ABSL= 3
##$ALPHA= 0
##$AQORDER= 0
##$ASSFAC= 0
##$ASSFACI= 0
##$ASSFACX= 0
##$ASSWID= 0
##$AUNMP= <proc_prof1d_extract_pilot.lims>
##$AXLEFT= 0
##$AXNAME= <>
##$AXNUC= <1H>
##$AXRIGHT= 0
##$AXTYPE= 0
##$AXUNIT= <>
##$AZFE= 0.1
##$AZFW= 0.1
##$BCFW= 0
##$BC_mod= 0
##$BYTORDP= 0
##$COROFFS= 0
##$CY= 15
##$DATMOD= 1
##$DC= 0
##$DFILT= <>
##$DTYPP= 0
##$F1P= 0
##$F2P= 0
##$FCOR= 0.5
##$FTSIZE= 32768
##$FT_mod= 6
##$GAMMA= 0
##$GB= 0
##$INTBC= 1
##$INTSCL= 1
##$ISEN= 128
##$LB= 0
##$LEV0= 0
##$LPBIN= 0
##$MAXI= 10000
##$MC2= 0
##$MEAN= 0
##$ME_mod= 0
##$MI= 0
##$NCOEF= 0
##$NC_proc= -8
##$NLEV= 6
##$NOISF1= 0
##$NOISF2= 0
##$NSP= 0
##$NTH_PI= 0
##$NZP= 0
##$OFFSET= 14.98509
##$PC= 1
##$PHC0= 99.62402
##$PHC1= 0
##$PH_mod= 1
##$PKNL= yes
##$PPARMOD= 0
##$PPDIAG= 0
##$PPIPTYP= 0
##$PPMPNUM= 2147483647
##$PPRESOL= 1
##$PSCAL= 4
##$PSIGN= 0
##$PYNMP= <proc.py>
##$REVERSE= no
##$SF= 400.02
##$SI= 32768
##$SIGF1= 0
##$SIGF2= 0
##$SINO= 400
##$SIOLD= 32768
##$SPECTYP= <>
##$SREGLST= <1H.CDCl3>
##$SSB= 0
##$STSI= 32768
##$STSR= 0
##$SW_p= 8223.68421052631
##$SYMM= 0
##$S_DEV= 0
##$TDeff= 65536
##$TDoff= 0
##$TI= <>
##$TILT= no
##$TM1= 0
##$TM2= 0
##$TOPLEV= 0
##$USERP1= <user>
##$USERP2= <user>
##$USERP3= <user>
##$USERP4= <user>
##$USERP5= <user>
##$WDW= 1
##$XDIM= 32768
##$YMAX_p= 451325446
##$YMIN_p= -715772
##$CURPLOT= <Network HP LaserJet P1505>
##$CURPRIN= <$Network HP LaserJet P1505>
##$DFORMAT= <normdp>
##$LAYOUT= <+/1D_H.xwp>
##$LFORMAT= <normlp>
##$PFORMAT= <normpl>
##$SURQMSG= 1
$$ End of Bruker specific parameters
$$ ---------------------------------
##NTUPLES= NMR SPECTRUM
##VAR_NAME=  FREQUENCY,     SPECTRUM/REAL,   SPECTRUM/IMAG
##SYMBOL=    X,             R,               I
##VAR_TYPE=  INDEPENDENT,   DEPENDENT,       DEPENDENT
##VAR_FORM=  AFFN,          ASDF,            ASDF
##VAR_DIM=   32768,         32768,           32768
##UNITS=     HZ,            ARBITRARY UNITS, ARBITRARY UNITS
##FACTOR=    0.250966925370066, 1,           1
##FIRST=     8223.43324360094, -77373,       -3523
##LAST=      0,             24431,           107989
##MIN=       0,             -715772,         0
##MAX=       8223.43324360094, 451325446,    0
$$ Real data points
##PAGE= N=1
##DATA TABLE= (X++(R..R)), XYDATA
$$ [...]
19558H6978a25641D29179b25803J12233o4233c0949j90399a4793B60634c45755
19547e08036g7171B6399B2M041L7848g447j7506A14355b15838B465b65059A83642
19534I5766b52574K3294A37334b79692C7198l773M6058h1258G0864c5979A77652
19522b16604A74139a28901A28742a32115B80495j2598a47348K5935k31397D4447
19511A17833a05030l51458a11706A81993b2735G0440O4395A8848e6208K0506k104
19500c7806A38996b58647j40606A09702f0514j23813k6912B4509a37816N0986
19490h6830B3552a69489K0276e3598k92426A18725l6300b6483D6746b15779P0441
19479a45338J9178j06448C1502R705a35253m3904N6718p943d5424a9275r8519
$$ y = [86978, -125641, 429179, -225803, -113570, -177803, -30949, -221348, -14793, 260634, -345755, -508036, -77171, 26399, 22, 4063, 41911, -7447, -24953, 114355, -215838, 2465, -265059, 183642, 95766, -252574, -229280, 137334, -279692, 37198, 33425, 79483, -81258, 70864, -35979, 177652, -216604, 174139, -128901, 128742, -132115, 280495, 267897, -147348, -121413, -352810, 44447, 117833, -105030, -456488, -111706, 181993, -22735, 70440, 134835, 18848, -56208, -35702, -37806, 138996, -258647, -399253, 109702, -60514, -184327, -211239, 24509, -137816, -86830, 23552, -169489, -149213, -53598, -346024, 118725, 82425, -26483, 46746, -215779, -145338, -126160, -232608, 31502, 41207, -135253, -179157, -122439, -130382, -45424, -19275, -117794]
19468a17794B6991K24538a25891c4779m3071E7757a92845c9009D329a94601d2368
19456C8867c5559j16714r3950j2753j27169E8373M1246n61g3503B67360c19144
19444e5511B703c38614f5571A39232b67569B12675p2868c35197A53365j145e6003
19432g3219B94575A33669a04369k22569b2918m9615G1060a23159F0047b14829
19421a3561j57386j26447l08502b19461C55478b29927P4845A94069a06255r8684
19411b04939B4517c46078e9789j02145j04274m1955C9497b6491p2703K4164K9501
19400d5529B17287c5572j35340O1664B916b69658d391j32965N9609M502o9919
19389a43164J1446A28847c1800p1374j62067J19843m1217B1133b53065j61157
$$ y = [-117794, 26991, 251529, -125891, -34779, -77850, 57757, -192845, -39009, 4329, -194601, -42368, 38867, -35559, -152273, -246223, -258976, -386145, 58373, 99619, 99058, -73503, 267360, -319144, -55511, 2703, -338614, -65571, 139232, -267569, 212675, 139807, -335197, 153365, 152220, -56003, -73219, 294575, 133669, -104369, -326938, -22918, -72533, 71060, -123159, 60047, -214829, -13561, -170947, -297394, -605896, -219461, 355478, -229927, -155082, 194069, -106255, -204939, 24517, -346078, -59789, -161934, -266208, -308163, 39497, -26491, -99194, -75030, -45529, 217287, -35572, -170912, -109248, 2916, -269658, -4391, -137356, -77747, -73245, -143164, -131718, 128847, -31800, -103174, -265241, -145398, -186615, 21133, -253065, -414222]
19379d14222a71106A20737c55427e0154P515k0431l47501a92695M2836P67L6670
19368a12422l1529B92755a57734O6751j35118A94341G2421a71842A03356f7526
19357e862k42429R0310k9215O9437j29744B2494a41328d9145K3292l28252D19566
19345g3035j8821j862F098Q0707a64356e4498j45769M7924C7719b51110c6149
19333a57452B85011a63339A0525c1300j16716O5720B10062e1228o662k02844b7281
19321i2991C7662c13209a15082N4849J1237H0033g4666F7276B7166c09508P2150
19310b37358H3376e1761o4512C4513b47104I599b17969n5855g8521j12561B7163
19298A49217n9610b37936h8731k94536a5754A69753d9631D15261a93444C8340
$$ y = [-414222, -171106, 120737, -355427, -50154, -42639, -63070, -410571, -192695, -149859, -149092, -112422, -143951, 292755, -157734, -90983, -226101, 194341, 72421, -171842, 103356, -67526, -5862, -248291, -157981, -187196, -117759, -247503, 22494, -141328, -49145, -25853, -354105, 419566, -73035, -91856, -93718, 6098, 86805, -164356, -54498, -200267, -152343, 37719, -251110, -36149, -157452, 285011, -163339, 10525, -31300, -148016, -82296, 210062, -51228, -57890, -260734, -27281, -92991, 37662, -313209, -115082, -60233, -48996, 80033, -74666, 67276, 27166, -309508, -237358, 83376, -51761, -116273, 34513, -247104, 9599, -217969, -273824, -78521, -191082, 27163, 149217, 89607, -237936, -88731, -383267, -15754, 169753, -49631, 415261, -193444, 38340]
19287A49721e6585m3184j14179O0991j7806A5319h067A57243N6449a64113M6896
19276a17217j05726B81122a32324I9557e9868B1151d0899A9734J13583a50442
19265b27328j8311K7497A52852a4127B05735H0102e8687j27189a2775A32136b22457
19253A83645c36085K2236q38K6409E5347j9235f0864j66892B55137J3027o6049
19242B02115c31117a22544B59443F9460d9988A04518a91957F4034b83190g5538
19231B12708B1117J2354d6221A01917B4765N18605a62923B69047a31648k14460
19221c46108J66314K1075P2163l9148n9133j15552a25205A34536E752b17930I5975
19209B76239c75180c3251m3724A418a53433a7223l66281B83813b44755B5967K69924
$$ y = [149721, -56585, -99769, -213948, -152957, -170763, 15319, -8067, 157243, 213692, -164113, -117217, -222943, 281122, -132324, 99557, -59868, 21151, -40899, 19734, 133317, -150442, -227328, -245639, -218142, 152852, -14127, 205735, 80102, -58687, -185876, -12775, 132136, -222457, 183645, -336085, -313849, -314687, -288278, 55347, 36112, -60864, -227756, 255137, 268164, 202115, -331117, -122544, 259443, 69460, -49988, 104518, -191957, 64034, -283190, -75538, 212708, 21117, 33471, -46221, 101917, 24765, 543370, -162923, 269047, -131648, -346108, -179794, -158719, -86556, -125704, -184837, -300389, -125205, 134536, 5752, -217930, 95975, 276239, -375180, -33251, -76975, 1418, -153433, -17223, -383504, 283813, -244755, 25967, 295891]
19198B95891b05256c3305A573a04595b0933j32592g4303G237J67559f26730A59013
19186a77633B11941E2643b25574J04263A31452n6660B7899A3003d39879M2537
19176c97342f2705o2324j3132C5543a97807m1058g4195m7047j51289a0858J458
19165i400j95987r9030b4355j84673A48814o6053j5937i867k44727a21592e8526
19153A42652g482j90183f8926j62649c2267B28567a65137d0997j53823N3168n9756
19142b01408e3947j91831I7220I696c22982c8301B83082I8420b53074i2278A06248
19130A11229b03759B08779B225O0307c40862J37486E3444d7782A85076d3500C5708
19118a36245k26860a03422a5137j3071l45883f1263j18466r375C3686c37767J59743
$$ y = [295891, -205256, -33305, 1573, -104595, -20933, -153525, -74303, 7237, 174796, -626730, 159013, -177633, 211941, 52643, -225574, -121311, 131452, 74792, 27899, 13003, -439879, -397342, -62705, -125029, -138161, 35543, -197807, -238865, -74195, -121242, -272531, -10858, -9400, -205387, -304417, -24355, -209028, 148814, 82761, 66824, -9867, -254594, -121592, -58526, 142652, -7482, -197665, -68926, -231575, -32267, 228567, -165137, -40997, -194820, -141652, -201408, -53947, -245778, 97220, 9696, -322982, -38301, 283082, 98420, -253074, -92278, 106248, 111229, -203759, 208779, 2225, 62532, -340862, -203376, 53444, -47782, 185076, -43500, 35708, -136245, -363105, -103422, -15137, -28208, -374091, -61263, -179729, -189104, 33686, -337767, -178024]
19107a78024b4526j09343c4791B1267b18331F1963J72312C0292K1216c43391A39923
19095A87791D8847L6547c5143m8685A65452a73801N0810b0438k12118R1047d6125
19083c45878c4692p1109E5924c91650I1699a63528A9897L6340b40306A5599c7231
19071b44200d3899D2501b5758j76863A95177c74110d4218j65987B43235j1018
19061B32217l591j1606i2553M6228A27843a63826F2030i3576q7792A79002J02269
19050B81271j05134L2893A1041c27244c2145H3911d7682j48076A31017b14535
19039a46450l30519e0965j7872j65245P7519F5771b5673D6954e4713k05783A93071
19027b01666L112h8634j42924J02679A63029J50200o9024A0129c6906p7020L8820
$$ y = [-178024, -24526, -133869, -34791, 21267, -218331, 61963, 234275, 30292, 51508, -343391, 139923, 187791, 48847, 85394, -35143, -83828, 165452, -173801, -122991, -20438, -232556, -141509, -46125, -345878, -34692, -105801, 55924, -391650, 91699, -163528, 19897, 56237, -240306, 15599, -37231, -244200, -43899, 42501, -25758, -202621, 195177, -374110, -44218, -210205, 243235, 232217, 228626, 217020, -92553, -46325, 127843, -163826, 62030, -93576, -181368, 179002, 281271, 176137, 209030, 11041, -327244, -32145, 83911, -47682, -195758, 131017, -214535, -146450, -476969, -50965, -68837, -234082, -156563, 65771, -25673, 46954, -54713, -260496, 193071, -201666, -198554, -88634, -231558, -128879, 163029, 313229, 244205, 10129, -36906, -113926, -75106]
19016g5106D6925c8774j8298h665j90043b3407m9920r0020A66029b0718j46370
19005a67088I9635I805K66415A28138B4659i1236A28304h4704k99917A39381a89720
18993b3074o5162N43K237l36945J97439J11849p7203A11900a42745a6531H2632
18981B4343d52606g0060B25774a13891q9680q6279A56112e31973a91186o3542
18971b54728g6529K964j02000L1625C6721R1227n8283f5753j03221B61843c21356
18959b10132B9329g7271E8537J60989b80121F5516f5622m22912a95173B18780
18948c14018p8236A33316F3366b54009a21569c4783j45555M2142m1226L9737A83197
18936B7717b11447A06639n1478i697j03223H5445f2084I4081l8641c6063l90538
$$ y = [-75106, 46925, -38774, -57072, -8665, -198708, -23407, -73327, -163347, 166029, -20718, -167088, 99635, 9805, 276220, 128138, 24659, -91236, 128304, -84704, -384621, 139381, -189720, -23074, -88236, -87693, -85456, -422401, -224962, -113113, -190316, 111900, -142745, -16531, 82632, 24343, -452606, -70060, 225774, -113891, -203571, -289850, 156112, -531973, -191186, -254728, -76529, -73565, -175565, -143940, 36721, 127948, 69665, -65753, -168974, 261843, -321356, -210132, 29329, -77271, 58537, 219526, -280121, 65516, -65622, -488534, -195173, 218780, -314018, -392254, 133316, 63366, -254009, -121569, -34783, -180338, -138196, -179422, -139685, 183197, 27717, -211447, 106639, 55161, -9697, -112920, 85445, -62084, 94081, 55440, -36063, -426601]
18925d26601A67693b28067C35917n9460a24265c607k21626B11279h2173k02689
18915b84862a07728B07538G9744J87974D6455j7495J14361J05330D8176a04421
18904A60101p536b97978g5904H9893a63057J2263G7519d9983A15270J52135d30235
18892a83593k13521h9482A35053g6756m4729r0116R4308J9117D2327a36972H3894
18880f405A70051b4907e949m6434k13358m3010I3753a39550I3587a13815k47343
18869c61158G3110g7574A91991J03304F3140d09680A7264c66949c8896j10249
18859a49145P4472J704j90018k506C59830b32232P7971A72151a45140P0814C21896
18847a0286A14112P3942P7890l81i3103B4128Q1779q139a22230r5032B04989a93933
$$ y = [-426601, 167693, -228067, 335917, 276457, -124265, -3607, -225233, 211279, -82173, -284862, -107728, 207538, 79744, 267718, 46455, 28960, 143321, 248651, 48176, -104421, 160101, 152565, -297978, -75904, 89893, -163057, -150794, 77519, -49983, 115270, 267405, -430235, -183593, -397114, -89482, 135053, -76756, -121485, -211601, -117293, -98176, 42327, -136972, 83894, -6405, 170051, -24907, -5949, -52383, -265741, -308751, 93753, -139550, 93587, -113815, -361158, 73110, -77574, 191991, 295295, 63140, -409680, 17264, -366949, -38896, -149145, -74673, -72969, -262987, -265493, 359830, -232232, -154261, 172151, -145140, -74326, 321896, -10286, 114112, 188054, 265944, 265563, -93103, 24128, 105907, 97768, -122230, -217262, 204989, -193933]
18834A68342a92369i2005r3990p1968I1178c8021k85013F6137N497J00931a86792
18822A1641a91724d1282A9136b06523A42312P299A2014J51591G590f5801B23538
18810B26563a81659D22731a21420C5861K9358a64792A74677b25929l7349A46090
18799F1114g8273j30792c3470B47173E4744O6689C1484a34954J8210p9513i6364
18787a46338N4930H0850f534j51139e782j85668B45630a83906j41308A16242b2815
18775c11963d1665q1546R549A11211D4269L35735a79658j63995C1123e9599A08295
18763a39685G4938J88700j7905o8822D3279g6569J7423A22848l0619a08393B3184
18751B29642A3193b57407d6539M86C27031a75215M0316n7641I9629i095j76836
$$ y = [168342, -192369, -92005, -185995, -257963, 91178, -38021, -323034, 66137, 71634, 172565, -186792, 11641, -191724, -41282, 19136, -206523, 142312, 149611, 12014, 163605, 7590, -65801, 223538, 226563, -181659, 422731, -121420, 35861, 65219, -164792, 174677, -225929, -263278, 146090, 61114, -78273, -209065, -33470, 247173, 54744, 121433, 31484, -134954, -116744, -196257, -96364, -146338, -91408, 80850, -6534, -157673, -5782, -191450, 245630, -183906, -325214, 116242, -22815, -311963, -41665, -123211, -113662, 111211, 44269, 380004, -179658, -343653, 31123, -59599, 108295, -139685, 74938, 263638, 245733, 176911, 43279, -76569, -59146, 122848, 92229, -108393, 23184, 229642, 13193, -257407, -46539, -46053, 327031, -175215, -134899, -192540, 99629, -9095, -185931]
18740a85931G8616l1396b70571E3736J24469B864b50050A04653D6781a71554B57964
18728a56062A1371a70216A94091j9044C1849M8707B0890K21976A4333c06971O6716
18717b40255R1814B58705d2673A54691c8755B05898B2405a21185D264O8661a72895
18705a51776I7429a62950B02634a91124D1705b74058d8880B22627c50997A57802
18694i4274H9491a50808L1731j6262N895M1297p854M3414C2457Q9456h1779E2690
18681D3828P1736l8349c26666A45257a5917A26568a33674k6832j11775A84832
18670B67697A13447b06920Q4117E6038n447a24783j05183e0171j80967c9394B3845
18658B33814f8513l6705A49206a52562j68043H3408c32890J35320Q6573l5976
$$ y = [-185931, 78616, 47220, -270571, 53736, 178205, 2864, -250050, 104653, 46781, -171554, 257964, -156062, 11371, -170216, 194091, 175047, 31849, 80556, 20890, 242866, 14333, -306971, -240255, -148441, 258705, -42673, 154691, -38755, 205898, 22405, -121185, 4264, 72925, -172895, -151776, 97429, -162950, 202634, -191124, 41705, -274058, -48880, 222627, -350997, 157802, -94274, 89491, -150808, -119077, -135339, -129444, -88147, -96001, -52587, 32457, 121913, -81779, 52690, 43828, 115564, 77215, -326666, 145257, -15917, 126568, -133674, -160506, -272281, 184832, 267697, 113447, -206920, -122803, 56038, 50591, -124783, -229966, -50171, -231138, -39394, 23845, 233814, -68513, -105218, 149206, -152562, -320605, 83408, -332890, -197570, -110997, -146973]
18648a46973m3556j0708B6059h0916C5377c8432j49426m3543d7282A17878g0896
18636A57942a71803A62913a79181A26803g041l36696b8117j37361D2127b13189
18625d62127i0962k0988c2484j50260C86885A77914i5503H3762b0317A76836h2334
18613a05543A31060n6879C1745b2178I9532f3180p9489M8910j523A29797b29053
18601A69281O0402g3096R321A83529c45307h6623m25608K38685B004h7117A76615
18589C56489a8635n3660j3597a0999C6878b68579m7383f1791j21331L0184C6444
18577a09573B5214J52994J3908a45151q3023c7403m10710a39355a9569k10619
18567b30188H0709k4206a68588B33715b36817a6261j0875j00105A6666J14212
$$ y = [-146973, -190529, -201237, 26059, -80916, 35377, -38432, -187858, -231401, -47282, 117878, -70896, 157942, -171803, 162913, -179181, 126803, -7041, -343737, -28117, -165478, 42127, -213189, -462127, -90962, -111950, -32484, -182744, 386885, 177914, -95503, 83762, -20317, 176836, -82334, -105543, 131060, 74181, 31745, -22178, 99532, -63180, -142669, -93759, -95282, 129797, -229053, 169281, 229683, -73096, -63775, 183529, -345307, -86623, -512231, -273546, 2004, -87117, 176615, 356489, -18635, -72295, -85892, -10999, 36878, -268579, -315962, -61791, -183122, -152938, 36444, -109573, 25214, 178208, 192116, -145151, -228174, -37403, -448113, -139355, -19569, -230188, 80709, 56503, -168588, 233715, -236817, -16261, -27136, -127241, 16666, 130878]
18557A30878b3772j4777F1536a4924j08747c5493j59803N8725I8422k761d6436
18545a73056B68094a75031m8813A11878a59683p7372A30831a58391D0546c33571
18534A8742J75781a18558n7277B64703b21742M5692j09003A3058d886k21055N6173
18523a69768C6408g652A1857d31869a20518k21479A34970i9031j00113a6320m4585
18512f0905D5734a50109F6676B7847O1659R9134d33558a11402M1061A70628c46577
18500A10659P2420c5186a0447k70351J09640f0968B38329a17819b7548k06058
18490b33606r3059Q5501A93498l4495J10052p6570a4815e418k55491R9688C9483
18478I2402a82920a9873C91190C4483e4550D2122K6585b29727A14874A7403h0098
$$ y = [130878, -23772, -38549, 61536, -14924, -123671, -35493, -195296, -136571, 98422, 95661, -46436, -173056, 268094, -175031, -223844, 111878, -159683, -237055, 130831, -158391, 40546, -333571, 18742, 194523, -118558, -175835, 264703, -221742, -176050, -285053, 13058, -4886, -225941, -169768, 36408, -7652, 11857, -431869, -120518, -341997, 134970, -99031, -199144, -16320, -60905, 45734, -150109, 66676, 27847, 89506, 188640, -433558, -111402, -70341, 170628, -346577, 110659, 183079, -35186, -10447, -280798, -171158, -60968, 238329, -117819, -27548, -233606, -326665, -241164, 193498, 159003, 269055, 192485, -14815, -5418, -260909, -161221, 39483, 92402, -182920, -19873, 391190, 34483, -54550, 42122, 68707, -229727, 114874, 17403, -80098]
18466B22762l8734C4932b00295I1314b8619q1657r2011E7858M4830b80537A83427
18454a25037e1050a5028l3074q8220H7519b10423D3111a22409I3185A9668c3128
18442d6978o4933e2828j34542B24209a68982o8210o2841J03118N5225j534F9347
18430b83319I2061A9915K33310a57435n8581l2184a16526N4791A33331b49888
18419f3941G9493c40882G552a34879q6386i547k14059C33810B6864L2459a2020
18407f4533A20574b7710j09509A90363p5475i690m5706k29365j32854a54965C1326
18395a56929G7672g2407A07420b76371d2166k54629G4345R4463q4084a12897G6768
18383A45882a93595I474a73574A06745k4022O013N0240a83875N8670f2431E0608
$$ y = [222762, 184028, 34932, -200295, 91314, -28619, -110276, -202287, 57858, 102688, -280537, 183427, -125037, -51050, -15028, -48102, -136322, 87519, -210423, 43111, -122409, 93185, 19668, -33128, -46978, -111911, -52828, -187370, 224209, -168982, -237192, -300033, -196915, -141690, -143224, 69347, -283319, 92061, 19915, 253225, -157435, -216016, -248200, -116526, -61735, 133331, -249888, -63941, 79493, -340882, 7552, -134879, -221265, -9547, -223606, 333810, 26864, 59323, -12020, -64533, 120574, -27710, -137219, 190363, 114888, -9690, -55396, -284761, -417615, -154965, 31326, -156929, 77672, -72407, 107420, -276371, -42166, -296795, 74345, 168808, 84724, -112897, 76768, 145882, -193595, 9474, -173574, 106745, 82723, 88736, 138976, -183875, -125205, -62431, 50608]
18371b28368A13178e8843k29783A63952g2637A37468i2191C5861L9248m224c49578
18359h7617B1729R1074h0746b3100j02353B28539A04210h628A07839d2238A54402
18347a70130B75353d076k22536B12697A1502a48690N2947A53901J02388B7781
18336b24008J0780R4295B77808r7840D1252b11929e6100m7282j95505J05915l8679
18325b31651n5305a34534m4384G6852d1453j28506O1625b2404n824H8896l7254
18314E1642H036J10189E3862a51221F3360b4560j02831h894A33707o4479L4507
18303A03735f8801r5643k64125b9282A52031b14302a8150C12972d99920A27356
18292e8908n298K0189B93012c2306K010A9425a92413F9010a02133b7527j06326
$$ y = [-228368, 113178, -58843, -288626, 163952, -72637, 137468, -92191, 35861, 75109, 70885, -349578, -87617, 21729, 112803, -80746, -23100, -125453, 228539, 104210, -8628, 107839, -42238, 154402, -170130, 275353, -4076, -226612, 212697, 11502, -148690, -95743, 153901, 256289, 27781, -224008, -213228, -118933, 277808, 179968, 41252, -211929, -56100, -103382, -298887, -192972, -231651, -286956, -134534, -178918, 76852, -41453, -169959, -108334, -22404, -28228, 88896, 51642, 8036, 118225, 53862, -151221, 63360, -24560, -127391, -8894, 133707, 69228, 103735, -68801, -164444, -428569, -29282, 152031, -214302, -18150, 312972, -499920, 127356, -58908, -64206, -44017, 293012, -32306, -30296, 19425, -192413, 69010, -102133, -27527, -133853]
18281a33853f5993B9300a82131B7436R854a98047a5617k5022k56072g1845C02981
18269a47044g0214B58763r8549b7271k16042B05639R6209B5005h2631B1080b54404
18257A604J00728c17818A83093b93389k24010K55749H3703d2008m8965k3204C03032
18245b61184B42935C3821J6613g5381C10311F410d27161D42420I0583a01314a5638
18233a45187A7144K01772A3868M1876a61450d5329A89253E4355a02129D098b703
18221A4745b00623F8223c59117A60256K3607i0514m5352A73833H2514e4815D9577
18209a07771a09l88264J11794d0241h02l03007J48296A21681K51556A78953P0790
18198B49743i6147l7222a4203j1028B700K64707a67998L3252N0487l89910a01443
$$ y = [-133853, -65993, 29300, -182131, 27436, 37290, -198047, -15617, -40639, -296711, -71845, 302981, -147044, -70214, 258763, 160214, -27271, -243313, 205639, 301848, 25005, -82631, 21080, -254404, 1604, 102332, -317818, 183093, -293389, -517399, -261650, 83703, -42008, -90973, -114177, 303032, -261184, 242935, 33821, 50434, -75381, 310311, 6410, -427161, 442420, 90583, -101314, -15638, -145187, 17144, 218916, 13868, 55744, -161450, -45329, 189253, 54355, -102129, 4098, -2703, 14745, -200623, 68223, -359117, 160256, 183863, -90514, -135866, 173833, 82514, -54815, 49577, -107771, -109, -388373, -276579, -40241, -802, -303809, -155513, 121681, 373237, 178953, 249743, -96147, -133369, -14203, -25231, 2700, 267407, -167998, -134746, -84259, -474169, -101443]
18186a44829B79835j35671b99388A02414b84903d5263I3704b69800r3022l776
18176c66598f5382E1686a47064L6342A9555f7846O134b5205I7717c67706R8885
18165b68821p2468C50967a19219A66244J58650h8891A06506J0059d5891l8958
18155h4849k96811a59820A58991H523K79336j10082i3199A60666G961K72816a38609
18143c8760D1040b23483B56367c03001E1608c4779j71705I2716f7982L2000o3014
18132i8996F2962a11832j48429h5901k2533K3374L0370j16045a4098o3362B67128
18120E5646K5583d0951B50732a2590C54252H4150K44021h3398J6696I326R836
18109A9162R4746b60708A84189i7723A03109g8812p6348j6634m8119c230A48898
$$ y = [-144829, 279835, 144164, -299388, 102414, -284903, -45263, 93704, -269800, -362822, -366598, -65382, 51686, -147064, -110722, 19555, -67846, -61712, -25205, 97717, -367706, -268821, -341289, 350967, -119219, 166244, 324894, -88891, 106506, 116565, -45891, -84849, -381660, -159820, 158991, 8523, 287859, 177777, -93199, 160666, 7961, 280777, -138609, -38760, 41040, -223483, 256367, -303001, 51608, -34779, -206484, 92716, -67982, -35982, -98996, 62962, -111832, -260261, -85901, -108434, -85060, -54690, -170735, -14098, -77460, 267128, 55646, 81229, -40951, 250732, -12590, 354252, 84150, 328171, -83398, -66702, 9326, 19162, 113908, -260708, 184189, -97723, 103109, -78812, -155160, -171794, -219913, -3230, 148898]
18097g5870j21710l5058A95583C2505d8091k4078A42599b84105A65109B2457L8490
18086F0947b4579l291k9942l6888j52976C0397m975e305A76055b05425l2520a00649
18073a39739J8021m9019D2900d2971p529G086J42447J23091a18849r210c1326
18061b3600j38639G1011i0284j24011I6699O6044l7995o427a16668A55933d7031
18049d77335H0447J72685r3681b22021A63491e8105p2381I3016K7893C8457a45575
18037a63930A88130q7399b23516G3743N5341A4758c00768J21086G0037a45974
18026a91819g7144n9924o2414B18233h8508C12436E966d66941e6826p0499h452
18014E27588C0030a46640a1732j20164A05549b55480d5349j26484G4363B1892
$$ y = [-75870, -197580, -232638, 195583, 32505, -48091, -72169, 142599, -284105, 165109, 22457, 60947, -24579, -27870, -57812, -94700, -247676, 30397, 25422, -5305, 176055, -205425, -237945, -100649, -139739, -121718, -170737, 42900, -42971, -50500, 7086, 149533, 272624, -118849, -128059, -31326, -23600, -162239, 71011, -90284, -214295, 96699, 162743, 124748, 118321, -116668, 155933, -47031, -477335, 80447, 253132, 159451, -222021, 163491, -58105, -130486, 93016, 120909, 38457, -145575, -163930, 188130, 100731, -223516, 73743, 129084, 14758, -300768, -179682, 70037, -145974, -191819, -77144, -137068, -199482, 218233, -88508, 312436, 5966, -466941, -56826, -127325, -8452, 527588, 30030, -146640, -11732, -131896, 105549, -255480, -45349, -171833, 74363, 21892]
18003A56332c66297g3907k58282g8393a5902k61921e9340q66A77974a42455I9
17991a02005A25357g6480a2951H522b25895J10450I8166b09660G5283a9955l0911
17980e0866k21715C09840j52598a64568a5284B0065a32102B25424b6753k35645
17970b62398C10499a2978l3010B34878e7130D08506a27197d8391j82002B05849
17959b3781A43050f954A31030a83672K8025B03672L930D1298b08199G9963e8637
17947a96034C8775J38078O5178G9114a38269B30806d164A59099d61725b15185
17936a69558A13516C4035b85184a3593G5968J49384a02488d4717D16389c06131
17925B615g0598j6795L9400a280j34766E7466j0238c70104J33448A17569b72201
$$ y = [156332, -366297, -73907, -332189, -78393, -15902, -277823, -59340, -60206, 177974, -142455, 99, -102005, 125357, -76480, -12951, 8522, -225895, -115445, 98166, -209660, 75283, -19955, -50866, -272581, 309840, 157242, -164568, -15284, 20065, -132102, 225424, -26753, -262398, 310499, -12978, -45988, 234878, -57130, 408506, -127197, -48391, -230393, 205849, -23781, 143050, -6954, 131030, -183672, -155647, 203672, 207602, 41298, -208199, 79963, -58637, -196034, 38775, 176853, 242031, 79114, -138269, 230806, -4164, 159099, -461725, -215185, -169558, 113516, 34035, -285184, -13593, 75968, 225352, -102488, -44717, 416389, -306131, 2615, -70598, -87393, -47993, -1280, -136046, 57466, 47228, -370104, -236656, 117569, -272201]
17913b03495f0654a3352A80676a34026B9261a37908m4344n0497A20868a70414
17902A1363c65342B70710j14059J067j3163o3053K7679B2699a42018B88912B0124
17890A20395c29C503i944A76328P2601c13515A33869a22182k8701b1572A04076
17878g3756B05938I1131R3583a96695h0967c672A7526i0625A23323n8341K7192
17867I2174a84432Q8428E5687a0808j5188j30856A44406i0930A23043e7896n16
17856e8412B95138J2774A02699a38467B39707b15576i3025j98241a5270A91989
17845a88744A53590b39370f190j69717c1097G2300b30116H2565p125L8021a97331
17833a02058j48265B87608I118R4602c5670B09187k0192o1535d5923A28565b9848
$$ y = [-203495, -60654, -13352, 180676, -134026, 29261, -137908, -182252, -232749, 120868, -170414, 11363, -365342, 270710, 156651, 157718, 144555, 81502, 109181, 22699, -142018, 288912, 20124, 120395, -329, 3503, -9944, 176328, 248929, -313515, 133869, -122182, -150883, -21572, 104076, -73756, 205938, 91131, 184714, -196695, -80967, -3672, 17526, -90625, 123323, 64982, 92174, -184432, -96004, 55687, -10808, -25996, -156852, 144406, -90930, 123043, -57896, -58412, 295138, 307912, 102699, -138467, 239707, -215576, -93025, -291266, -15270, 191989, -188744, 153590, -239370, -6190, -175907, -31097, 72300, -230116, 82565, 75440, 113461, -197331, -102058, -250323, 287608, 9118, 103720, -35670, 209187, 188995, 127460, -45923, 128565, -29848]
17821B32226E925b76293B66810k910d1706E8783K74159n9012d5135A17338J09828
17810B27166F7185k1642b25472E4671a54232E5133L68729j72390F5717L0992l4227
17799F2482n802b66158I5858O0990a14067B99886a81966C85705a06845A11010
17788G5295d2761E8343b04953A3561J00745b43639G3110a7669A11839a16837B85155
17776A7870c7233a4506j6923C46095j49566c27049B10288i0841P515C49679j13452
17765B36227a01369j19673B20528d7565j25401N4913c9626j15762A46271L8780
17755A85051C2111c3097B48950j03573E174a04245B22123F2153J16541k0619b00744
17743a55697l2951f4738I71a63455P0011j56399d402k58244O1139j4733B7615
$$ y = [232226, 5925, -276293, 266810, 263900, -41706, 58783, 332942, 273930, -45135, 117338, 227166, 67185, 45543, -225472, 54671, -154232, 55133, 423862, 251472, 65717, 96709, 62482, 56680, -266158, 95858, 156848, -114067, 299886, -181966, 385705, -106845, 111010, 75295, -42761, 58343, -204953, 13561, 114306, -243639, 73110, -17669, 111839, -116837, 285155, 17870, -37233, -14506, -31429, 346095, 196529, -327049, 210288, -90841, -83326, 349679, 236227, -101369, -221042, 220528, -47565, -172966, -118053, -39626, -155388, 146271, 185051, 32111, -33097, 248950, 145377, 5174, -104245, 222123, 62153, 178694, 158075, -200744, -155697, -188648, -64738, 971, -163455, -93444, -249843, -4402, -262646, -201507, -216240, 27615]
17731B78641a84846n9360E3100a4024j69160j98800B84488A20895d56651d2538
17720b71699A11482M1020a87663A4694J29439K40867j81731g8814j29267A16858
17709A34023D7374e1780A57715M4498J15339a8088J067B27661I9094b05662i4069
17697b58255l9050D66803E1642a6910k01137a03502C01604b19634C3595a29498
17686A13010B2014J1395P2158a5897E7723k6827a22578r4422R7371I0285K13706
17675C03991j35006c7725r9057A83878c4471j95480A54454a12729J0718a5367
17664b87944G0710c9714j88843B30797q9520a47384m4124I5812J6842G857M715
17653A2572J20961d6053G6991b37319B1444b9442j15775B47549C3736h0332c4849
$$ y = [278641, -184846, -244206, 53100, -14024, -183184, -381984, 284488, 120895, -456651, -42538, -271699, 111482, 152502, -187663, 14694, 144133, 385000, 203269, -78814, -208081, 116858, 134023, 47374, -51780, 157715, 202213, 317552, -18088, -17021, 227661, 99094, -205662, -94069, -258255, -297305, 466803, 51642, -16910, -218047, -103502, 301604, -219634, 33595, -129498, 113010, 22014, 33409, 105567, -15897, 57723, 30896, -122578, -217000, -119629, 90285, 303991, 168985, -37725, -136782, 183878, -34471, -229951, 154454, -112729, -102011, -15367, -287944, 70710, -39714, -228557, 230797, 141277, -147384, -191508, 95812, 112654, 7857, 12572, 133533, -46053, 76991, -237319, 21444, -29442, -145217, 247549, 33736, -80332, -34849]
17641b74394A34507b67463J5478C17994b4575J1927D2163J12079e4637n3733N878
17630a02492j06669g83p3146A77738E9747b27178I4543P8339i3529D0294K47012
17619B87306I050K3307a51481B73651n3467o8324p0495J25153J25382A16599L8960
17608A55559c3968A9120b37130B57069I0086M5646e0942I5423e7283C66121A62824
17596d6211B47052H0227K2316K82068f2425f153q1216r5009H8413b06912O2336
17585a44576G0951C5009J56849g7753b5059A68821b9977A89804a65669N4945B56182
17573A81591C3594L24863A62821n4365P1861L5977J00592A56210h3965K8655A3002
17561a32776q7230D1950a20544K5144E6469A5140J83132C4662L5346J41851o9380
$$ y = [-274394, 134507, -267463, -251985, 317994, -24575, -12648, 42163, 154242, -54637, -108370, -102492, -209161, -783, -73929, 177738, 59747, -227178, 94543, 172882, -93529, 40294, 287306, 9050, 32357, -151481, 273651, 220184, 151860, 81365, 206518, 331900, 116599, 155559, -33968, 19120, -237130, 257069, 90086, 135732, -50942, 95423, -57283, 366121, 162824, -46211, 247052, 80227, 102543, 384611, -62425, -6153, -87369, -182378, 88413, -206912, -144576, 70951, 35009, 191858, -77753, -25059, 168821, -29977, 189804, -165669, -110724, 256182, 181591, 33594, 358457, 162821, 108456, 180317, 216294, 316886, 156210, -83965, -55310, 13002, -132776, -220006, 41950, -120544, -95400, 56469, 15140, 198272, 34662, 70008, 211859, 142479]
17550A42479j5759i4434A48937B4433N8826j6393L8376L6854J28652H383J06713
17539A15096c09982B5578a72670F6118i4062K4272I9935K71600b34356B21702
17528G8650R5488n7014j4549d13950a02313b2642I2902J99826j13731J09068p7882
17517B10183b27617A16252J18236A11769e8574A113K77283I6389L1154A4674f975
17505c3764C03150b2724B58922J83186F9951L6566f3097j49857D31719A13668
17494f9427A5066J3071K44751F0686K30889p9208m9917D3216a2708F0833J63830
17483B24663C1422a8970q4411c3369C04179H5488J71106f7695J14C68486A31439
17471B79336K90707a36842A79036c07222A20296O0095J2826J98479A85118p3437
$$ y = [142479, 126720, -94434, 148937, 24433, 83259, 66866, 105242, 142096, 270748, 8383, 115096, -309982, 25578, -172670, 66118, -94062, -69790, 99935, 371535, -234356, 221702, 78650, 174138, 117124, 102575, -413950, -102313, -22642, 92902, 292728, 178997, 288065, 210183, -227617, 116252, 234488, 111769, -58574, 1113, 278396, 96389, 127543, 14674, -6975, -33764, 303150, -22724, 258922, 442108, 69951, 106517, -63097, -212954, 431719, 113668, -69427, 15066, 28137, 272888, 60686, 291575, 212367, 162450, 43216, -12708, 60833, 224663, 31422, -18970, -103381, -33369, 304179, 85488, 256594, -67695, -67581, 368486, 131439, 279336, 570043, -136842, 179036, -307222, 120296, 180391, 193217, 391696, 185118, 111681]
17461A11681J80877j34912a14335B40214o46J19871P273E5598J22856Q0537O6849
17450C25840J4615A09533L75318j16213J47958B30294J86868A08747a400A49254
17439A2038K84379p0117J08788B2503L39372J31460j30653m1169o6031c03544
17428C27744j0650E6668N62956k91195j01519K68m5829K39352j37477K9804A19544
17416E02250B6286O9753K14612J45791A86146L60731B66690a267B88922I9514
17405a9214G24451B50329J09161A08463O6754B8711K73456a83183D3212J81804
17395B25016L13573D2855J01990J33069g3289C4726J44512m8784I298L87547j67201
17384B29644q0315o616A331J81492A7766J10316K26037K87926d0666H4768b5307
$$ y = [111681, 292558, 157646, -114335, 240214, 239568, 359439, 366712, 55598, 178454, 258991, 325840, 340455, 109533, 484851, 368638, 516596, 230294, 417162, 108747, -1400, 149254, 12038, 296417, 226300, 335088, 22503, 361875, 493335, 362682, 321513, 255482, -303544, 327744, 317094, 56668, 619624, 328429, 226910, 227178, 181349, 420701, 283224, 313028, 119544, 502250, 26286, 96039, 310651, 456442, 186146, 546877, 266690, -1267, 288922, 99514, -19214, 724451, 250329, 359490, 108463, 175217, 28711, 302167, -183183, 43212, 225016, 538589, 42855, 144845, 277914, -73289, 34726, 179238, 130454, 9298, 396845, 229644, 149329, 142713, 1331, 182823, 17766, 128082, 354119, 642045, -40666, 84768, -25307]
17372C17408O1423F5851c10202B30616G3796d3976B32029G9299J78560M8980A01065
17360a17196d2723F4782g065A27560J37739j07766E2663e329B48515k874A21448
17348A23198b3321j41596A09191M9786K61237j92782d1340A55999M2542g5450
17337C60403a29734B96570a4366B17961Q6337D1229p23A8297K51138M5531j14675
17326B00291B0975J25705M9843C6641c1579A56722D1695J41062L7329O2016g4144
17314C01952A37907m811b00892f1178A24760J5934K23806q7770l7360H0671e8712
17302D6291N18030j25469A49047F1833b8201A91045d6451A68780B11J27630c3204
17290c991m1395o6547B04816C5545K68085m9801K16291e3054B97371l3470e284
$$ y = [317408, 378831, 65851, -310202, 230616, 73796, -43976, 232029, 79299, 257859, 306839, 101065, -117196, -42723, 64782, -7065, 127560, 265299, 157533, 52663, -5329, 248515, 245641, 121448, 123198, -23321, -164917, 109191, 158977, 420214, 227432, -41340, 155999, 198541, -75450, 360403, -129734, 296570, -14366, 217961, 304298, 41229, 40506, 18297, 269435, 314966, 200291, 20975, 146680, 196523, 36641, -31579, 156722, 41695, 182757, 220086, 282102, -74144, 301952, 137907, 133096, -200892, -61178, 124760, 140694, 364500, 276730, 239370, 80671, -58712, 46291, 564321, 438852, 149047, 61833, -28201, 191045, -46451, 168780, 211, 127841, -33204, -3991, -45386, -111933, 204816, 35545, 303630, 253829, 470120, -53054, 297371, 263901, -5284]
17278a16376A99548e5389H9779Q7696a24624E1663A8825P7148a29850A05554A9012
17266c0240A1480L09100A14144J11506a50604B84107j689m5891J16752I0803J73359
17255B64162F0920b43516G1894K85488A24235C5125a07886A56437N6624a27071
17244C60024j15529e769B23707K11376A29983K64053j86212j9721J57775A21267
17233A42392R9325o8020O047M4014O5721C2277L49784l9748j54418N8415P3510
17222C19820n8316a16136B89625j00824J23224A29114i658F21369j73833A35193
17211C68032a37397B48436J26867A07086Q1615F6377J68383J51465A32779J57310
17201B90089J3898j02908r1505L14091f6189B92040L33778A82466o6337L53601
$$ y = [-116376, 199548, -55389, 89779, 177475, -124624, 51663, 18825, 95973, -129850, 105554, 19012, -30240, 11480, 320580, 114144, 225650, -150604, 284107, 282418, 236527, 353279, 90803, 264162, 60920, -243516, 71894, 357382, 124235, 35125, -107886, 156437, 213061, -127071, 360024, 244495, -5769, 223707, 435083, 129983, 394036, 207824, 188103, 345878, 121267, 142392, 241717, 173697, 179744, 223758, 289479, 32277, 382061, 342313, 187895, 246310, 319820, 261504, -116136, 289625, 188801, 312025, 129114, -9658, 621369, 447536, 135193, 368032, -137397, 248436, 375303, 107086, 188701, 66377, 234760, 386225, 132779, 290089, 303987, 201079, 109574, 423665, -66189, 292040, 625818, 182466, 116129, 469730]
17191D69730a4101D05820B02614J6717K81546j28593J6378J45852k45920b6377
17180E44959I5917N7640J89993O2932q2572O3945d1464F80210B54695N9385H5281
17168A15930D5342L45491F8468K44965L2242P7138j56197o205j21955R2248H7380
17156B12017C643L47855N1378A14959L38877j27907J4457K4366G9523M27059A56195
17144C84640o1727F3676L67209j01775R5392j69452q3742J58000J60729G5934
17133D46498n1124j43840n6680n0072R3320L9949J43625A47940J35908k1342N1526
17122C14032R5529r6616L25728p1453B12975n9313M29350l8771A9193L37697j11811
17111B45079j7213R1278j36563K53672m9719k9764J77241J21600r9903k27096
$$ y = [469730, -14101, 405820, 202614, 219331, 500877, 372284, 388662, 534514, 288594, -26377, 544959, 95917, 153557, 343550, 406482, 323910, 387855, -41464, 680210, 254695, 314080, 85281, 115930, 45342, 390833, 68468, 313433, 345675, 422813, 266616, 260411, 138456, 230704, 87380, 212017, 3643, 351498, 402876, 114959, 453836, 325929, 340386, 364752, 79523, 506582, 156195, 384640, 322913, 63676, 430885, 329110, 424502, 255050, 171308, 329308, 490037, 75934, 446498, 395374, 251534, 194854, 144782, 238102, 278051, 421676, 147940, 283848, 262506, 314032, 409561, 312945, 638673, 567220, 212975, 153662, 583012, 544241, 19193, 356890, 245079, 227866, 319144, 182581, 436253, 386534, 356770, 534011, 655611, 555708, 328612]
17101C28612J3590K59924k43323J61951k25207J26869j24155G4948K02571J9058
17091B96577K69851j7159k9836j45420Q5170n8699L13161B88949p8752K74401
17081D84598j39408J88467k7293j00920J78952j86480K32363j8844k77345K22060
17071E56150J39631A25726M01075k03984j52327K26343L51112r5082j33053R3079
17061F12889q6845p6646K9398A39815M34891J55956j46993K30795n5917C46420
17050G72070l17342Q3953K1011L9182A84960M43517n3783o8722o1184L14116k45180
17039E13724o9538L14063j19881o9685j54468J96526Q8686l00158K17959K14019
17029H31247k69830K44540C67517K73682O9166C41057L71993q6263n3951j71437
$$ y = [328612, 342202, 602126, 358803, 520754, 295547, 422416, 298261, 74948, 277519, 296577, 566428, 549269, 519433, 374013, 459183, 400484, 713645, 288949, 210197, 484598, 345190, 533657, 506364, 405444, 584396, 397916, 630279, 611435, 334090, 556150, 695781, 125726, 526801, 322817, 170490, 396833, 747945, 652863, 519810, 612889, 526044, 449398, 478796, 139815, 574706, 730662, 583669, 814464, 758547, 346420, 772070, 454728, 538681, 559692, 598874, 184960, 628477, 574694, 505972, 444788, 758904, 513724, 444186, 758249, 638368, 568683, 414215, 610741, 699427, 399269, 617228, 831247, 561417, 805957, 367517, 641199, 710365, 341057, 713050, 626787, 572836, 401399]
17019D01399K18501L40182j30063k67263j43386P3336K32172k24869M35289p0054
17009H65244r252j31723J99629j58301n7072N5077k94Q8521m25397N26992C28578
16997F88266R5824R0236j68620L19428l70100J38298j93475J00587O704J21371
16987H28519C14799Q32471m37608L13594q5244J7120k69667j68210K96588K60322
16977A074165l91089r5601J64680K37664k49713J67567O8758j64725K6668Q8066
16967I26440J32074m35468L81932l3186K59512o3916k19765J22292k48054J74756
16957I96617O4608L16019m33946O1057o1608J06298J27333m8982M7885L88201
16947A563482n65552J45096R1223o6018k3602j70586K23410j28291p2567l2800
$$ y = [401399, 619900, 960082, 830019, 562756, 419370, 492706, 724878, 500009, 935298, 865244, 855992, 724269, 923898, 765597, 708525, 763602, 763308, 851829, 426432, 953424, 328578, 688266, 784090, 874326, 705706, 1025134, 655034, 793332, 599857, 700444, 707148, 828519, 314799, 1147270, 709662, 1023256, 938012, 955132, 685465, 517255, 813843, 1074165, 683076, 587475, 752155, 989819, 740106, 907673, 976431, 811706, 838374, 926440, 1058514, 623046, 1004978, 971792, 1231304, 1167388, 947623, 1069915, 821861, 996617, 1061225, 1377244, 943298, 1004355, 942747, 1049045, 1176378, 1127396, 1175281, 1563482, 997930, 1143026, 1234249, 1168231, 1144629, 974043, 1197453, 1069162, 996595, 963795]
16937I63795K13579r4767p1485K12603j11013K61092J5858o8402M2740k58260
16927A105740r8643L48241l79828K80616r3221L9527N74406o9162k86814j29886
16917A290976L81577l36227K33428j00791k23081L50699P1672j78349K39246j30306
16907A598844j72915J78968L8211R2514Q451o9221q7183R4256N979j31212j5507
16896A541185M0005L36024j3026k65743L30863j13039j27602L54899j20918N21008
16886B483656l26117r0500N3295k32650L94066j8369J43586J82016j94726l68049
16876B026208K19593P3546J97452k13419K86096l19512O6787K0416M45942J19577
16866B922686n06389l2212K42241R8975j27755j28392M52827q7912j88805K54903
$$ y = [963795, 1177374, 1082607, 1011122, 1223725, 1112712, 1373804, 1389662, 1321260, 1364000, 1105740, 1007097, 1355338, 975510, 1256126, 1162905, 1202432, 1776838, 1707676, 1420862, 1290976, 1672553, 1336326, 1569754, 1468963, 1245882, 1596581, 1668253, 1489904, 1729150, 1598844, 1425929, 1604897, 1643108, 1735622, 1744073, 1674852, 1587669, 1681925, 1687904, 1556692, 1541185, 1581190, 1917214, 1904188, 1638445, 1969308, 1856269, 1728667, 2083566, 1962648, 2483656, 2157539, 2067039, 2120334, 1887684, 2281750, 2263381, 2406967, 2588983, 2394257, 2026208, 2245801, 2319347, 2516799, 2303380, 2589476, 2269964, 2336751, 2357167, 2803109, 2922686, 2416297, 2384085, 2626326, 2725301, 2597546, 2469154, 2921981, 2834069, 2645264, 2900167]
16856B900167R160J35659N5159n40048L62483J37919J8130K17424K56917m24654
16846C128316M45477J28704k02805r1142J01554K27591j706j02963K90673J93922
16836D117621J2616N6611j8517j34338J40494M4518L4397P38055m93259J69146
16826D667344J5709m2504J67459K78905j5121J6338K08555J9046n1257J34300
16816E398774K66420m08185O19598L48883l6198J46333j20307N7775K61237K76995
16806F811325j11844L40689J52332J62282K1893R3393K08518R5081L14870k1905
16796H066634M47458M24241j6208J57936M72470Q7696J35360j02153O28217L90629
16786A0692280J62876K35897K61990M04585L75R54388L7508M09281N19678K63188
$$ y = [2900167, 2909327, 3044986, 3100145, 2560097, 2922580, 3060499, 3078629, 3296053, 3552970, 3128316, 3573793, 3702497, 3499692, 3408550, 3510104, 3737695, 3735989, 3633026, 3923699, 4117621, 4130237, 4186848, 4168331, 4033993, 4174487, 4219005, 4253402, 4991457, 4498198, 4667344, 4683053, 4640549, 4808008, 5086913, 5071792, 5088130, 5296685, 5315731, 5264474, 5398774, 5665194, 5257009, 5876607, 6225490, 6189292, 6335625, 6215318, 6273093, 6534330, 6811325, 6699481, 7040170, 7192502, 7354784, 7376677, 7470070, 7678588, 7773669, 8088539, 8066634, 8514092, 8938333, 8922125, 9080061, 9552531, 9640227, 9775587, 9673434, 10301651, 10692280, 10855156, 11091053, 11353043, 11757628, 11758003, 12712391, 12749899, 13159180, 13678858, 13942046]
16776A3942046L85726N32110j9042R99543O25515K74331N70155L50733J100523
16767A8761640K61480J008594P69089O23605Q54316P72752J012587P51203J273529
16758B6088795P58239J313243J218453J186522J749515J034109J703497J712458
16750C6764831J326388K010756J536450K221614K382619K701649K532506K634258
16742E4111071K898330K826821L595140L747095L670387M129647M631159M606794
16734H4216444N233839N314208O097167O180394O432820O990856P001588P486901
16726A34954217P793878P503142P919640P301363O912846O715157N597979N042209
16718A89740431L497564L100795J030766J79600j077501l019095l880298m811185
$$ y = [13942046, 14327772, 14859882, 14840840, 15840383, 16465898, 16740229, 17310384, 17661117, 18761640, 19023120, 20031714, 20800803, 21424408, 22278724, 23051476, 24064063, 24815266, 26088795, 26847034, 28160277, 29378730, 30565252, 32314767, 33348876, 35052373, 36764831, 38091219, 40101975, 41638425, 43860039, 46242658, 48944307, 51476813, 54111071, 57009401, 59836222, 63431362, 67178457, 70848844, 74978491, 79609650, 84216444, 89450283, 94764491, 100861658, 107042052, 113474872, 120465728, 127467316, 134954217, 142748095, 150251237, 158170877, 165472240, 172385086, 179100243, 184698222, 189740431, 193237995, 196338790, 197369556, 197549156, 196471655, 193452560, 189572262, 184761077]
16710A84761077n474929o927657o923756p413746p814672p934112p609287q005819
16702A26657099p371460o758166p054904o218886o304741n542112n495249n046585
16694G6864996m564313l923575m334042l781271l148942l418219k836415l027346
16686D7830873k470255k522619k141353j846598j955624j703486j578219j597018
16678C2015701j606516j374394j258404j196580j174864j379657j005882m34721
16670B2584683j286386m08507q79003q45958n26720q33735q22916m00301o81803
16661A5899354l21882o66750o35109m06403n49763k09629n87493o2942r00886
16652A1558497m44880k53465P2403o92174j71023j49501m70285k16408o2845n07083
$$ y = [184761077, 179286148, 172358491, 165434735, 158020989, 150206317, 142272205, 134662918, 126657099, 119285639, 112527473, 105472569, 99253683, 92948942, 87406830, 81911581, 76864996, 72300683, 68377108, 64043066, 60261795, 57112853, 53694634, 50858219, 47830873, 45360618, 42837999, 40696646, 38850048, 36894424, 35190938, 33612719, 32015701, 30409185, 29034791, 27776387, 26579807, 25404943, 24025286, 23019404, 22584683, 21298297, 20889790, 20010787, 19164829, 18638109, 17804374, 16981458, 16581157, 15899354, 15577472, 14910722, 14275613, 13869210, 13319447, 13109818, 12522325, 12459383, 11558497, 11113617, 10860152, 10932555, 10240381, 10069358, 9919857, 9449572, 9233164, 9170319, 8663236]
16642H663236j97248k88033j96639k70349j65981k90424k61778J31382l24904
16633F799262J46965k90562k45057l17333J13433m23211j13887K71451m89373
16624E451688j24517k58594j20610L65181k60484l34245J43735l91332j26117
16615D344705M4041N0593k86781J23554j12375m5659k83707j72655M2754j26337
16605C578133r3395j12075k2384J7877J70441m50921J76952j15565o5948j67049
16595B916066k83841M20910Q6363l98389R7818L07740m75814k5743j11049P7263
16585B611324k48422J84874q3948k05006k29072L32766Q3767j69213p0855j66729
16575B039486L78443k62893o6325o3033j20117M95466m65151q9641j43956J70694
$$ y = [8663236, 8465988, 8177955, 7981316, 7710967, 7544986, 7254562, 6992784, 7124166, 6799262, 6946227, 6655665, 6410608, 6093275, 6206708, 5783497, 5669610, 5941061, 5451688, 5327171, 5068577, 4947967, 5313148, 5052664, 4718419, 4862154, 4470822, 4344705, 4388746, 4439339, 4152558, 4276112, 4163737, 4118078, 3834371, 3661716, 3704470, 3578133, 3484738, 3372663, 3350279, 3368156, 3538597, 3087676, 3264628, 3149063, 3083115, 2916066, 2632225, 3053135, 3139498, 2741109, 2838927, 3146667, 2670853, 2645110, 2534061, 2611324, 2362902, 2547776, 2463828, 2258822, 2029750, 2362516, 2446283, 2277070, 2206215, 2039486, 2417929, 2155036, 2088711, 2025678, 1905561, 2401027, 1935876, 1846235, 1702279, 1872973]
16565A872973j74995O2231J90500k67761J74626k07220o5361j37153L32687j82440
16555A598087m04239K88175J89738k69768K0536L89157n04831L06263l63402N0179
16545A299895N1468L00264p3368o07680N79789L0070m94579j8976J43857j4808
16535A195932L91153m14509j22463J98677O3044m00644J51376j04887K37398J80451
16525A375528j66687J62426k20579O4692J7903k9940j86530K94347j84077l88797
16515G38286J97361j7394j13727M09069r0436j07241l0596k52754M24029m79633
16505F76964k1203L4761J79252r7454q7120j7007N5737j11441O9194j12674L85008
16494I54017l54101L18258q305l75873P8000N7238j44651J16190j64962M6066
$$ y = [1872973, 1697978, 1760209, 1950709, 1682948, 1857574, 1650354, 1584993, 1447840, 1780527, 1598087, 1193848, 1482023, 1671761, 1401993, 1422529, 1811686, 1306855, 1613118, 1249716, 1299895, 1351363, 1651627, 1578259, 970579, 1550368, 1580438, 1085859, 1066883, 1210740, 1195932, 1587085, 1172576, 1050113, 1248790, 1311834, 911190, 1062566, 957679, 1195077, 1375528, 1208841, 1371267, 1150688, 1215380, 1233283, 1203343, 1016813, 1311160, 1127083, 738286, 935647, 918253, 804526, 1213595, 1123159, 1015918, 985322, 732568, 1156597, 676964, 655761, 690522, 869774, 772320, 685200, 668193, 723930, 612489, 681683, 569009, 954017, 599916, 918174, 909869, 533996, 611996, 669234, 524583, 640773, 475811, 521877]
16484E21877j96623K52171J13879k09691M04750l50466K25268k91334J48503Q6329
16474G04663p4501j70674B23820J79123L19399m1376j85127M448J83978k43188
16464D41077A85869M53473l7661r6875k45377L6474K87946Q748B96002N728O69639
16453I71369D62289k30365J19195L91419B99045P7668l2115A31920K87554J44116
16443E63590K4877q6462k37191L63913k16614K64068A12891N66493A66485L97735
16433E64220j81142D7660K33023j272L70742o8393j76929J83633J21654j85560
16423E24558B15452K77905K196B17537J47180a48174D11996O1562A26861J19927
16413B46788L55316A80374j3084Q7133J97292j23396k585j60212K16696E2576
$$ y = [521877, 325254, 577425, 691304, 481613, 886363, 535897, 761165, 469831, 618334, 704663, 630162, 459488, 223820, 402943, 722342, 680966, 495839, 500287, 684265, 441077, 185869, 639342, 601681, 504806, 259429, 295903, 583849, 592597, 296002, 301730, 971369, 462289, 231924, 351119, 742538, 299045, 376713, 344598, 131920, 419474, 563590, 588467, 502005, 264814, 628727, 412113, 676181, 112891, 679384, 166485, 564220, 383078, 47660, 280683, 279411, 650153, 581760, 404831, 588464, 710118, 524558, 215452, 493357, 495553, 217537, 364717, -148174, 411996, 473558, 126861, 246788, 602104, 180374, 167290, 254423, 451715, 328319, 325734, 165522, 382218, 52576]
16402B86970o1789Q3540j29072P0326L27519B59233n3881N3494g3699C42492I9449
16390A10542J32124Q5186g3895E85782A87843L11161E0144K97267E1756c56172
16379C80248q4758j31130J22730M612d1331B59096H4331R8045K32088o6435A01392
16367A1714J71593J87566j10866J44955j35892J96123k25134p7026K0003M277
16357A87313J64359A2673f9810B02364c0951D2616d5036A35141O9786o3679J25528
16346B66776B8169J25426J79062q8096m0589k323B0733d5650A47060Q5005J14415
16335C46480A40393C4729J23838k419c3115A13417O2627J84830o3203e3778B35016
16323A22584E4447L44327F1433K20404q2377K44914a64940b8205k90395A18628
$$ y = [286970, 225181, 308721, 179649, 249975, 577494, 259233, 205352, 258846, -73699, 342492, 99449, 110542, 242666, 327852, -73895, 585782, 187843, 499004, 50144, 347411, 51756, -356172, 380248, 295490, 164360, 287090, 291702, -41331, 259096, 84331, 182376, 414464, 348029, 101392, 11714, 183307, 370873, 260007, 404962, 269070, 465193, 240059, 163033, 183036, 187313, 351672, 12673, -69810, 202364, -30951, 42616, -45036, 135141, 204927, 141248, 266776, 28169, 153595, 332657, 244561, 203972, 201649, 20733, -45650, 147060, 232065, 346480, 140393, 34729, 158567, 156148, -33115, 113417, 176044, 360874, 297671, -53778, 235016, 122584, 54447, 398774, 61433, 281837, 199460, 444374, -164940, -28205, -318600, 118628]
16312a8181B5367a8089A08794b7018E7986a51518C27199c7945H305b2569B51061
16300B280J16335P7941C2994J33580R9807B074Q4220h0756c7439A93343J8361
16289B11704J19424f0929G2254J89352p2956l1240b59172J10858D62731B9483
16278B62551g831H6160c214B90732I0375a81919h8457C08457a19379B33579k7711
16267B05868b8759C93188A32906K96384a26473k3110g2600b0379G7465M10982
16257D88447A96551E3692c6853A55313a90465A6281L2642a20460J8419L2346A00132
16245a37319A91535A9890J70983H0474L02770A54314J0125J43610B772O8003a45114
16233A9786c07003r2941f3644C32457a39794A12844A5753N38424A53787k1986
$$ y = [-18181, 25367, -18089, 108794, -27018, 57986, -151518, 327199, -37945, 8305, -22569, 251061, 2280, 118615, 196556, 32994, 166574, 266381, 2074, 86294, -80756, -37439, 193343, 211704, 331128, -60929, 72254, 261606, 188650, 157410, -259172, -148314, 462731, 29483, 262551, -7831, 86160, -3214, 290732, 90375, -181919, -88457, 308457, -119379, 233579, 205868, -28759, 393188, 132906, 429290, -126473, -149583, -72600, -20379, 77465, 488447, 196551, 53692, -36853, 155313, -190465, 16281, 48923, -120460, -102041, -69695, 100132, -137319, 191535, 19890, 190873, 80474, 383244, 154314, 164439, 308049, 2772, 70775, -145114, 19786, -307003, -399944, -63644, 332457, -139794, 112844, 15753, 554177, 153787, 131801]
16223A31801a12336c6642A46490D3800a42697A79941L19184B27068c5218A70279
16212c3353E7476N3646i1095d06I1349e8469D34029m8635j01806j21206b40776
16200b11993J8751h0492I0933a61557D0419J19041L1954J2044b47814i6249D1308
16188A93245g0742c3496A06506J39670Q4489A29481a37481E8640a34862G1082
16177a24665q6506B2207O4703J74114B1797e1220B1453b1147Q365o6374G9277
16165A31498O4102a87696A15084a26071A48047l1038h2553C95223a65784G0838
16154a0909A38238o4146N3698a24855A58150a36910B69461A07573N1154C3246
16143A46991a92795J2425I8331b16135B37310A0455a97154E3517K3587a27263
$$ y = [131801, -112336, -36642, 146490, 43800, -142697, 179941, 499125, 227068, -35218, 170279, -33353, 57476, 111122, -91095, -406, 91349, -58469, 434029, 385394, 283588, 162382, -240776, -211993, -193242, -80492, 90933, -161557, 40419, 159460, 191414, 203458, -247814, -96249, 41308, 193245, -70742, -33496, 106506, 246176, 330665, 129481, -137481, 58640, -134862, 71082, -124665, -211171, 22207, 86910, 261024, 21797, -51220, 21453, -21147, -12782, -79156, 79277, 131498, 195600, -187696, 115084, -126071, 148047, 117009, -82553, 395223, -165784, 70838, -10909, 138238, 74092, 127790, -124855, 158150, -136910, 269461, 107573, 158727, 33246, 146991, -192795, -180370, 98331, -216135, 237310, 10455, -197154, 53517, 77104, -127263]
16132F6091J74222b71753n7008A7280g7681J5556B29550A11091B9804K5453A1218
16120a14420B99649G4468b52695b154j75776o6399N2384A41721b07932c2774D21745
16108A6969N06567A12489a86223A10739K0787i966C38824b13852e4100A29939
16097c7301I5206e5255J1969C35294c47161J58005B52981G541j024a09l0039k82426
16085c12574J39832A507M1101i7480A1389c16501J49681A68119a02183e372j2134
16074a7506K071e195A26341J6005a9107o8057a1623B00404a49063r7071O8811
16063a77323l2129f4098j26971A0810M6828k1744K2995d266A72074m8681j1995
16052A11398D9161O5547B5174d29170B29978a45910P1845j12635D8732K24747
$$ y = [66091, 240313, -271753, -328761, 17280, -77681, -62125, 229550, 111091, 29804, 55257, 11218, -114420, 299649, 74468, -252695, -2154, -177930, -244329, -191945, 141721, -207932, -32774, 421745, 16969, 523536, 112489, -186223, 110739, 131526, -9966, 338824, -213852, -54100, 129939, -37301, 95206, -55255, -43286, 335294, -347161, -189156, 252981, 7541, 6517, -109, -30148, -312574, -172742, 1507, 42608, -97480, 11389, -316501, -166820, 168119, -102183, -5372, -17506, -15435, -5195, 126341, 142346, -19107, -87164, -11623, 200404, -149063, -246134, -177323, -209452, -64098, -191069, 10810, 57638, 35894, 58889, -4266, 172074, 123393, 111398, 49161, 114708, 25174, -429170, 229978, -145910, -74065, -186700, 48732, 273479]
16042B73479a21612J6032m2400A01449c67597g7828G6799Q4274e4933m1176F4857
16030f0040j31182A66762c6370A15739a40297M3384K276M4164j21668Q2004j87953
16019b78090G5461h7500d0471k79125a03613G4613N3044a75217B3008O5915c4342
16007A17978a66795B75883e8364F2548a12226A31727M2517A1622a77829K4941
15997a52888d9331n5836k26028g6681A25220a22675K3858E9678b38065e4124B47960
15985A94156A8199N6656J86310K40222J60906k92348o1963J06122k06030E8743
15974A40057b19040a08588b5371m59955e1822j15703I3683a55774b4243D30356
15963I1148b0177B5640R3904b73418B20369h2480j03797A89079D1492a69069F5440
$$ y = [273479, -121612, -105580, -147980, 101449, -367597, -77828, 76799, 161073, -54933, -96109, 64857, -60040, -191222, 166762, -36370, 115739, -140297, -96913, -94637, -50473, -172141, -90137, -278090, 75461, -87500, -40471, -319596, -103613, 74613, 127657, -175217, 23008, 88923, -34342, 117978, -166795, 275883, -58364, 62548, -112226, 131727, 174244, 11622, -177829, -152888, -49331, -105167, -331195, -76681, 125220, -122675, -98817, 59678, -238065, -54124, 247960, 194156, 18199, 74855, 261165, 501387, 662293, 369945, 307982, 414104, 208074, 58743, 140057, -219040, -108588, -25371, -485326, -51822, -167525, 93683, -155774, -24243, 430356, 91148, -20177, 25640, 119544, -273418, 220369, -82480, -186277, 189079, 41492, -169069, 65440]
15951a1804H713d761K270A82014c642j47717r4979J16592f4489j56773g4240l18445
15939c92685a17634q8717L9271A61841a5451A42247f6440A49449b48265H243l030
15928E213P5121D466J29715a0687A42002g0818m8279A48651h8059B50667B1783
15916B14462a61608r3409A67841b67899g1398G2633b01298D7641a16662L4144
15906h2518I6167a27806H2515i0555I8414c83107r7674A82652a44403f4204E2834
15894g6017b7040l3516A84581O4199C2479f0406l3973m5273A26601n6672C1998
15882F4233K784M5731E3626a67582N0686p3937j13509a46917A14160L7464n8355
15871I3269b63058h3694q6418l6470j58918g5787j4814J6463k5657J0442G093
$$ y = [-11804, 8713, -4761, -2491, 182014, -3642, -151359, -246338, -129746, -64489, -221262, -74240, -392685, -117634, -206351, -167080, 161841, -15451, 142247, -66440, 149449, -248265, 8243, 5213, 80334, 4466, 134181, -10687, 142002, -70818, -119097, 148651, -88059, 250667, 21783, 214462, -161608, -255017, 167841, -267899, -71398, 72633, -201298, 47641, -116662, -82518, 96167, -127806, 82515, -90555, 98414, -383107, -480781, 182652, -144403, -64204, 52834, -76017, -27040, -60556, 184581, 248780, 32479, -60406, -94379, -139652, 126601, 69929, 31998, 64233, 67017, 112748, 53626, -167582, -116896, -190833, -304342, -146917, 114160, 151624, 93269, -263058, -83694, -170112, -206582, -365500, -75787, -90601, -74138, -99795, -89353, 7093]
15859h3009m5213j43327l35943C37058a20661G6527e0372B41h877k3673R148p4746
15847i8148B17652l9151i6364I3574b62094l1335C16395a86176C51146a69128
15836b15450A9053a61014F28857a58611k4152B27265B9215K67819e922j77524
15826a83446i1209I0412b88151O5877A87253a64089n4631A9115a6797D5494J79504
15815B24998D9209J38815b15444C6825a35126A81552a12150c6968l7869A316J8676
15804A9992n166J25278a65233A8147O6235a04545H1616k344J83937d67B75372
15792A00809h6006B28122o3883a82390b4825m7739j01558A461a5462j38680l9943
15781a94085A82469a81625f0086j01095B51872b92005a06145k16525a37820A17899
$$ y = [-83009, -128222, -271549, -607492, 337058, -120661, 76527, -50372, 241, -8877, -32550, -23402, -98148, 217652, 178501, -96364, 93574, -262094, -293429, 316395, -186176, 351146, -169128, -215450, 19053, -161014, 628857, -158611, -182763, 227265, 29215, 297034, -5922, -183446, -91209, 90412, -288151, -222274, 187253, -164089, -218720, 19115, -16797, 45494, 224998, 49209, 188024, -215444, 36825, -135126, 181552, -112150, -36968, -74837, 1316, 19992, 14826, 140104, -165233, 18147, 84382, -104545, 81616, 79272, 263209, -467, 275372, 100809, -86006, 228122, 164239, -182390, -24825, -72564, -174122, 1461, -15462, -154142, -194085, 182469, -181625, -60086, -161181, 251872, -292005, -106145, -322670, -137820, 117899]
15770A60841g7738k5660I9265d0210m2798K9381F7603m100c6606E3822K1318b74581
15757c93971A59247A7335J1242a5384A47859b14873B38186a17885L9420a3069
15746B14596a32685B58186C2933K23805L9590a14787j50911A20021h539k0662
15736b9201l96624C6284K500e3991A33306h0226k0824D5887a67777m3022a128
15724f0846a0569B17541E0263h5278k14937h8710L7576F3339K5638b8203j81817
15713b10020i8722j68642E6744J88272o3316a06835l95613C203d42599a54155
15702b2101j37295C09537a501j18540C32804b16047B48709l6241m1403j1893a51706
15690a20826C63859j38460H3569A6978a72951c905G6782L1706A0932b42346D8163
$$ y = [160841, -77738, -103398, 99265, -40210, -83008, -53627, 67603, 63503, -36606, 53822, 75140, -274581, -393971, 159247, 17335, 28577, -15384, 147859, -214873, 238186, -117885, -78465, -13069, 214596, -132685, 258186, 32933, 256738, 296328, -114787, -265698, 120021, -8539, -29201, -425825, 36284, 38784, -53991, 133306, -80226, -101050, 45887, -167777, -210799, -1128, -60846, -10569, 217541, 50263, -85278, -300215, -88710, -51134, 63339, 88977, -28203, -210020, -98722, -267364, 56744, 245016, 181700, -106835, -502448, 3203, -442599, -154155, -22101, -159396, 309537, -1501, -120041, 332804, -216047, 248709, 212468, 171065, 159172, -151706, -120826, 363859, 225399, 83569, 16978, -172951, -3905, 76782, 108488, 10932, -242346, 48163]
15678h4123A77946M6848a66292F7692a00845B7855R3681a68202F5420J7055l6510
15667D5965a5337q6299I2214i5103C5839a98102P5669A16602n5746h1881B8638
15655A12225e3607A36649a2573n9992I3754e3660A31389m2428K6292d2736B49188
15643A90613f9517b9879j94784B20829G9014j3159e7522b8327j01517A84878b4932
15631A43174J01023C4023A1949a17536c7415A24841e6758B76676f3051J8127r8352
15620a43276F1091N0570a01404B40935J59338a48398A36969b40317B71980a23474
15609I8666b64581I9426a54282B2384a55095A08129d09822b3842B78645a9278
15598b87653I649i8186C28830B492Q4077a23239j2756F5148e04454A98440D3193
$$ y = [-84123, 177946, 224794, -166292, 67692, -100845, 27855, 121536, -168202, 65420, 82475, 45965, -15337, -101636, 92214, -95103, 35839, -198102, -122433, 116602, 60856, -81881, 28638, 112225, -53607, 136649, -12573, -72565, 93754, -53660, 131389, 88961, 115253, -42736, 249188, 190613, -69517, -29879, -224663, 220829, 79014, 65855, -57522, -28327, -129844, 184878, -24932, 143174, 244197, 34023, 11949, -117536, -37415, 124841, -56758, 276676, -63051, -44924, -143276, 61091, 111661, -101404, 240935, 400273, -148398, 136969, -240317, 271980, -123474, 98666, -264581, 99426, -154282, 22384, -155095, 108129, -409822, -23842, 278645, -19278, -287653, 9649, -98186, 328830, 2492, 86569, -123239, -135995, 65148, -504454, 198440, 43193]
15586B10854b96613C80051b25200c5132B03682b02662g1992a9669l09488C3625
15575h5403k4778j42045r960a07736j21774J14338A27125m6432K7372a64055B93469
15563F1806P4308J0570c61027I6182d9859I2752b46224I9818J38237a67871f8420
15551A73769a28667K9648o0552B65040b2440A93639B4159J15807b83775d6009
15540A90166Q673a49812A91947C184K23252a91281j11121b1064I8369m5464R2709
15529A45614D7849b28278J7509J04259R752j62239h9210l60217K20089A35497
15518A32128F0197e6535k41262D6348L0544c04548B21962G1035c5254D6426M5301
15507I1727b18776d9149A25339b06855j87785c9123A84439G4649k5768M7074Q5471
$$ y = [210854, -296613, 380051, -225200, -35132, 203682, -202662, -71992, -19669, -329157, 33625, -85403, -110181, -252226, -262186, -107736, -229510, -115172, 127125, 80693, 108065, -164055, 293469, 61806, 136114, 146684, -361027, 96182, -49859, 92752, -246224, 99818, 238055, -167871, -68420, 173769, -128667, -99019, -159571, 265040, -22440, 193639, 24159, 139966, -283775, -46009, 190166, 198839, -149812, 191947, 3184, 226436, -191281, -302402, -21064, 98369, 52905, 145614, 47849, -228278, -210769, -106510, -96758, -258997, -89210, -449427, -229338, 135497, 132128, 60197, -56535, -297797, 46348, 76892, -304548, 221962, 71035, -35254, 46426, 91727, -218776, -49149, 125339, -206855, -394640, -39123, 184439, 74649, 48881, 95955, 181426]
15496A81426b0973B22505H5042a35365j05340E6820m941f8975k7653c2799j68543
15485b01342A67292o20a69623m1128D2332J68764E2396e8649A88734e7594H9566
15473i5789F2559G085J56683k3881b94268b7954j43391L6457B32413c81B56866
15461A58295p8929a6225A70539p4952e9764j97334A41732a94573B36118h2380
15450A40141i1378H3858a68092I4174a27000N3491B79277a10963J3661a6709k9245
15439d5954j8291a7090l8077i849C5025N7182A8407j329b2392B99099j05926b68048
15426B52604e0655j80354Q1102B30963h8443L4284j62581A46114a53507g3687
15415A91100e46119A67050a36864A0231a80187A46327b67767b5762e045j19450
$$ y = [181426, -20973, 222505, 85042, -135365, -240705, 56820, 51879, -68975, -96628, -32799, -201342, 167292, 166672, -169623, -210751, 42332, 211096, 52396, -58649, 188734, -57594, 89566, -95789, 62559, 7085, 163768, 139887, -294268, -27954, -171345, -134888, 232413, -381, 256866, 158295, 79366, -16225, 170539, 95587, -59764, -257098, 141732, -194573, 236118, -82380, 140141, -91378, 83858, -168092, 94174, -127000, -73509, 279277, -110963, -97302, -16709, -45954, -64245, -17090, -55167, -9849, 35025, 92207, 18407, 17078, -22392, 299099, 193173, -268048, 252604, -50655, -231009, -149907, 230963, -88443, -54159, -216740, 146114, -153507, -73687, 191100, -546119, 167050, -136864, 10231, -180187, 146327, -267767, -25762, -5045, -124495]
15405a24495b5681j14020a8060n1305b1448r4769l2227C4436J26470a25537E3717
15393A03417A525b58567i8651o557j32995O0869A32320a61254H7513C3765J35000
15382A68765c90621C18641q5080K4179F5682e1135E5729N9532a26200E9743b78945
15370E8858f8905L1650l7845k6982L7682C11603a73505A36185D2660P4097a00669
15358i0716n4985A41762a14837C16814c9426O397k05770a03155l2814O4211A03586
15346i0951H7649d2517l12889A70188G718J9192a42489B80805A33474b62q3958
15335h4220M0009o4009H549K30626a94132A03283j7305b3466C55834a20100B16891
15323a83851A05655q928A6953J46029L2423J25738a46581G0237C3950a31967n1498
$$ y = [-124495, -25681, -139701, -18060, -69365, -21448, -116217, -148444, 34436, 160906, -125537, 53717, 103417, 1525, -258567, -98651, -105208, -238203, -177334, 132320, -161254, 87513, 33765, 168765, -390621, 318641, 233561, 257740, 65682, -51135, 55729, 115261, -126200, 59743, -278945, 58858, -68905, -37255, -75100, -102082, -64400, 311603, -173505, 136185, 42660, 116757, -100669, -90716, -145701, 141762, -114837, 316814, -39426, -33029, -238799, -103155, -135969, -71758, 103586, -90951, 87649, -42517, -355406, 170188, 7718, 26910, -142489, 280805, 133474, -262, -84220, -44211, -108220, 8549, 239175, -194132, 103283, 85978, -23466, 355834, -120100, 216891, -183851, 105655, 96727, 16953, 162982, 195405, 321143, -146581, 70237, 33950, -131967, -183465]
15312a83465D23607B9830b49329G5218a75297j7327A8569Q7986E3165O6658E2175
15300D2707J1400a12106e5235B14683K22344B5337b72976e3924A56698h469A75878
15288a42517A86486C9842M8970b52554N0333A63816C6797a03212j29344B88680
15277B05716h3536B9214c04432d8590A85746i1049C64506b2892B42715a03812
15266B16794h9493B62397E2251b68604C64776b44609F8260f7840p6091J3213A98113
15254A44391B2498J65741a27391G6222J48848J86769P67607M744K94790o3928
15244A415052j28301l41373C80638o9880K6601a02656d6398E041J72059a8052
15233b6258j6864G6288J47006f2994D8691e6597P104B48538j04018d288C0995
$$ y = [-183465, 423607, 29830, -249329, 75218, -175297, -192624, 18569, 106555, 53165, 119823, 52175, 42707, 54107, -112106, -55235, 214683, 437027, 25337, -272976, -53924, 156698, -8469, 175878, -142517, 186486, 39842, 88812, -252554, -202221, 163816, 36797, -103212, -232556, 288680, 205716, -83536, 29214, -304432, -48590, 185746, -91049, 364506, -22892, 242715, -103812, 216794, -89493, 262397, 52251, -268604, 364776, -244609, 68260, -67840, -143931, -130718, 198113, 144391, 22498, 188239, -127391, 76222, 225070, 411839, 1179446, 1184190, 1478980, 1415052, 1286751, 945378, 380638, 310758, 337359, -102656, -46398, 5041, 177100, -18052, -26258, -43122, 76288, 223294, -62994, 48691, -56597, -49493, 248538, 144520, -4288, 30995]
15221C21417D5775c5897H9979a15053B91773c6169B23625p6068A480a70694B0601
15209E251K25169d7605j03251M3769A1410J52701K9765I3303a7307A28861a09656
15197a34360I723L65386a27554j39756R9481B35384a75518e4743k78511J50756
15187a82498c0957j00276A83378Q9336E5588J50731J77407F3955l700K12297A0171
15175d25275A83568J38503r4655b0127B08242h3490N460J0529p6003O4543m1908
15164a20869C43370p9009K7720e0081D75166c7885f786B37272b7159j43032A50116
15152B424N9269K24273j8442B5367J6574J10251b578B64081F7957J8591a00657
15140D84501G1128B7002j2925c9437j4954B5647a16854A83317q0023a64749B30444
$$ y = [321417, 45775, -35897, 89979, -115053, 291773, -36169, 223625, 147557, 1480, -170694, 20601, 5251, 230420, -47605, -150856, -107087, 11410, 164111, 193876, 93303, -17307, 128861, -109656, -134360, 9723, 375109, -127554, -267310, -167829, 235384, -175518, -54743, -333254, -182498, -30957, -131233, 183378, 272714, 55588, 206319, 383726, 63955, 60255, 272552, 10171, -425275, 183568, 322071, 227416, -20127, 208242, -83490, -78030, -67501, -143504, -78961, -120869, 343370, 264361, 292081, -50081, 475166, -37885, -6786, 237272, -27159, -170191, 150116, 2424, 61693, 285966, 267524, 25367, 41941, 152192, -2578, 264081, 67957, 86548, -100657, 484501, 71128, 27002, 14077, -39437, -54391, 25647, -116854, 183317, 103294, -164749, 230444]
15128B23150K7128E5031B825J4468N7561k240j7047M97524k26024j54379M0442
15117B13130J63397F4361a652B12605q0847a9294C2489J65765l5372J57884O4653
15106C85419A18596l9386J38091e7146C426b21093A89949a7647r8344C27485A17252
15094B31687J34592j09774b84083G9181J48367R3793j5620P8563a0598B1548R5319
15083A16867a0641B69704d9334A61812J4436p041B3713J64898J02974H2499a49276
15071B86397q0724R7539j38114J11371g7935A78314R2184C4310R6367J22494J86624
15060D39795R101a57366e4950c512D8377b82750B7502L12572q5753L7411l9908
15049B51824A18178K55259n0596o0708J35303a07868A0915K74228f7554q2729
$$ y = [223150, 250278, 55031, 2825, 17293, 74854, 72614, 55567, 553091, 327067, 172688, 213130, 376527, 64361, -1652, 212605, 131758, -19294, 32489, 198254, 162882, 320766, 385419, 118596, 79210, 217301, -57146, 3426, -221093, 189949, -17647, -115991, 327485, 117252, 231687, 366279, 256505, -284083, 79181, 227548, 321341, 305721, 384284, -10598, 21548, 116867, -10641, 269704, -49334, 161812, 176248, 169207, 23713, 188611, 291585, 82499, -149276, 286397, 205673, 303212, 165098, 276469, -77935, 178314, 270498, 34310, 130677, 253171, 439795, 448896, -157366, -54950, -3512, 48377, -282750, 27502, 340074, 254321, 291732, 251824, 118178, 373437, 322841, 262133, 397436, -107868, 10915, 285143, -67554, -150283]
15039a50283C81125K0523A18231K24263B1218M3834K74431F7066a27224I4807
15028E90663b4404A63283d941A43646M7615c5366A9540J80391j6469m1556J1955
15017A53861L23197A91116J45077j64652a2391C47485I0858i124A8641K73346
15007B91987o3397Q102e0694B85981j06230M8797I1357D882K70370e9322G3834
14995B93195j13885L3621R3948e3207C37956j30758a14698E61479I2427L19548
14985D11975E7169J64408d363C65524j42990A4411K55732Q383p3131R2977J23892
14974D22264m1714O6481A52491K69146k01267l2031H9901R000J78842J11792J18900
14963E08435A53028P3143K41105O3913j01966j28769r9084N3257J28914j46555
$$ y = [-150283, 381125, 401648, 118231, 342494, 21218, 65052, 339483, 67066, -127224, 94807, 590663, -24404, 163283, -4941, 143646, 191261, -35366, 19540, 199931, 183462, 141906, 153861, 477058, 191116, 336193, 171541, -12391, 347485, 90858, -9124, 18641, 291987, 228590, 236692, -50694, 285981, 179751, 228548, 91357, 4882, 275252, -59322, 73834, 293195, 179310, 212931, 306879, -53207, 337956, 207198, -114698, 561479, 92427, 411975, 57169, 221577, -4363, 365524, 222534, 14411, 270143, 278526, 205395, 298372, 422264, 380550, 447031, 152491, 421637, 220370, 188339, 89901, 98901, 277743, 389535, 508435, 153028, 226171, 467276, 531189, 429223, 300454, 201370, 254627, 383541, 236986]
14953B36986H0779K69916q612J72409q7322C1288L43707j60981K27273j51334
14943B89953K3324J31745A48997q678K38144K4959J01279j74584l2856r5559J86393
14932C88095j13305K48042k23880g732B70596K91750p2378j47969Q40A41081R5276
14921B36357K29948q3756q1249j0420H673M22654r6360r2244L01064k42191N1218
14910C52814J37035j84351E1545K58975L088R6206J52810N905A90278J51377p4382
14899B67273J27955I5384K71377J8281n7345j7637A41007L08851j4128j35047
14889C00683O8182A49085J05294Q4531K27875B37256L98023j08282j48400P1644
14879D50241j45037n6608J89764O754B13997M36527G0808M61037n8913G8452L64696
$$ y = [236986, 80779, 350695, 342083, 514492, 427170, 31288, 374995, 214014, 441287, 289953, 313277, 445022, 148997, 140319, 378463, 403422, 504701, 330117, 297261, 201702, 388095, 274790, 522832, 298952, -7732, 270596, 562346, 489968, 341999, 342839, 141081, 236357, 466305, 382549, 301300, 290880, 8673, 431327, 334967, 242723, 543787, 301596, 352814, 489849, 305498, 51545, 310520, 313608, 409814, 562624, 568529, 190278, 341655, 267273, 395228, 95384, 366761, 385042, 327697, 310060, 141007, 449858, 435730, 300683, 368865, 149085, 254379, 338910, 566785, 237256, 635279, 526997, 378597, 450241, 305204, 248596, 438360, 445114, 213997, 650524, 70808, 531845, 472932, 78452, 443148]
14868D43148A39290K45834j3000A41766N74861l19316A60070L44335j84339j17433
14858B02633K62468j22186k5470n3504K05307H5891L63284K16230j74279j77244
14848C13882J36337K38743j23242J3623J08679l27471j47312J81789j4486K52275
14838F32817A88564J84379K83585j26660j01126m0564A82883L76603K34375k78328
14828E15533j87130N09508l12535k26207L36543l866k35693K06226k30924p9140
14818B92315P5522J05219B32609K42284k15162J59627Q7190j16092n6909R9724
14808D33271J60638k07068R6344n2290R9094n1971L45391l20964K47787J823l26674
14797D25381A26772K44624J37589R8530k18501J37459J03587k76588K02326J40410
$$ y = [443148, 139290, 385124, 372124, 141766, 716627, 397311, 160070, 504405, 320066, 202633, 465101, 342915, 317445, 263941, 469248, 85891, 449175, 665405, 491126, 313882, 450219, 688962, 565720, 579343, 688022, 360551, 213239, 395028, 380542, 632817, 188564, 372943, 656528, 529868, 428742, 388178, 182883, 559486, 793861, 515533, 328403, 837911, 525376, 299169, 635712, 631846, 396153, 602379, 371455, 292315, 367837, 473056, 232609, 474893, 259731, 419358, 506548, 390456, 333547, 433271, 593909, 386841, 483185, 430895, 529989, 478018, 823409, 502445, 750232, 752055, 425381, 126772, 371396, 508985, 607515, 389014, 526473, 630060, 353472, 555798, 696208]
14787F96208J85873D12430K52018n0143j08221J83045j88959B26215L78666M7189
14777F52070J50255B91258M53346k67919K36123j09587K57397j72555n3664J05687
14767G40086l00549Q6643j26271J73008O5537J00247L9662l79964M42276k83445
14757E57230j636j84233O32870j85516k89080L07709j38503J84847r7417k27130
14747E59141M73579k08405k78142K60803j33331j00009j64728K90076J30122j52462
14737F76644J88266m13983L75891P9374q2629j11012N1972J5182l43758L13517
14727G49464K7617l2750n9738K7752j95112J28565J8372j41248M33674k16149
14717G40447l5434p4496q4545L50949l84445L40345j4797l86589O69299l4994
$$ y = [696208, 882081, 412430, 664448, 614305, 506084, 689129, 500170, 226215, 604881, 652070, 802325, 291258, 744604, 476685, 712808, 603221, 860618, 688063, 634399, 740086, 439537, 526180, 399909, 572917, 638454, 738701, 778363, 398399, 840675, 557230, 555594, 371361, 1004231, 818715, 529635, 837344, 698841, 883688, 786271, 559141, 1032720, 824315, 546173, 806976, 673645, 573636, 408908, 698984, 829106, 676644, 864910, 450927, 826818, 906192, 823563, 712551, 764523, 779705, 435947, 749464, 777081, 744331, 684593, 712345, 517233, 645798, 664170, 522922, 956596, 740447, 705013, 630517, 545972, 896921, 512476, 852821, 838024, 451435, 1120734, 1085740]
14707A085740m39301M86543l42430k61058J98482L63136k61615l09381K36289
14698G56405J29386J49817j10413q3198J30880k19183n9363K63532k69365K91196
14688I79694q5500n0595L99645l91851k66529J99753n6684L58691k83642J61764
14678I64746m7600Q6273k8763l7056j52026J07420M08533Q3154j33837k51431
14668I99413L30724j16348j79172J15007j84792J30413J77037J7849j24288m46512
14658G19331K21860K82399j23039P1860J02223L5663j75239k1633k3118q267n5057
14647A026983M23395k92475p6451Q5442l1321J58121l1476k14961L77111M666
14637A429034j50762L0615j02236L74872k42173J74363k35274J43828k5530n1410
$$ y = [1085740, 646439, 1132982, 790552, 529494, 727976, 1091112, 829497, 520116, 756405, 885791, 1035608, 925195, 841997, 972877, 753694, 694331, 957863, 688498, 979694, 894194, 843599, 1243244, 851393, 584864, 784617, 727933, 1086624, 802982, 964746, 917146, 1003419, 974656, 937600, 785574, 892994, 1301527, 1384681, 1250844, 999413, 1330137, 1213789, 1034617, 1149624, 964832, 1095245, 1272282, 1290131, 1165843, 719331, 941191, 1223590, 1100551, 1172411, 1274634, 1310297, 1135058, 1113425, 1090307, 1082040, 1026983, 1450378, 1157903, 1081452, 1166894, 1135573, 1293694, 1262218, 1047257, 1424368, 1429034, 1278272, 1308887, 1206651, 1581523, 1339350, 1513713, 1278439, 1422267, 1396737, 1345327]
14627A345327J0022j94119O4606K16196j68308J102R6753L9430K05278p1897J69510
14616A713900m10039J95700j60067J57428j11805L99110l63897n4882r5767M44631
14606A714312q7908j55744j75930L37267o7619K34562k22025M5747J5071p7908
14596A559825J45516K1382J52374k0050j94540L15434O8210o7017l08446K15366
14586A888054K48933k5913K6721j01243R7956j18390j07013L17233k26929L25311
14576B324720j86518q4110m7528M0015j752J51160J63732k60079J9780M93039
14566B612459l58391M69410q6293j20648o5811j4128M44919J86416k71058L19392
14556C116267m80N2367L40001K53452L30955Q54614J034699K267450N935162J1682364
$$ y = [1345327, 1355349, 1161230, 1225836, 1442032, 1273724, 1274826, 1371579, 1411009, 1616287, 1544390, 1713900, 1303861, 1499561, 1339494, 1496922, 1385117, 1784227, 1420330, 1365448, 1269681, 1714312, 1626404, 1470660, 1294730, 1631997, 1564378, 1798940, 1576915, 1622662, 1637733, 1559825, 1705341, 1726723, 1879097, 1859047, 1664507, 1979941, 2048151, 1981134, 1672688, 1888054, 2136987, 2111074, 2137795, 2036552, 2134508, 2016118, 1909105, 2226338, 1999409, 2324720, 2138202, 2054092, 2006564, 2046579, 2044827, 2195987, 2359719, 2099640, 2119420, 2612459, 2254068, 2723478, 2637185, 2516537, 2450726, 2436598, 2881517, 3067933, 2796875, 3116267, 3115787, 3168154, 3508155, 3761607, 4092562, 4947176, 5981875, 8249325, 14184487, 25866851]
14546B5866851P981256Q39283j1603169q968443o570470l139075j426685p40695
14538B238853N8943n11231r445J91314K02318l8905L08076j12393o6107J48375
14528B409798K17173m35902N9261J47129j01160J83866J08959K03664m07160L77689
14518B763317o0846P9456k01583J74441o7092K31418j8461q3941R0139r4543M08305
14507C220610J94725j68015r0555m27704K91519O5215K89111R168j02605r1148
14497C190321J68418K38363k36215J00099n6796m5296L48691q1032k04494J96167
14487C618226j74511L3910K77582M28142n97902K05157R0043j02400J40708P4780
14477C993735P441p0362J91137j00679J15413j4523L59820k70636N448N80245
$$ y = [25866851, 33848107, 34687390, 23084221, 14115778, 7545308, 4406233, 2979548, 2238853, 2297796, 1786565, 1777120, 1968434, 2170752, 2131847, 2439923, 2327530, 2261423, 2409798, 2626971, 2191069, 2250330, 2397459, 2296299, 2480165, 2589124, 2792788, 2385628, 2763317, 2702471, 2781927, 2580344, 2754785, 2687693, 2919111, 2900650, 2816709, 2906848, 2812305, 3220610, 3415335, 3247320, 3156765, 2729061, 3020580, 3085795, 3374906, 3384074, 3281469, 3190321, 3358739, 3597102, 3360887, 3460986, 3404190, 3358894, 3707585, 3626553, 3422059, 3618226, 3443715, 3477625, 3755207, 4183349, 3585447, 3790604, 3880647, 3778247, 3918955, 3993735, 4001176, 3930814, 4121951, 4021272, 4136685, 4122162, 4481982, 4211346, 4216794, 4797039]
14467D797039l69139J16323N6177J09494J34918M8717j02425j2976L51309k32187
14457D897250K11377q3330K33247L6239j42618P5861L52106n9655K23028j48009
14447E595496K90717j88472K69869j59650L783J04042p4182L22157M24552l3221
14437F555091m4084J58914K24539l62172J79676k93401K03481N61531P0377j27073
14427G126879M13530j60734J62013Q5724N14336l00340L0359R4669K08729K86941
14417H462106n804j15852M35231J80509L8324j41435J07332j74747M60559K31549
14407I477772L24861N719K8634J7891K25427L97654j31252L91732L82786Q9880
14397A1211104P7920K68780J62388Q5473O02171l86551N85372J90543N1099O4618
$$ y = [4797039, 4427900, 4544223, 4600400, 4709894, 4844812, 4893529, 4791104, 4778128, 5129437, 4897250, 5108627, 5025297, 5258544, 5294783, 5152165, 5228026, 5580132, 5520477, 5743505, 5595496, 5886213, 5697741, 5967610, 5807960, 5811743, 5915785, 5841603, 6163760, 6588312, 6555091, 6511007, 6669921, 6894460, 6532288, 6711964, 6418563, 6622044, 7183575, 7253952, 7126879, 7540409, 7379675, 7541688, 7627412, 8141748, 7841408, 7871767, 7966436, 8175165, 8462106, 8456302, 8340450, 8775681, 8956190, 8994514, 8853079, 8960411, 8785664, 9246223, 9477772, 9802633, 9808352, 9836986, 9854877, 10080304, 10477958, 10346706, 10738438, 11121224, 11211104, 11289024, 11557804, 11720192, 11805665, 12407836, 12021285, 12606657, 12797200, 12848299, 12912917]
14387A2912917L96882K31680K09339N01920l88328Q70531j65101O03157j20971
14378A5052026P93940J6895K87985O53207J0364j08973Q89432O7242K60538M30090
14368A8352746N27977K32891L42961Q52242k1242L59917P11610R2064N78142P20648
14358B2749956L47885O02866O29428N80830L30646M75364J21104J408267L95291
14349B7641637N85757R30340N60803P41696Q90525M43831J045157P02896R82100
14340C4524742Q59379J114310Q98327R60371J104015J301959J383209P75592J479760
14331D4401664J491221J281658J539269J579663J339440J653309J913551K242550
14323E7442325J324629K385676K020116J959384K636833K210345K876905K298903
$$ y = [12912917, 13309799, 13541479, 13750818, 14252738, 13864410, 14734941, 14569840, 15172997, 15052026, 15845966, 15862861, 16150846, 16804053, 16814417, 16705444, 17594876, 17662118, 17922656, 18352746, 18880723, 19113614, 19456575, 20308817, 20287575, 20647492, 21359102, 21451166, 22029308, 22749956, 23097841, 23700707, 24330135, 24910965, 25241611, 25716975, 25838079, 27246346, 27641637, 28227394, 29157734, 29718537, 30460233, 31350758, 31794589, 32839746, 33542642, 34524742, 35384121, 36498431, 37396758, 38357129, 39461144, 40763103, 42146312, 42921904, 44401664, 45892885, 47174543, 48713812, 50293475, 51632915, 53286224, 55199775, 57442325, 58766954, 61152630, 63172746, 65132130, 67768963, 69979308, 72856213, 75155116]
14315G5155116K972600L229353L278874L062292L612411L784380M018961M148104
14307A03262091M471589M099267N083851N400665N382258N476814O369200O370767
14299A45916502O842599P414198P544295Q218172Q387498R011523R679178J0207914
14291B13221879J0553974J1034848J1852434J2476287J2262507J3783030J3571678
14284B98756637J3884395J4608676J4832202J4602768J4571385J4573452J3850084
14277C99679599J3322795J2395402J1307696Q886902M992379P40673o036573j765165
14269D43523708K287236m396946M72236j330126n451017p091380r826743j1712758
14261D06474210j3283072j4843507j4406952j5731362j5574075j5625376j4563498
$$ y = [75155116, 78127716, 81357069, 84635943, 87698235, 91310646, 95095026, 99113987, 103262091, 107733680, 111832947, 116916798, 122317463, 127699721, 133176535, 139545735, 145916502, 152759101, 160173299, 167717594, 175935766, 184323264, 193334787, 203013965, 213221879, 223775853, 234810701, 246663135, 259139422, 271401929, 285184959, 298756637, 312641032, 327249708, 342081910, 356684678, 371256063, 385829515, 399679599, 413002394, 425397796, 436705492, 445592394, 450584773, 451325446, 445288873, 443523708, 445810944, 441413998, 441886234, 440556108, 435105091, 428013711, 418186968, 406474210, 393191138, 378347631, 363940679, 348209317, 332635242, 317009866, 302446368]
14254C02446368j4251130j3840366j3420850j2760646j2230418j1971789j0842989
14247B13128180j0495003r993028r530361q357442q397712p827811p471489o932054
14239A44123280o352833o194467n530564n741006n259700m646734m780094m150222
14231A01467660l912117l727648l949640l561608l203205k865007k865948l085318
14223G4297169k912350k310988k332804k307314k334987k320275j655679j901729
14215E6221043j645503j651191j680377j364826j822703j578814j377136r67141
14207D4133352j031753j160339j273452j372032r80224j045944p73036j098399
14199C5398173q26488j040610j033518q42375p46002q13494n72655p81033p09472
$$ y = [302446368, 288195238, 274354872, 260934022, 248173376, 235942958, 223971169, 213128180, 202633177, 192640149, 183109788, 174752346, 166354634, 158526823, 151055334, 144123280, 137770447, 131575980, 126045416, 120304410, 115044710, 110397976, 105617882, 101467660, 97555543, 93827895, 89878255, 86316647, 83113442, 80248435, 77382487, 74297169, 71384819, 69073831, 66741027, 64433713, 62098726, 59778451, 58122772, 56221043, 54575540, 52924349, 51243972, 49879146, 48056443, 46477629, 45100493, 44133352, 43101599, 41941260, 40667808, 39295776, 38315552, 37269608, 36496572, 35398173, 34571685, 33531075, 32497557, 31655182, 30909180, 30095686, 29523031, 28741998, 28032526]
14190B8032526q92838n87019o56147n15574n11563r54441l67486k2547p72662
14181B2752249l37381q81396p20200k60272j40806p86167q3956n15721m78321
14172A8548029k41137n97530o3101o09956m1767l69891n41714r2770l32269j26776
14162A5531118o8281l04791p63446j0616k74828j48560l61806m44969O7276q0388
14152A3140709p09761K0738j81287k9363o00762k29576K23363j68608k69400k87906
14142A0908147k27388k24681P6862m58100K5567j96821J66279k75665l04923j08737
14132I380540J65546m3234p53610K4340q3403R6139j70042J67083n86680K65729
14122H462408l84481O5154l88744J69336l07421P067j77977O0176l67519O0104
$$ y = [28032526, 27139688, 26552669, 25896522, 25380948, 24869385, 23914944, 23547458, 23524911, 22752249, 22414868, 21533472, 20813272, 20553000, 20412194, 19626027, 19542071, 19026350, 18548029, 18306892, 17709362, 17646261, 17036305, 16994538, 16624647, 16082933, 15990163, 15657894, 15531118, 15462837, 15158046, 14394600, 14383984, 14109156, 13960596, 13598790, 13153821, 13221097, 13140709, 12430948, 12451686, 12270399, 12241036, 11640274, 11410698, 11634061, 11465453, 11196053, 10908147, 10680759, 10456078, 10532940, 10074840, 10100407, 9903586, 10069865, 9794200, 9489277, 9380540, 9546086, 9502852, 8749242, 8773582, 8690179, 8786318, 8616276, 8783359, 8196679, 8462408, 8077927, 8143081, 7754337, 7923673, 7616252, 7623319, 7445342, 7505518, 7137999, 7198103]
14112G198103M590j75746l15196N0847N3371l76369N0625q9637Q2831k38783J69334
14101F413970k01530j45191L035R4716j55140Q8683k03495J14792j56881m2260
14091E810699j36240k35993J1306j13660j57307P9903m19442O04660J58677o19349
14081D983254l91485M73887J12600o56930M28832k18520M4582m12824P5849R0824
14071D530069K3060J06054k09909l32441J9742m6282K01596L01609l75751m3986
14061D173761r9096L6563k69763P9799J27025k51269K67837J57520m24026n00708
14051C297643M54407j07854j7541k67919L36851n3225l06819L2939j95588J12689
14041C285583l31107J44800k723k19642K80527j78133M24046l98382o5960K54278
$$ y = [7198103, 7202693, 7026947, 6711751, 6762598, 6815969, 6439600, 6490225, 6400588, 6483419, 6244636, 6413970, 6212440, 6067249, 6070284, 6165000, 6009860, 6098543, 5895048, 6009840, 5852959, 5810699, 5674459, 5438466, 5449772, 5336112, 5178805, 5258708, 4839266, 5443926, 5602603, 4983254, 4591769, 5065656, 5178256, 4521326, 4950158, 4731638, 4776220, 4363396, 4439245, 4530069, 4553129, 4659183, 4449274, 4116833, 4136575, 4090293, 4291889, 4593498, 4217747, 4173761, 4074665, 4111228, 3841465, 3921264, 4048289, 3797020, 4064857, 4222377, 3798351, 3297643, 3752050, 3644196, 3626655, 3358736, 3695587, 3642362, 3335543, 3368482, 3172894, 3285583, 2954476, 3099276, 3096553, 2876911, 3157438, 2979305, 3403351, 3004969, 2939009, 3193287]
14031C193287n72912M84263K638l25015J70364k38357j37852m3025M49709O585
14021B989685l37291r1867J12543j66808K86080P4532k20293k54713L62626k16946
14011B537548K4873j07084J10059k20315p2304K81648m23038K17781k97910L0246
14001B081504o1600k84762L15329l78597K27193K65560m61760K23916J52163O0243
13991B139189o1781R06459J328349M103694J1295413J0329306M723208q695761
13983B6068076q806626o675325l838268j839425p29962l94123l78201O1005m21111
13974C046040l53171K16593r0310j82098j31654L6474p4519k06558J09800K8347
13964B398944L4979j07444K2453o3713k16922J58136j80916O0671J23313M4080
$$ y = [3193287, 2620375, 3104638, 3107276, 2782261, 2952625, 2714268, 2576416, 2533391, 2983100, 2989685, 2652394, 2560527, 2673070, 2506262, 2792342, 2866874, 2646581, 2391868, 2754494, 2537548, 2562421, 2455337, 2565396, 2345081, 2272777, 2554425, 2131387, 2349168, 2051258, 2081504, 2019904, 1735142, 2050471, 1671874, 1899067, 2164627, 1702867, 1926783, 2078946, 2139189, 2077408, 2983867, 4312216, 8415910, 19711323, 30040629, 34763837, 26068076, 17261450, 10586125, 6747857, 4908432, 4178470, 3784347, 3406146, 3467151, 3046040, 2692869, 2909462, 2819152, 2637054, 2505400, 2541874, 2467355, 2260797, 2370597, 2398944, 2433923, 2326479, 2348932, 2285219, 2068297, 2226433, 2045517, 2106188, 2229501, 2273581]
13954B273581k55112k61517J90328q5731K79235q8357l76042N06591n0817n87594
13944A544565K94030l2623j4212L70331l55155k12189L68437l35126l4706M05325
13934A998677l56752J50935o7700J09551k25611M63780p26668M77700j98419k0027
13924A605466j76265L32434k64332K51093j90015j55894l1405j1351K27198k22958
13914A363971Q2843j41812K30009J26589k34396j02075J12132M6400J08701k50614
13904A341748P789K12022k74376r0010K63314l59059J63445j00291J87654K97573
13894A649809m64887K0310q2158J48908Q2339j80689J43396l9727J52392J7337
13884A447030l50037K69589l44808L08953m0419q9953L5609R7539N2820n25836
$$ y = [2273581, 2018469, 1756952, 1947280, 1861549, 2140784, 2052427, 1676385, 2182976, 2132159, 1544565, 1838595, 1805972, 1791760, 2162091, 1806936, 1594747, 1963184, 1628058, 1593352, 1998677, 1641925, 1792860, 1725160, 1834711, 1609100, 2072880, 1346212, 1823912, 1625493, 1605466, 1429201, 1761635, 1497303, 1748396, 1558381, 1402487, 1371082, 1359731, 1586929, 1363971, 1446814, 1305002, 1535011, 1661600, 1427204, 1325129, 1437261, 1483661, 1592362, 1341748, 1349537, 1561559, 1287183, 1197173, 1460487, 1101428, 1264873, 1164582, 1352236, 1649809, 1184922, 1205232, 1123074, 1271982, 1354321, 1173632, 1317028, 1277301, 1429693, 1447030, 1096993, 1366582, 1021774, 1330727, 1290308, 1200355, 1235964, 1333503, 1386323, 860487]
13874H60487J99359J82824j19830M11802j22050k00029k88390J53137M0584M2135
13864A160029R7622m20043K82771k86635J44460M40K50080J68233r566l69623
13854A017768j22882J98809N0848J00885m64297K80123M7668J4139M7887q7944
13844A083004p3543o3703J20030k53624K88957L5443o3642j55926k44794N34829
13834A207031k47075P2117o1224J6516J64500k52882p2685J36442K15910n52515
13824F26135K67198l1733p7876K7020j10877o1234K96334r7671j20583J26026
13814H42739Q1677m26294M24545J74724k66257J43960o1030l30569L09654j35052
13804G58097R6005j04951R3042N5347k33124J39747k2252K23514j39690l39075
$$ y = [860487, 1059846, 1242670, 1122840, 1534642, 1412592, 1212563, 924173, 1077310, 1117894, 1160029, 1257651, 837608, 1120379, 833744, 978204, 978644, 1228724, 1396957, 1387391, 1017768, 894886, 1093695, 1144543, 1245428, 781131, 1061254, 1108922, 1123061, 1170948, 1083004, 1009461, 945758, 1065788, 812164, 1101121, 1136564, 1072922, 916996, 672202, 1207031, 959956, 1032073, 970849, 987365, 1151865, 898983, 826298, 962740, 1178650, 626135, 893333, 861600, 783724, 810744, 699867, 638633, 934967, 837296, 716713, 842739, 924416, 498122, 922667, 1097391, 831134, 975094, 914064, 583495, 893149, 758097, 854102, 749151, 842193, 897540, 664416, 804163, 781911, 1005425, 865735, 526660]
13794E26660K15013Q8155j48148J33816k01659K94925k07615j59795J97633j8588
13784G20397M89001l77118o1221l48872M78777k32895J76918j07219R2667j39475
13774F90960n5253M16819k28045J54313k53282j85246L8037K56991j40435L53688
13764A048547k93965j54962K99371l81095K22891J08241J88999l23055m8829B54638
13753G08891j08671j38605J40959j35735K27529P95A29374M15741N3733k47407
13743C51441L56248p8503L88759l05806j68528j24313j06121o4119O05201l9363
13733H14896l76874k3496J43341O1925k99974L12022m7019J37379K16661l61546
13723E77315j27230j96493K75735k03241K55249Q6755j7169l07993M32542l45326
$$ y = [526660, 741673, 829828, 681680, 815496, 613837, 908762, 701147, 541352, 738985, 720397, 1209398, 832280, 771059, 422187, 900964, 668069, 844987, 737768, 830435, 690960, 635707, 1052526, 824481, 978794, 725512, 540266, 578303, 835294, 694859, 1048547, 754582, 599620, 898991, 517896, 740787, 849028, 1038027, 714972, 666143, 254638, 708891, 600220, 461615, 602574, 466839, 694368, 695163, 129374, 545115, 598848, 351441, 707689, 629186, 1017945, 712139, 543611, 419298, 313177, 249058, 854259, 814896, 438022, 414526, 557867, 619792, 319818, 631840, 584821, 722200, 938861, 577315, 450085, 253592, 529327, 326086, 581335, 668090, 650921, 342928, 775470, 430144]
13713D30144P3685K1251B44040K85674K06647j07498m6806O9245K8775Q57J485
13702F82419N9137j99716K48095C13504K47955k11699J61389P9957j35119J30289
13692E86276J9140o1929j54595K17801j33150J52904B81591p9014L78783l6824
13682E44536A73154K38062J74704j51631j30537K12371j22644A91239L20950l0819
13672D81370N8659P0800A37000J71640M435K89804r3305N7154B18982K59348j11339
13661C66991r1653J46145L7372o7978k1625J62871k65131K48192p7411n0824K4662
13650D11611j93328L16686I9456L15708J54583J74934j24312k41306J23991j82622
13640C20432L32797G4884K35628L76587k81461k1930p110J84049k15975J07922
$$ y = [430144, 503829, 525080, 244040, 529714, 736361, 628863, 582057, 651302, 680077, 680934, 682419, 741556, 541840, 789935, 313504, 561459, 349760, 511149, 591106, 455987, 586276, 605416, 543487, 388892, 606693, 473543, 626447, 281591, 202577, 581360, 544536, 173154, 411216, 585920, 434289, 303752, 516123, 393479, 191239, 512189, 481370, 540029, 610829, 137000, 308640, 313075, 602879, 509574, 566728, 218982, 478330, 366991, 275338, 421483, 458855, 390877, 369252, 532123, 266992, 515184, 437773, 386949, 411611, 218283, 534969, 99456, 415164, 569747, 744681, 620369, 379063, 503054, 320432, 653229, 74884, 310512, 687099, 405638, 383708, 376598, 560647, 344672, 452594]
13630D52594J07090B09092M12048A33437N03631A54797L12274l8683n0298k8630
13620C49460K58375A90208L0833J68831j3802J88342A50248K21226R8392l3079
13610D36787r6793L36309k25668m3389K6927m3235R2925j4114m4733j53112O2749
13599C34653K02367J32906k07531j28636J14626H6333N01539k57509K43251k08086
13589C65528J4494m5960q7837j4996K66797J03257I5831J51007J49434A43696
13578C20719J32649R2988c1977A49971P1571M251P9841L6797p8186J87835B19396
13566A46416J01787J55846L7706A50818O9565R9574H6579l5640M01707j9823A53461
13554B87350K187J26381I1804J79764L1801R3780B2050N08313A22817k1925N68437
$$ y = [452594, 559684, 209092, 621140, 133437, 637068, 154797, 467071, 428388, 378090, 349460, 607835, 190208, 221041, 389872, 376070, 564412, 150248, 371474, 469866, 436787, 339994, 676303, 450635, 407246, 434173, 390938, 483863, 469749, 425016, 271904, 334653, 537020, 669926, 462395, 333759, 448385, 86333, 587872, 330363, 573614, 365528, 380022, 334062, 246225, 231229, 498026, 601283, 95831, 246838, 396272, 143696, 320719, 453368, 546356, -31977, 149971, 221542, 225793, 305634, 342431, 264245, 452080, 219396, 146416, 248203, 404049, 441755, 150818, 220383, 319957, 86579, 50939, 452646, 432823, 153461, 287350, 289537, 415918, 91804, 271568, 303369, 397149, 22050, 530363, 122817, 100892, 669329]
13543F69329A84105Q4210P1865A50127D2438M74593B41143H2750M3755K13609
13533C40114j6146j9345L9714K6464j78941J38178m0208C1660J93228p6196K7753
13522A76445C1676M04245l1778j18253A41413L9110K09476A32401K88046j7241
13512D03206j71043J51830I6501L04174j1533j62328Q9897R2036m1079j18676
13502B48992c19363A44079J3005J55228j34690B2792L24794n1456j40790M3593
13492A98933L0788l2193K33523j81926N3982j41664l7983j1946E1063L94481A10764
13480D43336k02306L2561K6186A37645l6130K03009H5675L21835l2412D7501K20968
13469B68469o2997a5778A8586L42146A30791L34470A29008J52414D8709Q9322
$$ y = [669329, 184105, 268315, 340180, 150127, 42438, 517031, 241143, 82750, 126505, 340114, 323968, 304623, 344337, 370801, 191860, 330038, 289830, 31660, 224888, 148692, 176445, 31676, 435921, 404143, 285890, 141413, 180523, 389999, 132401, 420447, 403206, 232163, 383993, 96501, 400675, 389142, 226814, 316711, 408747, 367668, 248992, -319363, 144079, 157084, 312312, 177622, 22792, 347586, 296130, 155340, 198933, 229721, 197528, 431051, 249125, 303107, 161443, 123460, 111514, 51063, 445544, 110764, 443336, 241030, 273591, 299777, 137645, 101515, 304524, 85675, 407510, 375098, 47501, 268469, 205472, -15778, 18586, 360732, 130791, 465261, 129008, 281422, 48709, 138031]
13459A38031K41156p9028N9546j51144L15169A98745n1683K43032A81727K98672
13449D80399a2212A82478k866a45255D35195I0383L69643g201B16355K03297C7335
13437b8944A77666L12014a22286a6143C35508q7182J77327G4603L32702M4519
13427D51824j60510J86873M442C2850d651A68630K92876e6591A70179J7695L56827
13416E44701l451k64990F6517P1755J58417r4628E0471K53606R1956j78695m5552
13405A71786Q4436G63K78449A449J99496e7328A13226n029l9872A5513F329J16514
13393A22843K12294D4601L58262K9411A93431J61865N6294A90550a35126E7607
13382D15783A78166l3662A9613L46016A39702J28797A10186l6098L51240A67042
$$ y = [138031, 379187, 300159, 359705, 208561, 523730, 198745, 147062, 390094, 181727, 480399, -12212, 182478, 179612, -145255, 435195, 90383, 460026, -7201, 216355, 419652, 37335, -28944, 177666, 489680, -122286, -16143, 335508, 248326, 425653, 74603, 407305, 451824, 291314, 478187, 482629, 32850, -4651, 168630, 461506, -56591, 170179, 187874, 544701, 541250, 276260, 66517, 138272, 296689, 202061, 50471, 304077, 396033, 217338, 171786, 256222, 763, 279212, 1449, 200945, -57328, 113226, 108197, 68325, 15513, 6329, 122843, 335137, 44601, 402863, 432274, 193431, 355296, 411590, 190550, -135126, 57607, 415783, 178166, 144504, 19613, 365629, 139702, 268499, 110186, 74088, 425328, 167042]
13371B16737n404E3952K55535h1708l8828B39435O7978a99531F19697j72332j75017
13360B72348G2760K13231K0411J91151k5093F2146N32826k63844A35914J15630
13350B51544r8252n8676i8460C26982l1515J48548j69237J68581k7106A97016
13339C6947J6078J59847F6899M0436J23372E4893r83M73849D5707A3201N5525
13328F8726K20358A34928J5920K95593k06374m833A17320M3280m9759J47416P8042
13317C36299A17916Q6304L68742A36134D8114O291L85125h3200A15057n3871R6927
13306A58113G3552O7404d9126C89777j22771J75632j91271H5123d6889B30839
13295I9349J73820D8120o62K3987L1858J30530H8613L55559A77903o8941i2571
$$ y = [216737, 211333, 53952, 309487, -81708, -120536, 239435, 307413, -199531, 619697, 447365, 272348, 72760, 285991, 306402, 497553, 472460, 62146, 594972, 331128, 135914, 251544, 153292, 94616, -98460, 326982, 295467, 444015, 274778, 443359, 416253, 197016, 36947, 53025, 212872, 66899, 107335, 230707, 54893, 53910, 527759, 45707, 13201, 68726, 289084, 134928, 150848, 446441, 240067, 235234, 117320, 160600, 110841, 258257, 336299, 117916, 204220, 572962, 136134, 48114, 54405, 439530, -83200, 115057, 61186, 158113, 73552, 140956, -49126, 389777, 267006, 442638, 251367, 85123, -46889, 230839, 99349, 273169, 48120, 47458, 71445, 103303, 233833, 88613, 444172, 177903, 108962, -92571]
13283A93422g1098P833D08384j10950b6696k0919A31210L4761p906J6169a02369
13271D24657A76552a50903B71295G3513a873D51K10531a07707A55270n8995K9786
13260A26061a29092C82939c6524A28095M1533c93356C3541J93918G3724d2708
13249C41861c8412D5583Q8693Q5867H0349a94994K4028B98042D6762e1834D64702
13237a97570A63585D8947K2159a49322A5459N3426J4997O6317n9590J60153j17468
13226A33294l1508D65M1859J39478b1904B5564K08940K0254J14329A68919f8676
13214c2193B73420J32527I8325J03231j9676a32778A51863j9576K44636I4346
13203B80644i8678A3292N4829h0400L9147I9675B0047b92787B65648j08628l5620
$$ y = [193422, -71098, -63265, 408384, 297434, -26696, -47615, 131210, 165971, 158065, 174234, -102369, 424657, 176552, -150903, 271295, 73513, -1873, 451, 210982, -107707, 155270, 96275, 126061, -129092, 382939, -36524, 128095, 169628, -393356, 33541, 227459, 73724, -42708, 341861, -38412, 45583, 134276, 220143, 80349, -194994, -170966, 298042, 46762, -51834, 464702, -197570, 163585, 48947, 71106, -149322, 15459, 68885, 83882, 150199, 90609, 250762, 133294, 101786, 465, 42324, 181802, -21904, 25564, 234504, 254758, 369087, 168919, -68676, -32193, 273420, 405947, 98325, 201556, 181880, -132778, 151863, 132287, 376923, 94346, 280644, -98678, 13292, 68121, -80400, -41253, 99675, 20047, -292787, 265648, 157020, 121400]
13192A21400e3675j0609B04275a15947k1720m0641A87713m7931n2738b43091I031
13180b5099B18347p3056A5280J27645i2931m767D10736a64907A0722J59422k5823
13169A44321l3881P7019C9224f2842A173K24997b26764B04877O9111a7510C01248
13157B70153j04900I565a27548B31546a54247K7290O2530a2788j44565A98703
13146B98042j11284a6434B8299b4164D2551J77647P5232K0511A6481L07055a12112
13134C22299c9859D2030Q8118J11330f3483A98831K09850a33783D27011B2005
13123a18388A07424J11582C3840J9381J09809b30345I0243h0318C10028A16633
13112a25247A12409C079K48347I6243J52293B1183h7978D03715j27537A11457
$$ y = [121400, -53675, -64284, 204275, -115947, -137667, -178308, 187713, 139782, 87044, -243091, 9031, -25099, 218347, 145291, 15280, 142925, -92931, -97698, 410736, -164907, 10722, 170144, 144321, 110440, 187459, 39224, -62842, 1173, 226170, -226764, 204877, 273988, -17510, 301248, 270153, 165253, 9565, -127548, 231546, -154247, -126957, -64427, -12788, -157353, 198703, 298042, 186758, -16434, 28299, -24164, 42551, 220198, 295430, 315941, 16481, 323536, -112112, 322299, -39859, 42030, 130148, 241478, -63483, 198831, 408681, -133783, 427011, 22005, -118388, 107424, 219006, 33840, 53221, 163030, -230345, 90243, -80318, 310028, 116633, -125247, 112409, 3079, 251426, 96243, 248536, 21183, -87978, 403715, 276178, 111457]
13101H940L61501h0483C36654F8700h1253r4272h2365q1384A85866H2939P1927
13090A54866f6182A66707D066h2961A00608L19450A79699I141L68363p2751e8671
13078C4672L96358g6263B47265n3970P213o1165a05239E2109M84694c0920a4201
13066C2426K78829n5881C2693f9981A09956A178K92867B4005J2858K97185j4980
13055C19068a72625Q3938C81482d8967k2715C76730H151a10017A13951m4906b0659
13043a94386e975A88094c9166a0126B20103o6939J05188I0262J6956J12970J43631
13032C63819H1798j7296a68408F2696M151b07481D24927A0360M77608b1528H6846
13020b05237A84111h0179E0487a19883E87207c11256c6642A10550J27108d33446
$$ y = [8940, 370441, -80483, 336654, 68700, -81253, -175525, -82365, -163749, 185866, 82939, 154866, -66182, 166707, 4066, -82961, 100608, 420058, 179699, 9141, 377504, 304753, -58671, 34672, 431030, -76263, 247265, 193295, 200508, 139343, -105239, 52109, 536803, -30920, -14201, 32426, 311255, 255374, 32693, -69981, 109956, 1178, 294045, 24005, 36863, 334048, 319068, -172625, -88687, 381482, -48967, -71682, 376730, 8151, -110017, 113951, 69045, -20659, -194386, -5975, 188094, -39166, -10126, 220103, 153164, 258352, 90262, 107218, 220188, 363819, 81798, 64502, -168408, 62696, 66847, -207481, 424927, 10360, 487968, -21528, 86846, -205237, 184111, -80179, 50487, -119883, 587207, -311256, -36642, 110550, 237658, -433446]
13009c372B28531a41656G4053O192J33230A02124i6488A33719K03158J2978J26122
12998D75977A41949L5430b08069P3122F0427g2692n9716c8841A6768b31786E4409
12986B55975a77585A9282O3034E807O252L60121A34309L27470G582J97547g5504
12974A1851L8713L8587C2668D245K3626a52903P1290F4300a58700B21171A05062
12962a07790q9492B66539C9094c82942A31344J21182E9837b2914m352j7643C8533
12950A35384F0235K28729h50B09319A00593m7767B0498O6169a52560C2905J70828
12939B03733b6027A97634a0507l3079C2038i9691N414C57921b13696i998B0473
12927a02460F0845J70215Q9197a34663m7774A24733n1440k7271d57514B49016
$$ y = [-3372, 228531, -141656, 74053, 80245, 213475, 102124, -96488, 133719, 336877, 349855, 475977, 141949, 177379, -208069, -134947, 60427, -72692, -132408, -38841, 16768, -231786, 54409, 255975, -177585, 19282, 82316, 5807, 12059, 372180, 134309, 461779, 7582, 205129, -75504, 11851, 50564, 89151, 32668, 4245, 27871, -152903, -81613, 64300, -158700, 221171, 105062, -107790, -197282, 266539, 39094, -382942, 131344, 252526, 59837, -22914, -27266, -44909, 38533, 135384, 60235, 288964, -850, 209319, 100593, 52826, 20498, 86667, -152560, 32905, 203733, -26027, 197634, -10507, -43586, 32038, -99691, -94277, 357921, -213696, -9998, 20473, -102460, 60845, 231060, 320257, -134663, -182437, 124733, 73293, 46022, -457514, 249016]
12916E9557B6083J23907o8189l1097K10648a36761C9924b8470C35477b045A36457
12904A40505a64861h0306C3500a9616A6221E479J7302g8686C06135i5028C09680
12892A21297a11913A4004K2293b4770j88779I1773a22516A72168b5616A14782
12881C0548K16243C0234a98944A25325h6065q4183M2621B1189a63149I3296J62949
12870B56245b41696B10185K2073a4333k20405C05273a91p955D5308L4240b1024
12858E3206c118r3497R781j85673D7511O2265f1702A75724G920f804I5413h2848
12845g1318D6206a64653O7887A18619g8125F6514J36041l7856e0957b2167j62076
12834a84243d4892A54615K415K43925a28167B3151a2591k50438a12345B43724
$$ y = [59557, 26083, 149990, 81801, 50704, 261352, -136761, 39924, -28470, 335477, -2045, 136457, 140505, -164861, -80306, 33500, -19616, 16221, 5479, 22781, -78686, 306135, -95028, 309680, 121297, -111913, 14004, 36297, -24770, -213549, 91773, -122516, 172168, -25616, 114782, 30548, 246791, 30234, -198944, 125325, -86065, -170248, -127627, 21189, -163149, 93296, 256245, -241696, 210185, 232258, -14333, -234738, 305273, -191, -8146, 45308, 79548, -21024, 53206, -3118, -96615, -86834, -272507, 47511, 109776, -61702, 175724, 7920, -6804, 95413, -82848, -71318, 46206, -164653, -96766, 118619, -78125, 66514, 202555, 164699, -50957, -22167, -184243, -44892, 154615, 157030, 400955, -128167, 23151, -12591, -263029, -112345, 243724]
12823h0695j52873k2526A63782J53461e6454A57708K80250f4024j56128C95681
12812C9215a07180H943f9611C2353I306J05092c188C96025a93119B35497l258
12801B32239g0571A06330A9131J56093a8125k7700B01867h8961I9411d6379k20324
12790b66703H3177g8777B5232a27882A72272J2873i0233m2200K3962A7118P8164
12779I5282R5214Q595a15594j54114J4455A86643B7929J44022g0961a0941A27387
12767b06145R6139B87173c2871j06958B7761a75694O7644A36832K73277I668K17224
12756B26892G9975j4407O9378h347A79133H1032a04895H0463d4089A18910g258
12744A9780k732b0201B01723B0698J23351L1545F2898b12753F086h1129j47410
$$ y = [-80695, -233568, -256094, 163782, 317243, -56454, 157708, 437958, -64024, -220152, 395681, 39215, -107180, 8943, -69611, 32353, 9306, 114398, -3188, 396025, -193119, 235497, 232239, -70571, 106330, 19131, 175224, -18125, -45825, 201867, -88961, 99411, -46379, -266703, 83177, -78777, 25232, -127882, 172272, 185145, -90233, -132433, -108471, 17118, 95282, 190496, 199091, -115594, -269708, -255253, 186643, 27929, 171951, -70961, -10941, 127387, -206145, -110006, 287173, -32871, -139829, 27761, -175694, -108050, 136832, 410109, 9668, 226892, 79975, 65568, 134946, -8347, 179133, 81032, -104895, 80463, -44089, 118910, -7258, 19780, 17048, -20201, 201723, 20698, 144049, 175594, 62898, -212753, 6086, -81129, -228539]
12733b28539A11934J87905l8114b02343C8505M86796b0737H8187e7713k17365
12723b75078B54437a27405l2819C47295C0331K36485j9031q9652F0828M1482K0328
12712A22638c37234A36122b06536I4867j7356L06755j55443D4365J8957A1094
12701A1205M60178r9550e88A87025E6477K53111F2432N7885a93105O598B25558
12689i2048m6748r6251j482c4643A37658J73807a9665j51133A13584J87550K6520
12678C27654A40820E6402k598J11711G3456J09669K8262L33129c63438F047R4315
12667A00362C7226J8617J00062K2120B8122b35308A13637k6062e7661D9982i0268
12655c3832C6040N32327a39728A51173B4393M4721K7408c6723E7027c8922G1539
$$ y = [-228539, 111934, 299839, 261725, -202343, 38505, 525301, -20737, 88187, -57713, -275078, 254437, -127405, -160224, 347295, 30331, 266816, 247785, 158133, 60828, 102310, 122638, -337234, 136122, -206536, 94867, 77511, 384266, 228823, 44365, 63322, 11094, 11205, 471383, 371833, -588, 187025, 56477, 309588, 62432, 120317, -193105, -186507, 225558, -92048, -138796, -235047, -236529, -34643, 137658, 311465, -19665, -170798, 113584, 301134, 327654, 140820, 56402, 53804, 165515, 73456, 183125, 211387, 544516, -363438, 6047, 100362, 37226, 55843, 155905, 178025, 28122, -235308, 113637, 87575, -57661, 49982, -90268, -33832, 36040, 568367, -139728, 151173, 24393, 69114, 96522, -36723, 57027, -38922, 71539]
12643b5148A76212d9094C92646H9188b1679j35745k0413D89788a16680r049o4611
12632a90340B51704J62947j50329A6058n943L35426C7126L00746j68788f5938
12621a789A17672J09337J5038L3914a03758l5587B4006L78860B5270J38962E1779
12609b35988g0233E07377a21760A90905f9558G064Q5342j8709g3479J4727B28091
12597E3634J86758A06440J23817h4468g862C27142I6445b17734A60172g3499B48789
12585c9209D6447r68c53574J52828A51136G3796a7400l1671C4789K31980c73133
12573a80662A26509f5641A7931M90817k45011m6434n2633d765A66437a12597F0326
12561C615f8871J5125l3571B38065D7981c03789b9539A03342a51933B96670c4117
$$ y = [-25148, 176212, -49094, 392646, 89188, -21679, -157424, -177837, 489788, -116680, -125729, -190340, 251704, 414651, 264322, 16058, 10115, 345541, 37126, 337872, 169084, -65938, -1789, 117672, 227009, 242047, 275961, -103758, -139345, 24006, 402866, 25270, 164232, 51779, -235988, -70233, 507377, -121760, 190905, -69558, 7064, 92406, 73697, -73479, -58752, 228091, 53634, 240392, 106440, 230257, -84468, -7862, 327142, 96445, -217734, 160172, -73499, 248789, -39209, 46447, 45479, -353574, -200746, 151136, 73796, -17400, -49071, 34789, 266769, -373133, -180662, 126509, -65641, 17931, 508748, 263737, 217303, 164670, -4765, 166437, -112597, 60326, 3615, -68871, -53746, -87317, 238065, 47981, -303789, -29539, 103342, -151933, 296670, -34117]
12549a34949C51197c11663A67409j2026b3729A29111P2075a81253g6436E1358
12538a8574j63308B94442a35485d7316k4725j05729F9307j3933P9137c2627A65435
12526A43230b72246E3775e48661b62386c8474k94057e1077A40865C3354J42153
12516A75507j0184e9907J2622A71063J42141E4194c9913A23950D6019h1001j40467
12505b21468m7800A49313c04894h4032A75925a59646o2095I8527K30695a00644
12494A41352B0052a4961A81765o3842m8761D88d11818A09662a25266q8803A34028
12482B14691a98317j34935C53550b77205p1102K6361A1194e1069k89509A19976
12471i63j56979q3714d9336j56877k7962d7053k11654M1386J08306M869f908k09913
$$ y = [-134949, 351197, -311663, 167409, 155383, -23729, 129111, 201186, -181253, -76436, 51358, -18574, -181882, 294442, -135485, -47316, -72041, -177770, 69307, 55374, 134511, -32627, 165435, 143230, -272246, 53775, -548661, -262386, -38474, -332531, -51077, 140865, 33354, 175507, 165323, -59907, -47285, 171063, 313204, 54194, -39913, 123950, 46019, -81001, -221468, -269268, 149313, -304894, -84032, 175925, -159646, -221741, 98527, 329222, -100644, 141352, 20052, -14961, 181765, 117923, 69162, 488, -411818, 109662, -125266, -214069, 134028, 214691, -198317, -333252, 353550, -277205, -348307, -321946, 11194, -51069, -340578, 119976, -963, -157942, -241656, -49336, -206213, -234175, -47053, -258707, -217321, -109015, -104146, -6908, -216821]
12459b16821A3801c82688I2482b50414A3592g2711B2775R1167N9662b40915B94694
12447a56972A45081l9006k3961a76597m3391B4578i141J793I888i773B21492G1899
12434B92514n8382f8160j45510A20711B0147J60084a22868N7987j43675E1783
12423d2080G0478a21990e5701G8988b5488m2958B8981b7583A18312Q4723R1062
12412B94097j37727a77256g3281j03311h193A0405K39889E7339a1346L248B55405
12400f297A80461b85709A2477h7996j5901b6780B71838G856a80196l2661j60803
12389c73660C9893K78843b8343A87385j298a95587B93727a22054A59733Q3458
12379B43191A05838K18810A00071a47706K9668A21898K18124j58780b70603D353
$$ y = [-216821, 13801, -382688, 92482, -250414, 13592, -72711, 22775, 113942, 173604, -240915, 294694, -156972, 145081, 106075, 82114, -176597, -219988, 24578, -9141, -7348, 9888, -9773, 221492, 71899, 292514, 234132, -68160, -213670, 120711, 20147, 180231, -122868, -64881, -208556, 51783, -42080, 70478, -121990, -55701, 78988, -25488, -68446, 28981, -27583, 118312, 203035, 294097, 156370, -177256, -73281, -176592, -8193, 10405, 250294, 57339, -11346, -8098, 255405, -6297, 180461, -285709, 12477, -87996, -103897, -26780, 271838, 7856, -180196, -212857, -373660, 39893, 318736, -28343, 187385, 186087, -195587, 293727, -122054, 159733, 243191, 105838, 324648, 100071, -147706, -118038, 121898, 340022, 181242, -270603, 4353]
12368G8413K5348J14697J05883C3693a10562B19765h0159o4903D7482J52963o6155
12357A34290K48417A67337e7847k31566A0849f7370A42457n6325a62729B10437
12346C10656a395A1405i445B21392A06920a56114g1983q2440L9364E9111c826
12334A86013K04714A59715o7840a53834A3881g6456H4268l2314b9053A87589b49963
12322b25303f1207B43839c06983F506f8109B72842a15309A70678R3758f6924j10995
12311a77919D2087i816C78044b78790A74110D5706E72N3073I721c5676j2442J7416
12299c0702C80688j1647a49940b8271j29641b6952k90553J50012m5505A36346
12288B83399I7239b700k88988A3747L0483c82408a0619B82983a16175C13306G2862
$$ y = [78413, 103761, 218458, 324341, 33693, -110562, 219765, -80159, -145062, 47482, 200445, 134290, 382707, 167337, -57847, -289413, 10849, -67370, 142457, 86132, -162729, 210437, 310656, -1395, 11405, -9445, 221392, 106920, -156114, -71983, -154423, -115059, 59111, -3826, 186013, 390727, 159715, 91875, -153834, 13881, -76456, 84268, 51954, -29053, 187589, -249963, -225303, -61207, 243839, -306983, 6506, -68109, 272842, -115309, 170678, 264436, -66924, -177919, 42087, -9816, 378044, -278790, 174110, 45706, 572, 53645, 9721, -35676, -48118, -30702, 380688, 369041, -149940, -28271, -157912, -26952, -317505, -167493, -212998, 136346, 283399, 97239, -2700, -291688, 13747, 44230, -382408, -10619, 282983, -116175, 313306, 72862]
12276b05967A47277f4220E4825A9747m38d5597B35010h3181A51222a14914B28277
12264B51741a0299A52922J87906A23765a8820l56795A20095J52267j33595i5725
12253D6692j6820h8795C97193H8341K59945a70163A17662J73334h1081a5260E4236
12241g2844r1397A71958e5598B19605j3200l3955c2172l8170A03314K50200o8183
12230B85331b63735e590o0127k0240F14568k40066A47487C8529K99711a249A58765
12218D24660r3911L8543j26675n266A9058L711K10857K05134A1145M18512D9896
12206d4073C65841e2417E785J17756L8925J03812A03278b965A83951K8269O2552
12195B74772J31147J39361k12651g0897A46177a00921C12038a93315E23455C0980
$$ y = [-205967, 147277, -64220, 54825, 19747, 19309, -45597, 235010, -83181, 151222, -114914, 228277, 251741, -10299, 152922, 340828, 123765, -18820, -375615, 120095, 272362, 138767, -95725, 46692, 29872, -88795, 397193, 88341, 348286, -170163, 117662, 290996, -81081, -15260, 54236, -72844, -164241, 171958, -55598, 219605, 206405, 172450, -32172, -70342, 103314, 353514, 285331, -263735, -5590, -65717, -85957, 614568, 374502, 147487, 38529, 338240, -1249, 158765, 424660, 330749, 369292, 242617, 237351, 19058, 22769, 233626, 438760, 11145, 429657, 49896, -44073, 365841, -52417, 5785, 123541, 162466, 266278, 103278, -2965, 183951, 212220, 274772, 405919, 545280, 332629, -70897, 146177, -100921, 312038, -193315, 523455, 30980]
12184E2371f471n0105J9965q1470b6957A970M24778E353J85536K0419k0215N2474
12172B43567j4797i4191B20111J30138A37725M5033B5628a05667C37042A45760
12161g3738D73648A67988J51627A00055J6361a92460f931j80743C14118j42159
12151A71959L69656A82058A2908O1021f970B519L12711A2801J27824g3474J8760
12140e4714k14880a33557n4940G4597a87491B55805p5108b15171A90042a35647
12129a89825B11566j05319Q2047i512B06428M8807a80553j65230d5014B96882
12118h4031d0780j86028A62568D4997h1370K0531j5112C55177g2970B71900q6003
12107A85897M0687a37155J5053e9087A17555p358b48319D6563J12717l3122N3390
$$ y = [52371, -6471, -56576, -36611, -118081, -26957, 1970, 426748, 5353, 190889, 211308, 191093, 243567, 228770, -94191, 220111, 350249, 137725, 182758, 25628, -105667, 337042, 145760, -73738, 473648, 167988, 319615, 100055, 116416, -192460, -6931, -187674, 314118, 171959, 541615, 182058, 12908, 73929, -6970, 2519, 315230, 12801, 140625, -73474, -54714, -269594, -133557, -188497, 74597, -187491, 255805, 180697, -215171, 190042, -135647, -189825, 211566, 106247, 188294, -9512, 206428, 255235, -180553, -345783, -45014, 296882, -84031, -40780, -226808, 162568, 44997, -81370, -60839, -75951, 355177, -72970, 271900, 185897, 226584, -137155, -122102, -59087, 117555, 110197, -248319, 46563, 159280, 126158, 179548]
12096A79548m6292b43286J19741A14625D7602a94555K2590e0306j76583G2104
12085a33222A33427f4495d753k0548n5646B63204J4028M04418M90178L98603F84598
12073F74130d6925a069A08916J00989I3824a83836I5441H127c24450a27924C7193
12061b76453H3890J80970k390a5898C4206O8279b24103A36925b22548l9892B11081
12049a37549O1073q572A35429i7621o7716C17142A49323P8158b04190A32986d3695
12037e9797l2256A29898d5317A20415M6033c80758a80455C22609a76470H640a99622
12025a38238G749b65958H2804l6120f0695j1188F0870a5138A40234M9144J06911
12014B96289b8344k96182a49339f8975q1755c3728n2370o660B43448l4582b61143
$$ y = [179548, 133256, -243286, -123545, 114625, 47602, -194555, -171965, -50306, -226889, 72104, -133222, 133427, -64495, -4753, -25301, -80947, 263204, 277232, 681650, 1171828, 1570431, 684598, 674130, -46925, -1069, 108916, 209905, 93824, -183836, 95441, 8127, -324450, -127924, 37193, -276453, 83890, 264860, 262470, -15898, 34206, 102485, -224103, 136925, -222548, -262440, 211081, -137549, -76476, -85048, 135429, -97621, -165337, 317142, 149323, 227481, -204190, 132986, -43695, -59797, -92053, 129898, -45317, 120415, 166448, -380758, -180455, 322609, -176470, 8640, -199622, -138238, 7749, -265958, 82804, 46684, -60695, -71883, 60870, -15138, 140234, 189378, 296289, -28344, -324526, -149339, -68975, -150730, -33728, -86098, -92758, 243448, 208866, -261143]
12002f7387l0426B53153p8854a03361E3846H137a64926D7202a3195k09176K1946
11991b00425D2170c546F3666K31542h5102L1875A8724Q1469b07173a02619C4668
11979c1979q6857a1119k12461B60243a39499D8206D448O857d6992A72589K47574
11968D20163d5658A68406a48564B69567A10248C3649b8628A93763B9494K37275
11958B66769a55183c1699j16905n6513F193d14974e3893b3975A80800a338I5216
11946I3477L6279h5781A04551c17590d7077I2821P187d2665H1895a35096f0887
11934b14094B20795j075b14346F8859b62202d8892n2153L6604B37140a30339d0640
11922c0904k5073C8579J9509J44104c42596a15787B26908I1863b1687j26247A77154
$$ y = [-67387, -97813, 253153, 174299, -103361, 53846, 8137, -164926, 47202, -13195, -222371, -200425, 42170, -3546, 63666, 295208, -85102, -53227, 18724, 100193, -207173, -102619, 34668, -31979, -118836, -11119, -223580, 260243, -139499, 48206, 4448, 11305, -46992, 172589, 420163, -45658, 168406, -148564, 269567, 110248, 33649, -28628, 193763, 29494, 266769, -155183, -31699, -148604, -205117, 6193, -414974, -53893, -23975, 180800, -1338, 95216, 93477, 129756, -85781, 104551, -317590, -47077, 92821, 100008, -42665, 81895, -135096, -60887, -214094, 220795, 219720, -214346, 68859, -262202, -48892, -101045, -64441, 237140, -130339, -40640, -30904, -55977, 38579, 58088, 202192, -342596, -115787, 226908, 91863, -21687, -147934, 177154]
11910a92224G5345l5199O458b75525P4881C29840h5506B23126c9357k32456J08864
11899a62949h1381k57290i6511k80209a68817f4144o2170a6896D49095b53447
11888e1577H2619K01802c5589e271j56404G3037K30919p5075j5320Q236b8498
11876F7152a69916i406j97887A2096J5630J80668m4365G5078B7203d9518k66997
11865c16515A97538i9774B2065a92340A80448j5970a75952F8218a49566e7684
11854c84948J89573A2165J26977k3565M2499N4717a81379J6207J7108r6635C7974
11842D9899a03227L5145C06165h9571n0031p7583H0231B4204J68867a88754A00328
11830d0953A41228a44369g0947j11098d8482F910g0622k00254Q8322A44642b24455
$$ y = [-192224, 75345, 40146, 46604, -275525, -200644, 329840, -85506, 223126, -39357, -271813, -162949, -81381, -338671, -96511, -376720, -168817, -64144, -126314, -16896, 449095, -253447, -51577, 82619, 284421, -35589, -5271, -161675, 73037, 303956, 228881, 213561, 221797, -28498, 67152, -169916, -9406, -207293, 12096, 27726, 208394, 164029, 75078, 27203, -49518, -316515, 197538, -99774, 22065, -192340, 180448, 164478, -175952, 68218, -149566, -57684, -384948, -195375, 12165, 139142, 115577, 158076, 212793, -181379, -165172, -148064, -244699, 37974, 49899, -103227, -68082, 306165, -89571, -139602, -217185, 80231, 24204, 193071, -188754, 100328, -40953, 141228, -144369, -70947, -182045, -48482, 6910, -70622, -270876, -182554, 144642, -224455]
11818b82600M0132A65710a19556k30108J57550A70003C7516B650a30482j87253
11808c17735J18177B9143a27124B23696G7632d6481j65436a9280k16974N459A4666
11796b69428H4812g1376n766K9058A73393e7787A73645b917q3387B17047J27D2578
11783d8052A09349b17040L0611B6351a04440H3840b6596A984a59384a3399b759
11771A18571J1243a54085i718r4957G3911a70969C9390d7730D5944a43148A91602
11759i438j38639d469l16927a12593K4433A66302a72782j34267A51014d4866K384
11748d2482j65212O4309H7355M9587g5122A90247G7710a41209k4714J6604L0216
11737a19103B10474A4183c6144F3574i6035A10667K37995a67417N3643D5249h8578
$$ y = [-282600, -242468, 165710, -119556, -349664, -192114, 170003, 37516, 2650, -130482, -317735, -199558, 29143, -127124, 223696, 77632, -46481, -211917, -19280, -236254, -230795, 14666, -269428, 84812, -71376, -77142, -48084, 173393, -57787, 173645, -2917, -86304, 217047, 217174, 42578, -48052, 109349, -217040, -186429, 26351, -104440, 83840, -26596, 1984, -159384, -13399, -2759, 118571, 129814, -154085, -9718, -104675, 73911, -170969, 39390, -47730, 45944, -143148, 191602, -9438, -148077, -4469, -321396, -112593, -88160, 166302, -172782, -307049, 151014, -44866, -42482, -207694, -143385, 87355, 136942, -75122, 190247, 77710, -141209, -165923, -149319, -119103, 210474, 14183, -36144, 63574, -96035, 110667, 348662, -167417, -113774, 45249, -88578]
11725f3200A2886K6222h6529l70896I5741a97531E4807a19394a6215G7555c41843
11713e6050E6555e54m11648g2642J4061j33322P0738A34711B2363f4382b2488
11701B02292A6427e4393C35186o6973f926C0058a04593A98906e1491A38985J06892
11690B45877B4864b49096A60783J6363O4005b61581F5566J05639d2063p6941L0896
11679h8108p2179B13756Q634o3498J84699P1986h2984D2829j9940b84587a0942
11667A59418o5222k4203J71398a13646A6110d0120B06867D5913N0074K8313R1424
11656B15724i7970A12319a9358A17553A5764L54265a22538j66104B2234N1958
11646G4192R3375a27557f1322B5311N60b12078L0390A17558B4139b20610a01796
$$ y = [-63200, 12886, 39108, -86529, -457425, 95741, -197531, 54807, -119394, -16215, 77555, -341843, -56050, 56555, -554, -412202, -72642, -58581, -191903, -121165, 134711, 22363, -64382, -22488, 202292, 16427, -54393, 335186, 268213, -6926, 30058, -104593, 198906, -51491, 138985, 245877, 24864, -249096, 160783, 177146, 241151, -261581, 65566, 171205, -42063, -119004, -88108, -160287, 213756, 222390, 158892, 343591, 415577, -82984, 42829, 22889, -284587, -10942, 159418, 94196, 69993, 241391, -113646, 16110, -40120, 206867, 45913, 95987, 124300, 215724, -97970, 112319, -19358, 117553, 15764, 370029, -122538, -288642, 22234, 74192, 167567, -127557, -61322, 25311, 25871, -212078, -181688, 117558, 24139, -220610, -101796]
11634A01278a31819C3843b91679D1031l157r450O0718a96682h5324j41481c1259
11622I7400a54398G692b32411e0334B62755g9052A23410o0046a04020o0246A40765
11610G8601k4707i2317C18835R1604g2193m6542C48481C2164a89014b9178B0920
11598B38468K9660o1095p2232a8542j9031J7154E1426A9296a13070A53146A4232
11586e6803A03830K89842I4190a33373g234B02028i6471j0973A60121b38360h9418
11574A07879J21986I2462a60868j41097B2030K49583C1472A0753J96681c55083
11563B9353K12410J86174a18495A90152d9383A85533l3535k8794a59344H1649
11552D06971A7990b28588f929B4996h9410E8617O9823d8262D682O6173C2457J86233
$$ y = [101278, -131819, 33843, -291679, 41031, 37874, 28424, 89142, -196682, -85324, -226805, -31259, 97400, -154398, 7692, -232411, -50334, 262755, -79052, 123410, 63364, -104020, -164266, 140765, 78601, 53894, -92317, 318835, 410439, -72193, -118735, 348481, 32164, -189014, -29178, 20920, 238468, 268128, 207033, 134801, -18542, -37573, -20419, 51426, 19296, -113070, 153146, 14232, -56803, 103830, 393672, 94190, -133373, -7234, 202028, -96471, -107444, 160121, -238360, -89418, 107879, 229865, 92462, -160868, -301965, 22030, 271613, 31472, 10753, 207434, -355083, 29353, 241763, 427937, -118495, 190152, -49383, 185533, 151998, 123204, -159344, 81649, 406971, 17990, -228588, -6929, 24996, -89410, 58617, 128440, -48262, 4682, 70855, 32457, 218690]
11540B18690l2508J15513a29359m1685K3613I9596a00275A83625b79343I4537
11529B8440Q1279l2057d14326D6432h661m6366p4937l0123h944q8435B37650g998
11516D96J23719a8098B3060P6984l4539J46117C6289K5481J36852k7097G7062
11504B67582J36525A07362M2658k7868a72159A1440N14690k47498A04566d5865
11493B0599D598J67590K41078j86335L2265a35929C29807I2941J03777E88J84554
11482A85142J46591a26762I0840M3225O2471b86253B81725d5352n3958B46101
11471b54540D06807G8269a40765B22095F4305b7558C37870C8508g6527B11168
11460B23559K63911A31471B9303h5124A21181F605K4635N0875h8615C08881F7068
$$ y = [218690, 186182, 301695, -129359, -171044, -147431, 99596, -100275, 183625, -279343, 94537, 28440, 109719, 77662, -414326, 46432, -8661, -55027, -129964, -160087, -8944, -97379, 237650, -7998, 496, 124215, -18098, 23060, 100044, 65505, 211622, 36289, 61770, 198622, 171525, 77062, 267582, 404107, 107362, 150020, 122152, -172159, 11440, 526130, 278632, 104566, -45865, 20599, 4598, 172188, 413266, 226931, 259196, -135929, 329807, 92941, 196718, 588, 185142, 331733, -126762, 90840, 134065, 196536, -286253, 281725, -45352, -99310, 246101, -254540, 406807, 78269, -140765, 222095, 64305, -27558, 337870, 38508, -76527, 211168, 223559, 487470, 131471, 29303, -85124, 121181, 6605, 31240, 82115, -88615, 308881, 67068]
11448B29924k1277j00602c3870C12959j48725B5521Q8862J38903j12277C9161
11437D08413a47016I430b03426a5429l9208H4071a64961m6541i1141F9380Q8096
11426A57476c7292H8881e8408J1825m68828B04690h3345b0391j68187k4845j8100
11415b31523A87559D9328K86342b02426e7165p2001A39397k3367r179b55241B05453
11403I7625m070p315C7909K52538d5349B25505a36411B12796A3115J20025B6071
11391I1699a89258a0461B2522R6016E462j631a53775j90823i2636H6496J38563
11380B25059B4251P7860a02032A32858l3876J02084H7462K13209D7200L08976
11370C56176D9715J28012H4587L2950f8354j9593j15991A07048b44476j25740
$$ y = [229924, 208647, 108045, -33870, 312959, 164234, 25521, 114383, 253286, 141009, 39161, 408413, -147016, 9430, -203426, -15429, -54637, 84071, -164961, -211502, -91141, 69380, 157476, -37292, 88881, -58408, -46583, -515411, 204690, -83345, -20391, -188578, -213423, -231523, 187559, 49328, 335670, -202426, -57165, -129166, 139397, 116030, 106851, -255241, 205453, 97625, 93555, 86240, 37909, 290447, -45349, 225505, -136411, 212796, 13115, 133140, 26071, 91699, -189258, -10461, 22522, 118538, 5462, 3831, -153775, -344598, -92636, 86496, 225059, 24251, 102111, -102032, 132858, 98982, 201066, 87462, 300671, 47200, 356176, 49715, 177727, 84587, 117537, -68354, -87947, -203938, 107048, -244476, -370216]
11360c70216L1816B04014a97473j77408a11178c6119j91947m69N3488H9252b17439
11348c95104J91039a7316j36666B281M6970a04436A19337O3992j1803k9114a8287
11336a29460A45993c23310G2970h2927C47220J44897F2720L7324g1611l59580
11326d31191A4066a32713m4061a108H4295k4970Q6411a06593K858E9647R2428
11315A52075N0239a58628K5058M0748J2187a203j01410j4197I4593g8197A10011
11303b53439A14583b8689G8716g0474A76259J03540a60473m5669A106J0895b07755
11291F8888M426f17904a3812k29761D0579J56632b10935j6058M7547k199j212
11280a82857L9427A85737c04550o5546C24670b6964D9991b24299a01448k18294
$$ y = [-370216, -338400, 204014, -197473, -374881, -111178, -36119, -228066, -228535, -175047, 89252, -217439, -395104, -204065, -17316, -153982, 2281, 49251, -104436, 119337, 183329, 171526, 142412, -18287, -129460, 145993, -323310, 72970, -82927, 347220, 492117, 62720, 100044, -71611, -431191, 14066, -132713, -176774, -1108, 84295, 59325, 145736, -106593, -103735, 59647, 152075, 202314, -158628, -133570, -92822, -80635, -1203, -102613, -116810, 94593, -78197, 110011, -253439, 114583, -28689, 78716, -70474, 176259, 279799, -160473, -206142, 1106, 12001, -207755, 68888, 73314, -617904, -13812, -243573, 40579, 197211, -210935, -226993, -179446, -181645, -182857, -143430, 185737, -304550, -370096, 324670, -26964, 49991, -224299, -101448, -319742]
11270c19742c9063k3869A34860a1743C60861a72495a607A89961k7247d58678B24897
11258b7060I7236C7999b746j03087p5588J3734n1001h9412B4074O1228j6291j4216
11246E4795a99578A39370a72583f5423H734i8132A60484F0567a09420j58486C5378
11234A07537C8210J7994M3692J16290B2885J32139b66837D5623b56576h5487A46943
11222c04649J205O4421E475a00227k02262B24054a4583j37804M2302k70939A54390
11210a33503c7031A5536d697j83939F692L4276Q7519a97076J9627c9241a3490
11198c841C0481a70953N8573F4453b42117Q3221b3679k9964k20551A3967c42918
11186a10428d3655A18596m1346a75531p1201L3908O3312b6709B44555f6244A54455
$$ y = [-319742, -39063, -62932, 134860, -11743, 360861, -172495, -1607, 189961, 162714, -458678, 224897, -27060, 97236, 37999, -2746, -105833, -181421, -167687, -218688, -89412, 24074, 85302, 69011, 54795, -199578, 139370, -172583, -65423, 8734, -98132, 160484, 60567, -109420, -267906, 35378, 107537, 38210, 56204, 99896, 216186, 22885, 155024, -266837, 45623, -256576, -85487, 146943, -304649, -303444, -239023, 5475, -100227, -302489, 224054, -14583, -152387, -110085, -381024, 154390, -133503, -37031, 15536, -4697, -188636, 6692, 40968, 128487, -197076, -177449, -39241, -13490, -3841, 30481, -170953, -112380, 64453, -242117, -158896, -23679, -53643, -274194, 13967, -342918, -110428, -43655, 118596, 77250, -175531, -246732, -212824, -149512, -26709, 244555, -66244, 154455]
11174b40435a8820b037j7334n9463p50J3156A20934c09793J06579c2386I5304
11162A24682l959O6651M7045q465b31179J15432H4447a39937A15320b00585b9058
11150h2458k5603G9428G415e0590A80473a80223C20018j35800E1241c16794a22384
11138b44224D7328J6896h5775A81669f9340C04348A06826K5526b54040A80367
11127A1074J93637o3963J3662d895A6755N6360L16240A58652N6172f4413F1365
11115b92026h9532l2914C5153d868j62427j49041B27651G9822h3140A67487p711
11104A59776m5392l6084L99365n4741A71727G8650Q3562a47824A43146j300J75853
11093C17699j03191o8167J83651A24261J47651l1132N9625K2571N1449A74041
$$ y = [-240435, -18820, -2037, -19371, -78834, -79584, -66428, 120934, -309793, -203214, -32386, 95304, 124682, 120723, 187374, 234419, 225954, -231179, -115747, 84447, -139937, 115320, -200585, -29058, -82458, -108061, 79428, 7415, -50590, 180473, -180223, 320018, 184218, 51241, -316794, -122384, -244224, 47328, 64224, -85775, 181669, -69340, 304348, 106826, 132352, -254040, 180367, 11074, 204711, 140748, 154410, -4895, 16755, 73115, 389355, 158652, 214824, -64413, 61365, -292026, -89532, -122446, 35153, -4868, -167295, -316336, 227651, 79822, -83140, 167487, 159776, 114384, 78300, 477665, 422924, 171727, 78650, 162212, -147824, 143146, 141846, 317699, 214508, 146341, 329992, 124261, 271912, 240780, 300405, 322976, 374425, 174041]
11082a15901G5720j0890k6104a14035A26154K20525A64897c3587F1417K37519
11072B98936o3329J20729j37105I4067K62359n6614q6021J08504n4757M26959
11062F94497j86481J59671j3083j60898J06955L73469l61203J45260O8824l57213
11052D69798J03693L19725m11434J96862k1786l1968q4402K49700j09038j5416
11042F65734k21706J76648j03910k1602P7787K6427n6624J56977j85900K50949
11032G64780K9017q768l00156K9470J76066N7763l8371j65280O4830J10776J57651
11021H77778j19749k02822B19223K71114J3404J12247j3428L91409m47748J7433
11011E63654R7403k6730p0225m0818K71570j90167K26192j39819j44247J19986
$$ y = [-115901, 75720, 64830, 38726, -114035, 126154, 346679, 164897, -33587, 61417, 298936, 235607, 356336, 219231, 94067, 356426, 299812, 213791, 322295, 267538, 694497, 508016, 667687, 654604, 493706, 600661, 974130, 612927, 758187, 827011, 469798, 573491, 893216, 481782, 678644, 656858, 624890, 540488, 790188, 681150, 665734, 444028, 620676, 516766, 495164, 572951, 599378, 542754, 699731, 513831, 764780, 793797, 785029, 484873, 514343, 690409, 748172, 709801, 544521, 609351, 720127, 877778, 758029, 555207, 219223, 490337, 503741, 615988, 602560, 993969, 546221, 563654, 661057, 634327, 564102, 523284, 794854, 604687, 830879, 691060, 546813, 666799]
11001F66799k37149K62985O5625q2161R232q8369K22391P8147m36132J52029j3348
10990F00049R9202r9608N77793k94988o872K63104J21086l75418l8521M65367
10980A311194o820j27371K37664l0665L96974j86637P79457L26087Q0741Q2328
10970B862952J83307m83360j48742k62872k19680j61382q6982j75243j49306M03639
10960A762331r475k949l2500p1112J09839j13950k8546j93865k63804l02713J64712
10949A017968k25510n1360r1692B81184K04656M0745K2251Q9002h0710E9829P7534
10938A37363m8603J52618j3355b20054r0049A99961G8277K13145a45025j38603
10928b83628B29335f2672F5833M95593k26102b47020A9782i5058j1496B89906
$$ y = [666799, 429650, 692635, 758260, 676099, 685331, 596962, 819353, 897500, 461368, 613397, 600049, 699251, 599643, 1177436, 882448, 875576, 1138680, 1259766, 884348, 845827, 1311194, 1304374, 1177003, 1414667, 1384002, 1780976, 1594339, 2373796, 2699883, 2780624, 2862952, 3046259, 2562899, 2414157, 2151285, 1931605, 1770223, 1683241, 1507998, 1358692, 1762331, 1752856, 1749907, 1717407, 1646295, 1756134, 1642184, 1613638, 1419773, 1155969, 853256, 1017968, 792458, 741098, 649406, 281184, 485840, 526585, 548836, 637838, -80710, 59829, 137363, 88760, 241378, 228023, -220054, -310103, 199961, 78277, 291422, -145025, -283628, 229335, -62672, 65833, 561426, 335324, -247020, 19782, -95058, -106554, 289906]
10917A88234J58716j04774a34428j13967E2966B5801J9172A86g2094K1625j71247
10906b21716A31457J21170a0456l5094k58514a10676B71689c00351E5359c8487
10895B43801H8196b07413A04160R8743l6959N5922q9090e2436A3541R4871m0044
10884F8368J64049I4623a9582A19987a02033k580l005A7766g8258k79708F1927
10872F4662K644b79452J28430A65561b72295A40433D2242b0967B7243f1881B3079
10860A17641a10937I2112C6739h5995A35136C5299b63321E4541i2853j59540o8980
10849c21373A2176i0837j79384B059a64982A54961K42777A17591A7171P1861O0491
10838A49523R34c31052C373a61505k22247J32773E6035b68656A29647k2159A541
$$ y = [188234, 346950, 242176, -134428, -248395, 52966, 25801, 44973, 186, -72094, -50469, -221716, 131457, 252627, -10456, -45550, -304064, -110676, 271689, -300351, 55359, -38487, 243801, 88196, -207413, 104160, 202903, 165944, 221866, 132776, -52436, 13541, 108412, 68368, 232417, 94623, -19582, 119987, -102033, -104613, -107618, 17766, -78258, -357966, 61927, 64662, 67306, -279452, -151022, 165561, -272295, 140433, 42242, -20967, 27243, -61881, 23079, 117641, -110937, 92112, 36739, -85995, 135136, 35299, -263321, 54541, -92853, -252393, -321373, 12176, -90837, -270221, 2059, -164982, 154961, 397738, 117591, 17171, 89032, 149523, 150457, -331052, 3373, -161505, -383752, -250979, 56035, -268656, 129647, 107488, 1541]
10826F3181N889a03245e0294A68761b74083J27825o1323O8169H0174J73284c90188
10814c8505A26561b43274d6641j60657e5729A14785e0019A25645a85564Q6944
10804i8620k21672N6916A43422g5585C84356a86742I7565C192J87403H6052J27204
10793B13256A00086a63172j53472B18585a30446A09647a38408K0213C00785a87242
10782H7462a48349j40562A84934c13867A58498b89431A83607h8312k18131h1859
10771B05707a28384L1636J2498K3332l1441j3805b1033A26906a26996C02468H2526
10759e7275A49611e4313o5123D3356B244a40A20456a94643f5794C09668B6100
10747I3610b86764A4471d2783A62692d84782b26348R0561A34798a17042j57906
$$ y = [63181, 69070, -103245, -50294, 168761, -274083, -146258, -207581, -139412, 80174, 253458, -390188, -38505, 126561, -243274, -46641, -207298, -55729, 114785, -50019, 125645, -185564, -98620, -320292, -263376, 143422, -75585, 384356, -186742, 97565, 3192, 190595, 86052, 213256, 100086, -163172, -316644, 218585, -130446, 109647, -138408, -118195, 300785, -187242, 87462, -148349, -288911, 184934, -313867, 158498, -289431, 183607, -88312, -306443, -81859, 205707, -128384, -96748, -84250, -60918, -92359, -106164, -21033, 126906, -126996, 302468, 82526, -57275, 149611, -54313, -119436, 43356, 2244, -140, 120456, -194643, -65794, 309668, 26100, 93610, -286764, 14471, -42783, 162692, -484782, -226348, -135787, 134798, -117042, -274948]
10737b74948H5147c13782P5863b4880E6383a64118g9457L6433j14586B44910H7868
10725d6185k18910F0149a62313A74990f8332A58971G914a25492A27042c81590
10714A49086b65758b8661p8755A74580J14331D9072b39355I251b18740B20154
10703D1978c51194b389j21990j13872A48118i8534j48147B9416a63601P0855B28801
10691a40321B79018a30025B10112I2833j4240l4239R8773a49000K2218K259P015
10680a17508A0877K10487j01430C2290c46911a07410j38875H0816O4987J91146
10670C36949b27328B13149h0910C48049a96256A79955L0570k336b44895F7895
10659f4496n4403k5337A15105c83286h3657e42m5667j70106N9549k2051M2489
$$ y = [-274948, 85147, -313782, -237919, -24880, 56383, -164118, -79457, -43024, -157610, 244910, 87868, -46185, -265095, 60149, -162313, 174990, -68332, 158971, 7914, -125492, 127042, -381590, 149086, -265758, -28661, -107416, 174580, 288911, 49072, -239355, 9251, -218740, 220154, 41978, -351194, -2389, -124379, -238251, 148118, -98534, -246681, 29416, -163601, -92746, 228801, -140321, 279018, -130025, 210112, 92833, 78593, 44354, 143127, -149000, -126782, -124523, -117508, 10877, 221364, 119934, 32290, -346911, -107410, -246285, 80816, 145803, 336949, -227328, 213149, -80910, 348049, -196256, 179955, 210525, 208189, -244895, 67895, -64496, -118899, -144236, 115105, -383286, -83657, -542, -46209, -216315, -156766, -178817, -136328]
10648a36328M9171A24590a69384A96311a27825j8980H0543c45994a13463k68509
10638c81972a41475n719H4132b75156J05005J2874e3618l42883b6865F452i4204
10626c0272B43551b8573j41653O8425A19180m1401J88491r1493G117R0418c92069
10614a30998k82392G5607J91771E8514a07217H0868L7624d7477A74437b19832
10603C9516J58989b27586g9826j05268L9021I4136j4553K32778F4615l0365J23561
10592A57811m6566B1344h7090j57913A03536a75215B87081A24255K4165F9457
10581A75777R5052b20669J06479k14467g2597k01645H6977J04491F9097a16314
10570c15023A20404c08456d0528k19911a21394d999k50454h9065N63k6291l00699
$$ y = [-136328, -87157, 124590, -169384, 196311, -127825, -146805, 80543, -345994, -113463, -381972, -141475, -147194, 84132, -275156, -170151, -157277, -53618, -396501, -26865, 6452, -94204, -30272, 243551, -28573, -170226, -101801, 119180, 77779, 266270, 174777, 7117, 97535, -392069, -130998, -413390, 75607, 267378, 58514, -107217, 80868, 118492, -47477, 174437, -219832, 39516, 198505, -227586, -79826, -185094, -146073, 94136, 79583, 312361, 64615, 34250, 157811, 111245, 21344, -87090, -245003, 103536, -175215, 287081, 124255, 148420, 69457, 175777, 270829, -220669, -114190, -328657, -72597, -274242, 86977, 191468, 69097, -116314, -315023, 120404, -308456, -40528, -260439, -121394, -4999, -255453, -89065, -88502, -114793, -415492]
10559d15492D900J4851J17458f9255J7616D86222A24299b1059D36801b63999a01067
10547b08798H1918B0724h0091F1056L28819D7960L37860b77865C45921A34086
10536e8591B1551d5691O736m5085A60069a49696j33125A03403a99956j51712a20926
10524a23254j27730A63121j0314l4601P6179d41140Q0328a10005j38713j61549
10514d10267a27915B91219a49109A21647J70245a36889p1441d2062j21730c4098
10503g65B7924a37294n7920A3469b25341G4081R4651C8464a64743f8748G922J84716
10491A92638m9908j7454b6103n4844A60123c46372I2831L8444A3454J11683J94725
10480C19862J13529q4741j63937J84490j62563a70196D73424G6905a82169J5576
$$ y = [-415492, 4900, 19751, 137209, -69255, -51639, 486222, 124299, -21059, 436801, -263999, -101067, -208798, 81918, 20724, -80091, 61056, 389875, 47960, 385820, -277865, 345921, 134086, -58591, 21551, -45691, -38955, -84040, 160069, -149696, -282821, 103403, -199956, -351668, -120926, -123254, -250984, 163121, 152807, 118206, 194385, -441140, -360812, -110005, -248718, -410267, -127915, 291219, -149109, 121647, 291892, -136889, -208330, -42062, -163792, -34098, -765, 27924, -137294, -195214, 13469, -225341, 74081, 168732, 38464, -164743, -68748, 7922, 192638, 142730, 125276, -26103, -80947, 160123, -346372, 92831, 131275, 13454, 125137, 319862, 433391, 348650, 184713, 369203, 206640, -170196, 473424, 76905, -182169, -166593]
10470a66593b3137C2700o322g7555l6794P109Q669f415r5003J9719r0679B39098
10457c17670a02408j5192N805j1868k6138h593n6283D5848a02359C9169b44716
10445a39935H1631l0961c3601F8417L3456L5574i0302B05290A8191d7335l212
10434e0547A10205c4169H4958d19466D4738N6008g8678A23276b4245k67796i5578
10422H9787K7599O3320C9603f6146n3682c5909j18037C01052c8678j7560a586
10410h2589D2372i9331j11294k51005A07794b8506p7316b1558H8714a07339d5979
10398G8387B5559K11190g3457C43292E409e0730B86524A00318J04045a11522J9817
10387i1705b2985A71142Q641b71991B04634i7934B26984R3776a09361C56927N5547
$$ y = [-166593, -23137, 32700, 26378, -77555, -114349, -107240, -98571, -6415, -101418, -81699, -172378, 239098, -317670, -102408, -117600, -111795, -123663, -149801, -8593, -64876, 45848, -102359, 39169, -244716, -139935, 81631, 50670, -33601, 68417, 101873, 137447, -90302, 205290, 18191, -47335, -50547, 110205, -34169, 84958, -419466, 44738, 100746, -78678, 123276, -24245, -292041, -95578, 89787, 117386, 180706, 39603, -66146, -119828, -35909, -153946, 301052, -38678, -56238, -1586, -82589, 42372, -99331, -210625, -461630, 107794, -28506, -105822, -21558, 88714, -107339, -45979, 78387, 25559, 236749, -73457, 343292, 5409, -50730, 286524, 100318, 204363, -111522, -91705, -22985, 171142, 179783, -271991, 204634, -97934, 226984, 320760, -109361, 356927, 412474]
10376D12474o1054A43655m4786a07038A87568J42104J43537O1154B58934L10670
10366E69604R4483B93481O3284J78998j96242k5558A06877J31803a38994A6357
10355A52255J26557I4179J50788J6590K84722R8942q2602B03067J50927J12433
10345D66427A86462P2790K784O9765j07345Q6319d0236H5986f8956B46906f2667
10333A79654a35400A22386a8745m6308C55598c1692B34445B5083e2539A04052
10322A03926J31482q6416a18312F3601P741C4909N0717c18979C58979a08463E1464
10310A58714a04703A16496e2053k35848a38002C18103j10287a12145K5754B6623
10299f0000F3357c33391A11637d33921b2230I6839l3059h8980j56547r6014B76151
$$ y = [412474, 351420, 143655, 98869, -107038, 187568, 329672, 473209, 534363, 258934, 569604, 664087, 293481, 356765, 535763, 339521, 313963, 106877, 238680, -138994, 16357, 152255, 278812, 94179, 244967, 261557, 546279, 645221, 562619, 203067, 353994, 466427, 186462, 259252, 262036, 331801, 224456, 310775, -40236, 85986, -68956, 246906, -62667, 179654, -135400, 122386, -18745, -65053, 355598, -31692, 234445, 25083, -52539, 104052, 103926, 235408, 148992, -118312, 63601, 71342, 34909, 85626, -318979, 358979, -108463, 51464, 158714, -104703, 116496, -52053, -287901, -138002, 318103, 207816, -112145, -86391, 26623, -60000, 63357, -333391, 111637, -433921, -22230, 96839, 63780, -88980, -245527, -341541, 276151]
10287a32460a8298A74169a42668O6961A45232J99424h6486j59948L8251A27612
10276C51922j28936b46010h1524d0515B5228J91935b23957A75098b63519D00301
10265a73644M8846I5841g9430A5788J24449J95223A16730L09328A69131Q5118
10255B54249a92163B53047B5188j2215L70860a42868A87941a9217j28047K0706
10245a26558A89846a59974E9260e1824k07362e2241I7110J01812I5297C6039J08060
10234A44099b0702A42749E957i8900A53367c1627I2143h3016n1663L5282n6k11537
10222c10990E7756a1822j622j94920j44454d6656B82624b21734k61240A6976O8926
10211H5902i7979B29469a68358I7452a5780j15490A9138K43024A3076b91201g2002
$$ y = [-132460, -18298, 174169, -142668, -75707, 145232, 344656, -86486, -246434, -208183, 127612, 351922, 222986, -246010, -81524, -40515, 25228, 217163, -223957, 175098, -263519, 400301, -173644, -124798, 95841, -79430, 15788, 140237, 335460, 116730, 426058, 169131, 254249, -192163, 253047, 25188, 12973, 383833, -142868, 187941, -19217, -147264, -126558, 189846, -159974, 59260, -51824, -259186, -52241, 97110, 198922, 95297, 36039, 144099, -20702, 142749, 5957, -98900, 153367, -31627, 92143, -83016, -134679, -99397, -99453, -310990, 57756, -11822, -13444, -208364, -352818, -46656, 282624, -221734, -482974, 16976, 85902, -97979, 229469, -168358, 97452, -15780, -131270, 19138, 262162, 13076, -291201, -72002]
10199i9210k76493J43602G0701K14c25756J05377A46380C6843a45397g758l51392
10188c59150h0325M516A09892n4614a14114o9070j16773h7937g478D3515j2322
10177C1193i778j98052A82991b94380A08957N0277O5068d789l0998j24416g8207
10165B37599A798b16809A14500i2430l1041o87D4464b15841L3774k6319A68889
10153G8231b6361k91717j3575A9151K77332p0933a87382L2243C7671b55178C1498
10141a46873j80281J34726A34791A5671c30929J26140j2960c1614A39006Q0086
10131B19092c075A21600K21320a02814D5978b08193A76586a44627A45641f0833
10120g8305j00649o9765l6444Q1458A05558b34166A27147m7576c83622B31996
$$ y = [-99210, -375703, -232101, 70701, 70915, -325756, -220379, 146380, 36843, -145397, -7758, -359150, -80325, -75809, 109892, 55278, -114114, -183184, -299957, -87937, -7478, 43515, 31193, -9778, -207830, 182991, -294380, 108957, 159234, 224302, -4789, -35787, -160203, -78207, 237599, 1798, -216809, 114500, -92430, -123471, -124158, 44464, -215841, -182067, -208386, 168889, 78231, -26361, -318078, -331653, 19151, 296483, 225550, -187382, -155139, 37671, -255178, 31498, -146873, -327154, -192428, 134791, 15671, -330929, -204789, -217749, -31614, 139006, 219092, -3075, 121600, 342920, -102814, 45978, -208193, 176586, -144627, 145641, -60833, -78305, -178954, -248719, -285163, -203705, 105558, -234166, 127147, 79571, -383622, 231996]
10109a03220j98275i1125C7182J9872c8607k0038J7403K0003q9017r4058A12204
10097a0446p3640B07017d15809d4240j62745B75225d0489l982k14806D5774h3513
10085A77885h5372K3306J7000C44699a45524F7527a56472a3317B0104J5074i0242
10073I7304g0401l2676l31974A14740b2413k13151c2654D6367a37037j77404a52301
10061a22061A67825J34514i7778l6334k51039b7251A01357h1950o0037j50780
10051b92767E1172O1609L6511i0400j22440A27983d0416m92263D5163e2027j60456
10040b12483L0078B853c93507C1163e29668C19443F8911e1069l26928J85736a4074
10028b14318a1646j12114k718j1712n0620j10910I9215c38790a34758C46371a68060
$$ y = [-103220, -301495, -91125, 37182, 57054, -38607, -58645, -41242, -21239, -110256, -204314, 112204, -10446, -84086, 207017, -415809, -44240, -206985, 275225, -40489, -44471, -259277, 45774, -83513, 177885, -85372, -62066, -45066, 344699, -145524, 67527, -156472, -13317, 20104, 35178, -90242, 97304, -70401, -103077, -435051, 114740, -22413, -235564, -32654, 46367, -137037, -314441, -152301, -122061, 167825, 302339, -97778, -134112, -385151, -27251, 101357, -81950, -141987, -292767, 51172, 112781, 149292, -90400, -212840, 127983, -40416, -532679, 45163, -52027, -212483, -182405, 2853, -393507, 31163, -529668, 319443, 68911, -51069, -377997, -192261, -14074, -214318, -11646, -123760, -126478, -138190, -188810, -299720, 99215, -338790, -134758, 346371, -168060]
10016b07761B9234a30417H6603a77868c5614A50037h9023H3820e2201A00718b20531
10004I5799C3802M1419a07674n11945d4896j95846B813h9349B52534R7901A4635
9992A79387e0687A5634K06771o3237A5498a82832a7464r1006K7712j56027e9636
9980a22700n1176P7737m8506j29470A38337D860P8697a8532A04939e42033b29476
9968F815A272i6315F3682J3063c24541J47571O312D6491p594a63668C34073D3925
9955i8255j18382j55946A56480a37330j64238b5867G5705h4379m8111f4162A36392
9943a03446d1820q3000A6679a64875D7620b66501O0836A53355c0894j75565j47729
9932c54188B60382f7458J2936K0605F067e5878k41378i4430N386j16064q5652
$$ y = [-207761, 29234, -130417, 86603, -177868, -35614, 150037, -89023, 83820, -52201, 100718, -220531, 95799, 33802, 75221, -107674, -619619, -44896, -240742, 2813, -89349, 252534, 350435, 14635, 179387, -50687, 15634, 222405, 159168, 15498, -182832, -17464, -108470, -80758, -236785, -59636, -122700, -173876, -96139, -144645, -274115, 138337, 4860, 83557, -18532, 104939, -542033, -229476, 6815, 1272, -96315, 63682, 76745, -324541, -176970, -170658, 46491, 38897, -163668, 334073, 43925, -98255, -216637, -372583, 156480, -137330, -301568, -25867, 75705, -84379, -132490, -64162, 136392, -103446, -41820, -124820, 16679, -164875, 47620, -266501, -205665, 153355, -30894, -206459, -354188, 260382, -67458, -54522, -33917, 6067, -55878, -297256, -94430, -89044, -205108, -290760]
9921b90760G547a43908k20962f8883A59648b09545m9647c462j13663C1224a88470
9909a61479j87910J09713L5464A62006a92236G1231d03750a24325o4040M9354
9899a39011B02516F6072r19J03879a059F0700d55743a03582A11816J4915K4491
9888A51222c0560A91099a09696B83266b80978J11208A08516a02493H0126O754
9878H6880e8715b7222p920j59775A4777K35901h0206k80195i3802j14095B4657
9866a45138L9115B08435F576a94039A01370a520r4084C9397e48768a11330l8828
9855a50158J9545H8918K39024c61809J27754A41756i5554n8973I1791a89445H3209
9843b85371B2914e0295m7714E7762a7086A83029C3338h7378n5368D4650J41168
$$ y = [-290760, 7547, -143908, -364870, -68883, 159648, -209545, -259192, -3462, -117125, 31224, -188470, -161479, -349389, -239676, -204212, 162006, -192236, 71231, -403750, -124325, -188365, -139011, 202516, 66072, 65153, 169032, -1059, 60700, -455743, -103582, 111816, 126731, 151222, -30560, 191099, -109696, 283266, -280978, -169770, 108516, -102493, 80126, 86880, -58715, -27222, -35142, -194917, 14777, 250678, -80206, -360401, -93802, -207897, 24657, -145138, -106023, 208435, 6576, -194039, 101370, -1520, -95604, 39397, -548768, -111330, -150158, -130613, 88918, 327942, -361809, -234055, 141756, -95554, -154527, 91791, -189445, 83209, -285371, 22914, -50295, -98009, 57762, -17086, 183029, 33338, -87378, -142746, 44650, 185818]
9832A85818a27888B1315N6453a24516B81914a35151k1494g5775A76011G8294b29619
9820b8613B83465H2171M4302a30569C9386d04247C8600h2404B71670B8535J43224
9809A71759a63352Q1532j04817j25980h6079a3335j15193e6137Q524I5138c27536
9797c1122n3343d277j10887C12082a12067o6981H3537i2550I5717m3948c20741
9785A64474c0929C35715j09091a48415p1307A24906d43644R3417i3286I5b89166
9773a30875A78558a8040o6724A28330b75934M3994l384g6118c7843j44234a9570
9761a77718k12036J79787C5976N2887l7577c6244q3646N331r6492A39943d3377
9749a10615b1709r9107A79402e5620B45174a11030p0157E3583a84534c8651A5091
$$ y = [185818, -127888, 21315, 77768, -124516, 281914, -135151, -156645, -75775, 176011, 78294, -229619, -28613, 283465, 82171, 126473, -130569, 39386, -404247, 38600, -82404, 271670, 28535, 171759, -163352, -81820, -186637, -312617, -86079, -13335, -128528, -56137, -47613, 95138, -327536, -31122, -84465, -4277, -115164, 312082, -112067, -179048, 83537, -92550, 95717, 51769, -320741, 164474, -30929, 335715, 226624, -148415, -219722, 124906, -443644, -350227, -93286, 95, -289166, -130875, 178558, -18040, -84764, 128330, -275934, -231940, -235324, -76118, -37843, -182077, -19570, -177718, -389754, -209967, 35976, 88863, 51286, -36244, -119890, -114559, -211051, 139943, -43377, -110615, -21709, -120816, 179402, -55620, 245174, -111030, -181187, 53583, -184534, -38651, 15091]
9737a76101B5275Q561J44262b16840n4380F7533L61208a62776k4988j12193d0888
9725b01726n6615C66136a87532k3372a04617b6504M774k96306J29806C8163a42022
9713d3693a9651k09354a00850Q460j88781I0020b29728A96869P5234a45576a7715
9701c92210j30728A71318p4998a13061j33145A44276a49701k06526I6576d16815
9690C67173h2994j25787R6085q1459d8780J8039D8509a70144E3987J42185a22385
9678F5324b15069m3556h1768H5403J34093D907a3258b443I4655j9285e436o7919
9666g3355a4355l75733f9148l62569J91731J2805Q6523j10132D8561O6553a86989
9654b45932A44777b1985p0251A42342b2145D4473M2223c06860G2091h9238j50553
$$ y = [-176101, 25275, 33836, 178098, -216840, -271220, 67533, 428741, -162776, -187764, -299957, -40888, -201726, -258341, 366136, -187532, -210904, -104617, -26504, -21730, -318036, -188230, 38163, -142022, -43693, -19651, -229005, -100850, -92390, -281171, 90020, -229728, 196869, 272103, -145576, -17715, -392210, -522938, 171318, 96320, -113061, -246206, 144276, -149701, -356227, 96576, -416815, 367173, -82994, -208781, -112696, -194155, -48780, -30741, 48509, -170144, 53987, 196172, -122385, 65324, -215069, -258625, -81768, 85403, 219496, 4907, -13258, -2443, 94655, 75370, -5436, -73355, -14355, -390088, -69148, -431717, -239986, -227181, -140658, -250790, 48561, 115114, -186989, -245932, 144777, -21985, -92236, 142342, -22145, 44473, 86696, -306860, 72091, -89238, -239791]
9643b39791c3285l4299A23608c19327L508e3226A51787b21127k51585a19992A8069
9631B95399a05386C6322J39111h1654k24810a07268k19204F5534a74544F8401
9620A18511a51223p3474A76994a28035e087A6525M8903b34891B00305b12348A84695
9608a86569M0120c4252A03303k0526c0617j50328Q9691A48109d6702l81183a23362
9596C37388C1060K34938e1892G4565O3156i5899d3448j76889C1493d0531j13843
9585a54374a461j64317p4600B07948d00904a97263a7921A52152C5324a79973H7384
9573a95565m7222b985j6767n1867k82224Q0844A2530a38820D5571d2505k38360
9562b80865h8045B15724a78175b4605l01311d9731F4891N719K76514n1083e4888
$$ y = [-239791, -33285, -67584, 123608, -319327, -315819, -53226, 151787, -221127, -472712, -119992, 18069, 295399, -105386, 36322, 175433, -81654, -306464, -107268, -326472, 65534, -174544, 68401, 118511, -151223, -224697, 176994, -128035, -5087, 16525, 65428, -234891, 200305, -212348, 184695, -186569, -146449, -34252, 103303, 82777, -30617, -180945, -91254, 148109, -46702, -427885, -123362, 337388, 31060, 265998, -51892, 74565, 137721, -95899, -43448, -220337, 31493, -40531, -154374, -1461, -165778, -240378, 207948, -400904, -197263, -17921, 152152, 35324, -179973, 87384, -195565, -242787, -2985, -19752, -71619, -353843, -272999, 12530, -138820, 45571, -42505, -280865, -88045, 215724, -178175, -24605, -325916, -49731, 64891, 70610, 347124, 296041, -54888]
9550C3186a63254I1609e74773a58040j30243A62242e4604l4633J5706H5089a47815
9538f17A19753a62450c4292q2122M3116q7552q9514J19231k44885A43577h5513
9526a5874j28172A87037b49896a17095j82718A73149b36674C1799g6120J2115
9516f4005H464c32631a02432C01586a33564B07611c03528A2787a41414r3593g1044
9504D1191a36324j50379f7374k74178a8039j02553C12113a82971L4969f6261m9296
9493a15557A30398c6839l67253A23169f2175D3399L954L23839A5760a78822L8098
9482a40724f4633j84529B46754q4094d3868B80612a08538G6323i7656K1524G094
9470G1134a04730K5622j5k38667d322n6722K6046m4537C1830a75596A16709E6380
$$ y = [33186, -163254, 91609, -574773, -158040, -288283, 162242, -54604, -89237, -73531, 85089, -147815, -617, 119753, -162450, -34292, -116414, -73298, -160850, -250364, -131133, -376018, 143577, -85513, -15874, -144046, 187037, -249896, -117095, -299813, 173149, -236674, 31799, -76120, -64005, 8464, -332631, -102432, 301586, -133564, 207611, -303528, 12787, -141414, -235007, -71044, 41191, -136324, -286703, -67374, -341552, -18039, -120592, 312113, -182971, -148002, -66261, -115557, 130398, -36839, -404092, 123169, -62175, 43399, 47353, 371192, 15760, -178822, -140724, -64633, -249162, 246754, 162660, -43868, 280612, -108538, 76323, -97656, -76132, 7094, 71134, -104730, -79108, -79123, -317790, -4322, -61044, -34998, -79535, 31830, -175596, 116709, 56380]
9457a25826j81476a20352M8726L3388k07838L0881H7786c83890J23820R8181A6520
9445D6640c53463a7997j77607c309r9019K0664E450a20676j9131e0727l5135j60468
9433b46330g6053B58741I9971h9451o1560L4568q3313B99900o7790i6034b3358
9421a34676I3106a19770n8926j83608A07386H558c0885J779A89458J5241a58338
9409a72907e8408C4426a87517K8762A59989g0164j47502H3627Q8447J14800a81211
9397E8676c24127G6424g0927q6838B5490O8593c23188i8782M1578k08463h3898
9385c51089a38320B55938a77796o0114f243j03494A28212m6362A7884a07904d7605
9373A53669G5862c60479B68925a2029n0312r1876k96796b1640A64181a42314k80141
$$ y = [-125826, -307302, -120352, -71626, -38238, -246076, -215195, 87786, -383890, -260070, -161889, 16520, 46640, -353463, -17997, -195604, -3309, -102328, -81664, 5450, -120676, -139807, -50727, -85862, -246330, -76053, 258741, 99971, -89451, -151011, -116443, -199756, 299900, 232110, -96034, -23358, -134676, 93106, -119770, -178696, -362304, 107386, 8558, -30885, -29106, 189458, 204699, -158338, -172907, -58408, 34426, -187517, -158755, 159989, -70164, -217666, 83627, 172074, 286874, -181211, 58676, -324127, 76424, -70927, -157765, 25490, 94083, -323188, -98782, -57204, -265667, -83898, -351089, -138320, 255938, -177796, -237910, -6243, -109737, 128212, 81850, 17884, -107904, -47605, 153669, 75862, -360479, 268925, -12029, -62341, -154217, -451013, -21640, 164181, -142314, -422455]
9362d22455J92937E1090j1502A236b20822a0443A7439a73406P3792d1295A32865
9350A24643a98849A41548b53337A77805a226G9170c23161g8009j95494a4068j85285
9339a99353P2455M5152B30800a62777m3076H5359b47083N1059A83709j2943A0651
9327h8333p3137p0718r1115a38209J5066k6093J8348j03046Q1771A97125b21869
9315a66045j8463g8775k36128I2186a27430C37692f9606j35386N7910A6896P2996
9304H9892a62152k4461d4900A87833C5523d79498e6963j12368A6558h1534A94891
9292e3043A02772a71075B2413c0366A44098d56768B60722d1073A46491d8043A09781
9280A69255J08720A4753b16456b7185a2682j26316K3136K5351m8422d8287p3919
$$ y = [-422455, -229518, 51090, 39588, 1236, -220822, -10443, 17439, -173406, -99614, -41295, 132865, 124643, -198849, 141548, -253337, 177805, -1226, 79170, -323161, -78009, -273503, -14068, -199353, -126898, -81746, 230800, -162777, -205853, 85359, -247083, -196024, 183709, 170766, 10651, -88333, -161470, -232188, -323303, -138209, -123143, -149236, -130888, -233934, -152163, 197125, -221869, -166045, -184508, -78775, -314903, 92186, -127430, 337692, -69606, -204992, -147082, 16896, 89892, -162152, -186613, -44900, 187833, 35523, -479498, -56963, -169331, 16558, -81534, 194891, -53043, 102772, -171075, 22413, -30366, 144098, -456768, 260722, -41073, 146491, -48043, 109781, 169255, 277975, 14753, -216456, -27185, -12682, -138998, -115862, -90511, -138933, -48287, -122206]
9269a22206A29672b95506n1906a4614e606A62879a18603B06590A3392a07428l2965
9258a40393f300A818b27825c9886j79586j41201a47037I4294i3780c857k24032
9247b27889F4110B3221a02801m1850A55473J5381C888c77427B36694B125c31637
9235a98360e0336l13810H9549k4630c8064m7436j73561A6661K36128N8326c67631
9223c34194Q0455B3574J07974m5746a74972E6164M3613L58024b6001A20397K16273
9212C36670i8441A64981B3524a53471r0483r4027n5642h8677K4514j6115A56737
9200a46986m2224h0915l9236A37764L7907d00089a70454g2758l3520A1217a95503
9188a19057C626b69791k3727n2324A4450a02901B71284H3679c08788A18149a99081
$$ y = [-122206, 129672, -295506, -347412, -14614, -5606, 162879, -118603, 206590, 13392, -107428, -140393, -6300, 1818, -227825, -39886, -219472, -360673, -147037, 94294, -93780, -3857, -227889, 64110, 23221, -102801, -144651, 155473, 170854, 3888, -377427, 236694, 2125, -331637, -198360, -50336, -364146, 89549, 64919, -38064, -85500, -259061, 16661, 252789, 311115, -367631, -334194, -253739, 23574, 131548, 85802, -174972, 56164, 99777, 457801, -26001, 120397, 336670, -98441, 164981, 23524, -153471, -243954, -337981, -393623, -88677, -64163, -80278, 156737, -146986, -189210, -80915, -120151, 137764, 175671, -400089, -170454, -72758, -106278, 11217, -195503, -119057, 3626, -269791, -293518, -345842, 14450, -102901, 271284, 83679, -308788, 118149, -199081]
9176A76287b44571A32492a92759p8279J0548N4451e5562k33931d6977O150A03707
9164B8536g7571B5055O3103L75896I8969d1821j57504L7877B4038a62011b8007
9152c38362E8675b50759b4985A09202C6437J6088g0764j00691C03249A26879c51257
9140e2389j9773D6032a78494k9826G8107a37256e4143A83359l0380e1338D9790
9128F9796d499C0589b06486A97395b81647O010L801h8616E0925d00685R6584a08042
9115I4929b33561J9848M344i3516j82789e8693A94456N6019C2906o240c76323
9103a48236K9976G4192A9108Q4967a94808j27208b4434H5034b37767I5908a86448
9091B5c1646J259A56368e29275h383o9444j25559O6601A20182b50596A11257J27530
$$ y = [176287, -244571, 132492, -192759, -271038, -260490, -206039, -55562, -289493, -46977, -40827, 103707, 28536, -77571, 25055, 88158, 464054, 98969, -41821, -199325, -161448, 24038, -162011, -28007, -338362, 58675, -250759, -24985, 109202, 36437, 52525, -70764, -171455, 303249, 126879, -351257, -52389, -72162, 46032, -178494, -208320, 78107, -137256, -54143, 183359, 152979, -51338, 49790, 69796, -4499, 30589, -206486, 197395, -281647, -275637, -271836, -88616, 50925, -400685, -304101, -108042, 94929, -233561, -213713, -209369, -93516, -276305, -58693, 194456, 250475, 32906, 26666, -376323, -148236, -118260, 74192, 19108, 104075, -194808, -322016, -24434, 85034, -237767, 95908, -186448, 25, -31646, -30387, 156368, -529275, -8383, -77827, -203386, -136785, 120182, -250596, 111257, 238787]
9079B38787D2938N2257Q3150M009J48233b59076A6821J21142b92066J36832E3527
9067A25476b60449A71592G0995a14883j58816e6568B1637J62164C9225a17244
9056A04694i6390A59105a629D0686J03171a65771C00987c28667I9692b63395b0201
9044a0427A37218d58500e1144A89703h1514h752D9374b00938K8404M4733m2170
9033a69971c5103l4972A24801b8174r6407G4334b41593R6431k60842a74045A45460
9021b40296R8640p2286Q2495F0183J78805d31599c8027I2899h9588p5698j19345
9010b84631e6366k95594a20600O0064j30912D1925J49959a74612m9732R2231A23771
8998a87404M1918k50163c3694k90277J08509m2223A23107c93363A26271a49217
$$ y = [238787, 42938, 95195, 178345, 182354, 330587, -259076, 16821, 137963, -292066, -155234, 53527, 125476, -260449, 171592, 70995, -114883, -273699, -56568, 21637, 183801, 39225, -117244, 104694, -96390, 159105, -1629, 40686, 143857, -165771, 300987, -328667, 99692, -263395, -20201, -10427, 137218, -458500, -51144, 189703, -81514, -8752, 49374, -200938, -172534, -127801, -169971, -35103, -70075, 124801, -28174, -124581, 74334, -241593, -145162, -406004, -174045, 145460, -240296, -141656, -213942, -131447, 60183, 238988, -431599, -38027, 92899, -89588, -165286, -284631, -56366, -351960, -120600, -60536, -191448, 41925, 191884, -174612, -224344, -132113, 123771, -187404, -145486, -395649, -33694, -323971, -215462, -257685, 123107, -393363, 126271, -149217]
8987c71528a2733k33247B86524H0715e5339k74208A85394b92391i9776F0502c2829
8975b21068B13137h2820C05a85573e6209C4850c7764r8789k43239H0867M6109
8964A26976l5773a08936e3986n3348B65102A7271J11745K62389D0839f9553E381
8952A97001e1072p9746d5901k36168M5394F651K81773I818b18775a0955l4682
8941d5637l07173A9071h4916K561B78596n3783P453A9868K8122a9250l2242A09544
8928b1059D53250j0890L25419K1703J252154M935963L445527J653544n281690
8919F794980l365677A657999E99293J68226G0899b4927j39916H8290J7223l4019
8909G1494J77905a51119B23735a88688h4341A17966d57005a6801k74341g8555
$$ y = [-371528, -12733, -245980, 286524, 80715, -55339, -329547, 185394, -292391, -99776, 60502, -32829, -221068, 213137, -82820, 305, -185573, -56209, 34850, -37764, -136553, -379792, 80867, 126976, 91203, -108936, -53986, -107334, 265102, 17271, 129016, 391405, 40839, -69553, 5381, 197001, -51072, -130818, -45901, -282069, -236675, 6651, 288424, 9818, -218775, -10955, -45637, -352810, 19071, -84916, -82355, 278596, 224813, 232266, 19868, 47990, -19250, -51492, 109544, -21059, 453250, 442360, 767779, 789482, 2041636, 6977599, 10423126, 12076670, 6794980, 3429303, 1657999, 599293, 767519, 70899, -24927, -164843, 88290, 105513, 71494, 249399, -151119, 223735, -188688, -84341, 117966, -457005, -16801, -291142, -78555]
8898a25353B93436C2004b76492j264H3773d68550A13310e0369q0297A04741C0361
8886e945A34508d5629B806Q2449a72670A1050i1660j4945j59860A26007a20123
8874B3395b18829Q3239C29258e4530A55664n5151a58188O8090j23224e5539A92129
8862c6673r6748H5808a20671b6122Q221m1059A29314F3473A961J25098a47564
8850e7242l78542B23515b70380A2727C046a94959A8970O8996a27147M2251D2929
$$ y = [-125353, 293436, 32004, -276492, -277756, 83773, -468550, 113310, -50369, -130666, 104741, 30361, -5945, 134508, -45629, 2806, 85255, -172670, 11050, -91660, -106605, -266465, 126007, -120123, 23395, -218829, -135590, 329258, -54530, 155664, 100513, -158188, -90098, -213322, -55539, 192129, -36673, -133421, 85808, -120671, -26122, -17901, -58960, 129314, 63473, 1961, 127059, -147564, -57242, -435784, 223515, -270380, 12727, 3046, -194959, 18970, 87966, -127147, -84896, 42929]
$$ [...]
##END NTUPLES=NMR SPECTRUM
##END=
