##TITLE=AC1508_CUNDCR13315_8126600_pgbkpb7KZe
##JCAMPDX= 6.0         $$ Bruker NMR JCAMP-DX V2.0
##DATA TYPE= NMR SPECTRUM
##DATA CLASS= NTUPLES
##ORIGIN= BRUKER
##OWNER= Administrator
$$ 1.72 TOPSPIN		Version 2.1
$$ 2013-08-15 23:53:35.459 -0700  Administrator@X
$$ Compression mode = diff/dup
##.OBSERVE FREQUENCY= 400.02188249412
##.OBSERVE NUCLEUS= ^1H
##.ACQUISITION MODE= SIMULTANEOUS (DQD)
##.ACQUISITION SCHEME= undefined
##.AVERAGES= 64
##.DIGITISER RES= 22
##SPECTROMETER/DATA SYSTEM= spect
##.PULSE SEQUENCE= noesygpps1d.comp
##.SOLVENT NAME= COFFEE_meoh
##.SHIFT REFERENCE= INTERNAL, COFFEE_meoh, 1, 14.96097
##AUDIT TRAIL= $$ (NUMBER, WHEN, WHO, WHERE, PROCESS, VERSION, WHAT)
$$ ##TITLE= Audit trail, TOPSPIN		Version 2.1
$$ ##JCAMPDX= 5.01
$$ ##ORIGIN= Bruker BioSpin GmbH
$$ ##OWNER= Administrator
$$ $$ E:\/data/COFFEE/nmr/AC1508_CUNDCR13315_8126600_pgbkpb7KZe/12/pdata/1/auditp.txt
$$ ##AUDIT TRAIL=  $$ (NUMBER, WHEN, WHO, WHERE, PROCESS, VERSION, WHAT)
(   1,<2013-08-15 23:53:30.349 -0700>,<Administrator>,<X>,<go>,<TOPSPIN 2.1>,
      <created by zg
	started at 2013-08-15 23:42:00.709 -0700,
	POWCHK enabled, PULCHK disabled,
       configuration hash MD5:
       C8 4E 4E 5D D3 5C D8 9E 9F 52 82 E0 59 8A DE 15
       data hash MD5: 64K
       99 7C 0F 37 B8 91 A9 30 70 5A 83 19 35 0F 8B 04>)
(   2,<2013-08-15 23:53:33.303 -0700>,<Administrator>,<X>,<proc1d>,<TOPSPIN 2.1>,
      <Start of raw data processing
       efp LB = 0.3 FT_mod = 6 PKNL = 1 PHC0 = 0 PHC1 = 0 SI = 128K 
       data hash MD5: 128K
       6D A7 C0 81 1B 01 2F 5F 96 07 3B 09 E4 29 1A 84>)
(   3,<2013-08-15 23:53:34.318 -0700>,<Administrator>,<X>,<proc1d>,<TOPSPIN 2.1>,
      <pk PHC0 = -78.5083 PHC1 = 0 
       data hash MD5: 128K
       76 82 53 8C 85 E3 9A 8A 5B DC 8D AE 2E 80 94 E4>)
(   4,<2013-08-15 23:53:34.849 -0700>,<Administrator>,<X>,<proc1d>,<TOPSPIN 2.1>,
      <abs ABSG = 1 
       data hash MD5: 128K
       8F 0B BB 32 08 BA 3B 2A 16 78 08 6D 36 4F 47 A7>)
(   5,<2013-08-15 23:53:34.959 -0700>,<Administrator>,<X>,<proc1d>,<TOPSPIN 2.1>,
      <abs ABSG = 2 
       data hash MD5: 128K
       8A 07 C5 57 5C D9 FD 2A F3 2E E4 39 88 3B 01 72>)
(   6,<2013-08-15 23:53:35.037 -0700>,<Administrator>,<X>,<proc1d>,<TOPSPIN 2.1>,
      <abs ABSG = 3 
       data hash MD5: 128K
       77 80 0C 7D E4 85 C9 B1 AB C6 4F 19 55 73 20 7A>)
(   7,<2013-08-15 23:53:35.115 -0700>,<Administrator>,<X>,<proc1d>,<TOPSPIN 2.1>,
      <abs ABSG = 4 
       data hash MD5: 128K
       79 D0 E5 C7 B5 89 CF 2D BA CD 8A A7 16 1B D5 B2>)
(   8,<2013-08-15 23:53:35.271 -0700>,<Administrator>,<X>,<proc1d>,<TOPSPIN 2.1>,
      <abs ABSG = 5 
       data hash MD5: 128K
       20 79 D8 73 8D 38 AA 7C 77 7E 7D B6 76 22 BA AB>)
$$ ##END=
$$ 
$$ $$ hash MD5
$$ $$ 62 3E 6E 44 F0 47 F6 07 D0 A5 80 79 94 3A 15 9F
##$RELAX= 
##$RELAX= 
##$RELAX= 
##$RELAX= 
##$RELAX= 
##$RELAX= 
##$RELAX= 
##$RELAX= 
$$ Bruker specific parameters
$$ --------------------------
##$DU= <E:\>
##$EXPNO= 12
$$ [...]
150 150 150 150 150 150 150 150
##$TP07= 0
##$TPNAME0= <>
##$TPNAME1= <>
##$TPNAME2= <>
##$TPNAME3= <>
##$TPNAME4= <>
##$TPNAME5= <>
##$TPNAME6= <>
##$TPNAME7= <>
##$TPOAL= (0..7)
0.5 0.5 0.5 0.5 0.5 0.5 0.5 0.5
##$TPOFFS= (0..7)
0 0 0 0 0 0 0 0
##$TUNHIN= 0
##$TUNHOUT= 0
##$TUNXOUT= 0
##$USERA1= <user>
##$USERA2= <user>
##$USERA3= <user>
##$USERA4= <user>
##$USERA5= <user>
##$V9= 5
##$VALIST= <valist>
##$VCLIST= <CCCCCCCCCCCCCCC>
##$VD= 0
##$VDLIST= <DDDDDDDDDDDDDDD>
##$VPLIST= <PPPPPPPPPPPPPPP>
##$VTLIST= <TTTTTTTTTTTTTTT>
##$WBST= 1024
##$WBSW= 4
##$XGAIN= (0..3)
0 0 0 0
##$XL= 0
##$YL= 0
##$YMAX_a= 6580108
##$YMIN_a= -13454176
##$ZGOPTNS= <>
##$ZL1= 120
##$ZL2= 120
##$ZL3= 120
##$ZL4= 120
##$ABSF1= 14.96097
##$ABSF2= -5.597212
##$ABSG= 5
##$ABSL= 3
##$ALPHA= 0
##$AQORDER= 0
##$ASSFAC= 0
##$ASSFACI= 0
##$ASSFACX= 0
##$ASSWID= 0
##$AUNMP= <proc_prof1d_extract.lims>
##$AXLEFT= 0
##$AXNAME= <>
##$AXNUC= <1H>
##$AXRIGHT= 0
##$AXTYPE= 0
##$AXUNIT= <>
##$AZFE= 0.1
##$AZFW= 0.1
##$BCFW= 0
##$BC_mod= 0
##$BYTORDP= 0
##$COROFFS= 0
##$CY= 15
##$DATMOD= 1
##$DC= 0
##$DFILT= <>
##$DTYPP= 0
##$F1P= 0
##$F2P= 0
##$FCOR= 0.5
##$FTSIZE= 131072
##$FT_mod= 6
##$GAMMA= 0
##$GB= 0
##$INTBC= 1
##$INTSCL= 1
##$ISEN= 128
##$LB= 0.3
##$LEV0= 0
##$LPBIN= 0
##$MAXI= 10000
##$MC2= 0
##$MEAN= 0
##$ME_mod= 0
##$MI= 0
##$NCOEF= 0
##$NC_proc= -2
##$NLEV= 6
##$NOISF1= 0
##$NOISF2= 0
##$NSP= 0
##$NTH_PI= 0
##$NZP= 0
##$OFFSET= 14.96097
##$PC= 1
##$PHC0= -78.5083
##$PHC1= 0
##$PH_mod= 1
##$PKNL= yes
##$PPARMOD= 0
##$PPDIAG= 0
##$PPIPTYP= 0
##$PPMPNUM= 2147483647
##$PPRESOL= 1
##$PSCAL= 4
##$PSIGN= 0
##$PYNMP= <proc.py>
##$REVERSE= no
##$SF= 400.020009647028
##$SI= 131072
##$SIGF1= 0
##$SIGF2= 0
##$SINO= 400
##$SIOLD= 131072
##$SPECTYP= <>
##$SREGLST= <1H.CDCl3>
##$SSB= 0
##$STSI= 131072
##$STSR= 0
##$SW_p= 8223.68421052631
##$SYMM= 0
##$S_DEV= 0
##$TDeff= 65536
##$TDoff= 0
##$TI= <>
##$TILT= no
##$TM1= 0
##$TM2= 0
##$TOPLEV= 0
##$USERP1= <user>
##$USERP2= <user>
##$USERP3= <user>
##$USERP4= <user>
##$USERP5= <user>
##$WDW= 1
##$XDIM= 131072
##$YMAX_p= 393615644
##$YMIN_p= -11179
##$CURPLOT= <Network HP LaserJet P1505>
##$CURPRIN= <$Network HP LaserJet P1505>
##$DFORMAT= <normdp>
##$LAYOUT= <+/1D_H.xwp>
##$LFORMAT= <normlp>
##$PFORMAT= <normpl>
##$SURQMSG= 1
$$ End of Bruker specific parameters
$$ ---------------------------------
##NTUPLES= NMR SPECTRUM
##VAR_NAME=  FREQUENCY,     SPECTRUM/REAL,   SPECTRUM/IMAG
##SYMBOL=    X,             R,               I
##VAR_TYPE=  INDEPENDENT,   DEPENDENT,       DEPENDENT
##VAR_FORM=  AFFN,          ASDF,            ASDF
##VAR_DIM=   131072,        131072,          131072
##UNITS=     HZ,            ARBITRARY UNITS, ARBITRARY UNITS
##FACTOR=    0.0627417313425164, 1,          1
##FIRST=     8223.62146879497, -1079,        -64901
##LAST=      0,             1351,            -66205
##MIN=       0,             -11179,          0
##MAX=       8223.62146879497, 393615644,    0
$$ Real data points
##PAGE= N=1
##DATA TABLE= (X++(R..R)), XYDATA
$$ [...]
63884G84339k2404k1002j9802j8590j7074j5369j3795j2253j0257p671m964k492
63872F18666j7K730N315P069Q050R059J0659J2720J4929J7236J9435K0873K1074
63859G67798K0478K0017K0093K0271K0001J9172J7893J6137J3836J1146Q303N311
63847I60456K014j529m918p804j0277j2711j5292j7837k0132k2285k4518k6683
63835G98484k8252k8848k8644k8071k7315k6340k5320k4691k4578k4423k3437
63824E08565k1468j9154j7168j5566j4048j2664j1779j1417j0981r925q447p166
63812C48782o279n372m130k893k326k635l244l312k549j537j109j454k045k368
63798C07529k497k652k660k228j552j189j417k075k857l374l148k152j245j399
$$ y = [784339, 761935, 740933, 721131, 702541, 685467, 670098, 656303, 644050, 633793, 626122, 621158, 618666, 618649, 621379, 626694, 633763, 641813, 650872, 661531, 674251, 689180, 706416, 725851, 746724, 767798, 788276, 808293, 828386, 848657, 868658, 887830, 905723, 921860, 935696, 946842, 955145, 960456, 962470, 960941, 956023, 948219, 937942, 925231, 909939, 892102, 871970, 849685, 825167, 798484, 770232, 741384, 712740, 684669, 657354, 631014, 605694, 581003, 556425, 532002, 508565, 487097, 467943, 450775, 435209, 421161, 408497, 396718, 385301, 374320, 364395, 355948, 348782, 342503, 337131, 333001, 330108, 327782, 325147, 321903, 318591, 316042, 314505, 313396, 311942, 309897, 307529, 305032, 302380, 299720, 297492, 295940, 294751, 293334, 291259, 288402, 285028, 281880, 279728, 278483, 277084]
63784B77084k452l314l457l408l598l574k803j566n06J35L39p2j031j858j910
63769B48009j247k25R97K054K116R12n04r20n00j95j66Q4K94l35j502j835r63
63752B46074j95n11j118q37Q2N92N26N91J119J790K375K808K860K468K229K653
63736B63506L142K665J353M83P24J345J553J613K112K803K990K677K545K962L655
63721B96128M322M951N426N366M647L695L028K690K393J945J308M48n18j135r71
63706C33723k57J81k44j262k077k186j731j192q09l45O02J932K870K766J972J503
63690C35446J780K191K148J976K275K852K943K299J436Q22L82o6m17m99l64k07
63674C54997j75l56o70q13n52k2M99R38J260J144L96m81p73n91p37j394j794j490
$$ y = [277084, 274632, 271318, 267861, 264453, 260855, 257281, 254478, 252912, 252406, 252541, 252880, 252808, 251777, 249919, 248009, 246762, 246537, 247534, 249588, 251704, 252616, 252112, 251192, 250692, 250497, 250331, 250415, 250709, 250374, 248872, 247037, 246074, 245879, 245368, 244250, 243413, 243495, 244087, 244613, 245204, 246323, 248113, 250488, 253296, 256156, 258624, 260853, 263506, 266648, 269313, 270666, 271149, 271873, 273218, 274771, 276384, 278496, 281299, 284289, 286966, 289511, 292473, 296128, 300450, 305401, 310827, 316193, 320840, 324535, 327563, 330253, 332646, 334591, 335899, 336347, 335829, 334694, 333723, 333466, 333647, 333403, 332141, 330064, 327878, 326147, 324955, 324146, 323801, 324403, 326335, 329205, 331971, 333943, 335446, 337226, 339417, 341565, 343541, 345816, 348668, 351611, 353910, 355346, 356168, 356550, 356484, 356067, 355568, 355204, 354997, 354822, 354466, 353796, 352983, 352431, 352409, 352908, 353846, 355106, 356250, 356646, 356165, 355392, 354801, 354064, 352670, 350876, 349386]
63656C49386j227j929l394m596m941m628l993l158k264j532j064q48q79r91p25
63641C13217K53J648K747L150L090L096L519M243M725M517L891L692M406N575
63627C61769O463O937P331P817Q359R081J0034J0776J0860J0710J1369J3187J5369
63614D90062J7128J8771K1172K4460K7780L0269L1857L3017L4017L4637L4584
63603G97754L3859L2552L0349K6609K1147J4760Q746L943L70k316m391o027p416
63590I49939q779j0365j2379j4781j7181j9201k0912k2690k4631k6317k7207k7042
63578G18454k5911k4177k2404k0954j9557j7513j4591j1425q789o644m346j710
63566E40433O44K138L078M202N590O486O348N700N668O852Q953J1366J3683J5665
$$ y = [349386, 348159, 346230, 342836, 338240, 333299, 328671, 324678, 321520, 319256, 317724, 316660, 315812, 314933, 313942, 313217, 313470, 315118, 317865, 321015, 324105, 327201, 330720, 334963, 339688, 344205, 348096, 351788, 356194, 361769, 368232, 375169, 382500, 390317, 398676, 407757, 417791, 428567, 439427, 450137, 461506, 474693, 490062, 507190, 525961, 547133, 571593, 599373, 629642, 661499, 694516, 728533, 763170, 797754, 831613, 864165, 894514, 921123, 942270, 957030, 965776, 969719, 970089, 967773, 963382, 957355, 949939, 941160, 930795, 918416, 903635, 886454, 867253, 846341, 823651, 799020, 772703, 745496, 718454, 692543, 668366, 645962, 625008, 605451, 587938, 573347, 561922, 553133, 546489, 542143, 540433, 541077, 543215, 546293, 550495, 556085, 562571, 568919, 574619, 580287, 587139, 596092, 607458, 621141, 636806]
63552F36806J7153J8344J9854K2273K5669K9627L3598L7057L9550M0798M0674
63541I61403L8904L5032K8961K1449J3715O568J95n257r277j1421j1974j1894
63529A056404j2116j2963j4278j5966j8197k1079k4285k7312k9986l2428l4507
63518H13287l5668l5518l4290l2595l0838k9089k7226k5038k2378j9471j6882
63507E04294j4920j3325j1782j0415r462q694p702o554n649n066m603m353m561
63494C97208m898m561l412k277j825j680j168l56K33N74J087J747J999J603R93
63479C85267O89P95J310K367L810M854M682L256J365j43r16j131j242j681k468
63464D00814l155l320l102k884k596j782m89M69N18J70M15J474K660L372L635
$$ y = [636806, 653959, 672303, 692157, 714430, 740099, 769726, 803324, 840381, 879931, 920729, 961403, 1000307, 1035339, 1064300, 1085749, 1099464, 1106032, 1106227, 1100970, 1091693, 1080272, 1068298, 1056404, 1044288, 1031325, 1017047, 1001081, 982884, 961805, 937520, 910208, 880222, 847794, 813287, 777619, 742101, 707811, 675216, 644378, 615289, 588063, 563025, 540647, 521176, 504294, 489374, 476049, 464267, 453852, 444390, 435696, 427994, 421440, 415791, 410725, 406122, 401769, 397208, 392310, 387749, 384337, 382060, 380235, 378555, 377387, 377031, 377264, 377838, 378925, 380672, 382671, 384274, 385267, 385956, 386751, 388061, 390428, 394238, 399092, 403774, 407030, 408395, 408252, 407336, 406205, 404963, 403282, 400814, 397659, 394339, 391237, 388353, 385757, 383975, 383486, 383955, 384473, 384643, 385058, 386532, 389192, 392564, 396199]
63449C96199L679L556L402L632M576O122P861R399J0482J1072J1492J2201J3332
63436D97005J4719J6425J8809K1839K4711K6573K7306K7320K6789K5549K3578
63425G50623K1173J8724J6605J5272J5101J6083J7954K0565K3947K8001L2226
63414I76274L5828L8056L8547L7345L4542L0023K3863J6914J0433M962P7m574
63402A242290q505j1150j2813j4353j6241j8424k0848k3476k6060k8403l0694
63391A031323l3048l5032l6207l6804l7169l6846l5070l2128k9227k6989k4918
63380F67885k2494j9846j7078j3894j0387p383n354l579j105J893M400N992P318
63367E86368R222J1809J4486J6679J8474K0517K3183K5977K8171K9933L2224L5397
$$ y = [396199, 399878, 403434, 406836, 410468, 415044, 421166, 429027, 438426, 448908, 459980, 471472, 483673, 497005, 511724, 528149, 546958, 568797, 593508, 620081, 647387, 674707, 701496, 727045, 750623, 771796, 790520, 807125, 822397, 837498, 853581, 871535, 892100, 916047, 944048, 976274, 1012102, 1050158, 1088705, 1126050, 1160592, 1190615, 1214478, 1231392, 1241825, 1246787, 1246864, 1242290, 1233785, 1222635, 1209822, 1195469, 1179228, 1160804, 1139956, 1116480, 1090420, 1062017, 1031323, 998275, 963243, 927036, 890232, 853063, 816217, 781147, 749019, 719792, 692803, 667885, 645391, 625545, 608467, 594573, 584186, 576803, 571449, 567870, 566765, 568658, 573058, 579050, 586368, 595590, 607399, 621885, 638564, 657038, 677555, 700738, 726715, 754886, 784819, 817043, 852440]
63355H52440L8526M0472M1065M0788L9788L7753L4459K9918K4158J7381J0265
63344A207013L719j684n811q783j0899j2599j4178j5689j7299j9392k2069k4873
63332A057456k7386k9737l2187l4422l5793l6027l5262l3563l0895k7522k3871
63321G10791k0081j6047j2031q860p414p957r876j1936j3131j3564j4241j5679
63309E59974j7085j7321j6318j4956j3851j2934j2088j1386j0633r462q044p030
63297D08866o519n762m298k768k092k257k474k296k017k040k396k912l496m054
63283C63485m282l806k587j144k06m4k54l57m00o34q39n17J83M49o8o56n56oK86
63264C48047L09O29J333J883K030K116K339K367K042J850K252L027L720M346N097
$$ y = [852440, 890966, 931438, 972503, 1013291, 1053079, 1090832, 1125291, 1155209, 1179367, 1196748, 1207013, 1210732, 1209048, 1203237, 1194454, 1183555, 1170956, 1156778, 1141089, 1123790, 1104398, 1082329, 1057456, 1030070, 1000333, 968146, 933724, 897931, 861904, 826642, 793079, 762184, 734662, 710791, 690710, 674663, 662632, 653772, 646358, 638401, 628525, 616589, 603458, 589894, 575653, 559974, 542889, 525568, 509250, 494294, 480443, 467509, 455421, 444035, 433402, 423940, 415896, 408866, 402347, 396585, 392287, 389519, 387427, 385170, 382696, 380400, 378383, 376343, 373947, 371035, 367539, 363485, 359203, 355397, 352810, 351666, 351460, 351416, 351162, 350805, 350405, 349771, 348932, 348415, 348598, 349047, 348979, 348323, 347767, 347761, 348047, 348356, 348985, 350318, 352201, 354231, 356347, 358686, 361053, 363095, 364945, 367197, 370224, 373944, 378290, 383387]
63249C83387N693N655N148M927N449O483P602Q590R381J0084J1098J2666J4259
63236D90422J4990J4816J4713J5434J6734J8158J9866K1966K3680K4029K3132
63225F97940K2075K1641K1765K2112K2430K2471K2253K2404K3457K4846K5310
63214I48704K4411K2894K1420J9752J7443J4502J1029O910K259k468p216j2378
63202A067262j7738k2164k4961k6739k8212k8872k7871k5597k3267k1280j9053
63191H01508j6262j3188r894o175k427N07K602M853P836J0891J3180J4777J6278
63178H24486J7939J9622K1098K1984K1927K1273K0960K1276K1310K0208J8411
63167A050494J6893J5608J3611J0524O970L451l17m735r617j4524j9231k3572
$$ y = [383387, 389080, 394735, 399883, 404810, 410259, 416742, 424344, 432934, 442315, 452399, 463497, 476163, 490422, 505412, 520228, 534941, 550375, 567109, 585267, 605133, 627099, 650779, 674808, 697940, 720015, 741656, 763421, 785533, 807963, 830434, 852687, 875091, 898548, 923394, 948704, 973115, 996009, 1017429, 1037181, 1054624, 1069126, 1080155, 1087065, 1089324, 1086856, 1079640, 1067262, 1049524, 1027360, 1002399, 975660, 947448, 918576, 890705, 865108, 841841, 820561, 801508, 785246, 772058, 762164, 755989, 753562, 754069, 756671, 761524, 769360, 780251, 793431, 808208, 824486, 842425, 862047, 883145, 905129, 927056, 948329, 969289, 990565, 1011875, 1032083, 1050494, 1067387, 1082995, 1096606, 1107130, 1114100, 1117551, 1117234, 1112499, 1102882, 1088358, 1069127, 1045555]
63155A045555k7156k9699l1266l1958l1720l0791k9892k9398k8590k6524k3492
63144G25069k0913j9531j8529j6830j4633j2995j2235j1542j0078p875n518l598
63132E70792k516k312k422k045r58L05J283K134L157M266N248O112O824P051O664
63117F03583O127N867N573M712L523K874L072L459L315K659J997J668J648J763
63103F51840J809J562Q61k41j300j653j061k47k84j192j726j030R5K75m67p79
63087F46462N8J208J539R97M31N46J313K070K108J560J604L116N271O316N847
63072F80446N289N835O964P619P849Q385R282J0055J0716J1719J3101J4572J6332
63059H08164J8847K1898K4643K6687K8442L0358L2550L5189L8470M2017M5013
$$ y = [1045555, 1018399, 988700, 957434, 925476, 893756, 862965, 833073, 803675, 775085, 748561, 725069, 704156, 684625, 666096, 649266, 634633, 621638, 609403, 597861, 587783, 579908, 574390, 570792, 568276, 565964, 563542, 561497, 560539, 560844, 562127, 564261, 567418, 571684, 576932, 583044, 589868, 596919, 603583, 609710, 615577, 621150, 625862, 629385, 632259, 635331, 638790, 642105, 644764, 646761, 648429, 650077, 651840, 653649, 655211, 656072, 655831, 654531, 652878, 651817, 651570, 651286, 650094, 648368, 647338, 647433, 647708, 647241, 646462, 646520, 647728, 649267, 650264, 650695, 651241, 652554, 654624, 656732, 658292, 659896, 663012, 668283, 674599, 680446, 685735, 691570, 698534, 706153, 714002, 722387, 731669, 741724, 752440, 764159, 777260, 791832, 808164, 827011, 848909, 873552, 900239, 928681, 959039, 991589, 1026778, 1065248, 1107265, 1152278]
63048A152278M7241M9326N1622N3547N4497N4911N5707N6969N7802N7475N6265
63037A747640N5051N4420N4278N4171N3770N2982N1564M8928M4606L8880L2439
63026B288729K5382J7030P018l930j4737k5086l5219m4914n3399o0145o5078o7965
63014A967686o8357o6476o3414o0017n5962n0541m3857l6698k9565k2484j5575
63003A454740r028k568M220J0904J6375K0243K3380K6599K9545L1485L2560L3532
62991A671987L4652L5634L6427L7144L7327L6209L3781L0838K7757K3957J8822
62980B024535J2483N423k082r805j7477k5228l3470m1869m9130n4323n7918o0793
62968A690346o2794o3124o1737n9370n6450n2909m9052m5563m2555l9604l6897
$$ y = [1152278, 1199519, 1248845, 1300467, 1354014, 1408511, 1463422, 1519129, 1576098, 1633900, 1691375, 1747640, 1802691, 1857111, 1911389, 1965560, 2019330, 2072312, 2123876, 2172804, 2217410, 2256290, 2288729, 2314111, 2331141, 2338159, 2334229, 2319492, 2294406, 2259187, 2214273, 2160874, 2100729, 2035651, 1967686, 1899329, 1832853, 1769439, 1709422, 1653460, 1602919, 1559062, 1522364, 1492799, 1470315, 1454740, 1445712, 1443144, 1447364, 1458268, 1474643, 1494886, 1518266, 1544865, 1574410, 1605895, 1638455, 1671987, 1706639, 1742273, 1778700, 1815844, 1853171, 1889380, 1923161, 1953999, 1981756, 2005713, 2024535, 2037018, 2042441, 2040359, 2030554, 2013077, 1987849, 1954379, 1912510, 1863380, 1809057, 1751139, 1690346, 1627552, 1564428, 1502691, 1443321, 1386871, 1333962, 1284910, 1239347, 1196792, 1157188, 1120291]
62957A120291l5235l4511l3300l0760k8021k6603k6133k4930k2572k0468j9738
62946H18020j9755j9367j8513j7766j7032j5696j3843j2329j1616j1235j0595
62935F50273r746r026q384p366n670l520j626q00j247k216k623k138j378r80q97
62920E92656q59r06j128j268j162j257k044l188l858l865l803m043m240m035l571
62905E53429l071k454j762j431j701k128k133j730j258p64j85J15k51r00r17j52
62889E32707L86k33j615k513k320j641j343j447j270m55N25J049J127J219J348
62874E25524R69j56j336j614r10j13k1m92p70m86j39m26j286j832j455o49m03
62857E14405p93r06k00O45P16J77j4N60J413K034K408K613K474J892J104L40m16
$$ y = [1120291, 1085056, 1050545, 1017245, 986485, 958464, 931861, 905728, 880798, 858226, 837758, 818020, 798265, 778898, 760385, 742619, 725587, 709891, 696048, 683719, 672103, 660868, 650273, 640527, 631501, 623117, 615751, 610081, 606561, 604935, 604135, 602888, 600672, 598049, 595911, 594533, 593553, 592656, 591797, 590891, 589763, 588495, 587333, 586076, 584032, 580844, 576986, 573121, 569318, 565275, 561035, 557000, 553429, 550358, 547904, 546142, 544711, 543010, 540882, 538749, 537019, 535761, 534997, 534812, 534927, 534676, 533776, 532859, 532707, 533093, 532860, 531245, 528732, 526412, 524771, 523428, 521981, 520711, 520256, 520781, 521830, 522957, 524176, 525524, 526493, 526337, 525001, 523387, 522477, 522364, 522343, 521851, 521081, 520595, 520456, 520030, 518744, 516912, 515457, 514808, 514405, 513612, 512706, 512506, 513151, 513867, 514044, 514030, 514590, 516003, 518037, 520445, 523058, 525532, 527424, 528528, 528868, 528452]
62840E28452j111j337p46L94J315J371M93p88j690j738j147n62l32k16J23O30
62824E23111J056J315J449J420J244J141J290J546J744K027K549K988K881K390
62810E48151K244K710L219L204K906K979L633M556N472O316P057P714Q466R328
62796F17955R861R650R019Q819R499J0861J2763J5416J8765K2156K5075K7857
62784G97696L1204L5293L9832M4710N0083N5818O1336O6212P0605P5000P9555
62773A407344Q3700Q6366Q6765Q5046Q1865P7288P0605O1463N0615L9006K6677
62762B156740J3266p52j4289k6944l9178n1046o1619o9898p5651p9138q0686q0855
62750A589950q0305p9169p7026p3728o9714o5324o0495n5484n1044m7416m3856
$$ y = [528452, 527341, 526004, 525258, 525652, 526967, 528338, 528831, 528043, 526353, 524615, 523468, 522906, 522574, 522358, 522481, 523111, 524167, 525482, 526931, 528351, 529595, 530736, 532026, 533572, 535316, 537343, 539892, 542880, 545761, 548151, 550395, 553105, 556324, 559528, 562434, 565413, 569046, 573602, 579074, 585390, 592447, 600161, 608627, 617955, 627816, 637466, 646485, 655304, 664803, 675664, 688427, 703843, 722608, 744764, 769839, 797696, 828900, 864193, 904025, 948735, 998818, 1054636, 1115972, 1182184, 1252789, 1327789, 1407344, 1491044, 1577410, 1664175, 1749221, 1831086, 1908374, 1978979, 2040442, 2091057, 2130063, 2156740, 2170006, 2169254, 2154965, 2128021, 2088843, 2037797, 1976178, 1906280, 1830629, 1751491, 1670805, 1589950, 1509645, 1430476, 1353450, 1279722, 1210008, 1144684, 1084189, 1028705, 977661, 930245, 886389]
62739H86389l9783l5728l2384k9396k5962k2195j8931j6478j4436j2620j1194
62728F27282r946q343o418m839l957l396k749j996j107J31J679L117M215N164
62714E98837O114O967P825R136J1142J3552J6010J8505K1146K3875K6692K9777
62702G89578L3227L6870M0537M4294M8273N2490N6901O1348O5474O8944P1805
62691A369741P4200P5742P5600P3278O8844O2442N4111M4213L3374K1735Q953
62680A962233m728j8050k9952m0590n0534n9431o6216p0495p2890p4077p4112
62669A401158p2901p0739o8059o4937o1148n6674n1944m7510m3548l9781l6018
62658G87899l2546k9675k7072k4141k0985j8370j6519j4807j2952j1641j1259
$$ y = [886389, 846606, 810878, 778494, 749098, 723136, 700941, 682010, 665532, 651096, 638476, 627282, 617336, 608993, 602575, 597736, 593779, 590383, 587634, 585638, 584531, 584662, 586341, 589458, 593673, 598837, 604951, 611918, 619743, 628879, 640021, 653573, 669583, 688088, 709234, 733109, 759801, 789578, 822805, 859675, 900212, 944506, 992779, 1045269, 1102170, 1163518, 1228992, 1297936, 1369741, 1443941, 1519683, 1595283, 1668561, 1737405, 1799847, 1853958, 1898171, 1931545, 1953280, 1962233, 1957505, 1939455, 1909503, 1868913, 1818379, 1758948, 1692732, 1622237, 1549347, 1475270, 1401158, 1328257, 1257518, 1189459, 1124522, 1063374, 1006700, 954756, 907246, 863698, 823917, 787899, 755353, 725678, 698606, 674465, 653480, 635110, 618591, 603784, 590832, 579191, 567932]
62647E67932j0835r317p379o650p288p684o763n324m549m294l659k495j359m76
62633D89860L05P60L85o67j492j478r53o15p25j102j557k090k693l130k931j725
62617D70152K59K151L160L340L375L693M135M499M953N717O603P204P386P421
62603E34048P745Q722J0426J2528J4561J6548J9080K2486K6089K8801L0371L1622
62591G63027L3411L5751L8123M0139M1463M1486L9659L6200L2021K7726K3009
62580A152015J7194J0198K687m607j1457j7923k3816k8653l2105l4312l5660l6386
62568I57175l6535l6170l5436l4424l3102l1468k9612k7584k5357k2875k0154
62557F24458j7290j4498j2124j0431r350q553p774o930n989m905l750k724j958
$$ y = [567932, 557097, 547780, 540401, 533751, 526463, 518779, 512016, 506692, 502143, 497849, 494190, 491695, 490336, 489860, 490165, 490925, 491310, 490643, 489151, 487673, 486720, 486105, 485380, 484278, 482721, 480631, 477938, 474808, 471877, 470152, 470411, 472562, 475722, 479062, 482437, 486130, 490265, 494764, 499717, 505434, 512037, 519241, 526627, 534048, 541793, 550515, 560941, 573469, 588030, 604578, 623658, 646144, 672233, 701034, 731405, 763027, 796438, 832189, 870312, 910451, 951914, 993400, 1033059, 1069259, 1101280, 1129006, 1152015, 1169209, 1179407, 1182094, 1177487, 1166030, 1148107, 1124291, 1095638, 1063533, 1029221, 993561, 957175, 920640, 884470, 849034, 814610, 781508, 750040, 720428, 692844, 667487, 644612, 624458, 607168, 592670, 580546, 570115, 560765, 552212, 544438, 537508, 531519, 526614, 522864, 520140, 518182]
62544E18182j498j469j929k522k578j789n79L52O52L55l43j007j039j75J167K382
62528E08162L312M084M619M849N277O665R038J1463J3134J4286J5812J8206K1155
62515F40062K4045K6709K9585L3131L7093M0536M2837M4370M5840M7191M7629
62504A059028M6648M4399M1036L6432L0805K4932J9316J3629P587J896k303m742
62492A318663o135p008p046n712k942R56N671J0890J6235K1490K6732L1953L6591
62479A440338L9678M0452L8813L5326L0874K6117K0930J4383N540n492j7329k8251
62467A641379l7375m4933n1587n7646o2864o6721o8760o8722o6676o3085n8730
62456I94280n4298m9963m5367m0216l4816k9877k5734k2053j8474j5160j2365
$$ y = [518182, 516684, 515215, 513286, 510764, 508186, 506397, 505818, 506170, 506822, 507177, 506834, 505827, 504788, 504613, 505780, 508162, 511474, 515558, 520177, 525026, 530303, 536968, 546006, 557469, 570603, 584889, 600701, 618907, 640062, 664107, 690816, 720401, 753532, 790625, 831161, 873998, 918368, 964208, 1011399, 1059028, 1105676, 1150075, 1191111, 1227543, 1258348, 1283280, 1302596, 1316225, 1323812, 1325708, 1323405, 1318663, 1312528, 1305520, 1298474, 1292762, 1289820, 1290776, 1296447, 1307337, 1323572, 1345062, 1371794, 1403747, 1440338, 1480016, 1520468, 1559281, 1594607, 1625481, 1651598, 1672528, 1686911, 1692451, 1686959, 1669630, 1641379, 1604004, 1559071, 1507484, 1449838, 1386974, 1320253, 1251493, 1182771, 1116095, 1053010, 994280, 939982, 890019, 844652, 804436, 769620, 739743, 714009, 691956, 673482, 658322, 645957]
62445F45957r794o927l885j316O01K313L941M961N210N489O459P484P414O155
62431F74062M588L143J369r81l347n151o532p919r310j0330j0725j0546j0111
62418F08210r856j0045j0421j0455r936r060p979o707n452m601m242m114m013
62405E11329l878l509k761k020j794j846j423n58j54m53m11P18K041K203J368
62390D98852Q87J422K402L270M117M842M768L644K437K406L648N045N614N523
62376E48877N667O546P754Q616R052R576J0489J1497J2203J2672J3335J4541J6453
62363F87278J9074K2145K5224K8123L1143L4713L9005M3957M9273N4200N7835
62352A091970N9999O1393O2369O2045N9156N3544M6138L7763K8693J9311J0334
$$ y = [645957, 636163, 629236, 625351, 624035, 624636, 626949, 630890, 635851, 641061, 646550, 653009, 660493, 667907, 674062, 678650, 681793, 683162, 682181, 678834, 673683, 667151, 659232, 649922, 639592, 628867, 618321, 608210, 598354, 588309, 577888, 567433, 557497, 548437, 540458, 533751, 528299, 523698, 519456, 515342, 511329, 507451, 503942, 501181, 499161, 497367, 495521, 494098, 493540, 493386, 492933, 492522, 493240, 495281, 497484, 498852, 499739, 501161, 503563, 506833, 510950, 515792, 520560, 524204, 526641, 529047, 532695, 537740, 543354, 548877, 554544, 561090, 568844, 577460, 586512, 596088, 606577, 618074, 630277, 642949, 656284, 670825, 687278, 706352, 728497, 753721, 781844, 812987, 847700, 886705, 930662, 979935, 1034135, 1091970, 1151969, 1213362, 1275731, 1337776, 1396932, 1450476, 1496614, 1534377, 1563070, 1582381, 1592715]
62341A592715K186n291j2325j8853k4861l0553l5960m0658m4110m6018m6306m5124
62329A244842m2978m0556l8224l5874l3354l0737k8204k5878k3896k2364k1211
62318I01566k0325j9836j9916k0292k0362j9924j9381j8997j8286j6497j3624
62307F94126j0597q452p362o545n098k892n36J453L148M786O239P211P698P802
62293F90981P332O091M467L156K333J604P70J07k58o48j316k097k786l412l840
62278G02484l612k573j342o73n67l62L71J377K154K611L253M738P263J0300J3126
62263G38548J5484J7627J9904K2655K6368L1349L7088M2492M7066N1425N6324
62252A106330O1459O5624O7744O7456O4921O0544N4769M7887M0030L1426K2429
$$ y = [1592715, 1594901, 1589610, 1577285, 1558432, 1533571, 1503018, 1467058, 1426400, 1382290, 1336272, 1289966, 1244842, 1201864, 1161308, 1123084, 1087210, 1053856, 1023119, 994915, 969037, 945141, 922777, 901566, 881241, 861405, 841489, 821197, 800835, 780911, 761530, 742533, 724247, 707750, 694126, 683529, 675077, 667715, 661170, 656072, 653180, 652644, 654097, 657245, 662031, 668270, 675481, 683179, 690981, 698313, 704404, 708871, 712027, 714360, 715964, 716734, 716841, 716583, 715935, 714619, 712522, 709736, 706324, 702484, 698872, 696299, 694957, 694284, 693717, 693355, 693726, 695103, 697257, 699868, 703121, 707859, 715122, 725422, 738548, 754032, 771659, 791563, 814218, 840586, 871935, 909023, 951515, 998581, 1050006, 1106330, 1167789, 1233413, 1301157, 1368613, 1433534, 1494078, 1548847, 1596734, 1636764, 1668190, 1690619]
62241A690619J3141L388o687j6377k5102l2953m0204m6561n1598n5537n8888o1300
62229A311941o1606n9264n5195n0880m7068m3634m0216l6549l2572k8601k5290
62218H31066k2949k1051j8793j6035j3331j1155r600q677q354q156p386o054m987
62205F74538m602m094k555m78P10N83L02J050K628L986M517M390M067M060M764
62190F93866N983O885O987O907P592R046J0373J0962J0960J0658J0180R813R940
62177H10152J0413J0586J0265J0006J0261J0760J1125J1649J2957J5270J8435
62166I41879K2336K6829L1419L5548L9089M2168M4558M5710M5408M3940M1483
62155A360367L7603L1705K3939J5431P502O59n513j1532j7290k2311k6464l0088
$$ y = [1690619, 1703760, 1707148, 1700461, 1684084, 1658982, 1626029, 1585825, 1539264, 1487666, 1432129, 1373241, 1311941, 1250335, 1191071, 1135876, 1084996, 1037928, 994294, 954078, 917529, 884957, 856356, 831066, 808117, 787066, 768273, 752238, 738907, 727752, 718152, 709475, 701121, 692965, 685579, 679525, 674538, 669936, 665842, 663287, 662809, 663519, 664102, 664404, 665454, 668082, 672068, 676585, 680975, 685042, 689102, 693866, 699849, 706734, 713721, 720628, 728220, 737266, 747639, 758601, 769561, 780219, 790399, 800212, 810152, 820565, 831151, 841416, 851422, 861683, 872443, 883568, 895217, 908174, 923444, 941879, 964215, 991044, 1022463, 1058011, 1097100, 1139268, 1183826, 1229536, 1274944, 1318884, 1360367, 1397970, 1429675, 1453614, 1469045, 1476547, 1477206, 1471693, 1460161, 1442871, 1420560, 1394096, 1364008]
62143A364008l3449l6417l8707m0039m0073l8589l5959l3048l0369k7597k4185
62132I85576k0271j6705j4278j3148j2849j2607j1808j0420q973q023p611p344
62120H41539o829n928m680l174j487K78J895L026L419L098K189P74r14k322l035
62105H27849l308l664m070m069l761l941m947o061o485o349o212o022n320m120
62091G59520k915j908q75K03J043J682K637M214N964P166P612P784Q302R312J0476
62076H20217J1496J2578J4114J5974J7432J8025J8121J8353J8833J9347K0114
62065A004604K1702K4206K6940K9144L0687L1940L3180L4160L4165L2481K8998
62054A332207K4298J9025J3327P098O31n368j0501j5107j9900k5252l0873l6004
$$ y = [1364008, 1330559, 1294142, 1255435, 1215396, 1175323, 1136734, 1100775, 1067727, 1037358, 1009761, 985576, 965305, 948600, 934322, 921174, 908325, 895718, 883910, 873490, 864517, 856494, 848883, 841539, 834710, 828782, 824102, 820928, 819441, 819719, 821614, 824640, 828059, 831157, 833346, 834120, 833206, 830884, 827849, 824541, 820877, 816807, 812738, 808977, 805036, 800089, 794028, 787543, 781194, 774982, 768960, 763640, 759520, 756605, 754697, 753822, 754025, 755068, 756750, 759387, 763601, 769565, 776731, 784343, 792127, 800429, 809741, 820217, 831713, 844291, 858405, 874379, 891811, 909836, 927957, 946310, 965143, 984490, 1004604, 1026306, 1050512, 1077452, 1106596, 1137283, 1169223, 1202403, 1236563, 1270728, 1303209, 1332207, 1356505, 1375530, 1388857, 1395955, 1396586, 1391218, 1380717, 1365610, 1345710, 1320458, 1289585, 1253581]
62042A253581l9920m2365m3567m3967m3919m3569m2753m1065l8365l5164l2152
62031H06775k9341k6251k3040k0644j9382j8205j6061j3415j1532j0704j0142
62020F08058r389q704q141p377o669o837p868q482p732o245n148m505l625k471
62006E14865j750j719j785j432p76m5R30K249L393L656L042K358K307K714K899
61991E30906K576K051J512O20r06k635l873m540n124n857o503o998p620q300q416
61976D76893p679o675o026n529m703l827l609l954l925l036j887j247j080r18
61962D22798o85o12o20l51K04N97N73M75P84J484K146K500K721L132L768M403
61946D43317M885N377O178P291Q334Q943R143R250R419R590R797J0240J0861J1216
$$ y = [1253581, 1213661, 1171296, 1127729, 1083762, 1039843, 996274, 953521, 912456, 874091, 838927, 806775, 777434, 751183, 728143, 707499, 688117, 669912, 653851, 640436, 628904, 618200, 608058, 598669, 589965, 581824, 574447, 567778, 560941, 553073, 544591, 536859, 530614, 525466, 520961, 517336, 514865, 513115, 511396, 509611, 508179, 507403, 507358, 508288, 510537, 513930, 517586, 520628, 522986, 525293, 528007, 530906, 533482, 535533, 537045, 537665, 536759, 534124, 530251, 525711, 520587, 514730, 508227, 501229, 493609, 485309, 476893, 469214, 462539, 456513, 450984, 446281, 442454, 438845, 434891, 430966, 427930, 426043, 424796, 423716, 422798, 422113, 421501, 420881, 420530, 420734, 421331, 421904, 422379, 423163, 424647, 426793, 429293, 432014, 435146, 438914, 443317, 448202, 453579, 459757, 467048, 475382, 484325, 493468, 502718, 512137, 521727, 531524, 541764, 552625, 563841]
61932E63841J1008J0512J0110R609Q514O892N458M710M393L948L089J766l3k119
61918F41698m015n324n968n919n019l330j367L39J689K813L723M486N398O591
61904F35795P703Q314Q485Q510Q314P568O180M281J965n11k500l584m246n348
61890F80926o956q287q775q593q129p563p053o734o412n775n057m923n541o310
61876E84818o714o890p116p279p206p012o727n979m508k715j255k96N17J487K543
61861E25668L422L968M331M911N944P206Q388R612J1167J2806J3931J4556J5438
61848F41348J7030J8830K0082K0532K0270J9392J8164J6971J5672J3612J0654
61837H32557P559M891K228q21l518m823m881m682m528l842k375n79J279L374N472
$$ y = [563841, 574849, 585361, 595471, 605080, 613594, 620486, 625944, 630654, 635047, 638995, 642084, 643850, 643817, 641698, 637683, 632359, 626391, 620472, 615453, 612123, 610756, 611095, 612784, 615597, 619320, 623806, 629204, 635795, 643498, 651812, 660297, 668807, 677121, 684689, 690869, 695150, 697115, 696604, 694104, 690520, 686274, 680926, 673970, 665683, 656908, 648315, 640186, 632623, 625570, 618836, 612424, 606649, 601592, 596669, 591128, 584818, 578104, 571214, 564098, 556819, 549613, 542601, 535874, 529895, 525387, 522672, 521417, 521121, 521638, 523125, 525668, 529090, 533058, 537389, 542300, 548244, 555450, 563838, 573450, 584617, 597423, 611354, 625910, 641348, 658378, 677208, 697290, 717822, 738092, 757484, 775648, 792619, 808291, 821903, 832557, 840116, 845007, 847235, 846414, 842896, 838073, 833192, 828510, 823982, 820140, 817765, 817186, 818465, 821839, 827311]
61822H27311O717O732O244O123O277N886M389J780j667n486q951j1398j2745j3514
61808H17698j4271j5047j5339j4721j3476j2499j2407j2876j3018j2346j1169
61797F70529j0101r409q852q025o911o064o017o423o251n060l631k921k865k798
61783E85201k634k799l254l424l201l129l381l344k566j527r76r94j085r45p13
61768E51229o62q75j074p68J68J086J207P18O58J551K726L326L332L215L066K736
61752E71639K344K059J602O31n28j236j514k062l181m282m667m396m066l971l837
61737E44535l278k304j311o85m93n83q19j049r58k71P82J534J592J206Q15N32
61721E39245L12K92O00J007J179J101R30O15M0n98r48j006j052j177j304j615
$$ y = [827311, 834028, 840760, 847004, 853127, 859404, 865290, 869679, 871459, 869792, 864306, 855355, 843957, 831212, 817698, 803427, 788380, 773041, 758320, 744844, 732345, 719938, 707062, 694044, 681698, 670529, 660428, 651019, 642167, 634142, 627231, 621167, 615150, 608727, 602476, 597416, 593785, 590864, 587999, 585201, 582567, 579768, 576514, 573090, 569889, 566760, 563379, 560035, 557469, 555942, 554966, 553972, 552887, 551942, 551229, 550567, 549692, 548618, 547850, 548018, 549104, 550311, 551029, 551687, 553238, 555964, 559290, 562622, 565837, 568903, 571639, 573983, 576042, 577644, 578275, 577747, 576511, 574997, 572935, 569754, 565472, 560805, 556409, 552343, 548372, 544535, 541257, 538953, 537642, 536957, 536464, 535881, 535062, 534013, 533055, 532784, 533566, 535100, 536692, 537898, 538713, 539245, 539557, 539849, 540449, 541456, 542635, 543736, 544666, 545281, 545321, 544723, 543775, 542769, 541717, 540540, 539236, 537621]
61705E37621k394l377l796l341k661k602l212l798l863l605l547l880m265m262
61691D89018l843l392l160l013k852k990l629m181l784k554j717k123l180l630
61677D44970l072k158j572j333j093o67j32K71L36J43M3J93K36j87p89q57k00
61660D34132O18J008R36P21O04P80J343K001K172J726J249J270J510J428J173
61645D52671J333J868J997J323M25M0J62L05K42P0j87n53q60r31q63p93n43j1
61627D55695L27j71j375k408k718k605k491k313j921j667j995k700l080k793k172
61612D25613j775j833k148k322k159j954k203k876l295l039k632k834l546l972
61598C89025l737l242k895k631k326k046j760j312r22j084j718k060j789j648
$$ y = [537621, 535227, 531850, 528054, 524713, 522052, 519450, 516238, 512440, 508577, 504972, 501425, 497545, 493280, 489018, 485175, 481783, 478623, 475610, 472758, 469768, 466139, 461958, 458174, 455620, 453903, 451780, 448600, 444970, 441898, 439740, 438168, 436835, 435742, 435075, 434943, 435214, 435550, 435693, 435736, 435929, 436165, 435978, 435189, 434332, 434132, 434750, 435758, 436694, 437415, 438019, 438799, 440142, 442143, 444315, 446041, 447290, 448560, 450070, 451498, 452671, 454004, 455872, 457869, 459192, 459617, 459657, 459819, 460124, 460366, 460436, 460249, 459696, 458836, 457905, 457042, 456249, 455706, 455695, 456022, 455851, 454476, 452068, 449350, 446745, 444254, 441941, 440020, 438353, 436358, 433658, 430578, 427785, 425613, 423838, 422005, 419857, 417535, 415376, 413422, 411219, 408343, 405048, 402009, 399377, 396543, 392997, 389025, 385288, 382046, 379151, 376520, 374194, 372148, 370388, 369076, 368154, 367070, 365352, 363292, 361503, 359855]
61584C59855k316l197l123j967p50k90m69q08j110j273j139p68m90m73n32m88
61568C40662l70j71K04O21P97P86J018J587K010J876J468J316J514J793J990K090
61552C59191J967J435N58l14p73n87J17Q07R79P56P35J104J389J223R21Q74R55
61535C71337R79J266K037K679K396J407O65M82K74l28r55j245j305j230q78m48
61519C77133n27j169j650j563j456j762j858r80L89J026N89j48n44p23r27j047
61503C64783j056j194j426j199j68J222K137K120J292J89m59j56Q18J559J511
61488C69973J056Q75J038J119R15O77O41Q12J190J804K433K682K587K739L456
61473C93997M060L524J823J94k41K62N19r9j125j863k199k307k073j291k76L29
$$ y = [359855, 357539, 354342, 351219, 349252, 348502, 348212, 347743, 346935, 345825, 344552, 343413, 342645, 342155, 341682, 341150, 340662, 340292, 340121, 340325, 340946, 341743, 342529, 343547, 345134, 347144, 349020, 350488, 351804, 353318, 355111, 357101, 359191, 361158, 362593, 363151, 362837, 362064, 361477, 361594, 362401, 363380, 364136, 364871, 365975, 367364, 368587, 369508, 370382, 371337, 372316, 373582, 375619, 378298, 380694, 382101, 382766, 383248, 383522, 383194, 382239, 380994, 379689, 378459, 377581, 377133, 376606, 375437, 373787, 372224, 370768, 369006, 367148, 366168, 366557, 367583, 368172, 368024, 367480, 366757, 365830, 364783, 363727, 362533, 361107, 359908, 359740, 360962, 363099, 365219, 366511, 366700, 366241, 366085, 366903, 368462, 369973, 371029, 371904, 372942, 374061, 374976, 375653, 376294, 377106, 378296, 380100, 382533, 385215, 387802, 390541, 393997, 398057, 401581, 403404, 403598, 403357, 403619, 404138, 404039, 402914, 401051, 398852, 396545, 394472, 393181, 392905, 393234]
61457C93234L03M5m4o0l18q73j485j850j720r84J10R41R70K52o03r73o48J69J112
61438C87578J861K231K166J777J344J162J286J465J439J246J073Q97N56J73J83
61423D06437P99J637K095J971J556J264J327J699K052J984J437Q73P75J072J222
61408D28200Q55J63l43l14J43N46M93J51J17N91R51N61k56o17m03m36j149j751
61390D27502j299r2P04N99K41L53Q54J238J380J545J863K098K013J762J849K521
61374D45131L281L240K236J277J530K900M142M329L703K984K409J835J262Q44
61360D81103N17J24j89j74N8J14o0rO44J703K630L154L444L796M223M445M256
61343E09779L806L474L472L696L874L793L341K596J843J322R27L79k48n12l05
$$ y = [393234, 393537, 393582, 393538, 393478, 393160, 392287, 390802, 388952, 387232, 386248, 386358, 387299, 388269, 388521, 387918, 386945, 386297, 386466, 387578, 389439, 391670, 393836, 395613, 396957, 398119, 399405, 400870, 402309, 403555, 404628, 405525, 406081, 406254, 406437, 407236, 408873, 410968, 412939, 414495, 415759, 417086, 418785, 420837, 422821, 424258, 425131, 425906, 426978, 428200, 429055, 429218, 428875, 428561, 428704, 429250, 429743, 429894, 430011, 430602, 431553, 432114, 431858, 431241, 430838, 430402, 429253, 427502, 426203, 426111, 426815, 427414, 427655, 428008, 428862, 430100, 431480, 433025, 434888, 436986, 438999, 440761, 442610, 445131, 448412, 451652, 453888, 455165, 456695, 459595, 463737, 468066, 471769, 474753, 477162, 478997, 480259, 481103, 481620, 481744, 481555, 481381, 481439, 481553, 481493, 481484, 482128, 483831, 486461, 489615, 493059, 496855, 501078, 505523, 509779, 513585, 517059, 520531, 524227, 528101, 531894, 535235, 537831, 539674, 540996, 541923, 542302, 542054, 541542, 541237]
61328E41237k10q53k038k885k737j736n22M11J076J786K620L216L286L205L628
61313E49484M599N576O476P901R947J1609J2052J1886J2311J3377J4131J4189
61301F73538J4119J4192J3811J2413J0220P730N204K836P82j237l689o323q218
61288G35378r022r424j0066j0730j1031j1149j1231j0807r518p965o998o624o256
61275F14557n692n022l984k326o27K08K63N42J444K202K131J700J826K619L406
61260F13247L743L869M168M594M838M821M844N092N232M749L670K621K042J616
61246F69146P05q60k614l864m120l387k300j650j597j601j264q23n18q2O88J317
61230F47176J363J319K044L454M606N034N233N771O640P696Q973J0240J0871J0581
$$ y = [541237, 541027, 540174, 538136, 535251, 532514, 530778, 530256, 530667, 531743, 533529, 536149, 539365, 542651, 545856, 549484, 554083, 559659, 566135, 574036, 583983, 595592, 607644, 619530, 631841, 645218, 659349, 673538, 687657, 701849, 715660, 728073, 738293, 746023, 751227, 754063, 754845, 753608, 749919, 743596, 735378, 726356, 716932, 706866, 696136, 685105, 673956, 662725, 651918, 642400, 634435, 627437, 620813, 614557, 608865, 603843, 599859, 597533, 596906, 597114, 597377, 597919, 599363, 601565, 603696, 605396, 607222, 609841, 613247, 616990, 620859, 625027, 629621, 634459, 639280, 644124, 649216, 654448, 659197, 662867, 665488, 667530, 669146, 669851, 668991, 666377, 662513, 658393, 655006, 652706, 651056, 649459, 647858, 646594, 645771, 645253, 645171, 645859, 647176, 648539, 649858, 651902, 655356, 659962, 664996, 670229, 676000, 682640, 690336, 699309, 709549, 720420, 731001]
61216G31001R927R721J0128J0644J0708J0110Q936P443N991N005M898N745O892
61203H37149P212O188M616L812M244N359O680Q355J0591J3025J5014J6215J6671
61190I55131J6543J5887J4584J2515R976P689O095M838L321J549r2j629l338m923
61176A038146n747n964o574q071r754j0763j1157j1565j2298j3288j4432j5538
61164I12995j6244j6370j6183j6026j5972j5889j5588j4787j3382j1787j0558
61153G50209r644q568p304o213n087l288j090J43k24j131j361j136j294j723j717
61138G00572j320j106j001m83L35R16J446K600M219N456O343P951J0635J3224
61124G49787J4559J5007J5807J7589K0138K3057K5973K8443L0261L1699L3022
$$ y = [731001, 740928, 750649, 760777, 771421, 782129, 792239, 801175, 808618, 814609, 819614, 824512, 830257, 837149, 844361, 850549, 855165, 858977, 863221, 868580, 875260, 883615, 894206, 907231, 922245, 938460, 955131, 971674, 987561, 1002145, 1014660, 1024636, 1032325, 1038420, 1043258, 1046579, 1048128, 1048036, 1046407, 1043069, 1038146, 1032399, 1026435, 1019861, 1011790, 1002036, 991273, 980116, 968551, 956253, 942965, 928533, 912995, 896751, 880381, 864198, 848172, 832200, 816311, 800723, 785936, 772554, 760767, 750209, 740565, 731997, 724693, 718480, 713393, 710105, 709015, 709158, 708934, 707803, 706442, 705306, 704012, 702289, 700572, 699252, 698146, 697145, 696662, 696997, 697913, 699359, 701959, 706178, 711634, 717977, 725928, 736563, 749787, 764346, 779353, 795160, 812749, 832887, 855944, 881917, 910360, 940621, 972320, 1005342]
61113A005342L3983L4213L3821L3291L2914L2621L2144L1099K9152K6511K3966
61102A349057K2041K0231J7516J3610R265N314J847j424m488p156r663j2520j5610
61089A388020j7963j8845j8700j8477j8256j7350j5720j4211j3089j1321q198
61078A215890m815k723j617K58L410O305P728Q557J0295J2820J4706J5293J5306
61065A301413J5555J6084J6622J7052J7167J6614J5393J4001J2769J1463R859
61054A463992Q272P164O379N344M009L105L236L951M141L355K333K061K587L138
61040A523067L248L349M108N601P285Q559R147R196R264J0024J1704J3857J5830
61027A634239J7384J8727K0150K1772K3490K4985K6037K7034K8816L1753L5328
$$ y = [1005342, 1039325, 1073538, 1107359, 1140650, 1173564, 1206185, 1238329, 1269428, 1298580, 1325091, 1349057, 1371098, 1391329, 1408845, 1422455, 1431720, 1437034, 1438881, 1437457, 1432969, 1425813, 1416150, 1403630, 1388020, 1370057, 1351212, 1332512, 1314035, 1295779, 1278429, 1262709, 1248498, 1235409, 1224088, 1215890, 1211075, 1208352, 1206735, 1206993, 1210403, 1216708, 1224436, 1232993, 1243288, 1256108, 1270814, 1286107, 1301413, 1316968, 1333052, 1349674, 1366726, 1383893, 1400507, 1415900, 1429901, 1442670, 1454133, 1463992, 1472264, 1479428, 1485807, 1491151, 1495160, 1498265, 1501501, 1505452, 1509593, 1512948, 1515281, 1517342, 1519929, 1523067, 1526315, 1529664, 1533772, 1539373, 1546658, 1555217, 1564364, 1573560, 1582824, 1592848, 1604552, 1618409, 1634239, 1651623, 1670350, 1690500, 1712272, 1735762, 1760747, 1786784, 1813818, 1842634, 1874387, 1909715]
61016A909715L9104M3714N0217N8623O7910P7504Q8072J00770J16526J36414J62079
61005B850648J95406K38166K91977L57870M35995N26922O33474P60263R11754
60996G202475J092113J303608J535001J744609J863083J832089J651973J386664
60988A9611615J113114Q67690O47543M55414L20080K59378K35152J67385J361
60979B3678732k47611n21028p78650j022228j263461j485697j646806j713785
60971A4999466j686091j588095j448704j290516j129761r77266q38045p13197
60963E327791o03161n08367m27861l59699l02714k56373k19116j88493j62983
60954B299024j42185j25142j10064r5957q3231p2325o3060n5553n0374m7202m4606
$$ y = [1909715, 1948819, 1992533, 2042750, 2101373, 2169283, 2246787, 2334859, 2435629, 2552155, 2688569, 2850648, 3046054, 3284220, 3576197, 3934067, 4370062, 4896984, 5530458, 6290721, 7202475, 8294588, 9598196, 11133197, 12877806, 14740889, 16572978, 18224951, 19611615, 20724729, 21592419, 22239962, 22695376, 23015456, 23274834, 23509986, 23677371, 23678732, 23431121, 22910093, 22131443, 21109215, 19845754, 18360057, 16713251, 14999466, 13313375, 11725280, 10276576, 8986060, 7856299, 6879033, 6040988, 5327791, 4724630, 4216263, 3788402, 3428703, 3125989, 2869616, 2650500, 2462007, 2299024, 2156839, 2031697, 1921633, 1825676, 1742445, 1670120, 1607060, 1551507, 1501133, 1453931, 1409325]
60943A409325m1774l9316l7803l6759l5720l5056l4868l4252l2686l1054l0211
60932A019826k9465k7675k5076k2754k0993j9365j7908j6877j5707j3651j1179
60921G99176r576r197r235r081q759q165p027n675m748m162l317k337j967k186
60907G13744k104j403p22l95k2K87l91k227l851m059l455l441m273n103n496n859
60891F71230o506p157p554p864q301q681q620q040p304o905o992p288p476p450
60877E65092p132o350n230m378m128l916l015j693q82p80o39l8N52P86J142K103
60861E31494L363M341M906N131M904M328L972M100M157L625L033L263M129M460
60847E89206L590K183J333J391J792J722P59q91k594l793m450n008n887o974p653
$$ y = [1409325, 1367551, 1328235, 1290432, 1253673, 1217953, 1182897, 1148029, 1113777, 1081091, 1050037, 1019826, 990361, 962686, 937610, 914856, 893863, 874498, 856590, 839713, 824006, 810355, 799176, 789600, 780403, 771168, 762087, 753328, 745163, 738136, 732461, 727713, 723551, 720234, 717897, 715930, 713744, 711640, 710237, 709515, 709120, 709098, 709385, 708994, 706767, 702916, 698857, 695402, 691961, 687688, 682585, 677089, 671230, 664724, 657567, 650013, 642149, 633848, 625167, 616547, 608507, 601203, 594298, 587306, 580018, 572542, 565092, 557960, 551610, 546380, 542002, 537874, 533958, 530943, 529250, 528368, 527588, 526949, 526911, 527463, 528249, 529391, 531494, 534857, 539198, 544104, 549235, 554139, 558467, 562439, 566539, 570696, 574321, 577354, 580617, 584746, 589206, 592796, 594979, 596312, 597703, 599495, 601217, 601976, 601085, 598491, 594698, 590248, 585240, 579353, 572379, 564726]
60832E64726p425o585o028o259o799o843o271n549m939m333l801l604l678l703
60818D88909l715m001m329m068l231k614k644k855k926l295m222m961m680l661
60804D37707k813k420k128j773j479j100l55N74J204J413J424J278Q68M08K98
60789D33106N79R95J460J999K309K045J516J508K246K994K840J632K9j097j284
60774D52877q16m55o43j033j027o40m01n17o15m37l01n96j108j163m80L74N46
60757D43565j24q80r62n60m72r34j325j111n50j70q3j02j82l41m81n99q76j280
60739D32533j476j533k095l360m400m215l074k080j690j495j260j233j413j320
60725D01889p57j41J18J53L13P57J393J948K052J635J183J169J375J258Q17N14
$$ y = [564726, 557301, 550716, 544688, 538429, 531630, 524787, 518516, 512967, 508028, 503695, 499894, 496290, 492612, 488909, 485194, 481193, 476864, 472796, 469565, 466951, 464307, 461452, 458526, 455231, 451009, 446048, 441368, 437707, 434894, 432474, 430346, 428573, 427094, 425994, 425639, 426213, 427417, 428830, 430254, 431532, 432400, 432808, 433106, 433685, 434680, 436140, 438139, 440448, 442493, 444009, 445517, 447763, 450757, 453597, 455229, 455258, 454161, 452877, 452061, 451606, 450963, 449930, 448903, 448263, 447862, 447345, 446730, 446293, 445992, 445396, 444288, 443125, 442645, 443019, 443565, 443441, 442561, 441599, 441039, 440567, 439633, 438308, 437197, 436647, 436477, 436394, 436292, 436110, 435769, 435288, 434689, 433813, 432533, 431057, 429524, 427429, 424069, 419669, 415454, 412380, 410300, 408610, 407115, 405855, 404622, 403209, 401889, 401132, 400991, 401109, 401262, 401575, 402332, 403725, 405673, 407725, 409360, 410543, 411712, 413087, 414345, 415162, 415676]
60709D15676N06N42O43J139J903K342K222J872J436P23q6l64o0Ko87j516j722
60692D24571j486j403j404j060n71n77j037j154n28K70N32L18K39O19J241J772
60676D20342K143K420K514K242J724J475J831K390K340J438K53o26j286k097k982
60661D34121l507l564l488l460l162k229q69K10M95J98O5O49J822K957L526L513
60645D27277L288L137K920K206Q25p53j830k274k635l310l926l888l226k516k109
60630D13186j918j879k037k136j688o28M66J055J206J270J323J204Q78M99K60
60615D11061K77M82N29R8o13r47n69J37O27Q40J016J180J160J008R49R84Q06K96
60597D19321k39l69pN80J173J814K574L210L320K886K428K419K708K776K399J777
$$ y = [415676, 416182, 416724, 417367, 418506, 420409, 422751, 424973, 426845, 428281, 429004, 428918, 428554, 428494, 428496, 427809, 426293, 424571, 423085, 421682, 420278, 419218, 418647, 418070, 417033, 415879, 415351, 415621, 416153, 416471, 416710, 417329, 418570, 420342, 422485, 424905, 427419, 429661, 431385, 432860, 434691, 437081, 439421, 440859, 441112, 440486, 439200, 437103, 434121, 430614, 427050, 423562, 420102, 416940, 414711, 413842, 414052, 414547, 414745, 414810, 415459, 417281, 420238, 423764, 427277, 430565, 433702, 436622, 438828, 439653, 438900, 437070, 434796, 432161, 428851, 424925, 421037, 417811, 415295, 413186, 411268, 409389, 407352, 405216, 403528, 402900, 403366, 404421, 405627, 406897, 408220, 409424, 410302, 410801, 411061, 411338, 411820, 412349, 412447, 411834, 410887, 410318, 410455, 411082, 411922, 412938, 414118, 415278, 416286, 417235, 418219, 419025, 419321, 419082, 418713, 418706, 419286, 420459, 422273, 424847, 428057, 431377, 434263, 436691, 439110, 441818, 444594, 446993, 448770]
60581D48770J124N06Q3N5L36O44R57J498K159K523K573K911L919N189O159O964
60565D86370Q129R681J1070J1830J1875J1267J0069Q464O623M515K155m7j582
60552E80419k453l086l640l829l518l013k625k213j465l31J011K401L751N005
60538E66414O239P624R187J0833J2692J5091J7766J9546J9388J7656J5759J4425
60526G32620J2976J0496P097L563K81k816n496p246q112q812r753j0475j0357
60513G03966r485q383p277n986m397k641r52L61J064J477K549M959Q222J1226
60499F94703J3647J6349K0155K4761K9124L2598L5370L7917M0365M2295M3058
60488A030342M2189L9686L5979L1600K6933K2052J6711J0508L295m563j2483k0112
$$ y = [448770, 449894, 450400, 450483, 450538, 450874, 451518, 452475, 453973, 456132, 458655, 461228, 464139, 468058, 473247, 479406, 486370, 494499, 504180, 515250, 527080, 538955, 550222, 560291, 568755, 575378, 579893, 582048, 582001, 580419, 577966, 574880, 571240, 567411, 563893, 560880, 558255, 556042, 554577, 554246, 555257, 557658, 561409, 566414, 572653, 580277, 589464, 600297, 612989, 628080, 645846, 665392, 684780, 702436, 718195, 732620, 745596, 756092, 763189, 766752, 767033, 764217, 758721, 751475, 743363, 734551, 724798, 714323, 703966, 694481, 686098, 678821, 672835, 668438, 665797, 664845, 665206, 666270, 667747, 670296, 675255, 683477, 694703, 708350, 724699, 744854, 769615, 798739, 831337, 866707, 904624, 944989, 987284, 1030342, 1072531, 1112217, 1148196, 1179796, 1206729, 1228781, 1245492, 1256000, 1259295, 1254732, 1242249, 1222137]
60476A222137k7382l4133l9925m4297m7028m8137m7753m6070m3327l9861l6142
60465G68082l2674k9671k6944k4187k1346j8594j6169j4320j3196j2569j1808
60454E46604j0478q818p404o485n937n641n504n268m697l905l180k524j807j163
60440D73793q51q08q01r18j322j696j550j076j069j783k562k721k260j476n39
60425D52361K56M80J62q1N1K8o29j402j329k19J204K160K401K096J677J653K207
60408D63076K919L137K616J635P10L47P63J638K295K402K231K090J889J571J556
60393D90875K197K990L003K060J080J074K126L458M191M009L210K354J824J647
60379E26098J614J478J179J029J508K610L535L561L088L181L984M370L522K166
$$ y = [1222137, 1194755, 1160622, 1120697, 1076400, 1029372, 981235, 933482, 887412, 844085, 804224, 768082, 735408, 705737, 678793, 654606, 633260, 614666, 598497, 584177, 570981, 558412, 546604, 536126, 527308, 519904, 513419, 507482, 501841, 496337, 491069, 486372, 482467, 479287, 476763, 474956, 473793, 472942, 472134, 471333, 470415, 469093, 467397, 465847, 464771, 463702, 461919, 459357, 456636, 454376, 452900, 452361, 452617, 453097, 453259, 453178, 453229, 453257, 452628, 451226, 449897, 449678, 450882, 453042, 455443, 457539, 459216, 460869, 463076, 465995, 469132, 471748, 473383, 474093, 474440, 475203, 476841, 479136, 481538, 483769, 485859, 487748, 489319, 490875, 493072, 496062, 499065, 501125, 502205, 503279, 505405, 508863, 513054, 517063, 520273, 522627, 524451, 526098, 527712, 529190, 530369, 531398, 532906, 535516, 539051, 542612, 545700, 548881, 552865, 557235, 560757, 562923]
60365E62923J612K088K698K704K174J521J085J133J761K711L652M551N493O288
60351F02394O633O587O493O510O505O338N944N288M448L599K648J231o55k353
60337F61610l367m078n092o114o274n437m478m125m201m216m049l807l434k902
60323F00036k469k409k638k812k734k454k040j350k03J228K356K840L218M422
60309E94991O544Q637R955J0782J1583J2053J1780J1245J1230J1464J0881R190
60297G20335P194N434L496R16k059m994p779j0186j1639j1952j1737j1557j1106
60284F54366r813p908o296n546n444n441n113m340l400k850l036l735m412m777
60270E82255m881m867m806m701m505m214l989m071m433m674m371l394j990o87
$$ y = [562923, 564535, 566623, 569321, 572025, 574199, 575720, 576805, 577938, 579699, 582410, 586062, 590613, 596106, 602394, 609027, 615614, 622107, 628617, 635122, 641460, 647404, 652692, 657140, 660739, 663387, 664618, 663963, 661610, 658243, 654165, 649073, 642959, 636685, 631248, 626770, 622645, 618444, 614228, 610179, 606372, 602938, 600036, 597567, 595158, 592520, 589708, 586974, 584520, 582480, 581130, 580927, 582155, 584511, 587351, 590569, 594991, 601535, 610172, 620127, 630909, 642492, 654545, 666325, 677570, 688800, 700264, 711145, 720335, 727529, 732963, 736459, 737375, 735316, 730322, 722543, 712357, 700718, 688766, 677029, 665472, 654366, 644553, 636645, 630349, 624803, 619359, 613918, 608805, 604465, 601065, 598215, 595179, 591444, 587032, 582255, 577374, 572507, 567701, 563000, 558495, 554281, 550292, 546221, 541788, 537114, 532743, 529349, 527359, 526672]
60256E26672q7l72r61r92k75N55R31J023J273J665J773J365O63J18J17P20J428
60239E35616J477O06m96q33j29Q98J270O28n12j211q74L52J831L050L843M208
60223E49724M120L622K965K551K809L915N519O833P366P430P696Q328Q982R501
60209F31361J0103J0825J1311J1360J1196J1056J0879J0612J0359J0014R222P960
60197G56258O791O108N510M314K479N96q19j729k432l303m563o037p277q034q438
60182G39424q645q651q582q729r036q980q281p362o701o131n243m109l093k247
60168F43634j428p96n90o41o35o84r89j154o54Q2r5j436k721k728j731r67r94
60151F25473j155n95O65J822K205J989J972K666L678M175L855L243L025L430M323
$$ y = [526672, 526585, 526213, 525252, 524260, 523985, 524540, 525471, 526494, 527767, 529432, 531205, 532570, 533233, 533351, 533468, 534188, 535616, 537093, 537699, 537203, 536370, 536241, 537139, 538409, 539037, 538525, 537314, 536440, 536792, 538623, 541673, 545516, 549724, 553844, 557466, 560431, 562982, 565791, 569706, 575225, 582058, 589424, 596854, 604550, 612878, 621860, 631361, 641464, 652289, 663600, 674960, 686156, 697212, 708091, 718703, 729062, 739076, 748298, 756258, 763049, 769157, 774667, 778981, 781460, 782056, 781237, 779508, 777076, 773773, 769210, 763173, 755896, 747862, 739424, 730779, 722128, 713546, 704817, 695781, 686801, 678520, 671158, 664457, 658326, 653083, 648974, 645881, 643634, 642206, 641410, 640820, 640179, 639544, 638860, 637871, 636717, 636063, 636145, 636050, 634614, 631893, 629165, 627434, 626467, 625473, 624318, 623723, 624388, 626210, 628415, 630404, 632376, 635042, 638720, 642895, 646750, 649993, 653018, 656448, 660771]
60136F60771N574P070Q488R379R524R167Q816Q738Q653Q057O894N666M849M435
60122G66081M283M447M786M650L652K523K423L357M090L826L138K837K681J899
60108H14673M41j046k176l038l570l507l011k802l430m724o012o624o225n066
60094G63883l921l415l416l379l160k997k752j871l49R13J104M93j6KK52L10j5
60077G41666p87j993l416m774n933o887p655q293q864r188q951q308p936q102
60063F50579q097p188n811m998m847m475l572k878k853k802k010r34m71n66m02
60048E98675L57J336K326L507M830N885O600P387Q363R013Q891Q248P625P145
60034F80188O537N611M424L096J736M63o98j890l274m817o323p628q727r720j0622
$$ y = [660771, 666345, 673415, 681903, 691282, 700806, 709973, 718789, 727527, 736180, 744237, 751131, 756797, 761646, 766081, 770364, 774811, 779597, 784247, 787899, 790422, 792845, 796202, 800292, 804118, 807256, 810093, 812774, 814673, 815114, 814068, 811892, 808854, 805284, 801777, 798766, 795964, 792534, 787810, 781798, 775174, 768949, 763883, 759962, 756547, 753131, 749752, 746592, 743595, 740843, 738972, 738623, 739536, 740640, 741133, 741117, 741119, 741371, 741681, 741666, 740879, 738886, 735470, 730696, 724763, 717876, 710221, 701928, 693064, 683876, 674925, 666617, 658681, 650579, 642482, 635294, 629483, 624485, 619638, 615163, 611591, 608713, 605860, 603058, 601048, 600114, 599643, 599077, 598675, 599032, 600368, 602694, 606201, 611031, 616916, 623516, 630903, 639266, 648279, 657170, 665418, 673043, 680188, 686725, 692336, 696760, 699856, 701592, 702055, 701357, 699467, 696193, 691376, 685053, 677425, 668698, 658978, 648356]
60019F48356j1309j1697j1928j2117j1943j0889r104p593p116p177o688n403m062
60006E31330l189k494j646r82r12j128r79l63K14M16M86Q18J422J960K197K220
59990E29370K277K478K835L408M174M740M597L846L186K878K162L81j752k866
59976E61714k750k551l045l743l979l946m038l963l282k266j495r87m42K7J76
59961E25430L54J117K241K924K940K803K794K608K191K023K211K031R98j40k27
59946E52298P50J644J633J025M98J31m15j132j584j516j084m52M02J317J750J395
59930E56660Q40J122K566M405N660O035N760N035L981K886K013J191L3j441k715
59915E94031l351l441l304l014k361j215K16J519K359K701K730K659K596K541
$$ y = [648356, 637047, 625350, 613422, 601305, 589362, 578473, 569369, 561776, 554660, 547483, 540795, 535392, 531330, 528141, 525647, 524001, 523019, 522107, 520979, 520000, 519637, 519851, 520267, 520753, 521571, 522993, 524953, 527150, 529370, 531647, 534125, 536960, 540368, 544542, 549282, 553879, 557725, 560911, 563789, 565951, 566332, 564580, 561714, 558964, 556413, 553368, 549625, 545646, 541700, 537662, 533699, 530417, 528151, 526656, 525669, 525227, 525254, 525430, 525784, 526901, 529142, 532066, 535006, 537809, 540603, 543211, 545402, 547425, 549636, 551667, 552665, 552525, 552298, 553048, 554692, 556325, 557350, 557848, 557979, 557564, 556432, 554848, 553332, 552248, 551796, 552198, 553515, 555265, 556660, 557500, 558622, 561188, 565593, 571253, 577288, 583048, 588083, 592064, 594950, 596963, 598154, 598187, 596746, 594031, 590680, 587239, 583935, 580921, 578560, 577345, 577561, 579080, 581439, 584140, 586870, 589529, 592125, 594666]
59901E94666K460K364K351K518K706K493J669P05M32J144K306L298M101M971N772
59886F33956O063N882N878O529P495Q017P804P268O939O901O929O895O793O423
59872G29772N438L837K185J056M23k13j155k238l153l766m193m708n468o217o381
59857G05219n780m959m481m120l284k067j174q06l90M57J392K116K982M349N878
59842F95332O922P262P025O286N236M357L896L558L121L043L801M921N336M554
59828G64650L028J417M1j020j817k571l478m488n515o628p739q339q048p244o713
59813G05536o740o947o915o539n922n354n140n156m743l597k395j963k158k235
59799F39732k061k121k487k784l115l982n122n470m649l571l122l068k831k494
$$ y = [594666, 597126, 599490, 601841, 604359, 607065, 609558, 611227, 611932, 612364, 613508, 615814, 619112, 623213, 628184, 633956, 640019, 645901, 651779, 658308, 665803, 673820, 681624, 688892, 695831, 702732, 709661, 716556, 723349, 729772, 735210, 739047, 741232, 742288, 742711, 742498, 741343, 739105, 735952, 732186, 727993, 723285, 717817, 711600, 705219, 699439, 694480, 689999, 685879, 682595, 680528, 679354, 678548, 678158, 678615, 680007, 682123, 685105, 689454, 695332, 702254, 709516, 716541, 722827, 728063, 732420, 736316, 739874, 742995, 746038, 749839, 754760, 760096, 764650, 767678, 769095, 769136, 768116, 766299, 763728, 760250, 755762, 750247, 743619, 735880, 727541, 719493, 712249, 705536, 698796, 691849, 684934, 678395, 672473, 667119, 661979, 656823, 652080, 648483, 646088, 644125, 641967, 639732, 637671, 635550, 633063, 630279, 627164, 623182, 618060, 612590, 607941, 604370, 601248, 598180, 595349, 592855]
59785E92855k362k181j664j187j165j139l78Q06J338Q95L34M75J184J945K633
59770E92389L350L912M007L672L280L172L445L996M531M676M319L833L757M213
59756F46552M785N102N350O030P223Q274Q419P591O505N897N871O013N972N707
59742G35291N279M579L503K278J415J198J309J123M20m10q52p88m51r1J71K88
59726G54262L32M90Q57J332J740J945J786J172L72nK98P79P12k8r72j668j958
59709G61446j820j414j158j344j647j501r11m45l23j02N78J411J951K329L071
59694G60121M297N486O005N662M772L816L027K206R92o45k219l113l162k874k963
59679G81408l663m482m856m960n518o740p871q069p394o554n996n708n624n680
$$ y = [592855, 590493, 588312, 586648, 585461, 584296, 583157, 582779, 583585, 584923, 585818, 586152, 586627, 587811, 589756, 592389, 595739, 599651, 603658, 607330, 610610, 613782, 617227, 621223, 625754, 630430, 634749, 638582, 642339, 646552, 651337, 656439, 661789, 667819, 675042, 683316, 691735, 699326, 705831, 711728, 717599, 723612, 729584, 735291, 740570, 745149, 748652, 750930, 752345, 753543, 754852, 755975, 756395, 755985, 755133, 754345, 753894, 753803, 753974, 754262, 754594, 755084, 755941, 757273, 759013, 760958, 762744, 763916, 764288, 764283, 764581, 765360, 766072, 766044, 765072, 763404, 761446, 759626, 758212, 757054, 755710, 754063, 752562, 751651, 751206, 750883, 750781, 751359, 752770, 754721, 757050, 760121, 764418, 769904, 775909, 781571, 786343, 790159, 793186, 795392, 796384, 795739, 793520, 790407, 787245, 784371, 781408, 777745, 773263, 768407, 763447, 757929, 751189, 743318, 735249, 727855, 721301, 715305, 709597, 703973, 698293]
59665F98293n535m864l901l226k950k544j575k12J037J764J857J663J878K828
59651F84513L868M050L306K439J980J731J419J005J87j495l717n263n426m877
59637F83720m586m546m153l372k633k032j410j051j387k051k089j341r18j845
59623F50306l708n046m935l830k846k573k678k588k273k165k439k706k547k020
59609F07952j433q01J25J329K315K579K153J562J236J097Q18M32L33O04O57J1
59593F20969q40q57J80J329J666J293Q97O70K62m26r09p80l89n49j524k514k505
59576F15973j492n71o12j359k047k427k628k495j891j367j633k405k647k031j216
59561E89152o10J03R28J123L44o39j091j264j514j275M0J718K417J916J236J228
$$ y = [698293, 692758, 687894, 683993, 680767, 677817, 675273, 673698, 673486, 674523, 676287, 678144, 679807, 681685, 684513, 688381, 692431, 695737, 698176, 700156, 701887, 703306, 704311, 704498, 703003, 699286, 694023, 688597, 683720, 679134, 674588, 670435, 667063, 664430, 662398, 660988, 659937, 658550, 656499, 654410, 653069, 652151, 650306, 646598, 641552, 636617, 632787, 629941, 627368, 624690, 622102, 619829, 617664, 615225, 612519, 609972, 607952, 606519, 605718, 605843, 607172, 609487, 612066, 614219, 615781, 617017, 618114, 618932, 619364, 619697, 620301, 620958, 620969, 620129, 619272, 619452, 620781, 622447, 623740, 624637, 625307, 625569, 625143, 624234, 623454, 623065, 622516, 620992, 618478, 615973, 614481, 613910, 613298, 611939, 609892, 607465, 604837, 602342, 600451, 599084, 597451, 595046, 592399, 590368, 589152, 588542, 588645, 589573, 590696, 591040, 590401, 589310, 588046, 586532, 585257, 585297, 587015, 589432, 591348, 592584, 593812]
59545E93812J863K818L842M611M958N331O426Q395J0918J3786J6614J8213J7374
59532G08961J4449J1234Q845O577L402j29k354k559j729j248j406j487r37r2K68
59517G41795k16j204k173k939l676m601n753o932p751p950p722p537p535p372
59503F68434o775n942n198m619m157l781l257k236r36k28n48j141r66l2Q67J419
59487F30904J977K607K898K856L169M184N228N442M983M898N949P816R488J0200
59473G02599R988R342Q561P593O488N498M586L266J370l95j194j090q06o01k0
59458G55185J285L032M699O033P126Q267R689J1092J1675J1043R870R102Q733
59445H56831Q007O630M935K890J8l432o170p314p482p825q528q910q619q039p583
$$ y = [593812, 595675, 598493, 602335, 606946, 611904, 617235, 623661, 632056, 642974, 656760, 673374, 691587, 708961, 723410, 734644, 743489, 750066, 753468, 753339, 750985, 748426, 746697, 745449, 744043, 742556, 741619, 741527, 741795, 741579, 740375, 738202, 735263, 731587, 726986, 721233, 714301, 706550, 698600, 690878, 683341, 675806, 668434, 661659, 655717, 650519, 645900, 641743, 637962, 634705, 632469, 631533, 631305, 630757, 629616, 628650, 628618, 629485, 630904, 632881, 635488, 638386, 641242, 644411, 648595, 653823, 659265, 664248, 669146, 675095, 682911, 692399, 702599, 712587, 721929, 730490, 738083, 744571, 750069, 754655, 757921, 759291, 758896, 757702, 756612, 755806, 755205, 755185, 756470, 759502, 764201, 770234, 777360, 785627, 795316, 806408, 818083, 829126, 838996, 848098, 856831, 864838, 871468, 876403, 879293, 879311, 875879, 869709, 862395, 854913, 847088, 838560, 829650, 821031, 812992, 805409]
59430H05409p188o621n875n098m268l052j067J674M688P507J0084J2541J4778
59417H23512J6725J8729K1136K3713K6098K8641L1701L4017L3025K7575J9556
59406A104428J1964N976P67m325q650j1131j1164q524l538K056N356M475L56m255
59392A083791p705j0781j5070k0549k5316k7449k6679k4237k1536j9253j7346
59381H67870j5511j3552j1564r825q471p346o316n472m775l803k293p78j02j94
59367G77868k5R97K142K316J527Q12R69J897L168M648O369Q188R890J1452J3024
59352H45242J4619J6029J6979J7354J7315J7250J7528J8226J9016J9345J8792
59341A037695J7246J4890J2064R130O287L457M07k989o661j0479j4239j7453j9484
$$ y = [805409, 798221, 791600, 785725, 780627, 776359, 773307, 772240, 773914, 778602, 786109, 796193, 808734, 823512, 840237, 858966, 880102, 903815, 929913, 958554, 990255, 1024272, 1057297, 1084872, 1104428, 1116392, 1122368, 1123135, 1118810, 1110160, 1099029, 1087865, 1079341, 1075803, 1077859, 1083215, 1087690, 1088046, 1083791, 1076086, 1065305, 1050235, 1029686, 1004370, 976921, 950242, 926005, 904469, 885216, 867870, 852359, 838807, 827243, 817418, 808947, 801601, 795285, 789813, 785038, 781235, 778942, 778164, 778062, 777868, 777843, 778840, 780982, 783298, 784825, 785637, 786606, 788503, 791671, 796319, 802688, 810876, 820766, 832218, 845242, 859861, 875890, 892869, 910223, 927538, 944788, 962316, 980542, 999558, 1018903, 1037695, 1054941, 1069831, 1081895, 1091025, 1097312, 1100769, 1101176, 1098187, 1091526, 1081047, 1066808, 1049355, 1029871]
59328A029871k0207k0347k0798k1684k2364k2238k1226j9566j7695j6156j5153
59317H12437j4175j2636j0818r509q749p826o677o135o424o468n439m019l204
59304G10358k770k016j191q49l23J631M914Q201J0843J3174J4815J4349J1254
59291G82390O921K997k56l316o092q052r032r170q522p247n715m071k161j27J622
59276G30169L342N887R244J2039J3252J3601J4369J5586J6298J6112J5377J4237
59264H79513J2499J0301Q032N629K809j31k433l815m634n148n336n374n608n912
59250H80392n780n121m406l851l086j848n07M64J163K067L340M554N032M425L086
59235H79924J918J584J818J681N23j458l491m955n809o571p807r519j1067j1889
$$ y = [1029871, 1009664, 989317, 968519, 946835, 924471, 902233, 881007, 861441, 843746, 827590, 812437, 798262, 785626, 774808, 765299, 756550, 748724, 742047, 735912, 729488, 723020, 717581, 713562, 710358, 707588, 705572, 704381, 703532, 703209, 704840, 709754, 717955, 728798, 741972, 756787, 771136, 782390, 789311, 792308, 792052, 788736, 782644, 774592, 765560, 756390, 747868, 740621, 734906, 730835, 728674, 728547, 730169, 733511, 739398, 748642, 760681, 773933, 787534, 801903, 817489, 833787, 849899, 865276, 879513, 892012, 902313, 910345, 915974, 918783, 918652, 916219, 912404, 907770, 902622, 897286, 891912, 886304, 880392, 874612, 869491, 865085, 861234, 858148, 856300, 855793, 856257, 857420, 859487, 862827, 867381, 872413, 876838, 879924, 881842, 883426, 885244, 886925, 887448, 885990, 882499, 877544, 871735, 865164, 857357, 847838, 836771, 824882]
59221H24882j2144j2391j2759j2763j1978j0584r192q257p748p205o170m684l361
59208G05646k761k679k242q53J054K364K385J538Q44Q16J109J251J299J484J619
59193G12874J390R97R08J084J080R30J104J438J002n34k125k517j682m62O11J397
59177G17495J562Q52j48l96L83J418J974K178K605L470M444M967M734M014L475
59162G53027L448L486K889J561K3j306k489l728n069o438p774r015j0058j0771
59148G07786j0986j0713j0275j0007r694q815p426o337o062o122n799n090m395
59135F06065l790l204k886k891k522j194M80J382J472J652K200K473K308K515
59121F04060L542M737N505O260P515Q786R303R203R139R135Q773Q213Q118Q521
$$ y = [824882, 812738, 800347, 787588, 774825, 762847, 752263, 743071, 734814, 727066, 719861, 713691, 709007, 705646, 702885, 700206, 697964, 697111, 698165, 700529, 702914, 704452, 705296, 706112, 707221, 708472, 709771, 711255, 712874, 714264, 715261, 716169, 717253, 718333, 719263, 720367, 721805, 722807, 722273, 720148, 717631, 715949, 715487, 716098, 717495, 719057, 719909, 719761, 719365, 719748, 721166, 723140, 725318, 727923, 731393, 735837, 740804, 745538, 749552, 753027, 756475, 759961, 762850, 764411, 764434, 763128, 760639, 756911, 751842, 745404, 737630, 728615, 718557, 707786, 696800, 686087, 675812, 665805, 656111, 647296, 639870, 633533, 627471, 621349, 615550, 610460, 606065, 602275, 599071, 596185, 593294, 590772, 589578, 590058, 591440, 592912, 594564, 596764, 599237, 601545, 604060, 607602, 612339, 617844, 624104, 631619, 640405, 649708, 658911, 668050, 677185, 685958, 694171, 702289, 710810]
59107G10810Q695Q243P543O903N989M543L092K301J962J313K58m34l69k75j027
59092G59547k274k746j912o76k08o21j184j427j513j711k124k886m088n363o057
59077G24757n932n476n272n416n707o020o246o120n529m849m602m749m700m049
59063F50090l056k206j611j130q67j081j557j577r05l67r44k338l135k484j075
59048F25757j99k87p55r72q16m92k40k47n26q34r12p72n55k66J96P84J421K168
59030F22453L044L803M251M710N769P480R177J0197J0548J0718J0992J1181J0913
59017G25236J0082Q922P651O163M198J860l02j779k540k829k791k471k001j495
59003G47904q66K7J124K219L190M026M705N161N311N095M654M446M818N380N193
$$ y = [710810, 719505, 727748, 735291, 742194, 748183, 752726, 755818, 758119, 760081, 761394, 761652, 761218, 760849, 760574, 759547, 757273, 754527, 752615, 751939, 751731, 751110, 749926, 748499, 746986, 745275, 743151, 740265, 736177, 730814, 724757, 718825, 713349, 708077, 702661, 696954, 690934, 684688, 678568, 673039, 668190, 663588, 658839, 654139, 650090, 647034, 644828, 643217, 642087, 641220, 640139, 638582, 637005, 636100, 635733, 634789, 632451, 629316, 626832, 625757, 625558, 625271, 624516, 623544, 622728, 622236, 621996, 621749, 621223, 620389, 619477, 618705, 618150, 617884, 618080, 618864, 620285, 622453, 625497, 629300, 633551, 638261, 644030, 651510, 660687, 670884, 681432, 692150, 703142, 714323, 725236, 735318, 744240, 751891, 758054, 762252, 764112, 763810, 762031, 759491, 756662, 753871, 751400, 749399, 747904, 747038, 747065, 748189, 750408, 753598, 757624, 762329, 767490, 772801, 777896, 782550, 786996, 791814, 797194, 802387]
58988H02387L891K235J201Q35M23l74j052r49JJ216K053K416K843L938N683P554
58972H34301R232J0770J2102J2976J3576J4552J6031J7206J7367J6774J5935J4687
58960A005509J2725J0477Q504O431L502rl026n314p796j1030j4294j6614j7919
58947I71146j8670j8952j8529j7515j6452j5655j4764j3082j0441p728o171n980
58935H07207o032n249l801k539j709j016n04m35n28k44K12J21n38j017j087j328
58919G81513j901k070j456q20q87j163o80N20J525J885K090K741L767M673N316
58904G95053O230Q041J0570J2805J4064J4809J5778J6665J6569J5647J5259J6177
58892I57667J7567J8326J8596J9244K0374K1178K1075K0335J9575J9036J8385
$$ y = [802387, 806278, 808513, 809714, 810549, 810972, 810598, 809546, 808597, 808598, 809814, 811867, 814283, 817126, 821064, 826747, 834301, 843533, 854303, 866405, 879381, 892957, 907509, 923540, 940746, 958113, 974887, 990822, 1005509, 1018234, 1028711, 1037215, 1043646, 1047148, 1047139, 1044113, 1038799, 1031003, 1019973, 1005679, 989065, 971146, 952476, 933524, 914995, 897480, 881028, 865373, 850609, 837527, 827086, 819358, 813187, 807207, 801175, 795926, 792125, 789586, 787877, 786861, 786357, 785922, 785394, 785150, 785362, 785483, 784945, 783928, 782841, 781513, 779612, 777542, 776086, 775266, 774379, 773216, 772536, 773056, 774581, 776466, 778556, 781297, 785064, 789737, 795053, 801283, 809324, 819894, 832699, 846763, 861572, 877350, 894015, 910584, 926231, 941490, 957667, 975234, 993560, 1012156, 1031400, 1051774, 1072952, 1094027, 1114362, 1133937, 1152973, 1171358]
58881A171358J7047J4754J1819Q735N505J808k189n685q120r780j1219j2537j3447
58868A168049j3748j3420j2537j1353j0244r429q926q842r321j0182j1007j1642
58856A037398j2211j2616j2622j2492j2841j3647j4058j3565j2698j2190j1985
58845H96473j1619j1106j0792j0632j0217r423q682q562r204j0109j0502j0096
58833G75529r420r032q643p572n961m638l817k859j564n84q8Q71K875M872N484
58818G35453M964M783N570O478O536N760M813M192L916L638L023K209J697J557
58804G94589J131j22j841l229l985m308m439m653n384o631p592p559o922o585
58790G32470o617o252n162l870k838j895q16J96R99J972L517N289O398O352N553
$$ y = [1171358, 1188405, 1203159, 1214978, 1223713, 1229218, 1231026, 1228837, 1223152, 1215032, 1205252, 1194033, 1181496, 1168049, 1154301, 1140881, 1128344, 1116991, 1106747, 1097318, 1088392, 1079550, 1070229, 1060047, 1049040, 1037398, 1025187, 1012571, 999949, 987457, 974616, 960969, 946911, 933346, 920648, 908458, 896473, 884854, 873748, 862956, 852324, 842107, 832684, 824002, 815440, 806236, 796127, 785625, 775529, 766109, 757077, 748434, 740862, 734901, 730263, 726446, 723587, 722023, 721439, 721351, 722222, 725097, 729969, 735453, 740417, 745200, 750770, 757248, 763784, 769544, 774357, 778549, 782465, 786103, 789126, 791335, 793032, 794589, 795720, 795598, 793757, 790528, 786543, 782235, 777796, 773143, 767759, 761128, 753536, 745977, 739055, 732470, 725853, 719601, 714439, 710569, 707731, 705836, 705020, 705216, 706215, 708187, 711704, 716993, 723391, 729743, 735296]
58775G35296M766M193L308J620n84k537l928n111o428p736q758r486r950r957
58761F84708r341q225o787n119l432k104j212m46L51Q91R76Q82R00R36R05J089
58745F54972J695K430K963L458M205N041N600N846N944N868N520N005M454L875
58731G16876L577M249O044P948Q726Q372P986Q303Q973R288R139R062R588J0703
58717H28834J1905J2739J3239J3612J3590J2652J0878R010P450N804L744J657
58705I45114j45k239n421r491j3422j6501j8782k0522k1748k2395k2489k2180
58693G69779k1708k1180k0262j8456j5826j3089j0856r233q247p958p936p406
58681F07622o343n698n982o341n659l975k149p10L24J021J639K655M006M870M908
$$ y = [735296, 740062, 744255, 747563, 749183, 748599, 746062, 742134, 737023, 730595, 722859, 714101, 704615, 694665, 684708, 675367, 667142, 660355, 655236, 651804, 649700, 648488, 648042, 648393, 649284, 650260, 651142, 652042, 652978, 653883, 654972, 656667, 659097, 662060, 665518, 669723, 674764, 680364, 686210, 692154, 698022, 703542, 708547, 713001, 716876, 720453, 724702, 730746, 738694, 747420, 755792, 763778, 772081, 781054, 790342, 799481, 808543, 818131, 828834, 840739, 853478, 866717, 880329, 893919, 906571, 917449, 926459, 933909, 939713, 943457, 945114, 944969, 942730, 937309, 927818, 914396, 897895, 879113, 858591, 836843, 814448, 791959, 769779, 748071, 726891, 706629, 688173, 672347, 659258, 648402, 639169, 630922, 622964, 615028, 607622, 601279, 595581, 589599, 583258, 577599, 573624, 571475, 570765, 571089, 572110, 573749, 576404, 580410, 585280, 590188]
58666E90188N151O806R604J2108J3321J3204J2018J0022P579M830J567k054n139
58653F79205p004q002q725r049q747q353q325q050o795n134m205l961l464k623
58639E86768k220k293j900o06R51K192L149L708L395K259J126O20N23L64p0q55
58623E97111j931k829k935k152q71N37J880L009M039N293O547O981O492O194O710
58608F34075O832N316L188K574L605M333L655K447J599P31n45j640k082k386l005
58593F58697l391k810j472j43Q19J715L109N239P492Q673Q468Q157Q991J0441
58579G13985J1197J1346J1927J2641J2034J0146R023R955J1885J3296J4186J5354
58567H56975J7015J9140K2016K5525K8758L1095L2907L4530L5426L4931L2952
$$ y = [590188, 595339, 602145, 611749, 623857, 637178, 650382, 662400, 672422, 680001, 684831, 686398, 684344, 679205, 672201, 664199, 655474, 646425, 637678, 629325, 621000, 612950, 606155, 601021, 596816, 592855, 589391, 586768, 584548, 582255, 580355, 579749, 580700, 582892, 586041, 589749, 593144, 595403, 596529, 597149, 597672, 598036, 597966, 597111, 595180, 592351, 589416, 587264, 586393, 586930, 588810, 591819, 595858, 601151, 607698, 614679, 621171, 627365, 634075, 640907, 646223, 649411, 651985, 655590, 659923, 663578, 666025, 667624, 668355, 667810, 666170, 664088, 661702, 658697, 655306, 652496, 651024, 650881, 651700, 653415, 656524, 661763, 669255, 677928, 686396, 694553, 703544, 713985, 725182, 736528, 748455, 761096, 773130, 783276, 792299, 802254, 814139, 827435, 841621, 856975, 873990, 893130, 915146, 940671, 969429, 1000524, 1033431, 1067961, 1103387, 1138318, 1171270]
58556A171270K9467K4335J8141J2207P183K528k064n830q104r300j0005j0127
58544A219701r751r783j0866j2470j3919j5536j8000k1188k4412k7090k8639k8518
58532I99529k7056k5442k4229k2647k0051j7149j4985j3498j1955j0136q302o606
58520G97473n255m673m813m922m559m152m023l709k860k027j803j957k120k485
58506G48115l044k967j703q8O10K44l64o16m33J32Q41J231J162J072J220J362
58490G46774J503K193L580M927N693O344P578R429J1671J4189J6512J7866J8276
58477H66535J8682J9444J9685J8693J6803J4301J0732O160J812j529m579p863
58465I78876j0288j0678r652q555p455n637l247r28J549M789Q366J1286J3362
$$ y = [1171270, 1200737, 1225072, 1243213, 1255420, 1262603, 1265131, 1263067, 1257237, 1249133, 1239833, 1229828, 1219701, 1209950, 1200167, 1189301, 1176831, 1162912, 1147376, 1129376, 1108188, 1083776, 1056686, 1028047, 999529, 972473, 947031, 922802, 900155, 880104, 862955, 847970, 834472, 822517, 812381, 804079, 797473, 792218, 787545, 782732, 777810, 773251, 769099, 765076, 761367, 758507, 756480, 754677, 752720, 750600, 748115, 745071, 742104, 740401, 740313, 740923, 741167, 740803, 740187, 739754, 739886, 740727, 741958, 743120, 744192, 745412, 746774, 748277, 750470, 754050, 758977, 764670, 771014, 778592, 788021, 799692, 813881, 830393, 848259, 866535, 885217, 904661, 924346, 943039, 959842, 974143, 984875, 991035, 992847, 991318, 986739, 978876, 968588, 957910, 948258, 939703, 932248, 926611, 923364, 922436, 923985, 928774, 937140, 948426, 961788]
58452I61788J4904J5485J4318J1605Q294M823J082k767o420r996j3468j5973j6716
58439I66959j6066j4903j3364j1230q930p109n694m322l100k024l83K149M620
58426H86603O095P097Q551J0056J0572J0147R460Q278N898K727n0k142m172o291
58412I52829q127r727j1255j2057j1366r736q513q058p704p161o734o323n503
58399H40565m414l535k703j487j93N24P85J162J656K025K609L735M704M641L817
58384H53891L024K259J281P90J497K602K771K220K201K890L479M064N573P852
58370H96394R556J0117J0258J0475J0506J0483J1167J2728J4395J5583J6371J6843
58358A044876J6906J6663J6050J4422J1524Q446O495N458M168K417R32j01j078
$$ y = [961788, 976692, 992177, 1006495, 1018100, 1026394, 1031217, 1032299, 1029532, 1023112, 1013116, 999648, 983675, 966959, 950893, 935990, 922626, 911396, 902466, 895357, 889663, 885341, 882241, 880217, 879834, 881983, 886603, 892698, 899795, 908346, 918402, 928974, 939121, 948581, 956859, 962757, 965484, 965434, 963292, 959120, 952829, 944702, 934975, 923720, 911663, 900297, 890561, 882048, 873990, 866286, 859125, 852391, 846068, 840565, 836151, 832616, 829913, 828426, 828233, 828757, 829542, 830704, 832360, 834385, 836994, 840729, 845433, 850074, 853891, 856915, 859174, 860455, 861245, 862742, 865344, 868115, 870335, 872536, 875426, 878905, 882969, 888542, 896394, 905950, 916067, 926325, 936800, 947306, 957789, 968956, 981684, 996079, 1011662, 1028033, 1044876, 1061782, 1078445, 1094495, 1108917, 1120441, 1128887, 1135382, 1140840, 1145008, 1147425, 1148357, 1148256, 1147178]
58345A147178j770j416O0J997L931N644O792P518Q777J0931J2814J3457J3758
58332A229671J4984J6608J7392J7568J7962J7851J5892J2672J0081Q567P067N272
58320A391587L888K953K047J760K895M477M775M061M198N672P208Q158R123J0288
58306A463090J1251J2349J4148J5775J5905J5121J5175J6209J6873J6894J7148
58295A629938J7553J7307J7044J8222K0496K2010K2254K2335K2726K3072K3856
58284A856813K5711K7535K7909K7892K9559L2364L4002L4475L5908L8611M0737
58273B211516M1939M3859M6807M9145N0352N1442N2402N2357N2287N4153N7321
58262B763580N9297N9918O1158O3021O3646O3459O4906O7777O9200O8709O8923
$$ y = [1147178, 1145408, 1143992, 1144052, 1146049, 1149980, 1155624, 1162416, 1169934, 1178711, 1189642, 1202456, 1215913, 1229671, 1244655, 1261263, 1278655, 1296223, 1314185, 1332036, 1347928, 1360600, 1370681, 1379248, 1386315, 1391587, 1395475, 1398428, 1400475, 1402235, 1405130, 1409607, 1414382, 1418443, 1422641, 1428313, 1435521, 1443679, 1452802, 1463090, 1474341, 1486690, 1500838, 1516613, 1532518, 1547639, 1562814, 1579023, 1595896, 1612790, 1629938, 1647491, 1664798, 1681842, 1700064, 1720560, 1742570, 1764824, 1787159, 1809885, 1832957, 1856813, 1882524, 1910059, 1937968, 1965860, 1995419, 2027783, 2061785, 2096260, 2132168, 2170779, 2211516, 2253455, 2297314, 2344121, 2393266, 2443618, 2495060, 2547462, 2599819, 2652106, 2706259, 2763580, 2822877, 2882795, 2943953, 3006974, 3070620, 3134079, 3198985, 3266762, 3335962, 3404671, 3473594]
58251C473594P0711P2217P3376P6655Q2291Q7472R1364R6413J03488J10381J16334
58240D454296J23459J32311J40626J47805J56179J66540J76924J86891J98379
58231E883410K11388K23716K35868K51082K69753K89134L09235L33131L60809
58222H367526L88930M17510M50383M88320N28620N72132O23344O82727P46880
58213A3266372Q17179R00083R98176J109702J237705J390383J572152J784731
58205B3076483K037670K347374K726759L188765L760087M478417N376922O483784
58197E3476261P830960R445370J1339494J3535146J6091753J9090044K2595185
58190A53404213K6615248L0942884L4844639L6952546L5824921L0970036K3342068
$$ y = [3473594, 3544305, 3616522, 3689898, 3766553, 3848844, 3936316, 4027680, 4124093, 4227581, 4337962, 4454296, 4577755, 4710066, 4850692, 4998497, 5154676, 5321216, 5498140, 5685031, 5883410, 6094798, 6318514, 6554382, 6805464, 7075217, 7364351, 7673586, 8006717, 8367526, 8756456, 9173966, 9624349, 10112669, 10641289, 11213421, 11836765, 12519492, 13266372, 14083551, 14983634, 15981810, 17091512, 18329217, 19719600, 21291752, 23076483, 25114153, 27461527, 30188286, 33377051, 37137138, 41615555, 46992477, 53476261, 61307221, 70752591, 82092085, 95627231, 111718984, 130809028, 153404213, 180019461, 210962345, 245806984, 282759530, 318584451, 349554487, 372896555]
58183C72896555J4642474O076615k123688j0050616j7326328k3140555k6905595
58176C14068862k8637435k8744832k7683648k5869536k3714448k1548046j9501535
58169A38369382j7541632j5615471j3731575j1936475j0276828q790082p495985
58162E2981334o386557n438363m633597l959249l395061k918248k515868k180837
58154B1553554j900934j662491j459867j291453j150824j030158r27312q41435
58146A1289080p66517o96745o33409n79267n30904m83593m38890m00355l66142
58137F393258l32813l02471k78947k60324k41942k24037k09973j99292j88581
58128D154878j77328j67444j58542j48735j38697j30450j23514j16163j08974
$$ y = [372896555, 387539029, 393615644, 391491956, 381441340, 364115012, 340974457, 314068862, 285431427, 256686595, 229002947, 203133411, 179418963, 157870917, 138369382, 120827750, 105212279, 91480704, 79544229, 69267401, 60477319, 52981334, 46594777, 41156414, 36522817, 32563568, 29168507, 26250259, 23734391, 21553554, 19652620, 17990129, 16530262, 15238809, 14087985, 13057827, 12130515, 11289080, 10522563, 9825818, 9192409, 8613142, 8082238, 7598645, 7159755, 6759400, 6393258, 6060445, 5757974, 5479027, 5218703, 4976761, 4752724, 4542751, 4343459, 4154878, 3977550, 3810106, 3651564, 3502829, 3364132, 3233682, 3110168, 2994005, 2885031]
58119B885031j03465r8772r3212q7498q3142p9367p4748p0141o6926o4231o0842
58108B002687n7890n6641n5585n2825m9446m7417m6018m3512m0671l9307l8758
58097A474617l6965l3929l1190k8977k6588k4532k3662k3180k1818k0006j8777
58086A184993j7807j6588j6133j7224j8381j7950j6869j7025j8125j8559j8171
58075I92161j7883j7639j7040j6851j7634j7975j6417j4115j3196j3464j3087
58064H16860j1781j0780j0256r176p538o585o829p498p895p990p904p907q355
58051G06366q823q245o739n993o691p199o215n012n231o090n950n209n307n998
58037F17664o011n564n866o767p129o979p188p553p280o831p289q242q375p756
$$ y = [2885031, 2781566, 2682794, 2589582, 2502084, 2418942, 2339575, 2264827, 2194686, 2127760, 2063529, 2002687, 1944797, 1888156, 1832571, 1779746, 1730300, 1682883, 1636865, 1593353, 1552682, 1513375, 1474617, 1437652, 1403723, 1372533, 1343556, 1316968, 1292436, 1268774, 1245594, 1223776, 1203770, 1184993, 1167186, 1150598, 1134465, 1117241, 1098860, 1080910, 1064041, 1047016, 1028891, 1010332, 992161, 974278, 956639, 939599, 922748, 905114, 887139, 870722, 856607, 843411, 829947, 816860, 805079, 794299, 784043, 774867, 767329, 760744, 753915, 746417, 738522, 730532, 722628, 714721, 706366, 697543, 689298, 682559, 676566, 669875, 662676, 656461, 651449, 646218, 640128, 634178, 628969, 623662, 617664, 611653, 606089, 600223, 593456, 586327, 579348, 572160, 564607, 557327, 550496, 543207, 534965, 526590, 518834]
58023E18834p553p838p617o811o303o174n657m740m108l691k901k092k119k666
58009D48564k624j953j555j576j379j011j015j042l07P76J068O59O29J031Q65
57994D41130J40M9Q87J430Q23k97j035j341j535j779k245k918l196k659k043k369
57978D23042l310l652l215k934l132l149k771k573k603k052o52O80J016M21m47
57963C94669r61o44M40J440J583J182J045J104O38m02j366k089k968l946m477
57948C85248m456m216l711k705j649j284j387r70K97J865L351M769N865O316O509
57933C93842P114P934Q237Q005P736P182N549K865O3k241l965m826m696m479n253
57918D23067o606p197o870o734p187p410o936o176n233l714k064j427j784j736
$$ y = [518834, 511281, 503443, 495826, 489015, 482712, 476538, 470881, 466141, 462033, 458342, 455441, 453349, 451230, 448564, 445940, 443987, 442432, 440856, 439477, 438466, 437451, 436409, 436102, 436878, 437946, 438605, 439234, 440265, 441130, 441270, 441319, 442206, 443636, 444459, 444162, 443127, 441786, 440251, 438472, 436227, 433309, 430113, 427454, 425411, 423042, 419732, 416080, 412865, 409931, 406799, 403650, 400879, 398306, 395703, 393651, 392999, 393679, 394695, 395116, 394669, 393708, 393064, 393504, 394944, 396527, 397709, 398754, 399858, 400496, 400094, 398728, 396639, 393671, 389725, 385248, 380792, 376576, 372865, 370160, 368511, 367227, 365840, 364870, 365167, 367032, 370383, 375152, 381017, 387333, 393842, 400956, 408890, 417127, 425132, 432868, 440050, 445599, 448464, 448527, 446286, 442321, 437495, 432799, 428320, 423067, 416461, 409264, 402394, 395660, 388473, 381063, 374127, 367951, 362718, 359004, 356940, 355513, 353729, 351993]
57904C51993o72L37L84m2l28q16j812k701k948k866k695j952m47J054J954K624
57888C41067L373L679L249K924L547M683N309N132M528L758L006K598K592K616
57874C92061K491K370K044J028l27q71l54L5m98j092p63p5j77j026j712j964k053
57857C89117j792q20M21J144J448K039K868L107K465J557R24N27L42O17J266J658
57841D06888J358O33Pl89p43j105j226q26N8R53J323J110Q51J133K065L238M086
57824D19414M166L426K285J320P84N37L56J41j51m46n24m20p06j926l785n397
57808D19074o330o896p448p955q345q663q749q345p645p202p072o701n832m978
57794C16913m635m607m386l749k748j544n21j30l31n28k44N09J479K356K709K371
$$ y = [351993, 351321, 351658, 352042, 352000, 351672, 350856, 349044, 346343, 343395, 340529, 337834, 335882, 335435, 336489, 338443, 341067, 344440, 348119, 351368, 354292, 357839, 362522, 367831, 372963, 377491, 381249, 384255, 386853, 389445, 392061, 394552, 396922, 398966, 399994, 399667, 398796, 398442, 398477, 397979, 396887, 396124, 396049, 395872, 394846, 393134, 391170, 389117, 387325, 386505, 386926, 388070, 389518, 391557, 394425, 397532, 399997, 401554, 402478, 403005, 403347, 403964, 405230, 406888, 408246, 408879, 408886, 408497, 407754, 406649, 405423, 404597, 404655, 405608, 406931, 408041, 408892, 410025, 412090, 415328, 419414, 423580, 427006, 429291, 430611, 431395, 431932, 432288, 432429, 432278, 431832, 431308, 430888, 430182, 428256, 424471, 419074, 412744, 405848, 398400, 390445, 382100, 373437, 364688, 356343, 348698, 341496, 334424, 327723, 321891, 316913, 312278, 307671, 303285, 299536, 296788, 295244, 294723, 294593, 294262, 293734, 293490, 293999, 295478, 297834, 300543, 302914]
57778C02914K003K529L850M828M794M341M266M505M529M203L688K988K122J351
57764C52911Q05K55m94j311k043k644k830k222j092k79n9K31J082K025K444K513
57748C49292K690K878K794K719L147L940M473M437M005L362K518J520M64n66j437
57733C86236k000k273k291j809o83M40N59l22j009o34K99Q65Q92O86K83k54l84
57716C78601K70J132J293O80m4m83p66r75r20n34p4J64Q0j51j05N59J658K640
57698C83025L241L603L763L565L120K729K205J037n67j698k166k935m561o103
57684C88258o402n653m853m333l818l296k796j631R82M673Q227J1150J4102J7826
57670D12436K2421K7764L3809M0095M5222M7160M4318L6664K5994J4638L617p552
$$ y = [302914, 304917, 307446, 311296, 316124, 320918, 325259, 329525, 334030, 338559, 342762, 346450, 349438, 351560, 352911, 353716, 353971, 353477, 352166, 350123, 347479, 344649, 342427, 341335, 341056, 340997, 341228, 342310, 344335, 346779, 349292, 351982, 354860, 357654, 360373, 363520, 367460, 371933, 376370, 380375, 383737, 386255, 387775, 388239, 387673, 386236, 384236, 381963, 379672, 377863, 377180, 377620, 378179, 377857, 376848, 376214, 376513, 377378, 378270, 378956, 379239, 378985, 378601, 378871, 380003, 381296, 381976, 381932, 381449, 380683, 379708, 378788, 378254, 378180, 378344, 378424, 378273, 378168, 378727, 380385, 383025, 386266, 389869, 393632, 397197, 400317, 403046, 405251, 406288, 405721, 404023, 401857, 398922, 394361, 388258, 381856, 376203, 371350, 367017, 363199, 359903, 357107, 355476, 356458, 361131, 369358, 380508, 394610, 412436, 434857, 462621, 496430, 536525, 581747, 628907, 673225, 709889, 735883, 750521, 754138, 746586]
57658G46586j9068k9548l7080m0962m1814m0482l7601l3844k9828k5780k1815
57647C88764j8241j5233j2475r709p265n600m656m142l992m071l889l159k187
57634B94145j271k69P30J063M79k14k90j80o06j357j827k082k372k276j513q73
57618B81287j118j584j276p60j313k562k835j812r74j153j419q95j96k29p86j094
57602B61281q80k98L44M30n15j850k206j355o03r55j821k169j955j718j588j488
57586B42654j628k060k247j774j006n78o00q42j190j496j490j234j221j613j942
57571B21733j884j768j869j884j560j250j300j416j149n96o6M15P87O71p6q46
57555B07942r42l96L33J009J522J593J201R65J418K200K479K043J341P37K58M
$$ y = [746586, 727518, 697970, 660890, 619928, 578114, 537632, 500031, 466187, 436359, 410579, 388764, 370523, 355290, 342815, 333106, 325841, 320241, 315585, 311443, 307451, 303380, 299491, 296332, 294145, 292874, 292605, 293335, 294398, 294877, 294663, 294373, 294193, 293587, 292230, 290403, 288321, 285949, 283673, 282160, 281287, 280169, 278585, 277309, 276549, 275236, 272674, 269839, 268027, 267053, 265900, 264481, 263586, 263390, 263161, 262375, 261281, 260401, 260103, 260447, 260877, 260362, 258512, 256306, 254951, 254348, 253393, 251572, 249403, 247448, 245730, 244142, 242654, 241026, 238966, 236719, 234945, 233939, 233361, 232761, 231919, 230729, 229233, 227743, 226509, 225288, 223675, 221733, 219849, 218081, 216212, 214328, 212768, 211518, 210218, 208802, 207653, 207057, 206991, 207406, 208193, 208864, 208788, 207942, 207000, 206604, 206937, 207946, 209468, 211061, 212262, 213227, 214645, 216845, 219324, 221367, 222708, 223445, 223703, 223707]
57539B23707J59O20J005J095R41N90L3n88j021j137r33m51J51N65O40N95P23R89
57521B27683J135J043Q56P69Q38R50R71R37J034J255J288R55O40P96J234J388
57505B43772J235J290J666J772J231M07k07o45j158j706k121k364k372k071j734
57490B36995j810k151j987j038n9K13J01L65R69J171O38j97q55j292j647j902
57474B27514j878j451p00M0M34M61L42J67j20l26j31L02L38k57q91r32m46J16
57456B22582N32P65P72P42J105J857K275J814R43N86R43J363J228N37k50n94k14
57439B36986O40J376J649J621J498J230Q83Q27J144J244N95m32q95l55P17J481
57423B50209J444Q04L19O16J507K222K333K024J499P83K48M88J347J839J554J304
$$ y = [223707, 223866, 224486, 225491, 226586, 227527, 228117, 228150, 227562, 226541, 225404, 224471, 224020, 224171, 224736, 225376, 225971, 226694, 227683, 228818, 229861, 230717, 231486, 232324, 233274, 234245, 235182, 236216, 237471, 238759, 239714, 240354, 241150, 242384, 243772, 245007, 246297, 247963, 249735, 250966, 251373, 251166, 250521, 249363, 247657, 245536, 243172, 240800, 238729, 236995, 235185, 233034, 231047, 230009, 229950, 230163, 230264, 230629, 231598, 232769, 233407, 233210, 232355, 231063, 229416, 227514, 225636, 224185, 223485, 223525, 223959, 224420, 224762, 224929, 224809, 224483, 224352, 224654, 224992, 224735, 223844, 222912, 222466, 222582, 223114, 223879, 224651, 225393, 226498, 228355, 230630, 232444, 233387, 233973, 234916, 236279, 237507, 238044, 237794, 237200, 236986, 237626, 239002, 240651, 242272, 243770, 245000, 245883, 246710, 247854, 249098, 249693, 249261, 248366, 248011, 248728, 250209, 251653, 252457, 252776, 253392, 254899, 257121, 259454, 261478, 262977, 263760, 264008, 264496, 265843, 267682, 269236, 270540]
57407B70540J812K521K561K088J799J713J409R74P05K45p80j645j191M77K069
57392B85297K827L099L190K877K242J979K414L068L547M023M585M878M773M672
57378C33471M778M748M381L995L712L076J892Q21N32Q04R48Q19P68Q97R23O97
57362C67262M51N23J020J718K245K474K676L062L324L116K830L181L979M169L389
57347D05419K672K992L885M193L694L123K970L107L427L984M430M158L217K457
57333D53728K438K741K746K606K896L543L771L143K222J845K150K627L003L601
57319D93060M676N817O373O254N899N568N104M504M185M472N120N719O205O674
57305E69630O886O502N750N361N698O313O629O730P110P857Q467Q524Q210P985
$$ y = [270540, 272352, 274873, 277434, 279522, 281321, 283034, 284443, 285417, 286122, 286367, 285587, 283942, 282751, 283228, 285297, 288124, 291223, 294413, 297290, 299532, 301511, 303925, 306993, 310540, 314563, 319148, 324026, 328799, 333471, 338249, 342997, 347378, 351373, 355085, 358161, 360053, 360874, 361406, 362210, 363158, 363977, 364745, 365642, 366565, 367262, 367713, 368236, 369256, 370974, 373219, 375693, 378369, 381431, 384755, 387871, 390701, 393882, 397861, 402030, 405419, 408091, 411083, 414968, 419161, 422855, 425978, 428948, 432055, 435482, 439466, 443896, 448054, 451271, 453728, 456166, 458907, 461653, 464259, 467155, 470698, 474469, 477612, 479834, 481679, 483829, 486456, 489459, 493060, 497736, 503553, 509926, 516180, 522079, 527647, 532751, 537255, 541440, 545912, 551032, 556751, 562956, 569630, 576516, 583018, 588768, 594129, 599827, 606140, 612769, 619499, 626609, 634466, 642933, 651457, 659667, 667652]
57291F67652Q052Q276Q511Q713Q841Q904R128R800J0871J1874J2344J2288J2144
57278G97398J2317J2813J3218J3162J2765J2633J3214J4291J5258J5771J5967
57267I48807J6075J6124J6083J5979J5911J6113J6818J7779J8144J7350J6141
57256A131324J5996J7382J9156J9976J9624J8660J7497J6473J6235J7132J8444
57245A327899J8981J8534J8087J8587J9968K1473K2489K2920K3067K3334K3945
57234A559284K4901K6181K7730K9115K9646K9163K8380K8037K8117K8308K8827
57223A867689K9990L1263L1491L0266K8352K6727K5755K5413K5664K6311K6966
57212B175887K7478K8150K9340L1033L2799L4038L4317L3824L3379L3636L4334
$$ y = [667652, 675704, 683980, 692491, 701204, 710045, 718949, 728077, 737877, 748748, 760622, 772966, 785254, 797398, 809715, 822528, 835746, 848908, 861673, 874306, 887520, 901811, 917069, 932840, 948807, 964882, 981006, 997089, 1013068, 1028979, 1045092, 1061910, 1079689, 1097833, 1115183, 1131324, 1147320, 1164702, 1183858, 1203834, 1223458, 1242118, 1259615, 1276088, 1292323, 1309455, 1327899, 1346880, 1365414, 1383501, 1402088, 1422056, 1443529, 1466018, 1488938, 1512005, 1535339, 1559284, 1584185, 1610366, 1638096, 1667211, 1696857, 1726020, 1754400, 1782437, 1810554, 1838862, 1867689, 1897679, 1928942, 1960433, 1990699, 2019051, 2045778, 2071533, 2096946, 2122610, 2148921, 2175887, 2203365, 2231515, 2260855, 2291888, 2324687, 2358725, 2393042, 2426866, 2460245, 2493881, 2528215]
57201B528215L4718L4576L4379L4417L4411L4134L3944L4370L5412L6389L6480
57190B911445L5495L4287L4057L5033L6205L6763L7212L8352L9647L9772L8601
57179C316869L7526L7678L8953M0979M3862M7415N0678N2916N4439N5773N6781
57168C833869N7194N7261N7082N5936N3154M9235M5192M1209L6888L2536K9180
57157D348736K7207K5855K4322K2672K1440K0785K0367J9747J8688J7186J5366
57146D582371J3180J0331O604K154k708p795j2768j6810j9026j9213j7901j5657
57134D502762j2700r227n751k840n70J601M233P085R028R102P633N892M606L303
57120D524157J300j204l435m852n075l404Q21P493J5892K5343L5251M4753N3261
$$ y = [2528215, 2562933, 2597509, 2631888, 2666305, 2700716, 2734850, 2768794, 2803164, 2838576, 2874965, 2911445, 2946940, 2981227, 3015284, 3050317, 3086522, 3123285, 3160497, 3198849, 3238496, 3278268, 3316869, 3354395, 3392073, 3431026, 3472005, 3515867, 3563282, 3613960, 3666876, 3721315, 3777088, 3833869, 3891063, 3948324, 4005406, 4061342, 4114496, 4163731, 4208923, 4250132, 4287020, 4319556, 4348736, 4375943, 4401798, 4426120, 4448792, 4470232, 4491017, 4511384, 4531131, 4549819, 4567005, 4582371, 4595551, 4605882, 4612486, 4614640, 4611932, 4604137, 4591369, 4574559, 4555533, 4536320, 4518419, 4502762, 4490062, 4480835, 4475084, 4472244, 4471674, 4473275, 4477508, 4484593, 4493621, 4502723, 4510356, 4516248, 4520854, 4524157, 4525457, 4524253, 4520818, 4515966, 4510891, 4507487, 4508308, 4515801, 4531693, 4557036, 4592287, 4637040, 4690301]
57107D690301O1408P0988Q3946J02006J27081J61084K05079K59367L24696M02899
57097F488855M96095O05811P32603Q75303J030273J192713J359323J527996J693655
57088A6002627J846411J976775K081064K156153K186653K143106K001590J767866
57080C2162245J476936J162321Q24706M34464l1224n51987j062957j488192j778566
57071C1147746j926937j959090j916174j840621j766103j709974j671363j637616
57063A6719868j594563j533120j450037j346599j228030j102237r76903q57172
57055F631207p45899o45114n56274m79558m13873l57767l10090k70060k37206
57046B615366k11090j90722j74448j60697j48613j37622j26931j15968j05034
$$ y = [4690301, 4751709, 4822697, 4906643, 5008649, 5135730, 5296814, 5501893, 5761260, 6085956, 6488855, 6984950, 7590761, 8323364, 9198667, 10228940, 11421653, 12780976, 14308972, 16002627, 17849038, 19825813, 21906877, 24063030, 26249683, 28392789, 30394379, 32162245, 33639181, 34801502, 35626208, 36060672, 36029448, 35477461, 34414504, 32926312, 31147746, 29220809, 27261719, 25345545, 23504924, 21738821, 20028847, 18357484, 16719868, 15125305, 13592185, 12142148, 10795549, 9567519, 8465282, 7488379, 6631207, 5885308, 5240194, 4683920, 4204362, 3790489, 3432722, 3122632, 2852572, 2615366, 2404276, 2213554, 2039106, 1878409, 1729796, 1592174, 1465243, 1349275, 1244241]
57037A244241r4798q5344p6195o7138n8308m9597m0691l1710k3057j4615n732
57026F97056L849J3716K3560L3385M2285M7549M5854L5836J9480R07j6406l1362
57014I15709m4365n5068o1810o3575o1580n8120n4239m9581m4113l8717l3987
57003C50554k9653k5519k1965j9078j6281j3309j0751q981p350n140k681p45O14
56990A89715J930L472N225P345R830J1984J2979J2806J2029J0721Q345M715M69
56977B91565l565p025r890j2081j3417j3778j3157j1648r428o812m251k159n07
56964A83847J288L822P077J0613J4232J7898K1004K2395K1311J7966J3032P125
56952C41610R63m624r214j2951j5862j7523j7655j6533j4550j1920r041o441l988
$$ y = [1244241, 1149443, 1064099, 987904, 920766, 862458, 812861, 772170, 740460, 717403, 702788, 697056, 700905, 714621, 738181, 771566, 813851, 861400, 907254, 943090, 962570, 963477, 947071, 915709, 871344, 816276, 754466, 690891, 629311, 571191, 516952, 467371, 423258, 384541, 350554, 320901, 295382, 273417, 254339, 238058, 224749, 213998, 205017, 197667, 192527, 189846, 189101, 189715, 191645, 195117, 200342, 207687, 217517, 229501, 242480, 255286, 267315, 278036, 286381, 291096, 291565, 288000, 280975, 271085, 259004, 245587, 231809, 218652, 207004, 197576, 190764, 186513, 184354, 183847, 185135, 188957, 196034, 206647, 220879, 238777, 259781, 282176, 303487, 321453, 334485, 341610, 342573, 337949, 328735, 315784, 299922, 282399, 264744, 248211, 233661, 221741, 212700, 206259, 202271]
56939B02271q60L204P330J0723J3794J7332K1161K4250K5673K4822K1376J5890
56927C86966R823M043k185r687j7312k2698k4871k4984k4453k3576k2167k0364
56915B08535j8322j5948j3400j1283r919q934p814o466n049l741k818k417k146
56902A00278j398k37O15Q44J047J934L477N159O680Q110R690J1678J4187J6938
56888A79002J9390K1168K2121K1941K0113J6481J1659O702K372j292m771q295
56876C06591j1176j2221j1111q961p080n382k708J568O840J2165J7072K1538K5823
56863C32958L0541L6164M2024M6175M6648M2784L5461K6312J6694O983l136j3416
56851F46192k2324k8125l0525l0540k8840k5133j9353j2471n562J335Q937J7610
$$ y = [202271, 201411, 204615, 211945, 222668, 236462, 253794, 274955, 299205, 324878, 349700, 371076, 386966, 396789, 400832, 398647, 388960, 371648, 348950, 324079, 299095, 274642, 251066, 228899, 208535, 190213, 174265, 160865, 149582, 139663, 130729, 122915, 116449, 111400, 107659, 104841, 102424, 100278, 98880, 98643, 99258, 100102, 101149, 103083, 106560, 111719, 118399, 126509, 136199, 147877, 162064, 179002, 198392, 219560, 241681, 263622, 283735, 300216, 311875, 318577, 320949, 319657, 314886, 306591, 295415, 283194, 272083, 263122, 256042, 250660, 247952, 249520, 256360, 268525, 285597, 307135, 332958, 363499, 399663, 441687, 487862, 534510, 577294, 612755, 639067, 655761, 662744, 659608, 646192, 623868, 595743, 565218, 534678, 505838, 480705, 461352, 448881, 443319, 444654, 453591, 471201]
56839D71201K7125L7156M7567N8217O8495P6724Q0113P6100O4411M7484K8458
56828A083051R059j0317k8922m5020n6865o3740o5866o3826n8413n0750m2060
56817F06331l3135k4184j5134n953L408J3142K3371L3854M3980N2714N8226N8017
56805H14637N0468L6646J9910L298j2195k6615l9253m8731n4371n6523n5735n2371
56793E79165m6962m0277l3055k6048j9921j4509q622j390O449J3431J9175K4150
56781D51586K7832K8477K5057J8457J0397J971o399j4531k2316k9357l4431l6169
56769D20574l4659l1652k8818k6522k4455k2616k1021j9250j6996j4508j2092
56758A67985r746p717o704o860p227o762n536m269l250k328j602j374j631k085
$$ y = [471201, 498326, 535482, 583049, 641266, 709761, 786485, 866598, 942698, 1007109, 1054593, 1083051, 1092110, 1081793, 1052871, 1007851, 950986, 887246, 821380, 757554, 699141, 648391, 606331, 573196, 549012, 533878, 527925, 531333, 544475, 567846, 601700, 645680, 698394, 756620, 814637, 865105, 901751, 921661, 924959, 912764, 886149, 846896, 798165, 743794, 687271, 631536, 579165, 532203, 491926, 458871, 432823, 412902, 398393, 389771, 388381, 394830, 408261, 427436, 451586, 479418, 507895, 532952, 551409, 561806, 563777, 557378, 542847, 520531, 491174, 456743, 420574, 385915, 354263, 325445, 298923, 274468, 251852, 230831, 211581, 194585, 180077, 167985, 158239, 150522, 143818, 136958, 129731, 122969, 117433, 113164, 109914, 107586, 105984, 104610, 102979, 100894]
56744A00894k520k714k374j505o27j93j28k34n86j175j563j404r35n56k98o5M7
56727H4064R9M96J293J822J515P77N17J070K028K753K698J727N82M80J657K822
56711A06400K718J679Q67N66K07k81k94L43J088J592J974K102J488K49o38m39
56695A19621N34J472J953J938J403M96k55l28J73O33O42M80P27J479K144K193
56679A35305J933K074K561K459J265j94p40k98J86np79j712k452k611j910o37
56663A34445M50Q11N47Q6k35k70k9L33O35P84P24M35O5p5R5K75K14P6N1j00p11
56642A38606j583k017j532l32R12J529J366R54J028J666K183K023J356N85k69
56627A46475j234j878j768j205r48j264j743j923j676j106m64j37k84n92o99p09
$$ y = [100894, 98374, 95660, 93286, 91781, 91154, 90961, 90833, 90599, 90013, 88838, 87275, 85871, 84936, 84380, 84082, 84017, 84064, 84163, 84659, 85952, 87774, 89289, 90066, 90583, 91653, 93681, 96434, 99132, 100859, 101441, 101921, 103578, 106400, 109118, 110797, 111664, 112230, 112437, 112156, 111862, 112205, 113293, 114885, 116859, 118961, 120449, 120698, 120060, 119621, 120155, 121627, 123580, 125518, 126921, 127417, 127162, 126834, 127007, 127640, 128282, 128762, 129489, 130968, 133112, 135305, 137238, 139312, 141873, 144332, 145597, 145403, 144663, 144365, 144551, 144546, 143767, 142055, 139603, 136992, 135082, 134445, 134895, 135706, 136253, 136339, 136104, 135834, 135805, 136138, 136773, 137557, 138281, 138716, 138781, 138706, 138801, 139076, 139290, 139366, 139417, 139317, 138606, 137023, 135006, 133474, 133142, 134054, 135583, 136949, 137903, 138931, 140597, 142780, 144803, 146159, 146744, 146475, 145241, 143363, 141595, 140390, 139442, 138178, 136435, 134512, 132836, 131730, 131266, 131129, 130845, 130253, 129554, 128845]
56611A28845r01j167j152p57j15O61J270J061j84j517j636m24Q99J279Q47L55
56595A27364K05L04M88P23J096J660K222K366J930J317J018J032J083J109J128
56580A45045Q82K79q1M49J458J860J353P39O95J030J421K007K826L425L658M210
56564A71256N667P449Q448Q483Q464R168J0458J1687J2282J1887J0438Q429O666
56551B90782N418M055J944m18j725j436n59m72j269j884j724j484k046l228m130
56536B81824m369m323m357m383m282m206m298m447m489m438m362m285m258m354
56522B20973m429m112l208k055j275j161j433j593j469j302j362j657k049k348
56508A91520k217j356j23L48p22k609l665l164j961j256j329j704j940j834j327
$$ y = [128845, 127944, 126777, 125625, 124868, 124753, 125414, 126684, 127745, 127561, 126044, 124408, 123984, 124883, 126162, 127009, 127364, 127569, 127873, 128361, 129084, 130180, 131840, 134062, 136428, 138358, 139675, 140693, 141725, 142808, 143917, 145045, 145927, 146206, 146125, 146574, 148032, 149892, 151245, 151984, 152679, 153709, 155130, 157137, 159963, 163388, 167046, 171256, 176923, 184372, 192820, 201303, 209767, 218935, 229393, 241080, 253362, 265249, 275687, 284116, 290782, 296200, 300255, 302199, 301781, 300056, 298620, 298061, 297589, 296320, 294436, 292712, 291228, 289182, 285954, 281824, 277455, 273132, 268775, 264392, 260110, 255904, 251606, 247159, 242670, 238232, 233870, 229585, 225327, 220973, 216544, 212432, 209224, 207169, 205894, 204733, 203300, 201707, 200238, 198936, 197574, 195917, 193868, 191520, 189303, 187947, 187824, 188172, 187450, 184841, 181176, 178012, 176051, 174795, 173466, 171762, 169822, 167988, 166661]
56493A66661o15l9L78Q73J281J037J10o85o80j12M99J060J524J501Q81K52P7N
56475A74008l26m54J67J106J568J557J561J505J104Q24J300K021J779N68k31K41
56459A88298J212J473Q15j39q32j059q28l06K78P79J018P07q7o72n00Q1M39P03
56441A91380J315J897J564M27l66k04L34N37M46K61j33o77r05o82n42q57j263
56424A92532j248q16k35L48P16O04J77Q7O59J450J835J633R96J56m98o17l29m9
56406A97401K00P38J391J512J037P44J042J241O10m48q99m39L17P62Q99J012J163
56389B08283J068M51m49q20m5J470K594K668K020J293P90O05Q46J383J730J521
56373B25408R57N64O51J085J431J299O91jm02m22j3R08K049K645K283J494J078
$$ y = [166661, 166046, 166007, 166385, 167258, 168539, 169576, 169686, 169001, 168321, 168209, 168708, 169768, 171292, 172793, 173674, 173926, 174003, 174008, 173682, 173228, 173395, 174501, 176069, 177626, 179187, 180692, 181796, 182620, 183920, 185941, 187720, 188288, 188057, 188298, 189510, 190983, 191798, 191659, 190827, 189768, 188940, 188634, 188912, 189691, 190709, 191416, 191329, 190657, 190157, 190238, 190677, 191380, 192695, 194592, 196156, 196583, 196217, 196013, 196347, 196884, 197330, 197591, 197458, 196781, 195876, 195194, 194652, 193795, 192532, 191284, 190468, 190233, 190581, 191297, 191901, 192078, 192165, 192824, 194274, 196109, 197742, 198738, 198894, 198396, 197779, 197450, 197401, 197601, 198339, 199730, 201242, 202279, 203023, 204065, 205306, 205916, 205468, 204569, 204130, 204447, 205209, 206108, 207120, 208283, 209351, 209802, 209353, 208533, 208488, 209958, 212552, 215220, 217240, 218533, 219323, 219928, 220774, 222157, 223887, 225408, 226365, 226929, 227580, 228665, 230096, 231395, 232086, 232085, 231683, 231261, 231248, 232156, 234205, 236850, 239133, 240627, 241705]
56356B41705J170J426J698J868J577Q40N02J154K038K052J352R16Q45N47K17O65
56340B60572J599J792J162J070K041K802K363J608J861K982L966M458M645M411
56326B97332L599K670K238K318K585K886L020K601J703J020R18R83R11J088J694
56311C27566K074J690J027P52P31O05P55J759L319M594N269N625N861O013O325
56296C73965O934P377P014N872M677M127M348M929N253N060M756M901N496O192
56282D50901P043Q304R515R770R084Q617R158J0292J1349J2305J3347J4400J5600
56269E89685J7341J9334K0553K0692K0848K2186K4677K7695L1009L4572L8133
56258H66725M1794M6233N1818N8188O5187P3294Q2636R2549J02742J13809J25905
$$ y = [241705, 242875, 244301, 245999, 247867, 249444, 250284, 250786, 251940, 253978, 256030, 257382, 258298, 259143, 259690, 259907, 260572, 262171, 263963, 265125, 266195, 268236, 271038, 273401, 275009, 276870, 279852, 283818, 288276, 292921, 297332, 300931, 303601, 305839, 308157, 310742, 313628, 316648, 319249, 320952, 321972, 322890, 323873, 324784, 325872, 327566, 329640, 331330, 332357, 333109, 333840, 334445, 335200, 336959, 340278, 344872, 350141, 355766, 361627, 367640, 373965, 380899, 388276, 395290, 401162, 405839, 409966, 414314, 419243, 424496, 429556, 434312, 439213, 444709, 450901, 457944, 466248, 475763, 485533, 494617, 503234, 512392, 522684, 534033, 546338, 559685, 574085, 589685, 607026, 626360, 646913, 667605, 688453, 710639, 735316, 763011, 794020, 828592, 866725, 908519, 954752, 1006570, 1064758, 1129945, 1203239, 1285875, 1378424, 1481166, 1594975, 1720880]
56247A720880J37956J49054J59526J69667J78450J84645J88293J89765J88175
56238C266411J82109J71356J56632J38076J15388Q9256O1316L2698L585k5713
56228D191114n4116q0223j02918j21649j36575j48281j57059j62738j65387j65500
56218B896668j63321j58800j52568j45918j39269j31758j23005j14149j06310
56209A661570r9072r1564q4055p7271p1041o4756n8580n3081m8274m3913m0127
56198I29836l6892l3648l0263k7489k5640k3770k1159j8543j6748j5297j3567
56187F66820j2154j1667j1168r520p344o013n467m715l785l422l430l005k277
56174E82853j911j665r14q6qk89O1Q80J346J675K644L895M479M660N424O562P006
$$ y = [1720880, 1858836, 2007890, 2167416, 2337083, 2515533, 2700178, 2888471, 3078236, 3266411, 3448520, 3619876, 3776508, 3914584, 4029972, 4119228, 4180544, 4213242, 4216827, 4191114, 4136998, 4056775, 3953857, 3832208, 3695633, 3547352, 3390293, 3227555, 3062168, 2896668, 2733347, 2574547, 2421979, 2276061, 2136792, 2005034, 1882029, 1767880, 1661570, 1562498, 1470934, 1386879, 1309608, 1238567, 1173811, 1115231, 1062150, 1013876, 969963, 929836, 892944, 859296, 829033, 801544, 775904, 752134, 730975, 712432, 695684, 680387, 666820, 654666, 642999, 631831, 622311, 614967, 608954, 603487, 598772, 594987, 591565, 588135, 585130, 582853, 580942, 579277, 578363, 578277, 578269, 577980, 578041, 578921, 580267, 581942, 584586, 588481, 592960, 597620, 603044, 609606, 616612]
56157F16612O744O659O849O908P480R474J2106J3747J4542J6097J8613K0664K2001
56144G78496K4245K8323L3231L7956M2823M8228N3720N8975O4166O8775P1364
56133A310302P1147O8657O4721N9983N5519N2259M9523M5602M0096L4291K9013
56122A881113K3710J7939J2194O753J096n083j1612j8761k7119l6204m4558n1501
56110A747967n7542o2866o6851o9173o9961o8797o5144n9798n4336m8880m2279
56099A082340l4680k8018k3336j9541j5484j1626q719o419m177k283j144m10L93
56086I26896J268K184L309M515N498O405P511Q423Q698Q857R567J0212R875R324
56072A022542J0113J2007J3218J3216J3290J4144J5006J5433J6043J7008J7545
$$ y = [616612, 623356, 630015, 636864, 643772, 651252, 660726, 672832, 686579, 701121, 717218, 735831, 756495, 778496, 802741, 831064, 864295, 902251, 945074, 993302, 1047022, 1105997, 1170163, 1238938, 1310302, 1381449, 1450106, 1514827, 1574810, 1630329, 1682588, 1732111, 1777713, 1817809, 1852100, 1881113, 1904823, 1922762, 1934956, 1941709, 1942805, 1937722, 1926110, 1907349, 1880230, 1844026, 1799468, 1747967, 1690425, 1627559, 1560708, 1491535, 1421574, 1352777, 1287633, 1227835, 1173499, 1124619, 1082340, 1047660, 1019642, 996306, 976765, 961281, 949655, 940936, 934517, 930340, 928057, 926913, 926503, 926896, 928164, 930348, 933657, 938172, 943670, 950075, 957586, 966009, 974707, 983564, 993131, 1003343, 1013218, 1022542, 1032655, 1044662, 1057880, 1071096, 1084386, 1098530, 1113536, 1128969, 1145012, 1162020, 1179565]
56061A179565J7360J7006J6583J5724J4919J5155J6058J6207J5392J4830J5070
56050A353869J5473J5783J6327J6804J6724J6908J8421K0343K0886K0443K1043
56039A553024K2978K4805K6534K9742L4236L7611L8840L9548M1062M2773M3999
56028A935152M4968M5491M5064M4565M5319M6437M5874M4146M3933M5948M8411
56017B435308N0682N3863N7662O0302O2078O5258O9953P3767P6129P9102Q3328
56006C167432Q7180R0536R5294J01485J07023J11999J18701J26811J33375J38414
55996D278250J45381J55075J64345J72192J81622J93851K06228K17809K31384
55987E946137K47989K65027K81921L01946L26251L51922L78043M07738M42066
$$ y = [1179565, 1196925, 1213931, 1230514, 1246238, 1261157, 1276312, 1292370, 1308577, 1323969, 1338799, 1353869, 1369342, 1385125, 1401452, 1418256, 1434980, 1451888, 1470309, 1490652, 1511538, 1531981, 1553024, 1576002, 1600807, 1627341, 1657083, 1691319, 1728930, 1767770, 1807318, 1848380, 1891153, 1935152, 1980120, 2025611, 2070675, 2115240, 2160559, 2206996, 2252870, 2297016, 2340949, 2386897, 2435308, 2485990, 2539853, 2597515, 2657817, 2719895, 2785153, 2855106, 2928873, 3005002, 3084104, 3167432, 3254612, 3345148, 3440442, 3541927, 3648950, 3760949, 3879650, 4006461, 4139836, 4278250, 4423631, 4578706, 4743051, 4915243, 5096865, 5290716, 5496944, 5714753, 5946137, 6194126, 6459153, 6741074, 7043020, 7369271, 7721193, 8099236, 8506974, 8949040]
55978H949040M78258N16306N60771O13781O72822P37695Q12653Q99868R98495
55969A5239689J112053J248535J411736J601801J826073K099891K436313K847303
55961B9823394L356764M000020M809306N812003P039510Q519458J0263580J2288445
55953H5912480J4647384J7418252K0664317K4407050K8520074L2451383L5021340
55946B59042280L4779192L0925402K3992763J5482889O746104j725534r941805
55939C59301291j7619219k3964894k8193669l0074072k9958043k8449189k6122879
55932A74919326k3429135k0673565j8022457j5551465j3305578j1314739r581681
55925F3040706q089910o823569n765681m886735m153080l542538l040174k625729
$$ y = [8949040, 9427298, 9943604, 10504375, 11118156, 11790978, 12528673, 13341326, 14241194, 15239689, 16351742, 17600277, 19012013, 20613814, 22439887, 24539778, 26976091, 29823394, 33180158, 37180178, 41989484, 47801487, 54840997, 63360455, 73624035, 85912480, 100559864, 117978116, 138642433, 163049483, 191569557, 224020940, 259042280, 293821472, 324746874, 348739637, 364222526, 370968630, 369243096, 359301291, 341682072, 317717178, 289523509, 259449437, 229491394, 201042205, 174919326, 151490191, 130816626, 112794169, 97242704, 83937126, 72622387, 63040706, 54950796, 48127227, 42361546, 37474811, 33321731, 29779193, 26739019, 24113290]
55917B4113290k277568j983748j738350j531605j352893j198747j068874r58112
55909A2003393q59828p73110o99390o35697n77694n25686m81432m42617m06150
55900F601789l73274l45898l21352k96166k71762k51193k33336k15404j98228
55891D095176j84151j72151j59780j47594j37269j27700j17164j07152r9911r4133
55881B748171q7093p9284p3278o9525o6683o4548o3534o2859o1998o2255o4206
55870A992908o5629o4662o2840o2183o1508n8705n4558n1041m7692m3051l8079
55859A382960l4820l2959l0777k8382k7011k6255k4910k3582k3616k4301k3909
55848A082438k2731k2476k3267k3704k3400k3159k3039k2355k1192k0182j9284
$$ y = [24113290, 21835722, 19851974, 18113624, 16582019, 15229126, 14030379, 12961505, 12003393, 11143565, 10370455, 9671065, 9035368, 8457674, 7931988, 7450556, 7007939, 6601789, 6228515, 5882617, 5561265, 5265099, 4993337, 4742144, 4508808, 4293404, 4095176, 3911025, 3738874, 3579094, 3431500, 3294231, 3166531, 3049367, 2942215, 2842304, 2748171, 2661078, 2581794, 2508516, 2438991, 2372308, 2307760, 2244226, 2181367, 2119369, 2057114, 1992908, 1927279, 1862617, 1799777, 1737594, 1676086, 1617381, 1562823, 1511782, 1464090, 1421039, 1382960, 1348140, 1315181, 1284404, 1256022, 1229011, 1202756, 1177846, 1154264, 1130648, 1106347, 1082438, 1059707, 1037231, 1013964, 990260, 966860, 943701, 920662, 898307, 877115, 856933, 837649]
55837H37649j8269j7587j7365j6551j4652j3047j2872j2967j1787j0036r299r255
55825F73962q547p395p077p580p987q469r716j0918j0565q890p517p000o511n669
55811E60121m880m101k899j497m19N97K016L388M180M936O246P286P071O332O397
55796E94774O798N893L537J180m26j990m086o379q415r974j0629j0152r246q795
55782E42090q717q436q015p743p178n835m173k734q72K316O407J0249J3511J6235
55768E37105J7524J6264J2738Q105K816l117q861j3451j7206k0806k3429k3576
55756D84106k1499j9043j7162j5311j3188j1429j0366r645r222r374r621q969
55744C29277p370n750m600l704l090k932k665j622m35l70j276j788j612j941l327
$$ y = [837649, 819380, 801793, 784428, 767877, 753225, 740178, 727306, 714339, 702552, 692516, 683217, 673962, 665415, 658020, 650943, 643363, 635376, 626907, 617191, 606273, 595708, 586818, 579301, 572301, 565790, 560121, 555241, 551140, 548241, 546744, 546325, 546922, 548938, 552326, 556506, 561442, 567688, 574974, 582045, 588377, 594774, 601572, 607465, 611002, 612182, 611756, 609766, 605680, 599301, 590886, 580912, 570283, 560131, 550885, 542090, 533373, 524937, 516922, 509179, 502001, 496166, 491993, 489259, 488387, 490703, 497110, 507359, 520870, 537105, 554629, 570893, 583631, 591736, 594552, 591435, 582574, 569123, 551917, 531111, 507682, 484106, 462607, 443564, 426402, 411091, 397903, 386474, 376108, 366463, 357241, 347867, 338246, 329277, 321907, 316157, 311557, 307853, 304763, 301831, 299166, 297544, 297109, 296739, 295463, 293675, 292063, 290122, 286795]
55729B86795m726n159m952m815m911n272n998o569o056m462k893k051j477n96
55715B26858N11J684L019M365N394O380P856R276R218P296M697K458K96k252m674
55700B82382o189o812p060p203p391p773q082p700o549n276m281l279k132j321
55686B01334j102j001n87p5K85P26J449K214K838L445L903L715K859J992J414
55671B23409O05o57j638j767j643k071k718k640j716o39K30J152K209L014L272
55656B18402L112K825K716L053L744M146L758K957K595K755K523J185q03k370
55642B50598l052l285l669m367n244o173o944p183o736o023n609n487n143m380
55628A77303l590l098k733k252j770j475j279j099j045j056p99l36l78j343k624
$$ y = [286795, 282069, 276910, 271958, 267143, 262232, 256960, 250962, 244393, 238337, 233875, 230982, 228931, 227454, 226858, 227369, 229053, 232072, 236437, 241831, 248211, 256067, 265343, 274561, 281857, 286554, 289012, 289308, 287056, 282382, 276193, 269381, 262321, 255118, 247727, 239954, 231872, 224172, 217623, 212347, 208066, 204787, 202655, 201334, 200232, 199231, 198644, 198569, 198854, 199580, 201029, 203243, 206081, 209526, 213429, 217144, 220003, 221995, 223409, 224014, 223357, 221719, 219952, 218309, 216238, 213520, 210880, 209164, 208525, 208755, 209907, 212116, 215130, 218402, 221514, 224339, 227055, 230108, 233852, 237998, 241756, 244713, 247308, 250063, 252586, 253771, 252968, 250598, 247546, 244261, 240592, 236225, 230981, 224808, 217864, 210681, 203945, 197922, 192313, 186826, 181683, 177303, 173713, 170615, 167882, 165630, 163860, 162385, 161106, 160007, 158962, 157906, 157107, 156771, 156393, 155050, 152426]
55613A52426l303l230k802k167j343p64q21j103q93l32k38q39j459j521j160p39
55597A29712m48l99n61n51o1M83L92k35o04m52m19r95j786k022j391j56J142J982
55579A23631K276K482K941L314L210L080L695M903N797O090O372O922P236P035
55565A88984O725O506N833M277K227K72j464k986m084m781n554o584p306p213
55551A74852o572n970n580n297n069m679l752k431j498j354j352p43K16P12O03
55536A32086M96Q28J461J951J824P66q92k162k386k102k275k899l075k445j788
55521A19388j895k453k540j891j144r32j210j529j592j318p00Q4M64j08j418k545
55505I8661k708j893n19R41J883J725O16m47p79q02j132j413r39k5L07p9k72K41
$$ y = [152426, 149123, 145893, 143091, 140924, 139581, 138817, 137996, 136893, 136000, 135668, 135430, 134591, 133132, 131611, 130451, 129712, 129264, 128865, 128304, 127753, 127692, 128175, 128567, 128332, 127728, 127276, 126857, 125862, 124076, 122054, 120663, 120507, 121649, 123631, 125907, 128389, 131330, 134644, 137854, 140934, 144629, 149532, 155329, 161419, 167791, 174713, 181949, 188984, 195709, 202215, 208048, 212325, 214552, 214824, 213360, 210374, 206290, 201509, 195955, 189371, 182065, 174852, 168280, 162310, 156730, 151433, 146364, 141685, 137933, 135502, 134004, 132650, 131298, 130555, 130771, 131483, 132086, 132582, 133410, 134871, 136822, 138646, 139412, 138520, 136358, 133972, 131870, 129595, 126696, 123621, 121176, 119388, 117493, 115040, 112500, 110609, 109465, 108533, 107323, 105794, 104202, 102884, 102184, 102268, 102732, 102624, 101206, 98661, 95953, 94060, 93541, 94482, 96365, 98090, 98706, 98259, 97480, 96678, 95546, 94133, 93194, 93169, 93476, 93397, 93125, 93366]
55487I3366R43J281J303J102N92J29L56J007R49j01q88m14N88Q69M76K83L54O4
55469A02259n66q55p38q88j479j811j421p21k69p2P5J64K20M87R55J172Q34L08
55451I7654J96N77R61R06L62m69j332j924j900j151o3O45M80l56j123j224p01
55434I1538q3J81Q8l2M2J66R6m3J85Q65J418J283O86L56O01J135J662K024J815
55415A03983O37j001j763r51N64J410J302J036J168J356J005R2q37j189q10j26
55399A05876J92j34p02q85n28j8J83n0n38j014j312j401j265q38j29O17J054J055
55381A00163P94N11L54L46L73K35n7j70O5K23k44j187j855j860j541j307j142
55364I3701r23p10n05r2N23Q90O46Nn16n93j88N55J209J252O04k02o33p03p01
$$ y = [93366, 94309, 95590, 96893, 97995, 98587, 98716, 99072, 100079, 101028, 100927, 100039, 99625, 100213, 101082, 101558, 101841, 102195, 102259, 101693, 100838, 100100, 99212, 97733, 95922, 94501, 93780, 93511, 93439, 93514, 93678, 93898, 94385, 95340, 96512, 97346, 97654, 97850, 98427, 99388, 100294, 100656, 100187, 98855, 96931, 95031, 93880, 93817, 94462, 94942, 94586, 93463, 92239, 91538, 91455, 91636, 91724, 91692, 91734, 91900, 91996, 91953, 92138, 93003, 94421, 95704, 96390, 96746, 97347, 98482, 100144, 102168, 103983, 104620, 103619, 101856, 100905, 101469, 102879, 104181, 105217, 106385, 107741, 108746, 108838, 108001, 106812, 106002, 105876, 106068, 105934, 105232, 104347, 103819, 103801, 103984, 103934, 103396, 102382, 101070, 99669, 98404, 97566, 97437, 98054, 99108, 100163, 100957, 101468, 101822, 102168, 102541, 102776, 102719, 102549, 102614, 102837, 102593, 101406, 99551, 97691, 96150, 94843, 93701, 92778, 92068, 91563, 91471, 91994, 92884, 93530, 93535, 93019, 92426, 92238, 92793, 94002, 95254, 95858, 95656, 95023, 94320, 93619]
55345I3619o56l84J32N95O28J07n68o96o3N96M02m95j072p86p0N42J003J226Q55
55326I4915j4o12n85o23j363k243k228j281k97J24K26N19J184J936K155J401R1
55309I3305p27o07j58P6M40J164J417M36r43j192k67M08Q4m22k20M33R18J193
55291I5338J427J453J186R88J050R49M11j3L45J159J401O43n05j189j180q63p08
55274A01892q58j102j198j137j057q82l53M86J087R48K45k86j62L51O18L66p0
55257I8888k25m7J39Q3j86n48r00j044p54j44L24L98L37M75P22P93P19P58R10
55238A00698Q40L52l81j045j455j600j571j448j230q91n36l34k60j19R4K24K74
55221I1612M03N42M12N9p7J59M69P46J244J781J640P76K65P90J399Q50m61j102
$$ y = [93619, 92963, 92579, 92711, 93306, 93934, 94041, 93473, 92777, 92714, 93310, 93712, 93217, 92145, 91359, 91289, 91831, 92834, 94060, 94915, 94901, 94289, 93704, 93081, 91718, 89475, 87247, 85966, 85669, 85793, 86019, 86538, 87722, 89658, 91813, 93214, 93305, 92578, 91971, 91813, 91889, 92329, 93493, 94910, 95346, 94403, 93211, 92944, 93352, 93436, 93014, 92794, 93227, 94145, 95338, 96765, 98218, 99404, 100392, 101442, 102391, 102802, 102789, 103134, 104293, 105694, 106337, 105832, 104643, 103463, 102600, 101892, 101034, 99932, 98734, 97597, 96540, 95658, 95305, 95791, 96878, 97826, 98071, 97785, 97623, 97974, 98592, 98958, 98888, 98663, 98616, 98755, 98838, 98652, 98104, 97204, 96160, 95406, 95262, 95586, 95984, 96321, 96796, 97518, 98311, 99030, 99788, 100698, 101538, 101890, 101509, 100464, 99009, 97409, 95838, 94390, 93160, 92269, 91733, 91399, 91139, 91020, 91114, 91338, 91612, 92015, 92557, 92969, 93028, 92951, 93110, 93579, 94325, 95569, 97350, 98990, 99766, 100031, 100821, 102220, 103070, 102609, 101507]
55203A01507p85n50q76j002l74M07O51N63O00O03J84n29j055j091o26R1M90J36
55185I8344o03q71n36l42o66q76l66N05J057J244J306J069L01n84r06n94q0M20
55167I7822R21J162P85L7l30M0P38J157J162J010Q97P34L61q1j45L59Q56N40n49
55148A07476j450j540j272j278j307p31K26O08P0o55p33k01L46N57N13L88K20
55131A01237J5j35p8K32N61N11n6o92p60j48N30O03J69M4P76J821K052J158J25
55112A07965j0M93O05R5k31N5L67K42J95P80J452J318N81K86P33J153R23K87l04
55093A16985p69j009o35M03J403J612J062L61o4j92j65j63k86l51OP41J223R75
55075A21137L50O3K30L45J72J11N30J176J460J108L10n79j305j732j778j409p11
$$ y = [101507, 100722, 100172, 99296, 98294, 97920, 98327, 98978, 99541, 100141, 100744, 100928, 100399, 99344, 98253, 97627, 97718, 98208, 98344, 97741, 96870, 96334, 95992, 95326, 94450, 94084, 94589, 95646, 96890, 98196, 99265, 99566, 98982, 98076, 97482, 97402, 97822, 98743, 99905, 100690, 100727, 100397, 100437, 101175, 102332, 103494, 104504, 105401, 106135, 106496, 106415, 106270, 106629, 107485, 108025, 107476, 106026, 104486, 103214, 101936, 100629, 99898, 100124, 100732, 100802, 100147, 99414, 99213, 99559, 100116, 100629, 101017, 101237, 101252, 101117, 101039, 101271, 101832, 102343, 102287, 101595, 100835, 100687, 101217, 101820, 101989, 102033, 102809, 104630, 106682, 107840, 107965, 107955, 108448, 109053, 109148, 108917, 108972, 109339, 109581, 109776, 110556, 112008, 113326, 113907, 114193, 114926, 116079, 117002, 117289, 116985, 116216, 115207, 114572, 114975, 116378, 117990, 119052, 119413, 119349, 119157, 118992, 118829, 118543, 118192, 118198, 118939, 120162, 121137, 121487, 121550, 121780, 122125, 122297, 122408, 122938, 124114, 125574, 126682, 126992, 126413, 125108, 123376, 121598, 120189, 119478]
55058A19478L3M59M92M59O17P02K80n20j042r43n68l35k53k18l82p57r47p56o63
55039A15136j112j589j195nR00Q09N6p15j231j331q24M3O59Q97J206J532J076
55022A14312k64j225q16J23J32o80r48k03O69J065J387J845J824R69q7o90r66
55005A16447j104o86N20J817K343K105J567P81k87j076r83l44n2k70l59K2M86
54988A20927O19M86K30j75o38q82q67q42q31m88L18J134J443J242Q54M50O0j41
54970A22899J8L42L63o6m81k66O89J847K495K275J339K38l92k64J60k0j139k370
54952A27667k495j291K16R11O37jm41n49m72m57o36q39p26k54K41M89N46N12L36
54933A23394J62L97J109J696J564R13M10L67O90J394K553L784M394M244L990M270
$$ y = [119478, 119511, 119970, 120462, 120921, 121538, 122240, 122520, 122000, 120958, 120015, 119447, 119112, 118859, 118641, 118259, 117502, 116555, 115799, 115136, 114024, 112435, 111240, 111235, 112135, 112944, 113000, 112285, 111054, 109723, 108899, 108942, 109601, 110498, 111704, 113236, 114312, 114048, 112823, 112007, 112130, 112262, 111582, 110634, 110431, 111100, 112165, 113552, 115397, 117221, 118190, 118103, 117413, 116447, 115343, 114657, 115177, 116994, 119337, 121442, 123009, 123790, 123503, 122427, 121444, 121100, 121048, 120778, 120419, 120441, 120927, 121546, 122032, 122262, 122087, 121449, 120567, 119700, 118858, 118027, 117539, 117857, 118991, 120434, 121676, 122530, 122980, 123040, 122899, 122917, 123259, 123622, 123556, 123075, 122809, 123498, 125345, 127840, 130115, 131454, 131692, 131300, 131036, 131196, 131176, 130037, 127667, 125172, 123881, 124097, 125008, 125645, 125644, 125203, 124654, 124182, 123725, 123089, 122250, 121524, 121270, 121511, 122000, 122546, 123058, 123394, 123556, 123953, 125062, 126758, 128322, 129235, 129645, 130012, 130702, 132096, 134649, 138433, 142827, 147071, 151061, 155331]
54917A55331M921N245M805L797K732J908J219M37m64j354k264l300m175m318l685
54902A60835l129l439m267m528l736k487j578j174r49o94n09n55p37o54JR29J428
54885A34757J285J147J674K601L118K929K419J956J652J682K149K693K877K973
54871A65912L621M548M506K876O12r32j578k117l000l949m647n119n313m889l665
54856A46866k091j024r91j626j963j467o85o18j433k218k162j495r82q88r08q82
54840A25433j034j490j931j902j304m56J92M32L53P9l64q26q93l11N64J172J506
54823A19220J961K398K075P53o98j256q50j66K80L25n6o61r57o42m6L71O39R00
54805A23590Q39K22l89k23N34J039J119J340J667J210k69j556j445l40L78K17
$$ y = [155331, 160252, 165497, 170302, 174099, 176831, 178739, 179958, 180395, 179931, 178577, 176313, 173013, 168838, 164520, 160835, 157706, 154267, 150000, 145472, 141736, 139249, 137671, 136497, 135548, 134854, 134345, 133790, 133053, 132399, 132400, 133329, 134757, 136042, 137189, 138863, 141464, 144582, 147511, 149930, 151886, 153538, 155220, 157369, 160062, 162939, 165912, 169533, 174081, 178587, 181463, 182075, 181143, 179565, 177448, 174448, 170499, 165852, 160733, 155420, 150531, 146866, 144775, 143751, 142760, 141134, 139171, 137704, 137019, 136401, 134968, 132750, 130588, 129093, 128111, 127223, 126315, 125433, 124399, 122909, 120978, 119076, 117772, 117316, 117508, 117940, 118293, 118372, 118008, 117182, 116289, 115978, 116542, 117714, 119220, 121181, 123579, 125654, 126407, 125709, 124453, 123603, 123437, 123717, 124042, 123986, 123325, 122368, 121726, 121680, 122051, 122690, 123590, 124429, 124651, 124262, 124039, 124573, 125612, 126731, 128071, 129738, 130948, 130679, 129123, 127678, 127338, 127716, 127933]
54789A27933m9K78Q20P54o7q89q93l9R16J233Q93M70M52R18J700K457K684K179
54771A41750J517J614K608L754M555N345O368O992O565N547M978N037M901L992
54757B05523K591J136l25j779k987l869m709n564n978n571m680l975l668l517
54743A62628l376l349l393l159k405j348m72r4j19k48k63j75q3rJ31M69J118K048
54725A47901K945L318L012K488K455L141M133M818M808M027K664J068m25j616
54711A84737k282k207j686j677k827m437n107m511l737l631l621k829j573q91
54697A43721r90j125q79o19o28o31m44l46n46q10r71j247j683j799j231l46K09
54680A29635L01K15R4p3j49k4M2k56p37r82r74r53q30k91M59P81N79N04Q89J172
$$ y = [127933, 127884, 128162, 128982, 129736, 129669, 128780, 127887, 127848, 128764, 129997, 130890, 131360, 131812, 132730, 134430, 136887, 139571, 141750, 143267, 144881, 147489, 151243, 155798, 161143, 167511, 174503, 181068, 186615, 191593, 196630, 201531, 205523, 208114, 209250, 208925, 207146, 204159, 200290, 195581, 190017, 184039, 178468, 173788, 169813, 166145, 162628, 159252, 155903, 152510, 149351, 146946, 145598, 145126, 145032, 144913, 144665, 144402, 144227, 144144, 144135, 144266, 144735, 145853, 147901, 150846, 154164, 157176, 159664, 162119, 165260, 169393, 174211, 179019, 183046, 185710, 186778, 186353, 184737, 182455, 180248, 178562, 176885, 174058, 169621, 164514, 160003, 156266, 152635, 149014, 146185, 144612, 143721, 142731, 141606, 140727, 140108, 139480, 138849, 138405, 138059, 137513, 136703, 135732, 134485, 132802, 131003, 129772, 129426, 129635, 129936, 130151, 130245, 130172, 130023, 129999, 130041, 129785, 129048, 128066, 127092, 126139, 125309, 125018, 125477, 126258, 126837, 127341, 128230, 129402]
54660A29402Q72M50M90N35k88j652k120j082L40P98L82J38M56P62N89J93QJ32
54642A30405M95R85J241Q10k14j025r28q6P42J022P56J93m10q05q00l68L18R42
54624A33273J171Q71K51l56q44j225j298q17l6M11L57L17N54N28k32j132j144
54607A30649k02P46R85P25M78M09M40M41K11l29p83n92J21N71L35j35k40l8M2
54588A33834j45m42o63n74L7R21J305P66j16m41j48L9l44r83j308j066l21O81
54570A31032J475J614J097L98p0l16m92n06j59M47R31J066R96R05O99K72n9K22
54552A39552J023J460Q57l65j153j040m46J10M69N77L62O3J22N64R29J005J074
54535A45163J193R45L00L5O13J248Q77l37j300j553j523j371o84M94J219P96k75
$$ y = [129402, 130274, 130724, 131214, 131749, 131461, 129809, 127689, 126607, 126947, 127745, 128127, 128265, 128721, 129483, 130072, 130265, 130273, 130405, 130900, 131885, 133126, 133936, 133722, 132697, 131769, 131683, 132425, 133447, 134203, 134396, 133986, 133181, 132381, 132013, 132331, 133273, 134444, 135315, 135566, 135210, 134366, 133141, 131843, 131026, 130990, 131401, 131758, 132075, 132629, 133157, 132925, 131793, 130649, 130447, 131193, 132178, 132903, 133381, 133790, 134230, 134671, 134882, 134553, 133770, 133178, 133299, 133870, 134205, 134070, 133830, 133792, 133834, 133689, 133247, 132584, 132010, 132047, 132968, 134273, 135039, 134923, 134482, 134334, 134373, 134029, 133046, 131738, 130672, 130351, 131032, 132507, 134121, 135218, 135616, 135546, 135230, 134738, 134232, 134073, 134520, 135451, 136517, 137513, 138418, 139117, 139389, 139330, 139552, 140575, 142035, 142892, 142527, 141374, 140334, 139888, 139998, 140467, 141044, 141406, 141469, 141591, 142155, 143084, 144089, 145163, 146356, 147301, 147601, 147636, 148249, 149497, 150374, 150037, 148737, 147184, 145661, 144290, 143606, 144100, 145319, 146115, 145840]
54518A45840r60q95n58n25r29j409j400o41L90Q82O59L56M48N65J56n18o32N8
54500A40887Q36R09L16k12k10Jk18q96j315r07k6N01M27K41K95L63K40J74L36
54481A41742L39k17r36r60j9J294K244K562K343J758J064O11O21J009J443J545
54465A56443J156N70L49P03J113R31K47k67l77o20j336j934j605n28K78J86m50
54448A54859r62j152j144r68o13l57n41j091j478j198k21R63J663J499Q20M22
54432A50501O14P72J74q72j273n45N61J047Q15M51K38q6o06q60l65P23J671J902
54414A54862J550J208J191J155O17k72q16o37j87j10l95m24J95J111J596J299
54398A61943N86J44K53M99L22k32n59l10K04M63L47P8j10j06Q1K41J31j18j8O13
$$ y = [145840, 144880, 143985, 143427, 142902, 141973, 140564, 139164, 138523, 138913, 139795, 140454, 140810, 141258, 141823, 141979, 141461, 140829, 140887, 141723, 142632, 142948, 142736, 142526, 142527, 142309, 141413, 140098, 139191, 139165, 139666, 140093, 140334, 140629, 140992, 141232, 141406, 141742, 142081, 141864, 140928, 139968, 139949, 141243, 143487, 146049, 148392, 150150, 151214, 151825, 152446, 153455, 154898, 156443, 157599, 158169, 158518, 159221, 160334, 161265, 161512, 161245, 160868, 160248, 158912, 156978, 155373, 154845, 155123, 155309, 154859, 153897, 152745, 151601, 150633, 150020, 149663, 149122, 148031, 146553, 145355, 145134, 146097, 147760, 149259, 150079, 150501, 151115, 151887, 152061, 151189, 149916, 149371, 149932, 150979, 151794, 152245, 152483, 152397, 151791, 150931, 150566, 151289, 152960, 154862, 156412, 157620, 158811, 159966, 160583, 160311, 159495, 158858, 158671, 158561, 158166, 157742, 157937, 159048, 160644, 161943, 162529, 162673, 162926, 163425, 163747, 163515, 162956, 162646, 162850, 163313, 163660, 163738, 163628, 163522, 163603, 163844, 163975, 163857, 163839, 164452]
54378A64452J233J168M18l47m63K24J343K242K506K361K404K845L347L649L837
54363A91219L775L016J686P89R50J420J068o6j056j523j833k114k125k039k323
54348A90844k801k811k377k237k522k443j629p86n69o84o73p29j044j112n22J67
54332A68072J95k04k69k6k24r85j441q73L81J386J596J146M97ol33o57j050j342
54314A65863j309r23m00q0j86n28o02j92K33J10l72n17p9N58J098J494J420M50
54296A66038j016j854j601r26m41R9Q17J001K27n49j08J322K384K347J584O92
54280A70016k8l62k87k29m82n95oR28J331J004M91R4k76m41r9M49N84M53P46J406
54260A74697J552R07K72K38M30L87L45N45O47M15K96O33R25N85m8k10J27K64j70
$$ y = [164452, 165685, 166853, 167271, 166924, 166461, 166685, 168028, 170270, 172776, 175137, 177541, 180386, 183733, 187382, 191219, 194994, 198010, 199696, 200485, 201435, 202855, 203923, 203857, 202801, 201278, 199445, 197331, 195206, 193167, 190844, 188043, 185232, 182855, 180618, 178096, 175653, 174024, 173238, 172669, 171985, 171312, 170583, 169539, 168427, 167905, 168072, 168267, 168063, 167794, 167768, 167544, 166559, 165118, 164245, 164626, 166012, 167608, 168754, 169251, 169245, 168912, 168255, 167205, 165863, 164554, 163631, 163231, 163151, 162965, 162437, 161835, 161643, 161876, 161986, 161614, 161097, 161018, 161576, 162674, 164168, 165588, 166038, 165022, 163168, 161567, 160641, 160200, 160299, 161116, 162117, 162344, 161795, 161687, 163009, 165393, 167740, 169324, 170016, 169988, 169626, 169339, 169110, 168628, 168033, 168027, 168955, 170286, 171290, 171781, 171875, 171599, 171158, 171059, 171508, 172092, 172545, 173291, 174697, 176249, 177156, 177428, 177666, 178096, 178483, 178828, 179373, 180020, 180435, 180731, 181364, 182289, 182874, 182826, 182616, 182743, 183007, 182837]
54241A82837q46j219r98k63M21K65q69j962j793l39J161J551Q50q3m98l10R6L54
54223A78355M58N75O75M92k6n02n05m0M95O96M14j84p09q48o91n80n85m23J8L74
54203A77459K37k96q06j019r15n60j38Ok87o51m87K77J010J012K57o18j043j045
54185A72393r69q36l04O29J354J341Q35L97R9k80m79K0R83J434R58K68J33L37
54167A78313K08l53q98j159j202j131j042j072j150r69n24k92n25p28m20L8p2
54150A67022o71r37m22M81J156J348J071M79j36n39p88r70q50k20N71R66R72J027
54132A69560J152R44L88N0J96M11L66L66P39J133R81L35k17l40k48k42k97j02
54114A75175N59J520K322K771L183L814M237L837K943K654L254L638K834J467
$$ y = [182837, 181991, 180772, 179774, 179511, 179932, 180197, 179328, 177366, 175573, 175234, 176395, 177946, 178796, 178713, 178215, 177905, 178001, 178355, 178813, 179388, 180063, 180555, 180529, 180027, 179522, 179482, 179977, 180673, 181087, 180903, 180194, 179346, 178655, 178075, 177490, 177067, 177085, 177459, 177696, 177400, 176594, 175575, 174660, 174100, 173962, 173968, 173681, 173030, 172543, 172820, 173830, 174842, 175099, 174481, 173438, 172393, 171424, 170588, 170284, 170913, 172267, 173608, 174443, 174840, 174939, 174659, 174180, 174200, 175183, 176617, 177575, 177843, 177976, 178313, 178521, 178168, 177270, 176111, 174909, 173778, 172736, 171664, 170514, 169545, 169021, 168729, 168204, 167476, 167056, 167094, 167022, 166351, 165414, 164992, 165473, 166629, 167977, 169048, 169527, 169391, 168852, 168064, 167094, 166244, 166024, 166595, 167561, 168533, 169560, 170712, 171656, 172044, 172094, 172290, 172701, 173067, 173433, 174172, 175305, 176286, 176621, 176404, 176064, 175816, 175574, 175277, 175175, 175734, 177254, 179576, 182347, 185530, 189344, 193581, 197418, 200361, 203015, 206269, 209907, 212741, 214208]
54100B14208R14J444K041J897J180L55m41j098j288r31m50k83m25o22p13o20l62
54083B14806k09m10p31p10n43j003k140k795k053o60q0n20q69m95o2k59p13p10
54065A99844l53k44m90o41m72k01k6J15L22O43J158J732J842J096Qk51Q51K491
54047B07424L357L017K182J740J865K101K151K273K862L825M609M854M778M780
54033B51818M968N246N569N859N897N662N553N849O070N415L857K270J405J195
54019C16633J222J360J616J737J361L96r33k257l175l520l649m117m919n439n372
54004B90944n213n360n267m158k353j144j306k251k822k521j770j359j712k539
53990B51169l087k875k151j483j053o78l82m62r14j268j123o59l56m93r12j184
$$ y = [214208, 215122, 216566, 218607, 220504, 221684, 222039, 221598, 220500, 219212, 218281, 217831, 217548, 217123, 216501, 215788, 215168, 214806, 214597, 214187, 213456, 212746, 212203, 211200, 209060, 206265, 204212, 203552, 203472, 202952, 202083, 201588, 201526, 201267, 200554, 199844, 199491, 199247, 198757, 198116, 197644, 197443, 197417, 197532, 197854, 198497, 199655, 201387, 203229, 204325, 204333, 204082, 204933, 207424, 210781, 213798, 215980, 217720, 219585, 221686, 223837, 226110, 228972, 232797, 237406, 242260, 247038, 251818, 256786, 262032, 267601, 273460, 279357, 285019, 290572, 296421, 302491, 307906, 311763, 314033, 315438, 316633, 317855, 319215, 320831, 322568, 323929, 324325, 323392, 321135, 317960, 314440, 310791, 306674, 301755, 296316, 290944, 285731, 280371, 275104, 270946, 268593, 267449, 266143, 263892, 261070, 258549, 256779, 255420, 253708, 251169, 248082, 245207, 243056, 241573, 240520, 239842, 239460, 238998, 238084, 236816, 235693, 235034, 234678, 234185, 233273, 232089]
53974B32089r57l38J20J09J08Q46K242L418L883M122M771N738O558P107P363O895
53958B84074N272K971J099J28n40j620l000m045m376m042l234k225j373q24k90
53943B67975N50J505K088K238K414K842L149L017K852L268M065M266L377K066
53929C05672J343J403J654J717J877K511L531M522N193N484N429N148M866M792
53915C55142N011N507O182O748O829O340N669N282N191N006M470L721L025K507
53901D26630K129J757J159Q0j421k828l550l520l289l480m200n072n758o332p037
53886C85268p787q119p727o909o283o102o034n688n135m704m424m008l430l212
53872C05706l811m853n315m622l336k545k666l116l136k682k348k573l135l449
$$ y = [232089, 231132, 230794, 230914, 231023, 231131, 231977, 234219, 237637, 241520, 245642, 250413, 256151, 262709, 269816, 277179, 284074, 289346, 292317, 293416, 293544, 293004, 291384, 288384, 284339, 279963, 275921, 272687, 270462, 269089, 268265, 267975, 268525, 270030, 272118, 274356, 276770, 279612, 282761, 285778, 288630, 291898, 295963, 300229, 303606, 305672, 307015, 308418, 310072, 311789, 313666, 316177, 319708, 324230, 329423, 334907, 340336, 345484, 350350, 355142, 360153, 365660, 371842, 378590, 385419, 391759, 397428, 402710, 407901, 412907, 417377, 421098, 424123, 426630, 428759, 430516, 431675, 431755, 430334, 427506, 423956, 420436, 417147, 413667, 409467, 404395, 398637, 392305, 385268, 377481, 369362, 361635, 354726, 348443, 342341, 336307, 330619, 325484, 320780, 316356, 312348, 308918, 305706, 301895, 297042, 291727, 287105, 283769, 281224, 278558, 275442, 272306, 269624, 267276, 264703, 261568, 258119]
53858B58119l171k476j825j566j677j866j884j696j406j056o66l81m21q05j198
53843B36025j181o19J85O80M69l21j039j083n31k3R3J13L09K57n96j837k267j321
53825B27313K04J163J301J110Q94N82K36J49L75O58Q67J123J451J712J947K344
53809B43429K751K765K448K399K827L126K868K658L320M596N407N284M770M404
53795B93052M168M056M355M994N308M944M419M236M030L242K214J670J432O05
53781C42725r23k205k631k705l024l333l172k889l181m069m909n252n070m393
53767B94969l378k605k593l041l162k757k357k343k527k717k985l176k877k176
53753B56275j766j908j931j324p29j102k237k885k318j105l41n43j362j980j718
$$ y = [258119, 254948, 252472, 250647, 249081, 247404, 245538, 243654, 241958, 240552, 239496, 238830, 238449, 238028, 237223, 236025, 234844, 234225, 234410, 235090, 235559, 235238, 234199, 233116, 232585, 232562, 232655, 232768, 233077, 233334, 232738, 230901, 228634, 227313, 227517, 228680, 229981, 231091, 231985, 232567, 232803, 232952, 233327, 233985, 234852, 235975, 237426, 239138, 241085, 243429, 246180, 248945, 251393, 253792, 256619, 259745, 262613, 265271, 268591, 273187, 278594, 283878, 288648, 293052, 297220, 301276, 305631, 310625, 315933, 320877, 325296, 329532, 333562, 336804, 339018, 340688, 342120, 342725, 341802, 339597, 336966, 334261, 331237, 327904, 324732, 321843, 318662, 314593, 309684, 304432, 299362, 294969, 291591, 288986, 286393, 283352, 280190, 277433, 275076, 272733, 270206, 267489, 264504, 261328, 258451, 256275, 254509, 252601, 250670, 249346, 248617, 247515, 245278, 242393, 240075, 238970, 238629, 238086, 236724, 234744, 233026]
53738B33026n98O77J473J801J956J869J306M59j61l43k43J35R21J849K318K101
53722B48546J581J149P83M16K21L25N60O90O94O74P30J008J587K265K694K806
53706B66729K808K769K587K373K448K792K978K790K589K762L234L656L852L811
53692C08178L533L090K617K098J449Q49O49P43N27k86j126j250o72j22j76p46
53676C19355j277j322r32n39l88k92j72m96j604k792k911j920r48o33m04K44P53
53659C03722N06p7k70j85k25j13N70J285J165L91j02j59l90q03o20L13J088J138
53641C07234J099J701K649L166L037K549J888J241J104J825K960L622L434K832
53627C40341K449K499K768K992L135L319L579L787L887L991M103L973L442K746
$$ y = [233026, 232428, 233105, 234578, 236379, 238335, 240204, 241510, 241969, 241808, 241465, 241222, 241357, 242278, 244127, 246445, 248546, 250127, 251276, 252059, 252475, 252696, 253021, 253581, 254271, 254965, 255639, 256369, 257377, 258964, 261229, 263923, 266729, 269537, 272306, 274893, 277266, 279714, 282506, 285484, 288274, 290863, 293625, 296859, 300515, 304367, 308178, 311711, 314801, 317418, 319516, 320965, 321814, 322463, 323206, 323733, 323447, 322321, 321071, 320399, 320277, 320101, 319355, 318078, 316756, 315824, 315285, 314897, 314605, 314433, 313937, 312333, 309541, 306630, 304710, 303762, 303129, 302725, 302969, 303722, 304228, 304151, 303881, 303696, 303471, 303358, 303928, 305213, 306378, 306769, 306667, 306508, 306118, 305315, 304695, 305008, 306096, 307234, 308333, 310034, 312683, 315849, 318886, 321435, 323323, 324564, 325668, 327493, 330453, 334075, 337509, 340341, 342790, 345289, 348057, 351049, 354184, 357503, 361082, 364869, 368756, 372747, 376850, 380823, 384265, 387011]
53613C87011K226J943J873K168K812L311L239K916K917L158L108K769K671K840
53599D24962K642J860J139J047J363J575J583J446J005J35r22j862k536k761k334
53584D28342j546j181j612k302k549k336k077j972k013k238k523k435j762r58
53570D00838o42p96r22p90o43p40r98j137r81o44n29r11j508j701j223l43O34
53553C86964J600K239K036J060K51M56J469K420K834K861K783K753K871L130L368
53538D19095L502L621L712L608L435L739M803O243P516Q504R215R475R391R692
53524E05551J0927J2606J3768J4169J4287J4407J4396J4291J4460J5098J6144
53513F60104J7585J9390K1135K2316K3064K4002K5396K6835K7822K8217K8076
$$ y = [387011, 389237, 391180, 393053, 395221, 398033, 401344, 404583, 407499, 410416, 413574, 416682, 419451, 422122, 424962, 427604, 429464, 430603, 431650, 433013, 434588, 436171, 437617, 438622, 438757, 437835, 435973, 433437, 430676, 428342, 426796, 425615, 424003, 421701, 419152, 416816, 414739, 412767, 410754, 408516, 405993, 403558, 401796, 400838, 400196, 399400, 398478, 397688, 397045, 396305, 395307, 394170, 393189, 392545, 392016, 391105, 389597, 387896, 386673, 386330, 386964, 388564, 390803, 392839, 393899, 394150, 394606, 396075, 398495, 401329, 404190, 406973, 409726, 412597, 415727, 419095, 422597, 426218, 429930, 433538, 436973, 440712, 445515, 451758, 459274, 467778, 476993, 486468, 495859, 505551, 516478, 529084, 542852, 557021, 571308, 585715, 600111, 614402, 628862, 643960, 660104, 677689, 697079, 718214, 740530, 763594, 787596, 812992, 839827, 867649, 895866, 923942]
53502I23942K7507K6741K5943K4926K3484K1951K0952K0580K0310J9780J9177
53491A175293J8763J8522J8461J8717J9175J9372J9093J8772J8954J9590K0093
53480A384805J9950J9162J8093J7052J5944J4439J2495J0547Q947P414N364K621
53468A536833n08l664o533q690r955j0849j2167j4042j5891j7241j8079j8435
53456A400779j8325j8216j8832k0144k1193k1296k0920k0933k1453k1888k1763
53445A175816k1076k0075j9099j8377j7635j6248j4108j1939j0325q828o665m035
53433A007406j974r45k91P34K010K996L618M309N333O558P776Q924J0021J1121
53419A067596J2426J4207J6449J8741K0634K2058K3295K4656K6314K8338L0611
$$ y = [923942, 951449, 978190, 1004133, 1029059, 1052543, 1074494, 1095446, 1116026, 1136336, 1156116, 1175293, 1194056, 1212578, 1231039, 1249756, 1268931, 1288303, 1307396, 1326168, 1345122, 1364712, 1384805, 1404755, 1423917, 1442010, 1459062, 1475006, 1489445, 1501940, 1512487, 1521434, 1528848, 1534212, 1536833, 1536325, 1532661, 1526128, 1517438, 1507483, 1496634, 1484467, 1470425, 1454534, 1437293, 1419214, 1400779, 1382454, 1364238, 1345406, 1325262, 1304069, 1282773, 1261853, 1240920, 1219467, 1197579, 1175816, 1154740, 1134665, 1115566, 1097189, 1079554, 1063306, 1049198, 1037259, 1026934, 1018106, 1011441, 1007406, 1005432, 1004487, 1004196, 1004930, 1006940, 1009936, 1013554, 1017863, 1023196, 1029754, 1037530, 1046454, 1056475, 1067596, 1080022, 1094229, 1110678, 1129419, 1150053, 1172111, 1195406, 1220062, 1246376, 1274714, 1305325]
53408A305325L2719L4206L5007L5556L6359L7668L9552M1993M4691M7035M8569
53397A738680M9469N0346N1662N3405N5157N6420N7059N7536N8448N9643O0164
53386B347989N9330N7539N5638N3885N1945M9624M7020M4077M0618L6778L2890
53375B877333K8862K4252J8959J3430Q109K997k174p688j3759k0312k6837l2795
53363B870377l8005m2433m5877m8414n0691n3130n5120n5901n5912n6218n6716
53352B311960n6173n4259n2194n0963n0063m8724m7206m6082m5122m3852m2438
53341A774884m1114l9507l7413l5556l4497l3433l1331k8704k6875k5832k4219
53330A416403k1485j8595j6466j5026j4113j3989j4456j4558j3941j3467j3737
$$ y = [1305325, 1338044, 1372250, 1407257, 1442813, 1479172, 1516840, 1556392, 1598385, 1643076, 1690111, 1738680, 1788149, 1838495, 1890157, 1943562, 1998719, 2055139, 2112198, 2169734, 2228182, 2287825, 2347989, 2407319, 2464858, 2520496, 2574381, 2626326, 2675950, 2722970, 2767047, 2807665, 2844443, 2877333, 2906195, 2930447, 2949406, 2962836, 2970945, 2973942, 2971768, 2964080, 2950321, 2930009, 2903172, 2870377, 2832372, 2789939, 2744062, 2695648, 2644957, 2591827, 2536707, 2480806, 2424894, 2368676, 2311960, 2255787, 2201528, 2149334, 2098371, 2048308, 1999584, 1952378, 1906296, 1861174, 1817322, 1774884, 1733770, 1694263, 1656850, 1621294, 1586797, 1553364, 1522033, 1493329, 1466454, 1440622, 1416403, 1394918, 1376323, 1359857, 1344831, 1330718, 1316729, 1302273, 1287715, 1273774, 1260307, 1246570]
53319A246570j3893j2865j1064r812r394q825p422n618m073k822j596m01O48J711
53305A161144L052M696O479Q273R968J1367J2444J3597J5368J7822K0345K2253
53293A306808K3497K4591K5940K7361K8339K8577K8205K7548K6800K5909K4673
53282A598248K2956K0803J8375J5766J2965R985O961M006J062k089n522q936j1782
53269A682798j3865j5706j8054k0891k3288k4465k4713k4935k5621k6719k8099
53258A436442k9505l0239k9828k9016k9178l0537l1770l1798l1025l0322k9676
53247A103548k8674k7655k7323k7500k7206k5944k4215k2812k2087k1878k1657
53236H26597k0840j9372j7834j6607j5381j3838j2383j1477j0802r876r084r071
$$ y = [1246570, 1232677, 1219812, 1208748, 1198936, 1189542, 1180717, 1173295, 1167677, 1163604, 1160782, 1159186, 1158785, 1159433, 1161144, 1164196, 1168892, 1175371, 1183644, 1193612, 1204979, 1217423, 1231020, 1246388, 1264210, 1284555, 1306808, 1330305, 1354896, 1380836, 1408197, 1436536, 1465113, 1493318, 1520866, 1547666, 1573575, 1598248, 1621204, 1642007, 1660382, 1676148, 1689113, 1699098, 1706059, 1710065, 1711127, 1709038, 1703516, 1694580, 1682798, 1668933, 1653227, 1635173, 1614282, 1590994, 1566529, 1541816, 1516881, 1491260, 1464541, 1436442, 1406937, 1376698, 1346870, 1317854, 1288676, 1258139, 1226369, 1194571, 1163546, 1133224, 1103548, 1074874, 1047219, 1019896, 992396, 965190, 939246, 915031, 892219, 870132, 848254, 826597, 805757, 786385, 768551, 751944, 736563, 722725, 710342, 698865, 688063, 678187, 669103, 660032]
53224F60032r442r227q512q405r292j0324j0863j1338j2162j2889j2972j2605
53212E32001j2175j1656j1002j0514j0247r719q746p882p527p274o724o316o588
53199D15631p183p346o955o334n623n000n101o211p434p564o657n771n341m781
53185C28330l757k838k600k837l001k882k536j975j304q06o57q09j181j774k456
53170B96917k959l115k838k026q26R1L7q17j512j412q08l57l31n72q53r86r31
53153B76702q96j136j537j703j500j175q83n19j19N7M3J71M21K39n30j101p32
53136B65802J84P06P24R25J430J445N51m20l90N70J437J566J218R23Q83J048J275
53119B79877J320J092R90J531K448K719J872P52M90J023J320Q15r2q38j299j421
$$ y = [660032, 650590, 641363, 632851, 624446, 615154, 604830, 593967, 582629, 570467, 557578, 544606, 532001, 519826, 508170, 497168, 486654, 476407, 466688, 457942, 450060, 442533, 435259, 428535, 422219, 415631, 408448, 401102, 394147, 387813, 382190, 377190, 372089, 365878, 358444, 350880, 344223, 338452, 333111, 328330, 324573, 321735, 319135, 316298, 313297, 310415, 307879, 305904, 304600, 303794, 303137, 302328, 301147, 299373, 296917, 293958, 290843, 288005, 285979, 285153, 285244, 285281, 284464, 282952, 281540, 280732, 280375, 280044, 279472, 278619, 277633, 276702, 275806, 274670, 273133, 271430, 269930, 268755, 267872, 267353, 267234, 267291, 267334, 267505, 267926, 268165, 267635, 266534, 265802, 265986, 266692, 267416, 268341, 269771, 271216, 271767, 271347, 270957, 271527, 272964, 274530, 275748, 276671, 277554, 278602, 279877, 281197, 282289, 283279, 284810, 287258, 289977, 291849, 292601, 293091, 294114, 295434, 296249, 296157, 295319, 294020, 292599]
53103B92599j041k92L21N54N46J72r94k705l771l459k503k058k141j928j181m36
53087B71683L5M11N54M2r09j459j294j009j042j076p98m95m19k84M9R2m81j095
53069B62505j100q08r22j261j013j32M50K01k52j15M14N17m2o95r52j023j330
53052B54442j679j345o6J401K039J723J220J110J159Q98L00l73r49j233r35j70
53036B57542L54J46l56l89P9M65N84P39R25P16J03l23k79k37n88r48p98k94O3
53017B57504K79O72J130J156O62R8j93l14l77k07K40N88M99J61KM3o8l93n10j33
52997B60839L94N53L91M90J139J890K109J727J213R99J144J459J713J744J601
52982B79405J538J676J734J373P48L21J63j32o96j040o93J02P60J065J174J069
$$ y = [292599, 291558, 291266, 291587, 292141, 292687, 292859, 291865, 289160, 285389, 281930, 279427, 277369, 275228, 273300, 272119, 271683, 271718, 272129, 272683, 272725, 271816, 270357, 269063, 268054, 267012, 265936, 265138, 264643, 264224, 263940, 263989, 264081, 263600, 262505, 261405, 260597, 259675, 258414, 257401, 257269, 257719, 257920, 257668, 257553, 257967, 258484, 258442, 257747, 256795, 255772, 254442, 252763, 251418, 251352, 252753, 254792, 256515, 257735, 258845, 260004, 260902, 261202, 260829, 259880, 258647, 257712, 257542, 257896, 258042, 257686, 257297, 257376, 257841, 258425, 259164, 260089, 260805, 260908, 260585, 260306, 260069, 259481, 258533, 257735, 257441, 257504, 257783, 258455, 259585, 260741, 261403, 261501, 261308, 260994, 260617, 260410, 260650, 261238, 261737, 261898, 261900, 261943, 261875, 261482, 260972, 260839, 261233, 261786, 262177, 262667, 263806, 265696, 267805, 269532, 270745, 271744, 272888, 274347, 276060, 277804, 279405, 280943, 282619, 284353, 285726, 286474, 286795, 286958, 286826, 286130, 285090, 284397, 284499, 285259, 286324, 287498, 288567]
52966B88567N55k77r64j139p98j37N94J084J141R32P46N19o1r64j701j956j945
52949B84196j972j949j662j245j010j035j158j259j236r05k56L14L87Q2j58k62
52933B70872n86j181j490j005J1P18N71j68p04m48M17J129J210R78R62J045O94
52916B73025l7m06r2L20L09K14M37N04k31j304j591r33l27l42m58k08m3m18q22
52897B67597n56J43N10M47M82P95J111J363J651J634Q70k24o48k52M3k71m88O3
52879B74270P87P13nl56M9O59J014J232J435J486J468J781K458K958K933K708
52863B95590K606K332J450K03p21j101j391j974k614k825k564k306k465k876k992
52848B78352k555j940j684j802j876j726j626j763j909j789j513j327j222j124
$$ y = [288567, 289122, 288845, 287881, 286742, 285944, 285807, 286401, 287485, 288626, 289558, 290304, 290823, 290762, 289798, 288097, 286141, 284196, 282224, 280275, 278613, 277368, 276358, 275323, 274165, 272906, 271670, 270765, 270509, 270823, 271210, 271292, 271134, 270872, 270286, 269105, 267615, 266610, 266621, 267339, 267910, 267742, 267038, 266590, 267007, 268136, 269346, 270324, 271286, 272331, 273025, 272988, 272582, 272490, 272810, 273119, 273333, 273770, 274274, 274043, 272739, 271148, 270215, 269888, 269546, 269088, 268880, 268837, 268419, 267597, 267041, 267184, 267694, 268141, 268623, 269418, 270529, 271892, 273543, 275177, 276047, 275823, 275175, 274923, 274966, 274695, 274207, 274270, 275057, 275770, 275765, 275409, 275458, 276117, 277131, 278363, 279798, 281284, 282752, 284533, 286991, 289949, 292882, 295590, 298196, 300528, 301978, 302181, 301460, 300359, 298968, 296994, 294380, 291555, 288991, 286685, 284220, 281344, 278352, 275797, 273857, 272173, 270371, 268495, 266769, 265143, 263380, 261471, 259682, 258169, 256842, 255620, 254496]
52834B54496j192j525j724j222m9J098J633J574J228P71K92o6k10k55l83o51q88
52817B52927p71o3R85J626J318L80l09k98J23N84J038J397J268M60n92j289j513
52800B57271j457j168o33j96k91q57j384j589j581j442j054n16l29q30j632j864
52784B40448j017N42J864K281J945J519J398J403J219P86J26p75j609j722q94
52769B47514R7L28j25m44l24k41m69o70n44k38J65Q12J499J604J058O35Q12J001
52751B52470O16J95O06J574K090J959J923K204K115J314N44N51J051J255R45M70
52735B71882N9k52k58K14Q74J156Q95M46J84J39K00L22L95J65m81j227j526j148
52717B72039m62p2k58q20j407j789j774j176o5J032J475J056J67n71p52m41o7
$$ y = [254496, 253304, 251779, 250055, 248833, 248784, 249882, 251515, 253089, 254317, 255088, 255380, 255314, 255104, 254849, 254466, 253815, 252927, 252156, 252093, 253078, 254704, 256022, 256402, 256093, 255795, 255918, 256502, 257540, 258937, 260205, 260665, 260073, 258784, 257271, 255814, 254646, 254013, 253817, 253526, 252669, 251285, 249696, 248115, 246673, 245619, 245103, 244774, 243944, 242312, 240448, 239431, 239973, 241837, 244118, 246063, 247582, 248980, 250383, 251602, 252388, 252514, 251739, 250130, 248408, 247514, 247611, 247939, 247814, 247370, 247046, 246805, 246336, 245666, 245122, 244884, 245049, 245861, 247360, 248964, 250022, 250657, 251469, 252470, 253086, 253281, 253887, 255461, 257551, 259510, 261433, 263637, 265752, 267066, 267610, 268161, 269212, 270467, 271412, 271882, 271941, 271689, 271431, 271645, 272519, 273675, 274570, 275016, 275200, 275339, 275539, 275861, 276256, 276421, 275940, 274713, 273187, 272039, 271577, 271505, 271247, 270427, 269020, 267231, 265457, 264281, 264216, 265248, 266723, 267779, 267946, 267375, 266623, 266182, 266115]
52700B66115M0O7M34J022J077K11q64j071k48P88J323J322J020N30ll55n25o71
52682B70212p14m40n9p1m41m61K43J016R67R6p47q16p3R17J461J334J042J264
52664B74730J881K038J316L28j28j7K15M34P24R80J058J184J632K213K509K353
52648B93450J745O51o05j235r13m86r97k207k869k351j232l15J44J91n8k56q1
52631B82576K26K51K62R42K127K711K126J063L56k4l46k78M89J337J294L40o01
52614B94851q50o10m50o22r47j075p96k80J07K73M10N10K98r7m7N96R63L23o65
52595B91892o58N20J594J452M16m00m12P6N05O46O85R20J392J813J922J817J735
52578C05915J655J337P21O0l68m81m05m02p17j244j480j030j13O49Q32L80n57
$$ y = [266115, 266155, 266222, 266656, 267678, 268755, 268966, 268102, 267031, 266783, 267571, 268894, 270216, 271236, 271766, 271763, 271408, 270883, 270212, 269498, 269058, 268999, 268928, 268487, 268026, 268269, 269285, 270252, 270348, 269601, 268785, 268712, 269629, 271090, 272424, 273466, 274730, 276611, 278649, 279965, 280293, 280165, 280148, 280363, 280797, 281521, 282501, 283559, 284743, 286375, 288588, 291097, 293450, 295195, 295846, 295241, 294006, 293093, 292607, 291610, 289403, 286534, 284183, 282951, 282636, 282780, 282971, 282913, 282657, 282576, 282802, 283053, 283315, 284257, 286384, 289095, 291221, 292284, 292640, 292616, 292270, 291992, 292481, 293818, 295112, 295452, 294851, 294001, 293391, 292941, 292319, 291372, 290297, 289501, 289221, 289328, 289601, 290011, 290521, 290819, 290722, 290675, 291271, 292234, 292557, 291892, 291234, 291754, 293348, 294800, 295216, 294816, 294404, 294480, 294985, 295631, 296316, 297236, 298628, 300441, 302363, 304180, 305915, 307570, 308907, 309628, 309688, 309320, 308839, 308434, 308032, 307315, 306071, 304591, 303561, 303448, 304097, 304929, 305309, 304752]
52561C04752j534j767p66Q77J790J145n50k043k461j764n70K90L01l42r46j059
52545B95353q40o83p07p83q05p50o12m61m27m69k94K70R55J283J089O41K78J28
52527B93166J96N06J074J763K270K305J802R99L14Q6M02J107J920K535K715K419
52511C15579J954J820K297L101L634L597L235K859K350J398N4j274k345l227l917
52496C31115m165l867l262k620k001j535j567k189k840k772j892q37l11m55q05
52481B99997p28l6P40R07N10L09O53R59O24Q0K57J269K259K576K511K750L484
52464C19121M229M314L588K705K507K926K924J869M67k64m85j137k316l127l196
52449C34125l209l699m207m134l610l000k245j336q00j024j515j523j109q48p70
$$ y = [304752, 303218, 301451, 300685, 301562, 303352, 304497, 303947, 301904, 299443, 297679, 297109, 297399, 297700, 297358, 296412, 295353, 294513, 293830, 293123, 292340, 291535, 290785, 290173, 289712, 289285, 288816, 288522, 288792, 289747, 291030, 292119, 292760, 293038, 293166, 293362, 293868, 294942, 296705, 298975, 301280, 303082, 304081, 304395, 304481, 304883, 305990, 307910, 310445, 313160, 315579, 317533, 319353, 321650, 324751, 328385, 331982, 335217, 338076, 340426, 341824, 341878, 340604, 338259, 335032, 331115, 326950, 323083, 319821, 317201, 315200, 313665, 312098, 309909, 307069, 304297, 302405, 301568, 301257, 300802, 299997, 299269, 299233, 299973, 300880, 301390, 301699, 302352, 303311, 303935, 304015, 304272, 305541, 307800, 310376, 312887, 315637, 319121, 323350, 327664, 331252, 333957, 336464, 339390, 342314, 344183, 344650, 344386, 343901, 342764, 340448, 337321, 334125, 330916, 327217, 323010, 318876, 315266, 312266, 310021, 308685, 307885, 306861, 305346, 303823, 302714, 301866, 301096]
52434C01096l31N16R75L76q92j712j428n17p0o19j503j591n82O60J098O02r2j20
52416B95866Q43K361L490L560K889K409K576L005L357L963N307P318R436J1013
52402C57393J1440J0409Q449O626N320L750J207j788m193n767o889p487p070n791
52388C65609m588m097m025l761l144k451j967j697j326n32N20J271J534J759K164
52373C45269K223J669J451K731N082O712O497N004L478K626K499K654K265Q56
52359C91016p91j281l86N53L33p61j698j979j685r27L2O58P63Q35J303J876K127
52342C89988K213K462K649K374J908J959K759L937N128O184O983P529Q132R038
52328D53243J0026J0875J1885J3411J5000J5755J5529J5086J5065J5384J5746
$$ y = [301096, 300765, 301281, 302256, 302632, 301740, 300028, 298600, 298083, 298013, 297394, 295891, 294300, 293718, 294378, 295476, 296078, 295986, 295866, 296709, 299070, 302560, 306120, 309009, 311418, 313994, 316999, 320356, 324319, 329626, 336944, 346380, 357393, 368833, 379242, 387691, 394317, 399637, 403387, 404594, 402806, 398613, 392846, 385957, 378470, 371400, 365609, 361021, 356924, 352899, 349138, 345994, 343543, 341576, 339879, 338553, 338021, 338541, 339812, 341346, 343105, 345269, 347492, 349161, 350612, 353343, 358425, 365137, 371634, 376638, 380116, 382742, 385241, 387895, 390160, 391016, 390225, 388944, 388558, 389111, 389444, 388683, 386985, 385006, 383321, 382394, 382426, 383084, 383847, 384682, 385985, 387861, 389988, 392201, 394663, 397312, 399686, 401594, 403553, 406312, 410249, 415377, 421561, 428544, 436073, 444205, 453243, 463269, 474144, 486029, 499440, 514440, 530195, 545724, 560810, 575875, 591259, 607005]
52317F07005J6045J6090J5528J4418J3435J3223J3807J4877J6206J7571J8608
52306G76813J9109J9270J9351J9354J9228J9143J9214J9149J8522J7220J5398
52295I81771J3155J0587Q031N795L778J650n44k422l902n298o650p461p484p334
52281I83672p738q434q448p419n973m654l185j217Q24K242L085L959N006N796
52267I57516O238O893Q102R403J0153J0317J0305J0436J0870J1785J3155J4541
52255A079714J5487J6036J6530J6997J7072J6460J5175J3373J1205Q837O424M022
52243A237332J709l86k246m039n810p246q109q738r665j0817j1545j1559j1366
52230A147515j1499j1696j1300j0263r275q872q826q641q317q150p951p041n301
$$ y = [607005, 623050, 639140, 654668, 669086, 682521, 695744, 709551, 724428, 740634, 758205, 776813, 795922, 815192, 834543, 853897, 873125, 892268, 911482, 930631, 949153, 966373, 981771, 994926, 1005513, 1013544, 1019339, 1023117, 1024767, 1024223, 1021801, 1017899, 1012601, 1005951, 998490, 991006, 983672, 975934, 967500, 959052, 951633, 945660, 941006, 937821, 936604, 937428, 939670, 942755, 946714, 951720, 957516, 963754, 970647, 978749, 988152, 998305, 1008622, 1018927, 1029363, 1040233, 1052018, 1065173, 1079714, 1095201, 1111237, 1127767, 1144764, 1161836, 1178296, 1193471, 1206844, 1218049, 1226886, 1233310, 1237332, 1239041, 1238655, 1236409, 1232370, 1226560, 1219314, 1211205, 1202467, 1192802, 1181985, 1170440, 1158881, 1147515, 1136016, 1124320, 1113020, 1102757, 1093482, 1084610, 1075784, 1067143, 1058826, 1050676, 1042725, 1035684, 1030383]
52217A030383l666l045l024k387q64M53P39O58J329K667L638L860M010M585N142
52202A044478N079M547M153M140M339M596M872N116N318N590N971O299O519O896
52188A117913P628Q289Q022O368L789J270n09j667k844m433o171p527q406r116
52174A112606r701r716q865p550o410n603m930m363l989l462k246m37J177K118
52160A048629K822L801M701M727L729K266P66p13j843j993j151k31L9N3N69J462
52144A067633J947J822J668J850K085K126K128K079J594O61n5p4L37R65K332M830
52128A093928P728R972J1683J3857J6679J9191K0760K1866K3104K4294K5109K5809
52116A313980K6684K7280K6915K5658K4179K2768K1134J9139J7165J5640J4505
$$ y = [1030383, 1026717, 1023672, 1020648, 1018261, 1017397, 1017850, 1018589, 1019247, 1020576, 1023243, 1026881, 1030741, 1034751, 1039336, 1044478, 1049557, 1054104, 1058257, 1062397, 1066736, 1071332, 1076204, 1081320, 1086638, 1092228, 1098199, 1104498, 1111017, 1117913, 1125541, 1133830, 1141852, 1148220, 1152009, 1153279, 1152770, 1151103, 1148259, 1143826, 1137655, 1130128, 1121722, 1112606, 1102905, 1093189, 1084324, 1076774, 1070364, 1064761, 1059831, 1055468, 1051479, 1048017, 1045771, 1045334, 1046511, 1048629, 1051451, 1055252, 1059953, 1064680, 1068409, 1070675, 1071441, 1070728, 1068885, 1066892, 1065741, 1065510, 1065549, 1065602, 1066171, 1067633, 1069580, 1071402, 1073070, 1074920, 1077005, 1079131, 1081259, 1083338, 1084932, 1085593, 1085538, 1085464, 1085801, 1086766, 1089098, 1093928, 1101656, 1111628, 1123311, 1137168, 1153847, 1173038, 1193798, 1215664, 1238768, 1263062, 1288171, 1313980, 1340664, 1367944, 1394859, 1420517, 1444696, 1467464, 1488598, 1507737, 1524902, 1540542, 1555047]
52105A555047J3375J2032J0695R718R089Q316P086N878N419N482M814K628l57
52092A649222k933n019p531j0893j4348j6929j8411j9209j9699j9961j9841j9092
$$ y = [1555047, 1568422, 1580454, 1591149, 1600867, 1609956, 1618272, 1625358, 1631236, 1636655, 1642137, 1646951, 1649579, 1649222, 1646289, 1641270, 1633739, 1622846, 1608498, 1591569, 1573158, 1553949, 1534250, 1514289, 1494448, 1475356]
$$ [...]
##END NTUPLES=NMR SPECTRUM
##END=
