##TITLE=AC1509_ROEFFECT0001_8201573_8txOuqAMOm
##JCAMPDX= 6.0         $$ Bruker NMR JCAMP-DX V2.0
##DATA TYPE= NMR SPECTRUM
##DATA CLASS= NTUPLES
##ORIGIN= BRUKER
##OWNER= Administrator
$$ 1.72 TOPSPIN		Version 2.1
$$ 2013-09-26 16:49:52.134 -0700  Administrator@X
$$ Compression mode = diff/dup
##.OBSERVE FREQUENCY= 400.02188249412
##.OBSERVE NUCLEUS= ^1H
##.ACQUISITION MODE= SIMULTANEOUS (DQD)
##.ACQUISITION SCHEME= undefined
##.AVERAGES= 64
##.DIGITISER RES= 22
##SPECTROMETER/DATA SYSTEM= spect
##.PULSE SEQUENCE= noesygpps1d.comp
##.SOLVENT NAME= COFFEE_meoh
##.SHIFT REFERENCE= INTERNAL, COFFEE_meoh, 1, 14.96079
##AUDIT TRAIL= $$ (NUMBER, WHEN, WHO, WHERE, PROCESS, VERSION, WHAT)
$$ ##TITLE= Audit trail, TOPSPIN		Version 2.1
$$ ##JCAMPDX= 5.01
$$ ##ORIGIN= Bruker BioSpin GmbH
$$ ##OWNER= Administrator
$$ $$ E:\/data/COFFEE/nmr/AC1509_ROEFFECT0001_8201573_8txOuqAMOm/12/pdata/1/auditp.txt
$$ ##AUDIT TRAIL=  $$ (NUMBER, WHEN, WHO, WHERE, PROCESS, VERSION, WHAT)
(   1,<2013-09-26 16:49:46.549 -0700>,<Administrator>,<X>,<go>,<TOPSPIN 2.1>,
      <created by zg
	started at 2013-09-26 16:38:19.540 -0700,
	POWCHK enabled, PULCHK disabled,
       configuration hash MD5:
       C8 4E 4E 5D D3 5C D8 9E 9F 52 82 E0 59 8A DE 15
       data hash MD5: 64K
       16 8F 22 C7 6C 81 A9 EC 36 1E FC 20 64 98 CD FF>)
(   2,<2013-09-26 16:49:49.962 -0700>,<Administrator>,<X>,<proc1d>,<TOPSPIN 2.1>,
      <Start of raw data processing
       efp LB = 0.3 FT_mod = 6 PKNL = 1 PHC0 = 0 PHC1 = 0 SI = 128K 
       data hash MD5: 128K
       50 E9 BA 9B 41 76 A7 6B FB 9B 1B 9F 43 75 6A 8D>)
(   3,<2013-09-26 16:49:51.083 -0700>,<Administrator>,<X>,<proc1d>,<TOPSPIN 2.1>,
      <pk PHC0 = -50.82825 PHC1 = 0 
       data hash MD5: 128K
       B3 F4 17 43 4D 61 43 58 F2 C6 9D 67 8B EB 47 12>)
(   4,<2013-09-26 16:49:51.546 -0700>,<Administrator>,<X>,<proc1d>,<TOPSPIN 2.1>,
      <abs ABSG = 1 
       data hash MD5: 128K
       0F F1 FF CD DF 4A C8 74 80 F3 36 77 71 A0 F4 50>)
(   5,<2013-09-26 16:49:51.653 -0700>,<Administrator>,<X>,<proc1d>,<TOPSPIN 2.1>,
      <abs ABSG = 2 
       data hash MD5: 128K
       14 EE 21 71 12 5B 1E 68 2F EB 80 FB E2 F9 CC 6F>)
(   6,<2013-09-26 16:49:51.742 -0700>,<Administrator>,<X>,<proc1d>,<TOPSPIN 2.1>,
      <abs ABSG = 3 
       data hash MD5: 128K
       28 06 29 4C 56 90 D3 5D 3C 93 71 5A 43 B1 5E A2>)
(   7,<2013-09-26 16:49:51.849 -0700>,<Administrator>,<X>,<proc1d>,<TOPSPIN 2.1>,
      <abs ABSG = 4 
       data hash MD5: 128K
       E4 C7 2B 85 C4 1C 2B 6D 16 EE 6B 84 64 F7 06 52>)
(   8,<2013-09-26 16:49:51.956 -0700>,<Administrator>,<X>,<proc1d>,<TOPSPIN 2.1>,
      <abs ABSG = 5 
       data hash MD5: 128K
       35 5D B0 C3 7A 02 26 24 8B 2F 15 62 FB 1F 2F 35>)
$$ ##END=
$$ 
$$ $$ hash MD5
$$ $$ 8B C2 F0 31 D3 57 1A 61 2D C9 D0 BD 0E E3 0D 19
##$RELAX= 
##$RELAX= 
##$RELAX= 
##$RELAX= 
##$RELAX= 
##$RELAX= 
##$RELAX= 
##$RELAX= 
$$ Bruker specific parameters
$$ --------------------------
##$DU= <E:\>
##$EXPNO= 12
$$ [...]
##$TP07= 0
##$TPNAME0= <>
##$TPNAME1= <>
##$TPNAME2= <>
##$TPNAME3= <>
##$TPNAME4= <>
##$TPNAME5= <>
##$TPNAME6= <>
##$TPNAME7= <>
##$TPOAL= (0..7)
0.5 0.5 0.5 0.5 0.5 0.5 0.5 0.5
##$TPOFFS= (0..7)
0 0 0 0 0 0 0 0
##$TUNHIN= 0
##$TUNHOUT= 0
##$TUNXOUT= 0
##$USERA1= <user>
##$USERA2= <user>
##$USERA3= <user>
##$USERA4= <user>
##$USERA5= <user>
##$V9= 5
##$VALIST= <valist>
##$VCLIST= <CCCCCCCCCCCCCCC>
##$VD= 0
##$VDLIST= <DDDDDDDDDDDDDDD>
##$VPLIST= <PPPPPPPPPPPPPPP>
##$VTLIST= <TTTTTTTTTTTTTTT>
##$WBST= 1024
##$WBSW= 4
##$XGAIN= (0..3)
0 0 0 0
##$XL= 0
##$YL= 0
##$YMAX_a= 6773972
##$YMIN_a= -15779408
##$ZGOPTNS= <>
##$ZL1= 120
##$ZL2= 120
##$ZL3= 120
##$ZL4= 120
##$ABSF1= 14.96079
##$ABSF2= -5.597392
##$ABSG= 5
##$ABSL= 3
##$ALPHA= 0
##$AQORDER= 0
##$ASSFAC= 0
##$ASSFACI= 0
##$ASSFACX= 0
##$ASSWID= 0
##$AUNMP= <proc_prof1d_extract.lims>
##$AXLEFT= 0
##$AXNAME= <>
##$AXNUC= <1H>
##$AXRIGHT= 0
##$AXTYPE= 0
##$AXUNIT= <>
##$AZFE= 0.1
##$AZFW= 0.1
##$BCFW= 0
##$BC_mod= 0
##$BYTORDP= 0
##$COROFFS= 0
##$CY= 15
##$DATMOD= 1
##$DC= 0
##$DFILT= <>
##$DTYPP= 0
##$F1P= 0
##$F2P= 0
##$FCOR= 0.5
##$FTSIZE= 131072
##$FT_mod= 6
##$GAMMA= 0
##$GB= 0
##$INTBC= 1
##$INTSCL= 1
##$ISEN= 128
##$LB= 0.3
##$LEV0= 0
##$LPBIN= 0
##$MAXI= 10000
##$MC2= 0
##$MEAN= 0
##$ME_mod= 0
##$MI= 0
##$NCOEF= 0
##$NC_proc= -2
##$NLEV= 6
##$NOISF1= 0
##$NOISF2= 0
##$NSP= 0
##$NTH_PI= 0
##$NZP= 0
##$OFFSET= 14.96079
##$PC= 1
##$PHC0= -50.82825
##$PHC1= 0
##$PH_mod= 1
##$PKNL= yes
##$PPARMOD= 0
##$PPDIAG= 0
##$PPIPTYP= 0
##$PPMPNUM= 2147483647
##$PPRESOL= 1
##$PSCAL= 4
##$PSIGN= 0
##$PYNMP= <proc.py>
##$REVERSE= no
##$SF= 400.020009721533
##$SI= 131072
##$SIGF1= 0
##$SIGF2= 0
##$SINO= 400
##$SIOLD= 131072
##$SPECTYP= <>
##$SREGLST= <1H.CDCl3>
##$SSB= 0
##$STSI= 131072
##$STSR= 0
##$SW_p= 8223.68421052631
##$SYMM= 0
##$S_DEV= 0
##$TDeff= 65536
##$TDoff= 0
##$TI= <>
##$TILT= no
##$TM1= 0
##$TM2= 0
##$TOPLEV= 0
##$USERP1= <user>
##$USERP2= <user>
##$USERP3= <user>
##$USERP4= <user>
##$USERP5= <user>
##$WDW= 1
##$XDIM= 131072
##$YMAX_p= 406275168
##$YMIN_p= -88707
##$CURPLOT= <Network HP LaserJet P1505>
##$CURPRIN= <$Network HP LaserJet P1505>
##$DFORMAT= <normdp>
##$LAYOUT= <+/1D_H.xwp>
##$LFORMAT= <normlp>
##$PFORMAT= <normpl>
##$SURQMSG= 1
$$ End of Bruker specific parameters
$$ ---------------------------------
##NTUPLES= NMR SPECTRUM
##VAR_NAME=  FREQUENCY,     SPECTRUM/REAL,   SPECTRUM/IMAG
##SYMBOL=    X,             R,               I
##VAR_TYPE=  INDEPENDENT,   DEPENDENT,       DEPENDENT
##VAR_FORM=  AFFN,          ASDF,            ASDF
##VAR_DIM=   131072,        131072,          131072
##UNITS=     HZ,            ARBITRARY UNITS, ARBITRARY UNITS
##FACTOR=    0.0627417313425164, 1,          1
##FIRST=     8223.62146879497, 4543,         -78326
##LAST=      0,             8128,            -76743
##MIN=       0,             -88707,          0
##MAX=       8223.62146879497, 406275168,    0
$$ Real data points
##PAGE= N=1
##DATA TABLE= (X++(R..R)), XYDATA
$$ [...]
$$ plain form
63760 429780 437765 444259 448745 450394 448011 440950 430064 417526 405413 394414 383991 373648 363684
63747 363684 354770 347289 341415 337400 335308 334618 334493 334412 334262 334029 333843 334295 336161 339623 343987 348281
63731 348281 351923 354857 357455 360453 364591 369979 375926 381626 386986 392625 399132 406404 413605 419664
63717 419664 423945 426665 428708 430851 433035 434398 434053 431914 428760 425488 422358 419060 415407 411691
63703 411691 408242 404935 401413 397579 393592 389531 385578 382504 381380 382472 384732 386714 387873 388699
63689 388699 389811 391286 392855 394386 395949 397485 398615 398902 398468 398223 399207 401540 404266 406433 408154
63674 408154 410387 413795 418095 422431 426141 429190 432124 435640 439954 444500 448373 451053 452621 453346
63660 453346 453346 452620 451122 448744 445463 441591 437675 434007 430388 426479 422367 418735 416574 416637 418939 422768
$$ packed form
63760D29780P985O494M486J649k383p061j0886j2538j2113j0999j0423j0343r964
63747C63684q914p481n874m015k092o90j25q1j50k33j86M52J866L462M364M294
63731C48281L642K934K598K998M138N388N947N700N360N639O507P272P201O059
63717D19664M281K720K043K143K184J363l45k139l154l272l130l298l653l716
63703D11691l449l307l522l834l987m061l953l074j124J092K260J982J159Q26
63689C88699J112J475J569J531J563J536J130K87m34k45R84K333K726K167J721
63674D08154K233L408M300M336L710L049K934L516M314M546L873K680J568P25
63660D53346%p26j498k378l281l872l916l668l619l909m112l632k161O3K302L829
$$ plain form
63644 422768 427344 432482 438504 445685 454056 463578 474012 484690 495034 505365 516551 528603 540304
63631 540304 550621 559833 568605 576516 582466 586292 589097 591837 594383 596211 597481 599075 601934 606577
63617 606577 613092 621445 631903 645035 661068 679463 699499 721105 744525 769383 794759 820244
63605 820244 846130 872362 897977 921865 943374 961741 975612 983902 986904 986057 982799 977966 971939
63592 971939 964799 956453 946997 936861 926231 914498 900638 884058 864818 843277 819959 795683
63580 795683 771444 748056 726072 705926 687900 672064 658447 647195 638411 632028 628009 626459
63568 626459 627286 629959 633808 638419 643555 648968 654609 660798 667921 676164 685740 697116 710657 726369
63554 726369 744288 764912 788891 816622 848492 885251 927748 976621 1032457 1095466 1163888
$$ packed form
63644D22768M576N138O022P181Q371R522J0434J0678J0344J0331J1186J2052J1701
63631E40304J0317R212Q772P911N950L826K805K740K546J828J270J594K859M643
63617F06577O515Q353J0458J3132J6033J8395K0036K1606K3420K4858K5376K5485
63605H20244K5886K6232K5615K3888K1509J8367J3871Q290L002q47l258m833o027
63592I71939p140q346r456j0136j0630j1733j3860j6580j9240k1541k3318k4276
63580G95683k4239k3388k1984k0146j8026j5836j3617j1252q784o383m019j550
63568F26459Q27K673L849M611N136N413N641O189P123Q243R576J1376J3541J5712
63554G26369J7919K0624K3979K7731L1870L6759M2497M8873N5836O3009O8422
$$ plain form
63543 1163888 1232775 1295238 1345383 1380124 1398868 1402564 1393251 1373828 1347756 1318778 1290386 1264825
63531 1264825 1242621 1223420 1206948 1192646 1178899 1163724 1146164 1126184 1103352 1076752 1046370
63520 1046370 1013533 979759 946085 913713 884044 857423 832870 809791 789085 771691 756824
63509 756824 742699 728507 714668 701465 688492 675423 662440 649799 637591 625934 614803
63498 614803 603671 591936 579810 568227 557784 548314 539637 532153 526321 521920 518281 515173 513149
63485 513149 512908 514434 516942 519728 522956 527410 533520 540933 549068 557701 566837 576368 586163 596139
63471 596139 605915 614653 621781 627727 633503 639554 645394 650435 654832 659364 664664 670646 676571 681660
63457 681660 685729 689218 692527 695406 697024 696569 693802 689353 684644 681301 680279 681556 684744 689883
$$ packed form
63543A163888O8887O2463N0145L4741J8744L696r313j9423k6072k8978k8392k5561
63531A264825k2204j9201j6472j4302j3747j5175j7560j9980k2832k6600l0382
63520A046370l2837l3774l3674l2372k9669k6621k4553k3079k0706j7394j4867
63509G56824j4125j4192j3839j3203j2973j3069j2983j2641j2208j1657j1131
63498F14803j1132j1735j2126j1583j0443r470q677p484n832m401l639l108k024
63485E13149k41J526K508K786L228M454O110P413Q135Q633R136R531R795R976
63471E96139R776Q738P128N946N776O051N840N041M397M532N300N982N925N089
63457F81660M069L489L309K879J618m55k767m449m709l343j022J277L188N139
$$ plain form
63443 689883 697516 708255 722490 740494 762651 789685 822786 863335 912419 970486 1036914 1108959
63431 1108959 1180900 1245203 1295614 1329279 1345912 1345908 1330315 1302254 1266860 1229204 1192839 1160480
63419 1160480 1134980 1118625 1111825 1113340 1121780 1136229 1155377 1176920 1198315 1217770 1234034 1245639
63407 1245639 1251226 1250741 1245665 1237726 1227804 1216298 1203829 1190917 1177328 1162505 1146423 1129225
63395 1129225 1110108 1087549 1060826 1030699 998374 964591 930008 895680 862579 831155 801804
63384 801804 775180 751555 730406 711259 694516 680900 670533 663095 658431 656319 656032 656945 659336
63371 659336 663962 671024 680198 691397 704746 720074 737242 756892 780007 806729 836392 868712
63359 868712 904157 943050 985060 1029777 1076912 1125608 1174155 1220812 1264381 1303766 1337609
$$ packed form
63443F89883P633J0739J4235J8004K2157K7034L3101M0549M9084N8067O6428P2045
63431A108959P1941O4303N0411L3665J6633mj5593k8061l5394l7656l6365l2359
63419A160480k5500j6355o800J515Q440J4449J9148K1543K1395J9455J6264J1605
63407A245639N587m85n076p939r922j1506j2469j2912j3589j4823j6082j7198
63395A129225j9117k2559k6723l0127l2325l3783l4583l4328l3101l1424k9351
63384H01804k6624k3625k1149j9147j6743j3616j0367p438m664k112k87R13K391
63371F59336M626P062R174J1199J3349J5328J7168J9650K3115K6722K9663L2320
63359H68712L5445L8893M2010M4717M7135M8696M8547M6657M3569L9385L3843
$$ plain form
63348 1337609 1364808 1385034 1398344 1404803 1404969 1400462 1393478 1385685 1377751 1369729 1361541 1352988 1343429
63335 1343429 1331617 1316082 1295817 1270598 1240649 1206527 1169611 1132154 1096161 1062392 1031096
63324 1031096 1003491 981626 966870 959466 959512 966912 979441 991665 996975 990863 972088 941564 901250
63311 901250 854111 804061 755063 710060 670559 636814 608239 583917 563111 545487 530901
63300 530901 518934 508727 499461 491010 483842 478123 473232 468348 463218 458001 452797 447848 443823 441134
63286 441134 439105 436597 433447 430550 428529 427150 426079 425300 424543 423286 421791 421243 422260 423993 425331
63271 425331 426290 427451 428690 429425 429724 430180 430859 431248 431232 431349 432063 433433 435580 438818 443085 447740 452228
63254 452228 456645 461454 466855 472586 478164 483243 487836 492251 496753 501313 505676 509528 512632 515079
$$ packed form
63348A337609K7199K0226J3310O459J66m507o984p793p934q022q188q553r559
63335A343429j1812j5535k0265k5219k9949l4122l6916l7457l5993l3769l1296
63324A031096k7605k1865j4756p404M6P400J2529J2224N310o112j8775l0524m0314
63311I01250m7139n0050m8998m5003l9501l3745k8575k4322k0806j7624j4586
63300E30901j1967j0207r266q451p168n719m891m884n130n217n204m949m025k689
63286D41134k029k508l150k897k021j379j071p79p57j257j495n48J017J733J338
63271D25331R59J161J239P35K99M56O79L89j6J17P14J370K147L238M267M655M488
63254D52228M417M809N401N731N578N079M593M415M502M560M363L852L104K447
$$ plain form
63240 515079 517562 521044 525890 531494 536954 541850 546223 550257 554365 559270 565566 573328 582423 592842
63226 592842 604294 615791 626256 635508 644279 653396 663333 674339 686379 698937 711371 723583
63214 723583 735992 748824 761745 774165 785468 794924 801760 805551 806317 804148 799037 791187 781372
63201 781372 770750 760196 749665 738330 725708 712816 701808 694182 689640 687003 685852 686754 690259
63188 690259 696415 705190 716696 730960 747970 767995 791247 817118 844230 871463 898471 925043
63176 925043 950470 973947 995318 1015021 1033417 1050394 1065543 1078555 1089446 1098466 1105827 1111587
63164 1111587 1115774 1118331 1118714 1115768 1108340 1095901 1078330 1055438 1027230 994541 958831 921358
63152 921358 882956 844505 806935 770685 735819 702891 673030 646862 623891 603372 585297
$$ packed form
63240E15079K483L482M846N604N460M896M373M034M108M905O296P762R095J0419
63226E92842J1452J1497J0465R252Q771R117R937J1006J2040J2558J2434J2212
63214G23583J2409J2832J2921J2420J1303R456O836L791P66k169n111p850r815
63201G81372j0622j0554j0531j1335j2622j2892j1008p626m542k637j151R02L505
63188F90259O156Q775J1506J4264J7010K0025K3252K5871K7112K7233K7008K6572
63176I25043K5427K3477K1371J9703J8396J6977J5149J3012J0891R020P361N760
63164A111587M187K557L83k946p428j2439j7571k2892k8208l2689l5710l7473
63152I21358l8402l8451l7570l6250l4866l2928k9861k6168k2971k0519j8075
$$ plain form
63141 585297 569990 557191 546154 536463 528144 521021 514573 508565 503371 499417 496551 494137 491657
63128 491657 489021 486394 483917 481646 479567 477550 475355 472909 470574 468901 468000 467410 466810 466571 467272
63113 467272 468855 470775 472933 475924 480173 485215 490074 494153 497641 501270 505794 511410 517568 523600
63099 523600 529676 536889 546284 558116 572149 588243 606254 625614 645412 664729 682540 697326
63087 697326 707205 710694 707393 698057 684125 667107 648232 628566 609365 592031 577577 566179
63075 566179 557353 550502 545309 541790 540091 540149 541471 543349 545368 547643 550614 554798 560655 568360 577584
63060 577584 587737 598523 610099 622721 636597 652106 669647 689088 709805 731484 754360
63049 754360 778313 802397 825967 849851 875499 903083 931299 959122 986862 1015140 1043680
$$ packed form
63141E85297j5307j2799j1037r691q319p123o448o008n194l954k866k414k480
63128D91657k636k627k477k271k079k017k195k446k335j673r01n90o00k39P01
63113D67272J583J920K158K991M249N042M859M079L488L629M524N616O158O032
63099E23600O076P213R395J1832J4033J6094J8011J9360J9798J9317J7811J4786
63087F97326R879L489l301r336j3932j7018j8875j9666j9201j7334j4454j1398
63075E66179q826o851n193l519j699N8J322J878K019K275K971M184N857P705R224
63060E77584J0153J0786J1576J2622J3876J5509J7541J9441K0717K1679K2876
63049G54360K3953K4084K3570K3884K5648K7584K8216K7823K7740K8278K8540
$$ plain form
63038 1043680 1071748 1099304 1127039 1155515 1184915 1215366 1246728 1277972 1307464 1334189 1358264
63027 1358264 1379900 1398229 1411535 1418500 1418877 1413160 1402090 1386454 1366878 1343634 1316959 1287738
63015 1287738 1257656 1228491 1201487 1177592 1157936 1143627 1135107 1132105 1134381 1142296 1156528 1177256
63003 1177256 1203695 1234385 1267947 1303581 1340773 1378580 1415500 1450260 1482647 1513361 1543135
62992 1543135 1572245 1600775 1629035 1657561 1686800 1716825 1747300 1777664 1807217 1834840 1858735
62981 1858735 1876937 1888340 1892837 1890200 1879307 1859005 1829388 1791590 1746571 1694838 1637226 1575143
62969 1575143 1509992 1443127 1376436 1312041 1251024 1193175 1138323 1087149 1040215 997046 956896
62958 956896 919833 886288 856106 828856 804619 783468 764464 746169 728072 710594 693801
$$ packed form
63038A043680K8068K7556K7735K8476K9400L0451L1362L1244K9492K6725K4075
63027A358264K1636J8329J3306O965L77n717j1070j5636j9576k3244k6675k9221
63015A287738l0082k9165k7004k3895j9656j4309q520l002K276P915J4232K0728
63003A177256K6439L0690L3562L5634L7192L7807L6920L4760L2387L0714K9774
62992A543135K9110K8530K8260K8526K9239L0025L0475L0364K9553K7623K3895
62981A858735J8202J1403M497k637j0893k0302k9617l7798m5019n1733n7612o2083
62969A575143o5151o6865o6691o4395o1017n7849n4852n1174m6934m3169m0150
62958I56896l7063l3545l0182k7250k4237k1151j9004j8295j8097j7478j6793
$$ plain form
62947 693801 677259 661323 647325 635876 625852 615775 605535 596018 587545 579577 571699 564070
62935 564070 556937 550342 544434 539489 535456 531883 528457 525258 522340 519423 516305 513330 511158 510158
62921 510158 510217 511004 512236 513806 515960 519316 524448 531329 539376 548058 557166 566412 575091 582489 588435
62906 588435 593096 596268 597276 595676 591793 586512 580743 575119 569938 565256 561197 558137 556267 555006
62892 555006 553383 551177 549155 547863 546800 545297 543707 542919 542973 543087 543059 543733 545810 548874 551973 554556
62876 554556 556479 557644 558169 558486 558689 558089 555949 552504 548719 545204 541879 538625 535616 532920 530299
62861 530299 527651 525302 523616 522551 521774 521002 520118 519124 518123 517250 516552 516105 516234 517307 519196 521193
62845 521193 522619 523310 523464 523317 523156 523345 523961 524537 524489 523839 523360 524040 526404 530028 533574 535659 536163
$$ packed form
62947F93801j6542j5936j3998j1449j0024j0077j0240r517q473p968p878p629
62935E64070p133o595n908m945m033l573l426l199k918k917l118k975k172j000
62921E10158N9P87J232J570K154L356N132O881Q047Q682R108R246Q679P398N946
62906E88435M661L172J008j600l883n281n769n624n181m682m059l060j870j261
62892E55006j623k206k022j292j063j503j590p88N4J14k8O74K077L064L099K583
62876E54556J923J165N25L17K03o00k140l445l785l515l325l254l009k696k621
62861E30299k648k349j686j065p77p72q84r94j001q73o98m47J29J073J889J997
62845E21193J426O91J54j47j61J89O16N76m8o50m79O80K364L624L546K085N04
$$ plain form
62828 536163 536571 538636 542796 548220 554174 560682 567788 574778 580563 584517 586740 587705 587845 587271 585728
62813 585728 583028 579601 576270 573378 570490 567226 564009 561700 560808 561411 563568 567344 572545 578818 585951
62798 585951 593792 601994 610121 617918 625265 632133 638879 646331 655213 665692 677822 692050 708698
62785 708698 727274 747162 768881 793832 822548 853991 886885 921130 957560 996828 1038899
62774 1038899 1083151 1128473 1173623 1217888 1261181 1303223 1342956 1379067 1410733 1437485 1458701
62763 1458701 1473670 1481850 1482621 1475084 1458693 1434037 1402580 1365730 1324511 1279938 1233176 1185282
62751 1185282 1137186 1089980 1044801 1002269 962255 924315 888223 854142 822534 793980 768925
62740 768925 747425 729104 713296 699304 686702 675501 665864 657705 650828 645368 641590 639069 636693
$$ packed form
62828E36163M08K065M160N424N954O508P106O990N785L954K223R65J40n74j543
62813E85728k700l427l331k892k888l264l217k309q92O03K157L776N201O273P133
62798E85951P841Q202Q127P797P347O868O746P452Q882J0479J2130J4228J6648
62785G08698J8576J9888K1719K4951K8716L1443L2894L4245L6430L9268M2071
62774A038899M4252M5322M5150M4265M3293M2042L9733L6111L1666K6752K1216
62763A458701J4969Q180P71p537j6391k4656l1457l6850m1219m4573m6762m7894
62751A185282m8096m7206m5179m2532m0014l7940l6092l4081l1608k8554k5055
62740G68925k1500j8321j5808j3992j2602j1201r637q159o877n460l778k521k376
$$ plain form
62727 636693 633916 631594 631072 632690 635637 638958 642197 645311 648632 652849 658503 665541 673713 683115
62713 683115 693823 705351 717362 730768 747190 767129 789561 813628 839906 869526 902857
62702 902857 939657 979951 1023891 1071077 1120882 1173491 1229980 1291120 1356452 1424715 1494986
62691 1494986 1567130 1641084 1715785 1788915 1857733 1919951 1973637 2016684 2047090 2063887 2067247
62680 2067247 2057425 2034090 1997087 1947559 1887946 1821010 1749056 1673802 1596618 1518978 1442760
62669 1442760 1369835 1301122 1236356 1175076 1117567 1064496 1015937 971326 930306 893174 860370
62658 860370 831827 806871 784556 764093 745192 728026 712813 699487 687794 677481 668193 659446
62646 659446 650921 642669 634794 627159 619687 612728 606793 602116 598782 597009 596800 597422 597789 597395 596436
$$ packed form
62727F36693k777k322n22J618K947L321L239L114L321M217N654P038Q172R402
62713F83115J0708J1528J2011J3406J6422J9939K2432K4067K6278K9620L3331
62702I02857L6800M0294M3940M7186M9805N2609N6489O1140O5332O8263P0271
62691A494986P2144P3954P4701P3130O8818O2218N3686M3047L0406J6797L360
62680B067247r822k3335l7003m9528n9613o6936p1954p5254p7184p7640p6218
62669A442760p2925o8713o4766o1280n7509n3071m8559m4611m1020l7132l2804
62658H60370k8543k4956k2315k0463j8901j7166j5213j3326j1693j0313r288q747
62646F59446q525q252p875p635p472o959n935m677l334j773k09O22L67l94r59
$$ plain form
62631 596436 595028 592868 589825 586329 582908 579701 576671 573885 571315 568678 565864 563259 561292 559817
62617 559817 558350 556811 555663 555278 555488 555877 556304 557007 558316 560335 562819 565303 567428 569236 571221
62602 571221 574076 578318 584045 591003 598975 608132 618890 631336 644969 659207 674130 690531 709179
62589 709179 730135 752752 776108 799287 821415 841735 859775 875343 888216 897863 903582 904947
62577 904947 902054 895249 884673 870230 852108 831274 809237 787266 765841 744869 724250 704088
62565 704088 684547 665864 648507 632991 619307 606857 595251 584961 576738 570469 565105 559826
62553 559826 554824 550663 547287 544101 540882 538165 536619 536315 536667 536968 536984 537147 538197 540560 544068 548215
62537 548215 552458 556183 558785 560136 560902 561970 563605 565447 567341 569851 573882 580026 588247 597938
$$ packed form
62631E96436j408k160l043l496l421l207l030k786k570k637k814k605j967j475
62617E59817j467j539j148l85K10L89M27P03J309K019K484K484K125J808J985
62602E71221K855M242N727O958P972R157J0758J2446J3633J4238J4923J6401J8648
62589G09179K0956K2617K3356K3179K2128K0320J8040J5568J2873R647N719J365
62577I04947k893o805j0576j4443j8122k0834k2037k1971k1425k0972k0619k0162
62565G04088j9541j8683j7357j5516j3684j2450j1606j0290q223o269n364n279
62553E59826n002m161l376l186l219k717j546l04L52L01J6J63J050K363L508M147
62537E48215M243L725K602J351P66J068J635J842J894K510M031O144Q221R691
$$ plain form
62523 597938 608314 619136 631100 645167 661504 679523 699033 720754 745386 772724 802203
62512 802203 833940 868647 906653 947481 990185 1033594 1076382 1117527 1156632 1193188 1225583
62501 1225583 1251646 1270419 1282700 1289417 1290150 1283830 1270367 1250919 1226932 1199748 1170981 1142297
62489 1142297 1114543 1087661 1061779 1037913 1017271 1000254 986436 975246 966295 959318 954100 950377
62477 950377 947533 944618 940945 936502 931424 925124 916377 904281 888884 870870 850947 829556 806877
62464 806877 782938 757975 732769 708366 685316 663421 642398 622545 604491 588541 574589
62453 574589 562551 552479 544284 537738 532861 529910 528746 528527 528336 527947 527641 527464 527127 526699 526915 528462
62437 528462 531115 533833 535638 536286 536249 536231 536589 536970 536582 535014 532675 530273 528080 526068 524478 523637
$$ packed form
62523E97938J0376J0822J1964J4067J6337J8019J9510K1721K4632K7338K9479
62512H02203L1737L4707L8006M0828M2704M3409M2788M1145L9105L6556L2395
62501A225583K6063J8773J2281O717P33o320j3463j9448k3987k7184k8767k8684
62489A142297k7754k6882k5882k3866k0642j7017j3818j1190q951o977n218l723
62477I50377k844k915l673m443n078o300q747j2096j5397j8014j9923k1391k2679
62464H06877k3939k4963k5206k4403k3050k1895k1023j9853j8054j5950j3952
62453E74589j2038j0072q195o546m877k951j164k19j91l89l06j77l37m28K16J547
62437E28462K653K718J805O48l7j8L58L81l88j568k339k402k193k012j590q41
$$ plain form
62421 523637 523211 522397 521134 520431 521005 522125 522516 522010 521497 521366 520917 519460 517260 515058 513248 511900
62405 511900 511055 510526 509836 508921 508586 509722 512237 515287 518447 522043 526318 530895 535315 539655 544285
62390 544285 549325 554643 560154 565786 571359 576768 582179 587719 593104 597956 602521 607612 613699 620359
62376 620359 626915 633396 640549 648986 658606 668869 679408 690355 702250 715612 730426 746136
62364 746136 762379 779717 799354 822176 848487 878659 913344 952603 995401 1040644 1088440
62353 1088440 1139609 1193922 1249498 1303973 1355633 1403217 1445373 1480920 1509343 1530507 1544023
62342 1544023 1549294 1546177 1535305 1517806 1494804 1467075 1434942 1398602 1358687 1316354 1272717 1228420
62330 1228420 1184020 1140512 1099111 1060552 1024875 991764 960809 931555 903760 877683 853825
$$ packed form
62421E23637m26q14j263p03N74J120L91n06n13j31m49j457k200k202j810j348
62405E11900q45n29o90r15l35J136K515L050L160L596M275M577M420M340M630
62390E44285N040N318N511N632N573N409N411N540N385M852M565N091O087O660
62376F20359O556O481P153Q437R620J0263J0539J0947J1895J3362J4814J5710
62364G46136J6243J7338J9637K2822K6311L0172L4685L9259M2798M5243M7796
62353A088440N1169N4313N5576N4475N1660M7584M2156L5547K8423K1164J3516
62342A544023N271l117j0872j7499k3002k7729l2133l6340l9915m2333m3637m4297
62330A228420m4400m3508m1401l8559l5677l3111l0955k9254k7795k6077k3858
$$ plain form
62319 853825 832281 812498 793731 775563 757973 741138 725223 710326 696605 684465 674367
62308 674367 666262 659498 653644 649181 646777 645966 645214 643536 641429 639906 639146 638580 637833 636892 635650 634085
62292 634085 632873 632989 634427 635991 636818 637563 639564 643196 647737 652618 657956 663710 669066 673119 675788
62277 675788 677631 679037 679984 680409 680469 680552 681337 683647 687805 693233 699047 705044 711844 720359 731597 746738
62261 746738 766584 790805 818396 849145 884076 924207 969428 1018885 1071764 1127179 1183796
62250 1183796 1240175 1295131 1347267 1394569 1435045 1467459 1490980 1504716 1508476 1503633 1492136 1474666
62238 1474666 1450602 1419764 1383199 1342099 1296969 1248346 1197608 1146548 1096655 1049112 1004905
62227 1004905 964445 927536 894100 864491 838828 816571 797150 780444 766157 753307 741006
$$ packed form
62319H53825k1544j9783j8767j8168j7590j6835j5915j4897j3721j2140j0098
62308F74367q105o764n854m463k404q11p52j678k107j523p60n66p47r41j242j565
62292F34085j212J16J438J564Q27P45K001L632M541M881N338N754N356M053K669
62277F75788J843J406R47M25O0Q3P85K310M158N428N814N997O800Q515J1238J5141
62261G46738J9846K4221K7591L0749L4931M0131M5221M9457N2879N5415N6617
62250A183796N6379N4956N2136M7302M0476L2414K3521J3736L760m843j1497j7470
62238A474666k4064l0838l6565m1100m5130m8623n0738n1060m9893m7543m4207
62227A004905m0460l6909l3436k9609k5663k2257j9421j6706j4287j2850j2301
$$ plain form
62216 741006 729375 719014 709848 701099 692166 682919 673357 663669 654575 646898 640683 635150 629602 624077
62202 624077 619221 615803 614206 613998 614226 614509 615618 618463 622829 627780 633055 639221 646524 654514 662969
62187 662969 672255 682473 693034 703568 714504 726198 738067 749253 759657 769591 778716 786097
62175 786097 791296 794879 797872 801172 805432 811082 818441 828149 841362 859064 881222 907118 936559
62162 936559 970169 1008203 1049460 1091690 1132722 1170839 1204370 1231686 1251909 1265382 1273111 1275830
62150 1275830 1273714 1266803 1255292 1239251 1218412 1192605 1162426 1129189 1094228 1058471 1022740 988165
62138 988165 956110 927751 903767 884241 868743 856635 847516 841418 838606 839310 843655 851705 863426
62125 863426 878674 897167 918367 941574 966470 993512 1023322 1055508 1088500 1120746 1151668
$$ packed form
62216G41006j1631j0361r166q749q933r247r562r688r094p677o215n533n548n525
62202F24077m856l418j597k08K28K83J109K845M366M951N275O166P303P990Q455
62187F62969R286J0218J0561J0534J0936J1694J1869J1186J0404R934R125P381
62175G86097N199L583K993L300M260N650P359R708J3213J7702K2158K5896K9441
62162I36559L3610L8034M1257M2230M1032L8117L3531K7316K0223J3473P729K719
62150A275830k116o911j1511j6041k0839k5807l0179l3237l4961l5757l5731l4575
62138I88165l2055k8359k3984j9526j5498j2108r119o098k812P04M345Q050J1721
62125H63426J5248J8493K1200K3207K4896K7042K9810L2186L2992L2246L0922
$$ plain form
62114 1151668 1181123 1208321 1231780 1250208 1263049 1270351 1272551 1270431 1264996 1257441 1249296 1242152 1236741
62101 1236741 1232461 1228424 1224908 1223306 1224710 1229173 1236396 1246485 1259759 1276374 1296451 1320124 1347051
62088 1347051 1376219 1406611 1437891 1470172 1503430 1537546 1572785 1609784 1649103 1691024 1735763
62077 1735763 1783611 1834786 1889214 1946377 2005308 2064800 2123604 2180373 2233496 2281411 2323216
62066 2323216 2358681 2387620 2409754 2425539 2436790 2445906 2454559 2463386 2472693 2482879 2494196 2506614
62054 2506614 2520236 2535610 2553406 2573778 2595997 2618620 2639878 2657835 2670130 2673865 2666340 2646244
62042 2646244 2613868 2569963 2514736 2448251 2371401 2285891 2193442 2095601 1994227 1891553 1789571
62031 1789571 1689735 1593277 1501430 1415281 1335751 1263722 1199657 1143002 1092466 1047096 1006690
$$ packed form
62114A151668K9455K7198K3459J8428J2841P302K200k120n435p555q145p144n411
62101A236741m280m037l516j602J404M463P223J0089J3274J6615K0077K3673K6927
62088A347051K9168L0392L1280L2281L3258L4116L5239L6999L9319M1921M4739
62077A735763M7848N1175N4428N7163N8931N9492N8804N6769N3123M7915M1805
62066B323216L5465K8939K2134J5785J1251R116Q653Q827R307J0186J1317J2418
62054B506614J3622J5374J7796K0372K2219K2623K1258J7957J2295L735p525k0096
62042B646244l2376m3905n5227o6485p6850q5510r2449r7841j01374j02674j01982
62031A789571r9836r6458r1847q6149p9530p2029o4065n6655n0536m5370m0406
$$ plain form
62020 1006690 970981 938910 909111 880862 854285 829810 807616 787358 768315 750148 733643
62009 733643 720236 710502 703588 698476 695244 694462 695836 698350 701634 706252 712371 718932 724572 728859
61995 728859 732114 734396 735205 733984 730402 724241 715613 705373 694733 684044 672353 658688 643644
61982 643644 629170 616684 605932 595882 586219 577429 569809 563130 557246 552418 548781 545990 543592
61969 543592 541419 539428 537574 536089 535432 535616 535976 536051 536341 537638 539841 542113 544101 546370 549518 553461
61953 553461 557823 562601 568169 574962 583317 593347 604721 616859 629573 643279 658480 675388
61941 675388 694311 715964 740813 768204 796676 825223 853905 883132 912678 941618 968999
61930 968999 994370 1017731 1039137 1058319 1074605 1087280 1096091 1101348 1103470 1102548 1098479 1091450 1082119
$$ packed form
62020A006690l5709l2071k9799k8249k6577k4475k2194k0258j9043j8167j6505
62009G33643j3407r734o914n112l232p82J374K514L284M618O119O561N640M287
61995G28859L255K282Q09j221l582o161q628j0240j0640j0689j1691j3665j5044
61982F43644j4474j2486j0752j0050r663q790p620o679n884m828l637k791k398
61969E43592k173j991j854j485o57J84L60P5K90J297K203K272J988K269L148L943
61953E53461M362M778N568O793Q355J0030J1374J2138J2714J3706J5201J6908
61941F75388J8923K1653K4849K7391K8472K8547K8682K9227K9546K8940K7381
61930I68999K5371K3361K1406J9182J6286J2675Q811N257K122r22m069p029r331
$$ plain form
61917 1082119 1071333 1059880 1048579 1038405 1030314 1024983 1022852 1024368 1030097 1040538 1055844 1075559
61905 1075559 1098451 1122670 1146272 1167729 1185942 1199969 1209037 1212850 1211598 1205476 1194340 1177960
61893 1177960 1156574 1131129 1103023 1073598 1043708 1013728 984071 955585 929159 904904 882105
61882 882105 860152 839208 819792 802034 785690 770593 756686 743742 731502 720075 709934
61871 709934 701534 695196 691201 689580 689801 691080 693120 696344 701368 708516 717796 728974 741657 755712
61857 755712 771770 790963 814024 840856 871024 904239 940268 978874 1020198 1064751 1112587
61846 1112587 1162630 1213128 1262561 1309836 1354025 1394433 1430703 1462245 1487654 1505378 1515098
61835 1515098 1517939 1515230 1507713 1496335 1483169 1470866 1461351 1455516 1453904 1456966 1464616 1476220 1491336
$$ packed form
61917A082119j0786j1453j1301j0174q091n331k131J516N729J0441J5306J9715
61905A075559K2892K4219K3602K1457J8213J4027R068L813j252o122j1136j6380
61893A177960k1386k5445k8106k9425k9890k9980k9657k8486k6426k4255k2799
61882H82105k1953k0944j9416j7758j6344j5097j3907j2944j2240j1427j0141
61871G09934q400o338l995j621K21J279K040L224N024P148R280J1178J2683J4055
61857G55712J6058J9193K3061K6832L0168L3215L6029L8606M1324M4553M7836
61846A112587N0043N0498M9433M7275M4189M0408L6270L1542K5409J7724R720
61835A515098K841k709p517j1378j3166j2303r515n835j612L062P650J1604J5116
$$ plain form
61822 1491336 1509914 1531289 1553231 1572560 1586620 1593883 1593336 1583947 1564964 1536360 1498827 1453677
61810 1453677 1402983 1349306 1294723 1240197 1186231 1133964 1085085 1040623 1000321 963433 929743
61799 929743 899511 872692 848653 826627 806163 787092 769321 752830 737771 724385 712731
61788 712731 702508 693245 684796 677587 672155 668375 665241 661587 656976 651856 646880 642270 637829 633366
61774 633366 628930 624633 620448 616301 612317 608788 605857 603354 601050 598957 597234 595914 594927 594392 594686
61759 594686 596088 598484 601497 604862 608557 612635 617039 621590 626090 630384 634456 638601 643462 649650
61745 649650 657114 665014 672487 679516 686752 694491 702206 709313 715961 722699 729575 736037 741693 746815
61731 746815 752028 757762 763962 770059 775225 779060 782075 785209 788775 792195 794843 796737 798263 799608
$$ packed form
61822A491336J8578K1375K1942J9329J4060P263n47r389j8983k8604l7533m5150
61810A453677n0694n3677n4583n4526n3966n2267m8879m4462m0302l6888l3690
61799I29743l0232k6819k4039k2026k0464j9071j7771j6491j5059j3386j1654
61788G12731j0223r263q449p209n432l780l134l654m611n120m976m610m441m463
61774F33366m436m297m185m147l984l529k931k503k304k093j723j320r87n35K94
61759E94686J402K396L013L365L695M078M404M551M500M294M072M145M861O188
61745F49650P464P900P473P029P236P739P715P107O648O738O876O462N656N122
61731G46815N213N734O200O097N166L835L015L134L566L420K648J894J526J345
$$ plain form
61717 799608 800887 802582 805390 809560 814553 819371 823058 824932 824542 821609 816129 808576 799940 791344
61703 791344 783517 776641 770659 765553 761282 757648 754325 751048 747864 745321 744217 744758 745984 746424 745486
61688 745486 743835 742262 740649 738421 735546 732436 728964 724325 718125 711179 704778 699328 694111 688375
61674 688375 682268 676453 671058 665461 659210 652806 647237 642964 639694 637096 635285 634446 634317 634256 633674
61659 633674 632266 630032 627268 624461 622022 620128 618778 617876 617222 616588 615854 615009 614093 613352 613311 614375
61643 614375 616331 618571 620817 623191 625558 627325 628139 628273 628013 627073 625069 622211 618997 615466 611296
61628 611296 606585 602099 598644 596463 595228 594422 593861 594050 595860 599602 604620 610076 615833 622114 628533
61613 628533 634092 638118 640697 642109 642410 641739 640540 639170 637565 635587 633465 631659 630419 629693 629372
$$ packed form
61717G99608J279J695K808M170M993M818L687J874l90k933n480p553q636q596
61703G91344p827o876n982n106m271l634l323l277l184k543j104N41J226M40r38
61688G45486j651j573j613k228k875l110l472m639o200o946o401n450n217n736
61674F88375o107n815n395n597o251o404n569m273l270k598j811q39j29o1n82
61659F33674j408k234k764k807k439j894j350r02o54o34p34q45r16p41m1J064
61643F14375J956K240K246K374K367J767Q14J34k60r40k004k858l214l531m170
61628F11296m711m486l455k181j235q06n61J89J810L742N018N456N757O281O419
61613F28533N559M026K579J412L01o71j199j370j605j978k122j806j240p26l21
$$ plain form
61598 629372 629383 629486 629068 627313 623870 619461 615541 613000 611199 608607 604383 599079 593780 588825 583511
61583 583511 576851 568514 559129 549745 540994 532838 525110 517962 511482 505257 498847 492600 487423 483615
61569 483615 480394 476766 472493 468048 463934 460320 457029 453699 450118 446582 443633 441229 438491 434601
61555 434601 429888 425669 423067 422074 421714 420931 419381 417547 416193 415743 416150 417161 418447 419591 420343 420979
61539 420979 422133 424163 426996 430596 435056 439953 444135 446680 447831 448450 448709 447937 445721 442538 439048
61524 439048 435317 431113 426637 422491 418968 415770 412454 408941 405586 402914 401243 400291 399145 396937
61510 396937 393744 390639 388676 387934 387715 387455 387130 386855 386491 385794 384760 383725 383239 383772 385281 387005
61494 387005 387952 387781 386987 386182 385510 384930 384707 385164 386116 386967 387421 387805 388605 389916 391479 393093 394844
$$ packed form
61598F29372J1J03m18j755l443m409l920k541j801k592m224n304n299m955n314
61583E83511o660q337r385r384q751q156p728p148o480o225o410o247n177l808
61569D83615l221l628m273m445m114l614l291l330l581l536k949k404k738l890
61555D34601m713m219k602r93l60p83j550j834j354m50M07J011J286J144P52O36
61539D20979J154K030K833L600M460M897M182K545J151O19K59p72k216l183l490
61524D39048l731m204m476m146l523l198l316l513l355k672j671r52j146k208
61510C96937l193l105j963p42k19k60l25k75l64o97j034j035m86N33J509J724
61494C87005R47j71p94q05o72n80k23M57R52Q51M54L84Q00J311J563J614J751
$$ plain form
61477 394844 396829 398727 399851 399884 399427 399471 400266 401080 401161 400488 399439 398266 397264 396901 397274 397801 398026 398376
61459 398376 399457 400941 401940 402394 403248 405158 407726 410146 411932 412829 412690 411831 411010 410712 410777 410888 411025
61442 411025 411331 412037 413685 416826 421193 425722 429725 433572 437891 442654 447402 451827 455531 457747 458016
61427 458016 456939 455683 454887 454528 454582 455213 456396 457919 459784 462131 464839 467626 470510 473691 476948
61412 476948 479575 480989 481072 479900 477541 474211 470249 465776 460657 454944 449120 443763 439123 435150 431738
61397 431738 428788 426131 423538 420815 417908 414911 412013 409389 407136 405254 403650 402244 401188 400848
61383 400848 401319 402065 402410 402373 402553 403158 403734 404104 404955 406963 409749 412262 413881 414672 414863 414809 415293 417090
61365 417090 420060 423228 425935 428473 431473 435140 439284 443723 448382 453167 457929 462487 466752 471068
$$ packed form
61477C94844J985J898J124L3m57M4P95Q14Q1o73j049j173j002l63L73N27K25L50
61459C98376J081J484R99M54Q54J910K568K420J786Q97j39q59q21k98O5J11J37
61442D11025L06P06J648L141M367M529M003L847M319M763M748M425L704K216K69
61427D58016j077j256p96l59N4O31J183J523J865K347K708K787K884L181L257
61412D76948K627J414Q3j172k359l330l962m473n119n713n824n357m640l973l412
61397D31738k950k657k593k723k907k997k898k624k253j882j604j406j056l40
61383D00848M71P46L45l7J80O05N76L70Q51K008K786K513J619P91J91n4M84J797
61365D17090K970L168K707K538L000L667M144M439M659M785M762M558M265M316
$$ plain form
61351 471068 476285 483158 491611 500903 510485 520477 531412 543876 558213 574005 589846 604245 616871
61338 616871 628409 639113 648189 654853 659298 662116 663311 662597 660304 657293 653975 649971 644753 638296
61324 638296 631082 623829 617186 611357 605939 600390 594733 589633 585779 583320 581888 580953 580161 579509 579262
61309 579262 579611 580449 581527 582733 584146 586039 589031 594072 601863 612196 624013 636013 647053 656097
61295 656097 662306 665434 665993 664861 662646 659337 654389 647289 638348 628926 620521 613593 607616 602327
61281 602327 598373 596408 595998 596025 596010 596491 598150 601069 604961 609560 614550 619478 624149 628881 634057 639613
61265 639613 645251 651044 657451 664799 673051 682053 691647 701564 711636 722366 734972 750503 768894
61252 768894 788940 808980 827483 843271 855607 864179 868865 869468 865831 858169 847143 833622 818506
$$ packed form
61351D71068N217O873Q453R292R582R992J0935J2464J4337J5792J5841J4399J2626
61338F16871J1538J0704R076O664M445K818J195p14k293l011l318m004n218o457
61324F38296p214p253o643n829n418n549n657n100l854k459j432r35p92o52k47
61309E79262L49Q38J078J206J413J893K992N041P791J0333J1817J2000J1040R044
61295F56097O209L128N59j132k215l309m948p100q941r422q405o928n977n289
61281F02327l954j965m10K7j5M81J659K919L892M599M990M928M671M732N176N556
61265F39613N638N793O407P348Q252R002R594R917J0072J0730J2606J5531J8391
61252G68894K0046K0040J8503J5788J2336Q572M686O03l637p662j1026j3521j5116
$$ plain form
61239 818506 802725 787130 772239 758179 745041 733212 723232 715310 709119 704153 700227 697515 696139
61226 696139 695861 696334 697563 699910 703584 708273 713480 719183 725922 734047 742988 751475 758611 764594 770227
61211 770227 775827 780876 784827 787991 791359 795663 800843 806398 811999 817750 824108 831776 841598 854329
61197 854329 870433 890014 912930 938990 968100 1000224 1035213 1072770 1112563 1154123 1196427
61186 1196427 1237867 1277028 1313447 1347206 1377831 1404162 1425638 1443206 1458457 1472008 1483157
61175 1483157 1491023 1495465 1496731 1494674 1488774 1478831 1465206 1448287 1427965 1403926 1376302 1345772
61163 1345772 1312995 1278228 1241595 1203530 1164818 1126438 1089471 1054862 1022933 993307 965639
61152 965639 940301 918087 899395 884035 871670 862007 854654 849310 846113 845353 846731 849331 852319
$$ packed form
61239H18506j5781j5595j4891j4060j3138j1829r980p922o191m966l926k712j376
61226F96139k78M73J229K347L674M689N207N703O739Q125Q941Q487P136N983N633
61211G70227N600N049L951L164L368M304N180N555N601N751O358P668R822J2731
61197H54329J6104J9581K2916K6060K9110L2124L4989L7557L9793M1560M2304
61186A196427M1440L9161L6419L3759L0625K6331K1476J7568J5251J3551J1149
61175A483157P866M442J266k057n900r943j3625j6919k0322k4039k7624l0530
61163A345772l2777l4767l6633l8065l8712l8380l6967l4609l1929k9626k7668
61152I65639k5338k2214j8692j5360j2365r663p353n344l197p60J378K600K988
$$ plain form
61139 852319 855273 857846 859737 861108 862494 864109 865925 868666 873937 882769 894555 908162 923761
61126 923761 942849 966667 995260 1027985 1064263 1103725 1146159 1191575 1240114 1291786 1346461
61115 1346461 1403976 1463903 1525184 1586378 1646417 1704969 1762014 1817205 1869629 1918085 1961561
61104 1961561 1999496 2031574 2057318 2076163 2087963 2093122 2092028 2084620 2070725 2050470 2024010 1991085
61092 1991085 1951324 1904995 1853162 1797125 1737973 1676714 1614580 1553065 1493570 1436879 1383024
61081 1383024 1331819 1283460 1238356 1196575 1157988 1122957 1092170 1065594 1042271 1021573 1003967
61070 1003967 989976 978951 969640 961628 955409 951257 948775 947565 947698 949414 952773 957631 963643 970412
61056 970412 978006 987181 998733 1012771 1029062 1047837 1069677 1094633 1122020 1151250 1182591 1216938
$$ packed form
61139H52319K954K573J891J371J386J615J816K741N271Q832J1786J3607J5599
61126I23761J9088K3818K8593L2725L6278L9462M2434M5416M8539N1672N4675
61115A346461N7515N9927O1281O1194O0039N8552N7045N5191N2424M8456M3476
61104A961561L7935L2078K5744J8845J1800N159j094p408j3895k0255k6460l2925
61092A991085l9761m6329n1833n6037n9152o1259o2134o1515n9495n6691n3855
61081A383024n1205m8359m5104m1781l8587l5031l0787k6576k3323k0698j7606
61070A003967j3991j1025r311q012o219m152k482j210J33J716L359M858O012O769
61056I70412P594R175J1552J4038J6291J8775K1840K4956K7387K9230L1341L4347
$$ plain form
61044 1216938 1254905 1296071 1339141 1383092 1428116 1475006 1523699 1573159 1622853 1673360 1725038
61033 1725038 1777045 1828497 1879818 1932000 1985098 2038374 2091401 2144085 2196126 2247390 2298364
61022 2298364 2349286 2399503 2448859 2499229 2553483 2613434 2680099 2755347 2841690 2940704 3053252
61011 3053252 3181230 3327887 3497226 3695126 3930815 4215299 4558516 4969984 5461603
61002 5461603 6047136 6739684 7553895 8511814 9643486 10981212 12555111 14386048 16458574
60993 16458574 18677502 20852170 22749033 24189002 25113474 25573976 25680071 25567185 25390413
60984 25390413 25296159 25351549 25485834 25513122 25231511 24518373 23355306 21795110 19927621
60975 19927621 17869874 15758558 13724113 11860718 10216689 8805436 7618682 6633535
$$ packed form
61044A216938L7967M1166M3070M3951M5024M6890M8693M9460M9694N0507N1678
61033A725038N2007N1452N1321N2182N3098N3276N3027N2684N2041N1264N0974
61022B298364N0922N0217M9356N0370N4254N9951O6665P5248Q6343R9014J12548
61011C053252J27978J46657J69339J97900K35689K84484L43217M11468M91619
61002E461603N85533O92548Q14211R57919J131672J337726J573899J830937K072526
60993A6458574K218928K174668J896863J439969R24472M60502J06095j12886j76772
60984B5390413r4254N5390J34285K7288k81611p13138j163067j560196j867489
60975A9927621k057747k111316k034445j863395j644029j411253j186754r85147
$$ plain form
60967 6633535 5819257 5146185 4590456 4131963 3751598 3432324 3161148 2928561 2726994
60958 2726994 2550503 2394820 2256662 2133347 2023149 1925083 1838031 1760727 1692507 1633018
60948 1633018 1580946 1533930 1489860 1447476 1405792 1364072 1322576 1282280 1243554 1206012 1169762
60937 1169762 1135706 1104275 1074890 1046994 1020718 996155 972844 950367 928677 907572 886710
60926 886710 866458 847828 831145 815588 800393 785711 771896 758840 746502 735249 725214
60915 725214 716073 707874 701156 695797 690739 685567 681371 679154 678214 677133 675675 674486 673348 671036
60901 671036 666944 661900 657096 652888 648752 643952 638184 631989 626463 622113 618074 612967 606465 599513
60887 599513 593011 586863 580462 573625 566706 560140 554248 549395 545876 543546 541792 540110 538585 537461
$$ packed form
60967F633535q14278o73072n55729m58493l80365l19274k71176k32587k01567
60958B726994j76491j55683j38158j23315j10198r8066q7052p7304o8220n9489
60948A633018n2072m7016m4070m2384m1684m1720m1496m0296l8726l7542l6250
60937A169762l4056l1431k9385k7896k6276k4563k3311k2477k1690k1105k0862
60926H86710k0252j8630j6683j5557j5195j4682j3815j3056j2338j1253j0035
60915G25214r141q199o718n359n058n172m196k217r40j081j458j189j138k312
60901F71036m092n044m804m208m136m800n768o195n526m350m039n107o502o952
60887E99513o502o148o401o837o919o566n892m853l519k330j754j682j525j124
$$ plain form
60873 537461 536336 534323 531303 528497 527297 527742 528762 529707 531012 533317 536602 540374 544235 548102 552252
60858 552252 557270 563481 570328 576652 581655 585193 587291 588034 588038 588277 589087 589820 589774 589042 588182 587475 586695
60841 586695 585240 582310 577417 570891 563601 556188 549007 542597 537370 532802 527880 522539 517736 513857
60827 513857 510196 506498 503883 503317 504042 504533 504344 504034 503866 503645 503508 503778 504288 504782 505831 508286 511869
60810 511869 515193 517336 518662 520066 522086 524821 527986 530904 533113 535103 537840 541430 544885 547375
60796 547375 549063 550482 551697 552537 553173 553918 554632 554739 553893 552466 551327 551029 551113 550378 548089 544791 541623
60779 541623 538946 536127 532625 528683 524758 520778 516414 511835 507746 504633 502243 499927 497373 494896
60765 494896 492993 491811 491172 491019 491561 492939 494946 497165 499122 500317 500486 500021 499772 500217 501111 502179
$$ packed form
60873E37461j125k013l020k806j200M45J020R45J305K305L285L772L861L867M150
60858E52252N018O211O847O324N003L538K098P43MK39Q10P33m6p32q60p07p80
60841E86695j455k930m893o526p290p413p181o410n227m568m922n341m803l879
60827E13857l661l698k615n66P25M91j89l10j68k21j37K70N10M94J049K455L583
60810E11869L324K143J326J404K020K735L165K918K209J990K737L590L455K490
60796E47375J688J419J215Q40O36P45P14J07q46j427j139k98Q4p35k289l298l168
60779E41623k677k819l502l942l925l980m364m579m089l113k390k316k554k477
60765D94896j903j182o39j53N42J378K007K219J957J195J69m65k49M45Q94J068
$$ plain form
60749 502179 503659 505830 508447 511206 514442 518695 523725 528536 532397 535279 537321 538468 538829 538939 539387
60734 539387 540347 541497 542222 541967 540771 539452 538898 539149 539473 539328 538818 538259 537771 537488 537650 538219 538672 538474
60716 538474 537553 536223 534906 534056 533945 534214 533895 532255 529482 526270 522930 519289 515354 511571 508271
60701 508271 505306 502460 499914 497864 495918 493418 490485 488200 487431 487807 488259 488290 488215 488298 488326 488155 488130 488712
60683 488712 490063 492197 495155 498738 502424 505857 509196 512743 516472 520152 523691 527140 530604 534336
60669 534336 538536 542843 546390 548707 550198 551419 552288 552484 552168 551795 551439 550928 550339 549828 549208 548340 547754
60652 547754 548128 549214 549997 550034 549956 550580 552128 554483 557512 560774 563525 565470 567136 569024 570671 571017
60636 571017 569666 567406 565531 564885 565584 567383 570049 573375 577028 580662 584233 587957 591879 595713 599259
$$ packed form
60749E02179J480K171K617K759L236M253N030M811L861K882K042J147L61J10M48
60734E39387R60J150P25k55j196j319n54K51L24j45n10n59m88k83J62N69M53j98
60716E38474r21j330j317q50j11K69l19j640k773l212l340l641l935l783l300
60701E08271k965k846k546k050j946k500k933k285p69L76M52L1p5Q3K8j71k5N82
60683D88712J351K134K958L583L686L433L339L547L729L680L539L449L464L732
60669E34336M200M307L547K317J491J221Q69J96l16l73l56n11n89n11o20q68n86
60652E47754L74J086P83L7p8O24J548K355L029L262K751J945J666J888J647L46
60636E71017j351k260j875o46O99J799K666L326L653L634L571L724L922L834L546
$$ plain form
60621 599259 602721 606388 610225 614020 617719 621283 624492 627261 629997 633226 636942 640656 643985 646934
60607 646934 649799 653059 657104 661696 665962 669312 672047 674596 676606 677539 677825 678547 680021 681620 683034
60592 683034 684822 687486 690753 694086 697247 700060 702263 703895 705330 706678 707723 708565 709629 710767
60578 710767 711153 710531 709853 710113 711181 712455 714143 717105 721734 727687 734557 742191 750468 759329 768952
60563 768952 779513 790851 802759 815357 828676 842039 854432 865519 875803 885730 895085 903478
60551 903478 911070 918595 926784 935832 945337 954718 963787 972916 982619 993044 1003855 1014478 1024432
60538 1024432 1033644 1042509 1051457 1060350 1068510 1075332 1080558 1083960 1085287 1084856 1083648 1082387 1080836 1078515
60524 1078515 1075794 1073570 1071926 1069763 1066038 1060972 1055727 1051097 1046799 1042024 1036447 1030452 1024391 1017905
$$ packed form
60621E99259L462L667L837L795L699L564L209K769K736L229L716L714L329K949
60607F46934K865L260M045M592M266L350K735K549K010R33K86P22J474J599J414
60592F83034J788K664L267L333L161K813K203J632J435J348J045Q42J064J138
60578G10767L86o22o78K60J068J274J688K962M629N953O870P634Q277Q861R623
60563G68952J0561J1338J1908J2598J3319J3363J2393J1087J0284R927R355Q393
60551I03478P592P525Q189R048R505R381R069R129R703J0425J0811J0623R954
60538A024432R212Q865Q948Q893Q160O822N226L402J327m31j208j261j551k321
60524A078515k721k224j644k163l725n066n245m630m298m775n577n995o061o486
$$ plain form
60510 1017905 1010364 1001825 993042 984386 975257 964835 953055 940548 928045 916279 906092 898026
60498 898026 891927 887410 884589 883870 885138 887700 891107 895515 901026 907049 912450 915965 916381 912716 904631
60483 904631 892560 877259 859289 839028 817006 794017 770966 748710 727947 709067 692003
60472 692003 676339 661698 648100 635876 625212 615887 607573 600252 594037 588624 583251 577366 571094
60459 571094 565030 559812 555903 553316 551302 548738 545200 541355 537972 534923 531597 527968 524585 521682
60445 521682 518975 516320 513914 511697 509204 506301 503552 501413 499440 496734 493005 488858 485124 482216
60431 482216 480044 478211 476315 474332 472785 472339 473072 474242 474874 474532 473486 472200 470870 469510 468305
60416 468305 467613 467600 468093 468920 470157 471868 473825 475711 477483 479197 480576 481216 481309 481672 482750 483878
$$ packed form
60510A017905p541q539q783q656r129j0422j1780j2507j2503j1766j0187q066
60498H98026o099m517k821p19J268K562L407M408N511O023N401L515M16l665q085
60483I04631j2071j5301j7970k0261k2022k2989k3051k2256k0763j8880j7064
60472F92003j5664j4641j3598j2224j0664r325q314p321o215n413n373n885o272
60459E71094o064n218l909k587k014k564l538l845l383l049l326l629l383k903
60445E21682k707k655k406k217k493k903k749k139j973k706l729m147l734k908
60431D82216k172j833j896j983j547m46P33J170O32l42j046j286j330j360j205
60416D68305o92j3M93Q27J237J711J957J886J772J714J379O40R3L63J078J128
$$ plain form
60400 483878 484018 483084 482082 481869 482310 482840 483436 484525 486240 488357 490935 494313 498298 501946 504590 506524
60384 506524 508176 509083 508494 506708 504909 503657 502435 500827 499218 497900 496389 494328 492446 491796 492454
60369 492454 493754 495484 497902 500609 502355 502273 500750 498805 497090 495767 494899 494568 494822 495708 497251 499258
60353 499258 501320 503131 504628 505776 506436 506563 506405 506468 507393 509730 513497 517940 522042 525476 528862 532985
60337 532985 537946 543184 548169 552887 557752 563171 569181 575419 581345 586359 589780 591055 590301 588384
60323 588384 586099 583329 579294 573605 566768 559772 553549 548761 545658 543978 543241 543144 543465 543809 544075 545076
60307 545076 548004 553011 558961 564924 571438 579880 590982 604270 618501 632125 643713 652534 658635
60294 658635 662062 662291 658854 652173 643247 632829 621592 610837 602073 595740 591013 587052 583815 581405
$$ packed form
60400D83878J40r34j002k13M41N30N96J089J715K117K578L378L985L648K644J934
60384E06524J652R07n89j786j799j252j222j608j609j318j511k061j882o50O58
60369D92454J300J730K418K707J746q2j523j945j715j323q68l31K54Q86J543K007
60353D99258K062J811J497J148O60J27j58O3R25K337L767M443M102L434L386M123
60337E32985M961N238M985M718M865N419O010O238N926N014L421J275p54j917
60323E88384k285k770m035n689o837o996o223m788l103j680p37r7L21L44K66J001
60307E45076K928N007N950N963O514Q442J1102J3288J4231J3624J1588Q821O101
60294F58635L427K29l437o681q926j0418j1237j0755q764o333m727l961l237k410
$$ plain form
60280 581405 579305 576779 573645 570232 566826 563493 560153 556580 552651 548861 546171 544907 544144 542771
60266 542771 540871 539504 539262 539780 540662 542172 544691 548055 551829 555912 560474 565510 570768 575925 580609
60251 580609 584315 586520 586795 584822 580684 575365 570518 567198 564938 562469 559246 555829 552850 550243
60237 550243 547710 545472 544144 544009 544730 545800 547134 549175 552396 556619 560984 564814 568504 573228 579625
60222 579625 586932 593569 598450 601710 604421 607774 612386 618094 624308 630601 636896 643177 649308 655288
60208 655288 661518 668502 676244 684044 691041 697027 702728 709113 716229 722845 727532 730138 731869 733857
60194 733857 735965 737171 736803 735084 732659 729986 727173 724123 720738 717114 713587 710541 708114 706122
60180 706122 704213 702160 700081 698324 696944 695361 692916 689854 687419 686720 687773 689858 692464 695415
$$ packed form
60280E81405k100k526l134l413l406l333l340l573l929l790k690j264p63j373
60266E42771j900j367k42N18Q82J510K519L364L774M083M562N036N258N157M684
60251E80609L706K205K75j973m138n319m847l320k260k469l223l417k979k607
60237E50243k533k238j328j35P21J070J334K041L221M223M365L830L690M724O397
60222E79625P307O637M881L260K711L353M612N708O214O293O295O281O131N980
60208F55288O230O984P742P800O997N986N701O385P116O616M687K606J731J988
60194G33857K108J206l68j719k425k673k813l050l385l624l527l046k427j992
60180G06122j909k053k079j757j380j583k445l062k435o99J053K085K606K951
$$ plain form
60166 695415 698319 700510 701713 702420 703400 704963 706808 708388 709275 709311 708637 707712 707263 708012 710180 713193
60150 713193 716071 718264 720064 722189 725153 729133 734228 740569 748199 756950 766486 776465 786747 797511
60136 797511 809047 821402 834292 847240 859518 870047 877817 882590 884836 884843 882356 877320 870559
60123 870559 863261 856129 849449 843733 839694 837639 837235 837795 838585 839055 839221 839602 840410 841014 840687 839673
60107 839673 838863 838461 837597 835418 832041 828234 824550 820991 817206 812849 807954 803067 798783 795234 792291
60092 792291 790222 789694 791075 794162 798711 804839 812696 822022 832222 842666 852830 862376 871157 878960
60078 878960 885219 889256 890736 889592 885647 878770 869403 858392 846201 832807 818526 804392 791413
60065 791413 779840 769419 759967 751431 743780 737094 731446 726454 721410 716189 711557 708159 705585 702956
$$ packed form
60166F95415K904K191J203P07R80J563J845J580Q87L6o74r25m49P49K168L013
60150G13193K878K193J800K125K964L980N095O341P630Q751R536R979J0282J0764
60136G97511J1536J2355J2890J2948J2278J0529P770M773K246Pk487n036o761
60123H70559p298p132o680n716m039k055m04N60P90M70J66L81Q08O04l27j014
60107H39673q10m02q64k179l377l807l684l559l785m357m895m887m284l549k943
60092G92291k069n28J381L087M549O128P857R326J0200J0444J0164R546Q781P803
60078H78960O259M037J480j144l945o877r367j1011j2191j3394j4281j4134j2979
60065G91413j1573j0421r452q536p651o686n648m992n044n221m632l398k574k629
$$ plain form
60051 702956 700150 697860 696561 696008 695812 696085 697349 700011 704016 708951 714511 720814 728005 735598 742653
60036 742653 748788 754445 759780 763832 765506 765056 763782 762234 759517 754561 747409 738909 729627 719563
60022 719563 708569 696485 683013 668027 652191 636938 623524 612206 602481 594023 587037 581668
60010 581668 577432 573628 570190 567793 567027 567747 569343 571358 573723 576603 580207 584566 589326 593896 597868
59995 597868 601142 603679 605524 607183 609480 612631 615829 618201 619892 621714 623953 626076 627579 628518
59981 628518 629137 629479 629492 629041 627614 624434 619196 612457 605191 598192 592008 586988 583026 579547 576123
59966 576123 572949 570407 568367 566330 564151 562176 560625 559258 557889 556876 556774 557629 558893 560008 560846
59951 560846 561571 562305 563082 563993 565161 566555 567920 569007 569831 570609 571351 571543 570416 567629 563621 559143
$$ packed form
60051G02956k806k290j299n53j96K73J264K662M005M935N560O303P191P593P055
60036G42653O135N657N335M052J674m50j274j548k717m956p152q500r282j0064
60022G19563j0994j2084j3472j4986j5836j5253j3414j1318r725q458o986n369
60010E81668m236l804l438k397p66P20J596K015K365K880L604M359M760M570L972
59995E97868L274K537J845J659K297L151L198K372J691J822K239K123J503R39
59981F28518O19L42J3m51j427l180n238o739p266o999o184n020l962l479l424
59966E76123l174k542k040k037k179j975j551j367j369j013j02Q55J264J115Q38
59951E60846P25P34P77R11J168J394J365J087Q24P78P42J92j127k787m008m478
$$ plain form
59935 559143 554474 549361 543777 538432 534270 531612 530011 528866 527889 527022 526294 525899 526133 527028 528178 529072
59919 529072 529536 529715 529798 529881 529993 530076 530065 530200 531192 533753 537888 542834 547864 552939 558408 564158 569402
59902 569402 573410 576244 578589 581008 583560 586111 588740 591740 595408 599931 605306 611307 617663 624388
59888 624388 631736 639665 647605 654988 661848 668659 675711 682954 690357 698081 706261 714798 723294 730993
59874 730993 736992 740827 742651 742494 739634 733388 724435 714530 704737 694690 683938 673189 663521 654872
59860 654872 646232 637205 628645 621699 616828 613930 612825 613316 615113 618100 622592 629054 637621 648023
59846 648023 659894 672930 686714 700538 713501 724695 733299 738712 740980 741067 740402 739999 740248 741585
59832 741585 744750 749885 755700 760262 762551 762711 760885 756652 749839 741159 731575 721450 710660 699022
$$ packed form
59935E59143m669n113n584n345m162k658j601j145r77q67p28l95K34Q95J150Q94
59919E29072M64J79Q3Q3J12Q3j1J35R92K561M135M946N030N075N469N750N244
59902E69402M008K834K345K419K552K551K629L000L668M523N375O001O356O725
59888F24388P348P929P940P383O860O811P052P243P403P724Q180Q537Q496P699
59874G30993N999L835J824j57k860o246q953r905r793j0047j0752j0749r668q649
59860F54872q640r027q560o946m871k898j105M91J797K987M492O462Q567J0402
59846F48023J1871J3036J3784J3824J2963J1194Q604N413K268Q7o65m03K49J337
59832G41585L165N135N815M562K289J60j826m233o813q680r584j0125j0790j1638
$$ plain form
59818 699022 686193 671779 656247 641424 629292 620240 612977 606139 599526 593810 589521 586567 584490
59805 584490 583000 582274 582699 584261 586322 588044 588809 588216 586125 583008 579805 576948 573806 569567 564445
59790 564445 559505 555468 552269 549667 547687 546434 545957 546332 547409 548495 548840 548522 548383 548982 550045 550982
59774 550982 551475 551484 551256 551425 552548 554296 555707 556469 557310 558762 560257 561155 562049 564130 567511 571083 574081
59757 574081 576917 580256 584011 587634 590832 593411 594887 594918 594087 593652 594390 596045 598036 600309 603173
59742 603173 606515 609578 611609 612535 612893 613193 613459 613402 612964 612534 612480 612539 612002 610682 609459 609525 611151 613530
59724 613530 615777 617660 619288 620581 621457 622228 623365 624943 626741 628868 631809 635674 639699 642831 644713
59709 644713 645874 646977 648167 649276 650371 651711 653132 653876 653375 651945 650350 648791 646867 644617 642993
$$ packed form
59818F99022j2829j4414j5532j4823j2132r052p263o838o613n716m289k954k077
59805E84490j490p26M25J562K061J722P65n93k091l117l203k857l142m239n122
59790E64445m940m037l199k602j980j253m77L75J077J086L45l18j39N99J063R37
59774E50982M93Rk28J69J123J748J411P62Q41J452J495Q98Q94K081L381L572K998
59757E74081K836L339L755L623L198K579J476L1q31m35P38J655J991K273K864
59742F03173L342L063K031R26L58L00K66n7m38m30n4N9n37j320j223O6J626K379
59724F13530K247J883J628J293Q76P71J137J578J798K127K941L865M025L132J882
59709F44713J161J103J190J109J095J340J421P44n01j430j595j559j924k250j624
$$ plain form
59694 642993 642892 644026 645208 645605 645261 644422 642918 640566 637912 636111 635913 636988 638456 639939 641728
59679 641728 643906 645814 646704 646499 645359 642903 638698 633478 628903 625755 623171 620116 616896 614518 613179
59664 613179 612264 611523 611331 611857 612778 613819 614853 615438 615076 614255 614510 616966 621243 626235 631489 637234
59648 637234 643263 648573 652334 654794 656826 658765 659993 659615 657227 652965 647266 640933 635206 631128
59634 631128 628801 627640 627443 628693 631606 635402 638900 641529 643461 645194 647385 650701 655212 660065
59620 660065 664183 667122 668889 669285 668065 665518 662212 658267 653602 648956 645921 645668 648089 652376 657918
59605 657918 664391 671417 678574 685510 691732 696461 699000 699253 697762 695210 691885 687590 682172 676094
59591 676094 670198 664797 659424 653780 648443 644040 640067 635351 629638 623916 619064 614961 611204 607905
$$ packed form
59694F42993j01J134J182L97l44q39j504k352k654j801j98J075J468J483J789
59679F41728K178J908Q90k05j140k456m205n220m575l148k584l055l220k378j339
59664F13179r15p41j92N26R21J041J034N85l62q21K55K456M277M992N254N745
59648F37234O029N310L761K460K032J939J228l78k388m262n699o333n727m078
59634F31128k327j161j97J250K913L796L498K629J932J733K191L316M511M853
59620F60065M118K939J767L96j220k547l306l945m665m646l035k53K421M287N542
59605F57918O473P026P157O936O222M729K539K53j491k552l325m295n418o078
59591F76094n896n401n373n644n337m403l973m716n713n722m852m103l757l299
$$ plain form
59577 607905 605242 602788 599966 596955 594616 593503 593319 593400 593519 594152 595960 598928 602084 604332 605635
59562 605635 607160 610152 614803 620289 625653 630437 634554 637863 640118 641420 642550 644425 647189 650199
59548 650199 653047 656128 659926 664257 668795 673906 680277 687938 696495 706262 718509 734457 754406
59535 754406 777553 801859 824292 842279 855374 865009 872577 878618 883942 890402 899765 912331 927171
59522 927171 943228 959665 975595 990063 1002161 1010921 1015473 1015558 1011464 1003233 990517 973577 953837
59509 953837 932840 911133 888810 866756 846592 829398 814999 802541 791418 781661 773702 767783
59497 767783 763533 760357 758256 757835 759260 761740 764431 767424 771335 776320 782176 789153 797864 808231
59483 808231 819180 829808 840613 853246 869054 888031 909160 931592 955197 979916 1004855
$$ packed form
59577F07905k663k454k822l011k339j113j84Q1J19O33J808K968L156K248J303
59562F05635J525K992M651N486N364M784M117L309K255J302J130J875K764L010
59548F50199K848L081L798M331M538N111O371P661Q557R767J2247J5948J9949
59535G54406K3147K4306K2433J7987J3095R635P568O041N324O460R363J2566J4840
59522I27171J6057J6437J5930J4468J2098Q760M552Q5m094q231j2716j6940j9740
59509I53837k0997k1707k2323k2054k0164j7194j4399j2458j1123r757p959n919
59497G67783m250l176k101m21J425K480K691K993L911M985N856O977Q711J0367
59483H08231J0949J0628J0805J2633J5808J8977K1129K2432K3605K4719K4939
$$ plain form
59472 1004855 1028293 1048468 1064178 1074968 1081285 1084414 1085762 1086225 1086602 1088352 1093151 1101733 1113985
59459 1113985 1130341 1152197 1180588 1215224 1255261 1300223 1349573 1402146 1456991 1514547 1576206
59448 1576206 1642586 1712269 1781649 1845310 1896775 1929705 1939157 1922649 1881132 1819198 1743484
59437 1743484 1660138 1573868 1489041 1410176 1340345 1279763 1226832 1180157 1139032 1102873 1071456
59426 1071456 1045517 1026128 1013548 1007334 1007248 1013285 1025016 1041740 1063094 1088626 1116920 1145964
59414 1145964 1174501 1202323 1229257 1254395 1276076 1291877 1298832 1294669 1279218 1254224 1221991 1184826
59402 1184826 1145595 1107826 1074948 1049634 1033226 1024563 1019385 1012258 999889 982263 960721 936052
59390 936052 908792 880241 852291 826589 804211 785515 769808 755725 742593 731046 721890 714837
$$ packed form
59472A004855K3438K0175J5710J0790O317L129J348M63L77J750M799Q582J2252
59459A113985J6356K1856K8391L4636M0037M4962M9350N2573N4845N7556O1659
59448A576206O6380O9683O9380O3661N1465L2930R452j6508m1517o1934p5714
59437A743484q3346q6270q4827p8865o9831o0582n2931m6675m1125l6159l1417
59426A071456k5939j9389j2580o214q6O037J1731J6724K1354K5532K8294K9044
59414A145964K8537K7822K6934K5138K1681J5801O955m163j5451k4994l2233l7165
59402A184826l9231l7769l2878k5314j6408q663n178p127j2369j7626k1542k4669
59390I36052k7260k8551k7950k5702k2378j8696j5707j4083j3132j1547r156p053
$$ plain form
59378 714837 708980 704141 700915 699381 698501 697093 695078 693478 693318 694713 697045 699825 703131 707257 712191
59363 712191 717635 723375 729485 736373 744842 755807 769564 785495 802838 821670 842836 867114
59351 867114 894795 925865 960091 996957 1035911 1076546 1118160 1159351 1198586 1235128 1268892
59340 1268892 1299438 1325620 1346135 1359871 1365770 1363058 1351781 1332682 1306474 1273768 1235752 1194265
59328 1194265 1150903 1106567 1062074 1018657 977486 939091 903635 871442 842914 818071 796465
59317 796465 777552 761051 747004 735480 726180 718541 712322 707724 704604 701985 698989 696051 694517
59304 694517 695164 697772 702139 708630 717513 728505 741345 756286 773585 792713 812118 829452 842104
59291 842104 848342 848283 843473 835375 824740 812362 799621 787961 778411 771904 769405 771203 776568 784565
$$ packed form
59378G14837n857m839l226j534q80j408k015j600j60J395K332K780L306M126M934
59363G12191N444N740O110O888Q469J0965J3757J5931J7343J8832K1166K4278
59351H67114K7681L1070L4226L6866L8954M0635M1614M1191L9235L6542L3764
59340A268892L0546K6182K0515J3736N899k712j1277j9099k6208l2706l8016m1487
59328A194265m3362m4336m4493m3417m1171l8395l5456l2193k8528k4843k1606
59317G96465j8913j6501j4047j1524r300p639o219m598l120k619k996k938j534
59304F94517O47K608M367O491Q883J0992J2840J4941J7299J9128J9405J7334J2652
59291H42104O238n9m810q098j0635j2378j2741j1660r550o507k499J798N365P997
$$ plain form
59277 784565 794900 807721 823125 841333 862829 887718 915160 943855 972842 1001391 1028399
59266 1028399 1052482 1072666 1088614 1100133 1106763 1107941 1103454 1093721 1079611 1061892 1040911 1016997
59254 1016997 991100 964802 939723 917103 897745 881863 868970 858411 850097 844423 841540 841236
59242 841236 843500 848593 856452 866584 878699 892818 908580 925118 941937 959263 976954 993476
59230 993476 1006469 1014229 1016479 1014040 1007940 998571 985477 968222 947396 924368 900138 875123
59218 875123 850059 826204 804284 784040 765274 748562 734377 722135 710800 699966 689796
59207 689796 680466 672305 665942 661573 658398 655481 652836 650954 649579 647851 645563 643496 642385 642152
59193 642152 642272 642336 642064 641209 639807 638401 637854 638832 641337 644736 648371 652151 656352 661039 666222 672523
$$ packed form
59277G84565J0335J2821J5404J8208K1496K4889K7442K8695K8987K8549K7008
59266A028399K4083K0184J5948J1519O630J178m487r733j4110j7719k0981k3914
59254A016997k5897k6298k5079k2620j9358j5882j2893j0559q314n674k883l04
59242H41236K264N093P859J0132J2115J4119J5762J6538J6819J7326J7691J6522
59230I93476J2993P760K250k439o100r369j3094j7255k0826k3028k4230k5015
59218H75123k5064k3855k1920k0244j8766j6712j4185j2242j1335j0834j0170
59207F89796r330q161o363m369l175k917k645j882j375j728k288k067j111k33
59193F42152J20O4k72q55j402j406n47R78K505L399L635L780M201M687N183O301
$$ plain form
59177 672523 680951 691708 703798 716095 728289 740572 753257 767285 784290 805267 829456 855150
59165 855150 881233 907276 932656 956418 977795 996145 1010573 1020348 1025496 1026350 1022761 1014457 1001972
59152 1001972 986427 968452 948120 925893 902878 880078 858051 837300 818248 800683 783921
59141 783921 767732 752533 738486 725061 711827 699201 688069 678964 671866 666479 662406 659273
59129 659273 656925 655462 655063 655839 657844 661021 665187 670178 675959 682520 689907 698432 708454 719733
59115 719733 731448 743263 755883 770013 785131 799936 813696 826485 838490 849907 861377
59104 861377 873536 886059 897859 908224 917017 923882 928368 930992 933113 935278 936525 935834 933478
59091 933478 930455 927342 924317 921613 919167 916341 912715 908750 904873 900275 893461 883846 872045 858717
$$ packed form
59177F72523Q428J0757J2090J2297J2194J2283J2685J4028J7005K0977K4189K5694
59165H55150K6083K6043K5380K3762K1377J8350J4428R775N148Q54l589q304j2485
59152A001972j5545j7975k0332k2227k3015k2800k2027k0751j9052j7565j6762
59141G83921j6189j5199j4047j3425j3234j2626j1132r105p098n387m073l133
59129F59273k348j463l99P76K005L177M166M991N781O561P387Q525J0022J1279
59115G19733J1715J1815J2620J4130J5118J4805J3760J2789J2005J1417J1470
59104H61377J2159J2523J1800J0365Q793O865M486K624K121K165J247o91k356
59091I33478l023l113l025k704k446k826l626l965l877m598o814r615j1801j3328
$$ plain form
59077 858717 844034 828374 812624 797396 782575 768129 754842 743672 734631 726870 719742 713279
59065 713279 707593 702362 697200 692259 688067 684866 682368 680128 677894 675561 672977 670010 666698 663256
59051 663256 659969 657070 654623 652432 650145 647530 644626 641704 639173 637451 636687 636566 636564 636431 636234 636050
59035 636050 635994 636532 638289 641327 645061 649205 654348 661183 669497 678435 687585 697281 708012 719981
59021 719981 733203 747472 762205 776742 790942 805088 819059 831906 842428 850013 854864 857687
59009 857687 859311 860442 861613 863356 866366 871272 878212 886801 896616 907665 920395 935293 952464
58996 952464 971410 991147 1010624 1029192 1046796 1063773 1080260 1095567 1108156 1116525 1120111 1119128
58984 1119128 1113652 1103422 1088760 1071244 1053054 1035822 1020200 1006228 993791 982983 974337 968500
$$ packed form
59077H58717j4683j5660j5750j5228j4821j4446j3287j1170r041p761p128o463
59065G13279n686n231n162m941m192l201k498k240k234k333k584k967l312l442
59051F63256l287k899k447k191k287k615k904k922k531j722p64j21kj33j97j84
59035F36050n6N38J757L038L734M144N143O835Q314Q938R150R696J0731J1969
59021G19981J3222J4269J4733J4537J4200J4146J3971J2847J0522P585M851K823
59009H57687J624J131J171J743L010M906O940Q589R815J1049J2730J4898J7171
58996I52464J8946J9737J9477J8568J7604J6977J6487J5307J2589Q369L586r83
58984A119128n476j0230j4662j7516j8190j7232j5622j3972j2437j0808q646n837
$$ plain form
58972 968500 965470 964476 964939 967225 972078 979575 989116 1000261 1013094 1027783 1044128 1061497 1078848
58959 1078848 1094908 1108640 1119574 1127486 1131880 1131981 1127191 1117370 1102899 1084660 1063819 1041379
58947 1041379 1018082 994765 972491 952194 934612 920681 911394 906787 905500 905786 906647 907577 907715
58934 907715 905871 901187 893302 882237 868611 853622 838237 822674 807135 792532 779801 768973
58922 768973 759721 752395 747550 744720 742685 740886 739663 739259 739641 741376 745524 752311 760764 769945 779731
58907 779731 790187 801251 813525 828459 846930 868171 890687 913781 937621 962260 987290
58896 987290 1012259 1036914 1061140 1085127 1109662 1136102 1166001 1200636 1240489 1285061 1333393
58885 1333393 1384751 1438327 1492214 1543202 1588056 1624881 1653216 1673109 1684258 1685660 1675913 1654168
$$ packed form
58972I68500l030r94M63K286M853P497R541J1145J2833J4689J6345J7369J7351
58959A078848J6060J3732J0934P912M394J01m790r821j4471j8239k0841k2440
58947A041379k3297k3317k2274k0297j7582j3931r287m607j287K86Q61R30J38
58934I07715j844m684p885j1065j3626j4989j5385j5563j5539j4603j2731j0828
58922G68973r252p326m845k830k035j799j223m04L82J735M148O787Q453R181R786
58907G79731J0456J1064J2274J4934J8471K1241K2516K3094K3840K4639K5030
58896I87290K4969K4655K4226K3987K4535K6440K9899L4635L9853M4572M8332
58885A333393N1358N3576N3887N0988M4854L6825K8335J9893J1149J402r747k1745
$$ plain form
58873 1654168 1621033 1578357 1528153 1472093 1412187 1351382 1292874 1238788 1189701 1145353 1105614
58862 1105614 1070660 1040372 1013866 989941 967957 947893 929444 911697 894097 877215 861956
58851 861956 848382 835992 824836 815481 807930 801373 795067 788844 782719 776715 771085 766049 761103
58838 761103 755287 748266 740559 732645 724563 716555 709328 703290 698097 693267 688776 684859 681771 680013
58824 680013 680219 682453 686049 690388 695384 701038 707126 713586 720678 728344 735827 742290 747403 751103
58810 751103 753194 753539 752323 749850 746411 742545 739007 736148 733581 730611 726841 722369 717791 714021
58796 714021 711648 710370 709477 708869 709068 710250 711965 713968 716637 720378 725172 730945 737798 745622 754032
58781 754032 762802 771825 780562 788260 794901 801140 807065 811823 814863 816796 818547 820361 822047 823485
$$ packed form
58873A654168l3135m2676n0204n6060n9906o0805n8508n4086m9087m4348l9739
58862A105614l4954l0288k6506k3925k1984k0064j8449j7747j7600j6882j5259
58851H61956j3574j2390j1156r355p551o557o306o223o125o004n630n036m946
58838G61103n816p021p707p914q082q008p227o038n193m830m491l917l088j758
58824F80013K06K234L596M339M996N654O088O460P092P666P483O463N113L700
58810G51103K091L45j216k473l439l866l538k859k567k970l770m472m578l770
58796G14021k373j278q93o08J99J182J715K003K669L741M794N773O853P824Q410
58781G54032Q770R023Q737P698O641O239N925M758L040J933J751J814J686J438
$$ plain form
58767 823485 824417 824412 823577 822594 821596 819771 816695 813264 810557 808593 807119 806911 809107 813620 819383 825962
58751 825962 833801 842858 852103 860680 868716 876565 883974 890582 896817 903687 911738 920562 929259 937066
58737 937066 943561 948702 953029 957589 963199 969765 976776 984490 993932 1005412 1017820 1030018 1042183
58724 1042183 1054818 1067013 1077015 1084374 1090270 1095679 1100498 1104733 1109219 1114602 1120594 1126819 1133479
58711 1133479 1140591 1147402 1153170 1157762 1160969 1161939 1159886 1154687 1146351 1134685 1120020 1103376 1085237
58698 1085237 1064910 1041777 1016524 990564 965042 941028 919718 901446 885231 870198 856812
58687 856812 845751 836277 826839 816762 806233 795008 782494 769073 756248 745262 736290 729030
58675 729030 723478 719998 719027 720654 724227 728759 734104 741268 751112 763313 777245 793277 812191
$$ packed form
58767H23485R32nq35r83r98j825l076l431k707j964j474k08K196M513N763O579
58751H25962P839R057R245Q577Q036P849P409O608O235O870Q051Q824Q697P807
58737I37066O495N141M327M560N610O566P011P714R442J1480J2408J2198J2165
58724A042183J2635J2195J0002P359N896N409M819M235M486N383N992O225O660
58711A133479P112O811N768M592L207R70k053n199q336j1666j4665j6644j8139
58698A085237k0327k3133k5253k5960k5522k4014k1310j8272j6215j5033j3386
58687H56812j1061r474r438j0077j0529j1225j2514j3421j2825j0986q972p260
58675G29030n552l480r71J627L573M532N345P164R844J2201J3932J6032J8914
$$ plain form
58662 812191 833598 855755 876801 895438 910582 921212 926837 927783 925115 920432 915211 909826 903482
58649 903482 895563 886646 877773 869308 861164 853667 847459 842837 839859 838728 839450 841536 844727 849647
58635 849647 856954 866105 875661 884520 892185 898117 901749 903064 902473 900187 896341 891762 887968 886276
58621 886276 887157 890483 896218 904883 917336 933907 954006 977097 1003728 1034462 1067695 1099723
58609 1099723 1127405 1149762 1166715 1177752 1182712 1182578 1178394 1170392 1159133 1146370 1133563 1120548
58597 1120548 1106945 1093913 1083063 1074440 1067141 1061281 1057839 1057011 1058282 1061755 1068023 1077038 1088452
58584 1088452 1102692 1120283 1140355 1161200 1182023 1202778 1222617 1240043 1254458 1266150 1274934
58573 1274934 1280422 1283566 1286330 1289601 1292831 1295989 1300450 1307561 1317512 1329972 1344831 1362022 1381475
$$ packed form
58662H12191K1407K2157K1046J8637J5144J0630N625R46k668m683n221n385o344
58649I03482p919q917q873q465q144p497o208m622k978j131P22K086L191M920
58635H49647P307R151R556Q859P665N932L632J315n91k286l846m579l794j692
58621H86276Q81L326N735Q665J2453J6571K0099K3091K6631L0734L3233L2028
58609A099723K7682K2357J6953J1037M960j34m184q002j1259j2763j2807j3015
58597A120548j3603j3032j0850q623p299n860l442q28J271L473O268R015J1414
58584A088452J4240J7591K0072K0845K0823K0755J9839J7426J4415J1692Q784
58573A274934N488L144K764L271L230L158M461P111R951J2460J4859J7191J9453
$$ plain form
58560 1381475 1403335 1427334 1451946 1475034 1495176 1511412 1522114 1525692 1522570 1515193 1505798 1495147
58548 1495147 1483356 1470701 1457363 1443472 1429562 1416049 1402244 1386874 1369570 1350854 1330912
58537 1330912 1309569 1287388 1265522 1244551 1224633 1206562 1191336 1178871 1168645 1161406 1158506 1159511
58525 1159511 1162365 1166240 1172416 1181900 1193868 1207075 1221150 1235726 1249753 1262488 1273933 1283658
58513 1283658 1290538 1294338 1296305 1297457 1297580 1296654 1295878 1296261 1297357 1298466 1300144 1303496 1308609 1314598 1320594
58498 1320594 1325984 1330329 1333677 1336444 1338563 1339344 1338532 1336731 1334394 1331151 1326522 1320503 1313149 1304469
58484 1304469 1295223 1286972 1280887 1277158 1275862 1277564 1282712 1291084 1302043 1314529 1326743 1336796 1343901
58471 1343901 1348057 1348568 1344033 1333976 1319360 1301347 1280833 1259373 1239053 1220860 1204376 1189555
$$ packed form
58560A381475K1860K3999K4612K3088K0142J6236J0702L578l122p377r395j0651
58548A495147j1791j2655j3338j3891j3910j3513j3805j5370j7304j8716j9942
58537A330912k1343k2181k1866k0971j9918j8071j5226j2465j0226p239k900J005
58525A159511K854L875O176R484J1968J3207J4075J4576J4027J2735J1445R725
58513A283658O880L800J967J152J23r26p76L83J096J109J678L352N113N989N996
58498A320594N390M345L348K767K119P81q12j801k337l243m629o019p354q680
58484A304469r246q251o085l729j296J702N148Q372J0959J2486J2214J0053P105
58471A343901M156N11m535j0057j4616j8013k0514k1460k0320j8193j6484j4821
$$ plain form
58459 1189555 1177525 1169052 1163538 1160268 1159530 1161739 1166387 1172594 1179789 1187279 1193943 1198909 1201741 1201682
58445 1201682 1197746 1190011 1179952 1169076 1158105 1147669 1138659 1131526 1126262 1123344 1123575 1126766 1131795
58432 1131795 1138235 1146611 1156774 1167552 1178518 1190683 1204855 1220591 1237338 1255257 1274264 1293479
58420 1293479 1312174 1330078 1346296 1359262 1368259 1373741 1375903 1374536 1370638 1366261 1361908 1355716 1346129
58407 1346129 1333834 1320237 1305709 1290415 1275351 1261411 1248647 1237459 1229235 1224772 1223201 1223321
58395 1223321 1224808 1227348 1229891 1231655 1232704 1232809 1231096 1227495 1223159 1218776 1213870 1208349 1203088 1198320
58381 1198320 1193280 1188223 1184904 1184060 1184315 1184656 1186008 1189109 1192738 1195571 1198127 1201393 1205123 1208934 1213600
58366 1213600 1219871 1227469 1236505 1248243 1263168 1279899 1297311 1315936 1335832 1354939 1371242 1384904
$$ packed form
58459A189555j2030q473n514l270p38K209M648O207P195P490O664M966K832n9
58445A201682l936p735j0059j0876j0971j0436r010p133n264k918K31L191N029
58432A131795O440Q376J0163J0778J0966J2165J4172J5736J6747J7919J9007J9215
58420A293479J8695J7904J6218J2966Q997N482K162j367l898m377m353o192r587
58407A346129j2295j3597j4528j5294j5064j3940j2764j1188q224m463j571J20
58395A223321J487K540K543J764J049J05j713l601m336m383m906n521n261m768
58381A198320n040n057l319q44K55L41J352L101L629K833K556L266L730L811M666
58366A213600O271P598R036J1738J4925J6731J7412J8625J9896J9107J6303J3662
$$ plain form
58354 1384904 1396615 1405543 1410719 1412887 1413225 1411682 1408242 1404321 1401228 1398734 1396743 1396741 1399846 1405082 1411466
58339 1411466 1420211 1432953 1449284 1467861 1488397 1510658 1533122 1554757 1576662 1599858 1622823
58328 1622823 1643292 1661157 1677552 1692362 1704740 1714929 1723625 1730616 1735831 1740551 1746025 1752209
58316 1752209 1759302 1768785 1781315 1795467 1810286 1827076 1846821 1868043 1889373 1912020 1937233 1963380
58304 1963380 1988209 2012111 2036513 2060859 2083797 2105705 2127481 2148654 2169190 2191219 2216262
58293 2216262 2242598 2268020 2293152 2319334 2345566 2370736 2396722 2425860 2457169 2488421 2520081
58282 2520081 2553785 2588763 2623369 2658528 2696220 2736119 2777176 2820917 2869836 2924169 2983451
58271 2983451 3049098 3121812 3198506 3275599 3353496 3434183 3516786 3599609 3684247 3773008 3864257
$$ packed form
58354A384904J1711Q928N176K168L38j543l440l921l093k494j991kL105N236O384
58339A411466Q745J2742J6331J8577K0536K2261K2464K1635K1905K3196K2965
58328A622823K0469J7865J6395J4810J2378J0189Q696O991N215M720N474O184
58316A752209P093R483J2530J4152J4819J6790J9745K1222K1330K2647K5213K6147
58304A963380K4829K3902K4402K4346K2938K1908K1776K1173K0536K2029K5043
58293B216262K6336K5422K5132K6182K6232K5170K5986K9138L1309L1252L1660
58282B520081L3704L4978L4606L5159L7692L9899M1057M3741M8919N4333N9282
58271B983451O5647P2714P6694P7093P7897Q0687Q2603Q2823Q4638Q8761R1249
$$ plain form
58260 3864257 3954827 4045196 4137638 4231138 4323053 4414151 4507269 4602526 4698576 4796894 4900110
58249 4900110 5007863 5119026 5235962 5361674 5494958 5633536 5779558 5936432 6102821
58240 6102821 6275899 6458229 6654903 6865979 7088344 7323025 7573780 7840398 8120471
58231 8120471 8416174 8732278 9069282 9425558 9804340 10211232 10647050 11110773 11607168
58222 11607168 12143357 12720490 13337546 14000724 14719996 15499450 16341144 17255644 18258047
58213 18258047 19356573 20556846 21875040 23335087 24956242 26757094 28769596 31035977
58205 31035977 33596086 36494682 39800130 43601660 47994019 53085262 59016900 65955188
58197 65955188 74065109 83515825 94508897 107277493 122067773 139160231 158909734
$$ packed form
58260C864257R0570R0369R2442R3500R1915R1098R3118R5257R6050R8318J03216
58249D900110J07753J11163J16936J25712J33284J38578J46022J56874J66389
58240F102821J73078J82330J96674K11076K22365K34681K50755K66618K80073
58231H120471K95703L16104L37004L56276L78782M06892M35818M63723M96395
58222A1607168N36189N77133O17056O63178P19272P79454Q41694R14500J002403
58213A8258047J098526J200273J318194J460047J621155J800852K012502K266381
58205C1035977K560109K898596L305448L801530M392359N091243N931638O938288
58197F5955188Q109921R450716J0993072J2768596J4790280J7092458J9749503
$$ plain form
58190 158909734 181716250 207914193 237625559 270516301 305373581 339730294 370050276
58183 370050276 392679578 405041513 406275168 397055623 379014502 354250292 325026262
58176 325026262 293528165 261649248 230859097 202157420 176086524 152822492 132336510
58169 132336510 114525153 99233380 86229765 75228864 65948142 58129671 51528866
58162 51528866 45922599 41133794 37028525 33491014 30419084 27738174 25396527 23343710
58154 23343710 21527887 19911130 18469641 17177953 16007136 14938513 13964953 13077271
58146 13077271 12261374 11509267 10820806 10192927 9617214 9088820 8607820 8170752 7769866
58137 7769866 7401297 7065169 6756998 6467451 6191401 5929501 5680662 5440960 5210528
$$ packed form
58190A58909734K2806516K6197943K9711366L2890742L4857280L4356713L0319982
58183C70050276K2629302J2361935J233655r219545j8041121k4764210k9224030
58176C25026262l1498097l1878917l0790151k8701677k6070896k3264032k0485982
58169A32336510j7811357j5291773j3003615j1000901r280722p818471o600805
58162E1528866n606267m788805m105269l537511l071930k680910k341647k052817
58154B3343710j815823j616757j441489j291688j170817j068623r73560q87682
58146A3077271q15897p52107o88461o27879n75713n28394m81000m37068m00886
58137G769866l68569l36128l08171k89547k76050k61900k48839k39702k30432
$$ plain form
58128 5210528 4993742 4791547 4600384 4419037 4249547 4090933 3938937 3792725 3655347
58119 3655347 3527013 3404249 3286111 3174805 3069623 2966638 2865313 2769341 2680084 2594961
58109 2594961 2513053 2436368 2364558 2294211 2224779 2159885 2101466 2047639 1997445 1952642 1913558
58098 1913558 1878023 1845716 1818976 1798075 1780175 1763932 1750587 1739438 1726925 1711649 1696005
58087 1696005 1681485 1666449 1649806 1632742 1615399 1595814 1573539 1550612 1527663 1502883 1476064
58076 1476064 1449872 1425666 1401720 1377004 1353144 1331095 1309353 1287074 1265805 1246581 1228287
58065 1228287 1210308 1193809 1179117 1164752 1150277 1137270 1126350 1116128 1106071 1097324 1089601 1080462
58053 1080462 1068978 1057102 1046126 1034807 1022321 1010056 998992 988211 977479 968357 961167 953685
$$ packed form
58128E210528k16786k02195j91163j81347j69490j58614j51996j46212j37378
58119C655347j28334j22764j18138j11306j05182j02985j01325r5972q9257q5123
58109B594961q1908p6685p1810p0347o9432o4894n8419n3827n0194m4803l9084
58098A913558l5535l2307k6740k0901j7900j6243j3345j1149j2513j5276j5644
58087A696005j4520j5036j6643j7064j7343j9585k2275k2927k2949k4780k6819
58076A476064k6192k4206k3946k4716k3860k2049k1742k2279k1269j9224j8294
58065A228287j7979j6499j4692j4365j4475j3007j0920j0222j0057q747p723r139
58053A080462j1484j1876j0976j1319j2486j2265j1064j0781j0732r122p190p482
$$ plain form
58041 953685 944516 935174 927139 919507 911260 903313 896491 889819 882659 876287 871519 866820 860551 853195
58027 853195 845752 837870 829190 820722 813311 806388 799577 793747 789165 784546 779351 775144 773107 771963
58013 771963 769900 766968 764119 761458 758836 756709 755051 752789 749509 746313 744023 742054 740016 738593
57999 738593 737760 735965 732409 728546 726075 725059 725046 726259 728376 729963 730485 731296 733353 735629 737054
57984 737054 738216 739726 740668 740241 739221 738171 735867 731301 725717 720816 716327 711256 706279 702806 700513
57969 700513 697683 693466 688317 682917 678013 674572 672818 671846 671277 672245 675546 679883 683330 685543 687182
57954 687182 688125 687773 686273 683978 680420 675247 669539 664774 661000 657199 652971 648815 645353 643293 643457
57939 643457 645711 648499 650418 651724 653548 656483 660771 666798 674244 681585 687548 692261 696035 698076
$$ packed form
58041I53685r169r342q035p632q247p947o822o672p160o372m768m699o269p356
58027H53195p443p882q680q468p411o923o811n830m582m619n195m207k037j144
58013G71963k063k932k849k661k622k127j658k262l280l196k290j969k038j423
57999G38593q33j795l556l863k471j016j3J213K117J587N22Q11K057K276J425
57984G37054J162J510R42m27j020j050k304m566n584m901m489n071m977l473k293
57969G00513k830m217n149n400m904l441j754r72n69R68L301M337L447K213J639
57954F87182R43l52j500k295l558n173n708m765l774l801m228m156l462k060J64
57939F43457K254K788J919J306J824K935M288O027P446P341N963M713L774K041
$$ plain form
57925 698076 697650 695533 692873 689384 683977 676571 667983 658607 648507 638255 628449 618877 609217 600051
57911 600051 592130 585260 579041 574068 571196 570124 569919 570316 571246 571562 569686 565424 560043 554731 549960
57896 549960 545990 542896 540197 537425 535025 533904 534306 535869 538474 542200 546603 550837 554424 557355
57882 557355 559674 561471 562997 564365 565381 565923 565965 565040 562452 558431 554185 550333 546201 541265 536259
57867 536259 532100 528642 525304 522083 519065 515866 512493 509917 508820 508601 508595 509392 511846 515554 519471
57852 519471 523323 527317 531132 534419 537721 541720 546063 549981 553504 556972 559977 561976 563377 564752
57838 564752 565452 564303 561323 557602 553823 550112 546949 544882 543501 541911 540092 538663 537392 535148
57824 535148 531450 527102 523201 520301 518576 518053 518549 519833 521706 523601 524661 524717 524614 524803 524271 521717
$$ packed form
57925F98076m26k117k660l489n407p406q588r376j0100j0252r806r572r660r166
57911F00051p921o870o219m973k872j072k05L97R30L16j876m262n381n312m771
57896E49960l970l094k699k772k400j121M02J563K605L726M403M234L587K931
57882E57355K319J797J526J368J016N42M2r25k588m021m246l852m132m936n006
57867E36259m159l458l338l221l018l199l373k576j097k19oP97K454L708L917
57852E19471L852L994L815L287L302L999M343L918L523L468L005J999J401J375
57838E64752P00j149k980l721l779l711l163k067j381j590j819j429j271k244
57824E35148l698m348l901k900j725n23M96J284J873J895J060N6j03J89n32k554
$$ plain form
57808 521717 517252 511994 506441 500157 492683 483871 473828 463396 454137 446839 440441 433457 425995 419366
57794 419366 414198 410032 406385 403076 399849 396776 394699 394190 394427 394222 393822 394509 396714 399753 403197
57779 403197 407231 411719 416133 420457 425190 430451 436006 441940 448334 454410 459022 461856 463299 463490
57765 463490 462594 461627 461602 461977 461172 458618 455091 451137 446472 441021 435299 429602 424012 419329 416709 416027
57749 416027 415748 414842 413850 413690 414357 415233 415897 416144 415822 414929 413523 411528 409172 407350 406787 406970 406825
57732 406825 406292 406286 407138 408152 408791 409295 409915 410430 410706 410962 411358 411986 413237 415327 417488 418537 418304 417683
57714 417683 417261 416866 416445 416304 416252 415479 413606 411042 408202 405223 402612 401208 401207 402044 403420 405617 408568
57697 408568 411495 413796 415553 416971 418062 419039 420249 421500 422159 422093 421826 421786 422206 423724 427084 432123
$$ packed form
57808E21717m465n258n553o284p474q812j0043j0432r259p298o398o984p462o629
57794D19366n168m166l647l309l227l073k077n09K37k05m00O87K205L039L444
57779D03197M034M488M414M324M733N261N555N934O394O076M612K834J443J91
57765D63490q96r67k5L75q05k554l527l954m665n451n722n697n590m683k620o82
57749D16027k79r06r92j60O67Q76O64K47l22q93j406j995k356j822n63J83j45
57732D06825n33oQ52J014O39N04O20N15K76K56L96O28J251K090K161J049k33o21
57714D17683m22l95m21j41n2p73j873k564k840k979k611j404jQ37J376K197K951
57697D08568K927K301J757J418J091R77J210J251O59o6k67m0M20J518L360N039
$$ plain form
57681 432123 438096 445131 454329 466218 480291 496477 515971 540061 569188 603771 645042 694249
57669 694249 751659 816656 887484 959556 1024473 1072297 1095720 1092579 1065306 1018825 958857 891239
57657 891239 821782 755743 696646 645550 601840 564759 533988 509180 489641 474475 462531
57646 462531 452450 443382 435565 429543 424992 421053 417591 415216 414082 413573 413213 413013 412881 412531 412031
57631 412031 411646 411163 410201 409143 408779 409047 409176 409046 409256 409689 409320 407864 406468 406185 406768 407487 408302 409579
57613 409579 411322 413188 414722 415347 414721 413347 412145 411309 410308 408983 407760 406768 405808 405277 405848 407002
57597 407002 407214 406049 404819 404539 404468 403383 401163 398303 394926 391215 387963 385758 384221 382786 381538
57582 381538 380606 379551 378123 376903 376376 376055 375320 374487 374215 374385 374418 374276 374339 374674 375039 375307 375335 374806 373744
$$ packed form
57681D32123N973P035R198J1889J4073J6186J9494K4090K9127L4583M1271M9207
57669F94249N7410O4997P0828P2072O4917M7824K3423l141k7273m6481n9968o7618
57657H91239o9457o6039n9097n1096m3710l7081l0771k4808j9539j5166j1944
57646D62531j0081r068p817o022m551l939l462k375j134n09l60k00j32l50n00
57631D12031l85m83r62j058l64K68J29j30K10M33l69j456j396k83N83P19Q15J277
57613D09579J743J866J534O25o26j374j202q36j001j325j223r92r60n31N71J154
57597D07002K12j165j230k80p1j085k220k860l377l711l252k205j537j435j248
57582C81538r32j055j428j220n27l21p35q33k72J70L3j42O3L35L65K68K8n29j062
$$ plain form
57563 373744 372823 372721 373494 374853 376527 378082 379043 379621 380633 382348 384136 385579 387129 389182 391377
57548 391377 393379 395475 397778 399719 401000 402185 403548 404329 404100 404035 405611 408657 411839 414596 417437
57533 417437 420581 423514 425888 427918 429763 431194 432004 432324 432570 433329 435071 437632 440281 442611 444963
57518 444963 447698 450583 453228 455606 457767 459698 461896 465355 470290 475439 479270 481447 482651 483596
57504 483596 484752 486423 488363 489785 490328 490532 490889 491091 490738 490114 489629 489158 488580 488278 488435 488531 488240 488152
57486 488152 488857 490074 491462 493543 496829 500693 504074 506814 509469 512338 515448 518865 522178 524357
57472 524357 525098 525652 527338 529937 532555 535302 538839 542825 546176 548494 550141 551263 552011 553318 556115
57457 556115 559904 563227 565463 567244 569378 572387 576671 582012 587171 591126 594430 598287 602701 606795
$$ packed form
57563C73744r21j02P73J359J674J555R61N78J012J715J788J443J550K053K195
57548C91377K002K096K303J941J281J185J363P81k29o5J576L046L182K757K841
57533D17437L144K933K374K030J845J431Q10L20K46P59J742K561K649K330K352
57518D44963K735K885K645K378K161J931K198L459M935N149L831K177J204R45
57504D83596J156J671J940J422N43K04L57K02l53o24m85m71n78l02J57R6k91q8
57486D88152P05J217J388K081L286L864L381K740K655K869L110L417L313K179
57472E24357P41N54J686K599K618K747L537L986L351K318J647J122P48J307K797
57457E56115L789L323K236J781K134L009M284N341N159L955L304L857M414M094
$$ plain form
57443 606795 610569 614863 619741 624387 628594 632995 637724 642207 646433 651206 656852 662813 668719 674851
57429 674851 681298 687628 693548 699054 703938 708060 712049 716643 721444 725424 728633 732156 736402 740806
57415 740806 745367 751052 758241 766012 773446 780595 787770 794898 802020 809450 817052 824243 830990 837886
57401 837886 845053 852006 858807 866211 874399 882727 891125 900420 910767 920961 930066 938713 948033 958204
57387 958204 968760 979503 990438 1001543 1013162 1025847 1039251 1052031 1063407 1073997 1084574
57376 1084574 1094896 1104468 1113566 1122731 1131956 1141113 1150507 1160275 1169964 1179418 1189439 1200814 1213290
57363 1213290 1226265 1239832 1254401 1269881 1286063 1303273 1321808 1341143 1360496 1379750 1399077
57352 1399077 1418100 1436323 1454058 1472136 1490871 1509940 1529041 1547983 1566451 1584371 1602333
$$ packed form
57443F06795L774M294M878M646M207M401M729M483M226M773N646N961N906O132
57429F74851O447O330N920N506M884M122L989M594M801L980L209L523M246M404
57415G40806M561N685P189P771P434P149P175P128P122P430P602P191O747O896
57401H37886P167O953O801P404Q188Q328Q398R295J0347J0194R105Q647R320J0171
57387I58204J0556J0743J0935J1105J1619J2685J3404J2780J1376J0590J0577
57376A084574J0322R572R098R165R225R157R394R768R689R454J0021J1375J2476
57363A213290J2975J3567J4569J5480J6182J7210J8535J9335J9353J9254J9327
57352A399077J9023J8223J7735J8078J8735J9069J9101J8942J8468J7920J7962
$$ plain form
57341 1602333 1621038 1640554 1660608 1681185 1702159 1722745 1742262 1761351 1781617 1804003 1828091
57330 1828091 1852929 1877905 1902833 1927843 1953364 1979723 2006674 2033722 2060841 2088289 2115540
57319 2115540 2140786 2161757 2177022 2186792 2193084 2199214 2208577 2223251 2243414 2267894 2295193 2324270
57307 2324270 2354800 2386836 2420248 2454514 2489113 2523901 2558921 2594024 2628931 2663648 2698569
57296 2698569 2734136 2770491 2807517 2845179 2883768 2923704 2965042 3007240 3049563 3091710 3133982
57285 3133982 3176934 3220951 3265982 3311481 3356751 3401634 3446788 3493133 3541090 3590441 3640562
57274 3640562 3690547 3739580 3787727 3836172 3886158 3937903 3990888 4044808 4099562 4154685 4209618
57263 4209618 4264454 4319670 4375186 4430457 4485414 4540584 4596284 4652422 4709055 4766396 4824327
$$ packed form
57341A602333J8705J9516K0054K0577K0974K0586J9517J9089K0266K2386K4088
57330A828091K4838K4976K4928K5010K5521K6359K6951K7048K7119K7448K7251
57319B115540K5246K0971J5265R770O292O130R363J4674K0163K4480K7299K9077
57307B324270L0530L2036L3412L4266L4599L4788L5020L5103L4907L4717L4921
57296B698569L5567L6355L7026L7662L8589L9936M1338M2198M2323M2147M2272
57285C133982M2952M4017M5031M5499M5270M4883M5154M6345M7957M9351N0121
57274C640562M9985M9033M8147M8445M9986N1745N2985N3920N4754N5123N4933
57263D209618N4836N5216N5516N5271N4957N5170N5700N6138N6633N7341N7931
$$ plain form
57252 4824327 4882667 4941776 5002060 5063061 5124112 5185650 5248594 5312428 5375516 5437658 5500850
57241 5500850 5566821 5635254 5705229 5777002 5851104 5926833 6003007 6079532 6156954 6234908 6312226
57230 6312226 6388333 6463529 6538102 6612136 6686100 6760739 6836365 6912838 6990235 7069034 7149727
57219 7149727 7232573 7317529 7404100 7491552 7579562 7668346 7757857 7847371 7936124 8023750 8109640
57208 8109640 8192522 8271231 8345362 8414698 8478705 8537263 8591402 8642683 8692432 8742209 8794193
57197 8794193 8850082 8910041 8973643 9041421 9114487 9192884 9275379 9360797 9448676 9538513 9629087
57186 9629087 9718657 9805425 9888059 9966285 10040735 10111641 10177935 10238151 10291837 10339363 10380733
57175 10380733 10415508 10443794 10466421 10484146 10497350 10506503 10512254 10515004 10514949 10512591 10508739 10503968 10498395
$$ packed form
57252D824327N8340N9109O0284O1001O1051O1538O2944O3834O3088O2142O3192
57241E500850O5971O8433O9975P1773P4102P5729P6174P6525P7422P7954P7318
57230F312226P6107P5196P4573P4034P3964P4639P5626P6473P7397P8799Q0693
57219G149727Q2846Q4956Q6571Q7452Q8010Q8784Q9511Q9514Q8753Q7626Q5890
57208H109640Q2882P8709P4131O9336O4007N8558N4139N1281M9749M9777N1984
57197H794193N5889N9959O3602O7778P3066P8397Q2495Q5418Q7879Q9837R0574
57186I629087Q9570Q6768Q2634P8226P4450P0906O6294O0216N3686M7526M1370
57175A0380733L4775K8286K2627J7725J3204R153N751K750n5k358l852m771n573
$$ plain form
57162 10498395 10491762 10483265 10471555 10455507 10434865 10409649 10379119 10341914 10297011 10243962 10182324
57151 10182324 10111562 10031602 9943043 9846780 9743768 9635090 9521965 9405865 9288876 9173584
57141 9173584 9062142 8955713 8855192 8762091 8678192 8604576 8541301 8487545 8441565 8401052 8364122
57130 8364122 8329629 8296040 8260676 8220867 8175415 8124260 8067255 8004254 7936025 7864153 7790225
57119 7790225 7715832 7642934 7573206 7507124 7444329 7384521 7327210 7271257 7215952 7162622 7114304
57108 7114304 7073987 7043905 7026044 7022132 7033202 7060148 7104692 7169071 7255249 7365548 7503857
57097 7503857 7675132 7883852 8133839 8429014 8772934 9167834 9615214 10116469 10670555
57088 10670555 11270125 11900258 12540172 13166320 13759290 14315984 14857185 15415942 16009203
$$ packed form
57162A0498395o633q497j1710j6048k0642k5216l0530l7205m4903n3049o1638
57151A0182324p0762p9960q8559r6263j03012j08678j13125j16100j16989j15292
57141I173584j11442j06429j00521r3101q3899p3616o3275n3756m5980m0513l6930
57130H364122l4493l3589l5364l9809m5452n1155n7005o3001o8229p1872p3928
57119G790225p4393p2898o9728o6082o2795n9808n7311n5953n5305n3330m8318
57108G114304m0317l0082j7861l912J1070K6946M4544O4379Q6178J10299J38309
57097G503857J71275K08720K49987K95175L43920L94900M47380N01255N54086
57088A0670555N99570O30133O39914O26148N92970N56694N41201N58757N93261
$$ plain form
57079 16009203 16616423 17185340 17659099 18001920 18207936 18293121 18276610 18159753 17915377 17497461
57069 17497461 16866632 16013209 14963188 13768502 12492389 11197546 9938211 8755446
57061 8755446 7675584 6711425 5864853 5130001 4496603 3952997 3487940 3091045 2752453
57052 2752453 2462716 2213176 1996478 1806670 1638996 1489820 1356629 1237676 1131352
57043 1131352 1035878 949497 870720 798433 732077 671779 618012 571050 530868 497404 470591
57032 470591 450139 435573 426598 423352 426647 438130 459788 492755 536880 591479 655035 722365
57020 722365 782477 821616 830101 806401 755308 683989 600139 511586 424987 344440 271879 208375
57008 208375 154267 108675 70045 37309 9913 -12982 -32513 -49246 -63017 -73643 -81319 -86309
$$ packed form
57079A6009203O07220N68917M73759L42821K06016Q5185j6511j16857k44376m17916
57069A7497461o30829q53423j050021j194686j276113j294843j259335j182765
57061H755446j079862r64159q46572p34852o33398n43606m65057l96895l38592
57052B752453k89737k49540k16698j89808j67674j49176j33191j18953j06324
57043A131352r5474q6381p8777p2287o6356o0298n3767m6962m0182l3464k6813
57032D70591k0452j4566q975l246L295J1483K1658L2967M4125N4599O3556O7330
57020G22365O0112L9139Q485k3700n1093p1319q3850q8553q6599q0547p2561o3504
57008B08375n4108m5592l8630l2736I913a2982j9531j6733j3771j0626p676m990
$$ plain form
56996 -86309 -88707 -88591 -86051 -81023 -73341 -63032 -50448 -36090 -20333 -3110 16163 38094 62531
56983 62531 88392 114101 137944 158238 173907 185057 192450 196344 196524 193547 189053 184412 179870
56970 179870 175558 172465 171594 172792 175328 179177 184877 192439 201300 211197 222334 234800 248544 263711
56956 263711 280079 296096 309157 317051 318718 313851 302749 286808 268353 249394 230873 213319
56944 213319 197684 185039 175717 169356 165734 165174 168027 174079 182745 193750 207380 224000 243489
56931 243489 265132 287655 309004 326395 337301 340664 336867 326614 310418 289356 265542 241229
56919 241229 217652 195243 174642 156846 142312 130458 120333 111557 104403 99046 95010 91517
56907 91517 88279 85691 84138 83444 83253 83588 84619 86159 87974 90435 94159 99078 104580 110691 118359
$$ packed form
56996h6309k398J16K540N028P682J0309J2584J4358J5757c110A6163K1931K4437
56983F2531K5861K5709K3843K0294J5669J1150P393L894J80k977m494m641m542
56970A79870m312l093q71J198K536L849N700P562Q861R897J1137J2466J3744J5167
56956B63711J6368J6017J3061P894J667m867j1102j5941j8455j8959j8521j7554
56944B13319j5635j2645r322o361l622n60K853O052Q666J1005J3630J6620J9489
56931B43489K1643K2523K1349J7391J0906L363l797j0253j6196k1062k3814k4313
56919B41229k3577k2409k0601j7796j4534j1854j0125q776p154n357m036l493
56907I1517l238k588j553o94j91L35J031J540J815K461L724M919N502O111P668
$$ plain form
56892 118359 128358 140562 154509 169972 186702 204394 223290 243965 265817 286352 302650 313252
56880 313252 318222 318081 313521 305751 296237 286031 275855 266676 259750 256176 256711 261730 271007 283839
56866 283839 299835 319422 343316 371886 405383 444244 488421 536372 584903 629707 666050
56855 666050 689911 699515 695752 680783 656661 625653 591148 557149 526854 502239 484647 474989
56843 474989 473429 479580 493096 513784 541506 576562 620020 673129 736427 809419 890026 973158
56831 973158 1050179 1111284 1149274 1161243 1147534 1110410 1053993 984338 908522 833204 763442
56820 763442 702012 649609 606070 571630 546967 532488 528084 533360 547621 569986 600205 639107
56808 639107 687368 743542 803456 861008 909048 940427 950163 937511 905598 858995 802109 739412
$$ packed form
56892A18359R999J2204J3947J5463J6730J7692J8896K0675K1852K0535J6298J0602
56880C13252M970j41m560p770r514j0206j0176r179o926l574N35N019R277J2832
56866B83839J5996J9587K3894K8570L3497L8861M4177M7951M8531M4804L6343
56855F66050K3861R604l763j4969k4122l1008l4505l3999l0295k4615j7592r658
56843D74989j560O151J3516K0688K7722L5056M3458N3109O3298P2992Q0607Q3132
56831I73158P7021O1105L7990J1969j3709l7124n6417o9655p5816p5318o9762
56820G63442o1430n2403m3539l4440k4663j4479m404N276J4261K2365L0219L8902
56808F39107M8261N6174N9914N7552M8040L1379R736j2652l1913m6603n6886o2697
$$ plain form
56796 739412 675603 614558 558550 508845 466501 432206 405896 387069 375266 369990 370480 375931
56784 375931 385867 400265 419491 443843 472456 502343 528772 546989 553784 548022 530451 503163
56772 503163 468803 430007 389491 350009 313473 280224 249801 222341 198608 178818 162282
56761 162282 148296 136641 127056 119060 112560 107901 104918 102574 99920 96916 93927 90983 88015 85344
56747 85344 83365 81921 80455 78681 76821 75276 74287 73835 73707 73661 73489 72932 71810 70429 69530 69406 69394
56730 69394 68799 68013 67957 68558 68728 67962 67021 66793 67317 68381 70164 72627 74887 76030 76286 76699 77797
56713 77797 79154 80201 80912 81593 82306 82770 82741 82440 82433 83014 83817 84247 84153 83767 83083 81760 79712 77412 75494
56694 75494 74303 73838 73816 73854 73879 74288 75299 76324 76565 76153 76007 76482 76821 76227 74860 73490 72634 72425
$$ packed form
56796G39412o3809o1045n6008m9705m2344l4295k6310j8827j1803n276M90N451
56784C75931R936J4398J9226K4352K8613K9887K6429J8217O795n762j7571k7288
56772E03163l4360l8796m0516l9482l6536l3249l0423k7460k3733j9790j6536
56761A62282j3986j1655r585p996o500m659k983k344k654l004k989k944k968k671
56747H5344j979j444j466j774j860j545r89m52j28m6j72n57j122j381q99j24j2
56730F9394n95p86n6O01J70p66r41k28N24J064J783K463K260J143K56M13J098
56713G7797J357J047P11O81P13M64k9l01pN81Q03M30r4l86o84j323k048k300j918
56694G5494j191m65k2L8K5M09J011J025K41m12j46M75L39n94j367j370q56k09
$$ plain form
56676 72425 72902 73995 75400 76686 77459 77435 76670 75767 75463 75922 76641 77037 76849 76131 75310 75125 75946 77203
56658 77203 78014 78365 79056 80559 82621 84913 87299 89406 90764 91589 92650 94113 95313 95920 96555 97907
56642 97907 99945 102303 104660 106424 106903 106311 105756 105732 105439 104265 103066 103049 104015 104710 104547 104056 103842 103914
56624 103914 104036 104058 103896 103604 103377 103186 102623 101467 100108 99087 98533 98393 98785 99672 100557 101003 101179 101475
56606 101475 101934 102461 103191 104205 105237 106125 107036 107813 107651 106251 104855 105200 107541 110433 112415 113201
56590 113201 113312 113269 113364 113673 114048 114338 114655 115214 116017 116950 118026 119250 120441 121519 122730 124320 126207
56573 126207 128278 130622 133103 135128 136374 137382 138874 140831 142896 145307 148677 153033 157940 163429
56559 163429 169868 176841 183042 187590 190786 193286 195234 196656 198109 200318 203314 206325 208427 209116
$$ packed form
56676G2425M77J093J405J286P73k4p65r03l04M59P19L96j88p18q21j85Q21J257
56658G7203Q11L51O91J503K062K292K386K107J358Q25J061J463J200O07O35J352
56642I7907K038K358K357J764M79n92n55k4k93j174j199j7R66O95j63m91k14P2
56624A03914J22K2j62k92k27j91n63j156j359j021n54j40L92Q87Q85M46J76K96
56606A01475M59N27P30J014J032Q88R11P77j62j400j396L45K341K892J982P86
56590A13201J11m3R5L09L75K90L17N59Q03R33J076J224J191J078J211J590J887
56573A26207K071K344K481K025J246J008J492J957K065K411L370M356M907N489
56559A63429O439O973O201M548L196K500J948J422J453K209K996L011K102O89
$$ plain form
56545 209116 208515 207295 206295 205935 205974 205896 205410 204493 203124 201209 198737 195890 192971 190336 188383 187376
56529 187376 187067 186598 185140 182766 180404 178649 176940 174351 170995 168080 166518 166002 165585 164713 163476
56514 163476 162221 161194 160349 159384 158152 157014 156441 156245 155660 154273 152458 150807 149537 148608 147938 147398
56498 147398 146951 146872 147349 147938 147980 147579 147482 147973 148685 149549 150917 152530 153453 153583 154184 156226 159055 161506
56480 161506 163414 165120 166271 166283 165536 164975 164779 164417 163856 163755 164470 165643 166825 167866 168637 168967 168902
56463 168902 168656 168279 167649 166666 165365 164103 163680 164698 166609 168084 168600 168885 169490 169943 169971 170396 171838
56446 171838 173486 174327 174853 176196 178193 179707 180469 181198 182144 182918 183656 184932 186417 187000 186482 185966 186266
56429 186266 186964 187396 187560 187659 187616 187446 187433 187627 187765 187847 188213 188911 189653 190373 191148 191647 191526 191409 192489 194891
$$ packed form
56545B09116o01j220j000l60L9p8m86r17j369j915k472k847k919k635j953j007
56529A87376l09m69j458k374k362j755j709k589l356k915j562n16m17q72j237
56514A63476j255j027q45r65j232j138n73j96n85j387j815j651j270r29o70n40
56498A47398m47p9M77N89M2m01r7M91P12Q64J368J613R23J30O01K042K829K451
56480A61506J908J706J151J2p47n61j96l62n61j01P15J173J182J041P71L30o5
56463A68902k46l77o30r83j301j262m23J018J911J475N16K85O05M53K8M25J442
56446A71838J648Q41N26J343J997J514P62P29R46P74P38J276J485N83n18n16L00
56429A86266O98M32J64R9m3j70j3J94J38Q2L66O98P42P20P75M99j21j17J080K402
$$ plain form
56409 194891 197303 198535 198688 198506 198443 198773 199861 201675 203457 204393 204383 203909 203408 202945 202267 201141 199830
56392 199830 199129 199606 200984 202618 204267 205938 207383 208452 209594 211186 212684 213319 213424 214048 215417
56377 215417 216834 218027 219455 221181 222647 223834 225460 227629 229386 230195 230865 232271 233910 234610 234168
56362 234168 233573 233782 234791 235804 235991 235215 234219 234013 235029 236970 239262 241309 242609 243112 243336 243727
56346 243727 244157 244519 245343 247066 249101 250536 251502 252850 254689 256316 257544 258954 260731 262286 263283
56331 263283 264108 265163 266530 268435 271077 273910 275952 277031 277912 279206 281024 283589 286974 290181 291775
56316 291775 291733 291502 291917 292278 291895 291255 291043 291140 291342 292110 293824 296070 298330 300780 303821 307358 310958
56299 310958 314252 316966 319184 321644 324954 328463 330935 332436 334453 337821 341674 344847 347243 349395
$$ packed form
56409A94891K412J232J53j82o3L30J088J814J782R36j0m74n01m63o78j126j311
56392A99830p01M77J378J634J649J671J445J069J142J592J498O35J05O24J369
56377B15417J417J193J428J726J466J187J626K169J757Q09O70J406J639P00m42
56362B34168n95K09J009J013J87p76r96k06J016J941K292K047J300N03K24L91
56346B43727M30L62Q24J723K035J435R66J348J839J627J228J410J777J555R97
56331B63283Q25J055J367J905K642K833K042J079Q81J294J818K565L385L207J594
56316B91775m2k31M15L61l83o40k12R7K02P68J714K246K260K450L041L537L600
56299C10958L294K714K218K460L310L509K472J501K017L368L853L173K396K152
$$ plain form
56285 349395 351746 354785 358865 363427 367482 371246 376189 383076 391169 399800 409256 419419 428958 436935
56271 436935 444136 451894 460554 469864 479760 489789 498830 506439 513660 521750 531067 541953 555350
56258 555350 571387 588488 605308 622727 642686 665763 691231 718894 749471 783478 820894
56247 820894 861661 905614 952189 1000905 1051660 1103792 1155475 1204925 1251686 1295820 1336308
56236 1336308 1371113 1398462 1417358 1427382 1428770 1422235 1408057 1385899 1356148 1320775 1282067 1241014
56224 1241014 1197617 1152112 1105183 1057636 1010640 965739 923919 885131 849118 815938 785318
56213 785318 756624 730090 706894 687170 669213 651680 635388 621715 610325 599900 590174 581710
56201 581710 574339 567371 560949 555847 552177 549361 547061 545206 543553 542085 541230 540888 540012 538132 536523
$$ packed form
56285C49395K351L039M080M562M055L764M943O887Q093Q631R456J0163R539P977
56271D36935P201P758Q660R310R896J0029R041P609P221Q090R317J0886J3397
56258E55350J6037J7101J6820J7419J9959K3077K5468K7663L0577L4007L7416
56247H20894M0767M3953M6575M8716N0755N2132N1683M9450M6761M4134M0488
56236A336308L4805K7349J8896J0024J388o535j4178k2158k9751l5373l8708m1053
56224A241014m3397m5505m6929m7547m6996m4901m1820l8788l6013l3180l0620
56213G85318k8694k6534k3196j9724j7957j7533j6292j3673j1390j0425r726q464
56201E81710p371o968o422n102l670k816k300j855j653j468q55l42q76j880j609
$$ plain form
56186 536523 536751 538777 541506 544328 546983 548829 549621 550314 551797 553553 554823 556242 558823 562086 564849
56171 564849 567307 570641 574926 579056 582617 586408 591208 597202 604382 612381 620227 627423 634953 644086
56157 644086 654674 665727 677112 689379 702477 716052 730589 746861 764510 782627 801485
56146 801485 822476 846481 873481 903533 937089 974589 1016713 1064606 1119010 1179790 1247329
56135 1247329 1323546 1410196 1506569 1609659 1715641 1820074 1918043 2006100 2083864 2152601 2213026
56124 2213026 2265643 2311880 2352886 2387817 2414854 2433116 2442164 2440908 2429116 2409126 2383899 2353954
56112 2353954 2318064 2275925 2227773 2172093 2106465 2030689 1947112 1858219 1766149 1674254 1586722
56101 1586722 1506308 1434094 1371184 1318697 1276247 1242321 1215956 1196335 1181400 1169011 1159223
$$ packed form
56186E36523K28K026K729K822K655J846P92O93J483J756J270J419K581L263K763
56171E64849K458L334M285M130L561L791M800N994P180P999P846P196P530R133
56157F44086J0588J1053J1385J2267J3098J3575J4537J6272J7649J8117J8858
56146H01485K0991K4005K7000L0052L3556L7500M2124M7893N4404O0780O7539
56135A247329P6217Q6650R6373J03090J05982J04433R7969Q8057P7764O8737O0425
56124B213026N2617M6237M1006L4931K7037J8262R048j256j1792j9990k5227k9945
56112B353954l5890m2139m8152n5680o5628p5776q3577q8893r2070r1895q7532
56101A586722q0414p2214o2910n2487m2450l3926k6365j9621j4935j2389r788
$$ plain form
56090 1159223 1153389 1151398 1151777 1153952 1158102 1163243 1167934 1172644 1179055 1187225 1195764 1204533 1214666 1226108
56076 1226108 1237635 1249274 1262244 1276538 1290995 1305771 1322353 1341080 1361032 1382155 1405029
56065 1405029 1428651 1451129 1472590 1494841 1518117 1540802 1562396 1584026 1605870 1626759 1646577
56054 1646577 1666503 1686688 1706151 1725049 1744615 1764979 1785645 1807803 1833326 1861664 1890716
56043 1890716 1920557 1953138 1988522 2024729 2061331 2099829 2140480 2182269 2226281 2275662 2331933
56032 2331933 2394504 2463599 2539882 2621061 2702815 2783477 2864196 2944576 3022409 3098010 3174364
56021 3174364 3252294 3329702 3406153 3483863 3563488 3643500 3724598 3810206 3901559 3996719 4095334
56010 4095334 4199751 4310473 4425263 4543872 4668894 4800922 4937775 5079574 5229560
$$ packed form
56090A159223n834j991L79K175M150N141M691M710O411Q170Q539Q769J0133J1442
56076A226108J1527J1639J2970J4294J4457J4776J6582J8727J9952K1123K2874
56065A405029K3622K2478K1461K2251K3276K2685K1594K1630K1844K0889J9818
56054A646577J9926K0185J9463J8898J9566K0364K0666K2158K5523K8338K9052
56043A890716K9841L2581L5384L6207L6602L8498M0651M1789M4012M9381N6271
56032B331933O2571O9095P6283Q1179Q1754Q0662Q0719Q0380P7833P5601P6354
56021C174364P7930P7408P6451P7710P9625Q0012Q1098Q5608R1353R5160R8615
56010D095334J04417J10722J14790J18609J25022J32028J36853J41799J49986
$$ plain form
56001 5229560 5388836 5555496 5730005 5915915 6114094 6321947 6539518 6770417 7015610
55992 7015610 7272797 7543326 7832924 8143838 8473301 8821635 9194581 9595500 10023029
55983 10023029 10478904 10970108 11500515 12068670 12676949 13334584 14048560 14820464 15655903
55974 15655903 16567833 17567020 18659186 19855874 21178244 22646278 24275741 26091147
55966 26091147 28130986 30436334 33048228 36023280 39440545 43390032 47972074 53315317
55958 53315317 59577839 66922296 75508331 85517140 97162576 110673402 126298648
55951 126298648 144346921 165180548 189120019 216303332 246484742 278671194 310708399
55944 310708399 339288726 360737341 372228214 372592926 362281833 342834429 316431442
$$ packed form
56001E229560J59276J66660J74509J85910J98179K07853K17571K30899K45193
55992G015610K57187K70529K89598L10914L29463L48334L72946M00919M27529
55983A0023029M55875M91204N30407N68155O08279O57635P13976P71904Q35439
55974A5655903R11930R99187J092166J196688J322370J468034J629463J815406
55966B6091147K039839K305348K611894K975052L417265L949487M582042N343243
55958E3315317O262522P344457Q586035J0008809J1645436J3510826J5625246
55951A26298648J8048273K0833627K3939471K7183313L0181410L2186452L2037205
55944C10708399K8580327K1448615J1490873L64712j0311093j9447404k6402987
$$ plain form
55937 316431442 285636101 253079660 221036702 191123370 164268354 140848193 120836802
55930 120836802 103948481 89786165 77945757 68047288 59741560 52732795 46790615
55923 46790615 41729187 37387079 33633703 30375286 27538004 25052973 22863580 20932521
55915 20932521 19229395 17719382 16371007 15164456 14083677 13108606 12222259 11416976
55907 11416976 10686459 10018876 9403923 8839039 8322356 7846324 7404128 6995578 6620842
55898 6620842 6274643 5952186 5654526 5382354 5130247 4892709 4670576 4465944 4275757
55889 4275757 4095823 3926589 3769717 3623136 3484393 3354906 3236190 3125665 3020688
55880 3020688 2922896 2833980 2750602 2667984 2585356 2503696 2421358 2336290 2249874 2164570 2080293
$$ packed form
55937C16431442l0795341l2556441l2042958k9913332k6855016k3420161k0011391
55930A20836802j6888321j4162316j1840408r898469q305728p008765n942180
55923D6790615n061428m342108l753376l258417k837282k485031k189393j931059
55915B0932521j703126j510013j348375j206551j080779r75071q86347q05283
55907A1416976p30517o67583o14953n64884n16683m76032m42196m08550l74736
55898F620842l46199l22457k97660k72172k52107k37538k22133k04632j90187
55889D275757j79934j69234j56872j46581j38743j29487j18716j10525j04977
55880C020688r7792q8916q3378q2618q2628q1660q2338q5068q6416q5304q4277
$$ plain form
55869 2080293 1996722 1916373 1841585 1770977 1702606 1638278 1581178 1531428 1487338 1448812 1416149
55858 1416149 1387579 1361380 1338674 1321071 1307275 1294791 1283110 1272463 1261339 1248064 1233115
55847 1233115 1217283 1199345 1178092 1154836 1131348 1107131 1081224 1054933 1030170 1006725 983638
55836 983638 961590 941554 922678 903902 886118 870460 856083 841798 828242 816248 804833
55825 804833 793066 782122 773137 764745 755144 744898 735201 725148 713362 700828 689411 678867
55813 678867 667946 657209 648119 640452 633146 626659 621951 618140 613780 609666 607871 608707 610916 614185
55799 614185 619072 624959 630255 634270 637025 637864 636131 632562 628187 622520 614673 605466 596577 588409
55785 588409 580639 573975 569231 565347 560367 553816 546293 537486 526686 514704 503201 492506 481978
$$ packed form
55869B080293q3571q0349p4788p0608o8371o4328n7100m9750m4090l8526l2663
55858A416149k8570k6199k2706j7603j3796j2484j1681j0647j1124j3275j4949
55847A233115j5832j7938k1253k3256k3488k4217k5907k6291k4763k3445k3087
55836I83638k2048k0036j8876j8776j7784j5658j4377j4285j3556j1994j1415
55825H04833j1767j0944q985q392r601j0246r697j0053j1786j2534j1417j0544
55813F78867j0921j0737r090p667p306o487m708l811m360m114j795Q36K209L269
55799F14185M887N887N296M015K755Q39j733l569m375n667p847r207q889q168
55785E88409p770o664m744l884m980o551p523q807j0800j1982j1503j0695j0528
$$ plain form
55772 481978 472052 463978 457902 453104 449750 448502 448648 448485 447405 445988 444291 441731 438363 434610 429911
55757 429911 423243 414871 406092 397534 389153 381527 375521 370825 366334 361761 357492 353197 348217 343123
55743 343123 339253 336714 334335 331584 329086 327214 325532 323780 322231 320915 319468 317773 315922 313698
55729 313698 310876 307729 304458 300659 296198 291855 288055 283746 277864 271254 265672 261457 257681 254090
55715 254090 251281 249203 247098 244899 243405 243118 244011 246151 249367 252690 255371 258069 261710 265535 267727
55700 267727 267742 266610 265125 263091 260261 256739 252520 247798 243567 240711 238773 236771 234897 234028 233962
55685 233962 233662 233154 233611 235461 237823 240009 242331 245255 248764 252616 256292 258802 259592 259395 259165 258522
55669 258522 256498 253397 250465 247927 244965 241595 238953 237527 236578 235628 235191 235710 236985 239012 242200
$$ packed form
55772D81978r926q074o076m798l354j248J46j63j080j417j697k560l368l753m699
55757D29911o668q372q779q558q381p626o006m696m491m573m269m295m980n094
55743C43123l870k539k379k751k498j872j682j752j549j316j447j695j851k224
55729C13698k822l147l271l799m461m343l800m309n882o610n582m215l776l591
55715B54090k809k078k105k199j494k87Q93K140L216L323K681K698L641L825K192
55700B67727J5j132j485k034k830l522m219m722m231k856j938k002j874q69o6
55685B33962l00n08M57J850K362K186K322K924L509L852L676K510P90j97k30o43
55669B58522k024l101k932k538k962l370k642j426r49r50m37N19J275K027L188
$$ plain form
55654 242200 246380 250600 254322 257932 261781 265474 268360 270013 270166 268886 266773 264242 260715 255344
55640 255344 248437 241337 235009 229487 224446 219417 213705 207066 200395 194921 190973 188156 186113 184265
55626 184265 181604 178045 175340 175203 176953 178407 178555 177946 177051 176059 175864 177197 178852 178682 176525 174318
55610 174318 173177 172155 170174 167421 164430 161437 159107 158276 158474 158113 156600 154821 153269 151327 148890
55595 148890 147041 146376 146065 145281 144283 143483 142740 142101 142060 142559 142978 143443 144685 146304 146848 146208 146179 147814
55577 147814 149900 151091 151964 153695 156104 158369 160582 163255 166168 168957 172126 176341 181316 186216
55563 186216 190501 193621 194730 193606 191108 188007 184188 179701 175578 172627 170287 167638 164801 162384
55549 162384 160370 158498 157039 156148 155120 153278 151091 149480 148554 147910 147619 147969 148664 149090 148984 148232
$$ packed form
55654B42200M180M220L722L610L849L693K886J653J53j280k113k531l527n371
55640B55344o907p100o328n522n041n029n712o639o671n474l948k817k043j848
55626A84265k661l559k705j37J750J454J48o09q95r92j95J333J655j70k157k207
55610A74318j141j022j981k753k991k993k330q31J98l61j513j779j552j942k437
55595A48890j849o65l11p84r98q00p43o39m1M99M19M65J242J619N44o40k9J635
55577A47814K086J191Q73J731K409K265K213K673K913K789L169M215M975M900
55563A86216M285L120J109j124k498l101l819m487m123k951k340k649k837k417
55549A62384k014j872j459q91j028j842k187j611r26o44k91L50O95M26j06p52
$$ plain form
55533 148232 146633 144633 143571 144301 146074 147557 148381 148874 149001 148602 148077 147761 147053 145276 142980 141231
55517 141231 139858 137701 134583 131860 130738 130923 131279 131152 130716 130476 130701 131128 131150 130492 129673 129490 130100
55500 130100 130844 130941 130284 129602 129832 131107 132426 132667 131871 131072 130922 131112 131139 130889 130365 129624 129182 129671 130770
55481 130770 131325 130870 130215 130113 130266 130109 129665 128977 127600 125454 123479 122621 122703 122990 123280 123673 123844 123371
55463 123371 122423 121474 120768 120580 121425 123300 125266 126479 127175 127943 128625 128649 127993 127001 125716 124234 123223
55446 123223 123230 123712 123627 122759 121769 121149 120869 120788 120704 120165 118998 117908 117944 119364 121441 123200 123992 123695 122888
55427 122888 122573 123263 124581 126004 127502 129046 130114 130332 130137 130159 130370 130399 130224 129994 129682 129556 130382 132340
55409 132340 134275 134894 134269 133298 132190 130535 128544 127071 126373 125857 125158 124649 124729 125240 125717 125726 125009 123722
$$ packed form
55533A48232j599k000j062P30J773J483Q24M93J27l99n25l16p08j777k296j749
55517A41231j373k157l118k723j122J85L56j27m36k40K25M27K2o58q19j83O10
55500A30100P44R7o57o82K30J275J319K41p96p99j50J90K7k50n24p41m42M89J099
55481A30770N55m55o55j02J53j57m44o88j377k146j975q58Q2K87K90L93J71m73
55463A23371r48r49p06j88Q45J875J966J213O96P68O82K4o56r92j285j482j011
55446A23223PM82q5q68r90o20k80q1q4n39j167j090L6J420K077J759P92k97q07
55427A22888l15O90J318J423J498J544J068K18j95K2K11K9j75k30l12j26Q26J958
55409A32340J935O19o25r71j108j655j991j473o98n16o99n09Q0N11M77Rp17j287
$$ plain form
55391 123722 122521 121925 121703 121255 120390 119379 118584 118446 119412 121303 123126 124084 124430 124797 125208 125454 125931
55374 125931 127232 129119 130767 131807 132420 132634 132303 131583 130708 129521 127946 126594 126101 126107 125782 125145 125003
55357 125003 125677 126767 128073 129788 131634 132732 132590 131630 130593 129972 129987 130457 130586 129545 127428 125197
55341 125197 123614 122685 122084 121633 121289 121059 120985 121000 120986 121127 121793 122816 123500 123789 124662 126630 128580 129027
55323 129027 128006 126670 125550 124355 123154 122504 122455 122556 122714 123049 123072 122187 120870 120147 119900 119017 117358
55306 117358 116269 116800 118542 120571 122404 123590 123521 122331 121134 120701 120612 120195 119635 119651 120634 122455 124579
55289 124579 126066 126184 125354 124878 125468 126646 127759 128716 129492 129793 129729 129991 130787 131312 130859 129848 129116 128748
55271 128748 128217 127301 126242 125297 124579 124143 123875 123547 123159 122911 122703 122141 121209 120478 120429 121021 122000 123087
$$ packed form
55391A23722j201n96k22m48q65j011p95j38R66J891J823R58L46L67M11K46M77
55374A25931J301J887J648J040O13K14l31p20q75j187j575j352m93Ol25o37j42
55357A25003O74J090J306J715J846J098j42r60j037o21J5M70J29j041k117k231
55341A25197j583r29o01m51l44k30p4J5j4J41O66J023O84K89Q73J968J950M47
55323A29027j021j336j120j195j201o50m9J01J58L35K3q85j317p23k47q83j659
55306A17358j089N31J742K029J833J186o9j190j197m33q9m17n60J6R83J821K124
55289A24579J487J18q30m76N90J178J113R57P76L01o4K62P96N25m53j011p32l68
55271A28748n31r16j059r45p18m36k68l28l88k48k08n62r32p31m9N92R79J087
$$ plain form
55253 123087 123745 123498 122714 122337 122584 122699 122330 122234 122980 123829 123760 123020 122683 122992 123044 122067 120300 118599 117658
55234 117658 117647 118218 118851 119411 120250 121564 122946 123848 124254 124528 124783 124792 124425 123891 123531 123521 123732 123858 123796 123808
55214 123808 124035 124034 123272 122082 121480 121906 122748 123381 123968 124788 125364 124937 123552 122078 121259 121173 121530 122113 122862
55195 122862 123752 124605 124993 124537 123387 122283 121962 122619 123923 125377 126622 127655 128772 130089 131192 131608
55179 131608 131515 131559 131995 132482 132744 132952 133387 134184 135447 137093 138543 139141 138965 138693 138630 138553 138570 139279 140765
55160 140765 142242 143166 144026 145539 147666 149942 152149 154060 155050 154720 153586 152479 151404 149600 146635
55145 146635 143016 139762 137656 136796 136552 136098 135143 134037 133178 132717 132845 133747 134963 135439 134671 133375 132595
55128 132595 132567 132910 133482 134419 135559 136362 136387 135604 134473 133876 134521 136067 137242 137259 136729 136767 137597 138484 138691
$$ packed form
55253A23087O58k47p84l77K47J15l69r6P46Q49o9p40l37L09N2r77j767j701r41
55234A17658j1N71O33N60Q39J314J382R02M06K74K55Rl67n34l60j0K11J26o2J2
55214A23808K27jp62j190o02M26Q42O33N87Q20N76m27j385j474q19q6L57N83P49
55195A22862Q90Q53L88m56j150j104l21O57J304J454J245J033J117J317J103M16
55179A31608r3M4M36M87K62K08M35P97J263J646J450N98j76k72o3p7J7P09J486
55160A40765J477R24Q60J513K127K276K207J911R90l30j134j107j075j804k965
55145A46635l619l254k106q60k44m54r55j106q59m61J28R02J216M76p68j296p80
55128A32595k8L43N72R37J140Q03K5p83j131n97O45J546J175J7n30L8Q30Q87K07
$$ plain form
55109 138691 138020 136754 135585 135292 135936 136582 136338 135395 134640 134553 135025 135911 137008 137723 137527 136816 136667 137584
55091 137584 138953 139860 140047 139908 139876 139973 139872 139408 139041 139580 141276 143419 145081 145948 146173 145834 145045 144342
55073 144342 144284 144737 145063 145040 145102 145612 146327 146697 146418 145562 144462 143573 143291 143732 144676 145738 146606 147240 147816
55054 147816 148323 148315 147425 146089 145229 145088 144938 144252 143546 143553 144080 144345 144114 143767 143450 142888 142060 141366 141004 140750
55034 140750 140553 140880 142154 144111 145927 146891 146933 146637 146733 147361 147845 147404 146086 144765 144164 144092 143769 142772
55016 142772 141498 140648 140403 140332 140156 140281 141221 142678 143707 143815 143486 143520 144305 145795 147675 149320 150096
54999 150096 150098 150189 150995 152198 153123 153624 154030 154581 155328 156250 157104 157426 157113 156727 156891 157637 158637 159649 160366
54980 160366 160265 159254 158123 157744 157942 157793 156921 155935 155603 156102 157136 158358 159512 160448 161170 161802 162507
$$ packed form
55109A38691o71j266j169k93O44O46k44r43p55q7M72Q86J097P15j96p11j49R17
55091A37584J369R07J87j39l2R7j01m64l67N39J696K143J662Q67K25l39p89p03
55073A44342n8M53L26k3O2N10P15L70k79q56j100q89k82M41R44J062Q68O34N76
55054A47816N07qq90j336q60j41j50o86p06PN27K65k31l47l17n62q28o94l62k54
55034A40750j97L27J274J957J816R64M2k96R6O28M84m41j318j321o01p2l23r97
55016A42772j274q50k45p1j76J25R40J457J029J08l29L4P85J490J880J645P76
54999A50096KR1Q06J203R25N01M06N51P47R22Q54L22l13l86J64P46J000J012P17
54980A60366j01j011j131l79J98j49q72r86l32M99J034J222J154R36P22O32P05
$$ plain form
54963 162507 163357 164099 164137 163198 162065 162068 163543 165349 166253 166275 166170 166172 165962 165485 165089 165019 165322 166052 166968 167344
54943 167344 166727 165765 165627 166681 168246 169518 170178 170225 169859 169585 169915 170902 172348 174320 176948 179883 182531
54926 182531 184883 187595 191263 196034 201883 208693 216007 223123 229583 235278 240089 243727 245873 246219
54912 246219 244477 240736 235669 230021 223976 217344 210249 203292 197169 192414 189269 187403 185965 184339
54898 184339 182682 181406 180436 179387 178093 176517 174608 172814 172283 173738 176425 178966 181037 183369 186269
54883 186269 189134 191576 194193 197911 203009 208980 214993 220541 225880 231583 237257 241237 242280 241175
54869 241175 239733 238443 236160 231964 226221 219738 212992 206415 200507 195300 190490 186329 183523 181987
54855 181987 180564 178343 175550 172851 170573 168891 167932 167240 165934 163877 162041 161312 161617 162578 164128
$$ packed form
54963A62507Q50P42L8r39j133LJ475J806R04K2j05Kk10m77l96p0L03P30R16L76
54943A67344o17r62j38J054J565J272O60M7l66k74L30R87J446J972K628K935K648
54926A82531K352K712L668M771N849O810P314P116O460N695M811L638K146L46
54912B46219j742l741n067n648o045o632p095o957o123m755l145j866j438j626
54898A84339j657j276r70j049j294j576j909j794n31J455K687K541K071K332K900
54883A86269K865K442K617L718N098N971O013N548N339N703N674L980J043j105
54869B41175j442j290k283m196n743o483o746o577n908n207m810m161k806j536
54855A81987j423k221k793k699k278j682r59o92j306k057j836p29L05R61J550
$$ plain form
54840 164128 165909 166925 166578 165459 164337 162964 160727 158056 156226 155905 156698 158058 159842 161896 163756
54825 163756 165100 166161 167413 168983 170465 171306 171338 170911 170453 170061 169697 169553 169772 169909 169248 167824 166600
54808 166600 166361 166826 167154 166992 166729 166955 167907 169275 170423 170937 170990 171008 171005 170630 169785 168809 167999 167360 166845
54789 166845 166429 165951 165323 164901 165202 166274 167798 169748 172261 174908 176922 178321 180051 182658 185514
54774 185514 187765 189515 191694 195174 200300 206843 214156 221716 229577 237856 245843 252395 257306 261394
54760 261394 264900 266765 266043 263272 259745 255952 251391 245533 238426 230665 223184 216725 211206 206000
54746 206000 201084 197285 195074 193758 192349 190647 189013 187651 186710 186538 187198 188139 188841 189446 190358 191736
54730 191736 193780 196833 200671 204340 207353 210487 214734 220038 225774 231882 238562 245237 250732 254304
$$ packed form
54840A64128J781J016l47j119j122j373k237k671j830l21P93J360J784K054J860
54825A63756J344J061J252J570J482Q41L2m27m58l92l64j44K19J37o61j424j224
54808A66600k39M65L28j62k63K26R52J368J148N14N3J8ll75q45r76q10o39n15
54789A66845m16m78o28m22L01J072J524J950K513K647K014J399J730K607K856
54774A85514K251J750K179L480N126O543P313P560P861Q279P987O552M911M088
54760B61394L506J865p22k771l527l793m561n858p107p761p481o459n519n206
54746B06000m916l799k211j316j409j702j634j362r41j72O60R41P02O05R12J378
54730A91736K044L053L838L669L013L134M247N304N736O108O680O675N495L572
$$ plain form
54716 254304 255799 255061 251936 246655 239690 231506 223027 215778 210743 207372 204435 201482 198726 195986
54702 195986 192804 189359 186284 183707 181363 179499 178646 178549 178311 177672 177232 177271 177241 176697 175925 175422 175315 175502
54684 175502 175731 175415 173987 171667 169419 168067 167939 169160 171456 173621 174153 172882 171305 170912 171686 172581
54668 172581 172931 172957 173216 173936 174731 174869 174078 173033 172640 172864 172874 172387 172230 173312 175572 178241 180567 181987
54650 181987 182118 181141 179931 179289 179141 178807 177949 176961 176472 176755 177668 178990 180569 182052 182700 181905 180019
54633 180019 178225 177305 176916 176379 175729 175416 175370 175118 174630 174297 174130 173727 173064 172548 172202 171592 170726 170268 170508
54614 170508 170859 170877 171158 172540 174776 176684 177522 177667 177912 178532 179262 179928 180701 181590 182030 181476 180374 179928
54596 179928 180573 181292 180941 179793 179013 179018 179204 179088 178785 178391 177828 177387 177489 177717 177025 175258 173654 173381
$$ packed form
54716B54304J495p38l125n281o965q184q479p249n035l371k937k953k756k740
54702A95986l182l445l075k577k344j864q53r7k38o39m40L9l0n44p72n03j07J87
54684A75502K29l16j428k320k248j352j28J221K296K165N32j271j577l93P74Q95
54668A72581L50K6K59P20P95J38p91j045l93K24J0m87j57J082K260K669K326J420
54650A81987J31r77j210o42j48l34q58r88m89K83R13J322J579J483O48p95j886
54633A80019j794r20l89n37o50l13m6k52m88l33j67m03o63n16l46o10q66m58K40
54614A70508L51J8K81J382K236J908Q38J45K45O20P30O66P73Q89M40n54j102m46
54596A79928O45P19l51j148p80NJ86j16l03l94n63m41J02K28o92j767j604k73
$$ plain form
54578 173381 174315 175647 176979 178271 179360 180145 180721 180923 180274 178886 177741 177481 177501 176917 175868 175086 174693
54561 174693 174376 174451 175630 177741 179572 180254 180104 179926 180090 180572 181323 182205 182846 182901 182283 181029 179196 177069
54543 177069 175246 174291 174307 174932 175699 176396 177169 178293 179824 181546 183312 185205 187180 188738 189278 188739
54527 188739 187653 186553 185620 184869 184370 184108 183908 183722 183840 184543 185593 186320 186327 185932 185750 185943 186094 185801
54509 185801 185144 184487 184094 184095 184582 185415 186059 185988 185254 184448 184120 184389 184979 185365 185083 184240 183589 183622 183801 183313
54489 183313 182555 183018 185387 188492 190625 191322 191243 190895 190288 189588 189204 189165 189107 189015 189374 190318 191148 191058 190003
54470 190003 188595 187415 186794 186984 188067 189677 191167 192204 193002 193914 194958 195827 196155 195648 194148 191862
54454 191862 189481 187788 187061 186997 187233 187647 188121 188350 188175 187820 187448 186693 185070 182886 181274 181113 182102
$$ packed form
54578A73381R34J332J332J292J089P85N76K02o49j388j145k60K0n84j049p82l93
54561A74693l17P5J179K111J831O82j50j78J64M82P51Q82O41N5o18j254j833k127
54543A77069j823r55J6O25P67O97P73J124J531J722J766J893J975J558N40n39
54527A88739j086j100r33p51m99k62k00j86J18P03J050P27Pl95j82J93J51k93
54509A85801o57o57l93JM87Q33O44p1p34q06l28K69N90L86k82q43o51L3J79m88
54489A83313p58M63K369L105K133O97p9l48o07p00l84l9n8r2L59R44Q30r0j055
54470A90003j408j180o21J90J083J610J490J037P98R12J044Q69L28n07j500k286
54454A91862k381j693p27o4K36M14M74K29j75l55l72p55j623k184j612j61R89
$$ plain form
54437 182102 183076 183128 182336 181540 181465 182053 182628 182712 182510 182476 182685 182951 183375 184290 185702 187197 188514 189845 191454
54418 191454 193323 195268 197058 198315 198677 198256 197618 197091 196432 195409 194390 193950 194096 194263 194008 193384 192688
54401 192688 192146 191880 191976 192448 193236 194252 195414 196621 197675 198274 198116 197159 195751 194431 193651 193689 194669
54384 194669 196364 198099 199213 199687 200080 200788 201600 202012 201735 200847 199713 198883 198850 199748 201356 203256 204870
54367 204870 205600 205381 205008 205321 206079 206210 205307 204205 203778 203804 203564 203042 202855 203247 203825 204251 204634 205135 205601
54348 205601 205794 205723 205660 205927 206634 207584 208506 209438 210647 212028 212830 212264 210288 207652 205362 204237 204625
54331 204625 206076 207431 207605 206378 204278 201921 199801 198489 198408 199376 200756 202193 203773 205331 206133
54316 206133 205697 204695 204472 205597 207269 208332 208643 209154 210773 213384 216018 217767 218497 218834 219523 220671
$$ packed form
54437A82102R74N2p92p96p5N88N75Q4k02l4K09K66M24R15J412J495J317J331J609
54418A91454J869J945J790J257L62m21o38n27o59j023j019m40J46J67k55o24o96
54401A92688n42k66R6M72P88J016J162J207J054N99j58r57j408j320p80L8R80
54384A94669J695J735J114M74L93P08Q12M12k77q88j134q30l3Q98J608J900J614
54367B04870P30k19l73L13P58J31r03j102m27K6k40n22j87L92N78M26L83N01M66
54348B05601J93p1o3K67P07R50R22R32J209J381Q02n66j976k636k290j125L88
54331B04625J451J355J74j227k100k357k120j312q1R68J380J437J580J558Q02
54316B06133m36j002k23J125J672J063L11N11J619K611K634J749P30L37O89J148
$$ plain form
54300 220671 221628 221834 221724 222305 223693 224681 224218 222795 221648 220983 219948 218282 216934 216698 217129 217337 217206
54283 217206 217205 217505 217898 218258 218473 218169 217098 215686 214702 214396 214243 213486 211718 209174 206812 205827 206649 208482
54265 208482 210140 211108 211546 211610 211311 210837 210423 209957 209235 208523 208336 208674 208993 208988 208897 208975 209163 209421 209946 210796
54245 210796 211670 212269 212628 212990 213586 214599 215965 217127 217437 217001 216766 217514 219104 220893 222441 223434 223423
54228 223423 222339 221097 220942 222028 223210 223448 222982 222851 223607 224919 226156 226897 226934 226283 225297 224497 224141
54211 224141 224125 224253 224314 223908 222685 220976 219776 219740 220470 221125 221473 221865 222409 222741 222651 222419 222417 222674 222970 223060
54191 223060 222788 222231 221735 221524 221395 221107 220931 221260 221826 222010 221994 222759 224618 226544 227507 227856 228665 230142
54173 230142 231544 232498 233578 235342 237404 238855 239298 239164 239069 239128 238984 238367 237334 235913 233883 231240
$$ packed form
54300B20671R57K06j10N81J388R88m63j423j147o65j035j666j348k36M31K08j31
54283B17206jL00L93L60K15l04j071j412r84l06j53p57j768k544k362r85Q22J833
54265B08482J658R68M38O4k99m74m14m66p22p12j87L38L19nr1P8J88K58N25Q50
54245B10796Q74N99L59L62N96J013J366J162L10m36k35P48J590J789J548R93j1
54228B23423j084j242j55J086J182K38m66j31P56J312J237P41L7o51r86q00l56
54211B24141j6J28O1m06j223j709j200l6P30O55L48L92N44L32r0k32kK57K96R0
54191B23060k72n57m96k11j29k88j76L29N66J84j6P65J859J926R63L49Q09J477
54173B30142J402R54J080J764K062J451M43j34r5N9j44o17j033j421k030k643
$$ plain form
54157 231240 228637 226802 225606 224222 222259 220183 218553 217414 216656 216300 216178 215889 215390 215092 215108 215045 214923
54140 214923 215561 217398 219519 220623 220569 220285 220502 221251 222259 223114 223320 222908 222840 224096 226468 228898 230784
54123 230784 232289 233582 234590 235463 236517 237604 238186 238133 237903 237897 238167 238786 239898 241284 242343 242666 242274
54106 242274 241371 240240 239323 238967 239129 239631 240412 241129 240987 239710 238280 237796 237889 237275 235698 234168 233216
54089 233216 232180 230493 228518 226625 224563 222414 221188 221636 223138 224541 225521 226363 226967 226955 226470 226091
54073 226091 226069 226233 226556 227226 228222 229250 230063 230556 230691 230582 230525 230709 231051 231474 232086 232908 233717 234382 234982
54054 234982 235455 235556 235434 235778 237003 238660 240060 241146 242325 243799 245517 247542 249945 252524 255050
54039 255050 257735 261150 265751 271609 278337 285109 291185 296709 302550 309011 315175 319997 323548 326566
$$ packed form
54157B31240k603j835j196j384j963k076j630j139p58l56j22k89m99k98J6o3j22
54140B14923O38J837K121J104n4k84K17P49J008Q55K06m12o8J256K372K430J886
54123B30784J505J293J008Q73J054J087N82n3k30oK70O19J112J386J059L23l92
54106B42274r03j131r17l56J62N02P81P17j42j277j430m84R3o14j577j530r52
54089B33216j036j687j975j893k062k149j226M48J502J403R80Q42O04j2m85l79
54073B26091k2J64L23O70R96J028Q13M93J35j09n7J84L42M23O12Q22Q09O65O00
54054B34982M73J01j22L44J225J657J400J086J179J474J718K025K403K579K526
54039B55050K685L415M601N858O728O772O076N524N841O461O164M822L551L018
$$ plain form
54025 326566 329153 330697 330876 330050 328725 327259 326119 325736 326012 326385 326420 325947 324703 322397 319187 315622
54009 315622 311970 307984 303427 298530 293891 290141 287523 285464 282805 278991 274887 271788 269705 267422
53995 267422 264340 261376 259645 258987 258389 257303 255826 253959 251483 248606 246142 244871 244948 245896 246902
53980 246902 247163 246344 244784 243034 241278 239513 238162 237939 238885 240087 240742 241165 242178 243714 244706 244415
53964 244415 243302 242357 242090 242517 243596 245076 246223 246387 245836 245457 245656 246082 246511 247323 248870 250911 253023
53947 253023 255116 257208 259167 261075 263419 266392 269336 271448 272836 274311 276349 278840 281674 284876
53933 284876 288165 291108 293827 296995 300930 305329 310085 315692 322398 329497 336019 341772 347165 352285
53919 352285 356736 360298 363198 365824 368571 371922 376148 380919 385671 390372 395359 400374 404483 407257
$$ packed form
54025C26566K587J544J79q26j325j466j140l83K76L73L5m73j244k306l210l565
54009C15622l652l986m557m897m639l750k618k059k659l814m104l099k083k283
53995B67422l082k964j731o58n98j086j477j867k476k877k464j271P7R48J006
53980B46902K61q19j560j750j756j765j351k23R46J202O55M23J013J536R92k91
53964B44415j113r45k67M27J079J480J147J64n51l79J99M26M29Q12J547K041K112
53947B53023K093K092J959J908K344K973K944K112J388J475K038K491K834L202
53933B84876L289K943K719L168L935M399M756N607O706P099O522N753N393N120
53919C52285M451L562K900K626K747L351M226M771M752M701M987N015M109K774
$$ plain form
53905 407257 409358 411421 412900 412752 410965 408541 406119 403469 400468 397643 395305 392836 389467 385286
53891 385286 380848 376129 370625 364388 358235 352745 347611 342196 336385 330592 325206 320331 315969 312184
53877 312184 309008 306186 303148 299428 295245 291506 289026 287813 287187 286379 284843 282313 279002 275702 273250
53862 273250 271834 270950 269962 268519 266675 264918 263888 263645 263435 262596 261416 260570 260042 259403 258916 259387 260831
53845 260831 262326 263378 264451 265730 266452 266078 265274 264923 264963 265021 265409 266391 267139 266706 265698 265557 266206 265860
53827 265860 263576 260822 259772 260899 262948 264585 265330 265345 265171 265523 266682 268052 268812 268965 269298 270370
53811 270370 272021 273918 276062 278439 280614 282139 283295 285022 288033 292196 296831 301363 305634 309913
53797 309913 314786 320719 327323 333260 337367 339927 342392 345765 349669 353091 355542 357182 358203 358554
$$ packed form
53905D07257K101K063J479j48j787k424k422k650l001k825k338k469l369m181
53891C85286m438m719n504o237o153n490n134n415n811n793n386m875m362l785
53877C12184l176k822l038l720m183l739k480j213o26q08j536k530l311l300k452
53862B73250j416q84r88j443j844j757j030k43k10q39j180q46n28o39m87M71J444
53845B60831J495J052J073J279P22l74q04l51M0N8L88R82P48m33j008j41O49l46
53827B65860k284k754j050J127K049J637P45J5j74L52J159J370P60J53L33J072
53811B70370J651J897K144K377K175J525J156J727L011M163M635M532M271M279
53797C09913M873N933O604N937M107K560K465L373L904L422K451J640J021L51
$$ plain form
53783 358554 358122 356923 355258 353777 353008 352522 351003 347642 343213 339216 336187 333456 330439 327351 324484
53768 324484 321580 318450 315731 314311 314081 313824 312479 310256 308283 307350 307211 307080 306550 305910 305735 306391
53752 306391 307835 309575 310824 311101 310899 311439 313529 316897 320908 325628 331702 339315 347911 357129 367558
53737 367558 380182 395244 412072 430151 450206 474005 503033 537407 575996 617196 659142
53726 659142 699210 733889 759704 774422 777498 769691 752395 727084 695130 658184 618740 579947
53714 579947 544505 513760 487878 466549 449286 435403 424228 415396 408728 403931 400566 398193
53702 398193 396382 394785 393382 392391 391755 391047 390187 389827 390501 391665 392164 391610 390768 390637 391569 393254 394992
53685 394992 395900 395422 393905 392382 391504 390880 389596 387218 384205 381500 379746 378756 377735 376142 374238
$$ packed form
53783C58554m32j199j665j481p69m86j519l361m429l997l029k731l017l088k867
53768C24484k904l130k719j420k30k57j345k223j973r33j39j31n30o40j75O56
53752C06391J444J740J249K77k02N40K090L368M011M720O074P613Q596R218J0429
53737C67558J2624J5062J6828J8079K0055K3799K9028L4374L8589M1200M1946
53726F59142M0068L4679K5815J4718L076p807j7296k5311l1954l6946l9444l8793
53714E79947l5442l0745k5882k1329j7263j3883j1175q832o668m797l365k373
53702C98193j811j597j403r91o36p08q60l60O74J164M99n54q42j31R32J685J738
53685C94992R08m78j517j523q78o24j284k378l013k705j754r90j021j593j904
$$ plain form
53670 374238 372629 371440 370218 368575 366548 364394 362356 360758 359985 360237 361299 362580 363365 363246 362481
53655 362481 361727 361252 360710 359891 359293 359463 360110 360487 360433 360418 360661 360908 361098 361599 362643 364079 365761 367599
53637 367599 369078 369461 368788 368162 368655 370346 372686 375294 378007 380635 383194 386150 389864 393956 397598
53622 397598 400420 402788 405230 407839 410318 412505 414748 417704 421662 426170 430564 434725 439032 443636
53608 443636 448253 452678 456995 461114 464587 467214 469472 472058 475223 478778 482403 485683 488233 490106
53594 490106 491828 493757 495657 497178 498404 499529 500311 500324 499572 498392 496955 495338 493936 493142 492506 490862
53578 490862 487651 483796 480839 479377 478634 477445 475363 472803 470352 468125 465697 462634 459119 456073
53564 456073 454500 454537 455213 455252 454127 452311 450663 449794 449845 450506 451187 451565 452060 453420 455711 458141 460055
$$ packed form
53670C74238j609j189j222j643k027k154k038j598p73K52J062J281P85j19p65
53655C62481p54m75n42q19n98J70O47L77n4j5K43K47J90N01J044J436J682J838
53637C67599J479L83o73o26M93J691K340K608K713K628K559K956L714M092L642
53622C97598K822K368K442K609K479K187K243K956L958M508M394M161M307M604
53608D43636M617M425M317M119L473K627K258K586L165L555L625L280K550J873
53594D90106J722J929J900J521J226J125P82J3p52j180j437j617j402p94o36j644
53578D90862l211l855k957j462p43j189k082k560k451k227k428l063l515l046
53564D56073j573L7O76L9j125j816j648q69N1O61O81L78M95J360K291K430J914
$$ plain form
53547 460055 461633 463326 465147 466992 469138 471788 474576 477308 480828 486208 493127 500039 506095 512050
53533 512050 519057 527351 536454 546058 556288 567556 580391 594937 610536 626436 643107 662029
53521 662029 683793 707126 730338 753172 776699 801990 829522 859499 892151 927958 967866
53510 967866 1012858 1062920 1116798 1172922 1229712 1284505 1333317 1372905 1402675 1423678 1436339
53499 1436339 1440462 1437196 1429470 1420140 1410728 1402265 1396324 1394464 1397217 1404087 1414185 1426604 1440570
53486 1440570 1455600 1471316 1487172 1502803 1518601 1535226 1552317 1568363 1582224 1594305 1605874
53475 1605874 1617714 1629783 1641594 1652259 1660519 1665462 1667270 1666807 1664514 1660130 1653405 1644552 1633849
53462 1633849 1621204 1606446 1589869 1572222 1554130 1535669 1516583 1496796 1476570 1456114 1435203
$$ packed form
53547D60055J578J693J821J845K146K650K788K732L520N380O919O912O056N955
53533E12050P007Q294R103R604J0230J1268J2835J4546J5599J5900J6671J8922
53521F62029K1764K3333K3212K2834K3527K5291K7532K9977L2652L5807L9908
53510I67866M4992N0062N3878N6124N6790N4793M8812L9588K9770K1003J2661
53499A436339M123l266p726r330r412q463n941j860K753O870J0098J2419J3966
53486A440570J5030J5716J5856J5631J5798J6625J7091J6046J3861J2081J1569
53475A605874J1840J2069J1811J0665Q260M943J808m63k293m384o725q853j0703
53462A633849j2645j4758j6577j7647j8092j8461j9086j9787k0226k0456k0911
$$ plain form
53451 1435203 1413373 1390447 1366725 1342711 1318890 1295720 1273482 1252045 1231103 1210873 1192270
53440 1192270 1176009 1161690 1148133 1134664 1121696 1110013 1099828 1090815 1082841 1076313 1071808 1069551
53428 1069551 1069333 1070777 1073649 1077957 1083854 1091424 1100611 1111407 1123997 1138564 1154973 1172879 1192152
53415 1192152 1212943 1235292 1259018 1284215 1311472 1341241 1373186 1406619 1441436 1478127 1516833
53404 1516833 1556948 1597912 1640060 1684352 1731400 1780921 1832074 1884235 1937545 1992698 2050094
53393 2050094 2109305 2169568 2230616 2292604 2355266 2417679 2479047 2539303 2598742 2657419 2715105
53382 2715105 2771384 2825495 2876415 2923477 2966643 3005943 3040910 3070952 3096000 3116397 3132298
53371 3132298 3143560 3150115 3152095 3149573 3142302 3129690 3111016 3086002 3055315 3020205 2981384 2938552
$$ packed form
53451A435203k1830k2926k3722k4014k3821k3170k2238k1437k0942k0230j8603
53440A192270j6261j4319j3557j3469j2968j1683j0185r013p974o528m505k257
53428A069551k18J444K872M308N897P570R187J0796J2590J4567J6409J7906J9273
53415A192152K0791K2349K3726K5197K7257K9769L1945L3433L4817L6691L8706
53404A516833M0115M0964M2148M4292M7048M9521N1153N2161N3310N5153N7396
53393B050094N9211O0263O1048O1988O2662O2413O1368O0256N9439N8677N7686
53382B715105N6279N4111N0920M7062M3166L9300L4967L0042K5048K0397J5901
53371C132298J1262O555J980k522p271j2612j8674k5014l0687l5110l8821m2832
$$ plain form
53359 2938552 2891193 2839439 2783839 2724817 2662974 2599623 2536310 2473850 2412322 2351937 2293316
53348 2293316 2236801 2181989 2128193 2075166 2023211 1972698 1923532 1875155 1827268 1780527 1736133
53337 1736133 1694608 1655535 1618770 1585220 1555713 1529669 1505806 1483844 1464465 1447587 1431697
53326 1431697 1415154 1397351 1378291 1357852 1336026 1313420 1290997 1269613 1249959 1232504 1217197
53315 1217197 1203613 1191700 1181944 1174600 1169336 1165973 1165005 1166785 1170671 1175655 1181547 1188859 1197719 1207784
53301 1207784 1219305 1233441 1251033 1271489 1293365 1315797 1338963 1363354 1389134 1416321 1445163
53290 1445163 1475913 1508280 1541261 1573588 1604317 1633172 1660548 1687103 1713001 1737457 1759172
53279 1759172 1777287 1791770 1802904 1810824 1815705 1818034 1818303 1816582 1812608 1806112 1796823 1784478 1769265
$$ packed form
53359B938552m7359n1754n5600n9022o1843o3351o3313o2460o1528o0385n8621
53348B293316n6515n4812n3796n3027n1955n0513m9166m8377m7887m6741m4394
53337A736133m1525l9073l6765l3550k9507k6044k3863k1962j9379j6878j5890
53326A431697j6543j7803j9060k0439k1826k2606k2423k1384j9654j7455j5307
53315A217197j3584j1913r756p344n264l363r68J780L886M984N892P312Q860J0065
53301A207784J1521J4136J7592K0456K1876K2432K3166K4391K5780K7187K8842
53290A445163L0750L2367L2981L2327L0729K8855K7376K6555K5898K4456K1715
53279A759172J8115J4483J1134P920M881K329K69j721l974o496r289j2345j5213
$$ plain form
53266 1769265 1752044 1733662 1714127 1692901 1669899 1645672 1620573 1594231 1566038 1535816 1503927
53255 1503927 1471028 1437765 1404313 1370141 1334630 1298060 1261618 1226242 1191808 1157689 1123739
53244 1123739 1090441 1058280 1027349 997534 968864 941539 915600 890627 866003 841615 818044
53233 818044 795780 774515 753635 733197 713857 695959 679427 664584 652184 642258 633637 625090
53221 625090 616399 607853 599285 590303 581143 572531 564841 557992 552025 547146 543189 539639 536318 533551
53207 533551 531457 529505 526962 523473 518984 513364 506457 498471 490109 482174 474991 468138 460850 452800
53193 452800 444544 437066 430891 425678 420656 415383 410134 405583 402043 399082 396020 392819 390105 388158
53179 388158 386243 383382 379605 375924 373111 370990 369013 366984 364893 362515 359710 356964 355096 354309
$$ packed form
53266A769265j7221j8382j9535k1226k3002k4227k5099k6342k8193l0222l1889
53255A503927l2899l3263l3452l4172l5511l6570l6442l5376l4434l4119l3950
53244A123739l3298l2161l0931k9815k8670k7325k5939k4973k4624k4388k3571
53233H18044k2264k1265k0880k0438j9340j7898j6532j4843j2400r926q621q547
53221F25090q691q546q568q982r160q612p690o849n967m879l957l550l321k767
53207E33551k094j952k543l489m489n620o907p986q362p935p183o853p288q050
53193D52800q256p478o175n213n022n273n249m551l540k961l062l201k714j947
53179C88158j915k861l777l681k813k121j977k029k091k378k805k746j868p87
$$ plain form
53165 354309 353938 353257 352257 351458 351190 351306 351409 351131 350313 349189 348318 348071 348226 348329 348372 348712 349311 349562
53147 349562 349032 347954 346681 345100 343077 341161 340249 340588 341623 342823 344148 345636 347031 348113 349064
53132 349064 350215 351594 352915 353880 354363 354387 354016 353220 351886 350132 348519 347692 347756 348301 349054 350169 351699
53115 351699 353191 354134 354654 355392 356669 358027 358682 358344 357499 356916 356991 357600 358532 359787 361427 363358 365479
53098 365479 367823 370276 372315 373414 373736 374120 375372 377671 380519 382983 384134 383778 382864 382775 384009 385733
53082 385733 386685 386235 384600 382418 380319 378577 376931 374853 372139 369200 366779 365485 365420 365973 366056 364934
53066 364934 362846 360628 358808 357360 356151 355081 353856 352169 350164 348244 346438 344504 342595 341185
53052 341185 340271 339427 338748 338864 339761 340504 340653 341049 342450 344179 345014 344859 344546 344340 343726 342568 341507
$$ packed form
53165C54309l71o81j000p99k68J16J03k78q18j124q71k47J55J03M3L40N99K51
53147C49562n30j078j273j581k023j916r12L39J035J200J325J488J395J082R51
53132C49064J151J379J321R65M83K4l71p96j334j754j613q27O4N45P53J115J530
53115C51699J492R43N20P38J277J358O55l38q45n83P5O09R32J255J640J931K121
53098C65479K344K453K039J099L22L84J252K299K848K464J151l56r14q9J234J724
53082C85733R52m50j635k182k099j742j646k078k714k939k421j294o5N53Q3j122
53066C64934k088k218j820j448j209j070j225j687k005j920j806j934j909j410
53052C41185r14q44o79J16Q97P43J49L96J401J729Q35j55l13k06o14j158j061
$$ plain form
53035 341507 341093 341266 341815 342678 343613 344181 344318 344482 345001 345670 346121 346271 346244 346215 346487 347410 348962 350529 351325
53016 351325 351067 350249 349752 350060 350756 350966 350380 349600 349335 349593 349943 350199 350411 350470 350252 350018 350166 350612 350914
52997 350914 350945 351003 351304 351840 352707 354084 355785 357327 358560 359828 361376 363000 364406 365492 366126 366108 365689
52980 365689 365780 367193 369755 372420 374256 375207 375932 376991 378190 378788 378443 377777 377803 378814 380095 380634 379871
52963 379871 377835 375030 372314 370535 369956 370060 370011 369302 368029 366709 365733 364874 363480 361391 359385 358318
52947 358318 358011 357577 356734 356100 356048 356000 355266 353993 352757 351595 350066 348082 346141 344734 343930 343571 343538
52930 343538 343748 344139 344708 345393 345891 345836 345226 344508 344153 344187 344214 343853 343137 342556 342647 343538 344879 346248 347489
52911 347489 348599 349515 350222 350944 351910 352838 352998 352026 350516 349522 349537 350179 350810 351048 350664 349516 347948 346886
$$ packed form
53035C41507m14J73N49Q63R35N68J37J64N19O69M51J50k7k9K72R23J552J567P96
53016C51325k58q18m97L08O96K10n86p80k65K58L50K56K12N9k18k34J48M46L02
52997C50914L1N8L01N36Q67J377J701J542J233J268J548J624J406J086O34j8m19
52980C65689R1J413K562K665J836R51P25J059J199N98l45o66K6J011J281N39p63
52963C79871k036k805k716j779n79J04m9p09j273j320r76q59j394k089k006j067
52947C58318l07m34q43o34n2m8p34j273j236j162j529j984j941j407q04l59l3
52930C43538K10L91N69O85M98n5o10p18l55L4K7l61p16n81R1Q91J341J369J241
52911C47489J110R16P07P22R66R28J60r72j510r94J5O42O31K38l84j148j568j062
$$ plain form
52893 346886 346987 347873 348742 349603 351257 353955 356773 358597 359179 358811 357548 355363 352714 350280 348236 346304
52877 346304 344413 342803 341560 340512 339554 338619 337392 335545 333297 331369 330317 330290 331250 332889 334347
52862 334347 334732 334102 333405 333258 333307 333047 332640 332543 332847 333406 334179 334944 335056 334098 332564 331279 330303 328965
52844 328965 326953 324777 323084 322045 321557 321634 322287 323344 324678 326455 328846 331595 334094 335975 337494
52829 337494 339283 341672 344181 345698 345357 343365 340863 338836 337233 335342 332939 330665 329159 328214 327287
52814 327287 326706 327724 331133 336305 342074 348298 355882 365151 374726 382357 386650 387783 386733 384234
52800 384234 380454 375394 369279 362582 355790 349236 343132 337621 332788 328676 325376 323017 321541 320543
52786 320543 319410 317675 315293 312684 310516 309260 308804 308567 308092 307425 306877 306636 306734 307151 307709 308064 308092
$$ packed form
52893C46886J01Q86Q69Q61J654K698K818J824N82l68j263k185k649k434k044j932
52877C46304j891j610j243j048r58r35j227j847k248j928j052k7R60J639J458
52862C34347L85o30o97j47M9k60m07r7L04N59P73P65J12r58j534j285r76j338
52844C28965k012k176j693j039m88P7O53J057J334J777K391K749K499J881J519
52829C37494J789K389K509J517l41j992k502k027j603j891k403k274j506r45r27
52814C27287n81J018L409N172N769O224P584R269R575P631M293J133j050k499
52800C84234l780n060o115o697o792o554o104n511m833m112l300k359j476r98
52786C20543j133j735k382k609k168j256m56k37m75o67n48k41R8M17N58L55K8
$$ plain form
52769 308092 308136 308558 309226 309842 310625 312102 314131 315689 315938 315135 314207 313703 313537 313552 313814 314323 314774 314789 314265
52750 314265 313378 312340 311362 310789 311002 312012 313255 314102 314554 315219 316516 318195 319762 321064 322201 323128
52734 323128 323689 323948 324134 324366 324670 325126 325693 326069 326089 326117 326579 327234 327434 327055 326542 325957 324703 322545 320282
52715 320282 318946 318661 318765 318734 318468 317910 317050 316331 316492 317736 319332 320252 320163 319632 319444 319862 320556 321125
52697 321125 321507 321852 322208 322572 323113 324012 325072 325837 326256 326938 328457 330577 332486 333724 334635 335875 337697
52680 337697 339863 342061 344151 345936 347000 347089 346632 346520 347186 348204 349027 349839 351243 353259 355084 355909
52664 355909 355646 354842 354233 354438 355670 357560 359472 361115 362657 364228 365661 366821 367821 368684 369058 368614
52648 368614 367606 366753 366516 366600 366233 364953 363141 361674 360991 360716 360385 360193 360610 361490 362175 362445 362781 363602
$$ packed form
52769C08092M4M22O68O16P83J477K029J558K49q03r28n04j66J5K62N09M51J5n24
52750C14265q87j038r78n73K13J010J243Q47M52O65J297J679J567J302J137R27
52734C23128N61K59J86K32L04M56N67L76K0K8M62O55K00l79n13n85j254k158k263
52715C20282j336k85J04l1k66n58q60p19J61J244J596R20q9n31j88M18O94N69
52697C21125L82L45L56L64N41Q99J060P65M19O82J519K120J909J238R11J240J822
52680C37697K166K198K090J785J064Q9m57j12O66J018Q23Q12J404K016J825Q25
52664C55909k63q04o09K05J232J890J912J643J542J571J433J160J000Q63L74m44
52648C68614j008q53k37Q4l67j280j812j467o83k75l31j92M17Q80O85K70L36Q21
$$ plain form
52630 363602 364870 366653 369468 373631 378646 383552 387537 389951 390323 388893 386744 384793 382807 379963
52616 379963 376239 372719 370449 369482 369077 368465 367333 365895 364745 364467 365193 366541 367965 369148 370080 370868
52600 370868 371533 372019 372403 372940 373768 374692 375557 376736 378820 381739 384642 386837 388433 389781 390752 391009
52584 391009 390727 390539 390829 391465 392186 392897 393612 394374 395247 396153 396701 396393 395066 393080 391161 390059 390136 391029
52566 391029 391856 391962 391446 390850 390514 390380 390261 390091 390001 390273 391094 392187 392871 392706 391986 391410 391404 391892 392581
52547 392581 393269 394008 395105 396843 399077 401322 403324 405265 407223 408781 409467 409309 408751 408254 408301 409385
52531 409385 411485 413766 415253 415744 415681 415340 414640 413697 413071 413362 414806 417179 419853 422102 423781 425540
52515 425540 427976 430744 433063 435030 437694 441643 446099 449687 451664 452118 451376 449681 447190 443972 440034
$$ packed form
52630C63602J268J783K815M163N015M906L985K414L72j430k149j951j986k844
52616C79963l724l520k270r67m05o12j132j438j150k78P26J348J424J183R32P88
52600C70868O65M86L84N37Q28R24Q65J179K084K919K903K195J596J348R71K57
52584C91009k82j88K90O36P21P11P15P62Q73R06N48l08j327j986j919j102P7Q93
52566C91029Q27J06n16n96l36j34j19j70r0K72Q21J093O84j65p20n76oM88O89
52547C92581O88P39J097J738K234K245K002J941J958J558O86j58n58m97M7J084
52531D09385K100K281J487M91o3l41p00r43o26K91J444K373K674K249J679J759
52515D25540K436K768K319J967K664L949M456L588J977M54p42j695k491l218l938
$$ plain form
52500 440034 435554 430876 426164 421337 416589 412702 410406 409498 408983 408183 407438 407548 408721 410339 411752
52485 411752 413027 414725 417029 419368 421015 421863 422407 423072 423796 424329 424689 425128 425714 426127 425953 425101 423876
52468 423876 422739 422168 422688 424735 428291 432810 437662 442416 446536 449195 449903 449154 447856 446181 443551
52453 443551 439781 435514 431369 427316 423223 419374 416005 412926 410176 408422 408022 408112 407486 406197 405445
52438 405445 405966 407292 408604 409590 410249 410515 410372 409882 408887 407118 404806 402796 401775 401698 402157 402940 403935
52421 403935 404786 405084 404875 404707 405128 406248 407786 409456 411283 413574 416606 420402 424796 429660 435046
52406 435046 441267 448825 457983 468328 478923 488921 497748 504633 508536 508982 506626 502542 497091 489982
52392 489982 481288 471959 463308 456262 451077 447462 445016 443603 443178 443198 442676 441167 439319 438091 437878
$$ packed form
52500D40034m480m678m712m827m748l887k296r08n15q00p45J10J173J618J413
52485D11752J275J698K304K339J647Q48N44O65P24N33L60M39N86M13j74q52j225
52468D23876j137n71N20K047L556M519M852M754M120K659P08p49j298j675k630
52453D43551l770m267m145m053m093l849l369l079k750j754m00R0o26j289p52
52438D05445N21J326J312R86O59K66j43m90r95j769k312k010j021p7M59P83R95
52421D03935Q51K98k09j68M21J120J538J670J827K291L032L796M394M864N386
52406D35046O221P558R158J0345J0595R998Q827O885L903M46k356m084n451p109
52392D89982q694r329q651p046n185l615k446j413m25K0n22j509j848j228k13
$$ plain form
52377 437878 438853 441547 446278 452300 458444 464494 471069 478228 485064 490760 495127 497892 498396 496496 493109
52362 493109 489405 485903 482637 479655 476916 474186 471524 469584 469033 469872 471578 473647 475753 477701 479474
52347 479474 481166 482768 484273 486088 488885 492840 497356 501715 505717 509528 513346 517439 522178 527808
52333 527808 534402 542130 551137 561092 571382 581999 593728 607145 621903 637308 653043 668809
52321 668809 683738 696838 707921 717650 726841 736051 745629 755688 766072 776680 787756 799630
52309 799630 812350 825829 840132 855260 870783 886059 900805 915196 929468 943644 957568
52298 957568 970947 983301 993942 1002070 1007039 1008881 1008556 1007275 1005430 1002532 998365 993726 989687 986509
52284 986509 983682 980788 977905 975346 973431 972415 972316 972866 973809 975105 976699 978412 980382 983297 987765
$$ packed form
52377D37878R75K694M731O022O144O050O575P159O836N696M367K765N04j900l387
52362D93109l704l502l266k982k739k730k662j940n51Q39J706K069K106J948J773
52347D79474J692J602J505J815K797L955M516M359M002L811L818M093M739N630
52333E27808O594P728R007R955J0290J0617J1729J3417J4758J5405J5735J5766
52321F68809J4929J3100J1083R729R191R210R578J0059J0384J0608J1076J1874
52309G99630J2720J3479J4303J5128J5523J5276J4746J4391J4272J4176J3924
52298I57568J3379J2354J0641Q128M969J842l25j281j845k898m167m639m039l178
52284I86509k827k894k883k559j915j016r9N50R43J296J594J713J970K915M468
$$ plain form
52269 987765 993626 1000241 1007225 1014452 1021592 1028254 1034666 1041732 1050231 1060281 1071596 1083929 1097143
52256 1097143 1111141 1125882 1141230 1156646 1171228 1184197 1195292 1204645 1212405 1218622 1223381 1226938
52244 1226938 1229632 1231783 1233740 1235987 1238988 1242815 1247100 1251512 1256102 1260920 1265543 1269401 1272527 1275560
52230 1275560 1279066 1283263 1288339 1294369 1300797 1306681 1311764 1316726 1321994 1326934 1330787 1333943 1337577 1342272
52216 1342272 1347639 1353156 1358786 1364693 1370838 1376967 1382805 1388353 1394200 1401233 1409678 1418703 1427431 1436151
52202 1436151 1445927 1457087 1468712 1479780 1490285 1501012 1512581 1524997 1537953 1551236 1564735
52191 1564735 1578099 1590644 1601894 1612162 1622069 1631269 1638108 1641025 1639902 1635634 1628838 1619763 1609143
52178 1609143 1598118 1587136 1575746 1563735 1551808 1540743 1530470 1520484 1510730 1501603 1493373 1486228
$$ packed form
52269I87765N861O615O984P227P140O662O412P066Q499J0050J1315J2333J3214
52256A097143J3998J4741J5348J5416J4582J2969J1095R353P760O217M759L557
52244A226938K694K151J957K247L001L827M285M412M590M818M623L858L126L033
52230A275560L506M197N076O030O428N884N083M962N268M940L853L156L634M695
52216A342272N367N517N630N907O145O129N838N548N847P033Q445R025Q728Q720
52202A436151R776J1160J1625J1068J0505J0727J1569J2416J2956J3283J3499
52191A564735J3364J2545J1250J0268R907R200O839K917j123m268o796r075j0620
52178A609143j1025j0982j1390j2011j1927j1065j0273r986r754r127q230p145
$$ plain form
52166 1486228 1480722 1477597 1477005 1478283 1480608 1483654 1487482 1492003 1496766 1501211 1504973 1507893 1509898 1510944
52152 1510944 1511095 1510538 1509587 1508760 1508767 1510121 1512607 1515288 1517207 1518055 1518045 1517296 1515542 1512387 1507687 1501653 1494779
52135 1494779 1487657 1480775 1474361 1468345 1462454 1456530 1451017 1447108 1446115 1448464 1453422 1459872 1467269 1475876
52121 1475876 1486341 1499153 1514258 1531051 1548888 1567670 1587687 1608898 1630745 1652790 1675111
$$ packed form
52166A486228n506l125n92J278K325L046L828M521M763M445L762K920K005J046
52152A510944J51n57r51q27PJ354K486K681J919Q48j0p49j754l155m700o034o874
52135A494779p122o882o414o016n891n924n513l909r93K349M958O450P397Q607
52121A475876J0465J2812J5105J6793J7837J8782K0017K1211K1847K2045K2321
$$ [...]
##END NTUPLES=NMR SPECTRUM
##END=
