##TITLE=AC1510_ROEFFECT0001_8201620_6AwAUtwhzF
##JCAMPDX= 6.0         $$ Bruker NMR JCAMP-DX V2.0
##DATA TYPE= NMR SPECTRUM
##DATA CLASS= NTUPLES
##ORIGIN= BRUKER
##OWNER= Administrator
$$ 1.72 TOPSPIN		Version 2.1
$$ 2013-09-26 17:41:12.520 -0700  Administrator@X
$$ Compression mode = diff/dup
##.OBSERVE FREQUENCY= 400.02188249412
##.OBSERVE NUCLEUS= ^1H
##.ACQUISITION MODE= SIMULTANEOUS (DQD)
##.ACQUISITION SCHEME= undefined
##.AVERAGES= 8
##.DIGITISER RES= 22
##SPECTROMETER/DATA SYSTEM= spect
##.PULSE SEQUENCE= zg30
##.SOLVENT NAME= COFFEE_meoh
##.SHIFT REFERENCE= INTERNAL, COFFEE_meoh, 1, 14.98509
##AUDIT TRAIL= $$ (NUMBER, WHEN, WHO, WHERE, PROCESS, VERSION, WHAT)
$$ ##TITLE= Audit trail, TOPSPIN		Version 2.1
$$ ##JCAMPDX= 5.01
$$ ##ORIGIN= Bruker BioSpin GmbH
$$ ##OWNER= Administrator
$$ $$ E:\/data/COFFEE/nmr/AC1510_ROEFFECT0001_8201620_6AwAUtwhzF/20/pdata/1/auditp.txt
$$ ##AUDIT TRAIL=  $$ (NUMBER, WHEN, WHO, WHERE, PROCESS, VERSION, WHAT)
(   1,<2013-09-26 17:41:04.942 -0700>,<Administrator>,<X>,<go>,<TOPSPIN 2.1>,
      <created by zg
	started at 2013-09-26 17:39:59.753 -0700,
	POWCHK enabled, PULCHK disabled,
       configuration hash MD5:
       C8 4E 4E 5D D3 5C D8 9E 9F 52 82 E0 59 8A DE 15
       data hash MD5: 64K
       F7 B3 4A 08 CA B4 7F C0 7D 44 92 6A B7 CE C3 4C>)
(   2,<2013-09-26 17:41:08.505 -0700>,<Administrator>,<X>,<proc1d>,<TOPSPIN 2.1>,
      <Start of raw data processing
       efp LB = 0 FT_mod = 6 PKNL = 1 PHC0 = 0 PHC1 = 0 SI = 32K 
       data hash MD5: 32K
       DF FB 80 D4 E3 24 ED 3C 92 1C 1E F6 CB CD A7 E3>)
(   3,<2013-09-26 17:41:08.817 -0700>,<Administrator>,<X>,<proc1d>,<TOPSPIN 2.1>,
      <pk PHC0 = 92.34558 PHC1 = 0 
       data hash MD5: 32K
       A8 B7 26 50 E9 89 05 36 D9 52 97 AD 7F A4 A5 94>)
(   4,<2013-09-26 17:41:08.958 -0700>,<Administrator>,<X>,<proc1d>,<TOPSPIN 2.1>,
      <abs ABSG = 1 
       data hash MD5: 32K
       25 F1 30 EF E0 CA 4D C0 9A C3 41 7D 5F 71 62 41>)
(   5,<2013-09-26 17:41:09.067 -0700>,<Administrator>,<X>,<proc1d>,<TOPSPIN 2.1>,
      <abs ABSG = 2 
       data hash MD5: 32K
       38 C7 1D B4 02 8A 91 D9 C6 79 93 66 2F 71 D9 77>)
(   6,<2013-09-26 17:41:09.130 -0700>,<Administrator>,<X>,<proc1d>,<TOPSPIN 2.1>,
      <abs ABSG = 3 
       data hash MD5: 32K
       01 40 15 AD 75 03 C9 7E EE F6 0C 78 73 4B FD 9C>)
(   7,<2013-09-26 17:41:09.208 -0700>,<Administrator>,<X>,<proc1d>,<TOPSPIN 2.1>,
      <abs ABSG = 4 
       data hash MD5: 32K
       37 E8 1F B7 68 59 C0 B6 9F 9D 8D BD DB 25 35 D2>)
(   8,<2013-09-26 17:41:09.255 -0700>,<Administrator>,<X>,<proc1d>,<TOPSPIN 2.1>,
      <abs ABSG = 5 
       data hash MD5: 32K
       C2 1B 58 9D 90 A9 5A F0 32 6D 39 E7 B7 50 7F A2>)
$$ ##END=
$$ 
$$ $$ hash MD5
$$ $$ CB AD 58 3F B5 F2 0E 80 EB C2 69 AA 99 8C 4D 60
##$RELAX= 
##$RELAX= 
##$RELAX= 
##$RELAX= 
##$RELAX= 
##$RELAX= 
##$RELAX= 
$$ Bruker specific parameters
$$ --------------------------
##$DU= <E:\>
##$EXPNO= 20
$$ [...]
150 150 150 150 150 150 150 150
##$TP07= 0
##$TPNAME0= <>
##$TPNAME1= <>
##$TPNAME2= <>
##$TPNAME3= <>
##$TPNAME4= <>
##$TPNAME5= <>
##$TPNAME6= <>
##$TPNAME7= <>
##$TPOAL= (0..7)
0.5 0.5 0.5 0.5 0.5 0.5 0.5 0.5
##$TPOFFS= (0..7)
0 0 0 0 0 0 0 0
##$TUNHIN= 0
##$TUNHOUT= 0
##$TUNXOUT= 0
##$USERA1= <user>
##$USERA2= <user>
##$USERA3= <user>
##$USERA4= <user>
##$USERA5= <user>
##$V9= 5
##$VALIST= <valist>
##$VCLIST= <CCCCCCCCCCCCCCC>
##$VD= 0
##$VDLIST= <DDDDDDDDDDDDDDD>
##$VPLIST= <PPPPPPPPPPPPPPP>
##$VTLIST= <TTTTTTTTTTTTTTT>
##$WBST= 1024
##$WBSW= 4
##$XGAIN= (0..3)
0 0 0 0
##$XL= 0
##$YL= 0
##$YMAX_a= 605792
##$YMIN_a= -519474
##$ZGOPTNS= <>
##$ZL1= 120
##$ZL2= 120
##$ZL3= 120
##$ZL4= 120
##$ABSF1= 14.98509
##$ABSF2= -5.573092
##$ABSG= 5
##$ABSL= 3
##$ALPHA= 0
##$AQORDER= 0
##$ASSFAC= 0
##$ASSFACI= 0
##$ASSFACX= 0
##$ASSWID= 0
##$AUNMP= <proc_prof1d_extract_pilot.lims>
##$AXLEFT= 0
##$AXNAME= <>
##$AXNUC= <1H>
##$AXRIGHT= 0
##$AXTYPE= 0
##$AXUNIT= <>
##$AZFE= 0.1
##$AZFW= 0.1
##$BCFW= 0
##$BC_mod= 0
##$BYTORDP= 0
##$COROFFS= 0
##$CY= 15
##$DATMOD= 1
##$DC= 0
##$DFILT= <>
##$DTYPP= 0
##$F1P= 0
##$F2P= 0
##$FCOR= 0.5
##$FTSIZE= 32768
##$FT_mod= 6
##$GAMMA= 0
##$GB= 0
##$INTBC= 1
##$INTSCL= 1
##$ISEN= 128
##$LB= 0
##$LEV0= 0
##$LPBIN= 0
##$MAXI= 10000
##$MC2= 0
##$MEAN= 0
##$ME_mod= 0
##$MI= 0
##$NCOEF= 0
##$NC_proc= -8
##$NLEV= 6
##$NOISF1= 0
##$NOISF2= 0
##$NSP= 0
##$NTH_PI= 0
##$NZP= 0
##$OFFSET= 14.98509
##$PC= 1
##$PHC0= 92.34558
##$PHC1= 0
##$PH_mod= 1
##$PKNL= yes
##$PPARMOD= 0
##$PPDIAG= 0
##$PPIPTYP= 0
##$PPMPNUM= 2147483647
##$PPRESOL= 1
##$PSCAL= 4
##$PSIGN= 0
##$PYNMP= <proc.py>
##$REVERSE= no
##$SF= 400.02
##$SI= 32768
##$SIGF1= 0
##$SIGF2= 0
##$SINO= 400
##$SIOLD= 32768
##$SPECTYP= <>
##$SREGLST= <1H.CDCl3>
##$SSB= 0
##$STSI= 32768
##$STSR= 0
##$SW_p= 8223.68421052631
##$SYMM= 0
##$S_DEV= 0
##$TDeff= 65536
##$TDoff= 0
##$TI= <>
##$TILT= no
##$TM1= 0
##$TM2= 0
##$TOPLEV= 0
##$USERP1= <user>
##$USERP2= <user>
##$USERP3= <user>
##$USERP4= <user>
##$USERP5= <user>
##$WDW= 1
##$XDIM= 32768
##$YMAX_p= 495294983
##$YMIN_p= -767918
##$CURPLOT= <Network HP LaserJet P1505>
##$CURPRIN= <$Network HP LaserJet P1505>
##$DFORMAT= <normdp>
##$LAYOUT= <+/1D_H.xwp>
##$LFORMAT= <normlp>
##$PFORMAT= <normpl>
##$SURQMSG= 1
$$ End of Bruker specific parameters
$$ ---------------------------------
##NTUPLES= NMR SPECTRUM
##VAR_NAME=  FREQUENCY,     SPECTRUM/REAL,   SPECTRUM/IMAG
##SYMBOL=    X,             R,               I
##VAR_TYPE=  INDEPENDENT,   DEPENDENT,       DEPENDENT
##VAR_FORM=  AFFN,          ASDF,            ASDF
##VAR_DIM=   32768,         32768,           32768
##UNITS=     HZ,            ARBITRARY UNITS, ARBITRARY UNITS
##FACTOR=    0.250966925370066, 1,           1
##FIRST=     8223.43324360094, -93795,       -409992
##LAST=      0,             236650,          -266013
##MIN=       0,             -767918,         0
##MAX=       8223.43324360094, 495294983,    0
$$ Real data points
##PAGE= N=1
##DATA TABLE= (X++(R..R)), XYDATA
$$ [...]
19564d72873a81016D9960c721A04640a79701p245Q180F0664b23077A38601L4733
19553A73334a60956A72047b361A30327K51105j55623b26689h9341B5083c1572
19542b76417k26635A54024a56543A16691n3811K18094j22658D5649a2854A26489
19531a89334F2070P5049a0027n4711B25287c1418n4093C4847L49780A9136b50967
19519E3759G12b58649A2025a4951j65283A13117P2817b7394o0847a5450H4001
19507h6516E13270f9153q8928I0373b13550J01199A90875a21430b8528D0278a26381
19495b76908D686b62697J13058A08605c49575a14687a7036j59152D39101c15484
19484a33102A15399d4574A02623L76643a70681D1422K89619g6976l27891B20053
$$ plain form
19564 -472873 -181016 49960 -3721 104640 -179701 -186946 -178766 60664 -223077 138601 173334
19553 173334 -160956 172047 -2361 130327 381432 225809 -226689 -89341 25083 -31572
19542 -276417 -503052 154024 -156543 116691 62880 280974 158316 45649 -12854 126489
19531 -189334 62070 137119 -10027 -64738 225287 -31418 -85511 34847 384627 19136 -250967
19519 53759 712 -258649 12025 -14951 -180234 113117 185934 -27394 -88241 -15450 84001
19507 -86516 513270 -69153 -158081 90373 -213550 -112351 190875 -121430 -28528 40278 -126381
19495 -276908 4686 -262697 -149639 108605 -349575 -114687 -17036 -176188 439101 -315484
19484 -133102 115399 -44574 102623 479266 -170681 41422 331041 -76976 -404867 220053
19473I7477c57331E3949B0569a03270B85882B4748b98960J6121q5540A56364i6906
19461E3256a8628l2552n009E7390d4698E7526J5803a51708C45449j9171a68238
19449a5151j66833E4423b01379n566B0470M1561Q2362a36483j62809B77968m8749
19438B29219c7721A09799a61845N8308j48052g4739A5557K71360o7056G2124K32597
19427C04721I8084k899a21906A71520c21282J31851C1750d71945a71842c9345
19416h0790j38320E0290c62825F107c95122C3819j416b90795e233A81661a08880
19404I5995a34277A39496D7824a91759l52797B49617i3589j61987e5234B06600
19393B18286e2077k09948A41396h8793E3673b28437e2126j35193A8618b22451
$$ plain form
19473 97477 -357331 53949 20569 -103270 285882 24748 -298960 -282839 -368379 156364 -96906
19461 53256 -18628 -51180 -56189 57390 -44698 57526 73329 -151708 345449 326278 -168238
19449 -15151 -181984 54423 -201379 -206945 20470 62031 144393 -136483 -299292 277968 229219
19438 229219 -37721 109799 -161845 -103537 -251589 -74739 15557 286917 219861 72124 304721
19427 304721 98084 95185 -121906 171520 -321282 -189431 31750 -471945 -171842 -39345
19416 -80790 -219110 50290 -362825 6107 -395122 33819 32403 -290795 -5233 181661 -108880
19404 95995 -134277 139496 47824 -191759 -544556 249617 -93589 -255576 -55234 206600
19393 218286 -52077 -262025 141396 -88793 53673 -228437 -52126 -187319 18618 -222451
19382A79731a02008k7704C29073A11630M0114N7343c17876A21233b289j5736A47085
19370a98446R0437j5717j4050f4801A07541M9166c15262I1829c58705f2610G1122
19358A31908a56259A09381K9648A5720g6413j12675A43998b49520A21316a96016
19347a48222A86560n7855F1693J3165B8183b07808k65344a33377N4717K6972j41982
19336a93670D8523a07287b2782j63168A5168J01289n6571J32879e3807L812A52533
19324i7348L8452B53099J02032b43578B9507h3359m4611k74586I0332a51206A20026
19312a89956D1980b86A66343a93580H1864b70921B00631c6395n3054c9274l9706
19301g8980j18612o2021A761Q7969c68817M1212A1350K4074a05211k183j25225
$$ plain form
19382 179731 -102008 -129712 329073 111630 151744 209087 -317876 121233 -2289 -18025 147085
19370 -198446 -108009 -123726 -137776 -64801 107541 156707 -315262 91829 -358705 -62610 71122
19358 131908 -156259 109381 139029 15720 -76413 -189088 143998 -249520 121316 -196016
19347 -148222 186560 128705 61693 74858 28183 -207808 -473152 -133377 -78660 -51688 -193670
19336 -193670 48523 -107287 -22782 -185950 15168 116457 59886 192765 -53807 -49995 152533
19324 -97348 -58896 253099 355131 -243578 29507 -83359 -127970 -402556 90332 -151206 120026
19312 -189956 41980 -286 166343 -193580 81864 -270921 200631 -36395 -89449 -39274 -78980
19301 -78980 -197592 -259613 1761 89730 -368817 -327605 11350 35424 -105211 -107394 -232619
19290b32619F8049N104h2670b8836A56607a39233F929a99569j27415A30162B8165
19278b22408i4896A27985h7651m0953B15365a66335D7031e6935j97924e4706A02744
19266B12883d1187n33089D9209a48071A39870B4959J76792j8775a24204F9091
19255B65432a67328d8925j68889g0827F4337b8401B10245c11586f6901J3538A24389
19243a78321h1183j16086j624A62106f7586E8354a27026B03561c41753G7114d1047
19231d57888a9624q9355M0085C4724j0085h1950b4375j59836A03612d5709l04911
19220c50620a03407j1566l16374A7017a89526O6828k77657A00650c20234i034
19209a7216n9446A34271f4601e662B1829b26360J441N3447N8312j8870k01508
$$ plain form
19290 -232619 68049 73153 -82670 -28836 156607 -139233 6929 -199569 -326984 130162 28165
19278 -222408 -94896 127985 -87651 -128604 215365 -166335 47031 -56935 -254859 -54706 102744
19266 212883 -41187 -574276 49209 -148071 139870 24959 201751 182976 -124204 69091
19255 265432 -167328 -48925 -217814 -70827 64337 -28401 210245 -311586 -66901 -53363 124389
19243 -178321 -81183 -197269 -198893 162106 -67586 58354 -127026 203561 -341753 77114 -41047
19231 -457888 -19624 -108979 -68894 34724 24639 -81950 -24375 -184211 103612 -45709 -350620
19220 -350620 -103407 -114973 -431347 17017 -189526 -122698 -400355 100650 -320234 -9034
19209 -17216 -76662 134271 -64601 -5662 21829 -226360 -224919 -171472 -113160 -132030 -333538
19198c33538D6231Q7560h319A25677d5098C4280K45721A12895e4720A2625b7316
19186g4738j8336j51502A84458q9061N45c72135f3367D6150e119j49856L4883
19175a20092B6991K2080J03985C7727C315L6641c21721B42880B3508J52797N0496
19164B26801p7987A687L77199b4192R34p7002r2047H4299b7796C2421f4786b6614
19151a95826H7161b47476B27224f7276j32619J9465l8395b8642G7202N1648a83001
19139a66682g5432g480E9983J76233A07698b77336i6305b2375A70787c4210A42761
19127d0943j32844J0928I6528e9117D476L59376j44264a43505j01951I919b93924
19115b35890C53272c27305A24552E3884b23193b7351r8292l44855b17289j85671
$$ plain form
19198 -333538 46231 133791 -8319 125677 -45098 34280 280001 112895 -54720 12625 -27316
19186 -74738 -93074 -244576 184458 95397 95942 -372135 -63367 46150 -5119 -154975 -120092
19175 -120092 26991 49071 153056 37727 3315 39956 -321721 242880 23508 176305 226801
19164 226801 148814 1687 378886 -24192 -23258 -100260 -192307 84299 -27796 32421 -64786 -26614
19151 -195826 87161 -247476 227224 -67276 -199895 -180430 -218825 -28642 77202 128850 -183001
19139 -166682 -75432 -7480 59983 236216 107698 -277336 -96305 -22375 170787 -34210 142761
19127 -40943 -173787 -162859 96528 -59117 4476 363852 219588 -143505 -245456 9919 -293924
19115 -235890 353272 -327305 124552 53884 -223193 -27351 -125643 -470498 -217289 -402960
19105d02960a59558j25904E8916h4859j96127H1843a00286A59484R1935E1321
19094b44822A38115a7407k79256C9137J93054F5216c13455c6467H6148a40852
19083B37059a7390n1671b7614m71605F4076L00395a37811e2548A78792b26596
19072a44470j9255B22865a23275A7867a11220B5538a27279k40920a69450Q3396
19062h6054D2850b03193F5064h1162k78599j091A97578f8322b2582C5176a1987
19050i891j66223J8269e8961B89707E465b49165E11019D3816A9651a44862B8160
19038A10770K7964j5822K6166c01830A31563A9093K42390j22232a44635A9054
19027e7640C48496b9756D0400a18933j50974a18649F2784A474O6384i9446m4695
$$ plain form
19105 -402960 -159558 -285462 58916 -84859 -280986 81843 -100286 159484 251419 51321
19094 -244822 138115 -17407 -296663 39137 232191 65216 -313455 -36467 86148 -140852
19083 237059 -17390 -69061 -27614 -499219 64076 364471 -137811 -52548 178792 -226596
19072 -144470 -163725 222865 -123275 17867 -111220 25538 -127279 -368199 -169450 -86054
19062 -86054 42850 -203193 65064 -81162 -359761 -360852 197578 -68322 -22582 35176 -11987
19050 -9891 -176114 -157845 -58961 289707 5465 -249165 511019 43816 19651 -144862 28160
19038 110770 138734 122912 149078 -301830 131563 19093 261483 139251 -144635 19054
19027 -57640 348496 -29756 40400 -118933 -269907 -118649 62784 1474 67858 -99446 -144141
19016a44141d1466l8562k6319A19229b4086B5940J05826e28554B24585c09734
19005a88523j30369B13746m2462a37287l14148J25754D0845g5596p0175n7081
18995b02852b5499B88692a1358o3068j70256j61137A25716c5572r652A50622J12840
18984B63462b32549N1933F2496k427b693j45836O0480j45529F9727b20473p4112
18973b94585J28246n3267F8993A7136M4031g4646B53073g0790k60438J50786h4269
18961b49911g6548P087K314b70A63647c39208H7688b47830B52011c07239L9720
18950b67519L101i8969d6499A15911L22184a7372A40997a49850A10658a8666o915
18939b5581B26997N8301c37970H0954d69425a62191B71895j157Q9509g2310k7494
$$ plain form
19016 -144141 -41466 -80028 -106347 119229 -24086 25940 131766 -528554 224585 -309734
19005 -188523 -318892 213746 171284 -137287 -451435 -325681 40845 -75596 -145771 -202852
18995 -202852 -25499 288692 -11358 -74426 -244682 -405819 125716 -35572 -45224 150622 263462
18984 263462 -232549 -180616 62496 60069 -2693 -148529 -88049 -233578 69727 -220473 -294585
18973 -294585 -166339 -219606 68993 17136 61167 -74646 253073 -70790 -331228 -180442 -84269
18961 -249911 -76548 -69461 -67147 -270 163647 -339208 87688 -247830 252011 -307239 -267519
18950 -267519 -264418 -98969 -46499 115911 438095 -17372 140997 -149850 110658 -18666 -25581
18939 -25581 226997 285298 -337970 80954 -469425 -162191 271895 270738 360247 -72310 -99804
18928i9804A88737I1675i5867j8053j7459B53468E3371l00P1054f0619n5258N3382
18916f2495q4977e4541k3476h997j46215j26174H0578J39004f4686m9539k53727
18905c67952C28411c10325J09845h6991b8583j46155Q5613a7002k09350R6790
18895a29562j20560G7845c13033h968B31930J61086E0111i782k88518f5237m8516
18884a13753J3515E0143b6748H3810L05534a58897A11130l7813a32812B4643f6078
18872C8285c5811o7727d7716l29642e5391a3449E9709f607C53774E1557J30745
18861A82302b25224B77506d87145F6448j5173a9310C530N9148L03392f424H5546
18849a3996E2143c53631A56720c8068j22117P9743j74329B88111p8900j9361l8563
$$ plain form
18928 -99804 188737 91675 -95867 -113920 -131379 253468 53371 53071 124125 -60619 -115877 -62495
18916 -62495 -147472 -54541 -78017 -8997 -155212 -281386 80578 219582 -64686 -114225 -367952
18905 -367952 328411 -310325 -200480 -86991 -28583 -174738 -89125 -17002 -226352 -129562
18895 -129562 -250122 77845 -313033 -8968 231930 393016 50111 -9782 -298300 -65237 -113753
18884 -113753 -100238 50143 -26748 83810 389344 -158897 111130 73317 -132812 24643 -66078
18872 38285 -35811 -103538 -47716 -377358 -55391 -13449 59709 -6607 353774 51557 182302
18861 182302 -225224 277506 -487145 66448 51275 -19310 3530 62678 366070 -6424 85546
18849 -13996 52143 -353631 156720 -38068 -160185 -80442 -254771 288111 209211 189850 151287
18838A51287a15375b7509p7735D02586b56306a02526j17634j95598F0125d4689
18827c82937a29629A84967O4110L3260j01021d537o8720A08468i0546H0973g3504
18815G2717J88995E0511M4117k6958P137L15991j60025a08362A39451o5583b3656
18803I0959m1781e2517j48463K2003l73324h775C9867h6204A69015b84656J07038
18792a77618D0448M2095c48039a60747A3710K571c61072A06567f0960m2645D6096
18780G183e2155l8735b3823l2119l5429n3826d8647m318q3546C461J06956N7764
18768A68181e2924B10714J3185m1387J39840b44108a01830b1146C9113J86787
18758B25900c42150A8604K14025A15786C8647b53706M4451Q2137B94209C466J57755
$$ plain form
18838 151287 -115375 -27509 -105244 402586 -256306 -102526 -220160 -415758 60125 -44689
18827 -382937 -129629 184967 249077 282337 181316 -4537 -73257 108468 -90546 80973 -73504
18815 72717 261712 50511 94628 67670 74807 390798 230773 -108362 139451 73868 -23656
18803 90959 49178 -52517 -200980 -178977 -552301 -8775 39867 -86204 169015 -284656 -177618
18792 -177618 40448 82543 -348039 -160747 13710 16281 -361072 106567 -60960 -103605 46096
18780 7183 -52155 -90890 -23823 -55942 -91371 -145197 -48647 -52965 -136511 3461 110417 168181
18768 168181 -52924 210714 223899 182512 322352 -244108 -101830 -21146 39113 225900
18758 225900 -342150 18604 232629 115786 38647 -253706 -209255 -127118 294209 3466 161221
18747A61221b14393o3027g3933B9209J27195a59400A15784c68880c8192l37540
18737c75732A77847c95319A6556b99651D2568d47684J60285a022k83308B14636
18726B6683N9627a70910Q4277j17142N1821a8283o2570l9978D19823i1235o5579
18715a56814l63045e5800B33944I612K78118h6026A02705b43979E41446a98302
18704F9296c67999j5949A14233a5273k65384c051o1287b7027F6960f8533j5730
18693h4263A52747a63002M6941L1908A5167b91483H5398a31515d0343A76621E9788
18681D0217e22602B89454a80845P6901G3673b53730A7760g4757B31914E5911b4548
18669d1405A10033c55636H632J95247g6418B52554b32586B7617a4453j9581j00999
$$ plain form
18747 161221 -214393 -277420 -73933 29209 156404 -159400 115784 -368880 -38192 -375732
18737 -375732 177847 -395319 16556 -299651 42568 -447684 -287399 -1022 -284330 214636
18726 26683 86310 -170910 -86633 -203775 -151954 -18283 -80853 -120831 419823 -91235 -156814
18715 -156814 -519859 -55800 233944 9612 287730 -86026 102705 -243979 541446 -198302
18704 69296 -367999 -383948 114233 -15273 -280657 -3051 -64338 -27027 66960 -68533 -84263
18693 -84263 152747 -163002 -116061 -84153 15167 -291483 85398 -131515 -40343 176621 59788
18681 40217 -522602 289454 -180845 -103944 73673 -253730 17760 -74757 231914 55911 -24548
18669 -41405 110033 -355636 8632 203879 -76418 252554 -232586 27617 -14453 -34034 -135033
18658a35033B20066b96792D742d1058d620k13591a03302k57731d1810o2320A15236
18646C62115f5736K5384A79038a05310a3732m93011a6316m4759l7898C71586a51465
18634b70203I0877i6655j2138j38527j82750a35265j99912A31564g9511m3920
18624a23431e7365p4833D1594e3778k098G9415b60709A52008E8418d4153m1846
18613h5999j68598B93080b21409J04530m4894q9661a19586J0776l62392f1416
18602b36129I7897C0785c0982k3236F169h3320j12339F2202g3500l9919E0805
18590a11601F3692J936b66262A38313o4894a10810e905j90324L9554C4535K4483
18579E9018K99998d8448B2639J6240a53907A1220J15562C3208d90541a07144L0935
$$ plain form
18658 -135033 220066 -296792 4742 -41058 -4620 -218211 -103302 -361033 -41810 -104130 115236
18646 362115 -65736 -40352 179038 -105310 -13732 -506743 -16316 -61075 -98973 371586 -151465
18634 -270203 90877 -96655 -108793 -247320 -430070 -135265 -335177 131564 -79511 -123431
18624 -123431 -57365 -132198 41594 -53778 -55876 79415 -260709 152008 58418 -44153 -85999
18613 -85999 -254597 293080 -221409 -116879 -161773 -251434 -119586 -108810 -471202 -61416
18602 -236129 97897 30785 -30982 -54218 6169 -83320 -195659 62202 -73500 -113419 50805
18590 -111601 63692 65628 -266262 138313 73419 -110810 -5905 -196229 -156675 34535 59018
18579 59018 359016 -48448 22639 38879 -153907 11220 126782 33208 -490541 -107144 -76209
18568g6209p5884C1846a44125A9243Q4850b4046k93116a15011A0706c21743a50049
18556a44993A27261i401q9978j68393J11301J1498m1657C2837J40206b36516Q2609
18545a53907J7179a4061k38352E5607a25256j13066f8553A38313n0987d3587o7688
18534a11275J8039A4407b53036K3762f1846l999B37167b79297J29615A50762a1523
18522b20618E4446j3737c21538F7196a0535j79399M7563a8510j03903A24836E3420
18510B6910a81226A9049b62634C3766a9973A18790L05209a06635B12879b31057
18499C8363N3185a84190M7769r5386b4674A92261O5979a47175j2752B57759j06744
18488A51015i0539n4403A94133A5180c7931C04198R7991k7256a15288A06496a30492
$$ plain form
18568 -76209 -152093 31846 -144125 19243 104093 -24046 -317162 -115011 10706 -321743 -150049
18556 -144993 127261 -9401 -99379 -267772 -156471 -144973 -186630 32837 173043 -236516 -153907
18545 -153907 -136728 -14061 -252413 55607 -125256 -238322 -68553 138313 87326 -43587 -111275
18534 -111275 -93236 14407 -253036 -229274 -61846 -65845 237167 -279297 -149682 150762 -11523
18522 -220618 54446 40709 -321538 67196 -10535 -189934 -142371 -18510 -122413 124836 53420
18510 26910 -181226 19049 -262634 33766 -19973 118790 423999 -106635 212879 -231057
18499 38363 91548 -184190 -136421 -231807 -24674 192261 258240 -147175 -159927 257759 151015
18488 151015 -90539 -144942 194133 15180 -37931 304198 402189 374933 -115288 106496 -130492
18476a00373k26978R4803B86873a72422B66252j09413F8063c184k14914j27566
18466c45664A03553a15091C39576H0890d15942a58510N3677D1513j8873M7558
18456G0198a27405B11119j00516a77696O1871G2032j9060a08919l0730A39779
18445A17917a22385r5912B53487E8721b90281A91770h5794m9426a2965l58825
18435c71790A6342a71539H8689b02416f2284A57698a96452g4654l38395R4947
18425c18102J09978d7335A31817b33842A1540J15775D1378H128b63045B19284
18414I6011b14027q1724I6429b72308B15728R4922d9341j30605A69297q4126b5768
18402f2977A18574b1492j36260e1754j84370o0357J5809G7321b7030C54583h1511
$$ plain form
18476 -100373 -327351 -232548 286873 -172422 266252 156839 68063 -3184 -218098 -345664
18466 -345664 103553 -115091 339576 80890 -415942 -158510 -104833 41513 22640 70198
18456 70198 -127405 211119 110603 -177696 -115825 72032 52972 -108919 -139649 139779
18445 117917 -122385 -218297 253487 58721 -290281 191770 -85794 -135220 -12965 -371790
18435 -371790 16342 -171539 88689 -202416 -62284 157698 -196452 -74654 -413049 -318102
18425 -318102 -208124 -47335 131817 -233842 11540 127315 41378 8128 -263045 219284
18414 96011 -214027 -295751 96429 -272308 215728 310650 -49341 -179946 169297 85171 -25768
18402 -62977 118574 -21492 -157752 -51754 -236124 -296481 -280672 77321 -27030 354583 -81511
18390b60810a25276j24987A03444a25726c064k47574K9769A59648K9643c81795
18379b56715a20434N3221B60004a87824I9699f1962B84696b31513M0033Q6968
18369a04512D1952c50560c5167A05837a50526j26531P5886A49153a60865B54340
18358b92549J34617D9836o713a92753a9968o8289j67700A37115a54401H184b4208
18346A23194B1527b82901a06895c7046j08032H8480Q8715a39047B37211b19613
18335B767a08788D8911J64598a84228b7806l29287J01548b0217B09105a42172
18324a94948e9035B03851G3319b17282j51068c0891j62115m1348f1869d615p5513
18313h0128F4425b52464C1739i932l04291B7874L00801J29842G4208i9148C34108
$$ plain form
18390 -260810 -125276 -250263 103444 -125726 -3064 -250638 -220869 159648 189291 -381795
18379 -256715 -120434 -67213 260004 -187824 99699 -61962 284696 -231513 -191480 -104512
18369 -104512 41952 -350560 -35167 105837 -150526 -277057 -201171 149153 -160865 254340
18358 -292549 -157932 49836 43123 -192753 -19968 -88257 -255957 137115 -154401 8184 -24208
18346 123194 21527 -282901 -106895 -37046 -145078 88480 177195 -139047 237211 -219613
18335 2767 -108788 48911 213509 -184228 -27806 -357093 -255545 -20217 209105 -142172
18324 -194948 -59035 203851 73319 -217282 -368350 -30891 -193006 -234354 -61869 -4615 -80128
18313 -80128 64425 -252464 31739 -9932 -314223 27874 328675 458517 74208 -99148 334108
18301B38560q6217b63475a14765E9078a19370j34774a9120k15808e5771B16397
18290C01453A04551m8099B5876c19634D9301N8030k731j1515e783p4963j40815
18279b21561F3484a47063k70026A7853P9889I028b80522c103j70303a3469C36871
18267b54530f4527A23780E3746b64929N3085a02671C01843B7769N25828b64064
18256c00398b7654A46861r417h09B19487d65244a56872k16616A54238J57474I539
18244a17j50364A95014a31775A36171a51243j09600B6142i7572A70936a5921j5776
18233c1697C10002a79946g5350c918G8042b84730f7460B02949B9340e0022A27431
18221c6575j6007H6205N2632K63982j85572a3521j21148m4678H8274g2986j30198
$$ plain form
18301 238560 152343 -263475 -114765 59078 -119370 -254144 -19120 -234928 -55771 216397
18290 301453 104551 56452 25876 -319634 49301 107331 104600 93085 -5783 -80746 -221561
18279 -221561 63484 -147063 -417089 17853 97742 9028 -280522 -3103 -173406 -13469 336871
18267 -254530 -64527 123780 53746 -264929 -211844 -102671 301843 27769 553597 -264064
18256 -300398 -27654 146861 137444 -809 219487 -465244 -156872 -373488 154238 311712 9539
18244 -117 -150481 195014 -131775 136171 -151243 -260843 26142 -97572 170936 -15921 -31697
18233 -31697 310002 -179946 -75350 -3918 78042 -284730 -67460 202949 29340 -50022 127431
18221 -36575 -52582 86205 138837 402819 217247 -13521 -134669 -179347 88274 -72986 -203184
18210b03184a9384k42945Q2257P9133b7220l73743d0073j8093F9565a520k08894
18199b10414M835j92366g923j57247A15942c01428R3237g536j19390j63003A74713
18187d3301j07161B16837M2947a17663A4814R25L31849A14701l6788N5038B2129
18175a22076A51836D752b6295j17181D2784a02405j1452C8011b1544j88903A24002
18163I2991d64427K12113e5466E386f7847r0874j99871J15635f438j52037o7071
18152b25546A66609F4183b86710e7097C5778d8051j12143m5661A39805a32118
18141A7218a06862K0421C46966j02452n5344l4643B0185i8816k90422d7954D7183
18129e1078B49357b29995h8356E4056a4954H36e0349q8140A20401K2673L2077
$$ plain form
18210 -203184 -19384 -262329 -180072 -100939 -27220 -400963 -40073 -58166 69565 -1520 -210414
18199 -210414 -205579 -397945 -7923 -165170 115942 -301428 -208191 -7536 -126926 -289929 174713
18187 -43301 -150462 216837 259784 -117663 14814 15739 347588 114701 77913 132951 22129
18175 -122076 151836 4752 -26295 -143476 42784 -102405 -113857 38011 -21544 -210447 124002
18163 92991 -464427 -252314 -55466 5386 -67847 -158721 -358592 -242957 -6438 -158475 -225546
18152 -225546 166609 64183 -286710 -57097 35778 -48051 -160194 -205855 139805 -132118
18141 17218 -106862 -86441 346966 244514 189170 154527 20185 -98816 -389238 -47954 47183
18129 -51078 249357 -229995 -88356 54056 -14954 836 -50349 -138489 120401 143074 175151
18118A75151g2707q7458E1848a05524c0209A87532a728A20198f1090l83637A52845
18106A4415a6703k6403j8942A5035b5313G2253J72627a03321j40466A12665D8227
18094b6013j6203A33380D5472M6131L1043a35198b145j63520j8357f002A627a95936
18081a40958A3466b88137a29597A71858J17093A18399Q7034g9040D9320Q7293
18071A36613L6337J83009c18197A32731b12414a06021m25005b37785J11917o577
18061a32445a6968e980l46712C22292d2374C9354Q6928a02307m92984A03088c22829
18049a84884K0981A22177C9149e0977A44558C1923A5428L4568g5490k57888B65251
18037B6041J17323b35774A79466a62549N8073j9120c9170A40811e6512n958j05608
$$ plain form
18118 175151 -72707 -160165 51848 -105524 -30209 187532 -1728 120198 -61090 -444727 152845
18106 14415 -16703 -43106 -62048 15035 -25313 72253 244880 -103321 -243787 112665 48227
18094 -26013 -42216 133380 45472 91603 122646 -135198 -2145 -165665 -184022 -6002 1627 -195936
18081 -140958 13466 -288137 -129597 171858 288951 118399 205433 -79040 49320 136613
18071 136613 172950 355959 -318197 132731 -212414 -106021 -531026 -237785 -125868 -132445
18061 -132445 -16968 -5980 -352692 322292 -42374 39354 126282 -102307 -595291 103088 -322829
18049 -184884 -163903 122177 39149 -50977 144558 31923 15428 49996 -75490 -333378 265251
18037 26041 143364 -235774 179466 -162549 -104476 -123596 -39170 140811 -56512 -62470 -168078
18026a68078n4892h6945B72509D5541d3818a6900A5854c25727A65098J97064b8997
18014d8074l02779G9959Q6497l4086g1664A95391c86461I4891c28347F8914c13708
18002b3199C9260a34971M7710K3738F0406b1855A1977b82949A47432b42146A02705
17990c44114L3925A5226a20090e3186j60668c0040A48888H82L29438d9092j93502
17979b42594C56893b43538E3599b96756a33768c760m5810B1631b02411b584p6118
17968g8702k28928G8768a4723B4400J39591i1337q6864A81010a25400B96431g9547
17956E1389M263b18961D77453A75870c33434C87037G7798K15630h5641A55736
17945C12085p9017a31737j42815B54190d9901G4455G505M3305L6730R4980a59735
$$ plain form
18026 -168078 -222970 -86945 272509 45541 -43818 -16900 15854 -325727 165098 362162 -28997
18014 -48074 -350853 79959 166456 132370 -71664 195391 -386461 94891 -328347 68914 -313708
18002 -23199 39260 -134971 -87261 -63523 60406 -21855 11977 -282949 147432 -242146 102705
17990 -344114 -310189 15226 -120090 -53186 -213854 -30040 148888 882 330320 -49092 -242594
17979 -242594 356893 -243538 53599 -296756 -133768 -3760 -49570 21631 -202411 -2584 -78702
17968 -78702 -307630 78768 -14723 24400 163991 -91337 -178201 181010 -125400 296431 -79547
17956 51389 55652 -218961 477453 175870 -333434 387037 77798 293428 -85641 155736
17945 312085 233068 -131737 -274552 254190 -49901 74455 7505 50810 87540 182520 -159735
17933i3901j65600A80828E3921a60084C4681a07574b4765n3291b4125l8526j07742
17922a70393j13587f3511E3168L20674h5685D9064g0448r413j01643l4049o6381
17911b81934f0157j15144O2166P272A05307l3312B3815h8541j75345a02426D233
17899D1588K57232c80014O2293A68355J65258A09044K0763k9036P1616a93397
17888a42726B70920G4318P7696o1377a25402a4797m7507k06714i8810k45011k06438
17877e50259b00682O6189o8874m4074J20441F2636e1879A79589a4460G661K33033
17866B40694e5618D1247j1609K41040o5855f57B38282A11351a31512N4432n805
17855h2885C20952a30881j40628P6715j67587C23958j02110F1810e4066A15976
$$ plain form
17933 -93901 -259501 180828 53921 -160084 34681 -107574 -24765 -78056 -24125 -62651 -170393
17922 -170393 -283980 -63511 53168 373842 -85685 49064 -70448 -79861 -181504 -215553 -281934
17911 -281934 -60157 -175301 -113135 -105863 105307 71995 23815 -88541 -263886 -102426 4233
17899 41588 298820 -380014 -317721 168355 333613 109044 129807 100771 172387 -193397
17888 -142726 270920 74318 152014 90637 -125402 -14797 -62304 -269018 -98810 -343821 -550259
17877 -550259 -200682 -134493 -203367 -247441 -127000 62636 -51879 179589 -14460 7661 240694
17866 240694 -55618 41247 29638 270678 204823 -657 238282 111351 -131512 -77080 -82885
17855 -82885 320952 -130881 -271509 -194794 -362381 323958 221848 61810 -54066 115976
17844a69752A62622m2424k0488Q738f3383D0346N7325a93725I6769L6575B9359
17832c02718a2169n1863h499M081m0364B60364a36116i986j44726H9044b07704
17820i7960o8514j54091f7025E111a66606B11444F5223a03443B4608L59029A6491
17808e6997o4093q09e1285D3460A0188K74429H4287a54819C71045c90031D00351
17796C21529b02132C0461c6577A48360E6112A3375a43827o1439d1355A28875N7831
17785A86706b46884E3536A926J14871B8912J16510c98411a28071l22568A61508
17774a33056E1929h4979E5383l408L9937c03109J07921e0022j9221D8036N1805
17763I9841K09828j10680n7088a45475a8092j22761C43832A54541o3616a53972
$$ plain form
17844 -169752 162622 120198 99710 108448 -63383 40346 97671 -193725 96769 133344 29359
17832 -302718 -12169 -64032 -8499 -4418 -44782 260364 -136116 -9986 -154712 89044 -207704
17820 -97960 -166474 -320565 -67025 5111 -166606 211444 65223 -103443 24608 383637 16491
17808 -56997 -121090 -121899 -51285 43460 10188 284617 84287 -154819 371045 -390031 400351
17796 321529 -202132 30461 -36577 148360 56112 13375 -143827 -205266 -41355 128875 186706
17785 186706 -246884 53536 1926 116797 28912 145422 -398411 -128071 -450639 161508
17774 -133056 51929 -84979 55383 51975 91912 -303109 -195188 -50022 -69243 48036 99841
17763 99841 309669 198989 141901 -145475 -18092 -140853 343832 154541 90925 -153972
17752f1818k51652A17466J5712a97423b2866l6935h471j87682Q4920A39005K33169
17741C72174f4586A69754b07163I1206b70628R4372A04655K82348b65571i289
17730A07662g6576P770B97900A25804b17070j83604a57858A93988H5744J84325
17720B70069E0086K30119d3485A0127K05127j4108j9648D292L38227b16034j2593
17709b28627B37062I727a07298o6157O1162A03461h4991r7788F1895d3860R670
17698c4190r7746C53812c1592A30568J47850h1948E1771K07984g0267H037a62332
17686h9086A13401b1276Q203k5166B25117a16407K429c7119j34267E8426f9496
17674f9508o4321C65577F2438q410a22692e881A29081m104i074k10999R4084A76968
$$ plain form
17752 -61818 -313470 117466 133178 -197423 -22866 -59801 -8471 -196153 -111233 139005 372174
17741 372174 -64586 169754 -207163 91206 -270628 -176256 104655 387003 -265571 -9289
17730 107662 -76576 -68806 297900 125804 -217070 -400674 -157858 193988 85744 270069
17720 270069 50086 280205 -43485 10127 215254 201146 181498 4292 342519 -216034 -228627
17709 -228627 237062 9727 -107298 -173455 -112293 103461 -84991 -182779 61895 -43860 -34190
17698 -34190 -131936 353812 -31592 130568 278418 -81948 51771 259755 -70267 8037 -162332
17686 -89086 113401 -21276 -13073 -38239 225117 -116407 -113978 -37119 -171386 58426 -69496
17674 -69508 -133829 365577 62438 54028 -122692 -5881 129081 124977 -9074 -220073 -125989 176968
17661F6886a63966H8370K3562B1486J44448L4322G374M6264b5820j00653D5610
17649A78454b88862R2828A38475k5853b61206E95747h5341A55340G3890h5951
17638f4209E7340e0388n7241D00838A56773J35907a6783B11691e7472D1114a89217
17626b01190j70855e3885g886j82993B9746R7272a16754k35036A2864L87335A83322
17614g8855j61238C6250a58421e01B52283a2169j75292G5131B2514Q3492J4690
17603A20696J31858H7203J5769k4038P753K28620A8718a6186D0307a59423g9659
17591F3982e659m5078B18459b77141A04696b72277A96723a16383D5841K76720
17581C22561J15715A26273b70783A91793K65267a39979I0609b24716O126B95664
$$ plain form
17661 66886 -163966 88370 111932 21486 165934 200256 7374 53638 -25820 -126473 45610
17649 178454 -288862 -196034 138475 112622 -261206 595747 -85341 155340 73890 -85951
17638 -64209 57340 -50388 -107629 400838 156773 292680 -16783 211691 -57472 41114 -189217
17626 -201190 -372045 -53885 -7886 -190879 29746 127018 -116754 -351790 12864 400199 183322
17614 -78855 -240093 36250 -158421 -501 252283 -12169 -187461 75131 22514 106006 120696
17603 120696 252554 87203 102972 78934 86687 315307 18718 -16186 40307 -159423 -79659
17591 63982 -5659 -50737 218459 -277141 104696 -272277 196723 -116383 45841 322561
17581 322561 438276 126273 -270783 191793 457060 -139979 90609 -224716 -218590 295664
17570a08389j2134I826K70717d413p792A07607J9552g5713A99625A1194K15829
17559B27023O3586b25776a05764J7988j11796L3432k7134N1780j43498D35724
17548B64916b10825d2120g881l48348c4898q3815A67194m2554Q087J42771j13313
17537A62185a50918B10375o5635o4512h264A99040J47820j5532F4475N6699J57901
17526B79075I1636h7057L5232D777J81544b12535A03527K64077b9959D13270a06470
17514A96143m8586A2661K1065J12830h0642A87711h1183c8216I8339m1810M8195
17503A04724A9578a17021N6142k73621G3026K1618d01663A11750g510A13132g6662
17491A90789L5513I6120Q2054J04291b05618e5188E13690F4937N2056A5479K23006
$$ plain form
17570 -108389 -120523 9826 280543 -4413 -12205 107607 127159 -75713 199625 11194 227023
17559 227023 290609 -225776 -105764 -87776 -199572 -166140 -193274 -141494 -284992 435724
17548 264916 -210825 -42120 -7881 -356229 -34898 -118713 167194 124640 132727 275498 162185
17537 162185 -150918 210375 144740 80228 -8264 199040 346860 331328 64475 121174 279075
17526 279075 91636 -87057 -51825 4777 186321 -212535 103527 367604 -29959 413270 -106470
17514 196143 147557 12661 33726 146556 -80642 187711 -81183 -38216 98339 56529 104724
17503 104724 19578 -117021 -60879 -334500 73026 94644 -401663 111750 -7510 113132 -76662
17491 190789 226302 96120 178174 282465 -205618 -55188 513690 64937 116993 15479 238485
17480B38485H5618P8554L1551I736k076J24243d2277A97845e3981B0578J54688
17469A75266K64098G2150J67917J66665A61384J27713m3637F9878a4228j63094
17459a77322A50116c7567l36884a17868E06456a2741A05751J32173J31899H9863
17448B48361J1241H5401L5921C110R0919J20601Q7857m399J02727L7896j99494
17437B39217a45016c8218E53715A08889O5960J8037L5984F9832a7706B33398A10730
17425B57479I0037M07232j97180a04343B87274A6987J20915b8677E97459k54356
17415C43103A15730L51912j14454o9822L3854A13663b02709B45325p4752J6078
17405A86651J4772L0634B1435Q6199g1225C47483i7834B91882m8229A00848N2781
$$ plain form
17480 238485 85618 164172 195723 9736 7660 131903 -42277 197845 -53981 20578 175266
17469 175266 439364 72150 240067 406732 161384 289097 245460 69878 -14228 -177322
17459 -177322 150116 -37567 -374451 -117868 506456 -12741 105751 237924 369823 89863
17448 248361 259602 85401 121322 3110 94029 214630 302487 298088 400815 438711 239217
17437 239217 -145016 -38218 553715 108889 174849 192886 228870 69832 -17706 233398 110730
17425 257479 90037 497269 300089 -104343 287274 16987 137902 -28677 597459 343103
17415 343103 115730 467642 353188 283366 317220 113663 -202709 245325 170573 186651
17405 186651 201423 232057 21435 107634 -71225 347483 -97834 291882 243653 100848 153629
17394A53629i4814M4684A28230P5a16984A74256b628D02835I6764N5311a48339
17382h9108E57301B1160J2644K33555K7792j45120k9908j6266h748C07127b34618
17370G0305a62738A4868M16452j23319C6711J55724i6482B19778a8927j9133A61247
17358C10033E5700J43466a39972G9008f121F0784J16680D0560a08332A71380p5918
17347I5462a58241G5955M5142J21274a03093C8752a70528B82964a68455A44069
17336b78261i9428r488I7265R4737n3164E5338a37226A73085M8678a42778I4989
17324A7654a00512B96389H3840M8139R3363H6388J22169m1553N6698L76954A83713
17312I2421Q9854a07729I6401J54706j07416e7202a7986a359B25131J46939F4096
$$ plain form
17394 153629 -94814 -50130 128230 128305 -116984 174256 -2628 402835 96764 152075 -148339
17382 -89108 557301 21160 33804 267359 295151 150031 120123 103857 -8748 307127 -234618
17370 70305 -162738 14868 431320 308001 36711 192435 -96482 219778 -18927 -38060 161247
17358 310033 55700 199166 -139972 79008 -6121 60784 177464 40560 -108332 171380 95462
17347 95462 -158241 75955 121097 242371 -103093 38752 -170528 282964 -168455 144069
17336 -278261 -99428 -108916 97265 192002 138838 55338 -137226 173085 221763 -142778 94989
17324 17654 -100512 296389 83840 131979 225342 86388 208557 167004 223702 600656 183713
17312 92421 182275 -107729 96401 251107 143691 -57202 -17986 -1359 225131 372070 64096
17300D4738L8768b2998k17185B65317N0511C4645J77695j03433c6628A76948m0744
17289A36204m2225J35314A04459A7440a26828m9230A93125J02180j1484B3826
17278A9770J06863J99552o1583B4181M44893O5838C3526J87828A04746a37765
17267F1818B2205B79J98314r4182J49444c7870C75004j85142b60981J0358E512
17255A49367a82577A86293E2568K27834A00482L86860m4056F4303c5104E28281
17244f6598A20946M12974c7247D9438L42023A07406m1610a15092D3666R423c0865
17232A93661J25242A0200a79066D19652a54558j3032B9892G775N4689i825D4240
17220B11761q3620J27096j16560L3673Q2875r9844J61022k1836Q4903k8236j68152
$$ plain form
17300 44738 83506 -22998 -240183 265317 315828 34645 212340 108907 -36628 176948 136204
17289 136204 93979 229293 104459 17440 -126828 -176058 193125 295305 283821 23826
17278 19770 126633 326185 264602 24181 469074 534912 33526 221354 104746 -137765
17267 61818 22205 279 198593 104411 253855 -37870 375004 189862 -260981 -250623 5512
17255 149367 -182577 186293 52568 280402 100482 487342 443286 64303 -35104 528281
17244 -66598 120946 533920 -37247 49438 391461 107406 65796 -115092 43666 53089 -30865
17232 193661 318903 10200 -179066 419652 -154558 -167590 29892 7775 62464 -9825 44240
17220 211761 128141 255237 138677 172350 255225 155381 316403 294567 379470 351234 183082
17209A83082e0404K639H4552L43267a28292K8185b4696B1441O9721R0769a41633
17197I1313K69472j48664M0287m30J46421A39072Q2025a02697E14212A2837Q2445
17186I5282J37452I4799J49366b8853A09242K72106k3811A49075N54256I0780
17175a30191B45598C7499M32351M3041G2620L56536j49903J27136A65689J72571
17165C38260j0595A06562J00068m1919n5889K72129j57486J7210K5371j22633
17155A43413F3411a07595A63323l2873J87166j15148J0432l743K72948L631j37289
17144C48447A69582K83516a23901D44322j24097J24637j18466J1298J94342m8391
17134D83645B05515M9541O8158e2791A21046P3979d4284B46353K37324k24913
$$ plain form
17209 183082 -50404 -47765 84552 427819 -128292 -100107 -24696 21441 91162 181931 -141633
17197 91313 360785 212121 252408 251978 398399 139072 221097 -102697 514212 12837 95282
17186 95282 232734 94799 244165 -28853 109242 381348 357537 149075 703331 90780
17175 -130191 245598 37499 469850 512891 72620 429156 279253 406389 165689 338260
17165 338260 327665 106562 206630 164711 108822 380951 223465 240675 266046 143413
17155 143413 63411 -107595 163323 130450 317616 202468 212900 209157 482105 485736 348447
17144 348447 169582 453098 -123901 444322 320225 444862 326396 337694 532036 483645
17134 483645 205515 255056 323214 -52791 121046 195025 -44284 246353 483677 258764
17124B58764J40224K01091B49733p5891J3374q2270K75323L5955j19393j37888
17114A58943J95494A25420L69345k16006L05914k63882K50676j42516A53605J44712
17104B98317m4466P251R3921m5341R2882J42530B61807K38386j31168m5029J33049
17093D57045B19990K04621l2473o1434A1068M25572D9439M34914A79961p6705
17083A03256J14511j06985K78300J66374B05365O1236I9855J78601J98699k34279
17073B42876K7619K34651A55629O7079K89197k25972K73554B71205A34946J99257
17063C34203M5181J57482j65382R3316k29557J55717A76064M37997k57070J54492
17053E11483j0339L4684r3871m1044J43066j73538J27939j15492k1591L9299o6433
$$ plain form
17124 258764 398988 600079 249733 173842 187216 104946 380269 416224 296831 158943
17114 158943 354437 125420 494765 278759 584673 320791 571467 428951 153605 298317
17104 298317 253851 261102 355023 309682 402564 545094 261807 500193 369025 323996 457045
17093 457045 219990 424611 392138 330704 11068 436640 49439 484353 179961 103256
17083 103256 217767 110782 389082 555456 205365 266601 99855 278456 477155 242876
17073 242876 270495 505146 155629 222708 511905 285933 559487 271205 134946 334203
17063 334203 379384 536866 371484 464800 235243 390960 176064 614061 356991 511483
17053 511483 501144 535828 441957 400913 543979 370441 498380 382888 361297 400596 334163
17042C34163m2526K13514J76432j94845B40565O37568B81692L78298A58222L03275
17032D61497N3134A52305N48055k74160O3496J72655k67034j13942K38681j87926
17022C32130J05922M80404m50476J35253j02463j0756j11582J16936K40757j64792
17012E71333k3975l6943j77469O4275L39966j4157j82692n220j7645M59010m08606
17001E67877n6474M8861j3790J56168K4645j60630j0803j13861J9814J02982L75640
16990I40429l51848j0566N5624K10945J01652k52911J37670n6272C77819J04978
16980D82797L88985C52813N27065k43756p0811n911L7806j72150K14026J08930
16970G48012k7037L01915m32617O3500J71404n4817M71496C57397O20437j1163
$$ plain form
17042 334163 291637 505151 681583 486738 240565 878133 281692 659990 158222 461497
17032 461497 514631 152305 700360 426200 489696 662351 395317 281375 520056 332130
17022 332130 438052 918456 467980 603233 500770 490014 378432 495368 736125 571333
17012 571333 547358 510415 332946 397221 737187 723030 540338 535118 517473 976483 567877
17001 567877 511403 560264 546474 702642 727287 566657 555854 441993 461807 564789 940429
16990 940429 588581 578015 633639 844584 946236 693325 830995 774723 377819 482797
16980 482797 871782 352813 879878 636122 565311 559400 597206 425056 639082 748012
16970 748012 720975 1022890 590273 653773 825177 770360 1241856 357397 977834 966671
16960I66671j39061k98515O75312n75835k78537L50120K06916J6411j90403n9169
16950F73910J84845K69589k37306k91945J14010J08922J39671j17155K27811n0572
16940A021780j19223k06566J16106K39242l80480L29662J09389j84344r2831J87563
16930A020298k33721J78831l3234l6052J36892N4702j40085J40766j64017N40210
16920A464590m19437K47314j43135K04970J18715k77848l80953M29303N00390
16911A743909n77973k44239N75430J9299j70707J53453m1602j89987K30653k6877
16901A471359k30817j60659N47409l88926K28238m3084K25337p9719j84589J74653
16891A559202N3214l1517M7994L6468k69395L81660O0737n02345M45925K1327
$$ plain form
16960 966671 827610 529095 1204407 628572 350035 700155 907071 923482 733079 673910
16950 673910 858755 1128344 891038 599093 713103 822025 961696 844541 1072352 1021780
16940 1021780 902557 695991 812097 1051339 670859 1000521 1109910 925566 832735 1020298
16930 1020298 786577 965408 932174 896122 1033014 1087716 947631 1088397 924380 1464590
16920 1464590 1045153 1292467 1149332 1354302 1473017 1195169 814216 1243519 1743909
16911 1743909 1165936 921697 1497127 1516426 1345719 1499172 1457570 1267583 1498236 1471359
16901 1471359 1240542 1079883 1627292 1238366 1466604 1423520 1648857 1569138 1384549 1559202
16891 1559202 1612416 1580899 1628893 1665361 1395966 1777626 1838363 1336018 1781943 1803270
16881A803270J59489j78974j71252j54440L808J32814N27915k40995J57582l28204
16871A711013L33199j82639q2951j15680R1451N1503O61106n04127P1798K92181
16861B326854J60335k94106J36131p6717L42517m377j08637J5320r2934K24552
16851B628938q2078L34147m80715J15850K42342Q3529k14790J57125L68859k59573
16841B893634R6815J99043k42088L07356r8099J77506K98935J46473n838j96200
16831C577537J71650k49133K35035O8124K1071J61605J09874K23922l37036K05997
16821D188646K45386Q6459J72953k694j42539L32615j5084n4821J23726J91833
16811E126480o0587K93267K3926R4462k03499L51285J07030M62163K3377J31362
$$ plain form
16881 1803270 1962759 1783785 1612533 1458093 1461901 1594715 2122630 1881635 2039217 1711013
16871 1711013 2044212 1861573 1778622 1662942 1754393 1805896 2467002 1962875 2034673 2326854
16861 2326854 2487189 2193083 2329214 2252497 2595014 2590637 2482000 2497320 2404386 2628938
16851 2628938 2546860 2881007 2400292 2516142 2758484 2842013 2627223 2784348 3153207 2893634
16841 2893634 2990449 3189492 2947404 3254760 3156661 3334167 3633102 3779575 3773737 3577537
16831 3577537 3749187 3500054 3735089 3803213 3824284 3985889 4095763 4319685 3982649 4188646
16821 4188646 4434032 4520491 4693444 4690750 4548211 4880826 4865742 4810921 4934647 5126480
16811 5126480 5065893 5359160 5383086 5477548 5274049 5625334 5732364 6194527 6217904 6349266
16801F349266L31483R9003j9296J98509L5593J70003M71500O9549J60466L17932
16791H184008n8541L10499M08143J02271J50992O11461M3852L71018Q6288M30664
16781A0640655L7883L49938N99036L2094L58155K54590O64397N87915J61599M13427
16771A4099689O03810M54854M54939P47799O89352K68533R47890N24285L87906
16762A9179057J246283O08914J099710N88670J231068J370330O58253J012071
16754B6994356J463708J387524J441336J473511J567977J978074J779373K015343
16746D0101202K215653K339574K617635K613796L143663K795775L507162L743942
16738F3078402L792276M187576M687103M734326N420532N952785N823942O637517
$$ plain form
16801 6349266 6680749 6779752 6760456 6958965 6994558 7164561 7636061 7705610 7866076 8184008
16791 8184008 8125467 8435966 8844109 8946380 9097372 9708833 9752685 10123703 10209991 10640655
16781 10640655 10678538 11028476 11627512 11659606 12017761 12272351 12936748 13524663 13686262 14099689
16771 14099689 14703499 15158353 15613292 16361091 17050443 17318976 18266866 18791151 19179057
16762 19179057 20425340 21034254 22133964 22722634 23953702 25324032 25982285 26994356
16754 26994356 28458064 29845588 31286924 32760435 34328412 36306486 38085859 40101202
16746 40101202 42316855 44656429 47274064 49887860 53031523 55827298 59334460 63078402
16738 63078402 66870678 71058254 75745357 80479683 85900215 91853000 97676942 104314459
16730A04314459O655562P470172P751816Q278460P953326Q649414Q327679P681938
16722A67082826Q043026O979621N917249N143286L739424K155445R83419r15152
16714A99129144k118982m221487m951808o593921o752677q062822q018516q413112
16706A49995819q543262q566775p778963p716001p663803o973772o310631o242396
16698I0200216n863535n624082m579703m730433m383469m013673l289562l616404
16690E4099355k794325k952242k826648k156382k631146k054981k128376j357723
16682C5197532k028825j354235k027789j209319r28243j342025j079123j311384
16674B3916589r77320q16004j178358n09750p17074r78118r13044n39745n54670
$$ plain form
16730 104314459 110970021 118440193 126192009 134470469 142423795 151073209 159400888 167082826
16722 167082826 175125852 182105473 188022722 193166008 196905432 199060877 200044296 199129144
16714 199129144 197010162 192788675 187836867 181242946 174490269 166427447 158408931 149995819
16706 149995819 141452557 132885782 125106819 117390818 109727015 102753243 96442612 90200216
16698 90200216 84336681 78712599 74132896 69402463 65018994 61005321 57715759 54099355
16690 54099355 51305030 48352788 45526140 43369758 40738612 38683631 36555255 35197532
16682 35197532 33168707 31814472 29786683 28577364 27649121 26307096 25227973 23916589
16674 23916589 22939269 22123265 20944907 20435157 19718083 18739965 17826921 17287176 16732506
16665A6732506q75531o14964k07356n84243p57378p6405q08691m16349k5478m48459
16655A1917652m83217k02868m03579j99174p24374k11545p2293o86515o7237j2707
16645H854143m03453j36361k70950j64691l74713k38234p6281R6210o28972l3838
16635F622860K5028q1218n60224K71416l89948j49037P8240l41701k59411Q1712
16625E297717m80506J17445J37142l35161l70492J07231j87514k34335L82679
16616D434206N5115q1514j49704l54866K15125l23335l58986L59243J11335O1902
16606C968521k96659m04495Q5837R3711m04716J98019p7487j62024l60195J82912
16596B823424L2441j12878j86743M58359l57428q2892M11741l07446r0418J59499
$$ plain form
16665 16732506 15856975 15242011 15034655 14450412 13693034 13616629 12807938 12391589 12366111 11917652
16655 11917652 11434435 11231567 10827988 10628814 9904440 9692895 9620602 8934087 8866850 8854143
16645 8854143 8450690 8314329 8043379 7878688 7503975 7265741 7189460 7285670 6656698 6622860
16635 6622860 6647888 6566670 6006446 6277862 5887914 5738877 5817117 5475416 5216005 5297717
16625 5297717 4817211 4934656 5071798 4736637 4366145 4473376 4285862 4051527 4434206
16616 4434206 4489321 4407807 4258103 3903237 4118362 3795027 3436041 3795284 3906619 3968521
16606 3968521 3671862 3267367 3353204 3446915 3042199 3240218 3162731 3000707 2640512 2823424
16596 2823424 2855865 2742987 2556244 3014603 2657175 2574283 2986024 2678578 2588160 2747659
16586B747659j49081j60459j51416j37200M6490P581O1888J836N1836j24169p3886
16575B121079j34924J03348J3675O1616q8711m0335J20587l5447l60941L52214
16565B112161L8352j00487j89333L476m62333M14490m1794K26352n72680p0091
16555A358113j08245M70245l09819L42285k52568P7608l31975L03967P5489k44855
16545A380245K91803j16609j86608L37893j57970K59194j92056m03843J27563
16536A339612R4636k32005l1996J69322k88686L8797k1335n2867K08473O8598
16526A292549J84346P2863R412l89922J32928o04078L51708j62810L16822k59065
16516I44753K02246J04843j07642Q0706j34094k84949K26683k51769l5037J65898
$$ plain form
16586 2747659 2598578 2438119 2286703 2149503 2195993 2203574 2265462 2267298 2319134 2194965 2121079
16575 2121079 1986155 2089503 2103178 2164794 2076083 2035748 2156335 2120888 1759947 2112161
16565 2112161 2150513 2050026 1860693 1864169 1401836 1816326 1774532 2000884 1428204 1358113
16555 1358113 1249868 1720113 1410294 1752579 1500011 1577619 1245644 1549611 1625100 1380245
16545 1380245 1672048 1555439 1368831 1706724 1548754 1807948 1615892 1212049 1339612
16536 1339612 1434248 1202243 1170247 1339569 1050883 1089680 1068345 1015478 1223951 1292549
16526 1292549 1476895 1549758 1559170 1169248 1302176 698098 1049806 886996 1203818 944753
16516 944753 1146999 1251842 1144200 1224906 1090812 805863 1032546 780777 745740 911638
16506I11638P6876k38980L0176L04286j83147j11598p3261L64431k90170k11654
16496E78597L25916J39292m32275M62763n995l49255J24944l58085K68294j4835
16486G39361J28214J44625D67156N10091j25270m5862l59235L18406N5438j3021
16476H07703J10004k54604C02829P13387B68147K71222M53510o0847j69284C51671
16465H00192B70014M67428k7478j82479j07971l649J72026L49959j00396l29376
16455E08078J48477j14427L59813l08879k3494O5712B99262K93300Q0269r8851
16445E73980L21707k91316j52867A83605L69297J52411j53581B64378R7779O3204
16435D25361J73894p8648n7758K93616j92187O7756J1549M8733M1560k64234j62719
$$ plain form
16506 911638 988514 749534 779710 1083996 900849 789251 715990 1080421 790251 578597
16496 578597 904513 1043805 611530 1074293 1068298 719043 843987 485902 754196 739361
16486 739361 867575 1012200 467156 977247 851977 806115 446880 765286 820724 807703
16476 807703 917707 663103 302829 1016216 268147 539369 992879 932032 762748 351671
16465 800192 270014 737442 709964 527485 419514 415865 587891 937850 837454 508078
16455 508078 656555 542128 901941 593062 569568 635280 299262 592562 672831 573980
16445 573980 895687 604371 451504 183605 552902 705313 551732 264378 362157 425361
16435 425361 599255 520607 462849 756465 564278 632034 643583 692316 733876 469642 306923
16424C06923J24560J51466J74503m8696k64191q0712A03394L82945K19846B48210
16413H25749m00062P7323K90408j65542j91168P7733L11042l82665m8120J74135
16403E68833k1663j67974K35308j21226K53979j13891N3690J81569m13148o7995
16393C87482L14876C26954M06257k8785k62942N626J76567A96754L30318d1924
16382C63352j70249N96624l45010J57420j92158N2145m8031j92052J24407O1094
16372D07542O777A10380L26528p1045J83263A33763J84556m178E4505Q84007A34635
16360C89696K10220B55735R8671j52179L72817J1417F7033J03104R1222C9449
16349F20230B13848J47397q119j43864M04063L0765M509k35008p5145I8452i1962
$$ plain form
16424 306923 431483 582949 757452 708756 444565 363853 103394 486339 706185 248210
16413 825749 425687 503010 793418 627876 436708 514441 825483 442818 394698 568833
16403 568833 547170 379196 614504 493278 747257 633366 687056 868625 455477 387482
16393 387482 702358 326954 733211 704426 441484 447110 623677 196754 527072 -41924
16382 363352 193103 789727 444717 602137 409979 462124 414093 222041 346448 407542
16372 407542 414319 110380 436908 365863 549126 133763 318319 314141 54505 938512 134635
16360 389696 599916 255735 354406 202227 575044 586461 67033 170137 261359 39449
16349 620230 213848 361245 353126 209262 613325 644090 648599 413591 338446 98452 -91962
16337B65057m8163j9486K88206N1234j37250K2050j82983K09032j70078J15269
16327C92888A49974D418L63586R7241j01464K54482B44749M5304G9457J97665
16317B77122K69571j84947C5378L55295j20818l5116K40651A50028j3217Q9023
16307B25834L54272A76603K8977J41347j36227O0639q2778J05916J79753k24374
16297B49856J91623C8003J16059L63725k06807M3281j34405K80918B04299L2791
16287B37090K66419l5469J84460j44691G7809M63991k66707L8765h2364H1621
16276A64117K64136A19148Q0962l4424L92245B43655J34146o3566K29248A07374
16265C49254A73817K8058L40627E0479Q26960D14190l5928j86173o9475R4220
$$ plain form
16337 265057 216894 197408 485614 536848 399598 421648 238665 447697 277619 392888
16327 392888 149974 4418 368004 465245 363781 618263 244749 290053 79457 277122
16317 277122 546693 361746 35378 390673 269855 234739 475390 150028 136811 225834
16307 225834 580106 176603 205580 346927 210700 271339 188561 294477 474230 249856
16297 249856 441479 38003 154062 517787 310980 354261 219856 500774 204299 237090
16287 237090 503509 468040 652500 507809 77809 541800 275093 313858 -82364 81621
16276 164117 428253 119148 200110 165686 557931 243655 377801 314235 543483 107374
16265 349254 173817 201875 542502 50479 877439 414190 378262 192089 122614 216834
16255B16834A7087L58987A17569K66386F2959L63215d8616A3919M59818A23190
16244H6070J73710J08655p5750F4333J63445F5365P5668O389l6487J6616J96967
16233C24518I3247K83069b1307A558J00682J7863K43372B9512M01910j85806a51545
16221D63420H3324K95254J00938A15214K81806n9952E8172N4620K8965K02121
16211C43878e2361D4767K15524A27061K31018j35573R3342B4432Q4793J81424
16201B90649E6464L68728A52750j296k0266J01420e9696A11843a53737D0058J02047
16190A42105b40523B09409J9908J36184I1489P9672j0123m8180j4074K69294G5521
16178C57507p1024E2293K26861e4153l3625a3420B04917O4068F7145K8361a61419
$$ plain form
16255 216834 17087 376074 117569 383955 62959 426174 -48616 13919 473737 123190
16244 86070 259780 368435 292685 64333 227778 65365 141033 147422 110935 127551 324518
16233 324518 93247 376316 -21307 1558 102240 120103 363475 29512 431422 245616 -151545
16221 463420 83324 378578 479516 115214 397020 337068 58172 112792 141757 343878
16211 343878 -52361 44767 260291 127061 358079 222506 315848 24432 109225 290649
16201 290649 56464 425192 152750 151454 131188 232608 -59696 111843 -153737 40058 142105
16190 142105 -240523 209409 229317 365501 91489 171161 161038 112858 98784 368078 75521
16178 357507 286483 52293 279154 -54153 -87778 -13420 204917 268985 67145 95506 -161419
16166A27815a77618B50799a4001j24139A50785O8550J41262j55263n6784J7667
16156A66217c1387j51370D07277j63586j02939N2776j7348c9206j88044E9628
16145g1840F0838b4673C21373E8694J44420e2240l3415E9213h0108A34512K56032
16134C90544a29819d6093A45063n5054a7888A68585n7052k9427A6500L66496j44660
16123B38336N9681b8220I9692J6371i8223A70873b2263j4599A9068G882i6300
16111B19321g73q2858D06L0697a41842H6273O3367J2533A9666K38378K58952f7253
16098C93766A88564J09947A47156i1941J7698a6566C45941A65223a6687A8969
16087B70886b98167D55997d9820I3961a70242E4418j4197J18144k7937F4244O3760
$$ plain form
16166 127815 -177618 250799 -14001 -138140 150785 219335 360597 205334 148550 166217
16156 166217 -31387 -182757 407277 243691 140752 193528 176180 -39206 -227250 59628
16145 -71840 60838 -24673 321373 58694 203114 -52240 -85655 59213 -80108 134512 390544
16134 390544 -129819 -46093 145063 90009 -17888 168585 111533 82106 16500 382996 238336
16123 238336 298017 -28220 99692 116063 -98223 170873 -22263 -36862 19068 7882 -96300
16111 219321 -773 -83631 406 31103 -141842 86273 149640 162173 19666 258044 516996 -67253
16098 393766 188564 298511 147156 -91941 -74243 -16566 345941 165223 -16687 18969
16087 270886 -298167 455997 -49820 93961 -170242 54418 40221 158365 130428 64244 128004
16076A28004b05666k732K0923B98621a1875G9369a13257l729j20995h4829A06290
16064B07653L557b4090I3134a4595k07567A6993c0431B42087B4742R719J87367
16053B21828N5154a28361A94480D3866K8221J3073a80232q1291A46911J6871p25
16042A63057b42801J05238j5231f391l6011H6206a43993j13197H797N772K0299
16031C4868J22601G7386a4846j66893C6060K15766P2795A09954l083e5248G8943
16019A24352C700J98730a86033N4954g842J931C1365a61196b012A4093c11500
16007d41191i3259E1301d87497a17422D10861I1179m1513a68203P4358o0709j5036
15996a69590a2789p199B46669E1967a99415O5879R928j25592B34670a87292Q6882
$$ plain form
16076 128004 -205666 -208398 -187475 298621 -11875 79369 -113257 -116986 -237981 -84829 106290
16064 207653 211210 -24090 93134 -14595 -222162 16993 -30431 242087 24742 34461 221828
16053 221828 276982 -128361 194480 43866 72087 85160 -180232 -261523 146911 163782 163057
16042 163057 -242801 -137563 -152794 -6391 -42402 86206 -143993 -257190 8797 14569 34868
16031 34868 157469 77386 -14846 -181739 36060 251826 324621 109954 106871 -55248 78943
16019 124352 3700 202430 -186033 -131079 -7842 -5911 31365 -161196 -2012 14093 -311500
16007 -441191 -93259 51301 -487497 -117422 410861 91179 49666 -168203 -93845 -154554 -169590
15996 -169590 -12789 -19988 246669 51967 -199415 -133536 -123608 -249200 234670 -187292 -100410
15985a00410A00679J55367A27117P6202D733J40475G0072f6355D9486A1558a28285
15973a1805E6285J07524d8232j43541B2869J04382A681K6267J78316o4267m847
15962A37150a8361G4078a57409O7744B08801a67679L4936A8680f2558d341k90182
15951b94523B75747E2022A3712O3756c897A8686L575f4627g830B78753b33423
15939c56100B87155I8169B131b01982Q7372H4781O1941e1722D2536b23018K8683
15928a94335A92599k4874g4743A44396a04716G32J58141J12345R3410a57345C4260
15916f8426l32269i0330k72806E5276a22816b2355H2061a53319K9595I1789b86637
15904a08249j6681D6947a21740D26757d01580A26387B3011h8475B49791D4321
$$ plain form
15985 -100410 100679 256046 127117 203319 4733 145208 70072 -66355 49486 11558 -128285
15973 -11805 56285 163809 -48232 -191773 22869 127251 1681 27948 206264 141997 137150
15962 137150 -18361 74078 -157409 -89665 208801 -167679 -132743 18680 -62558 -4341 -294523
15951 -294523 275747 52022 13712 77468 -3897 18686 22261 -64627 -7830 278753 -233423
15939 -356100 287155 98169 2131 -201982 -114610 84781 146722 -51722 42536 -223018 -194335
15928 -194335 192599 167725 -74743 144396 -104716 732 158873 271218 364628 -157345 34260
15916 -68426 -400695 -90330 -363136 55276 -122816 -22355 82061 -153319 -123724 91789 -286637
15904 -108249 -124930 46947 -121740 426757 -401580 126387 23011 -88475 249791 44321
15893a2115B11203b85252k9833a53033j04158a03400p0203d2315l9563a4433A48564
15881b08915B80553f4226L2059A7080a70889n151m0908h4070A90642H0618c6838
15869f9740l07942E3065J22547a6932H8972a080E1151O2486L0622b49292A77096
15857E5088a26608A60020f3061A52280o7584J5219a20711F9511l2137N3409b38186
15845A10216b01243b8833J3804l8418B7191i5146A69792F7014a08542A32380D2223
15833A5101d25104i4540j14274B31651a12882k09372h7558h168A78313n3907c59734
15821E6870b83589h3546q0145e598A85598a30946j15371N9865h3260q0726Q713
15810a55273d9174l3741H1678m0443c58292A6569a02619k68331Q5376B0713b58
$$ plain form
15893 -12115 211203 -285252 -315085 -153033 -257191 -103400 -173603 -42315 -81878 -14433 148564
15881 -208915 280553 -64226 -32167 17080 -170889 -176040 -216948 -84070 190642 80618 -36838
15869 -69740 -377682 53065 175612 -16932 88972 -1080 51151 113637 144259 -249292 177096
15857 55088 -126608 160020 -63061 152280 84696 99915 -120711 69511 37374 90783 -238186
15845 110216 -201243 -28833 -15029 -53447 27191 -95146 169792 67014 -108542 132380 42223
15833 15101 -425104 -94540 -208814 231651 -112882 -322254 -87558 -8168 178313 124406 -359734
15821 56870 -283589 -83546 -163691 -5598 185598 -130946 -246317 -186452 -83260 -163986 -155273
15810 -155273 -49174 -82915 81678 41235 -358292 16569 -102619 -370950 -285574 20713 -258
15798G5924G959d1415J1613A42716E9986L2960b0424n1577E7334I690b07590A6353
15785a82835f9845j42083M2885D093b77132g7339c7315l2316j23253A11809A3009
15773b92898f7874j14869j78758e1321J6018B6749L3324c27859A06301c3605o5565
15762i9170A84697n0843Q1171J23931a98271d0581B78348b38419A64721a48309
15751b92307l7620B6972R2514Q956L7307k0599B3570g6871j26550C4999N343b96506
15738H2961K35497c37906i0390k2835L1306j89010c8377D3559f6045p4038D9696
15726I6321h5692o3957B34458a46809B21032d34061e584j99352l1284A70126h3057
15714d47906G0682R2385o506g1517l53200b922A2494a1412A18047J85167a92582
$$ plain form
15798 75924 7959 -41415 -29802 142716 59986 92946 -20424 -72001 57334 9690 -207590 16353
15785 -182835 -69845 -211928 -169043 4093 -277132 -77339 -37315 -69631 -192884 111809 13009
15773 -292898 -67874 -182743 -361501 -51321 -35303 26749 60073 -327859 106301 -33605 -99170
15762 -99170 184697 133854 215025 338956 -198271 -40581 278348 -238419 164721 -148309
15751 -292307 -329927 26972 119486 128442 165749 145150 23570 -76871 -203421 34999 40342 -296506
15738 82961 318458 -337906 -90390 -113225 -81919 -270929 -38377 43559 -66045 -140083 49696
15726 96321 -85692 -149649 234458 -146809 221032 -434061 -5584 -204936 -236220 170126 -83057
15714 -447906 70682 163067 156561 -71517 -424717 -2922 12494 -11412 118047 303214 -192582
15702b61959B55K29302b27580B87140b92892G9074d57773A13672L27521d4447
15691E5472c9628C1030b01717J6768C67790g5164j35569B99777h1854B28813d72377
15679F6760k8159a42470B52457F923J75588b21459j72304F6583L7916P2072L45797
15668E22368A84590H1878a7838B4382a20155E451M12066f8566j48014a03397N910
15657i7487H0115c7641j31294E4057b3659A05870c0675j15314E5025d66388d9431
15645A10234M8191o37J93883h8782A42019h2170k81715c4127r8758j10106A2046
15633F566J49666h0639A02554c1154l3988k13547B1751K18962G3742c0310m0365
15622g0675k9578B13615B4768l37a11440B38934G9373a61285b1993j05393O1156
$$ plain form
15702 -261959 255 229557 -227580 287140 -292892 79074 -457773 113672 441193 -44447
15691 55472 -39628 31030 -201717 -184949 367790 -75164 -210733 299777 -81854 228813 -472377
15679 66760 38601 -142470 252457 6923 182511 -221459 -393763 66583 104499 176571 522368
15668 522368 184590 81878 -17838 24382 -120155 5451 417517 -68566 -216580 -103397 -97487
15657 -97487 80115 -37641 -168935 54057 -23659 105870 -30675 -145989 55025 -466388 -49431
15645 110234 158425 157788 351671 -88782 142019 -82170 -363885 -34127 -132885 -242991 12046
15633 6566 156232 -80639 102554 -31154 -65142 -278689 21751 240713 73742 -30310 -70675
15622 -70675 -100253 213615 24768 24431 -111440 238934 79373 -161285 -21993 -127386 -66230
15611f6230I6457a50948b154p2754j98120a14351N6296D03619h7286F6980g3815
15599e7188k22692A7057b9443A96537r2960c37623A29570a33999A24774K02749
15589C27523d7804n5959n1083A00878g5382G9601a85288A64246b4497q8930L7903
15578g5524l66543A44287N4451g8662k12325e7690F778N1590k2120b6343A06111
15566a88197b7489B7454b0256A67772Q0710c44753H5334M4456d73439a62087e9446
15554i7988c3690C36731j26628C1999K09008c6926l83697B7870a73569a3439k23050
15543b36489B28632a27311B14299B8163K8186a72005e9941H4260K5177f2452D5069
15531D2197b37336A4562b5520B09770A5525a9470r9640D2055a33390j09756B91035
$$ plain form
15611 -66230 96457 -150948 -2154 -74908 -273028 -114351 -58055 403619 -87286 66980 -73815
15599 -57188 -279880 17057 -29443 196537 103577 -337623 129570 -133999 124774 327523
15589 327523 -47804 -103763 -154846 100878 -75382 79601 -185288 164246 -24497 -113427 -75524
15578 -75524 -442067 144287 198738 -78662 -290987 -57690 6778 58368 36248 -26343 106111
15566 -188197 -27489 27454 -20256 167772 248482 -344753 85334 129790 -473439 -162087 -59446
15554 -97988 -33690 336731 210103 31999 241007 -36926 -420623 27870 -173569 -13439 -236489
15543 -236489 228632 -127311 214299 28163 56349 -172005 -59941 84260 109437 -62452 45069
15531 42197 -237336 14562 -25520 209770 15525 -19470 -119110 42055 -133390 -243146 291035
15519b95084A39809h3430A67906a40344C53659j59711d7320E55432B3501J11736
15509A35237k3481g1973k51804C72628a62663N9746B25010a28069G8494g6133
15498a26808c6996j68089B14252H3029a22365A09279g1501A85324G882a18218
15487B59372a74516c8382j4621m1114q1413M2268L2394F0981J14085q569c28013
15475f8278k01661I2919a34287K2108D09621j58579f2393C64518C3582J16776
15465A50358J55226c4477B14613e5106p1964m77730a03003m9642F08562B61936
15454A94302q4969Q9578i8518I6262c9530A59222b23859A90190c53443C31712
15443H364a60006E81136E5065c60215B20594g3630A61758E2967c0274C51080f3922
$$ plain form
15519 -295084 139809 -83430 167906 -140344 353659 193948 -47320 555432 23501 135237
15509 135237 111756 -71973 -323777 372628 -162663 -102917 225010 -128069 78494 -76133
15498 -126808 -36996 -205085 214252 83029 -122365 109279 -71501 185324 7882 -118218
15487 259372 -174516 -38382 -53003 -94117 -175530 -133262 -100868 60981 175066 166497 -328013
15475 -68278 -269939 92919 -134287 -112179 409621 251042 -62393 364518 33582 150358
15465 150358 305584 -34477 214613 -55106 -127070 -604800 -103003 -152645 608562 261936
15454 194302 109333 198911 -98518 96262 -39530 159222 -223859 190190 -353443 331712
15443 8364 -160006 581136 55065 -360215 220594 -73630 161758 52967 -30274 351080 -63922
15431F5099b5203j88985f8338r5027B51046q6908D1920J87611D3268e7142j50242
15420b07384c5781J3569A24976E151K4121M7602a01978B46757e9244l8405B6687
15408A46441a8112A862b33111C2962h6281c2024j94321D5494i9702B4261h7346
15396G301b42657B0262M5771a7587D7855L914b50775K4669A42987a52501d057
15384a4871j86780A63188G01a14994L1721A3065J20145F1319i7329K8488A70748
15372c8614A13343l5162j5974K10284A786a5302l26207C29525F9901a35422C77610
15360I7489b88369G5198l4497f8247H9644o763b68167I1094J62506K83763A15962
15348g2692j74894c2361C83412J2555j89887H508b44813P3246P1536R265j23977
$$ plain form
15431 65099 -25203 -214188 -68338 -163365 251046 164138 41920 229531 43268 -57142 -207384
15420 -207384 -35781 -22212 124976 5151 29272 76874 -101978 246757 -59244 -97649 26687
15408 146441 -18112 1862 -233111 32962 -86281 -32024 -226345 45494 -99702 24261 -87346
15396 7301 -242657 20262 66033 -17587 47855 51769 -250775 -226106 142987 -152501 -4057
15384 -14871 -201651 163188 701 -114994 -83273 13065 133210 61319 -97329 -68841 170748
15372 -38614 113343 78181 62207 272491 1786 -15302 -341509 329525 69901 -135422 377610
15360 97489 -288369 75198 40701 -68247 89644 82881 -268167 91094 253600 537363 115962
15348 -72692 -247586 -32361 383412 395967 206080 8508 -244813 -171567 -100031 -90766 -214743
15337b14743K7813A42200M2020A3529b22448o8654J15778P3799D8716K0777c0808
15325a94877k0027m9530F8729a79816F1006J15622m5349a4875B56461c2025A7213
15313b71516d4229A41046f3119H7384b78108B15219c4337A49260a3601A25015
15302A13795i8080B10142F2265L9320e5395A07890d8238o1512K6026D7034h7170
15290A44223d44013c4339j92408A66203a65762A71653a15610j04894Q634B01940
15279i4476j27532A14874J67158A03670c9279j58746G1684d8907C48124K58741
15269F06865F2042b19932A66851l1297B605J04729a9661k9979o6508A14863h3404
15257B49170h2014D3456K10492i127D95114A16146O7215o3416N61920J100961
$$ plain form
15337 -214743 -186930 142200 184220 13529 -222448 -291102 -175324 -101525 48716 69493 -30808
15325 -194877 -214904 -264434 68729 -179816 61006 176628 131279 -14875 256461 -32025 17213
15313 -271516 -44229 141046 -63119 87384 -278108 215219 -34337 149260 -13601 125015
15302 113795 -98080 210142 62265 101585 -55395 107890 -48238 -109750 -83724 47034 -87170
15290 144223 -444013 -34339 -226747 166203 -165762 171653 -115610 -220504 -211870 201940
15279 -94476 -222008 114874 282032 103670 -39279 -198025 71684 -48907 348124 606865
15269 606865 62042 -219932 166851 135554 2605 107334 -19661 -49640 -116148 114863 -83404
15257 249170 -82014 43456 253948 -9127 495114 116146 183361 119945 681865 1782826
15247A782826l51209l78860M88065D93601A68595R5889J3558K5805a91279C52549
15236B73744r1993J33205I5977a41045B8298C73M25316C6631J85605E1653a33240
15224A61636B5860c26081d976D6103R2238K52301a16965j19207I0512J52999a7493
15212b49348A04777J61886d4942o5610B95386a48820G1790L8524a27545a6848
15201A21904n472h0324r4558P8568B69712G4205R5096D8472M0986J74746f7801
15189c6826n8867C68811j56610K02689D2918c6341C4598J86226d1727o8924p9706
15178a90357E4858L84718b17219q9072a31627J0257C862a61737A77144D2853c54657
15166C13920h8249k752k9604F1249B3241b418A63802b50423A2642L45492o0737
$$ plain form
15247 1782826 1431617 1052757 1540822 493601 168595 264484 278042 303847 -191279 352549
15236 273744 181751 314956 95977 -141045 28298 373 425689 36631 222236 51653 -133240
15224 161636 25860 -326081 -4976 46103 138341 390642 -116965 -236172 90512 243511 -17493
15212 -249348 104777 266663 -44942 -110552 295386 -148820 71790 110314 -127545 -16848
15201 121904 116432 -80324 -174882 -96314 269712 74205 169301 48472 89458 264204 -67801
15189 -36826 -95693 368811 212201 414890 42918 -36341 34598 220824 -41727 -110651 -190357
15178 -190357 54858 439576 -217219 -306291 -131627 -121370 3862 -161737 177144 42853 -354657
15166 313920 -88249 -91001 -120605 61249 23241 -2418 163802 -250423 12642 358134 297397
15155B97397h719A00624O8773H1264J69143J28559j43234P6047f5109B06977H9083
15143A08218J06514K51782B11803G5711K72862A1450a92348Q4258j5563D35350
15132I3844g6892A91142o8980c8396C60714A05770c99103a07423E6020j5671J36651
15121A77000Q5405G2638J47478C5045J41773L2608J05602o1456i4596E84669j39475
15110D45194F5045b05773B4265N9311K2106a32146C9270a00990o1898F267a19448
15098C66108A39557Q1057H0131L498m0689d128n4858B25797q9993d8905j934A18496
15085B61897i945C39849G3706J945d9414A38173n5097l9619b46937B15042q9748
15074A25294D8324P1992m1799J24716J96295n9182j38349C5647M0875K47227a07490
$$ plain form
15155 297397 -8719 100624 169397 81264 250407 378966 235732 311779 -65109 206977 89083
15143 108218 214732 466514 211803 75711 348573 11450 -192348 -108090 -123653 435350
15132 93844 -76892 191142 122162 -38396 360714 105770 -399103 -107423 56020 40349 177000
15121 177000 262405 72638 220116 35045 176818 209426 315028 253572 -94596 584669 445194
15110 445194 65045 -205773 24265 83576 105682 -132146 39270 -100990 -162888 6267 -119448
15098 366108 139557 220614 80131 83629 42940 -4128 -58986 225797 135804 -48905 -50839 118496
15085 261897 -9945 339849 73706 75651 -49414 138173 83076 43457 -246937 215042 125294
15074 125294 48324 120316 78517 203233 399528 340346 201997 35647 76522 323749 -107490
15062C89468j32829d57680g2565D5256M8338K64536j47445J37427j55288d8887
15051a15440F9980H665L45203r6359G9729K15756A6435N8358M13258G4878M75769
15040E50647B40861M5513m5504o3146J64451F8542M79647a3613G6015R301K07965
15029B93281m6292o733K5943A10049k9328Q0782A8490K99782c5225D9725f1804
15017A56819O8849a65665g6973F28186A94272m350C3652J6112K01723j3232b50823
15005b9115A99225b37719B96343K43788A66896K6128J236K99966b1323B38683
14994A46246M90753A7276b8892R064C24602d6378b0946C50499J8399A78216j7998
14983A60218f4150A86057J8136J02852L8876a72366E1819L3740d5840E89224a9384
$$ plain form
15062 389468 256639 -457680 -72565 45256 93594 358130 210685 348112 192824 -48887
15051 -115440 69980 8665 353868 257509 79729 295485 16435 74793 488051 74878 550647
15040 550647 240861 286374 240870 177724 342175 68542 548189 -13613 76015 85316 293281
15029 293281 246989 240256 266199 110049 80721 161503 18490 318272 -35225 49725 -61804
15017 156819 225668 -165665 -76973 628186 194272 189922 33652 49764 251487 238255 -250823
15005 -29115 199225 -237719 296343 540131 166896 193024 194260 494226 -21323 238683
14994 146246 636999 17276 -28892 -19828 324602 -46378 -20946 350499 368898 178216 160218
14983 160218 -64150 186057 204193 307045 345921 -172366 51819 85559 -45840 589224 -19384
14971C68658j65516J81160A17076L01664D8216N11241B15097H5596N29532b52175
14960B79428q7634N5835d0497A67502M3674a44502B3028L7384L64216A85329K5621
14949B10950o5252J55178J06074A20055L8348R0456J99692r8116A07962J27443
14939B35405K01724m9781n9387K4120L00753A05493M5764K3523L5869K95273A99326
14927B92438L09300B8883L75027d6331D71974B1628a05831C59666J37036D0955
14916A37815F8236J56638q0730J91998J78985A45406J91563j1622m4266r8287
14906A82794K37052a84819I7800K69798k3851k8669A33449J29609m3077J93298
14896D13279j42992f1609B00811J27778j00553m0118R4149r6813K89765k20283
$$ plain form
14971 368658 203142 384302 117076 418740 48216 559457 215097 85596 615128 -252175
14960 279428 191794 247629 -40497 167502 211176 -144502 23028 60412 424628 185329 210950
14949 210950 145698 300876 406950 120055 158403 248859 448551 350435 107962 235405
14939 235405 437129 387348 327961 352081 652834 105493 151257 174780 210649 505922 199326
14927 292438 601738 28883 403910 -46331 471974 21628 -105831 359666 496702 40955
14916 137815 68236 224874 144144 336142 515127 145406 336969 325347 281081 182794
14906 182794 419846 -184819 97800 367598 343747 315078 133449 263058 219981 413279
14896 413279 270287 -61609 200811 328589 228036 187918 282067 185254 475019 254736
14886B54736A8754J84574N41844k30342j06900p4195j04338K94237j66218i3640
14875A80920L00520j48871j7035L6507C834O61976j57820A38355M91992k60398
14865C69949K38109A20594M82243O3141B25487L18278j52074j37953I9712K36687
14855C36399q8619L72232B41113R4658j19398M13080j15211C1438N18032B43780
14844B62768L02561B62747K47231K8974k63013L04341k77041L41102C11256O39556
14834I50812c4658B37702L17569O7205B37055J96960B02658N55765j29682k72685
14824C56056m501L38627C02965p4192J81709J92947F9503M07802J15683j51509
14814D41479A28886K91494a0269E27787l0395j86146L39222C16554m0551M4718
$$ plain form
14886 254736 18754 203328 745172 514830 407930 333735 229397 523634 357416 -93640
14875 180920 481440 332569 315534 352041 3834 665810 507990 138355 630347 369949
14865 369949 608058 120594 602837 665978 225487 543765 391691 253738 99712 336399
14855 336399 247780 620012 241113 335771 216373 629453 514242 31438 549470 243780
14844 262768 565329 262747 509978 538952 275939 580280 303239 644341 311256 950812
14834 950812 -34658 237702 555271 622476 237055 434015 202658 758423 628741 356056
14824 356056 351555 690182 302965 228773 410482 603429 69503 477305 592988 441479
14814 441479 128886 420380 -10269 527787 497392 311246 650468 316554 276003 320721
14804C20721Q3821L8393q5214J63191K26298k73718K95036j35561j33052j57068
14794C42847J52119j39221K33012j27135p2928J33988k2501A48296M53192B26472
14783E71109O2414j71192B29227K98116M2023j20625Q0319o0406M9374j3233J27842
14772F32637p1480j09411J15450k13713j24209L31047j07949j67474n2074L87664
14762F20488A96580L42233B20373M88210k48939j18238A43118O54472l02842J06235
14752F00983j40191K73711j0147j05538L8400j99670N3426j74629J66147N64710
14742A067202m77339j39505K59202o8429M2229l07594K82524j22584K61742k20342
14732E77106J25506O9156j19067J59332O8384k19814J35477j5539K62680l42746
$$ plain form
14804 320721 404542 442935 357721 520912 747210 473492 768528 632967 499915 342847
14794 342847 494966 355745 588757 461622 388694 522682 500181 148296 601488 226472
14783 571109 633523 462331 229227 527343 569366 448741 529060 468654 518028 504795 632637
14772 632637 561157 451746 567196 353483 229274 560321 452372 284898 232824 620488
14762 620488 196580 538813 220373 708583 459644 341406 143118 797590 494748 600983
14752 600983 460792 734503 724356 618818 657218 457548 510974 336345 502492 1067202
14742 1067202 589863 450358 709560 641131 683360 375766 658290 535706 797448 577106
14732 577106 702612 771768 652701 812033 880417 660603 796080 780541 1043221 700475
14722G00475J27386B01504K92221L33093j82657k83150O03503j83822l67096K71545
14712F85141J32043C32883K05237K65646j77893J67185K2456l64522K41452M50481
14702A142925l23077J8877j28068J33606m01431K23751K7558j99084K07415m0953
14692F61519K23909l7779J88163D39320M08929k4079j96478r6799Q4876K16404
14682H32173o1331J81866M01964o42558L45199j06540J8485j98813J34808r2193
14672H13060J02535k32576K19971l45379K11446J63707k9587o6852M5339R542
14662H91206M46878m66334R9679l19256L49527p2538j21648L86486k02066J32306
14652A124240O691r995N1740k03320j80135N9687K76357l8106j18940O8104j06937
$$ plain form
14722 700475 827861 201504 493725 826818 644161 361011 964514 780692 413596 685141
14712 685141 817184 332883 538120 803766 625873 793058 815514 450992 692444 1142925
14702 1142925 819848 838725 710657 844263 442832 666583 694141 495057 702472 661519
14692 661519 885428 847649 1035812 439320 848249 824170 627692 530893 615769 832173
14682 832173 770842 952708 1354672 712114 1057313 950773 969258 770445 905253 813060
14672 813060 915595 683019 902990 557611 769057 932764 903177 836325 881664 891206
14662 891206 1338084 871750 971429 652173 1001700 929162 807514 1194000 991934 1124240
14652 1124240 1130931 1120936 1172676 969356 789221 848908 1125265 1087159 968219 1036323 929386
14641I29386k51320J60161Q9299K30047K02004l83773K06116j9940k0605j02733
14631A038642m279K11403j36226J55344j13003j20266J23696q0478J78764M8241
14621A301838m2549r0789p0771P9865o9231N5947q5160J45899j40063L79110q944
14610A455152Q490m59626K09744J57913j48207L6017M5080J5630J96756K09333
14600A726282m79440Q7155m25196O70824j04809j21339J44418M36059m0248l62275
14590A531431K55727j13956K5915K31283j32985l07224K14362k11796J38196J99401
14580A830354r7100j64000N02616n16624K61097j51638q4030M25229R9443j17747
14570A987600k09887L96726J16263k34076q6743J56339j40819m8313L19680r0401
$$ plain form
14641 929386 678066 838227 927526 1157573 1359577 975804 1181920 1161980 1141375 1038642
14631 1038642 1034363 1245766 1109540 1264884 1151881 1031615 1155311 1074833 1253597 1301838
14621 1301838 1259289 1168500 1097729 1177594 1108363 1164310 1079150 1225049 1084986 1464096 1455152
14610 1455152 1463642 1004016 1213760 1371673 1223466 1259483 1304563 1320193 1516949 1726282
14600 1726282 1246842 1333997 908801 1579625 1474816 1353477 1497895 1933954 1893706 1531431
14590 1531431 1787158 1673202 1699117 1930400 1797415 1490191 1704553 1492757 1630953 1830354
14580 1830354 1733254 1569254 2071870 1555246 1816343 1664705 1580675 2005904 2105347 1987600
14570 1987600 1777713 2174439 2290702 2056626 1969883 2126222 1985403 1937090 2256770 2166369
14560B166369K27293J17222j33557j42795L16026J86524j5415P06714P47853M2769
14550D219003J118537K031016L821568Q277659J3118495R202613j5351345I890569
14541D606370j617546o80960m13871o9237M45518n35064L14555R0961m64001R4416
14531A771141l07918M72990j99652L25399l96347K20991L59422k29631M2530J28723
14521B187648k98987N53372l13974n5378m3946J92927j49501L16399J25804j98952
14511B315412L36265m36946O6645J96935j5848o0159j57877J27684m895J6699
14501B383915K72702L26347n20035J43245K04882o2478K92809j48167j94515K10834
14491B909539J81935m9842r8801J58074r1654K21964j18429k51091N20506J06389
$$ plain form
14560 2166369 2393662 2510884 2377327 2234532 2550558 2737082 2721667 3428381 4176234 4219003
14550 4219003 5337540 7368556 11190124 19467783 32586278 41788891 26437546 9890569
14541 4606370 2988824 2307864 1893993 1824756 2270274 1735210 2049765 2140726 1676725 1771141
14531 1771141 1463223 1936213 1736561 2061960 1665613 1886604 2246026 2016395 2058925 2187648
14521 2187648 1888661 2442033 2128059 2072681 2028735 2221662 2072161 2388560 2514364 2315412
14511 2315412 2651677 2214731 2281376 2478311 2462463 2402304 2244427 2372111 2367216 2383915
14501 2383915 2656617 2982964 2462929 2606174 2811056 2748578 3041387 2893220 2698705 2909539
14491 2909539 3091474 3041632 2942831 3100905 3009251 3231215 3112786 2861695 3382201 3488590
14481C488590k36833p3462N05296l12888r2113N12716k28976k1117m1813P02L18980
14470C819082k23385j3286n373M20170p48066M01953K53461k05335L05975L5239
14460D040435K50953l17179k49400L56932N3302K27845K5605J10591k66704K08505
14450D440885J34088j1116m6595K61246K45546j22747j3145J50673O1431K67016
14440E367282m04966N65069k13415L04619o6119j74809L00147L1229L80288n06100
14430E583225j2889J36549J16128K55590K22872K67879l70638K75651K65944j4473
14420F725838j18265J84607J17004k4367M28057N3957j26113K68684L74779k66692
14410G617489J30287K01102J20355K90126R8223j0548j74367Q49189j43615K14797
$$ plain form
14481 3488590 3251757 3178295 3683591 3370703 3278590 3791306 3562330 3541213 3499400 3500102 3819082
14470 3819082 3595697 3582411 3577038 3997208 3249142 3651095 3904556 3699221 4005196 4040435
14460 4040435 4291388 3974209 3724809 4081741 4135043 4362888 4388493 4499084 4232380 4440885
14450 4440885 4574973 4563857 4517262 4778508 5024054 4901307 4888162 5038835 5100266 5367282
14440 5367282 4962316 5527385 5313970 5618589 5552470 5377661 5677808 5709037 6089325 5583225
14430 5583225 5570336 5706885 5823013 6078603 6301475 6569354 6198716 6474367 6740311 6725838
14420 6725838 6607573 6792180 6909184 6884817 7312874 7366831 7240718 7509402 7884181 7617489
14410 7617489 7747776 7948878 8069233 8359359 8457582 8447034 8272667 9121856 8978241 9193038
14400I193038j98900j59162L95472L38652J76128J50321K30443j67219K071N32314
14390A0493158L8621J82675L66350j35158O04874L68081J94836K36877k67395
14381A2082919O15117L61767K86412j42343M23694Q7885J81738O46473k25870
14372A4317792P24117j55678O80079K22857N12176L15901O8116N43911M04902
14363A7634173N37205k4285L49063R24169l8719O46561L37249Q54389M65592j42779
14353B1542618O45973Q19372O15207N55077N64926P53072J99116J166099N33531
14344B7394991N77083Q67016Q02747K49737J264319O04548J298782R40058J103410
14335C5102691J059801N48011J183770J336606J256234J362914J278713J149916
$$ plain form
14400 9193038 8994138 8834976 9230448 9569100 9745228 9895549 10125992 9958773 9960844 10493158
14390 10493158 10531779 10714454 11080804 10945646 11550520 11918601 12113437 12350314 12082919
14381 12082919 12698036 13059803 13346215 13203872 13627566 13715451 13897189 14543662 14317792
14372 14317792 15041909 14886231 15566310 15789167 16301343 16617244 16685360 17229271 17634173
14363 17634173 18171378 18147093 18496156 19420325 19381606 20028167 20365416 21219805 21685397 21542618
14353 21542618 22188591 23007963 23623170 24178247 24743173 25496245 25695361 26861460 27394991
14344 27394991 27972074 28839090 29641837 29891574 31155893 31760441 33059223 33999281 35102691
14335 35102691 36162492 36710503 37894273 39230879 40487113 41850027 43128740 44278656
14327D4278656J282963J872032J581466J633174J703510J875451K082285J832186
14319E8141723K507841K255362K234526K792848K660180K811905K970381L296999
14311G9671765L500508L346113M100398M024232M438511M530499N295018M762036
14303A13669080N831716N766357O778702O507417P743494P333664Q420472R138226
14295A71189128R302674J0209798J0804867J1377592J2334952J3530787J3800932
14288B52550730J4755367J5596582J6430537J6893915J7373141J8471871J7846971
14281C69919114J8221328J8106152J7236179J6678201J5232278J4147240J1772564
14274D81313056R500272M481655o14492m106442m419664p07020k074482p901230
$$ plain form
14327 44278656 45561619 47433651 49015117 50648291 52351801 54227252 56309537 58141723
14319 58141723 60649564 62904926 65139452 67932300 70592480 73404385 76374766 79671765
14311 79671765 83172273 86518386 90618784 94643016 99081527 103612026 108907044 113669080
14303 113669080 119500796 125267153 132045855 138553272 146296766 153630430 162050902 171189128
14295 171189128 180491802 190701600 201506467 212884059 225219011 238749798 252550730
14288 252550730 267306097 282902679 299333216 316227131 333600272 352072143 369919114
14281 369919114 388140442 406246594 423482773 440160974 455393252 469540492 481313056
14274 481313056 490813328 495294983 494680491 490574049 486154385 485447365 483372883 475471653
14266D75471653j2024998j4200094j5699669j7087764j7808753j8140316j8741540
14259C61768519j8763733j8318462j7974628j7037843j5850993j4593085j4942286
14252B44287489j3817623j2598350j1927560j1528205j0500309j0046742r168307
14245A64700393q294991q053967p366644o965612o850466o068577n685250n063432
14237A10351454m835669n147742m547372m175055l956837l893811k887677l350494
14229G7556797l051280l013005k537363l096615k316347k594130k635076j883009
14221E6429972j649197k053755j438065k084084j720909j543680j838272o59884
14213D3442126j397796j392674j475841j251839j080242q41674n71475q33651
$$ plain form
14266 475471653 463446655 449246561 433546892 416459128 398650375 380510059 361768519
14259 361768519 343004786 324686324 306711696 289673853 273822860 259229775 244287489
14252 244287489 230469866 217871516 205943956 194415751 183915442 173868700 164700393
14245 164700393 156405402 148351435 140984791 134019179 127168713 121100136 115414886 110351454
14237 110351454 105515785 100368043 95820671 91645616 87688779 83794968 80907291 77556797
14229 77556797 74505517 71492512 68955149 65858534 63542187 60948057 58312981 56429972
14221 56429972 54780775 52727020 51288955 49204871 47483962 45940282 44102010 43442126
14213 43442126 42044330 40651656 39175815 37923976 36843734 36002060 35430585 34596934
14205C4596934j553156j108523j097928o07223q94007k90376o99865r38773q14774
14196B6592309r08939p80462m48927o05518n04418p05967o96609o93331J6134
14187B1264272j179361m9111k53694q40558k34393l22237n79181k5043q77005
14178A6903689j10571n31697j62314j21149o29605l28369m45335J05642m93347
14169A4186944q4362l86679k65478K45634p12067n9033n57997m6721n3681l71968
14159A1894592l55989L32532m27436j62393k41978n35531L75067o85331K25397
14150A0418930l02015r9504J6420n84094K4977n21904K81899j87350j9803j23811
14140H903745l55974o9406l08058R8333o1113n47256O90410j029313K45356m0758
$$ plain form
14205 34596934 33043778 31935255 30837327 30230104 29336097 29045721 28345856 27407083 26592309
14196 26592309 25683370 24902908 24453981 23848463 23344045 22638078 21941469 21248138 21264272
14187 21264272 20084911 20035800 19782106 18941548 18707155 18384918 17805737 17780694 16903689
14178 16903689 16793118 16261421 16099107 15977958 15348353 15019984 14574649 14680291 14186944
14169 14186944 14102582 13715903 13450425 13696059 12983992 12924959 12366962 12320241 12266560 11894592
14159 11894592 11538603 11871135 11443699 11281306 11039328 10503797 10878864 10193533 10418930
14150 10418930 10116915 10017411 10033831 9449737 9474714 8952810 9234709 9047359 9027556 8903745
14140 8903745 8547771 8478365 8170307 8268640 8207527 7660271 8350681 7321368 7566724 7525966
14130G525966N0888k46290r2731J10859j93441m42889N235o2472K1214k57296
14120F419043N25665m27569j30105j97838j16862l4601j51651R555k04807J10907
14110E801737k07986L38992m43104j28154J79429l70364J72018j54433k58112
14101D930023K51061q8585j83231p9790K77724k65287J03706j11419j18495j52830
14091D562877j87115r6838M9503n2173N20578k51965n06556k900K88750n15653
14081C808508M01042k94809q3284L76079m63319L89739k91685j62116J40970k15959
14071C605166J00025j7567M9703m13546q077J96271j35211M1837l64232P1842
14061C126211M56536j66267l41822J61655j50769J86606l21405M35489n48535
$$ plain form
14130 7525966 7576854 7330564 7237833 7348692 7155251 6712362 6717597 6655125 6676339 6419043
14120 6419043 6944708 6517139 6387034 6189196 6072334 6037733 5886082 5895637 5690830 5801737
14110 5801737 5593751 5932743 5489639 5361485 5540914 5170550 5342568 5188135 4930023
14101 4930023 5181084 5092499 4909268 4829478 5107202 4841915 4945621 4834202 4715707 4562877
14091 4562877 4375762 4278924 4328427 4276254 4796832 4544867 4038311 4035411 4324161 3808508
14081 3808508 4209550 3914741 3831457 4207536 3744217 4133956 3842271 3680155 3821125 3605166
14071 3605166 3705191 3687624 3737327 3323781 3315704 3511975 3376764 3418601 3054369 3126211
14061 3126211 3582747 3416480 3074658 3236313 3085544 3272150 2950745 3386234 2837699
14052B837699j5990N03602l21996J08110L8277n73280K75410J09611m48417O20671
14042C133697j41364m44589J14131R1201l18469L27906m3789L9951l31785L5609
14032B462499L6112q9048L12128J47541l54981j31794J6771N9364L4893j91155
14022B302330R942j39615K5938j56544J29809J12180m63984L00432o1117R943
14012B069314j47798P7964K26154o32714K97301j3956q6735L68781k50670N1666
14002A959307m93115O91069l15312k6708o2969k70477L76453P0084l02616K04969
13992A830685M54709r3673L97750J243340K797338P164290J2541081J3195643
13984C9531163j1258241A2956631n522234j869284j139638n34201m95872k97068
$$ plain form
14052 2837699 2821709 3325311 3003315 3111425 3149702 2576422 2851832 2961443 2513026 3133697
14042 3133697 2992333 2547744 2661875 2753076 2434607 2762513 2718724 2758675 2426890 2462499
14032 2462499 2498611 2409563 2721691 2869232 2514251 2382457 2399228 2458592 2493485 2302330
14022 2302330 2312272 2172657 2198595 2042051 2171860 2284040 1820056 2120488 2059371 2069314
14012 2069314 1921516 1999480 2225634 1592920 1890221 1876265 1789530 2158311 1907641 1959307
14002 1959307 1466192 2157261 1841949 1815241 1752272 1481795 1858248 1928332 1625716 1830685
13992 1830685 2285394 2191721 2589471 3832811 6630149 13794439 26335520 39531163
13984 39531163 28272922 12956631 7434397 5565113 4425475 3891274 3395402 3098334
13976C098334l88723j74837q7804m92663K14382R6542k43171J1792J09863q8240
13966B055475k52526J53228l63420k2780O9454K31243j47243N7579o5592O2084
13956A777502l41870K86863p4444n33887Q19417p8415k51038j86075l14698M02576
13946A505931P7802j18666j36864K29520L41740k93420j57601P7261L16856k58324
13936A584235k96304l324J79846P0863k16557k4054j17026j89699N03017l88982
13926A102015L53844l55561K2353J30131k26649K14986M3127n3464O2294L3808
13916A326884L44001l37933K38478n99521M49416j17645K2323p5163k51695J57088
13906A156233Q2904k28734k38524M19822n1938k11094J47901L2457k115j03336
$$ plain form
13976 3098334 2709611 2534774 2446970 1954307 2168689 2265231 2022060 2033852 2143715 2055475
13966 2055475 1802949 1956177 1592757 1569977 1639431 1870674 1723431 1781010 1715418 1777502
13956 1777502 1435632 1722495 1648051 1114164 1933581 1855166 1604128 1418053 1103355 1505931
13946 1505931 1583733 1465067 1328203 1557723 1899463 1606043 1448442 1525703 1842559 1584235
13936 1584235 1287931 1284607 1464453 1535316 1318759 1294705 1177679 987980 1490997 1102015
13926 1102015 1455859 1100298 1122651 1252782 1026133 1241119 1284246 1230782 1293076 1326884
13916 1326884 1670885 1332952 1571430 971909 1421325 1303680 1326003 1250840 999145 1156233
13906 1156233 1239137 1010403 771879 1191701 1139763 928669 1076570 1109027 1106912 1003576
13896A003576N3815J07804k68938N32533l44627J44175L12835l98131o8089J5338
13886A090291j69982L93053n70638K22164J52641k67257K74142k15609o1165n1281
13876G96359J03978K32502j06191k00458L6508j2702j82500L60160l9618q7461
13866I00577L13526l87368m6808K0906L13100m11045N28347l19101j69438K57836
13856A000532K4131C87809J75164J35277k23017K34579K36733n9506k09890L43565
13846A020714l98230N7873J70516P1924o1265l09763M60456l73627R8652k64654
13836D72596L50039L89959m14750j62155P8177J29071m2893j66554J23057Q9256
13826H45803n4633J35530j44855r5558o4748K73808O7966j50294k14429j86319
$$ plain form
13896 1003576 1057391 1165195 896257 1428790 1084163 1228338 1541173 1143042 1074953 1090291
13886 1090291 920309 1313362 742724 964888 1117529 850272 1124414 908805 847640 796359
13876 796359 900337 1132839 1026648 826190 862698 849996 667496 1027656 988038 900577
13866 900577 1214103 826735 779927 800833 1113933 702888 1231235 912134 742696 1000532
13856 1000532 1024663 387809 562973 698250 475233 709812 946545 887039 677149 1020714
13846 1020714 622484 680357 850873 922797 861532 551769 1012225 638598 737250 472596
13836 472596 822635 1212594 797844 635689 713866 842937 800044 633490 756547 845803
13826 845803 791170 926700 781845 686287 621539 895347 963313 813019 598590 412271
13816D12271o6782K90581m1990k44133M65734l9616o8471j52438j12148j18411
13806C24597J42080j1008L0653J89003k0669j68606K83726k6987J48346m21721
13796D69414K76112L58025m88536Q9299r9337O758R1117j18373O9896B96264J44448
13785D40712M85816k69048n4421K8264J32639J02264j40666k63888J04056o8143
13775D97585P2499k3419J18605M9489k33739J42975k46416L54952C39269M89689
13765H28958l25562R6279k21612Q5881O1545j46484K17087o0943j23171N94571
13755A006549C04434J68870K4733J23696J66284j44235j52487j39332O5295L75110
13745G92368l08757m9947K25571A17867O90495l47304M5181J88377j76558M0013
$$ plain form
13816 412271 345489 636070 594080 349947 815681 776065 707594 555156 443008 324597
13806 324597 466677 455669 486322 675325 654656 486050 769776 742789 891135 469414
13796 469414 745526 1103551 615015 704314 604977 611735 702852 584479 654375 296264 440712
13785 440712 926528 657480 603059 631323 763962 866226 725560 461672 565728 497585
13775 497585 570084 546665 665270 714759 481020 623995 377579 732531 339269 828958
13765 828958 503396 599675 378063 463944 525489 379005 596092 535149 411978 1006549
13755 1006549 304434 473304 498037 621733 788017 643782 491295 351963 417258 792368
13745 792368 483611 433664 659235 117867 808362 461058 506239 694616 518058 558071
13735E58071K67615l15402J94147C33998J32520l080O4813N0563j86173K43782
13725F36423k54894N1348j54016L19690J15005j64919j92478J91140r2383j60476
13715B94440J85299j39190J33174A76083J7796N16507A96914J24327D1519L33803
13705C75322L26340n3601k95442K17636p5134k0155J32885L9166k80474K79347
13695F45890m8649j14188K78485k33887j27119A86506K55435P1455k36045K26302
13685E03653B29421l1981P6138L6524J23486O7988j98298A14342P2149J68951
13675C55442L51123B51955o2790o949L09210q8294M36224F6063N832M09736E5875
13663G4772M79036B69211l9724J1889n8898L58395k08044K73015k19727I8031
$$ plain form
13735 558071 825686 510284 704431 333998 466518 463438 528251 578814 392641 636423
13725 636423 381529 432877 278861 598551 713556 548637 356159 547299 454916 294440
13715 294440 479739 340549 473723 176083 193879 710386 196914 321241 41519 375322
13705 375322 701662 648061 352619 570255 495121 474966 607851 647017 366543 645890
13695 645890 597241 483053 761538 527651 400532 186506 441941 513396 277351 503653
13685 503653 229421 197440 273578 310102 433588 501576 303278 114342 186491 355442
13675 355442 706565 251955 189165 182216 491426 403132 839356 66063 71895 481631 55875
13663 74772 553808 269211 229487 241376 182478 540873 332829 605844 386117 98031
13652B46683Q8568J03269A0412L86123j14624J95855j58296R9671J88242k56811
13642C50572k4709j39565q5647L4341M82768A56223l4791m0340L22678j08687
13632B95083j20890M1505O9145L23869k55206A49699N1760M17083j89011K09382
13622F38913C1467M34822p5560j89731L1624j00783J05308K16263I9520J99247
13612B98767o0147J01991q6350A07075d8615B91505A16773C4482L21108r5528
13602B60062n0160O807J55968j02465B768J41260L17771j83719J93771A41051
13591A51735P356R1222j24549m0147O3463J01579N7238l7733h7822l07180C65371
13579A72449M1284K77400o0988A92316p8352m3236a04205D29202A15824E5764
$$ plain form
13652 246683 335251 438520 10412 396535 281911 477766 319470 419141 607383 350572
13642 350572 325863 186298 100651 134992 617760 156223 121432 81092 403770 295083
13632 295083 174193 215698 284843 608712 353506 149699 201459 618542 429531 638913
13622 638913 31467 466289 390729 200998 232622 131839 237147 453410 99520 298767
13612 298767 238620 340611 254261 107075 -48615 291505 116773 34482 355590 260062
13602 260062 209902 216709 372677 270212 2768 144028 461799 278080 471851 141051
13591 151735 159091 250313 125764 85617 149080 250659 307897 270164 -87822 -395002 365371
13579 172449 213733 491133 430145 192316 113964 70728 -104205 429202 115824 55764
13568C77183j79262O0632j15177b49215C19617K47036B22768J29j3073j5081n8921
13557A35822A5001L10803a7948E42336F9932J14170L80639A11599J44809o7885
13547A88523M15156k55301P1133Q6550j27973F0667R5880J57804k9683j16955
13537A67713L5188m4765N6647G3027K99405A69600J98439j01984A24755J35682
13527B60437r8495m2504N2741h4409B60600A24999J43922j33798J89671a1867
13516E1967L23968j32326o032K66603c5844A10094a07002A49512J80066k8812
13506C00766B5649M63679A23821E1382R1756J80964M8814b18588D409J01626K05233
13495C11268H0075Q3143m4773K01713d6310j21538k3239a7944A33696a263E10635
$$ plain form
13568 377183 197921 258553 143376 -249215 319617 566653 222768 222897 209824 194743 135822
13557 135822 15001 325804 -17948 542336 69932 184102 564741 111599 256408 188523
13547 188523 603679 348378 419511 506061 378088 60667 156547 314351 284668 167713
13537 167713 202901 158136 214783 73027 372432 169600 368039 266055 124755 260437
13527 260437 161942 119438 172179 -84409 260600 124999 268921 135123 324794 -11867
13516 51967 375935 243609 237577 504180 -35844 110094 -107002 149512 329578 300766
13506 300766 25649 489328 123821 51382 143138 324102 372916 -218588 4409 106035 311268
13495 311268 80075 163218 118445 320158 -46310 -167848 -191087 -17944 133696 -1263 510635
13483A68859M7359F8145a942A44848a54580A71654K42841c3910j2790A09484M8412
13472A57896b9512B76407j24515a01992B47650q1412E9303K76083L8708j42362
13462B31732D7139P7547c4742A54140K35515a39120k01034A39554g1777A92848
13451C48515M933j21229A6591K12307M8108E8005K44960j5515N0717A33588K45276
13440C78864A03498L1577j6909J9843J13764C3490d1547A25279P4679M2493q3780
13429A58671c7314B38402P6524a13251i923B19890J41314j74553k6321k1896R7567
13418B36001A412J90056B8335g6767D45229f9245D0609c3096n3479A56462M74818
13407F31280j51962K5839g2355D70646A78231a30839C62349A60673D5229K1743
$$ plain form
13483 168859 216218 68145 -1942 144848 -154580 171654 414495 -33910 -46700 109484 157896
13472 157896 -29512 276407 151892 -101992 247650 166238 59303 335386 374094 231732
13462 231732 47139 124686 -34742 154140 389655 -139120 -340154 139554 -71777 192848
13451 348515 353448 232219 16591 228898 277006 58005 302965 287450 338167 133588 378864
13440 378864 103498 135075 118166 138009 251773 33490 -41547 125279 199958 242451 158671
13429 158671 -37314 238402 314926 -113251 -9923 219890 361204 186651 160330 138434 236001
13418 236001 1412 191468 28335 -76767 445229 -69245 40609 -33096 -86575 156462 631280
13407 631280 479318 505157 -72355 470646 178231 -130839 362349 160673 45229 66972
13397F6972K58149H2935N818J55580l024O5688c4755j62376F00942A95829J04342
13386C00171J80666j53591H3623D760N4011g5944G5119o590J47569a07525l7553
13375a45078C80415O5467f6846A69375o6049N3487B5835M10349A11264K4320K9719
13364A65303K16567H273M06860K22862b7216B20428C8996P259d4147C03895K61041
13353E64936k77688K6424A01616A8705L45180p6883A08399K05113J4329b0636
13342A76674J7471l5842l0299K70440a47627E84283F9455a6005B51413a1677A25610
13330h8817A33611a70409A16740K1041N2379K16205k02960J02693b3761C16181
13319C69746f6576C38930j33179k3494M0K13369a54994A28756a71452a6341A03407
$$ plain form
13397 66972 325121 82935 88753 244333 241309 306997 -34755 -197131 600942 195829 300171
13386 300171 480837 327246 83623 4760 58771 -75944 75119 68529 216098 -107525 -145078
13375 -145078 380415 445882 -66846 169375 103326 156813 25835 436184 111264 135584 165303
13364 165303 381870 8273 415133 637995 -27216 220428 38996 46255 -44147 303895 564936
13353 564936 287248 313672 101616 18705 363885 287002 108399 313512 327841 -20636
13342 176674 194145 158303 128004 398444 -147627 584283 69455 -16005 251413 -11677 125610
13330 -88817 133611 -170409 116740 137781 190160 406365 203405 306098 -23761 316181
13319 369746 -66576 338930 205751 182257 182297 395666 -154994 128756 -171452 -16341 103407
13307B28206D03J43300N6945B9245M0022N0511n451b51434B29419b96194R5762
13296b00432B57059b30588A06366Q255a62967A77086d627A20552c7470D59085
13285A79593a12576A46284L00651a43116A03369J62260A10777n3124a79541C51830
13274D12141A75750d8725C29552a37212A99133n3142c8837l14495b7180C2671
13263C22120m9620b0503j5399J1364A60139Q1605r4581b49328a5573D82462b19859
13251A85677p0927J52593J08044Q4791d0407j08762a4414j10496A76550n6738
13241A19812J10249a1236A23036b37474A77695N0200R9734a7372A29340c66751
13230f5529B51581c8688j21461a9329B37706o1012a15867H9013R8530a39900f0191
$$ plain form
13307 228206 403 143703 200648 29245 69267 119778 114327 -251434 229419 -296194 -200432
13296 -200432 257059 -230588 106366 114621 -162967 177086 -4627 120552 -37470 459085
13285 179593 -112576 146284 446935 -143116 103369 265629 110777 57653 -179541 351830
13274 412141 175750 -48725 329552 -137212 199133 145991 -38837 -353332 -27180 32671
13263 322120 272500 -20503 -35902 -24538 160139 241744 147163 -249328 -15573 482462 -219859
13251 185677 114750 267343 375387 460178 -40407 -149169 -14414 -124910 176550 119812
13241 119812 230061 -11236 123036 -237474 177695 227895 327629 -17372 129340 -366751
13230 -65529 251581 -38688 -160149 -19329 237706 176694 -115867 89013 187543 -139900 -60191
13218C2369L15760I8322M0071e5216j9491a6722B60851A29498j2135k6983D2944
13206A27253J94760j44823b5593A91270R7316A35555d8839m4953D21106B00730
13195B67517b01001B16454c5271j20058a230A45771a16498B64595f0587j39542
13185b00129F3751g577B06630b24534B55684e5570K0695j48238A73062a38632
13174f662D19938b7448E6372b53635A00339f0090m23371B2313K36998A09130c04219
13162B43123e1952C10319i3665C91566A4976b9523o0516q9464A00483A2836J41543
13151A54379m7886a0497C05922G7172L05544e7263n5080G2949K17765A7680O8177
13140H5857b84993c2597B45416d7735P553A48199m5530k8999Q3597p1278d4584
$$ plain form
13218 32369 348129 98322 138393 -55216 -74707 -16722 260851 129498 117363 90380 42944
13206 127253 322013 177190 -25593 191270 288586 135555 -48839 -93792 421106 200730
13195 267517 -201001 216454 -35271 -155329 -1230 145771 -116498 264595 -60587 -200129
13185 -200129 63751 -7577 206630 -224534 255684 -55570 -34875 -183113 173062 -138632
13174 -6662 419938 -27448 56372 -253635 100339 -60090 -483461 22313 259311 109130 -304219
13162 243123 -51952 310319 -93665 391566 14976 -29523 -90039 -179503 100483 12836 154379
13151 154379 106493 -10497 305922 77172 382716 -57263 -112343 72949 290714 17680 85857
13140 85857 -284993 -32597 245416 -47735 -40182 148199 102669 73670 157267 85989 -44584
13128G8849R5522a00134B48718D2160j6250e4083B90971A09250l5276e2494Q408
13117d4086A84854b76839K3586B17841b63490B21561c34455J53491E06695A93051
13106B48534F002a00395E9476f8907B1837g232B09260A02840K86570A83006n6983
13095A26023o1335P6574Q3421e8530B06918n4622e5915B46116a31323K5689H052
13083A1084a14906G828c1890k99466I9332r911l1222N8949l3604P0218b26642
13071e2214n0321C44726a48321o7292p8469J2975C30901a0885m0058C50327A73590
13059C53474N9061A99840j9782o0858b51808A80697K3642j5557Q649Q9498j37009
13048A49920j1918J6802J07073b72565E1118J26925M6525P7319k610J196N3641
$$ plain form
13128 78849 174371 -100134 248718 42160 25910 -54083 290971 109250 73974 -52494 -44086
13117 -44086 184854 -276839 -253253 217841 -263490 221561 -334455 -180964 506695 193051
13106 248534 6002 -100395 59476 -68907 21837 -7232 209260 102840 389410 183006 126023
13095 126023 64688 141262 224683 -58530 206918 152296 -55915 246116 -131323 -105634 8052
13083 11084 -114906 7828 -31890 -331356 99332 89421 58199 117148 83544 153762 -226642
13071 -52214 -102535 344726 -148321 -215613 -294082 -281107 330901 -10885 -50943 350327 173590
13059 353474 412535 199840 180058 119200 -251808 180697 204339 188782 197431 286929 149920
13048 149920 138002 154804 261877 -272565 51118 178043 224568 301887 299277 300473 354114
13037C54114b1474A58102L28929B21405H8970J83622r0621H9218A8146a65554
13026G1738L00927A73947G461J22575E7407K23433a76392a2513A91491I2341c58824
13014C21567A32598h4474A21657m0553K26847a3814l18306G6605m412P3974p2030
13003G4137c365A1581L09715I7701K5365a71521E02106a17000C9620e5953A92462
12991B23473k3166j0202g151B3182C777a71784l2811H9288e6384G9431N6999k6779
12979A09651d4014j9332K4085B82484d179J454j95656D4782n233O6351J07540
12968B13440I7640N0576R574K48771A81242G891N7939M2361N5808h1630C74283
12956b5891A55610J65982j15824n8673d6250j13273d8625j9072F0057J67583B3019
$$ plain form
13037 354114 -21474 158102 487031 221405 88970 272592 181971 89218 18146 -165554
13026 71738 372665 173947 7461 130036 57407 280840 -176392 -12513 191491 92341 -358824
13014 321567 132598 -84474 121657 81104 307951 -13814 -332120 76605 72193 146167 74137
13003 74137 -3365 11581 321296 97701 123066 -171521 502106 -117000 39620 -55953 192462
12991 223473 200307 190105 -7151 23182 3777 -171784 -204595 89288 -56384 79431 136430 109651
12979 109651 -44014 -63346 -39261 282484 -4179 -2725 -198381 44782 39549 105900 213440
12968 213440 97640 148216 157790 406561 181242 7891 65830 108191 163999 -81630 374283
12956 -25891 155610 321592 205768 147095 -46250 -159523 -48625 -67697 60057 227640 23019
12944c0367A19309a60175C34196a98322C4156J7142N5672f2925a9418A05321c0229
12932c50914E9513L96023A2777a54404J2633A16119f9861k5343C4057K44453b22119
12920H0816C1720J06466A3940b69204R6434q3023c6054A13316a14605A47644b9088
12908B17835b8137r0155H6635g2366n0689l026o9913i3194K0510j06775A87705
12896a92526B10711A2099J66730b05674C97770e7106m7295C83078j49760R6914
12886C30232o5347a06721A23542J44745P516b85346A45045J8886K1071b50077
12875a05659A06798l6650e8703b2868A84267q9254b51458a25194A53410A6372
12864b30033b2994j46353A36738j2315N9758j0416o6983P3033D7529J69152a13531
$$ plain form
12944 -30367 119309 -160175 334196 -198322 34156 51298 106970 -62925 -19418 105321 -30229
12932 -350914 59513 455536 12777 -154404 -141771 116119 -69861 -95204 34057 278510 -222119
12920 80816 31720 138186 13940 -269204 -172770 -255793 -36054 113316 -114605 147644 -29088
12908 217835 -28137 -118292 86635 -72366 -123055 -126081 -195994 -93194 -72684 -179459 187705
12896 -192526 210711 12099 178829 -205674 397770 -57106 -104401 383078 233318 330232
12886 330232 264885 -106721 123542 268287 275803 -285346 145045 163931 185002 -250077
12875 -105659 106798 70148 -58703 -22868 184267 95013 -251458 -125194 153410 16372
12864 -230033 -22994 -169347 136738 124423 184181 173765 106782 179815 47529 216681 -113531
12852b19939A6281K15887H5161a30294A64075g3445j0522A39394b33437C10451
12841a38971C93611b58471A38502Q5008c68500A47156l223A6786O5707J60802
12831B43295e1276K0118I3763C9821a32853b501j02273B72305b01439e327B11497
12819a87049B23243d8223D13135A09357b57944B62558h2129b1075A99710M9728
12809B49438E4992h4958L8803A02876e7197C55133A5166J70059a86873f3458j14346
12798a77804F2170L47254d5543o648C22575h9436A1813P7954Q3834p1781K34222
12787C36042A47290F306g6994B24401d0871D2711a85732B24503d48380A55756
12776a5628j16016j77601F7170b40260l35227g819k17665A21420n6189L10005
$$ plain form
12852 -219939 16281 232168 85161 -130294 164075 -73445 -83967 139394 -233437 310451
12841 -138971 393611 -258471 138502 223510 -368500 147156 143933 16786 82493 243295
12831 243295 -51276 -31158 93763 39821 -132853 -2501 -104774 272305 -201439 -5327 211497
12819 -187049 223243 -48223 413135 109357 -257944 262558 -82129 -21075 199710 249438
12809 249438 54992 -84958 -46155 102876 -57197 355133 15166 185225 -186873 -63458 -177804
12798 -177804 62170 409424 -45543 -52191 322575 -89436 11813 89767 173601 101820 336042
12787 336042 147290 6306 -76994 224401 -40871 42711 -185732 224503 -448380 155756
12776 -15628 -131644 -309245 67170 -240260 -575487 -7819 -225484 121420 65231 375236
12766C75236A37463b37886A91705d5787A84134d50306A67012L4762h3921b983
12755b97693R1081A87715f4972I1283b1894k39250j3800C27331b73215B11099
12744a69002B01549f8943E31298j30702i0897A03955M7737A0294b21876A38341
12733A85665b12693C0188c1696A01483h0092A45339a135D13256A21556d8727j37782
12722a86509I7283b41870A27211a28119D54017H9273d916k02292h6152K8272B15960
12710B24636b86889A2176a50430C24924D3569h7353D09818c3554C59914a71739
12699B38103J06419J6268A59259J6882B4913i2899A70487b5035r9493O648K4439
12688i3441E7962K13851a62799q0322g2941m8937f0883B3625i6381L0796A72594
$$ plain form
12766 375236 137463 -237886 191705 -45787 184134 -450306 167012 201774 -83921 -2983
12755 -297693 -206612 187715 -64972 91283 -21894 -261144 -274944 327331 -273215 211099
12744 -169002 201549 -68943 531298 400596 -90897 103955 151692 10294 -221876 138341
12733 185665 -212693 30188 -31696 101483 -80092 145339 -1135 413256 121556 -48727 -186509
12722 -186509 97283 -241870 127211 -128119 454017 89273 -4916 -207208 -86152 -57880 215960
12710 224636 -286889 12176 -150430 324924 43569 -87353 409818 -33554 359914 -171739
12699 238103 344522 360790 159259 176141 24913 -92899 170487 -25035 -124528 -117880 -93441
12688 -93441 57962 271813 -162799 -243121 -72941 -121878 -60883 23625 -96381 -65585 172594
12676D3727M775J73777H31K3408R4394L92250H3383e4215C4769J02608J32990
12665B70367j22244J63049A40985E8175c0558j18561C4887c3304B951L90574h3975
12653B185a11315a1397B45802c44998B95516j21810d56723a3442n7139D01405
12642a34796F0674c16980l3712i6510B94070a0859r0913j83659H7460b15409A89735
12630A47144K39952J9387o8653B3963d53A38779m4345E038J70119H5072J48838
12619B33910f6040C05251O3682A75517a3950A06493a1183j38039d3683D9053L3103
12608H2156a52711D4345d5457J5809B33787H0130J7347b40778A96478n2085K24819
12597C69212L1161A66346J01316I333M0821B2320L4948n056J52324D0090a45332
$$ plain form
12676 43727 48502 222279 831 24239 118633 510883 83383 -54215 34769 137377 270367
12665 270367 148123 311172 140985 58175 -30558 -149119 34887 -33304 2951 393525 -83975
12653 2185 -111315 -11397 245802 -344998 295516 173706 -456723 -13442 -70581 401405
12642 -134796 60674 -316980 -350692 -96510 294070 -10859 -101772 -285431 87460 -215409 189735
12630 147144 387096 406483 337830 23963 -453 138779 94434 5038 175157 85072 233910
12619 233910 -66040 305251 368933 175517 -13950 106493 -11183 -149222 -43683 49053 82156
12608 82156 -152711 44345 -45457 -29648 233787 80130 97477 -240778 196478 144393 369212
12597 369212 400373 166346 267662 9333 50154 22320 57268 52212 204536 40090 -145332
12585a94924B85028d4858j53170j09512M5555R1320g0460j85583J02567n5363
12575b08839l6181F4426b52630o0860I5600N29271A43508b43571a03316B28277
12564h5007i991j63481F6520g70E0594J45543c08563D7354J6017b1158C37366
12552a62687A10348i2812I4186j5016J05084h1720B53261J35220c90060A21030
12541A89623n2864f8476j67913L9571C13177G0699b70404O0525B36652g3169B76913
12529f584k25129F0195J15374B6023N963K18975b25580B25954d04707d9145B32962
12517a53597A8223K0970a18091B09218p9088b09090K3065H9194J89324b52452
12506C09830a30771J9672C84563g3602A27003c72052J25357c8204B780J98090
$$ plain form
12585 -194924 285028 -44858 -198028 -307540 -261985 -170665 -70460 -256043 -153476 -208839
12575 -208839 -245020 64426 -252630 -313490 95600 624871 143508 -243571 -103316 228277
12564 -85007 -9991 -173472 66520 -770 50594 196137 -308563 47354 63371 -21158 337366
12552 -162687 110348 -92812 94186 79170 184254 -81720 253261 388481 -390060 121030
12541 189623 136759 -68476 -236389 -196818 313177 70699 -270404 -209879 236652 -73169 276913
12529 -6584 -231713 60195 175569 26023 31986 250961 -225580 225954 -404707 -49145 232962
12517 -153597 18223 39193 -118091 209218 130130 -209090 -186025 89194 278518 -252452
12506 309830 -130771 -111099 384563 -73602 127003 -372052 -246695 -38204 2780 200870
12496B00870r9521K5032d8146F3681Q9981G6259P5669O0237F705b24076A07294
12484b59004A55472E0182L70430r5390A28990b95484G6612b53835A17518K13039
12474C30557D3864O7246Q522g77E0772P0887d097j72786A45681c93692A35379
12462a63346A45483b11889B33091a7872j41101A83751i3369k49798B56975C3291
12451a26538M4138R427B83379b52853C93K25508J60261a15014j66974C9708f4456
12439h2272o9887j29039C19845d2220n9114A60799J00471c09328Q2044e4927b7077
12427b35963N1362C4844J24397a8363j6492E6886b44876a02966B16250n4014J35718
12416B97954c66751J40105B18801A02565J61067A04290A5564c3232j56701B4633
$$ plain form
12496 200870 101349 126381 -48146 63681 153662 76259 151928 212165 6705 -224076 107294
12484 -259004 155472 50182 420612 325222 128990 -295484 76612 -253835 117518 330557
12474 330557 43864 111110 119632 -777 50772 121659 -4097 -176883 145681 -393692 135379
12462 -163346 145483 -211889 233091 -17872 -158973 183751 -93369 -343167 256975 33291
12451 -126538 -82400 -72973 283379 -252853 393 225901 386162 -115014 -281988 39708 -64456
12439 -82272 -152159 -281198 319845 -42220 -101334 160799 261270 -309328 -227284 -54927 -27077
12427 -235963 -184601 34844 159241 -18363 -34855 56886 -244876 -102966 216250 162236 297954
12416 297954 -366751 -226646 218801 102565 263632 104290 15564 -33232 -189933 24633
12405B1858Q403J94549p9824c61611a22678D6199M9679D3167f8364C25689D8224
12393b69777c1306A21993e638A15504K43759b32904N7420A19287J7848a69690
12382d6309B88828D107J06713E278a21995C78097d0804G4813P363K48626f4711
12370G1826b32935m2395j52552a61064g982B71246n3405f9309b4385k2418A59336
12358h861k71169f6493A97595b04439O9835B9132P8952c59106A19035a94434o8705
12347b63139p7061C69883h7976A79573H5903R2846n1760b56521m6813G7687b31701
12335D0519a68840P611o2880D5668K39726a35563B98602c1189j13328j90343I2180
12323A61910b07877e3964K6943B08742d30488g1364G0660J86564d0571D58351
$$ plain form
12405 21858 30261 224810 144986 -361611 -122678 46199 95878 43167 -68364 325689 48224
12393 -269777 -31306 121993 -5638 115504 359263 -232904 -175484 119287 137135 -169690
12382 -46309 288828 4107 110820 5278 -121995 378097 -40804 74813 82176 330802 -64711
12370 71826 -232935 -275330 -427882 -161064 -7982 271246 217841 -69309 -24385 -46803 159336
12358 -8861 -280030 -66493 197595 -204439 -134604 29132 108084 -359106 119035 -194434 -263139
12347 -263139 -340200 369883 -87976 179573 85903 178749 126989 -256521 -303334 77687 -231701
12335 40519 -168840 -161229 -224109 45668 285394 -135563 298602 -31189 -144517 -334860 92180
12323 161910 -207877 -53964 -27021 208742 -430488 -71364 70660 257224 -40571 458351
12312B72689A17835a99514M8046A75378a50316B85478A15730J91426e7527H3236
12301A95233a24864A04596a37693O4355K6400B91910D4280f1458D14444j99901
12291B14543F9371A3985P875J60589D8632i7220D77875k32300E9461J00999l8575
12280A21885j1843a47565A94224K58843A99550a2246k087n5544D10050a65963
12269a40428M7036D20780a06538M2803k26379A00726J02999a23588j79500G9459
12258A33959c39361d2464B74450a19274M3413B17886A06936a73736A85137K79064
12248D64201E3057b43903i9267D42882A25558o0950J06540J61344G0800f7028
12237E6625J64375m5827b30507C68209d6947f534j32473A82521a19413j27665
$$ plain form
12312 272689 117835 -199514 -151468 175378 -150316 285478 115730 307156 -57527 83236
12301 195233 -124864 104596 -137693 -73338 -46938 291910 44280 -61458 414444 214543
12291 214543 69371 13985 21860 182449 48632 -97220 477875 245575 59461 160460 121885
12280 121885 110042 -147565 194224 453067 199550 -12246 -14333 -69877 410050 -165963
12269 -140428 -93392 420780 -106538 -63735 -290114 100726 203725 -123588 -303088 79459
12258 133959 -339361 -42464 274450 -119274 -75861 217886 106936 -173736 185137 464201
12248 464201 53057 -243903 -99267 442882 125558 64608 171148 332492 70800 -67028
12237 56625 221000 175173 -230507 368209 -46947 -6534 -139007 182521 -119413 -247078
12227b47078a01055B01500k9082O0191K69862C1661J15265K34426A36709J04957
12217B41666I225O58236A45791D2576a05344E9264d9410H4801P8454E3050K96143
12206C49193j43775M59058a28719H1002C187J02990J58617D3150K09560J44234
12196C96944j71872A1735J52029G5645a26388A12005a29634a7636D0478M1781
12186H2259l175K44549e9946j61049A48993l5862K39147h5767F4603A2729f3740
12174e3221B7239D042R3084g0184b0055B10746b8163r8592A03146M96336d23395
12162C48087a36016B71146a09087K917A22156k9091J34788A04205a72678k1153
12152a93831j55273B6331b05584j92114A30632D124d8150j27955B06578a18821
$$ plain form
12227 -247078 -101055 201500 172418 232609 502471 31661 146926 381352 136709 241666
12217 241666 9225 667461 145791 42576 -105344 59264 -49410 84801 163255 53050 349193
12206 349193 205418 664476 -128719 81002 3187 106177 264794 43150 252710 396944
12196 396944 225072 11735 163764 75645 -126388 112005 -129634 -17636 40478 82259
12186 82259 79084 323633 -59946 -220995 148993 113131 352278 -85767 64603 12729 -63740
12174 -53221 27239 4042 97126 -70184 -20055 210746 -28163 -126755 103146 599482 -423395
12162 348087 -136016 271146 -109087 -106170 122156 93065 227853 104205 -172678 -193831
12152 -193831 -349104 26331 -205584 -397698 130632 4124 -48150 -176105 206578 -118821
12141C2875N8264a01869F3760b7922C3531a04288A26364L9412D0254K07087H5883
12129I5061J0069N2306J00650D2660e0009l48507b3056j048A82645H9804J22761
12118B12565E885b07333L3410C1482b5882k33256A95468f0729B10355b89571I173
12106a99786A05598n1445b30363B20379a68515K6937K3123A68498I70a62937A19801
12094A05484D9095K09026a7611j21088F444J92890b941A6327a42586A08310J27712
12083B36022b2636k44262A1268c40096f524A09930B2976M6816c8534C34425i8831
12071b2623A10710a80799C85777a05689q4015m2873C52340A3156a45621C25635
12060A57122k0907g2220A4193a01873B45597g8089o4575A00557K83244b8431B90906
$$ plain form
12141 32875 91139 -101869 63760 -27922 33531 -104288 126364 165776 40254 247341 85883
12129 95061 105130 157436 258086 42660 -50009 -398516 -23056 -24104 182645 89804 212565
12118 212565 5885 -207333 -173923 31482 -25882 -259138 195468 -60729 210355 -289571 9173
12106 -199786 105598 54153 -230363 220379 -168515 -141578 -118455 168498 970 -162937 119801
12094 105484 49095 258121 -17611 -138699 6444 199334 -2941 16327 -142586 108310 236022
12083 236022 -22636 -266898 11268 -340096 -6524 109930 22976 69792 -38534 334425 -98831
12071 -22623 110710 -180799 385777 -105689 -189704 -232577 352340 13156 -145621 325635
12060 157122 136215 -72220 14193 -101873 245597 -78089 -142664 100557 383801 -28431 290906
12048A44617A2387a57360C18124A21122d8836D9221I689a91021K7805A0601d9451
12036c39805J03085F5630J05241c05736c5972j9163I1511a0684B8014K7594B7441
12024a87640C01894j01520G3179M41808k37398P92586k19371C39203b5331A67057
12013I3955B0464K52855A12428K0476a68384B41081a36405p0080c059n5658j74542
12002b33259B13496b08874O587A27906b665j66151P9348A37290b21110J6728h8440
11990A03031M8566n8574c2507o1851A2444a27636B51090a38883h046l3456G7349
11978B27543D7933a24971k38819D17131b09703r4546D3779b04111B39330c49753
11967D40026C5238L968c52023G5014L1379a37566j6441g5037A58586A4077b72588
$$ plain form
12048 144617 12387 -157360 318124 121122 -48836 49221 9689 -191021 -163216 10601 -49451
12036 -339805 -236720 65630 170871 -305736 -35972 -55135 91511 -10684 28014 55608 27441
12024 -187640 301894 200374 73179 514987 277589 1070175 850804 339203 -25331 167057
12013 93955 20464 273319 112428 132904 -168384 241081 -136405 -206485 -3059 -58717 -233259
12002 -233259 213496 -208874 -202287 127906 -2665 -168816 -89468 137290 -221110 -204382 -88440
11990 103031 151597 93023 -32507 -94358 12444 -127636 251090 -138883 -8046 -41502 77349
11978 227543 47933 -124971 -363790 417131 -209703 -304249 43779 -204111 239330 -349753
11967 440026 35238 39206 -352023 75014 106393 -137566 -154007 -75037 158586 14077 -272588
11955a47163K0874A80576q5644a67626j82261B41891d5070f257A7253a44650L4812
11944a09838B47067a33805r6017e6427n2067l2940l7433a1384E3578a25646j72085
11933b97731D1162a84722A84271J27311j00357b22359G7406B6625K9990J5989
11923G2604j6765L0146a72167b189E7146K926M02862A55963R093b51980G8429
11911A03714b3060A59409b72373H5367b41412d0012B71489D92c00189A91545O3489
11900B55034c9650k72380B35K97121m7340a39384J6102j47156G1820o519O4218
11889A29519J70108H568N3299a16672B09137A8209K0064b35075P8497e2221a9048
11877C85800a9774C84655c03782e7008j16709c3498B3257d7209J6790j40728o5029
$$ plain form
11955 -147163 -126289 180576 94932 -167626 -349887 241891 -45070 -6257 17253 -144650 -109838
11944 -109838 247067 -133805 -229822 -56427 -108494 -141434 -178867 -11384 53578 -125646 -297731
11933 -297731 41162 -184722 184271 311582 211225 -222359 77406 26625 56615 72604
11923 72604 55839 85985 -172167 -2189 57146 60072 462934 155963 165056 -251980 78429
11911 103714 -23060 159409 -272373 85367 -241412 -40012 271489 492 -300189 191545 255034
11900 255034 -39650 -312030 235 297356 250016 -139384 -123282 -270438 71820 65301 129519
11889 129519 299627 8568 61867 -116672 209137 18209 38273 -235075 -156578 -52221 -19048
11877 385800 -19774 384655 -303782 -57008 -173717 -33498 23257 -47209 -30419 -171147 -236176
11866b36176R9461m820D0924a12942B12179G6899b1558o6150A8034c66920c5351
11854B2084J95566O2310a00195k65181C27815r4698d9011k29839M2460a05758
11843c35835F9032A2393K25126d8280k29581A43594a7380j3048r6130B91297J39560
11832D30857a13221e2788a5625A21206b4195l42095A78470M485a24951B2875J45602
11821A68477a7703D9755J23848d39649A78963M1156A6884a75338q3426A72707
11810A17605b24969A577a15123d9190n2854A39462A946J9926J34708K2554a55197
11798A55072l9787m9120J79341C7464P5407d8947o7198A85084b41144L7293G2917
11786a14614B47221a46123q7599o7596A67416d4266a6309B1644N850R815b32588
$$ plain form
11866 -236176 -136715 -141535 40924 -112942 212179 76899 -21558 -87708 18034 -366920 -35351
11854 22084 217650 279960 -100195 -365376 327815 233117 -49011 -278850 -236390 -105758
11843 -335835 69032 12393 237519 -48280 -277861 143594 -17380 -30428 -126558 291297 430857
11832 430857 -113221 -52788 -15625 121206 -24195 -366290 178470 182955 -124951 22875 168477
11821 168477 -17703 49755 173603 -439649 178963 220119 16884 -175338 -258764 172707
11810 117605 -224969 1577 -115123 -49190 -102044 139462 1946 21872 156580 179134 -155197
11798 155072 115285 66165 245506 37464 112871 -48947 -116145 185084 -241144 -203851 72917
11786 -114614 247221 -146123 -233722 -301318 167416 -44266 -16309 21644 27494 37309 -232588
11774H8099a15852j38936E3506a97404j1092A2593i3783A38000F3430i3984d1179
11762B87577f8245B9038J23197b359A75952g1305A45485e9944r8228A50505g9601
11750A00936a00299L513j36871E7671J93544I5076A6750J5554i9951j3888H6538
11738A55815e7908l8021B5978i8106l868N310B14797a93856j0850k18932F2110
11726b75751B53153C3844g4874k89735E9200P1351b43378B8839O77408b63091
11715A256b22424E2293b11741R2525N931c8445A37498J44307a49225k10807B13728
11703C18247q1055i246l8441j96880R2534q6082A67690k3458a1770F2172j0252
11692E1920R1329c18807a01562H6580a60355L8502A49289D5786L3711K846I721
$$ plain form
11774 88099 -115852 -254788 53506 -197404 -208496 12593 -93783 138000 63430 -93984 -41179
11762 287577 -68245 29038 152235 -2359 175952 -71305 145485 -59944 -158172 150505 -79601
11750 100936 -100299 -96786 -233657 57671 251215 95076 16750 32304 -99951 -113839 86538
11738 155815 -57908 -95929 25978 -98106 -101974 -96664 214797 -193856 -204706 -423638 62110
11726 -275751 253153 33844 -74874 -364609 59200 130551 -243378 28839 706247 -263091
11715 1256 -222424 52293 -211741 -119216 -113285 -38445 137498 281805 -149225 -360032 213728
11703 318247 237192 -9246 -47687 -244567 -152033 -238115 167690 144232 -11770 62172 51920
11692 51920 143249 -318807 -101562 86580 -160355 -121853 149289 45786 79497 82343 9721
11680i2222A02204h0232B09734B5877b70515A67574b09771R9132C83117a16424
11669A66699f8430K0199E8885c0643D962L37975f3364h530A0229d4673H2901J84969
11657B67870c908j0090j31936c1796G7440f1855A33070M6887d99285G9023m793
11646G4230c43093B58565a25344C03172G1183a0660A99572j4488h4338B38219
11635a27797A52077c04651B00249D3524A536O4571a0855m6493k4680A66543C3360
11623A05099b05701F2665a21097B51396c41746a48849B8853a26912D08965d8460
11612A17337L1319l2140C9436k665J01803k1128a47099A80867D4301f4162l24760
11601c88922B6558P417K23527a29584e7649B0324a20915J5598B31704e957r3791
$$ plain form
11680 -92222 102204 -80232 209734 25877 -270515 167574 -209771 -110639 383117 -116424
11669 166699 -68430 -48231 58885 -30643 4962 342937 -63364 -8530 10229 -44673 82901 267870
11657 267870 -3908 -13998 -145934 -31796 77440 -61855 133070 179957 -499285 79023 74230
11646 74230 -343093 258565 -125344 303172 71183 -10660 199572 185084 -84338 238219
11635 -127797 152077 -304651 200249 43524 1536 66107 -10855 -57348 -82028 166543 33360
11623 105099 -205701 62665 -121097 251396 -341746 -148849 28853 -126912 408965 -48460
11612 117337 148656 116516 39436 36771 138574 117446 -147099 180867 44301 -64162 -388922
11601 -388922 26558 33975 257502 -129584 -57649 20324 -120915 -105317 231704 -5957 -99748
11590i9748A80201h5080C17047g5714j18676j27403A02021B3615L2031J00908
11580A56554n4222d26443a48295B35801a66023a0070n851A26935K41441K491G560
11568a57893N7775A76458h0009E1392M18208A77566n7752A3592a21635L7456a1856
11556C86620a25252r1774A15352O7023a94379A04893b47646l9533A99281e4778
11545C5078a41003C0134a93472Q1892A86245b50459R4054D5155J84295c64061
11534d65360B04833i0799k8383M1707p1293A07515b28796d6920MA55959D5326
11522f8491j87356A10668J55324a3874A08064n2808Q1594a0726a612k05897A27217
11510B4653J5184J30474G9693J30048P1469a91378B13198a38606C44562H4904
$$ plain form
11590 -99748 180201 -85080 317047 -75714 -194390 -321793 102021 23615 55646 156554
11580 156554 102332 -426443 -148295 235801 -166023 -10070 -15921 126935 368376 370867 7560
11568 -157893 -100118 176458 -80009 51392 469600 177566 119814 13592 -121635 -84179 -11856
11556 386620 -125252 -217026 115352 182375 -194379 104893 -247646 -287179 199281 -54778
11545 35078 -141003 30134 -193472 -111580 186245 -250459 -156405 45155 229450 -364061
11534 -465360 204833 -90799 -119182 -77475 -148768 107515 -228796 -46920 -46916 155959 45326
11522 -68491 -255847 110668 265992 -13874 108064 55256 136850 -10726 -1612 -207509 127217
11510 24653 39837 170311 79693 209741 281210 -191378 213198 -138606 344562 84904
11499b2326D02845a57956K8099N8206Q545E9177A8841J5738j4843c3009A48721
11487C21091j17008J24620A33284G264J78608N5966j20551c327H1309A8484P8853
11476I7337f7703A1476N18003i838B55864M0263J36106j46073n2065c3136A40807
11464G4028K09565q5737b20083a9362A85523L21755a47579A56989h5755l9080
11454a24835A76764a14795o6711f6271b7478A24801K13011F3285b37837A74931
11443a2309B60127a51234l1674A01005J53301c4639F0105a54505d932m0727p1350
11432a17009K5834B40653r1259a3625B4387Q0592k5310J70612d4019A52320h9186
11420E0809N8432B9335K6984e0474C01992c17790I6370c70197f3941B17291a17112
$$ plain form
11499 -22326 402845 -157956 -129857 -71651 -63106 59177 18841 34579 19736 -33009 148721
11487 321091 204083 328703 133284 7264 185872 241838 121287 -3327 81309 18484 97337
11476 97337 -67703 11476 529479 -9838 255864 296127 432233 286160 234095 -33136 140807
11464 74028 283593 197856 -220083 -19362 185523 507278 -147579 156989 -85755 -124835
11454 -124835 176764 -114795 -181506 -66271 -27478 124801 337812 63285 -237837 174931
11443 -12309 260127 -151234 -182908 101005 254306 -34639 60105 -154505 -4932 -45659 -117009
11432 -117009 -91175 240653 149394 -13625 24387 104979 79669 250281 -44019 152320 -89186
11420 50809 109241 29335 56319 -50474 301992 -317790 96370 -370197 -63941 217291 -117112
11408d9743c564G6676b47793d2392A6764C071J0069K16098N9021A07222J55651
11397B62873a57057c0846C05546a03647K2981A83477q5807d09539A93394A4658
11386a22427j48330A74557F1425h2247D9434Q063J91725a90898B76252C8001K07785
11375B45786L3929n6772b14693B22811H1969k4358h812C20027l8138D430K4774
11364B9204g3281D9159c65896a9398A08246c17084d9519B19809H6288J62883a85565
11352f0782m69034A49765a93806b4516g295m3988p2485b8990H668M7660b41088
11340c39255A84097c52025J16455A40896K88669b06211G112d33812b12625f4528
11329a23825A16690d39198A0855b44957d7816B68816c18163f626A1128J22924
$$ plain form
11408 -49743 -3564 76676 -247793 -42392 16764 3071 13140 229238 288259 107222 262873
11397 262873 -157057 -30846 305546 -103647 -80666 183477 97670 -409539 193394 14658
11386 -122427 -270757 174557 61425 -82247 49434 57497 249222 -190898 276252 38001 245786
11375 245786 279715 222943 -214693 222811 81969 57611 -8812 320027 281889 4430 29204
11364 29204 -73281 49159 -365896 -19398 108246 -317084 -49519 219809 86288 249171 -185565
11352 -60782 -529816 149765 -193806 -24516 -7295 -51283 -123768 -28990 8668 56328 -241088
11340 -339255 184097 -352025 -235570 140896 429565 -206211 7112 -433812 -212625 -64528
11329 -123825 116690 -439198 10855 -244957 -47816 268816 -318163 -6626 11128 134052
11319A34052a31206K5514l7955N1564c5252j21550F8444f4934A43691b51731e1859
11307b06847l05929c5159I828O0010k8061P2909b26855f4772n0909D9651c01375
11295b42517a17076D5015f5074k5594A32634b33673f7285n6572B31602F5931f9692
11283a75088B32118b67644o8762K6548K553E3122M04107A16577a91807q1015B0327
11271A58601j4721o3318K64860a14519N6647l7510a7782n4522p5479B5671K04217
11260B29888m9579i4831A96938H5583b67006A92555M516i488F0813e6709J9121
11249c7588D32b09286c369k10052p3119J15771M4906C38025d321B0525a72702
11237c6939l1042j75688B19569a64128B84916g4488k04593P7529M2024I7871B1591
$$ plain form
11319 134052 -131206 -105692 -143647 -92083 -35252 -156802 68444 -64934 143691 -251731 -51859
11307 -206847 -512776 -35159 9828 69838 41777 114686 -226855 -64772 -115681 49651 -301375
11295 -242517 -117076 45015 -65074 -90668 132634 -233673 -67285 -123857 231602 65931 -69692
11283 -175088 232118 -267644 -336406 -309858 -307305 53122 457229 116577 -191807 -272822 20327
11271 158601 143880 80562 345422 -114519 -57872 -95382 -17782 -72304 -147783 25671 229888
11260 229888 180309 -94831 196938 85583 -267006 192555 197071 -9488 60813 -56709 -37588
11249 -37588 432 -209286 -3369 -213421 -286540 -170769 -125863 338025 -4321 20525 -172702
11237 -36939 -67981 -243669 219569 -164128 284916 -74488 -279081 -201552 -159528 97871 21591
11225d2146k5945j02726c7121A38201f9790A62455n4677D4700L5377P9135b68611
11213B0935K83602a8202j72755A06970l6733c10980a23139B3556b27747A2969
11202F8898J29726b75889N7043F7425L2328J7994m2336b07845i8330A46734k446
11191A44288j6223a01288F3635a1305l65778A29559j9254c22392a16488d6533
11180a0255c146A14716b31703I22b87973j11381B69090D7086b30971p8592J39805
11169a69758o2641K1016B1269b5333A95620b0703k0939A38780a37086I9079a8917
11157i057A46959J17487a00411j4437A04347i93j3552n7162p2352f6063k05547
11146b71610N0202J0932c1486B76936r9248b96356d7955K0625m32793i6993M1292
$$ plain form
11225 -42146 -68091 -170817 -37121 138201 -69790 162455 107778 44700 80077 159212 -268611
11213 20935 304537 -18202 -190957 106970 70237 -310980 -123139 23556 -227747 12969
11202 68898 198624 -275889 -218846 67425 99753 117747 75411 -207845 -98330 146734 144288
11191 144288 128065 -101288 63635 -11305 -377083 129559 110305 -322392 -116488 -46533
11180 -10255 -3146 114716 -231703 922 -287973 -399354 269090 47086 -230971 -309563 -169758
11169 -169758 -232399 -211383 21269 -25333 195620 -20703 -41642 138780 -137086 99079 -18917
11157 -9057 146959 264446 -100411 -114848 104347 -993 -14545 -71707 -144059 -66063 -271610
11146 -271610 -221408 -210476 -31486 276936 177688 -296356 -47955 -27330 -460123 -96993 -55701
11135e5701A44874j6025j4915J37997b51788e1865b3335I5623b01675B44275M0077
11124B84352r2573J8045a44412d6047K0280D2408J14908a76717I6935J29168A5308
11112A57076K31103e7833k84828B31645e8797A34201k0240N9793b8416C315a4274
11100B92190k9459n1641K61128d8703A299J47727J72047J4164A44719Q6399k9502
11089B01616K96413e0858B46212g9226j27881O094C33907A8639K0322j1259J17906
11078A45608F5519K32720j9929J96049c12254A63427N6881L89685k18903K04927
11068E96017B96608L6666l9248K32047j74084j15824L59956j37081J34639J17619
11058G11298J0325J90442B54855L03540P7571K32610j56215p1714j78466K22962
$$ plain form
11135 -55701 144874 128849 113934 251931 -251788 -51865 -23335 95623 -201675 244275 284352
11124 284352 191779 209824 -144412 -46047 -25767 42408 157316 -176717 96935 226103 15308
11112 157076 388179 -57833 -342661 231645 -58797 134201 113961 173754 -28416 3315 -14274
11100 292190 262731 211090 472218 -48703 1299 149026 321073 335237 144719 231118 201616
11089 201616 498029 -50858 246212 -79226 -207107 -201013 333907 18639 38961 27702 145608
11078 145608 65519 298239 278310 474359 -312254 163427 220308 609993 391090 596017
11068 596017 296608 333274 294026 526073 351989 236165 596121 459040 593679 711298
11058 711298 721623 912065 254855 558395 635966 868576 712361 640647 462181 685143
11048F85143N24832m01854j4310K7395k14392J48322J03992k3214k70175L3098
11038E98837K75649j00085j09485J56488l20976N02846m69849J41806l328j2597
11028F59306P0864n394j41542K23637r7737j19586l2057K34437P0674l39217L15520
11017H38905k69630O0015k23863K27694k18172N942J28052J17446l04807m7781
11007C13801M05851j95675N7419o4803K91716C43433K72424q8528J44740k5397
10997F46672q4760L2308K78292j50101J8155J19720j14031J15083J26424l16368
10987F71394J00143L74945j45596n1247J21224j07882q8678M12371P7982J24944
10977A489600P7436J11266O29220J17001O77223m41791K92866K17001L13527l15630
$$ plain form
11048 685143 1209975 808121 793811 821206 606814 755136 859128 835914 565739 598837
11038 598837 874486 774401 664916 821404 500428 1003274 533425 675231 671903 659306
11028 659306 730170 724776 583234 806871 709134 589548 557491 791928 862602 523385 838905
11017 838905 569275 629290 405427 633121 414949 420891 548943 666389 361582 313801
11007 313801 719652 523977 581396 516593 808309 343433 615857 527329 672069 646672
10997 646672 561912 594220 872512 722411 740566 860286 746255 861338 987762 671394
10987 671394 771537 1146482 1000886 949639 1070863 962981 874303 1286674 1364656 1489600
10977 1489600 1567036 1678302 2307522 2424523 3101746 2659955 2952821 3169822 3483349 3167719
10967C167719N05904r56080k29173k94057l54665l08274M66309n46994J12563
10958A563252k85900K4057j04019j82143r7492q6889n7230m6748C43808N6656
10948D00464P3657j62350L3846j45768K51120A53367j279L56121c511C15331A9101
10936B06277M7080b1244C26085b52810D28732j93501j00545c60413a21253A1955
10925A92488h3962j02405A15369g2811A14044J01707F8021g3212B48858K7405
10915B76263g6058D8566J87672b42028h8134j17794H3981J58219m8086A367L23607
10904C24974A13204a66299O573B6729E555a91696g9328r4597j23423A52350a86424
10892h83k4507A61000i2582A42246K12339b18776c8541j66072B7880J47376k8615
$$ plain form
10967 3167719 3673623 2717543 2488370 2194313 1839648 1531374 1997683 1450689 1563252
10958 1563252 1277352 1301409 1197390 1015247 917755 830866 773636 726888 343808 400464
10948 400464 474121 311771 345617 199849 450969 153367 152088 508209 -3511 315331 19101
10936 206277 253357 -21244 326085 -252810 428732 235231 134686 -360413 -121253 11955
10925 192488 -83962 -186367 115369 -72811 114044 215751 68021 -73212 248858 276263
10915 276263 -76058 48566 236238 -242028 -88134 -205928 83981 242200 194114 1367 324974
10904 324974 113204 -166299 -159726 26729 5555 -191696 -79328 -173925 -297348 152350 -186424
10892 -883 -25390 161000 -92582 142246 354585 -218776 -38541 -204613 27880 175256 146641
10881A46641b92j86267k819K2316M1752C2056c3876G7495J96650f6301j66989
10870b33290e8086b3002D6614b23134I559h4981H925b9954H5676a51770E2340
10858F6180h221B26231a27735G897J4679b44042A09794Q0988B4114J48595o8017
10847A04692K9229M7777f1467E8312Q259N7154J54068m6314a72786I5752d599
10835e259l4560o8087H2758e2197F5652a02792A24191a23095l9160A31824m4873
10824H6951b17159C3281M3635e8836j68870H5730b48442o1116j11424e2581B39833
10812b56729c7520A0009b8847m4470k91145A36525a70949C2647d54011a3925n6294
10801g0219B95995E7742b67021c0220l5384j42847A63256a62698m3441M0661A610
$$ plain form
10881 146641 -292 -186559 -189378 -167062 -125310 32056 -33876 77495 274145 -66301 -233290
10870 -233290 -58086 -23002 46614 -223134 9559 -84981 8925 -29954 85676 -151770 52340
10858 66180 -8221 226231 -127735 7897 22576 -244042 109794 190782 24114 172709 104692
10847 104692 133921 181698 -61467 58312 66571 123725 277793 231479 -172786 95752 -4599
10835 -5259 -39819 -107906 82758 -52197 65652 -102792 124191 -123095 -162255 131824 86951
10824 86951 -217159 33281 76916 -58836 -227706 85730 -248442 -309558 -420982 -52581 239833
10812 -256729 -37520 10009 -28847 -73317 -364462 136525 -170949 32647 -454011 -13925 -70219
10801 -70219 295995 57742 -267021 -30220 -65604 -208451 163256 -162698 -206139 -165478 1610
10789A25721B7700a14268A48791a2423A56795B7456N4879m245K6750k0421a15840
10777C66058b34667n4649F8604L0846a58225k2712g3699B27204d6513A20786D153
10765b82659a19056q8094E3210d4045k740C243O3166b89780A00464J09286a35306
10753b84207f8158a171j02848H3668e29723a23475d3157C3478q604L18752C6818
10741b03575A24410d43090d1681j14630D7086j8495P7523d8987m8887J8195B72497
10729A25339c29357a08566E7802b15042M8632b1923j47367J7460a0565q4214M5724
10718d9055m4911j07165A09916h3896B20921C8217K04582E1173a6134A78790H1672
10706c11741a42800k16442d8528r4037a2896k0641A08743k1216c13083J10833
$$ plain form
10789 125721 27700 -114268 148791 -12423 156795 27456 82335 78090 104840 84419 -115840
10777 366058 -234667 -289316 68604 99450 -158225 -180937 -73699 227204 -46513 120786 4153
10765 -282659 -119056 -207150 53210 -44045 -46785 3243 66409 -289780 100464 209750 -135306
10753 -284207 -68158 -1171 -104019 83668 -529723 -123475 -43157 33478 24874 343626 36818
10741 -203575 124410 -443090 -41681 -156311 47086 28591 106114 -48987 -97874 -79679 272497
10729 125339 -329357 -108566 57802 -215042 -166410 -21923 -169290 -151830 -10565 -94779 -49055
10718 -49055 -93966 -201131 109916 -83896 220921 38217 242799 51173 -16134 178790 81672
10706 -311741 -142800 -359242 -48528 -142565 -12896 -33537 108743 87527 -313083 -202250
10696b02250H1115J06411b00087P4454H1661b6801A8014M5678i1914C7537d2649
10684A30069b12505K3145q4259c4547F3484c29716a02845d5245b408E7882a35348
10672B34448C9044a37013c506l56271A21098d3968a4230j55340G6568M4515a46896
10660b76580C33143a44470n4433e2938l6753A8740J66720i9267B12459a53308
10649A88832D2748i7238j43851A3254j082a14152A08094e639B1747Q3228C1553
10637b775B1704M3568d18335f4176j9546k4823H8425c2630E65b19914h9539A77855
10624a7604k26702A15594d9074B27965I7589a78093A61138R952o6237b03052j11450
10613c14502A22114M059a8120k68065i7064J4021G2184a55291j3927e5394r3479
$$ plain form
10696 -202250 81115 187526 -200087 -125633 81661 -26801 18014 63692 -91914 37537 -42649
10684 130069 -212505 -189360 -273619 -34547 63484 -329716 -102845 -45245 -2408 57882 -135348
10672 234448 39044 -137013 -3506 -359777 121098 -43968 -14230 -169570 76568 121083 -146896
10660 -276580 333143 -144470 -198903 -52938 -89691 18740 185460 -99267 212459 -153308
10649 188832 42748 -97238 -241089 13254 12172 -114152 108094 -5639 21747 104975 31553
10637 -2775 21704 65272 -418335 -64176 -83722 -108545 88425 -32630 565 -219914 -89539 177855
10624 -17604 -244306 115594 -49074 227965 97589 -178093 161138 171090 104853 -203052 -314502
10613 -314502 122114 126173 -18120 -286185 -97064 -83043 72184 -155291 -169218 -55394 -148873
10602a48873m3854D9482b40059a10978A7737c25830r4160J55842e4155k44001
10592b98156k318I7912a85864A06474c23564C15769a12638H0453J904d95880a63023
10580b57562j09362a18665j25188a12272A5801i0510r3950C24017a61381P5427
10570h5954c7443k2038I9004c6974r0905a5708j75789j4812A96620J47530b34818
10558h5632j1930j66179K2809A51412L2488B8643J82042b62237b5721C14988i0701
10546A49106M9272c4704j03367F183J3356d8668l09136g8669A45925C7632c07273
10534g8210A9470c45040i1462l6096B57624a00728A43374o5769g7409q9629A9415
10522a94926B27817a5884A45432a64137D1169M2210d4022l03975b9905C7184d1389
$$ plain form
10602 -148873 -192727 49482 -240059 -110978 17737 -325830 -419990 -264148 -54155 -298156
10592 -298156 -300474 97912 -185864 106474 -323564 315769 -112638 80453 82357 -495880 -163023
10580 -257562 -366924 -118665 -243853 -112272 15801 -90510 -184460 324017 -161381 -85954
10570 -85954 -37443 -59481 99004 -36974 -127879 -15708 -191497 -206309 196620 344150 -234818
10558 -85632 -97562 -263741 -240932 151412 183900 28643 210685 -262237 -25721 314988 -90701
10546 149106 198378 -34704 -138071 6183 19539 -48668 -357804 -78669 145925 37632 -307273
10534 -78210 19470 -345040 -91462 -127558 257624 -100728 143374 77605 -77409 -167038 19415
10522 -194926 227817 -15884 145432 -164137 41169 83379 -44022 -347997 -29905 37184 -41389
10510B56960d8054A16639b13106E8743a68917C55396A12261J02060J6218f9081
10499B41298H6331a19183c3573r454F4022J74401A6594K8480N1432l4785J34141
10488A95862c3967n4677A2103J92855d6151A86640n8905E7L46116o8291A34446
10476A72408a01466c1761j50127A61560b23891O8081K0470e7479j86676M7020
10466a97135A27561n8524l726a72827B28273B6889a4988q4452C5782a7127l31412
10455c48539A60543a97085D3276J32271n9475d0298j4541n5121c3279B09975r8648
10444A11327M6737a49736E3202j5573a47005k44636A77020B2446b1926C41742
10433c50407a10285I9077K68356a04284F4483N4730a44024D8015m165a44557q379
$$ plain form
10510 256960 -48054 116639 -213106 58743 -168917 355396 112261 214321 230539 -69081
10499 241298 86331 -119183 -33573 -43027 64022 238423 16594 45074 96506 61721 195862
10488 195862 -33967 -88644 12103 204958 -46151 186640 127735 57 346173 277882 134446
10476 172408 -101466 -31761 -181888 161560 -223891 -155810 -135340 -57479 -244155 -197135
10466 -197135 127561 69037 65311 -172827 228273 26889 -14988 -99440 35782 -17127 -348539
10455 -348539 160543 -197085 43276 175547 116072 -40298 -54839 -109960 -33279 209975 111327
10444 111327 158064 -149736 53202 37629 -147005 -391641 177020 22446 -21926 341742
10433 -350407 -110285 99077 367433 -104284 64483 119213 -144024 48015 43850 -144557 -152936
10422a52936B78710A12567a36608C13760j5819g8608A10706m8292e4719C9579
10411c42638a4151D3407K2257A792K4699b11736j87513J69225C43167c0946j64802
10400a95748B18316d8848k01731k3754C32693d4511C33328a62646B72264k7799
10390B44465D1797J7804L32845j88136a5762B41266m7279Q2926d3205p6669B73717
10378A04660b3221C03814l485D8956H368K65137K23242r6312K15011B10181F8145
10366c0903G35945A78545k4225M03801k15141N0777H4550J45660M193d3476B72845
10354E7885N55324B63891L03516j1963j62751K52144j52177k36725J33540H3197
10343C23177K17730A56390D1245O8845J35346a0361B30358j00061m2901K45443
$$ plain form
10422 -152936 278710 112567 -136608 313760 297941 -78608 110706 62414 -54719 39579
10411 -342638 -14151 43407 65664 1792 26491 -211736 -399249 -230024 343167 -30946 -195748
10400 -195748 218316 -48848 -250579 -274333 332693 -44511 333328 -162646 272264 244465
10390 244465 41797 59601 392446 204310 -15762 241266 193987 276913 -43205 -119874 273717
10378 104660 -23221 303814 300329 48956 8368 273505 496747 400435 615446 210181 68145
10366 -30903 735945 178545 154320 558121 342980 393757 84550 230210 234403 -43476 272845
10354 57885 613209 263891 567407 555444 392693 644837 492660 255935 389475 83197
10343 323177 540907 156390 41245 110090 245436 -10361 230358 130297 87396 332839
10333C32839c9345C09091a97307B12378o060k6616n2124K29377a0037D6771K99683
10322C46454n993R8892A13866J39834A25101A6516e1517A75144J9768d743l67082
10311c71825B70494a54596b6568j42545a8194l7487B8609J31731j2858k5977a97005
10299a23663C35271I098L73972G6604b0971H3530C4598a91277b969C1880a36384
10287a62357G7627b01885l0251a4204m4983F9450R9423b81199N9360C6756a10542
10275a63247k23684C6299g0745j44671d3472H2967e49822A91309b13049B64460
10264b8991j25871a9143B54150J41248A73627N3230J14826G6061L96456F4763
10253A29861R2707A6937e4908A59112a29566A05683M3235f8684D5413L14748A4222
$$ plain form
10333 332839 -39345 309091 -197307 212378 206318 179702 127578 356955 -10037 46771 346454
10322 346454 340461 439353 113866 253700 125101 16516 -51517 175144 194912 -4743 -371825
10311 -371825 270494 -154596 -26568 -169113 -18194 -55681 28609 160340 147482 121505 -197005
10299 -123663 335271 9098 383070 76604 -20971 83530 34598 -191277 -2969 31880 -136384
10287 -162357 77627 -201885 -232136 -14204 -59187 69450 168873 -281199 -221839 36756 -110542
10275 -163247 -386931 36299 -70745 -215416 -43472 82967 -549822 191309 -213049 264460
10264 -28991 -154862 -19143 254150 395398 173627 226857 341683 76061 472517 64763
10253 129861 222568 16937 -54908 159112 -129566 105683 148918 -68684 45413 360161 14222
10241A53181a12962m7131b8251l18072E4057a10893q7699K3034j02516g0477B38661
10229A29122e4275B40636A367h4089G5156c8913o1896L7471H3281K48859F4022
10217a3539j70486m09413b65128h8083K9473A8776b97562B36253D0384R561h0272
10205D4032a66448o5928M0660K7779F085a2174k13407A49471a40909M2845j85646
10194b83710a22273p8615A79019e3477m29877i6796q9108h6372D72859A10647
10183a24187F6757a26005A64082a73435B71650d604j5909k70870a5796j44386
10173a60182j33896a16017k3415B7238b06865P2156A12353c09938D1064G302J56829
10162A64131a57883B26415K2908b94346i161p0128c5059i618H6688f7807C99797
$$ plain form
10241 153181 -112962 -160093 -28251 -346323 54057 -110893 -198592 -175558 -278074 -70477 238661
10229 129122 -54275 240636 1367 -84089 75156 -38913 -100809 -63338 83281 332140 64022
10217 -13539 -184025 -593438 -265128 -88083 -58610 18776 -297562 236253 40384 49945 -80272
10205 44032 -166448 -232376 -191716 -163937 6085 -12174 -225581 149471 -140909 -98064 -283710
10194 -283710 -122273 -200888 179019 -53477 -483354 -96796 -185904 -86372 472859 110647
10183 -124187 66757 -126005 164082 -173435 271650 -4604 -20513 -291383 -15796 -160182
10173 -160182 -294078 -116017 -139432 27238 -206865 -134709 112353 -309938 41064 7302 164131
10162 164131 -157883 226415 249323 -294346 -9161 -79289 -35059 -9618 86688 -67807 399797
10150b2858F8755A848L8529d9951B05268a10027j95050E9205J27980m8830b79929
10138F8165c63930J06397e9454m6486B47025a32095p0417m2973k34846G6818a85569
10126b54592O4363d9408F2247a11568P157D5756O0602a93229A97488J10952n8333
10115B50107a89323A08465i628l4858q3483A27641b86777f6804L2291n4699G8232
10103g9053B42741b88358L1976B80160b7521C27628j20606d3272L251j5474k87363
10092c42858e7437F5214a51059b1533D8639a42346k32988a07549E4045a69090
10081A2942J0971J15025m6443C2854a48461q2544A9970d1574o1289r4639d4027
10069a77276j6712A39983j4759n193a8042k36261c1612q7883c0833j21986P3658
$$ plain form
10150 -22858 68755 1848 40377 -49951 205268 -110027 -305077 59205 187185 138355 -279929
10138 68165 -363930 -257533 -59454 -105940 247025 -132095 -202512 -245485 -480331 76818 -185569
10126 -254592 -190229 -49408 62247 -111568 -104411 45756 106358 -193229 197488 308440 250107
10115 250107 -189323 108465 -9628 -44486 -127969 127641 -286777 -66804 -34513 -89212 78232
10103 -79053 242741 -288358 -256382 280160 -27521 327628 207022 -43272 -40021 -55495 -342858
10092 -342858 -57437 65214 -151059 -21533 48639 -142346 -375334 -107549 54045 -169090
10081 12942 23913 138938 92495 32854 -148461 -231005 19970 -41574 -102863 -197502 -44027
10069 -177276 -193988 139983 125224 120031 -18042 -254303 -31612 -119495 -30833 -152819 -79161
10058g9161j85672a25262k47936a45368b8656l55310I4844D0539b70488A79260
10047c07978i210n91023A69897D565a68284k17241a42906J0032m1447N4141J1971
10036a08209B0192a72976E9820a88154k80692a40739N9945A01358h8904k23702
10026c12606b1298A00355b688C4554b65312k083A67135O5272a93737l1520R0338
10015a34919l4425I6234b01361p3331A16783b93232e9933A00657d7108j37454
10005a84562M0638k55805a5265B58121c22721A90135C3671R6849a79292A65405
9994A52320d50841a2746o5617j73463O8062M3985B1558N0038Q0603g1701j06824
9983a78525H2156A9905f3063a1753j17274I3735i6673B2572b35163n6246A3020
$$ plain form
10058 -79161 -264833 -125262 -373198 -145368 -28656 -383966 94844 40539 -270488 179260
10047 -307978 -9210 -600233 169897 4565 -168284 -385525 -142906 -132874 -174321 -120180 -108209
10036 -108209 20192 -172976 59820 -188154 -468846 -140739 -80794 101358 -88904 -312606
10026 -312606 -21298 100355 -2688 34554 -265312 -267395 167135 232407 -193737 -225257 -134919
10015 -134919 -169344 96234 -201361 -274692 116783 -293232 -59933 100657 -47108 -184562
10005 -184562 -143924 -399729 -15265 258121 -322721 190135 33671 130520 -179292 165405
9994 152320 -450841 -12746 -78363 -251826 -183764 -139779 21558 71596 152199 -71701 -178525
9983 -178525 82156 19905 -63063 -11753 -129027 93735 -96673 22572 -235163 -291409 13020
9971I3678N6752a59480I1703b51622E66826A22015a70127B7918a03185A840J93870
9960A95710b33075p0117A37308b66349b1590j00151N3059j01730f8114A05835
9949a65805A89587b26083C8485c0724j16957K9366p6324a7236l294k60598B33820
9937a59142P2671j59225J01290M4663E5113h8044j19638B36275c43025k2052a43107
9925A07965a519A79509D415a90803n4066h6316F2769b2329j45415E7978c22714
9913B45368p7110b58703Q1080J7951c7623F9927c701k07194r2163J38826j00145
9902b64377B71219C3022M2176J28929o3968o2709J0959a17428j3320k60177a23906
9890A85809J0811c43806E1062K4328b46418C7304K84943a58197l43494b06023
$$ plain form
9971 93678 150430 -159480 91703 -251622 566826 122015 -170127 27918 -103185 1840 195710
9960 195710 -233075 -303192 137308 -266349 -21590 -121741 -68682 -170412 -68114 105835
9949 -165805 189587 -226083 38485 -30724 -147681 -118315 -194639 -17236 -20530 -281128 233820
9937 -159142 -86471 -245696 -144406 -99743 55113 -88044 -207682 236275 -343025 -365077 -143107
9925 107965 -1519 179509 4415 -190803 -244869 -86316 62769 -22329 -167744 57978 -322714
9913 245368 168258 -258703 -177623 -159672 -37623 69927 -3701 -210895 -303058 -164232 -264377
9902 -264377 271219 33022 75198 204127 140159 77450 88409 -117428 -130748 -390925 -123906
9890 185809 196620 -343806 51062 75390 -246418 37304 322247 -158197 -501691 -206023
9879A42241h5072b9622q3523J5550c3291C9234b6291H6399J15072r9972b2703
9867b62042L6586a5271j11521H4661d4522I7254m478h4549A59194a59178A06452
9855b1590A30745C240O4072c89163a78819N4071c0655j83920J8081l2353R3984
9844a34863O0867B444a4723j57474j435g8708m0741k07804E0133K326J9024A6094
9831A65387J6735h5127J4107n3988j6681l8856r601A40685e4267C1035a38980
9819A82580J2423L4960m8683b19981M6778g2828b1271A38335g4320r1361j58703
9808c24384a25965j05426a05370B86616g2850a6266j77329j76690A54800a635
9797a05009k00326a6262k50908m6533a42831M8481I6430b13055a6384q7866r4016
$$ plain form
9879 142241 -85072 -29622 -113145 -97595 -33291 39234 -26291 86399 201471 101499 -22703
9867 -262042 -225456 -15271 -126792 84661 -44522 97254 92776 -84549 159194 -159178 106452
9855 -21590 130745 3240 67312 -389163 -178819 -124748 -30655 -214575 -196494 -228847 -134863
9844 -134863 -73996 2444 -14723 -172197 -173632 -78708 -119449 -327253 50133 52459 71483 16094
9831 165387 182122 -85127 -71020 -125008 -141689 -180545 -190146 140685 -54267 31035 -138980
9819 182580 195003 229963 181280 -219981 -173203 -72828 -21271 138335 -74320 -165681 -324384
9808 -324384 -125965 -231391 -105370 286616 -72850 -16266 -193595 -370285 154800 -1635
9797 -105009 -305335 -16262 -267170 -313703 -142831 -94350 96430 -213055 -16384 -104250 -198266
9786a98266m282N2121D4336f6718F3547b59189a7961j4126k7127A25037i8283
9774a19112D2851b27872B28109a15496m6784F2875i5002a9951C3691J68167n5468
9763A46390k3344a26567b5808E335R076a76523O813D2614k0726a75228L6251d1429
9750d0923o058B13124a36176A75431e5944o3300M8618I7471a16075L9727L7992
9739c8356j61596i4386A2525a00561j70636e4899d554B4656e5010A10044J04758
9728B14802c6816C71391A51159h0046A42757a02770c17H8868P7731g7057b4036
9716A75125a2255p2375B93370A41967c13383A02119a90022M5457m6388d4928F3684
9704h6103A03628b72331b3885D853c9526j55583f6677j46220a6025l62353q4693
$$ plain form
9786 -198266 -202548 -150427 44336 -66718 63547 -259189 -17961 -32087 -59214 125037 -98283
9774 -119112 42851 -227872 228109 -115496 -162280 62875 -95002 -19951 33691 201858 146390
9763 146390 123046 -126567 -25808 5335 14411 -176523 -169710 42614 21888 -175228 -138977 -41429
9750 -40923 -46981 213124 -136176 175431 -55944 -119244 -70626 97471 -116075 -76348 -38356
9739 -38356 -199952 -94386 12525 -100561 -271197 -54899 -4554 24656 -55010 110044 214802
9728 214802 -36816 371391 151159 -80046 142757 -102770 -317 88868 166599 -77057 -24036
9716 175125 -12255 -84630 293370 141967 -313383 102119 -190022 -144565 -190953 -44928 63684
9704 -86103 103628 -272331 -23885 4853 -39526 -195109 -66677 -212897 -16025 -378378 -463071
9693d63071J30809a16473B50636G2531c7354A48903o7053c95950B2895K07L0848
9682E3950c60210a78743P2246j83320b3177A81295c9687I5321h1355j82163N1697
9671b11821d2098k03780g3975r8119A77419F1356b51682a5741j75857c7249B59494
9659e06527B10844g1494F508c11894d1675k14992F6560a11904A38481A4515g2282
9647A62085b02443o02p284P394F4216a93108a6675j7513p9979k23774A81385b92155
9634A23088e533j01693n4201a4275k58110a3712r3179A10601N1700F999M5422
9623E2421A9967b73107j27351J91905A44965b46862A05186b05084B9141J94366
9613B23507c16985e4239k23501a6086H3504J36113b21834A54074i8035B49928
$$ plain form
9693 -463071 -332262 -116473 250636 72531 -37354 148903 81850 -395950 22895 23102 53950
9682 53950 -360210 -178743 -106497 -289817 -23177 181295 -39687 95321 -81355 -263518 -211821
9671 -211821 -42098 -245878 -73975 -172094 177419 61356 -251682 -15741 -191598 -37249 259494
9659 -506527 210844 -71494 6508 -311894 -41675 -256667 66560 -111904 138481 14515 -72282
9647 162085 -202443 -203045 -210329 -202935 64216 -193108 -16675 -34188 -114167 -337941 181385 -292155
9634 123088 -5533 -107226 -161427 -14275 -272385 -13712 -106891 110601 162301 6999 52421
9623 52421 19967 -273107 -400458 -208553 144965 -246862 105186 -205084 29141 223507
9613 223507 -316985 -54239 -277740 -16086 83504 219617 -221834 154074 -98035 249928
9602A90075q1037a0310G8913c0641G9742d8961r5518a7940A40488M9791J34760
9591C25039a31036B05822f911m26005h5820l42220I2181c6464k58964p2305a0647
9579B02561a40708g394A04246K17502B4627O3823a58266O1049A09935B1432K0351
9568D1783b4846C5712j4522K2774b55312E6970c3972j7826D0784f8451f792k5976
9556c2768m58473a42769j8429d0334k70013C07302b46280A08692a95315g2669
9545A3911d65236E0380B1488b69259f9715k601k48002D1402b73004J2940G554
9533i6109F9471J3806Q9528c9487j58163f5877j95373m1385A09498E0443K60944
9522C11387B2724a68086A69019f2198k56151J38509Q1309m2258B18876a73698
$$ plain form
9602 190075 109038 -10310 78913 -30641 79742 -48961 -144479 -17940 140488 190279 325039
9591 325039 -131036 205822 -6911 -432916 -85820 -428040 92181 -36464 -295428 -367733 -10647
9579 202561 -140708 -7394 104246 321748 24627 88450 -158266 -97217 109935 21432 41783
9568 41783 -24846 35712 21190 43964 -255312 56970 -33972 -51798 40784 -68451 -6792 -32768
9556 -32768 -491241 -142769 -161198 -40334 -310347 307302 -246280 108692 -195315 -72669
9545 13911 -465236 50380 21488 -269259 -69715 -72316 -320318 41402 -273004 -260064 7554
9533 -96109 69471 83277 172805 -39487 -197650 -65877 -261250 -302635 109498 50443 311387
9522 311387 22724 -168086 169019 -62198 -318349 -179840 -98531 -140789 218876 -173698
9511A27615N9356c5667k10241B8747K18583C1842e5541m8990k33164F6310b13154
9499h0483p4163d9914j46113K0925a3919D9342a21277N7962A42130n4923p293
9488G9914i7617m8611P1944l50748d9423C6184B109b0347B01138I932K28264i0802
9475A74395d2170a7933l3134M830k33443j3341E094J04880N7413b91293A31540
9463d1842A00531L4550B85J044a30990A47781b5401n1888n3032J8096A23109a11515
9450a46975J4739A76504a18174r2032p8835i9095I9125b85358b5180j07616j97844
9439c30640A53986f261r3939j54968j72376I8198i6648o7270D2750c34829d0002
9427b35908B7235c64758a27814B9587a7048k7212o3849c0212j6527A29115J16825
$$ plain form
9511 127615 186971 -35667 -245908 28747 247330 31842 -55541 -104531 -337695 66310 -213154
9499 -80483 -154646 -49914 -196027 -175102 -13919 49342 -121277 -63315 142130 87207 79914
9488 79914 -97617 -146228 -74284 -425032 -49423 36184 2109 -20347 201138 9932 238196 -90802
9475 174395 -42170 -17933 -51067 -46237 -279680 -293021 5094 109974 167387 -291293 131540
9463 -41842 100531 135081 285 1329 -130990 147781 -25401 -77289 -130321 -112225 123109 -111515
9450 -146975 -132236 176504 -118174 -210206 -289041 -99095 99125 -285358 -25180 -132796 -330640
9439 -330640 153986 -6261 -100200 -255168 -427544 98198 -96648 -163918 42750 -334829 -40002
9427 -235908 27235 -364758 -127814 29587 -17048 -44260 -108109 -30212 -46739 129115 245940
9416B45940f3859j42191d2362G6610c4106J1275A07625K16068a50179l1892I2358
9404C03050b38067Q1247j76414G1267K02728a46213M0550g27A89045D2923M6453
9393H9376b99185c9450j48655P7911I9452d5792j76678j37775B117a79084N5438
9382a23646A06803b00984f7902a281k5112m9715E7627K16060b8684H4168j477
9371H2691a4321A94278b03847h6006k36418D31804b27966H8119a24216B54583
9360b49643M0199r6689a43313O5071j40947j61241A87243C3444b4826F8139d72650
9348d15939J67829g6865A17918i9898J7052p2018C3617K0346b2919j19167L1737
9337a10349A5663P9806d166r6840B5665a65924D4180E457a43974o289n0788N6894
$$ plain form
9416 245940 -63859 -206050 -42362 76610 -34106 -22831 107625 323693 -150179 -182071 92358
9404 303050 -238067 -156820 -333234 71267 273995 -146213 -105663 -727 189045 42923 89376
9393 89376 -299185 -39450 -188105 -110194 99452 -45792 -222470 -360245 2117 -179084 -123646
9382 -123646 106803 -200984 -67902 -1281 -26393 -76108 57627 273687 -28684 84168 82691
9371 82691 -14321 194278 -203847 -86006 -322424 431804 -227966 88119 -124216 254583
9360 -249643 -209444 -306133 -143313 -78242 -219189 -380430 187243 33444 -24826 68139 -472650
9348 -415939 -248110 -76865 117918 -99898 -82846 -154864 33617 53963 -22919 -142086 -110349
9337 -110349 15663 95469 -4166 -101006 25665 -165924 44180 5457 -143974 -150263 -201051 -144157
9325a44157N7889E6704j228b00805F4635a93841n0141Q3367n8777C89448I4610
9313a03649A16415J4945b1854k58474b806l76830i5419D0498b2523j77753F7972
9301a10806E6070L01157F20b5471A22398a55489j50843r8594G3708P2347i0390
9289a44751B42158a91681A46451L44297c4718C2651b90803a10259B5184a37175
9278A12790a13860k4424L8243K8921j40691d0039C6775a44533c1509j73986B44460
9266A73624d0281p2542d0568n1426C73191i2103a0443l9172D9608a34611a4447
9254I4094l738a12426j5292l7524a5892j61180p6637g3735q6252a9082j21244
9243a40326j00763a07070B01071G4020a26171j01343A05284a10844B3336b88206
$$ plain form
9325 -144157 -86268 56704 55476 -200805 64635 -193841 -243982 -160615 -219392 389448 94610
9313 -103649 116415 131360 -21854 -280328 -2806 -379636 -95419 40498 -22523 -200276 67972
9301 -110806 56070 357227 620 -25471 122398 -155489 -306332 -404926 73708 146055 -90390
9289 -144751 242158 -191681 146451 490748 -34718 32651 -290803 -110259 25184 -137175
9278 112790 -113860 -138284 -100041 -71120 -211811 -40039 36775 -144533 -31509 -205495 244460
9266 173624 -40281 -112823 -40568 -91994 373191 -92103 -10443 -49615 49608 -134611 -14447
9254 94094 90356 -112426 -127718 -165242 -15892 -177072 -253709 -73735 -159987 -19082 -140326
9243 -140326 -241089 -107070 201071 74020 -126171 -227514 105284 -110844 23336 -288206
9232a31053a1710l7648r763k42643C0931J07934a12474B73954c57356B12910b6966
9220d87183C0653P432a85480Q7897j68925D7466a35477A36686e1814p8858o600
9209a37272O5515D0576b61611d083p1210Q657k2278B46714A01626c44327g4676
9197B16561g6741J8579r3233A75049a5178j91484B89019a36963j87455a6206C1914
9185c256A11403a07971B4938d28810B73929n6776J04463a21781j54817F6337a74884
9173a3506q6711j98701J05328H2847i9899C59253q761a07517M1213q0446d5768
9161a89889b0291k00923I4322h4086K6981A88415b01512A68640N0163e1803A42017
9149a87743K8332j61435J28846i1997r8656m3858N4441d849D1103a85783d8940
$$ plain form
9232 -131053 -11710 -49358 -59121 -301764 30931 138865 -112474 273954 -357356 212910 -26966
9220 -487183 30653 38085 -185480 -97583 -266508 47466 -135477 136686 -51814 -130672 -137272
9209 -137272 -71757 40576 -261611 -4083 -75293 -66636 -88914 246714 101626 -344327 -74676
9197 216561 -76741 -58162 -151395 175049 -15178 -206662 289019 -136963 -324418 -16206 31914
9185 -3256 111403 -107971 24938 -428810 273929 217153 321616 -121781 -276598 66337 -174884
9173 -13506 -100217 -298918 -193590 82847 -99899 359253 350492 -107517 -66304 -146750 -45768
9161 -189889 -20291 -221214 94322 -84086 -57105 188415 -201512 168640 218803 -51803 142017
9149 -187743 -159411 -320846 -192000 -91997 -190653 -234511 -180070 -4849 41103 -185783 -48940
9137B91806p8424E8079b441r038n3295A5194a60467N6042j54380F1227J61371
9126B22598b42223m04136A20180a95422A26731J1606a2415K841A27335a71021
9115I088a8978k8312k08307P9866B8587G017c7704j36090l1111g5991o3243G5754
9102c26353l5989a52897A14239g8592K2194l72423K05352B2250Q9867a99421A033
9090C41207a15825A39072a22211J0191M5456C3263J37226h0758A1228K2224n572
9079B7880h0869p9955K7095O4576A35460q536B3072J15004b58308A2238b47567
9067c44082H2231c42653M7708d1706j7711K5736J1190D83167a29223b6464D0775
9055d0904j04517h908l29850a12707M6720m59553c6969E4006g2829k23876O7513
$$ plain form
9137 291806 213382 58079 -2441 -11479 -64774 15194 -160467 -104425 -258805 61227 222598
9126 222598 -242223 -646359 120180 -195422 126731 138337 -12415 -9574 127335 -171021
9115 9088 -18978 -47290 -255597 -175731 28587 7017 -37704 -173794 -204905 -75991 -139234 75754
9102 -326353 -362342 -152897 114239 -78592 -56398 -428821 -223469 22250 112117 -199421 1033
9090 341207 -115825 139072 -122211 -112020 -66564 33263 170489 -80758 11228 33452 27880
9079 27880 -80869 -160824 -133729 -69153 135460 126924 23072 138076 -258308 12238 -247567
9067 -344082 82231 -342653 -294945 -41706 -59417 -33681 -22491 483167 -129223 -26464 40775
9055 -40904 -145421 -8908 -338758 -112707 -65987 -525540 -36969 54006 -72829 -296705 -229192
9044b29192l91768H6188J45443b3979m4067F4012i6067A24996b13882a6487k69846
9033b86333g9467k2919j49761A24233B6905H662J61488d8226C135J3469a78426
9021C7819a47631k04501B54560i6085J0124j04478R4830k64775P6063a32708c3432
9009A45046d88733I7938Q4046p8274b85149B8172c10280h1614j50983j18747a00275
8997B2518c6654m6477E996J65878D3767a8781r6150D21806c88827A56695h9460
8985A24754n1327C4226c25252a24646K0084A2968d3080n083j06877A92245i6767
8973a64605B4208a57491b4384k77037A91074D7646a97907i2774j6994d2043C6809
8961a92483d1017m6584b1486J577C5561J37770d8084q5857A51330a60008G7956
$$ plain form
9044 -229192 -620960 86188 231631 -23979 -68046 64012 -96067 124996 -213882 -16487 -286333
9033 -286333 -79467 -102386 -252147 124233 26905 8662 170150 -48226 3135 16604 -178426
9021 37819 -147631 -352132 254560 -96085 -85961 -190439 -95609 -360384 -284321 -132708 -33432
9009 145046 -488733 97938 181984 103710 -285149 28172 -310280 -81614 -232597 -351344 -100275
8997 22518 -36654 -83131 5996 171874 43767 -18781 -114931 421806 -388827 156695 -89460
8985 124754 73427 34226 -325252 -124646 -104562 12968 -43080 -48163 -155040 192245 -96767
8973 -164605 24208 -157491 -24384 -301421 191074 47646 -197907 -92774 -109768 -42043 36809
8961 -192483 -41017 -87601 -21486 -19909 35561 173331 -48084 -133941 151330 -160008 77956
8949h8608l8728C09342A42991b89368o4777a13080o5011C98845A49367a37052
8938D7757a08122K5327L7898D42054E0742a07822B80999c15535k9359A21759J21247
8927B43006n0682M79191N24255J835881N200968Q136457j764731B321808I75405
8917E15622B31370n5677K75360a4612F1199d8981B16427a76454C88186R4393a90332
8905H5877c54675C20489j27575H6436A5450b26533A0999c72095A83082c55693
8894A21979a18268A61315l7025K72916C2033O5974J12674A4823N9538e2742k8752
8883h1494A43021a67469C9260a13073A4560g5304C51776a6328j41663A50864L2736
$$ plain form
8949 -88608 -127336 309342 142991 -289368 -354145 -113080 -178091 398845 149367 -137052
8938 47757 -108122 -82795 -44897 442054 50742 -107822 280999 -315535 -344894 121759 243006
8927 243006 192324 671515 1195770 3031651 8232619 16369076 14604345 2321808 975405
8917 515622 231370 175693 451053 -14612 61199 -48981 216427 -176454 388186 482579 -190332
8905 85877 -354675 320489 192914 86436 15450 -226533 10999 -372095 183082 -355693
8894 121979 -118268 161315 124290 397206 32033 98007 210681 14823 74361 -52742 -81494
8883 -81494 143021 -167469 39260 -113073 14560 -75304 351776 -16328 -157991 150864 183600
$$ [...]
##END NTUPLES=NMR SPECTRUM
##END=
