##TITLE=AC1510_ROEFFECT0001_8201620_6AwAUtwhzF
##JCAMPDX= 6.0         $$ Bruker NMR JCAMP-DX V2.0
##DATA TYPE= NMR SPECTRUM
##DATA CLASS= NTUPLES
##ORIGIN= BRUKER
##OWNER= Administrator
$$ 1.72 TOPSPIN		Version 2.1
$$ 2013-09-26 17:54:14.568 -0700  Administrator@X
$$ Compression mode = diff/dup
##.OBSERVE FREQUENCY= 400.02188249412
##.OBSERVE NUCLEUS= ^1H
##.ACQUISITION MODE= SIMULTANEOUS (DQD)
##.ACQUISITION SCHEME= undefined
##.AVERAGES= 64
##.DIGITISER RES= 22
##SPECTROMETER/DATA SYSTEM= spect
##.PULSE SEQUENCE= noesygpps1d.comp
##.SOLVENT NAME= COFFEE_meoh
##.SHIFT REFERENCE= INTERNAL, COFFEE_meoh, 1, 14.96081
##AUDIT TRAIL= $$ (NUMBER, WHEN, WHO, WHERE, PROCESS, VERSION, WHAT)
$$ ##TITLE= Audit trail, TOPSPIN		Version 2.1
$$ ##JCAMPDX= 5.01
$$ ##ORIGIN= Bruker BioSpin GmbH
$$ ##OWNER= Administrator
$$ $$ E:\/data/COFFEE/nmr/AC1510_ROEFFECT0001_8201620_6AwAUtwhzF/22/pdata/1/auditp.txt
$$ ##AUDIT TRAIL=  $$ (NUMBER, WHEN, WHO, WHERE, PROCESS, VERSION, WHAT)
(   1,<2013-09-26 17:54:09.096 -0700>,<Administrator>,<X>,<go>,<TOPSPIN 2.1>,
      <created by zg
	started at 2013-09-26 17:42:41.909 -0700,
	POWCHK enabled, PULCHK disabled,
       configuration hash MD5:
       C8 4E 4E 5D D3 5C D8 9E 9F 52 82 E0 59 8A DE 15
       data hash MD5: 64K
       7C 35 06 E5 31 36 61 66 5F 60 EA 82 F7 10 B5 04>)
(   2,<2013-09-26 17:54:12.396 -0700>,<Administrator>,<X>,<proc1d>,<TOPSPIN 2.1>,
      <Start of raw data processing
       efp LB = 0.3 FT_mod = 6 PKNL = 1 PHC0 = 0 PHC1 = 0 SI = 128K 
       data hash MD5: 128K
       9D A2 D7 1C 9B E7 82 A9 2A 16 1B C6 38 BA D1 E4>)
(   3,<2013-09-26 17:54:13.507 -0700>,<Administrator>,<X>,<proc1d>,<TOPSPIN 2.1>,
      <pk PHC0 = -50.96008 PHC1 = 0 
       data hash MD5: 128K
       E4 76 73 23 34 94 7D 91 37 FE DE 65 67 1A 21 A2>)
(   4,<2013-09-26 17:54:13.969 -0700>,<Administrator>,<X>,<proc1d>,<TOPSPIN 2.1>,
      <abs ABSG = 1 
       data hash MD5: 128K
       4F D9 5D B1 BA 6F 28 42 F9 C5 0D 11 5E 4A B6 CA>)
(   5,<2013-09-26 17:54:14.089 -0700>,<Administrator>,<X>,<proc1d>,<TOPSPIN 2.1>,
      <abs ABSG = 2 
       data hash MD5: 128K
       AA 1A 69 60 65 6B C1 DB E1 89 FE AA 32 51 F2 CA>)
(   6,<2013-09-26 17:54:14.191 -0700>,<Administrator>,<X>,<proc1d>,<TOPSPIN 2.1>,
      <abs ABSG = 3 
       data hash MD5: 128K
       6C 63 87 BA DA 41 A3 80 26 38 68 60 E1 49 AD A8>)
(   7,<2013-09-26 17:54:14.277 -0700>,<Administrator>,<X>,<proc1d>,<TOPSPIN 2.1>,
      <abs ABSG = 4 
       data hash MD5: 128K
       F1 22 73 58 5F 92 BD 6D 1F A0 0A E2 F2 F3 83 50>)
(   8,<2013-09-26 17:54:14.379 -0700>,<Administrator>,<X>,<proc1d>,<TOPSPIN 2.1>,
      <abs ABSG = 5 
       data hash MD5: 128K
       A8 F0 7C 8B 31 9A E4 83 91 A1 AE 1A 2E 4F BC 96>)
$$ ##END=
$$ 
$$ $$ hash MD5
$$ $$ 44 3A BE A9 4F 93 5B 5C 94 DF 04 88 F6 65 9D A0
##$RELAX= 
##$RELAX= 
##$RELAX= 
##$RELAX= 
##$RELAX= 
##$RELAX= 
##$RELAX= 
##$RELAX= 
$$ Bruker specific parameters
$$ --------------------------
##$DU= <E:\>
##$EXPNO= 22
$$ [...]
##$TP07= 0
##$TPNAME0= <>
##$TPNAME1= <>
##$TPNAME2= <>
##$TPNAME3= <>
##$TPNAME4= <>
##$TPNAME5= <>
##$TPNAME6= <>
##$TPNAME7= <>
##$TPOAL= (0..7)
0.5 0.5 0.5 0.5 0.5 0.5 0.5 0.5
##$TPOFFS= (0..7)
0 0 0 0 0 0 0 0
##$TUNHIN= 0
##$TUNHOUT= 0
##$TUNXOUT= 0
##$USERA1= <user>
##$USERA2= <user>
##$USERA3= <user>
##$USERA4= <user>
##$USERA5= <user>
##$V9= 5
##$VALIST= <valist>
##$VCLIST= <CCCCCCCCCCCCCCC>
##$VD= 0
##$VDLIST= <DDDDDDDDDDDDDDD>
##$VPLIST= <PPPPPPPPPPPPPPP>
##$VTLIST= <TTTTTTTTTTTTTTT>
##$WBST= 1024
##$WBSW= 4
##$XGAIN= (0..3)
0 0 0 0
##$XL= 0
##$YL= 0
##$YMAX_a= 6558045
##$YMIN_a= -13189878
##$ZGOPTNS= <>
##$ZL1= 120
##$ZL2= 120
##$ZL3= 120
##$ZL4= 120
##$ABSF1= 14.96081
##$ABSF2= -5.597372
##$ABSG= 5
##$ABSL= 3
##$ALPHA= 0
##$AQORDER= 0
##$ASSFAC= 0
##$ASSFACI= 0
##$ASSFACX= 0
##$ASSWID= 0
##$AUNMP= <proc_prof1d_extract.lims>
##$AXLEFT= 0
##$AXNAME= <>
##$AXNUC= <1H>
##$AXRIGHT= 0
##$AXTYPE= 0
##$AXUNIT= <>
##$AZFE= 0.1
##$AZFW= 0.1
##$BCFW= 0
##$BC_mod= 0
##$BYTORDP= 0
##$COROFFS= 0
##$CY= 15
##$DATMOD= 1
##$DC= 0
##$DFILT= <>
##$DTYPP= 0
##$F1P= 0
##$F2P= 0
##$FCOR= 0.5
##$FTSIZE= 131072
##$FT_mod= 6
##$GAMMA= 0
##$GB= 0
##$INTBC= 1
##$INTSCL= 1
##$ISEN= 128
##$LB= 0.3
##$LEV0= 0
##$LPBIN= 0
##$MAXI= 10000
##$MC2= 0
##$MEAN= 0
##$ME_mod= 0
##$MI= 0
##$NCOEF= 0
##$NC_proc= -2
##$NLEV= 6
##$NOISF1= 0
##$NOISF2= 0
##$NSP= 0
##$NTH_PI= 0
##$NZP= 0
##$OFFSET= 14.96081
##$PC= 1
##$PHC0= -50.96008
##$PHC1= 0
##$PH_mod= 1
##$PKNL= yes
##$PPARMOD= 0
##$PPDIAG= 0
##$PPIPTYP= 0
##$PPMPNUM= 2147483647
##$PPRESOL= 1
##$PSCAL= 4
##$PSIGN= 0
##$PYNMP= <proc.py>
##$REVERSE= no
##$SF= 400.020009714181
##$SI= 131072
##$SIGF1= 0
##$SIGF2= 0
##$SINO= 400
##$SIOLD= 131072
##$SPECTYP= <>
##$SREGLST= <1H.CDCl3>
##$SSB= 0
##$STSI= 131072
##$STSR= 0
##$SW_p= 8223.68421052631
##$SYMM= 0
##$S_DEV= 0
##$TDeff= 65536
##$TDoff= 0
##$TI= <>
##$TILT= no
##$TM1= 0
##$TM2= 0
##$TOPLEV= 0
##$USERP1= <user>
##$USERP2= <user>
##$USERP3= <user>
##$USERP4= <user>
##$USERP5= <user>
##$WDW= 1
##$XDIM= 131072
##$YMAX_p= 386888848
##$YMIN_p= -44686388
##$CURPLOT= <Network HP LaserJet P1505>
##$CURPRIN= <$Network HP LaserJet P1505>
##$DFORMAT= <normdp>
##$LAYOUT= <+/1D_H.xwp>
##$LFORMAT= <normlp>
##$PFORMAT= <normpl>
##$SURQMSG= 1
$$ End of Bruker specific parameters
$$ ---------------------------------
##NTUPLES= NMR SPECTRUM
##VAR_NAME=  FREQUENCY,     SPECTRUM/REAL,   SPECTRUM/IMAG
##SYMBOL=    X,             R,               I
##VAR_TYPE=  INDEPENDENT,   DEPENDENT,       DEPENDENT
##VAR_FORM=  AFFN,          ASDF,            ASDF
##VAR_DIM=   131072,        131072,          131072
##UNITS=     HZ,            ARBITRARY UNITS, ARBITRARY UNITS
##FACTOR=    0.0627417313425164, 1,          1
##FIRST=     8223.62146879497, 1196,         -67847
##LAST=      0,             3756,            -67581
##MIN=       0,             -44686388,       0
##MAX=       8223.62146879497, 386888848,    0
$$ Real data points
##PAGE= N=1
##DATA TABLE= (X++(R..R)), XYDATA
$$ [...]
63816E90489k3884k1772k0755j9864j8477j6819j5276j3842j2296j0600r003p804
63804D00097o999o195n159m272m048m204l869k916k331k808l582l450k449j682
63790C46133j663j801j606j444j641j623p28N81J066K17j207k181k432k303k073
63775C27295j838j785k089k540k654k235j552r58m73M4N79J040J513K185L105
63760C19637M125N108N994O748P392Q056Q726Q982Q216O163L090n07m126p236
63746C80368r382j0540j1068j1195j0743r593q122o825n638m076k048j56J037
63733B92019J683K311L021L423L340L180L480M280N179N834O191O390O628P002
63719C53961P267O921N802M373L098J805J93j225j574j126j375l079n053n656
$$ plain form
63816 590489 566605 544833 524078 504214 485737 468918 453642 439800 427504 416904 407901 400097
63804 400097 393098 386903 381744 377472 373424 369220 365351 362435 360104 357296 353714 350264 347815 346133
63790 346133 344470 342669 341063 339619 337978 336355 335627 336208 337274 337491 336284 334103 331671 329368 327295
63775 327295 325457 323672 321583 319043 316389 314154 312602 311644 311171 311215 311794 312834 314347 316532 319637
63760 319637 323762 328870 334864 341612 349004 357060 365786 374768 382984 389147 392237 391730 387604 380368
63746 380368 370986 360446 349378 338183 327440 317847 309725 302900 297262 293186 291138 290982 292019
63733 292019 293702 296013 299034 302457 305797 308977 312457 316737 321916 327750 333941 340331 346959 353961
63719 353961 361228 368149 373951 378324 381422 383227 383420 382195 380621 379495 378120 375041 369988 364332
63705C64332m835l822l255k752k124j819j953j954j545j234j271j020j7R67Q02
63690C38500l81j227q11M10J400J757J860K071K128J495K04r22j091l85N37J373
63674C46918K307L278L872M011M100M271M175L866M028M791N139M298K995K347
63660D00396K042Q72j204k849l342l511m286n336n818n649n282m781l872k625
63646C54755j439l96Q73K598M578O426P942R155J0205J1210J2211J3224J4196
63633D45538J4805J4479J2967J0831Q983P767O847N947N149M404L379J981N89
63620E43666m58j033o95J201M382P398R212J0522J2671J5642J8199J9814K1341
63607F61862K3581K6119K7992K8743K8404K7050K4880K2284J9304J5406J0267
$$ plain form
63705 364332 359497 355675 352420 349668 347544 345725 343772 341818 340273 339039 337768 336748 336731 337698 338500
63690 338500 338119 336892 336081 336491 337891 339648 341508 343579 345707 347202 347406 346484 345393 345008 345545 346918
63674 346918 349225 352503 356375 360386 364486 368757 372932 376798 380826 385617 390756 395054 398049 400396
63660 400396 402438 403310 402106 399257 395915 392404 388118 382782 376964 371315 366033 361252 357380 354755
63646 354755 353316 352920 353793 356391 360969 367395 375337 384492 394697 405907 418118 431342 445538
63633 445538 460343 474822 487789 498620 507603 515370 522217 528164 533313 537717 541096 543077 543666
63620 543666 543208 542175 541480 542681 547063 554461 563673 574195 586866 602508 620707 640521 661862
63607 661862 685443 711562 739554 768297 796701 823751 848631 870915 890219 905625 915892
63596I15892M506p94n019q035r611r598q643q003q424r665j1304j3472j6401j9666
63582G91763k2431k4262k5201k5132k3763k1363j8959j7253j5786j3634j0801
63571E73178q248o583n316l709j745O4J522K822M036N032N850O734P755Q783R866
63556F00041J1239J2904J4581J6228J8320K1406K5645L0911L7083M3895N0792
63545H83045N7202O3004O8317P2593P3900O9239N6213L5136R966j3283k9734l7898
63533A307700l9298l6479l1517k5795k0354j6087j3674j3364j4787j7165j9984
63522A059196k3345k7390l1552l4724l6190l6075l4834l2733k9943k6799k3676
63511G21935k0762j8164j6062j4508j3256j1975j0634r460q626q153q135q772
$$ plain form
63596 915892 920398 919604 914585 906550 896939 887341 878698 870695 862271 852606 841302 827830 811429 791763
63582 791763 769332 745070 719869 694737 670974 649611 630652 613399 597613 583979 573178
63571 573178 564930 558347 553031 549322 547577 547641 549163 551985 556021 561053 566903 573637 581392 590175 600041
63556 600041 611280 624184 638765 654993 673313 694719 720364 751275 788358 832253 883045
63545 883045 940247 1003251 1071568 1144161 1218061 1287300 1343513 1378649 1388615 1375332 1345598 1307700
63533 1307700 1268402 1231923 1200406 1174611 1154257 1138170 1124496 1111132 1096345 1079180 1059196
63522 1059196 1035851 1008461 976909 942185 905995 869920 835086 802353 772410 745611 721935
63511 721935 701173 683009 666947 652439 639183 627208 616574 607114 598488 590335 582200 573428
63499E73428j0060j1560j2649j2966j2574j1734j0670r543q491p500o331m841
63487D54509l380k535k344k055r53P65K367L595M868O487Q119R256R738R636R071
63472E07144Q346P818P422O691N621M969N234N772N654N095N186O271P455P921
63458E96599P882P867P755P128O014M651K823J96k768m941n656n233m257k804
63444F15256o97J888M491P072J0230J4560J9940K5766L1935L9175M8096N8073
63432H75785O7487P4935P9391P9030P1000N3603K8771J725k2064l9385m9379n2467
63420A168432m9722m2642l2774k1474j0028L75R071J6006K1121K4041K4623K3328
63408A130357K0595J6251J0134L062l522q781j2661j4999j5345j4049j2660j2617
$$ plain form
63499 573428 563368 551808 539159 526193 513619 501885 491215 481672 473181 465681 459350 454509
63487 454509 451129 448594 446250 444195 443242 444007 446374 449969 454837 461324 469443 478699 488437 498073 507144
63472 507144 515490 523308 530730 537421 543042 548011 553245 559017 564671 569766 574952 581223 588678 596599
63458 596599 604481 612348 620103 627231 633245 637896 640719 640915 638147 633206 627550 622317 618060 615256
63444 615256 614559 616447 620938 628010 638240 652800 672740 698506 730441 769616 817712 875785
63432 875785 943272 1018207 1097598 1176628 1247628 1301231 1330002 1331727 1309663 1270278 1220899 1168432
63420 1168432 1118710 1076068 1043294 1021820 1011792 1012167 1021238 1037244 1058365 1082406 1107029 1130357
63408 1130357 1150952 1167203 1177337 1180399 1176877 1168096 1155435 1140436 1125091 1111042 1098382 1085765
63396A085765j3914j5730j7972k1397k6202l1265l5145l7351l8224l7898l6008
63385G74659l2502k8282k4660k2207k0323j8025j5063j2149j0039q561o780m149
63373E71919j208J146K845M633O852Q916J0290J1469J3348J6027J9002K2330K6536
63360G14105L1267L5125L7480L9478M2358M5451M7042M6752M5820M4984M3354
63349A173216L9766L4234K7550K0282J2790N645o37n829r578j1314j1137j0176
63337A264812r466q946q393q715j1282j6123k1802k7015l1412l4785l6580l6477
63325A013816l4659l1162k5778j8934j1833n130J756R248J5926J8986J6055O282
63313I54573r548k8815m7103n9725o4081o0741n2502m2708l3953k7345k2518j8663
$$ plain form
63396 1085765 1071851 1056121 1038149 1016752 990550 959285 924140 886789 848565 810667 774659
63385 774659 742157 713875 689215 667008 646685 628660 613597 601448 591409 582848 576068 571919
63373 571919 570711 571857 574702 579335 586187 595103 605393 616862 630210 646237 665239 687569 714105
63360 714105 745372 780497 817977 857455 899813 945264 992306 1039058 1084878 1129862 1173216
63349 1173216 1212982 1247216 1274766 1295048 1307838 1313483 1312846 1307017 1297439 1286125 1274988 1264812
63337 1264812 1255346 1246400 1238007 1229292 1218010 1201887 1180085 1153070 1121658 1086873 1050293 1013816
63325 1013816 979157 947995 922217 903283 891450 886320 888076 897324 913250 932236 948291 954573
63313 954573 945025 916210 869107 809382 745301 684560 632058 589350 555397 528052 505534 486871
63301D86871j5564j3407j1886j0201q084o136m976m577m699n285o043o181n278
63288C84554m045l654m296m972m665l304j588k69K43rn89r65q72l39M62J204J405
63271C58301Q99L00N65J919L478M090L320J591k76j470j563q40K9Q32K022L780
63255C76977N363N892N550N361N833O473O586N984M792L277K036J769K474L305
63241D41672L589L515L492L382K959K627K934L597L747L189K751L234M529N999
63227D91216P198P998Q364Q381Q396Q799R652J0620J1298J1638J1994J2582J2973
63214F21109J2473J1104R738Q919Q052O341M038J995K60j942m815p578r648j1304
63200F48742j2786j3546j3044j1613r984q370o639m906l311j516R41L942O919
$$ plain form
63301 486871 471307 457900 446014 435813 427729 421593 416617 412040 407341 402056 396013 389832 384554
63288 384554 380509 376855 372559 367587 362922 359618 358030 357761 358004 357995 357406 356441 355569 355230 355692 356896 358301
63271 358301 359200 359500 360065 361984 365462 369552 372872 374463 374187 372717 371154 370314 370343 371175 373197 376977
63255 376977 382340 388232 393782 399143 404976 411449 418035 424019 428811 432088 434124 435893 438367 441672
63241 441672 445261 448776 452268 455650 458609 461236 464170 467767 471514 474703 477454 480688 485217 491216
63227 491216 498414 506412 514776 523157 531553 540352 550004 560624 571922 583560 595554 608136 621109
63214 621109 633582 644686 654424 663343 671395 677736 681774 683769 684029 682087 677272 669694 660046 648742
63200 648742 635956 622410 609366 597753 587769 579399 572760 567854 564543 563027 563968 567910 574829
63187E74829R580J2066J4574J7172J9808K2229K4078K5355K6425K7287K7289K6016
63175H26708K3971K1812J9367J6186J2712J0084Q804Q327P893P134N848L946J632
63162I74424r18m135q666j4331k0001k4715k8346l1191l3392l4927l5673l5375
63150G02754l3996l2055l0103k7952k5101k1885j9303j7652j6134j4114j1934
63139D52525j0089q446o820n593n101m868m143k886j714j200j544k565l560l654
63125C90342k743j700j261j178r09n94o40q68p76l49Q1M41P41O23p5o40k66O94
63107C80923J185J071J299K357L585M350M948N902P098Q291R770J1935J4517J6850
63093D74081J8643J9998K0923K1248K0848J9476J6501J1325M156l907j1490j7508
$$ plain form
63187 574829 584409 596475 611049 628221 648029 670258 694336 719691 746116 773403 800692 826708
63175 826708 850679 872491 891858 908044 920756 930840 939644 947971 955864 962998 968846 972792 974424
63162 974424 973506 969371 960705 946374 926373 901658 873312 842121 808729 773802 738129 702754
63150 702754 668758 636703 606600 578648 553547 531662 512359 494707 478573 464459 452525
63139 452525 442436 433990 427170 421577 416476 411608 407465 404579 402865 401665 400121 397556 393996 390342
63125 390342 387599 385899 384638 383460 382551 381957 381317 380449 379673 379324 379405 379846 380587 381210 381135 380495 380229 380923
63107 380923 382108 383179 384478 386835 390420 394770 399718 405620 412718 421009 430779 442714 457231 474081
63093 474081 492724 512722 533645 554893 575741 595217 611718 623043 627199 623292 611802 594294
63081E94294k1384k3167k3452k2749k0941j7719j3507r467o336l783j314O37J284
63068D32396R64J190K862N139O592O968P069P314P342P164P631R324J1664J3653
63054E27272J5080J6377J7701J8750J9383J9827K0314K0897K1598K2381K3024
63043G42604K3348K3555K3979K4638K5216K5445K5278K4847K4562K4967K6121
63032A014560K7277K7582K6867K5371K2963J9267J4474R314M203j011o435j1818
63020A172614j6943k1645k5372k7425k7839k7412k6554k4731k1444j7116j2460
63009I23673p530k017L876R566J4959K0490K6250L1579L5717L8475M0095M0670
62997A175803L9924L7632L4165L0542K7736K5991K4981K4501K4600K5023K5120
$$ plain form
63081 594294 572910 549743 526291 503542 482601 464882 451375 441908 435572 431789 430475 431112 432396
63068 432396 433360 434550 437412 442551 449143 456111 463180 470494 477836 485000 492631 501955 513619 527272
63054 527272 542352 558729 576430 595180 614563 634390 654704 675601 697199 719580 742604
63043 742604 765952 789507 813486 838124 863340 888785 914063 938910 963472 988439 1014560
63032 1014560 1041837 1069419 1096286 1121657 1144620 1163887 1178361 1187675 1191878 1190867 1184432 1172614
63020 1172614 1155671 1134026 1108654 1081229 1053390 1025978 999424 974693 953249 936133 923673
63009 923673 916143 914126 918002 927568 942527 963017 989267 1020846 1056563 1095038 1135133 1175803
62997 1175803 1215727 1253359 1287524 1318066 1345802 1371793 1396774 1421275 1445875 1470898 1496018
62986A496018K4615K3977K3539K2591J9951J5232R028J841o499j6134k6264l5403
62974A552492m2529m7840n2313n6527n9976o1671o1322n9675n7554n4956n1355
62963I46774m6727m1845l7609l4345l1767k9350k6720k3886k1219j9106j7576
62952F16624j6327j5050j3664j2272j1053j0160r671r562r738r938r726q850p670
62939D72943o874o635o431n868n242m813m100k597r98o71j763k747k389j390j305
62924D19120k239k670j572K11J197J158J087J620K352K824L447M904P026Q836
62910D47301R662R720R534R151Q148O180L275j85l620o397q058q434p584n779
62896D62914l583j722o75l80m00l50k28l95j260k744m063m315l336j791l19J093
$$ plain form
62986 1496018 1520633 1544610 1568149 1590740 1610691 1625923 1634951 1636792 1630293 1614159 1587895 1552492
62974 1552492 1509963 1462123 1409810 1353283 1293307 1231636 1170314 1110639 1053085 998129 946774
62963 946774 900047 858202 820593 786248 754481 725131 698411 674525 653306 634200 616624
62952 616624 600297 585247 571583 559311 548258 538098 528427 518865 509127 499189 489463 480613 472943
62939 472943 466069 459434 453003 447135 441893 437080 432980 430383 429385 428714 426951 424204 421815 420425 419120
62924 419120 416881 414211 412639 412850 414047 415205 416292 417912 420264 423088 426535 431439 438465 447301
62910 447301 456963 466683 476217 485368 493516 499696 502971 502786 499166 492769 484711 476277 468693 462914
62896 462914 459331 457609 456934 456554 456154 455804 455576 455181 453921 451177 447114 442799 439463 437672 437353 438446
62880D38446K678M159M849M405L215K036J356J073O32m61k117l746m850n383n494
62865D40798n238m709m182l810l425k917k502k318k001j187k21J91k3j78K65J156
62849D09699K063K712K890K472J841J757K449L161L026K137J318J035J045J026
62835D38631J080J427J997K553L029L464L734L618L183K917L286M245N316O133
62821D84613O637O724O014M333K241O54j21o25j425k347k797k592k174k043k242
62806D94850k431k275j661o39P02K256L789M941N437N365N108M973N000N138N492
62791E36045O212P224Q217R013R860J1251J3369J5762J7750J9199K0780K3316
62779F97998K6922L0893L4371L6975L8911M0617M2253M3434M3455M2057L9747
$$ plain form
62880 438446 441124 445283 450132 454537 457752 459788 461144 462217 462849 462388 460271 456525 451675 446292 440798
62865 440798 435560 430851 426669 422859 419434 416517 414015 411697 409696 408509 408288 408479 408456 408278 408543 409699
62849 409699 411762 414474 417364 419836 421677 423434 425883 429044 432070 434207 435525 436560 437605 438631
62835 438631 439711 441138 443135 445688 448717 452181 455915 459533 462716 465633 468919 473164 478480 484613
62821 484613 491250 497974 503988 508321 510562 511216 511095 510470 509045 506698 503901 501309 499135 497092 494850
62806 494850 492419 490144 488483 487844 488546 490802 494591 499532 504969 510334 515442 520415 525415 530553 536045
62791 536045 542257 549481 557698 566711 576571 587822 601191 616953 634703 653902 674682 697998
62779 697998 724920 755813 790184 827159 866070 906687 948940 992374 1035829 1077886 1117633
62768A117633L7125L3920K9223K2788J5633Q994L008l131r867j6661k2627k7450
62756A188588l1442l5014l8193m0570m1684m1539m0745l9910l8959l7294l4676
62745G68562l1610k8696k5954k3122k0333j8050j6356j4745j2781j0628q758p320
62733E50209o068m761l416k218j325o97o5Q26J806K368K395K526L368M517M933
62718E54398M332L609L726M713O110P747R550J1006J1677J2146J3617J6453J9727
62705F78811K2484K4890K7705L1195L5070L9175M3551M7905N1654N4693N7600
62694A114733O0811O3944O6243O7408O7592O6724O4354O0244N4562M7329L8125
62683A772069K6828J4304J725j0708k3597l6790m8694n7656o3558o7477p0144
$$ plain form
62768 1117633 1154758 1188678 1217901 1240689 1256322 1265316 1268324 1265193 1255326 1238665 1216038 1188588
62756 1188588 1157146 1122132 1083939 1043369 1001685 960146 919401 879491 840532 803238 768562
62745 768562 736952 708256 682302 659180 638847 620797 604441 589696 576915 566287 557529 550209
62733 550209 544141 539380 535964 533746 532421 531724 531659 532485 534291 536659 539054 541580 544948 549465 554398
62718 554398 558730 562339 566065 570778 576888 584635 594185 605191 616868 629014 642631 659084 678811
62705 678811 701295 726185 753890 785085 820155 859330 902881 950786 1002440 1057133 1114733
62694 1114733 1175544 1239488 1305731 1373139 1440731 1507455 1571809 1632053 1686615 1733944 1772069
62683 1772069 1798897 1813201 1814926 1804218 1780621 1743831 1695137 1637481 1573923 1506446 1436302
62672A436302p1433p1171o9561o6737o2673n7861n3377m9801m6505m2524l7887
62661H06772l3495k9972k7155k4655k2297j9932j7392j4908j3149j2473j2332
62650E79012j1797j0564r193q325q013p804p265o297n071l878k966k384j950j406
62636D92099o61J39P31Q97O60L31K63M00K14o41j710k130j685j102j113j558j753
62619D83381j472j099r10p02k10M25Q42Q60O03L50L84P98J345J643J608J581J971
62602D91398K896M153N354O118O407O808Q061J0193J2360J3843J4868J6090J7522
62589F16071J8567J8966J9146J9391J9209J7970J5813J3412J0968P897L733j084
62577G80059n504q851j1303j3499j5859j8199j9961k0749k0716k0308j9655j8446
$$ plain form
62672 1436302 1364869 1293698 1224137 1157400 1094727 1036866 983489 933688 887183 844659 806772
62661 806772 773277 743305 716150 691495 669198 649266 631874 616966 603817 591344 579012
62650 579012 567215 556651 547458 539133 531120 523316 516051 509754 504683 500805 497839 495455 493505 492099
62636 492099 491438 491577 492308 493205 493865 494196 494459 494859 495073 494432 492722 490592 488907 487805 486692 485134 483381
62619 483381 481909 480810 479900 479198 478988 479413 480255 481115 481718 482068 482452 483250 484595 486238 487846 489427 491398
62602 491398 494294 498447 503801 509919 516326 523134 531195 541388 553748 567591 582459 598549 616071
62589 616071 634638 653604 672750 692141 711350 729320 745133 758545 769513 777410 781143 780059
62577 780059 774555 765704 754401 740902 725043 706844 686883 666134 645418 625110 605455 587009
62565E87009j6541j4430j2837j1953j1391j0764r989r071p994o892n973n188m328
62552D59658l487l033l036l103k950k656k219j408l70K70L62O34J510K211J937
62537D44320J415K054L727M688L932K477J810K123K697L210L763M221M474N039
62523D89950O543Q717J0652J2055J3563J5707J8131K0135K1624K3199K5479K8521
62511F94276L1857L4902L7309L8968L9844L9959L9358L7878L4997L0311K4213
62500A083872J7676J1177M314l248j0841j7224k1791k4957k7466k9609l1073l1271
62488I19559k9883k7208k3940k0574j7181j3797j0675p909n201k337L62K423L826
62475G67465M823N313M832L185P73j733l932n962q254j0947j3578j5590j7117
$$ plain form
62565 587009 570468 556038 543201 531248 519857 509093 499104 490033 482039 475147 469174 463986 459658
62552 459658 456171 453138 450102 446999 444049 441393 439174 437766 437396 437666 438028 438662 440172 442383 444320
62537 444320 445735 447789 451516 456204 460136 462613 464423 466546 469243 472453 476216 480437 484911 489950
62523 489950 496493 505210 515862 527917 541480 557187 575318 595453 617077 640276 665755 694276
62511 694276 726133 761035 798344 837312 877156 917115 956473 994351 1029348 1059659 1083872
62500 1083872 1101548 1112725 1117039 1113791 1102950 1085726 1063935 1038978 1011512 981903 950830 919559
62488 919559 889676 862468 838528 817954 800773 786976 776301 768392 763191 760854 761216 763639 767465
62475 767465 772288 777601 782433 785618 786391 784658 780726 774764 766510 755563 741985 726395 709278
62462G09278j8782k0680k2112k2558k2258k1589k0521j9107j7770j6492j4518
62451D92891j1626q955p558o736n105k856j532j702k287k321j973j446l67J129
62437D39556J937J489P41P46J115Q25j17q52j037j041j066q99m64L3L05k8j228
62420D40015k659k885j323O32J152J90q39j219j500j940j850r11O7L06J58L56
62404D27750Q78J233J293J228J064R29J327K516L939M825N068N003M702M204M042
62389D70001M699N601N626M608L506K914K374J540J031J509K611L607M556N895
62375E20078P292P897P662P436P690Q041Q247Q779J0019J1664J3373J5356J7735
62362F51269K0008K1851K3901K6951L0760L4518L8138M2196M6634N0583N3493
$$ plain form
62462 709278 690496 669816 647704 625146 602888 581299 560778 541671 523901 507409 492891
62451 492891 481265 472310 464752 458016 452911 450055 448523 446821 444534 442213 440240 438794 438427 439556
62437 439556 441493 442982 443723 444469 445584 446409 446292 445440 444403 443362 442296 441397 440933 440966 441271 441243 440015
62420 440015 437356 434471 433148 433780 434932 435122 434283 433064 431564 429624 427774 426863 426930 427236 427394 427750
62404 427750 428628 429861 431154 432382 433446 434375 435702 438218 442157 446982 452050 457053 461755 465959 470001
62389 470001 474700 480301 485927 490535 494041 496955 499329 500869 501900 503409 506020 509627 514183 520078
62375 520078 527370 535267 542929 550365 558055 566096 574343 583122 593141 604805 618178 633534 651269
62362 651269 671277 693128 717029 743980 774740 809258 847396 889592 936226 986809 1040302
62351A040302N5535N6641N6110N3522M9255M3621L6238K7013J7076P917r9p583
62339A435548j4730k0968k6011l0407l4760l8960m2503m5069m6439m6217m4285
62328A045199m1385l8729l6817l5034l2554k9403k6316k3776k1700j9983j8804
62317G20698j8193j7718j6996j6159j5454j4655j3323j1559r985q991q410p855
62305E61400p023n778m318l083k158j091J86P37j65j584j831p92l6l92q49l76
62289E32847N93J342K283L913N406N684N218N352O148O416N678M678L912K964
62275E92434J630N31J50J44L4j52k05j4O88K188M179O055P942J0658J4439J8541
62259F59242K2441K6507L1078L5812M0457M5363N0543N4978N7703N8969N9459
$$ plain form
62351 1040302 1095837 1152478 1208588 1262110 1311365 1354986 1391224 1418237 1435313 1443230 1443131 1435548
62339 1435548 1420818 1399850 1373839 1343432 1308672 1269712 1227209 1182140 1135701 1089484 1045199
62328 1045199 1003814 965085 928268 893234 860680 831277 804961 781185 759485 739502 720698
62317 720698 702505 684787 667791 651632 636178 621523 608200 596641 586656 577665 569255 561400
62305 561400 554377 548599 544281 541198 539040 537949 538135 538872 538707 537123 535292 534500 534464 534072 533223 532847
62289 532847 533440 534782 537065 540978 546384 552068 557286 562638 568786 575202 580880 585558 589470 592434
62275 592434 594064 594595 594745 594889 594923 594771 594566 594552 595240 597428 601607 607662 615604 626262 640701 659242
62259 659242 681683 708190 739268 775080 815537 860900 911443 966421 1024124 1083093 1142552
62248A142552N8806N5760M9627M0833L0364J9329Q868k99q298j5617k2354k8346
62236A331225l3777l8988m3794m7616n0154n1460n1428m9824m6870m3211l9197
62225H34906l4710k9823k5192k1516j8890j6845j4863j2800j0935r666q998q484
62213F22184p833p320p324p630p666p312p014o971o731n830m537l633l512l743
62199E35128l585k842j986j414q22L53K063L676M906O098P434Q509R041R438J0102
62184E86099J0658J0550J0016R803J0095J0403J0298R651Q337O439M622L584L183
62171F93738K830K696L693O214R727J3715J8205K3092K7783L1883L5530L8665
62159I07771M0683M1140M0204L7966L4036K8287K1421J4229O912k88o523j1261
$$ plain form
62248 1142552 1201358 1257118 1306745 1347578 1377942 1397271 1406139 1405840 1397542 1381925 1359571 1331225
62236 1331225 1297448 1258460 1214666 1167050 1116896 1065436 1014008 964184 917314 874103 834906
62225 834906 800196 770373 745181 723665 704775 687930 673067 660267 649332 639666 630668 622184
62213 622184 614351 607031 599707 592077 584411 577099 570085 563114 556383 550553 546016 542383 538871 535128
62199 535128 531543 528701 526715 525301 524479 524832 526895 530571 535477 541575 549009 557518 566559 575997 586099
62184 586099 596757 607307 617323 627126 637221 647624 657922 667573 675910 682349 686971 690555 693738
62171 693738 696568 699264 702957 709171 718898 732613 750818 773910 801693 833576 869106 907771
62159 907771 948454 989594 1029798 1067764 1101800 1130087 1151508 1165737 1172649 1172361 1165838 1154577
62147A154577j5305j9946k5240l0008l3386l5596l7099l7697l6783l4091l0020
62136H19406k5505k1505j8283j5239j1675p660l755j27L615P680J1689J5043J7483
62123G71167J9386K1673K5127K9403L3007L4743L4963L4717L3964L1515K6813
62112A096478K0823J4877R363M062q38m743p305q623q960q721q543q900r612r871
62098A069487q745n677q10M981J0610J5542J9906K3755K6649K8287K9200L0246
62086A243431L1500L2205L1985L1628L2354L4510L7307L9844M2046M4460M7356
62075A648626N0416N3214N5593N7329N7762N6205N2606M7479M1283L4221K6662
62064B181396J9276J2634O929K199j352l366l522j860R14L681N915Q301J1737
$$ plain form
62147 1154577 1139272 1119326 1094086 1064078 1030692 995096 957997 920300 883517 849426 819406
62136 819406 793901 772396 754113 738874 727199 719539 715784 715657 719272 726952 738641 753684 771167
62123 771167 790553 812226 837353 866756 899763 934506 969469 1004186 1038150 1069665 1096478
62112 1096478 1117301 1132178 1141541 1145603 1144765 1140022 1132717 1124094 1115134 1106413 1097870 1088970 1079358 1069487
62098 1069487 1060742 1055065 1054255 1059236 1069846 1085388 1105294 1129049 1155698 1183985 1213185 1243431
62086 1243431 1274931 1307136 1339121 1370749 1403103 1437613 1474920 1514764 1556810 1601270 1648626
62075 1648626 1699042 1752256 1807849 1865178 1922940 1979145 2031751 2079230 2120513 2154734 2181396
62064 2181396 2200672 2213306 2220235 2222434 2221082 2217716 2214194 2212334 2213248 2216929 2222844 2231145 2242882
62051B242882J5874J9328K1383K2614K3518K3321K0733J5304P479k132j2875k3948
62039B373481l4834m5620n6261o5938p3802p9952q4917q8442q9861q9435q8234
62028A576185q6550q3424p8216p1785o5580o0224n5506n1217m7372m3907m0684
62017H91720l7694l4878l2003k8948k5900k3012k0128j7153j4431j2412j1001
62006F34160r560p449m462r15K477N056O692P691Q183P945O871N267L383J065
61992F66404j760m583o690p910q607r163r788j0663j1881j3225j4241j4522j3859
61979E39512j2400j0710r415q571p679o510n461m861m406l717k954k426k007j488
61965D56907j042p49j78Q16J402Q87J33O44K380L697L585K743K199K172K713M185
$$ plain form
62051 2242882 2258756 2278084 2299467 2322081 2345599 2368920 2389653 2404957 2412436 2410304 2397429 2373481
62039 2373481 2338647 2293027 2236766 2170828 2097026 2017074 1932157 1843715 1753854 1664419 1576185
62028 1576185 1489635 1406211 1327995 1256210 1190630 1130406 1074900 1023683 976311 932404 891720
62017 891720 854026 819148 787145 758197 732297 709285 689157 672004 657573 645161 634160
62006 634160 624600 617151 612689 611774 614251 619307 625999 633690 641873 649818 656689 661956 665339 666404
61992 666404 664644 660061 653371 645461 636854 627691 617903 607240 595359 582134 567893 553371 539512
61979 539512 527112 516402 506987 498416 490737 484227 478766 473905 469499 465782 462828 460402 458395 456907
61965 456907 455865 455116 454938 455754 457156 458043 458176 458820 461200 464897 468482 471225 473424 475596 478309 482494
61949D82494O326P926Q341Q508R565J1345J3187J5417J8652K2184K4500K5323
61937F53768K5871K7072K8614K9880L0647L0605K9293K6964K4627K2690K0384
61926I50415J7089J3515J0766Q768O347K725j716o002r439j1959j3880j5330j5722
61913I35577j4218j0854o846l220M11N123J0898J6301K0048K2290K3886K4869
61901A024265K4241K1268J6546J1444O634J557m532j1284j7391k1808k4529k6177
61889A000234k7327k8301k9131k9465k8827k7268k5426k3707k1802j9398j7032
61878G22550j5628j5350j5415j5025j4031j2672j1147r539p848o022m178k730
61866E92965j952j421l99J202K762L992N431P555R916J1834J3612J6376K0593
$$ plain form
61949 482494 488820 496746 505087 513595 523160 534505 547692 563109 581761 603945 628445 653768
61937 653768 679639 706711 735325 765205 795852 826457 855750 882714 907341 930031 950415
61926 950415 967504 981019 991785 1000553 1006900 1009625 1007909 1001907 992468 980509 966629 951299 935577
61913 935577 921359 910505 903659 900439 900850 905973 916871 933172 953220 975510 999396 1024265
61901 1024265 1048506 1069774 1086320 1097764 1104398 1105955 1101423 1090139 1072748 1050940 1026411 1000234
61889 1000234 972907 944606 915475 886010 857183 829915 804489 780782 758980 739582 722550
61878 722550 706922 691572 676157 661132 647101 634429 623282 613743 605895 599873 595695 592965
61866 592965 591013 589592 589193 590395 593157 597149 602580 610135 620051 631885 645497 661873 682466
61853F82466K5327K9322L2346L5144L8252M1374M4053M6403M8725N0556N0707
61842A124675M8486M4474L9704L4349K7747J9661J0898K527n007j1722j7356k1219
61830A297217k2640k1345j7559j1973n419J593Q947J6299K2615K6769K8504K8402
61818A351410K6848K3384J7381R038o04j0567k0482l0138l8740m5107m8697n0200
61806A183526n0713n0462m8808m5567m1727l8474l5866l3090k9828k6671k4150
61795G58170k1996j9639j7005j4453j2246j0484r315q799q605q257p656p107o827
61782F05781o692o537o411o416o412o130n545n068n281o336p634q186p487n962
61768E15684m533l823l873m328m645m258k992j454o30r14j720k174j968j314m06
$$ plain form
61853 682466 707793 737115 769461 804605 842857 884231 928284 974687 1023412 1073968 1124675
61842 1124675 1173161 1217635 1257339 1291688 1319435 1339096 1349994 1352521 1347514 1335792 1318436 1297217
61830 1297217 1274577 1253232 1235673 1223700 1218281 1219874 1228821 1245120 1267735 1294504 1323008 1351410
61818 1351410 1378258 1401642 1419023 1428061 1427457 1416890 1396408 1366270 1327530 1282423 1233726 1183526
61806 1183526 1132813 1082351 1033543 987976 946249 907775 871909 838819 808991 782320 758170
61795 758170 736174 716535 699530 685077 672831 662347 653032 644233 635628 627371 619715 612608 605781
61782 605781 599089 592552 586141 579725 573313 567183 561638 556570 551289 544953 537319 529133 521646 515684
61768 515684 511151 507328 503455 499127 494482 490224 487232 485778 485148 484234 482514 480340 478372 477058 476652
61753D76652O93J702K179K099J972K156K300J851R94O04J193K199K667K372J932
61738E03565K010K726L863N127O093O413O384O936Q543J0476J1627J1886J2077
61725E97726J2616J3053J2987J2738J2608J2225J1189R941R285R255R096Q296
61713G31015P025N611M069K287K15k279n329q642j1433j3036j3453j3195j2728
61700F70127j2122j1137r648p939o461n238l895k474j696j971k481k060p75K39
61686F02469L77J49Q1N0QM13J349K058J883J080J47q53j678j516j85R79M99j301
61668F06009k882l558l870m158m127l893m071m500m138k695j298r13j121j127
61654E63658j000j121j127n13L02M68ml82m23n08o73m30K88P97O43K83L88Q41
$$ plain form
61753 476652 477345 479047 481226 483325 485297 487453 489753 491604 492598 493202 494395 496594 499261 501633 503565
61738 503565 505575 508301 512164 517291 523384 529797 536181 543117 551660 562136 573763 585649 597726
61725 597726 610342 623395 636382 649120 661728 673953 685142 695083 704368 713623 722719 731015
61713 731015 738040 743651 747720 750007 750222 747943 742614 733972 722539 709503 696050 682855 670127
61700 670127 658005 646868 637220 629281 622820 617582 613687 611213 609517 607546 605065 603005 602230 602469
61686 602469 602846 602995 603076 603126 603134 603547 604896 606954 608837 609917 610064 609211 607533 606017 605832 606811 607310 606009
61668 606009 603127 599569 595699 591541 587414 583521 579450 574950 570812 568117 566819 565906 564785 563658
61654 563658 562658 561537 560410 559897 560199 560667 560663 560281 559858 559350 558677 558247 558535 559332 559975 560258 560646 561487
61636E61487Q96J57r81j927k623l463m568n442n611n321n245n491n512m976m185
61621E07195l323k001n0J841K903L354L914M513M371L286K023J090o8k212n026
61606E21810p283q124p859p427p299p030n904l978k211j459j614j898j776j132
61592D56816J11J975L971N274N542N230M945M822M650M238L435K136N09r62j903
61577E00789k346k503k487k437k637l275m191n105n924o670p198p259o812o143
61563D35802n632n482n630n816n718n095l908k426j190p26j066j670k029k219
61549C87195k627l280l757l823l699l600l322k630j756j164r02m96L80J432K103
61534C60054K264K340K677L017K783J795M78o34j361j831k243k838l760m782n369
$$ plain form
61636 561487 562383 562540 561559 559632 557009 553546 548978 543536 537925 532604 527359 521868 516356 511380 507195
61621 507195 503872 501871 501821 503662 506565 509919 513833 518346 522717 526003 528026 529116 529048 526836 521810
61606 521810 514527 506403 498544 491117 483818 476788 470884 466906 464695 463236 461622 459724 457948 456816
61592 456816 456927 458902 462873 468147 473689 478919 483864 488686 493336 497574 501009 503145 503654 502692 500789
61577 500789 498443 495940 493453 491016 488379 485104 480913 475808 469884 463214 456016 448757 441945 435802
61563 435802 430170 424688 419058 413242 407524 402429 398521 396095 394905 394179 393113 391443 389414 387195
61549 387195 384568 381288 377531 373708 370009 366409 363087 360457 358701 357537 356635 356139 356519 357951 360054
61534 360054 362318 364658 367335 370352 373135 374930 375408 374774 373413 371582 369339 366501 362741 357959 352590
61519C52590n172m284k986j566n49n39j396k069j806j152j048j365j212n39l17
61504C26590r69j683j730j556j944k699k939k329j308l62L43P37P28M14K3l06
61488C11010n28n72m77n22q91j324j293m98Q90K312L106K928K115J434J341J667
61472C20698K049K326K381K080J542J144R80P15K05j97k72l34n96o24r1M15Q9
61455C32510q20j202n05P08J585J747J198J48r02j408j286q62l22L85J108J599
61439C33681K063K992M247M949M657M075M125M755N142M790L822K458Q26o91j490
61424C80401j357p15j13K79N26O74R45J857L641N554O306N434L884K870K488J912
61408D14586P02p30j930k966l922m480m462m355m758n543o033n835n089m105l149
$$ plain form
61519 352590 347418 343134 340148 338582 338033 337494 336098 334029 332223 331071 330023 328658 327446 326907 326590
61504 326590 325621 323938 322208 320652 318708 316009 313070 310741 309433 309071 309414 310151 310879 311293 311316 311010
61488 311010 310482 309910 309433 308911 308020 306696 305403 304905 305795 308107 311213 314141 316256 317690 319031 320698
61472 320698 322747 325073 327454 329534 331076 332220 333200 333915 334120 333923 333651 333317 332721 332097 332006 332421 332510
61455 332510 331690 330488 329983 330691 332276 334023 335221 335369 334467 333059 331773 330911 330589 330974 332082 333681
61439 333681 335744 338736 342983 347932 352589 356664 360789 365544 370686 375476 379298 381756 382582 381891 380401
61424 380401 379044 378329 378216 378495 379021 379695 380640 382497 386138 391692 397998 403432 407316 410186 412674 414586
61408 414586 415288 414558 412628 409662 405740 401260 396798 392443 387685 382142 376109 370274 365185 361080 357931
61393C57931k529k390k476k432k229k042j819j388q29l48R3N76P65K32p58j297
61377C39060q35K48J128J301Q46L04L31J086J940K144J753J446J512J572J360
61362C55196J134J132J226J312J551J964K284K499K922L502L707L494L796N381
61348C91100P692R529J0530J1193J1775J2037J2105J2576J3493J3931J3135J1542
61336E30638J0172R258Q119O301M245K637J503K87j302k936m175m988n630o208
61322E47921o592o692o523o095n417m621l905l383l128l201l400l153k055n36
61308D89220L99K58m11o82j08J084K406L465M237N073O267P459P854P107N784
61293E39412M651L753K416M9l056n738o827o331n535n552n909n263l424j764j348
$$ plain form
61393 357931 355402 353012 350536 348104 345875 343833 342014 340626 339797 339449 339542 340118 340883 341115 340357 339060
61377 339060 338225 338473 339601 340902 341748 342052 342383 343469 345409 347553 349306 350752 352264 353836 355196
61362 355196 356330 357462 358688 360000 361551 363515 365799 368298 371220 374722 378429 381923 385719 391100
61348 391100 398792 408321 418851 430044 441819 453856 465961 478537 492030 505961 519096 530638
61336 530638 540810 550068 558187 564488 568733 571370 572873 573160 571858 568922 564747 559759 554129 547921
61322 547921 541329 534637 528114 522019 516602 511981 508076 504693 501565 498364 494964 491811 489756 489220
61308 489220 489619 489877 489466 488784 488676 489760 492166 495631 499868 504941 511208 518667 526521 533628 539412
61293 539412 544063 547816 550232 550281 547225 541487 534660 528329 522794 517242 511333 506070 502646 500882 499534
61278D99534j549j155m1J064J933K938M109M983N354N401N123M419L765L990N176
61263E45044O378O717O257N651N409N759O695P915R108J0428J2267J4432J6105
61250F58165J6873J7073J6840J5497J2509Q517M611R89k849o797r977j1948j3180
61237G06323j4077j4330j3724j2846j2283j1633j0121q000o462o059n992n255
61225E85541l897k677j886j034L53K196L999N284N775N612N319N356N605N505
61211F21051M761L655K685K096J848J767J677J597J853K722L912M758N059N396
61197F64837O487Q523J1347J4808J8634K2271K5339K8048L0759L3411L5697L7586
61185I37747L9057L9495L8094L5033L1606K8858K6577K3976K0936J8077J5792
$$ plain form
61278 499534 497985 496830 496789 497853 499786 502724 506833 511816 517170 522571 527694 532113 535878 539868 545044
61263 545044 551422 558139 564396 570047 575456 581215 587910 595825 604933 615361 627628 642060 658165
61250 658165 675038 692111 708951 724448 736957 745474 750085 751074 748225 741428 731451 719503 706323
61237 706323 692246 677916 664192 651346 639063 627430 617309 609309 602847 596788 590796 585541
61225 585541 581644 578967 577081 576047 576400 578596 582595 587879 593654 599266 604585 609941 615546 621051
61211 621051 625812 629467 632152 634248 636096 637863 639540 641137 642990 645712 649624 654382 659441 664837
61197 664837 671324 679847 691194 706002 724636 746907 772246 800294 831053 864464 900161 937747
61185 937747 976804 1016299 1054393 1089426 1121032 1149890 1176467 1200443 1221379 1239456 1255248
61174A255248J3770J1498Q869O071L192J04l329p153j1376j5924k0441k4361k7332
61161A188836k9605l1704l3688l5036l5383l5069l4532l3513l1417k8535k6135
61150H34219k4960k4111k2064j8554j4789j1811r397o860m270k283j078j76O90
61137F94556J158Q41j18j271k214k459j451P87L380N473P221R425J2357J5535
61123G43220J8636K1968K5844K9978L3825L7185M0202M3063M5851M8516N0845
61112A139133N2706N4325N5951N7149N6989N5203N2669N0319M7962M4693M0126
61101A707225L4719K9093K3592J8366J3269P706J170n995j2905j9298k5859l3067
61089A738016m0247m6175n0278n2822n4166n4477n4097n3622n3248n2445n0635
$$ plain form
61174 1255248 1269018 1280516 1289385 1295456 1298648 1298752 1295423 1288270 1276894 1260970 1240529 1216168 1188836
61161 1188836 1159231 1127527 1093839 1058803 1023420 988351 953819 920306 888889 860354 834219
61150 834219 809259 785148 763084 744530 729741 717930 708533 701673 697403 695120 694042 693866 694556
61137 694556 695714 696555 696437 695166 692952 690493 689042 689829 693209 698682 705903 715328 727685 743220
61123 743220 761856 783824 809668 839646 873471 910656 950858 993921 1039772 1088288 1139133
61112 1139133 1191839 1246164 1302115 1359264 1416253 1471456 1524125 1574444 1622406 1667099 1707225
61101 1707225 1741944 1771037 1794629 1812995 1826264 1833970 1835140 1829145 1816240 1796942 1771083 1738016
61089 1738016 1697769 1651594 1601316 1548494 1494328 1439851 1385754 1332132 1278884 1226439 1175804
61078A175804m8027m5383m3014m0494l7458l4164l0995k7755k4015j9877j5936
61067H08686j2590r872p927o986o749o361n225l459j406P80K834M285N097O003
61053G67110P654R735J1422J2507J3599J5285J7520J9864K2029K4212K6912L0384
61041I78233L4189L7561M0200M2379M4298M5912M7493M9594N2086N3944N4521
61030A480410N4444N4624N5013N5089N4980N5068N4870N3430N0828M8378M7293
61019B064427M7966N0588N5562O3028P2493Q3311R5130J08239J24162J45849J76372
61008C087127K17139K67938L28837M01643M89797N97814P30350Q89796J073193
60999H083634J271914J475190J673081J852966J989199K034494J926708J618944
$$ plain form
61078 1175804 1127777 1082394 1039380 998886 961428 927264 896269 868514 844499 824622 808686
61067 808686 796096 786224 778297 771311 764562 758201 752976 749517 748111 748891 751725 756010 761107 767110
61053 767110 774764 784499 795921 808428 822027 837312 854832 874696 896725 920937 947849 978233
61041 978233 1012422 1049983 1090183 1132562 1176860 1222772 1270265 1319859 1371945 1425889 1480410
61030 1480410 1534854 1589478 1644491 1699580 1754560 1809628 1864498 1917928 1968756 2017134 2064427
61019 2064427 2112393 2162981 2218543 2281571 2354064 2437375 2532505 2640744 2764906 2910755 3087127
61008 3087127 3304266 3572204 3901041 4302684 4792481 5390295 6120645 7010441 8083634
60999 8083634 9355548 10830738 12503819 14356785 16345984 18380478 20307186 21926130
60991B1926130J121679N25880k0953l80346m88031l75764j44598P9147J76396
60982B2419540N7856l07449q63454j470434j960414k217154k223554k045192j774345
60973I615400j483732j214113r83005p94196o43215n22724m26802l51013k90743
60964B905857k42052k03428j74517j53388j36767j22493j10075r9010q8369p8045
60954A497713o8818o0834n3259m5719l8892l3473k9632k7590k7530k8574k9067
60943A054325k8338k7232k6453k5460k3583k1286j9482j8268j7186j6198j5631
60932H15208j5422j5190j4823j4514j4247j3705j2689j1353j0067r189q870q900
60920F66239q856q420p491o170m896m444n173o291o454n327l920l190k877k187
$$ plain form
60991 21926130 23047809 23573689 23552736 23172390 22684359 22308595 22163997 22243144 22419540
60982 22419540 22477396 22169947 21306493 19836059 17875645 15658491 13434937 11389745 9615400
60973 9615400 8131668 6917555 5934550 5140354 4497139 3974415 3547613 3196600 2905857
60964 2905857 2663805 2460377 2285860 2132472 1995705 1873212 1763137 1664127 1575758 1497713
60954 1497713 1428895 1368061 1314802 1269083 1230191 1196718 1167086 1139496 1111966 1083392 1054325
60943 1054325 1025987 998755 972302 946842 923259 901973 882491 864223 847037 830839 815208
60932 815208 799786 784596 769773 755259 741012 727307 714618 703265 693198 684009 675139 666239
60920 666239 657383 648963 641472 635302 630406 625962 620789 614498 608044 602717 598797 595607 592730 590543
60906E90543j081l14l95j085j776k109k202k495l255m128m530m489m659n278n676
60891E47071n364n037n715p146p932p349o164n447n274n074m683m415m372m351
60877D68748m294m307m229l717k874k274k113j871j152m22l47o86n52L06J138
60862D41354J347J329J850L009M253N100N391N000L817K102N80J0O32J969L182
60847D80925L762L897L966L779K770R69q22k012k844l657m228m368m586n394o357
60832D65800o617o156n652n329m836m242m090m311m074l086k211k246k818l061
60818D07071k823k469k048j308m06J38J65N3J37L45M68N28P70J341K013K317K212
60801D08504K451L792N685O400N011K747J705K411L403L200J960Q88O68J038J521
$$ plain form
60906 590543 589462 589148 588753 587668 585892 583783 581581 579086 575831 571703 567173 562684 558025 552747 547071
60891 547071 541707 536670 530955 523809 515877 508528 502364 496917 491643 486569 481886 477471 473099 468748
60877 468748 464454 460147 455918 452201 449327 447053 444940 443069 441917 441495 441148 440462 439910 440216 441354
60862 441354 442701 444030 445880 448889 453142 458242 463633 468633 472450 474552 475132 475142 475774 477743 480925
60847 480925 484687 488584 492550 496329 499099 500068 499246 497234 494390 490733 486505 482137 477551 472157 465800
60832 465800 459183 453027 447375 442046 437210 432968 428878 424567 420493 417407 415196 412950 410132 407071
60818 407071 404248 401779 399731 398423 398017 398155 398320 398373 398510 398855 399323 399851 400621 401962 403975 406292 408504
60801 408504 410955 414747 420432 426832 431843 434590 436295 438706 442109 445309 447269 448157 448825 449863 451384
60786D51384J955K213K012J279M55Q7J93K73n8p25j442k000k258k235k367l173
60770D45593m384m909m128k865k421k874l120k459j375o80o54j171j945k377j933
60755D08298r97o41j144j464p77K51M33k44p71n92JP13J551K344K756K824K797
60738D15338K449J337k33j314j544j452j315o30Q06K096K263J570J028J035J186
60723D22620J199J262J537J977K597L322L636L031J937J442J876K343J948R60
60709D51687J98j37m45q89j272j585j983k298k151j638j261j189j137j154j794
60694D32952l151m313m372l502k599k152k044k094k158j886j043j5N98Q19J139
60679D06179J564J576J123Q73J178J496J286Q78Q87J256J491J539J733K054K109
$$ plain form
60786 451384 453339 455552 457564 458843 459298 459385 459578 459851 459793 459068 457626 455626 453368 451133 448766 445593
60770 445593 441209 436300 432172 429307 426886 424012 420892 418433 417058 416378 415724 414553 412608 410231 408298
60755 408298 407301 406660 405516 404052 403275 403526 403959 403715 402944 402352 402353 403066 404617 406961 409717 412541 415338
60738 415338 417787 419124 418891 417577 416033 414581 413266 412636 413442 415538 417801 419371 420399 421434 422620
60723 422620 423819 425081 426618 428595 431192 434514 438150 441181 443118 444560 446436 448779 450727 451687
60709 451687 451885 451748 451303 450414 449142 447557 445574 443276 441125 439487 438226 437037 435900 434746 432952
60694 432952 429801 425488 421116 417614 415015 412863 410819 408725 406567 404681 403638 403623 404221 405040 406179
60679 406179 407743 409319 410442 411315 412493 413989 415275 416153 417040 418296 419787 421326 423059 425113 427222
60664D27222J898J975K637L420L581K847J547K37n99o83n9Q59J494J508J091Q52
60648D49827J281K190K803K516J493M18k12l89l42k74l53p05j240j591j387n98
60632D53437L34Q09O00J80L64J477K890L590L207K397K121K676L490L783L265
60617D84620K206J088L32K08O50J153J194Q81Q88J474K007J830J272J161J489
60602E02453J352L72o08o56K1M99M53L64O26J018J180J183J403J996K631K755
60586E17042K197J400Q81M81l97j682k323j542K5R64O61k47q77r39o26k23N9K49
60568E15103O73J492K292K541K441K674L335L764L656L593M043M488M141L064
60554E57300J912R27n7p57n36N86J663K015K034K532L605M639N134N107M772M224
$$ plain form
60664 427222 429120 431095 433732 437152 440733 443580 445127 445364 444765 444082 444023 444882 446376 447884 448975 449827
60648 449827 451108 453298 456101 458617 460110 460528 460316 459927 459585 459311 458958 458253 457013 455422 454035 453437
60632 453437 453771 454580 455180 455360 455724 457201 460091 463681 466888 469285 471406 474082 477572 481355 484620
60617 484620 486826 487914 488246 488454 489104 490257 491451 492332 493220 494694 496701 498531 499803 500964 502453
60602 502453 503805 504177 503569 502913 502934 503433 503886 504250 504876 505894 507074 508257 509660 511656 514287 517042
60586 517042 519239 520639 521520 522001 521604 519922 517599 516057 516082 517046 517707 517460 516583 515644 515018 514795 514854 515103
60568 515103 515776 517268 519560 522101 524542 527216 530551 534315 537971 541564 545607 550095 554236 557300
60554 557300 559212 560139 560082 559325 558789 559375 561038 563053 565087 567619 571224 575863 580997 586104 590876 595100
60538E95100L452K500J632J360K056L262L793K989J676J299K155L124L225K808
60524F30431K844L679M864N886O404O191N435N024N833P740R727J1004J1584J1834
60510G28480J1936J1870J1467J0413Q658O862N877N745N812N944O815Q694J0711
60497H39284J1977J2842J4235J6155J7665J8174J7902J7060J5417J2898R913O758
60485A010280L179j021n373r156j2273j5184j7980j9879j9960j8352j6432j5574
60473H62275j5798j5883j4944j3471j2536j2367j2270j1851j1547j1751j2053
60462G17804j1840j1214j0710j0317r476q195p486q231r962j1272j1299j0373
60450E97429r237q237p456p134p407p917q106p808p288o777o354o117o081n952
$$ plain form
60538 595100 598552 601052 602684 604044 606100 609362 613155 616144 617820 619119 621274 624398 627623 630431
60524 630431 633275 636954 641818 647704 654108 660299 665734 670758 676591 684331 694058 705062 716646 728480
60510 728480 740416 752286 763753 774166 782824 789686 795563 801308 807120 813064 819879 828573 839284
60497 839284 851261 864103 878338 894493 912158 930332 948234 965294 980711 993609 1003522 1010280
60485 1010280 1013459 1012438 1007065 997909 985636 970452 952472 932593 912633 894281 877849 862275
60473 862275 846477 830594 815650 802179 789643 777276 765006 753155 741608 729857 717804
60462 717804 705964 694750 684040 673723 664247 656052 648566 640335 630373 619101 607802 597429
60450 597429 588192 579955 572499 565365 557958 550041 541935 534127 526839 520062 513708 507591 501510 495558
60436D95558n424m694m252m250m476m830n243n245m350l006k320k615l017k842
60422D38994k523k622k784k422j766j368j100n64r8l23r69j188r44j012j556j712
60406D16043q90L56J117J139P84M76L95L17k60j317j937j378l78k63q75o39R98
60389D13688K529K505J495R56J116J093N58N3o6J8J76M43O84Q09J057J436J262
60372D29812J31j024r80r4J48n63q92j04O28j1j496k307k050j621j617j714j550
60355D14696j269j040p29l14j1J99O78J538K346K646K475K142J817J542J331J100
60339D29147P22L74M89J214K146K919L665M615N490N784N489N063M752M346L623
60324D79838K595J295k66j869l116l811m029l863l443l117l147l165k479j113
$$ plain form
60436 495558 490134 485440 481188 476938 472462 467632 462389 457144 452794 449788 447468 444853 441836 438994
60422 438994 436471 433849 431065 428643 426877 425509 424409 423845 423747 423424 422455 421267 420323 419311 417755 416043
60406 416043 415153 415509 416626 417765 418549 419025 419420 419737 419477 418160 416223 414845 414467 414204 413329 412690 413688
60389 413688 416217 418722 420217 421173 422289 423382 423940 423993 423927 423945 424121 424564 425248 426057 427114 428550 429812
60372 429812 429943 428919 427939 427845 427993 427430 426538 426434 427062 427051 425555 423248 421198 419577 417960 416246 414696
60355 414696 413427 412387 411658 411344 411333 411532 412210 413748 416094 418740 421215 423357 425174 426716 428047 429147
60339 429147 429869 430243 430732 431946 434092 437011 440676 445291 450781 456565 462054 467117 471869 476215 479838
60324 479838 482433 483728 483462 481593 478477 474666 470637 466774 463331 460214 457067 453902 451423 450310
60310D50310R4O21R91J953L451M836N731O315P056Q508J0840J3198J4050J2759
60296E40713J0283P716M745M52m813r421j2244j3402j3334j2160j0190q077o188
60283D74080m484l137k442k038j231k92l38j472k240j650o69p24j569j869j368
60268D48557j155j925l017l409k815j690o72j78q0J70Q44J571K013K531L542M605
60252D48892M923M601M524M998N346M972M066L030J847M01j161k636l925m811
60238D75067m990m517l828l172k493j897j660j609j123n3R80J554K088L090M245
60223D61682M784M414L465K479J996K362L191L524K957K319K625L728M733N273
60209E09532N642N923N914N865O274O859O695N634M683M548M736M546M177M115
$$ plain form
60310 450310 450404 451025 452016 453969 457420 462256 467987 474302 481358 489866 500706 513904 527954 540713
60296 540713 550996 558712 563457 563909 559096 549675 537431 524029 510695 498535 488345 480268 474080
60283 474080 469596 466459 464017 461979 460748 460456 460118 458646 456406 454756 454087 453363 451794 449925 448557
60268 448557 447402 445477 442460 439051 436236 434546 433874 433696 433616 433786 434630 436201 438214 440745 444287 448892
60252 448892 453815 458416 462940 467938 473284 478256 482322 485352 487199 487600 486439 483803 479878 475067
60238 475067 470077 465560 461732 458560 456067 454170 452510 450901 449778 449725 450705 452259 454347 457437 461682
60223 461682 466466 470880 474345 476824 478820 481182 484373 487897 490854 493173 495798 499526 504259 509532
60209 509532 515174 521097 527011 532876 539150 546009 552704 558338 563021 567569 572305 576851 581028 585143
60195E85143M096L598K878K580K577K140J154K94n5k69o77j076j304j630k270
60180E97179k999l555l954m185m114l987m350n090n249m346l219k819k769k128
60166E44415j156r88j598j443L49K561L449K936K340K422K795L085L550M329M866
60151E71912M611L817L165K957L136L816N149O717P702P887Q004Q813J0198J1525
60137F59409J2547J3402J3982J3923J3203J2080J0409P653L864m3l297o000q379
60124G42753j0022j0456j0019r353q402o722m585k846j768q52J22P24P72P56J008
60109F81110J151P69R0m69r13j427j903k140k234k447k908l668m650n393n266
60094F49702m232k958j906q04O72K214L362M222N261O619Q089R361R980R541Q355
$$ plain form
60195 585143 589239 592837 595715 598295 600872 603012 604166 604460 604405 604136 603459 602383 601079 599449 597179
60180 597179 594180 590625 586671 582486 578372 574385 570035 564945 559696 555350 552131 549312 546543 544415
60166 544415 543259 542271 540673 539230 539579 542140 545589 548525 550865 553287 556082 559167 562717 567046 571912
60151 571912 576523 580340 583505 586462 589598 593414 598563 605280 612982 620869 628873 637686 647884 659409
60137 659409 671956 685358 699340 713263 726466 738546 748955 756608 760472 760429 757132 751132 742753
60124 742753 732731 722275 712256 702903 694501 687779 683194 680348 678580 677728 677850 678574 679346 680102 681110
60109 681110 682261 683030 683120 682651 681738 680311 678408 676268 674034 671587 668679 665011 660361 654968 649702
60094 649702 645470 642512 640606 639802 640474 642688 646050 650272 655533 662152 670241 679602 689582 699123 707478
60079G07478P445P241O806N031K203m43k418m234o082p337p624p533p864q671
60065F83998r462r869r753r006p681o185n051m442m067l502k661j933j818k426
60051F06142l441m491n215n060l601j384K64P09Q08J634K948L723L818M093N021
60036F05968O129O871P138O783N550L756K257J390N92o59k190l751n518p575r556
60021F17185j1198j2714j4125j4895j4746j4247j3915j3317j1820r822q303p447
60009D70636o578n424m476l963l376k382j552j567k108k124j076O16K237L401
59995D42264L959L809L200K866L359M248M510L915L509M302N826O597N894M504
59981E02762L584L401L442L290K883K177J127j6p62q88p22p43j033j281j318j424
$$ plain form
60079 707478 714923 722164 728970 734001 736204 735761 733343 729109 723027 715690 708066 700533 692669 683998
60065 683998 674536 664667 654914 645908 638227 632042 626991 622549 618482 614980 612319 610386 608568 606142
60051 606142 602701 598210 592995 587935 584334 582950 583214 583923 584731 586365 589313 593036 596854 600947 605968
60036 605968 612097 618968 626106 632889 638439 642195 644452 645842 646434 645775 643585 639834 634316 626741 617185
60021 617185 605987 593273 579148 564253 549507 535260 521345 508028 496208 486386 478083 470636
60009 470636 464058 458634 454158 450195 446819 444437 442885 441318 439210 437086 436010 436626 438863 442264
59995 442264 446223 450032 453232 456098 459457 463705 468215 472130 475639 479941 485767 492364 498258 502762
59981 502762 506346 509747 513189 516479 519362 521539 522666 522650 521888 521000 520278 519535 518502 517221 515903 514479
59965E14479j925k654l195l598m317n305n797n414m864m842m810l789k058r27
59951D60984q25p95j88L42J20k81J8P42R38M47P%J6l99j188k109l047l915m576
59932D46291m893m733m062l237k830k866k634j698p21o03j184j462r20P4J049
59917D15571J795K062J646R86Q19J104R90K08k22P26K639M123M431M034L733L735
59901D48380L736L488L089K781K696K795L061L542M122M394M078L522L491M344
59887D97519N639O663P138P305P493P783Q071Q337Q671R053R134Q550P361O003
59873F04720M653L104J376p8j170k677n192p972r648r978r985j0326j0471r706
59859E36650q122o166m036j976n13K45R49K133L477M569N735P359Q926R688R964
$$ plain form
59965 514479 512554 509900 506705 503107 498790 493485 487688 482274 477410 472568 467758 463969 461911 460984
59951 460984 460159 459364 459176 459518 459638 459357 459375 460117 461055 461502 461509 461509 461525 461126 459938 457829 454782 450867 446291
59932 446291 441398 436665 432603 429366 426536 423670 421036 419338 418617 418014 416830 415368 414448 414522 415571
59917 415571 417366 419428 421074 422060 422879 423983 424973 425181 424959 425685 428324 432447 436878 440912 444645 448380
59901 448380 452116 455604 458693 461474 464170 466965 470026 473568 477690 482084 486162 489684 493175 497519
59887 497519 503158 509821 516959 524264 531757 539540 547611 555948 564619 573672 582806 591356 598717 604720
59873 604720 609373 612477 613853 613775 612605 609928 604736 596764 587116 577138 567153 556827 546356 536650
59859 536650 528528 522362 518326 516350 515837 516082 517031 519164 522641 527210 532945 540304 549230 558918 568882
59844E68882J0642J1487J1044Q484M661J119j241k230j955r15O6N26O52N55j86
59829F11591j769l404m022l471k516j862j727k231l394m765n644n967o455p631
59815E56733r057r827r609q865q191p664o886n529l858k553j986j721j012K58
59801D80233J455J995J888J400O11m51j568k552l443m237m683m671m606m936n417
59786D51018n333m295k544n88R80J474O70o00j022k40Q41J358J471J679J902J892
59770D48663J981K588L318L383K816K403K421K354K014J963K373K360J251j45
59756D79743m72L01Q98O32K39N64J219J216M50k07j92P1p2n12n47J03Q47R04K93
59737D85478j70J34Q09R36K09p03j005o46j12L39Q52J417J656J317P13M22O79
$$ plain form
59844 568882 579524 591011 602055 610539 615200 616319 615078 612848 610893 609978 610044 610570 611222 611777 611591
59829 611591 609822 606418 602396 598925 596409 594547 592820 590589 587195 582430 576786 570819 564364 556733
59815 556733 547676 537849 528240 519375 511184 503520 496634 491105 487247 484694 482708 480987 479975 480233
59801 480233 481688 483683 485571 486971 487582 487131 485563 483011 479568 475331 470648 465977 461371 456435 451018
59786 451018 445685 441390 438846 438258 439238 440712 441382 440782 439760 439520 440361 441719 443190 444869 446771 448663
59770 448663 450644 453232 456550 459933 462749 465152 467573 469927 471941 473904 476277 478637 479888 479743
59756 479743 479271 479572 480470 481102 481341 481905 483124 484340 484790 484583 484391 484462 484390 483878 483331 483434 484281 485185 485478
59737 485478 485308 485442 486251 487187 487396 486693 485688 485042 484930 485269 486121 487538 489194 490511 491224 491646 492325
59720D92325J302K009K557K733K530K316K494K936L038K477J615J030Q79R65J181
59705E22387J526J771J542P81j29p34q78o61l01o3j08l42n96r42j503k005j919
59688E17826j281q64j198j761j639p11L79J237J999K625K650J898Q63Rq16j867
59672E19349k857l350l498l728l959l710k938k159j729j538j474j512j247l1J990
59657D87609L584L780L056K646K890L004K460J881K303L862N551O143N198L361
59643E37328J706P55J34p99k134l387m129m280l934l217k423j821j217o3J807
59628E14326L848N415O424P088P340O930O005N096M480L845K716R24j368l796
59614E69273n792o788o698o034n250m188k432n7K297M111N317N987O110N791N231
$$ plain form
59720 492325 493627 495636 498193 500926 503456 505772 508266 511202 514240 516717 518332 519362 520241 521206 522387
59705 522387 523913 525684 527226 528007 527878 527144 526266 525605 525304 525241 525133 524791 524195 523253 521750 519745 517826
59688 517826 516545 515681 514483 512722 511083 510372 510751 511988 513987 516612 519262 521160 522023 522032 521216 519349
59672 519349 516492 513142 509644 505916 501957 498247 495309 493150 491421 489883 488409 486897 485650 485619 487609
59657 487609 491193 494973 498029 500675 503565 506569 509029 510910 513213 517075 522626 528769 533967 537328
59643 537328 539034 539789 539923 539124 536990 533603 529474 525194 521260 518043 515620 513799 512582 512519 514326
59628 514326 518174 523589 530013 537101 544441 551371 557376 562472 566952 570797 573513 574437 573069 569273
59614 569273 563481 556693 549995 543961 538711 534523 532091 532034 534331 538442 543759 549746 555856 561647 566878
59599E66878M356K852Q04j094k371l357m440n144m773l767l484m437n564n675
59585E30784m920m302m233m338m287m116l765k998j859q07k21j11m19j204k310
59570D90894l114k908j670k00O48R01J360K455L592L989L833L867M045L616K628
59555E13936K257L011L718L193K069J763K301K480J972J729K262K907L172L638
59541E50408M913O728Q662J0898J3610J6332J8604K0507K1787K1153J7404J1088
59529G22094M328p38k963k157J017N257R466J3367J6887J9300J9676J8089J5599
59516H39222J2920R768N648P75m084q273j1560j4072j6076j7723j8827j9096j8503
59503G40119j7376j6029j4554j2908j1098r232p406n546l388q16J748L580M469
$$ plain form
59599 566878 571234 574086 574890 573796 571425 568068 563628 558484 553711 549944 546460 542023 536459 530784
59585 530784 525864 521562 517329 512991 508704 504588 500823 497825 495966 495159 494938 494827 494408 493204 490894
59570 490894 487780 484872 483202 483002 483650 484551 485911 488366 491958 495947 499780 503647 507692 511308 513936
59555 513936 516193 519204 522922 526115 528184 529947 532248 534728 536700 538429 540691 543598 546770 550408
59541 550408 555321 562049 570711 581609 595219 611551 630155 650662 672449 693602 711006 722094
59529 722094 726422 725684 722721 720564 721581 726838 736304 749671 766558 785858 805534 823623 839222
59516 839222 852142 861910 867558 868333 864249 855976 844416 830344 814268 796545 777718 758622 740119
59503 740119 722743 706714 692160 679252 668154 658922 651516 645970 642582 641766 643514 647094 651563
59490F51563M973N633O267O366N998N915O800Q611J0695J2397J3682J5231J7774
59477G71905K1209K4594K7114K8707K9570K9471K7800K4155J8561J1510M020k574
59465A016042p200r311q602n084M22O607J2924J9892K7715L5345M1759M7439N3536
59452A231484O0066O6099P1479P7052Q3057Q8466R2057R2894Q9212P7943N6556
59441B086365K5301j2464n1613q6573j12362j25821j26680j17626j03182q7890
59431A287455p4594o3981n5685m9477m4974m0781l5164k7821k0027j2760n630
59420H56561J807Q749J4065J7920K1488K5323K8811L1055L1575L0323K7687K4386
59408A119750K0499J4607M824q800k3295l4631m0435m0825l7241l1107k3599j5937
$$ plain form
59490 651563 656536 662169 668436 674802 680800 686715 693515 702126 712821 725218 738900 754131 771905
59477 771905 793114 817708 844822 873529 903099 932570 960370 984525 1003086 1014596 1018616 1016042
59465 1016042 1008842 999531 990929 985845 986267 992874 1005798 1025690 1053405 1088750 1130509 1177948 1231484
59452 1231484 1291550 1357649 1429128 1506180 1589237 1677703 1769760 1862654 1951866 2029809 2086365
59441 2086365 2111666 2099202 2047589 1961016 1848654 1722833 1596153 1478527 1375345 1287455
59431 1287455 1212861 1148880 1093195 1043718 998744 957963 922799 894978 874951 862191 856561
59420 856561 858368 867117 881182 899102 920590 945913 974724 1005779 1037354 1067677 1095364 1119750
59408 1119750 1140249 1154856 1159680 1150880 1127585 1092954 1052519 1011694 974453 943346 919747 903810
59396I03810r416n189m233p275j4158k3012l0624l4318l3692l0317k5890k1144
59384F64542j6441j2566j0286r414q928p995o598n159l946l021k399j989j435
59371E74365m32O86J056K99p63r05M4J073J460J665K432L638M728N776P357R553
59355F12032J1916J4328J7035J9833K2031K3464K4828K6821K9452L2412L5403
59344H69555L7932L9397L9662L9011L7357L4207K9599K4327J8806J2528N123k790
59332A184714j0417j7725k4809l0932l5171l7700l9552m1263m2441m2565m1469
59321H20670l9098l5507l1176k6841k2981j9787j7369j5515j3469j0643p520n255
59309E75509m295l921l125j448J000L803O400Q461J0249J2147J3960J5087J5391
$$ plain form
59396 903810 894394 889205 884972 877697 863539 840527 809903 775585 741893 711576 685686 664542
59384 664542 648101 635535 625249 615835 606907 598912 592314 587155 583209 580188 577789 575800 574365
59371 574365 573933 574619 575675 575974 575211 574306 574350 575423 576883 578548 580980 584618 589346 595122 602479 612032
59355 612032 623948 638276 655311 675144 697175 720639 745467 772288 801740 834152 869555
59344 869555 907487 946884 986546 1025557 1062914 1097121 1126720 1151047 1169853 1182381 1187504 1184714
59332 1184714 1174297 1156572 1131763 1100831 1065660 1027960 988408 947145 904704 862139 820670
59321 820670 781572 746065 714889 688048 665067 645280 627911 612396 598927 588284 580764 575509
59309 575509 571214 567293 564168 562720 563720 567523 573923 582384 592633 604780 618740 633827 649218
59296F49218J5217J4432J2051P284N85o547j2505j6131j6912j5191j2096q837
59284F10568n965l380r22J259K891L967M836N998P736R967J2384J4803J7356K0322
59270G01820K3670K6684K8298K8087K6791K5412K3874K1126J6653J1226N812M82
59258I39935n037j0306j4504j7541k0033k2326k4149k5139k5032k3444k0278j6348
59246G15798j2861j0150p585m798k194jK318N221Q325J1017J3275J5354J7100
59233G50819J8197J8705J8790J8113J6164J3006R251N250Q07m283r742j4924j9190
59220H20963k2240k4223k5444k5847k5004k2897k0357j8313j6753j4978j2845
59209E92062j1108j0369j0142r378p681n631l995k953k143j299o04l96p08j215
$$ plain form
59296 649218 664435 678867 690918 698202 698787 692240 679735 663604 646692 631501 619405 610568
59284 610568 604603 601223 600301 601560 604451 608418 613254 619252 626988 636955 649339 664142 681498 701820
59270 701820 725490 752174 780472 808559 835350 860762 884636 905762 922415 933641 939453 939935
59258 939935 934898 924592 910088 892547 872514 850188 826039 800900 775868 752424 732146 715798
59246 715798 702937 692787 685202 680404 678210 678209 680527 685748 694073 705090 718365 733719 750819
59233 750819 769016 787721 806511 824624 840788 853794 863045 868295 869102 864819 855077 840153 820963
59220 820963 798723 774500 749056 723209 698205 675308 654951 636638 619885 604907 592062
59209 592062 580954 570585 560443 551065 543384 537753 533758 530805 528662 527363 526759 526363 525655 524440
59195E24440j631j922k065j890j341p91o94j019j296j216q47j86R97K666M161
59180E17366M777M529M052L883M185M990O237P538Q486R297J0740J3145J5894
59167F15119J8199J9959K1471K2670K3236K3276K3198K2911K1685J9010J5098
59156H45832J0521N707R43l603q053j2597j6921k0233k2020k2447k1897k0596
59144G14636j8876j7236j5853j4476j3104j2196j1827j1273j0030q685q101q192
59132E64787q264q104p847p118n427l309j929j450q01O76K369L586M581N817P024
59117E44591P815Q543R731J1065J1807J1922J2029J2315J2323J1858J1439J1561
59105F76999J1987J2044J1454J0577R906R461Q791P628O361N561N057L978J940
$$ plain form
59195 524440 522809 520887 518822 516932 515591 514800 514106 513087 511791 510575 509728 509542 510539 513205 517366
59180 517366 522143 526672 530724 534607 538792 543782 550019 557557 566043 575340 586080 599225 615119
59167 615119 633318 653277 674748 697418 720654 743930 767128 790039 811724 830734 845832
59156 845832 856353 862060 863003 859400 851347 838750 821829 801596 779576 757129 735232 714636
59144 714636 695760 678524 662671 648195 635091 622895 611068 599795 589765 581080 572979 564787
59132 564787 556523 548419 540572 533454 528027 524718 522789 521339 520538 521214 523583 527169 531750 537567 544591
59117 544591 552406 560949 570680 581745 593552 605474 617503 629818 642141 653999 665438 676999
59105 676999 688986 701030 712484 723061 732967 742428 751219 758847 765208 770769 775826 779804 781744
59092G81744k44j464j566j299j237j339j395j401j449j655k301l644n486p296
59078G49968q863j0539j2671j5003j6770j7259j6298j4421j2560j1390j0843j0350
59066E93001r513q362p082n846m852m223l720k941j881r93n34k60M5N8p46k296
59050E39855l805m390l783k541j667j781k496k819k307j519j077p66r2O19M61
59035E11892o19j480j150m1P87J134J823L411N321O512O745O874P877R805J1754
59020E70645J2928J3465J4014J4655J4709J3796J2486J1534J0715R084O352L444
59008G07827J470N85K08J3L02J385L054M855O657Q710J1101J3435J5233J6444
58994G91279J7342J8022J8298J8080J7464J6354J4462J1854R021O031K182k907
$$ plain form
59092 781744 781500 780036 778470 777171 775934 774595 773200 771799 770350 768695 766394 762750 757264 749968
59078 749968 741105 730566 717895 702892 686122 668863 652565 638144 625584 614194 603351 593001
59066 593001 583488 575126 568044 562198 557346 553123 549403 546462 544581 543588 543054 542794 542839 542897 542151 539855
59050 539855 536050 531660 527877 525336 523669 521888 519392 516573 514266 512747 511670 510904 510812 511431 511892
59035 511892 511273 509793 508643 508602 509389 510523 512346 515757 521078 527590 534335 541209 549086 558891 570645
59020 570645 583573 597038 611052 625707 640416 654212 666698 678232 688947 698031 704383 707827
59008 707827 709297 709882 710090 710103 710405 711790 714844 719699 726356 735066 746167 759602 774835 791279
58994 791279 808621 826643 844941 863021 880485 896839 911301 923155 932176 938207 940389 937482
58982I37482q251j2383j5067j7234j9229k0064j8753j5643j1934q509n672l479
58970G81264j673K99K684N063O970Q503R904J0983J1559J2128J3270J4534J4719
58957H90207J3275J0846Q252N565K354j583n982j0253j3801j6437j8522k0287
58945H43634k1130k0039j6876j2710q729n287k198N09K563L782L980K845K14l577
58931G66981p893j2153j5762j8083j8878j8586j7745j6303j3980j1181q902p591
58919E99924o677n481m108l010k104r17N83J909K799L535M436N526O916Q942J1604
58904F23877J4228J6136J7443J8722K0164K1516K2600K3367K3473K2473K0506
58893H44505J8357J6762J6074J6644J8857K2620K7241L2174L7362M2616M7032
$$ plain form
58982 937482 929231 916848 901781 884547 865318 845254 826501 810858 798924 790415 784743 781264
58970 781264 779591 779890 782574 787637 794607 803110 813014 823997 835556 847684 860954 875488 890207
58957 890207 903482 914328 922580 928145 930499 928916 922934 912681 898880 882443 863921 843634
58945 843634 822504 802465 785589 772879 764150 758863 756665 757174 759737 763519 767499 770344 770558 766981
58931 766981 759088 746935 731173 713090 694212 675626 657881 641578 627598 616417 607515 599924
58919 599924 593247 587766 583658 580648 578544 577627 578210 580119 582918 586453 590889 596415 603331 612273 623877
58904 623877 638105 654241 671684 690406 710570 732086 754686 778053 801526 823999 844505
58893 844505 862862 879624 895698 912342 931199 953819 981060 1013234 1050596 1093212 1140244
58882A140244M9454M9259M6450M1324L4364K6197J7342Q043j564j1319k1108l0659
58870A348027l9278m6222n1287n4515n5401n3374m9169m4604m0533l6038l0427
58859H47179k4867k0974j8709j6991j5699j5434j5734j5235j3739j2579j2502
58848F64716j2549j1554r626p524n597m038l344l693m411m682m443m087l835l853
58834E81480m462n555o304o037n157m586m593m708m569m191l519k325o83R02K063
58819E27756K990M076N309O190O328N947N670N791N974N708M815L358J465l99
58805E90978j407j250p91j211k526l647l881l633l481l321k779j942j234q88q45
58790E58142q88o72O2J206K490M005O068Q489J0471J1361J1176J0300R117P920
$$ plain form
58882 1140244 1189698 1238957 1285407 1326731 1361095 1387292 1404634 1412677 1411113 1399794 1378686 1348027
58870 1348027 1308749 1262527 1211240 1156725 1101324 1047950 998781 954177 913644 877606 847179
58859 847179 822312 801338 782629 765638 749939 734505 718771 703536 689797 677218 664716
58848 664716 652167 640613 630987 623463 617866 613828 610484 606791 602380 597698 593255 589168 585333 581480
58834 581480 577018 571463 565159 559122 553965 549379 544786 540078 535509 531318 527799 525474 524791 525693 527756
58819 527756 530746 534822 540131 546321 552649 558596 564266 570057 576031 581739 586554 589912 591377 590978
58805 590978 589571 588321 587530 586319 583793 580146 576265 572632 569151 565830 563051 561109 559875 558987 558142
58790 558142 557254 556582 556644 557850 560340 564345 570413 578902 589373 600734 611910 622210 631327 639247
58776F39247O728N218L382K080K080K672K233M13j360j903j655j480j210l94M01
58761F56452J84j024k318l164l568l321k076j00J851L451M953O478P774Q606Q871
58746F83049Q410P239N973N410N727O460P181P666P654O990O066N505N409N351
58732G74090N093M823M767N039N911P566R498J0714J0726R984R128Q304P381O408
58718H79432N438M309L054K443L458O071Q824J0095R743R074R143R488Q880O854
58704I76306L955P40k677o125r227j2074j5243j8776k1740k3339k3883k4094k3923
58691G99900k2747k0448j7561j4538j1527q867p198o917p853r445j1025j2033
58679F49741j2285j2048j1557j0650r095p111n160l402j609L71K400M250N804
$$ plain form
58776 639247 645975 651193 654575 656655 658735 661407 663640 664053 662693 660790 659135 657655 656445 656051 656452
58761 656452 656636 655612 653294 650130 646562 643241 641165 641065 642916 646367 651320 657798 665572 674178 683049
58746 683049 691459 698698 704671 710081 715808 722268 729449 737115 744769 751759 757825 763330 768739 774090
58732 774090 779183 784006 788773 793812 799723 807289 816787 827501 838227 848211 857339 865643 873024 879432
58718 879432 884870 889179 892233 894676 898134 904205 913029 923124 932867 941941 951084 960572 969452 976306
58704 976306 980261 981001 978324 972199 962972 950898 935655 916879 895139 871800 847917 823823 799900
58691 799900 777153 756705 739144 724606 713079 704212 697014 690097 682244 672799 661774 649741
58679 649741 637456 625408 613851 603201 594106 586995 581835 578433 576824 577195 579595 583845 589649
58666E89649P156Q558J0169J1863J3468J5140J6956J8217J7868J5827J3093J0229
58654G48193O697K343j461l312l734m407n755o681o618o395o701o919o247n011
58640F93992m056l412k460j031M82J981L842O035P732Q189P677P060O564N512
58626G38107L353N47j886l367l933l703k617o97J920N097Q527J1635J4180J6736
58612G83899J9858K2929K4665K4780K4130K3007K0428J5613R237K662l112p212
58600I60884q832q398p915q860j0337j0388q643o465m925l884k881j632K82L081
58586H81087O054Q185R610J1516J4349J7147J8817J9226J8759J7625J6006J4200
58574A052581J2243R898P268M910L172J970J395J900L483N238O277O869Q222J1104
$$ plain form
58666 589649 596805 605363 615532 627395 640863 656003 672959 691176 709044 724871 737964 748193
58654 748193 754890 757233 755772 752460 748726 744319 738564 731883 725265 718870 712169 705250 699003 693992
58640 693992 689936 686524 684064 683033 683515 685496 689338 695373 703105 711294 718971 726031 732595 738107
58626 738107 741460 742007 740121 736754 732821 729118 726501 725804 727724 732821 741348 752983 767163 783899
58612 783899 803757 826686 851351 876131 900261 923268 943696 959309 968546 971208 968096 960884
58600 960884 952052 943654 935739 926879 916542 906154 897511 891046 886121 882237 879356 877724 878006 881087
58586 881087 887141 895326 904936 916452 930801 947948 966765 985991 1004750 1022375 1038381 1052581
58574 1052581 1064824 1074722 1081990 1086900 1090072 1092042 1093437 1095337 1098820 1104058 1110335 1117204 1125426 1136530
58560A136530J4858J7918J9257J9225J8716J7724J5395J1489O987K764j439n990
58548A273434j0023j2262j2789j2874j3197j3311j2921j2617j3015j3940j4888
58537A131597j5737j6707j7890j9000j9440j8742j7150j5482j4085j2338r618
58526I55408o252k919M03M024P521R988J1088J1199J0808J0475J0762J1300J0480
58513A044285P338L298P96M32P72O94L91J78o7n2Q53K326L250L507M256N977P679
58496A085913Q572R084R506R051P274N301M481M548M188K822R17r31k432l467
58482A144827m207m968n527n003k920J10L098N558P292P997P533O092L647o8m637
58467A158824q888j2231j5310j8588k1102k1536k0035j7961j6170j4419j2362
$$ plain form
58560 1136530 1151388 1169306 1188563 1207788 1226504 1244228 1259623 1271112 1278099 1280863 1279424 1273434
58548 1273434 1263411 1251149 1238360 1225486 1212289 1198978 1186057 1173440 1160425 1146485 1131597
58537 1131597 1115860 1099153 1081263 1062263 1042823 1024081 1006931 991449 977364 965026 955408
58526 955408 949156 946237 946640 950664 958185 968173 979261 990460 1001268 1011743 1022505 1033805 1044285
58513 1044285 1051623 1054921 1055717 1056149 1056921 1057615 1058006 1058184 1058117 1058065 1058918 1061244 1064494 1068001 1072257 1078234 1085913
58496 1085913 1094485 1103569 1113075 1122126 1129400 1134701 1139182 1143730 1147918 1150740 1151657 1150726 1148294 1144827
58482 1144827 1140620 1135652 1130125 1125122 1122202 1122312 1125410 1130968 1138260 1146257 1153790 1159882 1163529 1163461 1158824
58467 1158824 1149936 1137705 1122395 1103807 1082705 1061169 1041134 1023173 1007003 992584 980222
58456I80222j0173q046n719k905J66K836M595N434N637N286M132K018p66l739
58442I78978o539q792j0003j0023r324q321o749m270j300J404L651N594P010P634
58428I38950P882Q383R116R946J1483J4207J7118J8678J8845J8665J8089J5906
58416A107268J2073Q220N390K881o8k955n169p043q944j0525j1658j2935j4482
58403A062053j5353j4930j3848j2719j1005q041m301q36J819L589M605N509P051
58390A003593Q784R224P805N616L693J893Q6j025j199j391k097k276j099M71J186
58375A033264J436K260L259L080J411q53k911m331m532l250j242M80J898L676
58361A033645N993Q446J0654J2313J3112J3197J3145J2973J1933R710O887L745
$$ plain form
58456 980222 970049 962003 956284 953379 953545 956381 960976 966410 972047 977333 981465 983483 982717 978978
58442 978978 972439 963647 953644 943621 934297 925976 919227 914957 913657 915061 918712 924306 931316 938950
58428 938950 946832 955215 964331 974277 985760 999967 1017085 1035763 1054608 1073273 1091362 1107268
58416 1107268 1119341 1127561 1132951 1135832 1135764 1132809 1127640 1120597 1111653 1101128 1089470 1076535 1062053
58403 1062053 1046700 1031770 1017922 1005203 994198 986157 981856 981020 982839 986428 991033 996542 1003593
58390 1003593 1012377 1021601 1029406 1035022 1038715 1040608 1040694 1039669 1038470 1037079 1034982 1032706 1031607 1032078 1033264
58375 1033264 1034700 1036960 1040219 1043299 1044710 1043857 1040946 1036615 1032083 1028833 1027591 1028071 1029969 1033645
58361 1033645 1039638 1048084 1058738 1071051 1084163 1097360 1110505 1123478 1135411 1145121 1152008 1155753
58349A155753j62m436p225p403o169n286m637k994k59K572N124P799J0550J2805
58335A156032J4449J5860J7086J7913J8454J8967J9354J9418J9214J8615J7162
58324A352524J4864J2511J0754R632R357J0416J2262J3125J2033J0107R000R080
58312A485665R831J0849J1532J1006R468Q576R471J1351J2862J3840J4749J5553
58300A624753J6127J6698J7073J6614J5631J5358J5798J5357J3607J2401J3025
58289A792442J4165J4352J4428J5830J8059J9853K1330K3072K4530K5193K5907
58278B009161K7191K7756K6641K5311K5611K7101K8497L0176L2936L5775L7293
58267B333449L8246M0328M3493M6570M9394N2353N5086N7545O0918O5433O8897
$$ plain form
58349 1155753 1155591 1151155 1143930 1136527 1130358 1125072 1120435 1117441 1117182 1119754 1124878 1132677 1143227 1156032
58335 1156032 1170481 1186341 1203427 1221340 1239794 1258761 1278115 1297533 1316747 1335362 1352524
58324 1352524 1367388 1379899 1390653 1400285 1409642 1420058 1432320 1445445 1457478 1467585 1476585 1485665
58312 1485665 1495496 1506345 1517877 1528883 1538351 1546927 1556398 1567749 1580611 1594451 1609200 1624753
58300 1624753 1640880 1657578 1674651 1691265 1706896 1722254 1738052 1753409 1767016 1779417 1792442
58289 1792442 1806607 1820959 1835387 1851217 1869276 1889129 1910459 1933531 1958061 1983254 2009161
58278 2009161 2036352 2064108 2090749 2116060 2141671 2168772 2197269 2227445 2260381 2296156 2333449
58267 2333449 2371695 2412023 2455516 2502086 2551480 2603833 2658919 2716464 2777382 2842815 2911712
58256B911712O9540O8750O8699O9182O9098O9084P0048P1037P1414P3112P7718
58245C689394Q3340Q7560R1601R8031J06327J14281J22127J31434J41481J50583
58235D816159J59597J70378J82149J93125K04199K17279K31679K45972K61597
58226F682134K80564L01597L22724L45551L72538M02436M33271M67332N07864
58217A0116011N53327O00780O52484P12986P82031Q57221R41538J041245J158284
58208A7415907J292233J447952J633781J854334K113594K423880K803898L270061
58200C4255640L837740M527310N358680O344016P499128Q861131J0483645J2416743
58192I3584033J4698243J7343523K0304631K3429732K6485964K9222394L1362033
$$ plain form
58256 2911712 2981252 3050002 3118701 3187883 3256981 3326065 3396113 3467150 3538564 3611676 3689394
58245 3689394 3772734 3860294 3951895 4049926 4156253 4270534 4392661 4524095 4665576 4816159
58235 4816159 4975756 5146134 5328283 5521408 5725607 5942886 6174565 6420537 6682134
58226 6682134 6962698 7264295 7587019 7932570 8305108 8707544 9140815 9608147 10116011
58217 10116011 10669338 11270118 11922602 12635588 13417619 14274840 15216378 16257623 17415907
58208 17415907 18708140 20156092 21789873 23644207 25757801 28181681 30985579 34255640
58200 34255640 38093380 42620690 47979370 54323386 61822514 70683645 81167290 93584033
58192 93584033 108282276 125625799 145930430 169360162 195846126 225068520 256430553
58185B56430553L2484729L1926647K8866395K2643066J3188800J348658j1167569
58178C75721279k2311403l0468637l4991157l6167664l4791421l1745779k7825204
58171A57420014k3687307j9796204j6385534j3511051j1146917r237293p704419
58164E5951289o465858n460130m645550l981658l429375k965199k578744k257352
58156B4167423j985005j753207j560024j399211j260439j138810j034620r44773
58148A3091334q62945p87077p18853o56893n97733n42142m93497m50970m10857
58139G570367l73356l41773l16210k94065k75430k61876k51076k38618k24315
58130D993648k11161j99038j85246j70370j57877j48157j38468j28593j21280
$$ plain form
58185 256430553 288915282 320841929 349708324 372351390 385540190 386888848 375721279
58178 375721279 353409876 322941239 287950082 251782418 216990997 185245218 157420014
58171 157420014 133732707 113936503 97550969 84039918 72893001 63655708 55951289
58164 55951289 49485431 44025301 39379751 35398093 31968718 29003519 26424775 24167423
58156 24167423 22182418 20429211 18869187 17469976 16209537 15070727 14036107 13091334
58148 13091334 12228389 11441312 10722459 10065566 9467833 8925691 8432194 7981224 7570367
58139 7570367 7197011 6855238 6539028 6244963 5969533 5707657 5456581 5217963 4993648
58130 4993648 4782487 4583449 4398203 4227833 4069956 3921799 3783331 3654738 3533458
58121C533458j16895j12583j07115j02116r8174r3856q8883q4476q0517p6018
58111B572825p2031p0351o9652o6826o1972n8076n5946n3480n0019m7331m5938
58100A921203m4319m2260m1337m1538m0865l8913l7450l6933l5737l3444l1649
58089A496758l0758k9142k6290k3774k2267k0539j8314j7272j8185j9640k0568
58078A250009k1538k2597k2495k1119k0317k1047k1818k1175j9773j8890j8599
58067A020641j8460j8450j8304j7442j6125j5256j4642j3227j1334j0785j2145
58056H54471j3746j4141j3761j3435j3040j2442j2104j1879j0724q404o104m620
58044G20071l386j943r87j148j967k793l598m378m878n302o149p000o759n439
$$ plain form
58121 3533458 3416563 3303980 3196865 3094749 2996575 2902719 2813836 2729360 2648843 2572825
58111 2572825 2500794 2430443 2360791 2293965 2231993 2173917 2117971 2064491 2014472 1967141 1921203
58100 1921203 1876884 1834624 1793287 1751749 1710884 1671971 1634521 1597588 1561851 1528407 1496758
58089 1496758 1466000 1436858 1410568 1386794 1364527 1343988 1325674 1308402 1290217 1270577 1250009
58078 1250009 1228471 1205874 1183379 1162260 1141943 1120896 1099078 1077903 1058130 1039240 1020641
58067 1020641 1002181 983731 965427 947985 931860 916604 901962 888735 877401 866616 854471
58056 854471 840725 826584 812823 799388 786348 773906 761802 749923 739199 730795 724691 720071
58044 720071 716685 714742 713755 712607 710640 707847 704249 699871 694993 689691 683542 676542 669783 664344
58030F64344m364m221m370m327m515m992n006m431m148m417m318l508l098l885
58016F04744m970n100m244l055j812p95p35j939l640m937n793o504o898o728o233
58001E41361n840n683n769o107o447o484o314o180n770m603k998j759r37J55J730
57986D78355L287M558N602O084N565M597M278M718M972M568L893L139K134J249
57972E36999J133J443J236O35O71J382J688J338J283J737J644N19p61j658k715
57957E46574l973m379l685l283m105n177n385n207n537o087o269o467p060p162
57943D72798n791l549j858j113p03k43L19J243K627L898M563M954N463N683N124
57928D93415M236L785L695L231K034K44j863l840n157n890o696p710q219p957
$$ plain form
58030 664344 659980 655759 651389 647062 642547 637555 632549 628118 623970 619553 615235 611727 608629 604744
58016 604744 599774 594674 590430 587375 585563 584768 584033 582094 578454 573517 567724 561220 554322 547594 541361
58001 541361 535521 529838 524069 517962 511515 505031 498717 492537 486767 482164 479166 477407 476470 476625 478355
57986 478355 481642 486200 491802 497886 503451 508048 512326 517044 522016 526584 530477 533616 535750 536999
57972 536999 538132 539575 540811 541446 542117 543499 545187 546525 547808 549545 551189 551708 550947 549289 546574
57957 546574 542601 538222 534537 531254 527149 521972 516587 511380 505843 499756 493487 487020 479960 472798
57943 472798 467007 463458 461600 460487 459784 459541 459860 461103 463730 467628 472191 477145 482608 488291 493415
57928 493415 497651 501436 505131 508362 510396 510640 508777 504937 499780 493890 487194 479484 471265 463308
57914D63308p689p873p725o569n175m619m557l802k090k25J122J796J692R04J6
57899D18514m99r32j705k557l034l201l195k703j731j178j621k099j268O20K018
57884C95429K109J484R56P19N92K77n36j668k269j925j536k288m045n722o848
57869C74729p644p840o734m551k560j617j417j386j312r11K02J699K516K175J447
57854C46796J285J755K507L557M953O047N947M678L267K648K760K887K531J811
57840C93429J108N86R8n56j461k541l557m282m780n384o091o241n227l453k005
57825C49643j425j409j694k374l073k802j234N04J124P55N38J082K016K771K905
57810C47327J865o70m062o974q561r052r113r073q837q186p025n548m227l426
$$ plain form
57914 463308 455619 447746 440021 433452 428277 423658 419101 415299 413209 412984 414106 415902 417594 418498 418514
57899 418514 418015 417083 415378 412821 409787 406586 403391 400688 398957 397779 396158 394059 392791 393411 395429
57884 395429 397538 399022 399978 400697 401289 401566 401030 399362 397093 395168 393632 391344 387299 381577 374729
57869 374729 367085 359245 352511 347960 345400 343783 342366 340980 339668 338757 338959 340658 343174 345349 346796
57854 346796 348081 349836 352343 355900 360853 366900 372847 377525 380792 383440 386200 389087 391618 393429
57840 393429 394537 395123 395221 394665 393204 390663 387106 382824 378044 372660 366569 360328 355101 351648 349643
57825 349643 348218 346809 345115 342741 339668 336866 335632 336136 337260 338015 338553 339635 341651 344422 347327
57810 347327 349192 348522 344460 337486 328925 319873 310760 301687 292850 284664 277639 272091 267864 264438
57796B64438l145l238l668m281m611m365l843l469l027j965m02P34Q26M06N79
57781B30969J739L160L842L595L115L097L507L940M348N015N851O243N757M554
57767B88732L043J507K50m29p07j308k669m303n279n180m337l405k904k966l240
57752B56805l229k763k046j233l58L93P49P22M76o3r15j486j159m43n55j693k683
57735B40519k720k325k088j577m49M52K21n81p18j11K77Q8o9K45P74J178J292
57718B34408Q55k15j325j766j685j694j688j001K45J002P39J09j54j94m25o93
57702B26518n75p4N12J107J758K195J975J086J29k85k16l55j168k248k719k312
57686B25328j646j379j401j129k17J260L022M735O278Q076J0853J4760J9170K3604
$$ plain form
57796 264438 261293 258055 254387 250106 245495 241130 237287 233818 230791 228826 228424 229158 229984 230390 230969
57781 230969 232708 235868 239710 243305 246420 249517 253024 256964 261312 266327 272178 278421 284178 288732
57767 288732 291775 293282 293532 293103 292396 291088 288419 284116 278837 273657 269320 265915 263011 260045 256805
57752 256805 253576 250813 248767 247534 247176 247569 248318 249040 249516 249453 248538 247052 245893 245450 244895 243202 240519
57735 240519 237799 235474 233386 231809 231360 231812 232033 231452 230734 230623 230900 230988 230919 231164 231938 233116 234408
57718 234408 235263 235048 233723 231957 230272 228578 226890 225889 226134 227136 227875 227984 227830 227636 227211 226518
57702 226518 225943 225869 226381 227488 229246 231441 233416 234502 234631 234346 234130 233775 232607 230359 227640 225328
57686 225328 223682 222303 220902 219773 219556 220816 223838 228573 234851 242927 253780 268540 287710 311314
57672C11314K8420L4179M0735M7345N3183N7331N8620N5797M7587L2725J1141
57661G78377j4144l7424n3864o2390o4559o1735n4791m5664l7057l0245k4553
57650B91951j9215j4605j1306r195p879p086o278m855l150k266k494k784k303
57637A98535j595j515j825j674r69l74k63l50k68K1L48M23m1j010j958k291j931
57620A83263j332j002j081j296j286j045r57j270j668j635j121n38k44l94j058
57605A67336k012k587k289j487r66q80p74m89l86n65o72o09p83j412k141k652
57589A46632l024l275l087k371j601j259j349j654k062k317j995j131m80p44j703
57574A18580k509k608k125j511j043o68k04K37K00n21j367j523q55J9N42O87O30
$$ plain form
57672 311314 339734 373913 414648 461993 515176 572507 631127 686924 734511 767236 778377
57661 778377 764233 726809 672945 610555 545996 484261 429470 383806 346749 316504 291951
57650 291951 272736 258131 246825 237630 229751 222665 216387 211532 208382 206116 203622 200838 198535
57637 198535 196940 195425 193600 191926 190957 190583 190320 189970 189702 189723 190071 190494 190453 189443 187485 185194 183263
57620 183263 181931 180929 179848 178552 177266 176221 175264 173994 172326 170691 169570 169032 168788 168394 167336
57605 167336 165324 162737 160448 158961 157995 157115 156341 155852 155466 154901 154229 153620 152837 151425 149284 146632
57589 146632 143608 140333 137246 134875 133274 132015 130666 129012 126950 124633 122638 121507 121027 120283 118580
57574 118580 116071 113463 111338 109827 108784 108116 107912 108149 108349 107828 106461 104938 104083 104102 104644 105331 105961
57557A05961N03M96P32J003J001Q03O35M02m5k81K49J214J629J145L32l44r30
57540A14505j246q15J44P02O05O99J368J666P59o09j093n61L9J35n5k77m81n09
57522A14976k52l2k16n92p08n26k87mL12L60M1n8N37J313J398Q52M30L63K42L
57502A18152l4n6o78j729k160j601j089j684l030l965l957l276k178q40J10q7
57486I1898j182j887j354l14j46j052j781j280p3M56j64j034j160o35k61m32q27
57469G8772j048j082j087j039q55o84p76r73o14O31J949K007O60n49k13J122J671
57452G7892P60n60j149j008n77Q5Q07R22K01m83k78L95N66K38J61L70O6r38j694
57433G5776j353k70N73O35K9q86j699k045j918j678j548j323p80j17K92M77P95
$$ plain form
57557 105961 106464 106960 107692 108695 109696 110499 111134 111536 111491 111210 111459 112673 114302 115447 115779 115435 114505
57540 114505 113259 112444 112588 113290 113895 114594 115962 117628 118387 117778 116685 116124 116163 116298 116243 115966 115485 114976
57522 114976 114724 114692 114476 113884 113176 112650 112363 112359 112671 113031 113072 113014 113551 114864 116262 117114 117544 117907 118149 118152
57502 118152 118118 118062 117384 115655 113495 111894 110805 109121 106091 102126 98169 94893 92715 91875 91985 91898
57486 91898 90716 88829 87475 87161 87015 85963 84182 82902 82829 83285 83121 82087 80927 80292 80031 79599 78772
57469 78772 77724 76642 75555 74516 73661 72977 72201 71228 70614 71245 73194 75201 75861 75312 75099 76221 77892
57452 77892 78652 78092 76943 75935 75358 75443 76250 77172 77373 76890 76612 77007 77573 77811 77972 78342 78408 77470 75776
57433 75776 74423 74153 74726 75361 75390 74504 72805 70760 68842 67164 65616 64293 63513 63396 63688 64165 64960
57416F4960J324J643J357O70R6k07n08q64q81l66J96K46o0k06j97l58m86j14L80
57397F6625k0j306k123j643q17q61j460j491q70n35q40j147r42l55L75J059J247
57380E4896O32k00l52O1pr99k189k761k634k025j090k57o7m30p39q65j177j423
57362C8374p02R45K077J680N12j00JK00L51N87N28j23o35j03J021J394O28l62
57344D6273q86j180j491j527j109n51oP01J365J285K97p70j152r98p89n89m05
57327C8468o79j707k971l639l409k457r84N79J350P69n80j557j738j539j339j177
57311A7390j217j694k305k340j620p53l46l76n03m87j83L71P41N32R0J46O41O27
57293H714l14j362j696j656A720f74k149j247n23l91m37l18k05j29L44J465a448
$$ plain form
57416 64960 66284 67927 69284 69954 70050 69843 69335 68471 67590 67224 67420 67666 67606 67400 67203 66845 66359 66245 66625
57397 66625 66605 65299 63176 61533 60716 59855 58395 56904 56034 55499 54659 53512 52570 52215 52590 53649 54896
57380 54896 55528 55328 54976 55037 55030 54031 51842 49081 46447 44422 43332 43075 43008 42578 41839 40974 39797 38374
57362 38374 37672 38617 40694 42374 42886 42786 42787 42987 43338 43925 44453 44330 43695 43592 44613 46007 46635 46273
57344 46273 45387 44207 42716 41189 40080 39529 39523 40224 41589 42874 43171 42401 41249 40251 39462 38873 38468
57327 38468 37789 36082 33111 29472 26063 23606 22622 23201 24551 25320 24740 23183 21445 19906 18567 17390
57311 17390 16173 14479 12174 9834 8214 7461 7115 6739 6236 5749 5566 5937 6678 7210 7300 7446 8087 8714
57293 8714 8400 7038 5342 3686 1720 -674 -2823 -4070 -4593 -4984 -5421 -5739 -5944 -6073 -5729 -4264 -1448
57275B371M387M750N103N568O193O715O595N643M364L425K902K350J459M07m25
57260F1807q64j090j393j840k152k044j724j830k692l787m111l183j576l63j22
57245C3036n99j252j884k523k990l006k620k148j661j037n45p41j509j862j194
57230G465k10Pn81j140j217j067r33p32m50j93J48P07J165J063N82M49J097K397
57212H557L998N379N781M998M067M243N317N924N479M747M330L891L245K909K937
57197G5802K376P06j103j938k105k506l023k877k140j750k157k971l875n029o495
57182D0915p975r167r929C706f041q903p601n662l411j912j909k779l247k852
57168d4317k049j195k74M73O04L02M33J445K710L256K882K270K145K495K696K354
$$ plain form
57275 2371 6758 11508 16611 22179 28372 35087 41682 47325 51689 55114 58016 60366 61825 62232 61807
57260 61807 60943 59853 58460 56620 54468 52424 50700 48870 46178 42391 38280 35097 33521 33158 33036
57245 33036 32437 31185 29301 26778 23788 20782 18162 16014 14353 13316 12771 12030 10521 8659 7465
57230 7465 7255 7262 6681 5541 4324 3257 2324 1592 1142 949 1097 1804 2969 4032 4614 5063 6160 8557
57212 8557 12555 17934 23715 28713 32780 37023 42340 48264 53743 58490 62820 66711 69956 72865 75802
57197 75802 78178 78884 77781 75843 73738 71232 68209 65332 63192 61442 59285 56314 52439 47410 40915
57182 40915 32940 23773 13844 3706 -6041 -14944 -22545 -28207 -31618 -33530 -35439 -38218 -41465 -44317
57168 -44317 -46366 -47561 -47835 -47362 -46758 -46456 -46023 -44578 -41868 -38612 -35730 -33460 -31315 -28820 -26124 -23770
57152b3770J872J889K367K855L551N194A684R945J1010J1536J2503J4016J5897
57139G6591J8605K2501K6876L0838L4540L8348M1171M1037L7225L0729K2818J4452
57127D35731O980J926m01j105j291j390j962m044q225j4141k1161k8852l6729
57114C25336m4409n2334o1470p2092A1348h4824j10354j26771j45337j66299j90859
57103h24444k20287k55195k96048l43719l99296m64145n40552o31506p39224q64046
57093e578462j004356j156581j315050j472639j621608j753141j857087j924984
57085a7683908j955122j954613j937571j923924j939599k010835k147795k325653
57077c3879020k478357k513072k340463j907977j221619l45880O17282J557524
$$ plain form
57152 -23770 -21898 -20009 -17642 -14787 -11236 -6042 1684 11629 22639 34175 46678 60694 76591
57139 76591 95196 117697 144573 175411 209951 248299 289470 330507 367732 398461 421279 435731
57127 435731 442711 444637 444236 443131 441840 440450 438488 434444 426219 412078 390917 362065 325336
57114 325336 280927 228593 167123 95031 11348 -84824 -195178 -321949 -467286 -633585 -824444
57103 -824444 -1044731 -1299926 -1595974 -1939693 -2338989 -2803134 -3343686 -3975192 -4714416 -5578462
57093 -5578462 -6582818 -7739399 -9054449 -10527088 -12148696 -13901837 -15758924 -17683908
57085 -17683908 -19639030 -21593643 -23531214 -25455138 -27394737 -29405572 -31553367 -33879020
57077 -33879020 -36357377 -38870449 -41210912 -43118889 -44340508 -44686388 -44069106 -42511582
57069d2511582K379114L013538L425284L612626L601862L436202L164477K833133
57061a7045346K481011K136317J816655J531588J284991J076156R01187P55359
57053e062082O34598N35144M52915L83983L25457K75580K33377J98301J69704
57044a853023J46382J26894J10441R6995Q6391P7825P0419O3869N8277N3667M9897
57033i11966M6807M4135M1494L8502L4935L0810K6488K2667J9958J8556J8383
57022e69231J9499K1930K5226K8437L0588L1088K9861K7297K3994K0335J6605
57011b94371J3506J2003J2177J2753J2439J1383J0653J0606J0623J0284R862R571
56999a58511R190Q714Q597Q946R080Q334O947N752N253N305N516N732O232P434
$$ plain form
57069 -42511582 -40132468 -37118930 -33693646 -30081020 -26479158 -23042956 -19878479 -17045346
57061 -17045346 -14564335 -12428018 -10611363 -9079775 -7794784 -6718628 -5817441 -5062082
57053 -5062082 -4427484 -3892340 -3439425 -3055442 -2729985 -2454405 -2221028 -2022727 -1853023
57044 -1853023 -1706641 -1579747 -1469306 -1372311 -1285920 -1208095 -1137676 -1073807 -1015530 -961863 -911966
57033 -911966 -865159 -821024 -779530 -741028 -706093 -675283 -648795 -626128 -606170 -587614 -569231
57022 -569231 -549732 -527802 -502576 -474139 -443551 -412463 -382602 -355305 -331311 -310976 -294371
57011 -294371 -280865 -268862 -256685 -243932 -231493 -220110 -209457 -198851 -188228 -177944 -168082 -158511
56999 -158511 -149321 -140607 -132010 -123064 -113984 -105650 -98703 -92951 -87698 -82393 -76877 -71145 -64913 -57479
56985e7479R239J0779J1150J0382f699A404O701M717K305l65l310E369b169o952
56971i121n047l403k777k511j674k80R54J791K915M991f554C062J0463J0692J1100
56956C5317J1766J2255J2200J1264Q964N203P32l421o779r199j0156r119o567
56943E2460l803j631J37J904L762N867Q464J1232J3368J4757J6286J8525K0713
56930A62041K1640K0977J9088J6005J1361N208j770q737j4869j9232k1129k0684
56918A69899j8773j6329j3961j2040j0608r259p539n648m322l913l860l290k008
56905E8349o72pl0q6L82J235J859J925J704J705K266L527N476P831J0113J2075
56889A07652J3931J5950J8010J9710K0778K1081K0364J8242J4527R461L756j529
$$ plain form
56985 -57479 -48240 -37461 -26311 -15929 -6699 1404 8105 12822 15127 14762 11452 5369 -2169 -9121
56971 -9121 -14168 -17571 -20348 -22859 -24533 -24813 -23859 -22068 -19153 -14162 -6554 3062 13525 24217 35317
56956 35317 47083 59338 71538 82802 91766 96969 97701 94280 87501 78302 68146 59027 52460
56943 52460 48657 47026 47163 49067 52829 58696 67160 78392 91760 106517 122803 141328 162041
56930 162041 183681 204658 223746 239751 251112 256320 254550 245813 230944 211712 190583 169899
56918 169899 151126 134797 120836 108796 98188 88929 81390 75742 71420 67507 63647 60357 58349
56905 58349 57677 57670 57640 57554 57936 59171 61030 62955 64659 66364 68630 72157 77633 85464 95577 107652
56889 107652 121583 137533 155543 175253 196031 217112 237476 255718 270245 279706 283462 281933
56877B81933n363p334p845p528o483m363j211K136M669O218P628R980J3672J8216
56863C04325K2839K7098L0939L4368L7234L9246L9818L7832L1880K1268O986q383
56851F25450k1912l1622l6826l7631l4506k8399k0786j3066n768J331Q330J4882
56839D19477K0950K7308L4705M2786N0398N6809O1942O5373O5741O1437N1385
56828I58311L5133J3070j2677l7892n7755o9227p2160o8522o0908n1520m1773
56817E34080l2278k3139j4312n827K248R906J7256K4421L1263L7237M1704M4396
56805F66955M5241M3654L8267K7747J1946p565k7815m5180n6523o0563n8424n2689
56793E25051m5627l8303l1057k4265j8301j3029p779k046L943R488J4105J7788
$$ plain form
56877 281933 276570 269236 261391 253863 247380 243017 241806 243942 248611 254829 262457 272437 286109 304325
56863 304325 327164 354262 385201 419569 456803 496049 535867 573699 605579 626847 633833 625450
56851 625450 603538 571916 535090 497459 462953 434554 413768 400702 394934 396265 404595 419477
56839 419477 440427 467735 502440 545226 595624 652433 714375 779748 845489 906926 958311
56828 958311 993444 1006514 993837 955945 898190 828963 756803 688281 627373 575853 534080
56817 534080 501802 478663 464351 458524 460772 470678 487934 512355 543618 580855 622559 666955
56805 666955 712196 755850 794117 821864 833810 826245 798430 753250 696727 636164 577740 525051
56793 525051 479424 441121 410064 385799 367498 354469 346690 344644 348587 358075 372180 389968
56781C89968K0636K2537K3304K2812K0636J5842P674l337j5257k5864l3654l7882
56769D07415l8286l5320l0462k5590k1781j8882j6271j3767j1666j0114q842p539
56757A68895o218n080m179l435k919k845l199l572l520k984k218j461p96k37J43
56742A26375J72l20j144j664j369o39l75p26q25j53M98J60p49j028n31l44r68
56725A16370j501j035J4O43O79P42J155J621J846J930K023J971J440L75o94r71
56709A26608k59O21O87Qm26o4N73Q26P60P60Q24P18M19J4n20j030j112o66j63
56690A28578J2O8K79M32L06K45O39J173J271R90Q09P71M82j76r58j737k480k830
56672A27874k351j192K5R04J370J323Q27M65P57J286J215O07L47O88Q16K05m95
$$ plain form
56781 389968 410604 433141 456445 479257 499893 515735 523409 520072 504815 478951 445297 407415
56769 407415 369129 333809 303347 277757 255976 237094 220823 207056 195390 185276 176434 168895
56757 168895 162677 157597 153418 149983 147064 144219 141020 137448 133928 130944 128726 127265 126469 126232 126375
56742 126375 126547 126227 125083 123419 122050 121411 121036 120310 119485 119332 119830 119990 119241 118213 117682 117338 116370
56725 116370 114869 113834 113848 114491 115170 115912 117067 118688 120534 122464 124487 126458 127898 128273 127579 126608
56709 126608 126349 126970 127657 127665 127239 127175 127748 128574 129334 130094 130918 131636 132055 132069 131549 130519 129407 128741 128578
56690 128578 128590 128658 128937 129369 129675 129920 130559 131732 133003 133993 134802 135573 136055 135879 134921 133184 130704 127874
56672 127874 125523 124331 124356 125260 126630 127953 128780 129245 130002 131288 132503 133110 133457 134145 134961 135166 134671
56655A34671m91K4L84N32Q33J233J280Q93N16N76J041J486J348L92q46j351p05
56638A41816M44J223J514J725J952J885J376N13n96j604j741n68J053J590O55
56623A51237n09o90j91j11p30j349j503j447j423j204o96l37m55o34k38N99J076
56606A41395P21j52r48j307j085l15N72R49O86L79N61J008J137Q84P38R66J309
56589A47498J400J182P81K74k11l88k4P89J634J997J637Q22K20L66J136J823J747
56572A62683Q60j90n29J96J386J975J585J052J489K948M412N061N045M901M766
56557A97640M486M125L861L544K859J883J059O04L39J63K83P44J121J000N13N1
56541B24275k92o02p24n21m29j003j875k000j202o76j344k476k796k360k245k676
$$ plain form
56655 134671 134180 134204 134588 135120 135953 137186 138466 139359 139875 140451 141492 142978 144326 144718 143872 142521 141816
56638 141816 142260 143483 144997 146722 148674 150559 151935 152448 151852 150248 148507 147939 148992 150582 151237
56623 151237 150728 150038 149847 149736 149006 147657 146154 144707 143284 142080 141384 141047 140592 139958 139720 140319 141395
56606 141395 142116 141964 141016 139709 138624 138309 138881 139830 140516 140895 141456 142464 143601 144485 145223 146189 147498
56589 147498 148898 150080 150861 151135 150924 150536 150512 151301 152935 154932 156569 157391 157611 157977 159113 160936 162683
56572 162683 163543 163353 162824 163020 164406 166381 167966 169018 170507 173455 177867 182928 187973 192874 197640
56557 197640 202126 206251 210112 213656 216515 218398 219457 220061 220400 220563 220846 221590 222711 223711 224224 224275
56541 224275 223983 223381 222657 222136 221707 220704 218829 216829 215627 214951 213607 211131 208335 205975 203730 201054
56525B01054k746k054j378j284j200n46O7l25j514k354k291j851j696j791j627
56510A78464q95J45Q08O45K3j78K95P42N43O8N0M50N23j37j172j915j930j211
56492A75318k42L35L77L35M43L09k68o57k23O13R32O22L73N30P24O07K58j23k93
56473A79970J31J222K274K501K034J564J187M97k98l96L47J115J351J371J443
56458A96313J197L82m70o64j60O58J460J934J804J191O00K78K5k41k61K0K83L53
56440B04702L34J49m00r93j008n51l75o11n01K39Q68R18R58J370J439O17k78k79
56422B06598J03l06j329j618o29P12J362J170N16j43k85L46J259J650J400J075
56406B11881R89Q84N14K5l87o50o69m15q9J60M90R61J175Q64M86N43O51J62n40
$$ plain form
56525 201054 198308 196254 194876 193592 192392 191846 191913 191588 190074 187720 185429 183578 181882 180091 178464
56510 178464 177569 177714 178522 179167 179190 179012 179307 180049 180592 180660 180710 181160 181683 181546 180374 178459 176529 175318
56492 175318 175076 175411 175788 176123 176566 176875 176607 175950 175727 176340 177272 177894 178267 178797 179521 180128 180386 180263 179970
56473 179970 180101 181323 183597 186098 188132 189696 190883 191380 191082 190686 191033 192148 193499 194870 196313
56458 196313 197510 197892 197422 196758 196598 197256 198716 200650 202454 203645 204245 204523 204548 204307 204046 204066 204349 204702
56440 204702 205036 205185 204785 203792 202784 202233 201858 201247 200746 200985 201853 202771 203729 205099 206538 207155 206877 206598
56422 206598 206701 206395 205066 203448 202819 203531 204893 206063 206579 206436 206151 206497 207756 209406 210806 211881
56406 211881 212870 213754 214268 214293 213906 213256 212587 212172 212083 212243 212733 213694 214869 215733 216219 216762 217413 217575 217035
56387B17035m33N03J130Q92N86J023J801K083J841J588J391R42K93o1J36O38J042
56370B32430J056N74k29q92j062p76l17J45N49P81P36M83K15M7l6q2j28k07l19
56351B32968l90l03Q1P71J490J796J586J403J932L089L944L687K513J315P11N90
56335B57183O19Q10J334J944K041J465Q57Q56J205J120M46j29q4K94N36O60Q58
56318B72015R56P17L34J66K01K43L78P17R06N30j11j98N68J676K558L083L227
56301B87966K841K096J712K246L314L901L430K278J222O39L54J71K41Q06J734
56286C14951K556K917K840K571K451K810L637M335M228L413K793L109M215N432
56272C62258O244O573O671O885P236P228O505N582N371N914O369O308O242O535
$$ plain form
56387 217035 216602 217105 218235 219127 219713 220736 222537 224620 226461 228049 229440 230382 230675 230614 230750 231388 232430
56370 232430 233486 234060 233831 232939 231877 231101 230784 230929 231478 232259 232995 233478 233693 233740 233704 233622 233494 233287 232968
56351 232968 232578 232275 232356 233127 234617 236413 237999 239402 241334 244423 248367 252054 254567 255882 256593 257183
56335 257183 257802 258612 259946 261890 263931 265396 266253 267109 268314 269434 269880 269751 269667 269961 270497 271157 272015
56318 272015 272971 273688 274022 274188 274389 274632 275010 275727 276633 277163 277052 276854 277422 279098 281656 284739 287966
56301 287966 290807 292903 294615 296861 300175 304076 307506 309784 311006 311645 311999 312170 312411 313217 314951
56286 314951 317507 320424 323264 325835 328286 331096 334733 339068 343296 346709 349502 352611 356826 362258
56272 362258 368502 375075 381746 388631 395867 403095 409600 415182 420553 426467 432836 439144 445386 451921
56258D51921O758O658O870Q006R693J1285J2835J4718J6852J9118K1855K5121
56246F11690K8053K9854L0886L1948L2968L3412L3405L3295L2517L0156K6366
56235I54550K2089J7605J2521O931J397m096r878j5423j9722k2843k5768k8612
56223H88751l0377l0713l0474l0208k9423k7846k6125k4625k2754k0199j7791
56212E98216j6307j5308j3959j2230j0565r099p859p070o644o013n057m487m645
56199D78973m690l750k291j480j564j705j192k07N40N31q6o03m89m1J79L48J075
56182D63548K066K168J047k25p16p81j005j045l74N96J117J284J716K453L034
56167D74883L306L461L569L691M080M706N087N210O019Q125J0544J1732J1603
$$ plain form
56258 451921 458679 465337 472207 480213 489906 501191 514026 528744 545596 564714 586569 611690
56246 611690 639743 669597 700483 732431 765399 798811 832216 865511 898028 928184 954550
56235 954550 976639 994244 1006765 1013696 1015093 1010997 1001119 985696 965974 943131 917363 888751
56223 888751 858374 827661 797187 766979 737556 709710 683585 658960 636206 616007 598216
56212 598216 581909 566601 552642 540412 529847 520748 512889 505819 499175 493162 488105 483618 478973
56199 478973 474283 470533 468242 466762 465198 463493 462301 462094 462634 463165 463079 462476 461987 461946 462125 462473 463548
56182 463548 465614 467782 468829 468604 467888 467107 466102 465057 464683 465279 466396 467680 469396 471849 474883
56167 474883 478189 481650 485219 488910 492990 497696 502783 507993 514012 522137 532681 544413 556016
56154E56016J1517J2320J3468J4179J4580J5230J6145J6882J7384J8280K0293
56143G26294K3542K7553L1873L6445M1335M6439N1714N7372O3443O9455P4988
56132A250453Q0114Q4564Q6888Q5468Q0213P2328O2673N1680M0902L2898K8830
56121A957011K7088K5015K1066J4909O630l141j2993k1533k8101l2547l5154l7290
56109A880960m1153m8073n7414o7357p6016q1641q3012q0321p4808o7139n7221
56098A146805m5975l5776k8248k2805j8234j4458j1720r353o715m303k694j179
56086I45345J193M028O336Q132J0021J1869J3105J3868J4663J5378J5646J5631
56074A075215J5485J4626J2644J0279Q576P706P498Q239R849J1138J1082J0204
$$ plain form
56154 556016 567533 579853 593321 607500 622080 637310 653455 670337 687721 706001 726294
56143 726294 749836 777389 809262 845707 887042 933481 985195 1042567 1106010 1175465 1250453
56132 1250453 1330567 1415131 1502019 1587487 1667700 1740028 1802701 1854381 1895283 1928181 1957011
56121 1957011 1984099 2009114 2030180 2045089 2051719 2048578 2035585 2014052 1985951 1953404 1918250 1880960
56109 1880960 1839807 1791734 1734320 1666963 1590947 1509306 1426294 1345973 1271165 1204026 1146805
56098 1146805 1100830 1065054 1036806 1014001 995767 981309 969589 960236 953521 949218 946524 945345
56086 945345 946538 950566 956902 965034 975055 986924 1000029 1013897 1028560 1043938 1059584 1075215
56074 1075215 1090700 1105326 1117970 1128249 1136825 1144531 1152029 1160268 1170117 1181255 1192337 1202541
56062A202541R658R797J0578J2299J4685J6292J6261J5686J5911J6487J6350J5841
56050A372386J5850J5844J4772J3215J2797J3884J5546J7211J8756J9701J9966
56039A549928K0798K3187K6029K7553K7887K8371K9210K9756L0377L1898L3803
56028A858797L5063L6177L8308M1031M3118M4875M7406N0182N1833N2772N4487
56017B354049N6626N7563N7596N8777O1593O4567O7219P0649P4928P8512Q0759
56006C082838Q2712Q5136Q7972R1904R7967J05470J12537J18916J25949J33893
55996D125294J41730J49539J58506J68556J78556J88787K00681K14258K28429
55987E754336K43492K60515K78782K97054L16803L40680L68169L96655M26465
$$ plain form
56062 1202541 1212199 1221996 1232574 1244873 1259558 1275850 1292111 1307797 1323708 1340195 1356545 1372386
56050 1372386 1388236 1404080 1418852 1432067 1444864 1458748 1474294 1491505 1510261 1529962 1549928
56039 1549928 1570726 1593913 1619942 1647495 1675382 1703753 1732963 1762719 1793096 1824994 1858797
56028 1858797 1893860 1930037 1968345 2009376 2052494 2097369 2144775 2194957 2246790 2299562 2354049
56017 2354049 2410675 2468238 2525834 2584611 2646204 2710771 2777990 2848639 2923567 3002079 3082838
56006 3082838 3165550 3250686 3338658 3430562 3528529 3633999 3746536 3865452 3991401 4125294
55996 4125294 4267024 4416563 4575069 4743625 4922181 5110968 5311649 5525907 5754336
55987 5754336 5997828 6258343 6537125 6834179 7150982 7491662 7859831 8256486 8682951
55978H682951M60867N01018N45124N92831O46275P06633P73876Q50174R39367
55969A4699116J043041J161700J299802J464961J662695J897760K180921K529121
55961B7939117K959369L487968M133683M913335N835590O910033Q164873R647874
55953G3991842J1408903J3485515J5889864J8574874K1397400K4132025K6532317
55946B05412740K8349245K9244670K8675877K5911412K0274385J1560183M27145
55939C49855657j1527168k2200459k9795819l3524201l3739813l1498003k7951775
55932A59618419k3987126k0157527j6749971j3860736j1470919r518699p937706
55925E5935735o661009n624108m776624m083353l513383l037908k638053k304004
$$ plain form
55978 8682951 9143818 9644836 10189960 10782791 11429066 12135699 12909575 13759749 14699116
55969 14699116 15742157 16903857 18203659 19668620 21331315 23229075 25409996 27939117
55961 27939117 30898486 34386454 38520137 43433472 49269062 56179095 64343968 73991842
55953 73991842 85400745 98886260 114776124 133350998 154748398 178880423 205412740
55946 205412740 233761985 263006655 291682532 317593944 337868329 349428512 349855657
55939 349855657 338328489 316128030 286332211 252808010 219068197 187570194 159618419
55932 159618419 135631293 115473766 98723795 84863059 73392140 63873441 55935735
55925 55935735 49274726 43650618 38873994 34790641 31277258 28239350 25601297 23297293
55917B3297293k024716j786290j580203j404284j254591j123812j008118r08138
55909A2207141q22097p44676o73724o11667n59142n12896m70999m34470m02604
55900F974866l72055l41971l15136k92566k71542k50362k30723k13944j98788
55891D487779j84454j71973j61269j50306j38496j27829j19417j11927j04417
55882C217691r7717r2159q6968q2767q1654q3730q6382q7755q8126q7149q3161
55871B260123p6493p0357o6830o4443o1251n7770n5261n3282n0731m7623m4503
55860A611579m1491l8889l7270l6188l4414l1986l0310k9735k8974k7432k6085
55849A248805k5448k4726k3757k3633k4534k5009k4336k3658k3741k3577k2309
$$ plain form
55917 23297293 21272577 19486287 17906084 16501800 15247209 14123397 13115279 12207141
55909 12207141 11385044 10640368 9966644 9354977 8795835 8282939 7811940 7377470 6974866
55900 6974866 6602811 6260840 5945704 5653138 5381596 5131234 4900511 4686567 4487779
55891 4487779 4303325 4131352 3970083 3819777 3681281 3553452 3434035 3322108 3217691
55882 3217691 3119974 3027815 2940847 2858080 2776426 2692696 2606314 2518559 2430433 2343284 2260123
55871 2260123 2183630 2113273 2046443 1982000 1920749 1862979 1807718 1754436 1703705 1656082 1611579
55860 1611579 1570088 1531199 1493929 1457741 1423327 1391341 1361031 1331296 1302322 1274890 1248805
55849 1248805 1223357 1198631 1174874 1151241 1126707 1101698 1077362 1053704 1029963 1006386 984077
55838I84077k0694j9556j8517j7318j6702j6844j6663j5692j4985j5041j4602
55827G97463j2815j0875j0123r956r231q370q580r948j1648j3152j4111j4005
55815F64649j3022j2385j2796j3492j3595j3239j2498j0668p764n363m521l988
55803E41318j992J101L466M420M867N569O383O944P023O353N019L682K743J712
55789E98608N9j844l335m334m912m732l798l185l987o045q551j1314j4442j7194
55775E10994j8231j7018j4294j1255q742p034n858m635l086j485l71k43j428l577
55761D13737n426n912n561n759o698p206o790o321o255n682m048k438k075k527
55747C41039k488j510j4J569K762K973K410K255L023L631L001J597K81j178l113
$$ plain form
55838 984077 963383 943827 925310 907992 891290 874446 857783 842091 827106 812065 797463
55827 797463 784648 773773 763650 753694 744463 736093 727513 717565 705917 692765 678654 664649
55815 664649 651627 639242 626446 612954 599359 586120 573622 562954 555190 549827 545306 541318
55803 541318 539326 540427 543893 548313 553180 558749 565132 572076 579099 585452 590471 594153 596896 598608
55789 598608 598667 596823 593488 589154 584242 579510 575712 572527 568540 562495 553944 542630 528188 510994
55775 510994 492763 475745 461451 450196 441454 434420 428562 423927 420841 419356 418985 418742 417314 413737
55761 413737 408311 402399 396838 391079 384381 377175 370385 364064 357809 352127 348079 345641 343566 341039
55747 341039 338551 337041 337027 338596 341358 344331 346741 348996 352019 355650 358651 360248 360529 359351 356238
55732C56238m394l629j340N35J067Q67M67l56j686l200m829o607p928q009p089
55717C10107o158n584m954m222l854l804l401k456j575j104o46J05Q19J172J344
55702B75789J604J798J581P77n38j991l008l325l351l621m004l872k986j759q00
55687B52294n12q84j285p62Q66K481K901K389K273L139M198M476L929L108K280
55672B80891J239j77j621k385k171j596j551j995j921q21N11J027P73O22J147
55657B71972K266L546M321M033L046K544L041L577L111K006J207O71k99j575k353
55642C01114k542k796l313l761m260n287o524p044o717o338o211n776m898m283
55628B31364m159l754k637j557j237j250q34r2M12N98O27L35l44q03n30j01n28
$$ plain form
55732 356238 351844 348215 346875 347410 348477 349344 349811 349455 347769 344569 339740 333133 325205 317196 310107
55717 310107 303949 298365 293411 289189 285335 281531 278130 275674 274099 272995 272349 272454 273273 274445 275789
55702 275789 277393 279191 280772 281549 281011 279020 276012 272687 269336 265715 261711 257839 254853 253094 252294
55687 252294 251782 250898 249613 248851 249717 252198 255099 257488 259761 262900 267098 271574 275503 278611 280891
55672 280891 282130 281953 280332 277947 275776 274180 272629 270634 268713 267892 268403 269430 270203 270825 271972
55657 271972 274238 277784 282105 286138 289184 291728 294769 298346 301457 303463 304670 305341 305042 303467 301114
55642 301114 298572 295776 292463 288702 284442 279155 272631 265587 258870 252532 246321 240545 235647 231364
55628 231364 227205 223451 220814 219257 218020 216770 215936 215844 216256 216854 217481 217816 217472 216669 216139 216038 215510
55611B15510j829l001l458l653m117m525m176k983j607p11m32n67r75j610k229
55596A79637k411j980j248o71l38n3J95J53k71p58q71m74J99Q11J169J324J459
55579A75872J737K233K963L809M520M956N314N769O017N595M699M130M219M297
55565B36130L586K108L16j598l506m889n278n019m906n183n378n064m362l736
55551A93221l589l905m126l642k641j958j867j710j190j068j775k150q90J270
55537A63980K257J398M4n69o57p75p46l55J8J24L37P81P89J4p30n25K76O01J94
55518A66456k99n03p05j109j370j091l70K97M46j3p16j157j198j150j284j480
55502A54754j514j402j267j101q81p30p55q78j013j161j201q41j2Q72J352J427
$$ plain form
55611 215510 213681 210680 207222 203569 199452 194927 190751 187768 186161 185450 185018 184451 183476 181866 179637
55596 179637 177226 175246 173998 173327 172989 172936 173131 173284 173013 172255 171384 170910 171109 171920 173089 174413 175872
55579 175872 177609 179842 182805 186614 191134 196090 201404 207173 213190 218785 223484 227614 231833 236130
55565 236130 239716 241824 242140 240542 237036 232147 226869 221850 216944 211761 206383 201319 196957 193221
55551 193221 189632 185727 181601 177959 175318 173360 171493 169783 168593 167525 165750 163600 162710 163980
55537 163980 166237 167635 167679 167110 166453 165678 164932 164577 164595 164719 165056 165837 166626 166640 165910 165385 165661 166262 166456
55518 166456 166157 165654 164949 163840 162470 161379 161009 161306 161752 161739 161023 159866 158668 157518 156234 154754
55502 154754 153240 151838 150571 149470 148589 147859 147104 146226 145213 144052 142851 142010 141998 142870 144222 145649
55486A45649J344J061L48o47j296j169n58j41k15m30l26O3L00J43j85k89JN53
55468A44206J035J066N74O0J75Q27J182O95k17q21r14p06l24K3j55j011j862j941
55450A41892j342o22J19R78J390O36q43j713j474r26o99l42O05J556J644R98M77
55433A42334M96P25P42M93J67m0m1O3J28J72L15N45Q27J341K206L012L136K522
55415A59143J689R85M09J71O96J778K397J751J01j698k962l336k801j910j531
55400A54882j915k380k186j393n89j24lj29l83o81j089j586j716j001K12R12O47
55383A41478qm09n65o01k42N93J297J221M59l85q67q00k46K76J42m25m24M98J390
55364A42382J360P73M01O4q58k092k643k155j189l21K77N08M01L22N27O75L86
$$ plain form
55486 145649 146993 148054 148402 147755 146459 145290 144732 144591 144376 143946 143620 143683 143983 144126 143941 143652 143653 144206
55468 144206 145241 146307 146881 146941 147116 147943 149125 149820 149603 148782 147868 147162 146838 146861 146706 145695 143833 141892
55450 141892 140550 139928 140047 141025 142415 143051 142208 140495 139021 138095 137396 137054 137659 139215 140859 141857 142334
55433 142334 142830 143555 144297 144790 144957 144917 144876 144939 145067 145239 145554 146099 146926 148267 150473 153485 156621 159143
55415 159143 160832 161817 162226 162397 163093 164871 167268 169019 169120 167422 164460 161124 158323 156413 154882
55400 154882 152967 150587 148401 147008 146419 146295 146292 146163 145780 145099 144010 142424 140708 139707 139919 140831 141478
55383 141478 141470 141061 140496 139895 139653 140246 141543 142764 143223 142838 141971 141171 140925 141201 141343 140918 140494 140992 142382
55364 142382 143742 144515 144916 144980 144122 142030 139387 137232 136043 135722 135999 136507 136908 137230 137757 138432 138818
55347A38818j5n8p0o36j372j346o02k23n86p83m1J147J921K206K343K167J237
55330A44107k82j582j984j471n88j5j15o48j027r00l14O09J707K460K164P71p47
55313A42145j267n99M89J112R32J89n63q57o45l46l92p66j087j066p58l99n4M04
55295A36472J077J822K334K411K068J394N04l51p79n85k5M02M30K10L2k8j82o16
55277A46590j145j357j235j323j931k426j895m69P03R80R44J240J481R46j09p16
55261A40278n37k04l21p95j173j186q45m06k21l12j66O13J573J788R95j12o96
55244A38273n14J01N57K87p57j763j700m74Q57J159K69j004j610r74N45J835K024
55227A37111J302N02o7p34j494j639p60M68R99N88j10l84j8P15J249J097L93j30
$$ plain form
55347 138818 138803 138745 138675 138039 136667 135321 134719 134496 133910 133127 133086 134233 136154 138360 140703 142870 144107
55330 144107 143825 142243 140259 138788 138200 138185 138070 137422 136395 135495 135181 135790 137497 139957 142121 142892 142145
55313 142145 140878 140279 140768 141880 142812 143001 142438 141581 140936 140590 140198 139432 138345 137279 136521 136122 136068 136472
55295 136472 137549 139371 141705 144116 146184 147578 148082 147731 146952 146367 146342 146744 147174 147384 147416 147388 147206 146590
55277 146590 145445 144088 142853 141530 139599 137173 135278 134809 135512 136492 137436 138676 140157 141103 140994 140278
55261 140278 139741 139537 139216 138421 137248 136062 135217 134811 134590 134278 134112 134725 136298 138086 139081 138969 138273
55244 138273 137759 137860 138417 138704 137947 136184 134484 134010 134867 136026 136295 135291 133681 132707 133252 135087 137111
55227 137111 138413 138915 138848 138114 136620 134981 134221 134689 135688 136276 136166 135782 135764 136479 137728 138825 139218 139088
55209A39088ML78L97K79P17J578J751O78o27q08L2N44J42j91N13J580J531J12
55191A47698j397j896j590j154o93j01K48k4n16m42K78R95J276J266J066N22j99
55174A45337m47J07R24J183P02m8n57n70L4J183K374K863K379J531J241J683K041
55157A61960J531M43k50k20k01q62j860k360k191j866j690j396p44NL54J24m05
55140A50372p75q07p89j059j363j068j74L82l3p35o24J91N47o8q50r79p54r92
55122A40422j811k468k139o46J289K384J829K55p41k90R24J677J582J058M78l6
55106A43767k23J75Q71J173P56nn53p13n58p9P13J438J513Q12k7j87M04J015J010
55087A51302N73L22M28M34p4r79j839k313k239j587m96O48J381J457J075P53Q33
$$ plain form
55209 139088 139092 139470 139867 140146 140863 142441 144192 144870 144243 143435 143467 144011 144153 143962 144475 146055 147586 147698
55191 147698 146301 144405 142815 141661 140968 140867 141115 141091 140575 140133 140411 141406 142682 143948 145014 145536 145337
55174 145337 144890 144997 145921 147104 147806 147758 147201 146631 146665 147848 150222 153085 155464 156995 158236 159919 161960
55157 161960 163491 163934 163684 163464 163263 162401 160541 158181 155990 154124 152434 151038 150294 150299 150653 150777 150372
55140 150372 149597 148790 148001 146942 145579 144511 144337 144719 144686 143951 143327 143518 144065 143997 143147 142168 141414 140422
55122 140422 138611 136143 134004 133358 134647 137031 138860 139115 138374 138084 139008 140685 142267 143325 143803 143767
55106 143767 143544 143719 144590 145763 146519 146514 145961 145248 144690 144611 145324 146762 148275 149087 149060 148873 149277 150292 151302
55087 151302 151875 152197 152625 153059 152985 152006 150167 147854 145615 144028 143532 144180 145561 147018 148093 148846 149679
55070A49679J126J147P66L75K81K52o0n93j001j139j013m99L98J177J196M58m01
55053A52149q72r60q40n47j04L52O49N54j16j057j428p38L32N85k17j116j208
55036A45418m89N33J423J811J473O89J01m1J3J30M38O90K71p56j337p02N63J259
55018A51487R46M1r06j492j349m79M45P07L29j15k83j82J76P25J136J193J193
55001A53572J441J507P09p45j762j642p67J51Q95J470J533P32n71j419j243m40
54985A53421J23jn00p71m95K17J058J683J770J196K28n58o76l9J015J890K047
54968A61608J452O52J85Lk00l03N3N97M84m89j338j095m4P22O79J87l00n96m92
54949A61765K18J234J793J497P27P5l42p38j113j193q69l58P8M01O92R17J007
$$ plain form
55070 149679 150805 151952 152718 153093 153374 153626 153566 152973 151972 150833 149820 149321 149719 150896 152092 152550 152149
55053 152149 151277 150317 149477 148930 148826 149178 149827 150381 150265 149208 147780 147042 147374 147959 147742 146626 145418
55036 145418 144929 145462 146885 148696 150169 150858 150959 150918 150931 151061 151499 152189 152460 151704 150367 149665 150228 151487
55018 151487 152433 152474 151568 150076 148727 148248 148693 149400 149729 149614 149331 149149 149325 150050 151186 152379 153572
55001 153572 155013 156520 157229 156484 154722 153080 152313 152464 153359 154829 156362 157094 156523 155104 153861 153421
54985 153421 153544 153543 153043 152272 151777 151994 153052 154735 156505 157701 157929 157371 156695 156656 157671 159561 161608
54968 161608 163060 163712 163897 163900 163700 163397 163450 164047 164531 164042 162704 161609 161565 162287 162966 163153 162853 162257 161765
54949 161765 161983 163217 165010 166507 167234 167309 166967 166229 165116 163923 163054 162696 162774 163175 163867 164784 165791
54932A65791J063J294J632J667J160M71K48P77J835L076M209M957N217N279N548
54917B04224N916N842N145M326L865L515K607R38r68k426l304m054m984n699n572
54902B09371m808m381m575m315k761r19m83j365j818j122n38j104j920j641n10
54887A77111K73M15M98P04Q33J194K256L545M040L577L006K939L272L860M702
54872B12225N365N169M130K929J904Q29k76j066j750l043m885o108n907m885m112
54857B00519l814l630l496l541l436k689j469n41l93p81j204j411j408j229q77
54842A70600m60j93k20m04n17n77p29p59j75R20J628J365P27N36N31k6p90n94
54824A70863O02J346O47p65j636j720j386o96K94R34O91J8l03l51p06j229j195
$$ plain form
54932 165791 166854 168148 169780 171447 172607 173078 173326 174103 175938 179014 183223 188180 193397 198676 204224
54917 204224 210140 215982 221127 225453 229318 232833 235440 236378 235410 232984 229680 225626 220642 214943 209371
54902 209371 204563 200182 195607 191292 188531 187612 187129 185764 183946 182824 182286 181182 179262 177621 177111
54887 177111 177384 177799 178297 179001 179834 181028 183284 186829 190869 194446 197452 200391 203663 207523 212225
54872 212225 217590 222759 226889 229818 231722 232551 232275 231209 229459 226416 221531 215423 209516 204631 200519
54857 200519 196705 193075 189579 186038 182602 179913 178444 177903 177510 176729 175525 174114 172706 171477 170600
54842 170600 170140 169947 169727 169323 168806 168229 167500 166741 166566 167486 169114 170479 171206 171742 172273 172247 171457 170863
54824 170863 171465 172811 173458 172693 171057 169337 167951 167255 167549 168483 169174 169192 168889 168538 167832 166603 165408
54807A65408n57o8j12k01P2L58K21j14j51Q9J29k37o52n83J32J176K009K269J979
54788A71167J406Q73N87N24L75j14p07q19l02K25J68j67P4J132K314K876K860
54771A82472K840L111L481L778M267N330O753P652P397O460N915O051N968M823
54757B56298K935J155l92k291m660o757p848p963p595p087o509n808m804l356
54743A95318j726n45k36o34j278j801j941j517o88M0L48M45N91O03J77m40n90
54726A86126K1J070K171L296M475N453N919N861N500M997M417L817L110J980K74
54711B38487j560k798l316l766m622n344m975l536k305k408l493m189l735k669
54697A89771j923j713j629j390j069p85o23p78j284j593r68M39J405R58m49j472
$$ plain form
54807 165408 164851 164783 164671 164470 164542 164900 165121 165007 164856 164945 165074 164837 164185 163602 163734 164910 166919 169188 171167
54788 171167 172573 173446 174033 174557 174932 174818 174111 173292 172990 173215 173383 173216 173290 174422 176736 179612 182472
54771 182472 185312 188423 191904 195682 199949 205279 212032 219684 227081 233541 239456 245507 251475 256298
54757 256298 259233 260388 259996 257705 253045 246288 238440 230477 222882 215795 209286 203478 198674 195318
54743 195318 193592 193047 192811 192177 190899 189098 187157 185640 184952 184992 185340 185785 186376 186979 187156 186716 186126
54726 186126 186147 187217 189388 192684 197159 202612 208531 214392 219892 224889 229306 233123 236233 238213 238487
54711 238487 236927 234129 230813 227047 222425 217081 212106 208570 206265 203857 200364 196175 192440 189771
54697 189771 187848 186135 184506 183116 182047 181262 180639 179861 178577 176984 176016 176455 177860 178818 178369 176897
54681A76897j384o27O3M43O91R36J165J243R59K48n56r29p63m40k89k36j04Q5
54663A77402K60M23M47J10m56p11m55k44o00j131r80n2P99Q38K35l09l31J03N62
54644A75910N68M1n02m24L04J112J512J462J024J18j096k017k131j615j123r95
54628A72148r35m99L27J027J066M46k67n11k60J15L80N82P55Q35Q96J082J196
54611A78383O94n33j674j705n65P77J361J133O61L01o9n80j032j170j085j040
54595A73857r46l70P43J660J543M34p85j327j100m52K34N69K88l41n74J4R18J240
54577A75605P65J51L3K55K11k58n73j58O96R93K17r05j191m64K63J98j97lO97
54558A76335R03J51p77q73j50N06M30k78j103j645j770j569j229p75p7P21R92
$$ plain form
54681 176897 175513 174886 174949 175392 176083 177019 178184 179427 180386 180634 180078 179149 178386 177946 177657 177421 177317 177402
54663 177402 177662 178085 178532 178642 178186 177475 177020 176776 176176 175045 174065 174013 174812 175650 175885 175576 175245 175348 175910
54644 175910 176478 176519 176017 175593 175897 177009 178521 179983 181007 181125 180029 178012 175881 174266 173143 172148
54628 172148 171213 170714 171041 172068 173134 173580 173313 172802 172542 172657 173037 173619 174374 175209 176105 177187 178383
54611 178383 179077 178544 176870 175165 174600 175377 176738 177871 178532 178833 178764 178184 177152 175982 174897 173857
54595 173857 172911 172541 173284 174944 176487 176921 176136 174809 173709 173257 173491 174060 174348 174007 173433 173447 174365 175605
54577 175605 176370 176521 176554 176809 177020 176762 176189 176031 176727 177720 177937 177032 175841 175377 175640 175838 175641 175638 176335
54558 176335 177238 177389 176612 175739 175589 176095 176525 176247 175144 173499 171729 170160 168931 168156 168079 168800 169792
54541A69792L13p35j066m73J12M5o6O06J656J942J237M69K95L73K98L52Q33J347
54523A77330J351R69P11P65R94J265J371R83K46p2L69P66K57o14n97K96N92n31
54505A86451j964k068o96P98J236O89K9j51qn2m07o68n27k66l30o04o10k58Q5
54486A80679J97J87J06n8p0K86O43M40p9p2N20O82j42j033q11L93J478J820J598
54467A86764J081L32m66j067j469j668j330k56R92J538J172M48j49m76m16J13
54451A85143P01P47K50k26m63q18j341j437q28j92k21m61P1J332K066J375j25
54434A85573j081r43l14j3k04n53p80q07n80o2N14P08L38k06l30J81R92J578J663
54415A85674J280O07j76r48j637k148k313j924r33L58J396J728J345O37Q7K7N29
$$ plain form
54541 169792 170105 169370 168304 167831 167943 167988 167922 168528 170184 172126 173363 173832 174127 174500 174798 175150 175983 177330
54523 177330 178681 179650 180361 181126 182120 183385 184756 185739 185985 185913 186282 187048 187305 186691 186094 186390 186982 186451
54505 186451 184487 182419 181723 182521 183757 184446 184475 184324 184316 184264 183857 183189 182662 182396 182066 181462 180852 180594 180679
54486 180679 180876 181063 181169 181111 181041 181327 181970 182410 182331 182259 182779 183461 183319 182286 181475 181868 183346 185166 186764
54467 186764 187845 188177 187711 186644 185175 183507 182177 181921 182913 184451 185623 186071 185922 185446 185030 185143
54451 185143 185844 186591 186841 186615 186152 185334 183993 182556 181728 181536 181315 180854 180925 182257 184323 185698 185573
54434 185573 184492 183549 183235 183222 183018 182465 181685 180878 180298 180236 180750 181458 181796 181590 181260 181441 182433 184011 185674
54415 185674 186954 187561 187385 186437 184800 182652 180339 178415 177482 177840 179236 180964 182309 182946 183033 183060 183589
54398A83589J326J865J733J090M74R3l09q28j036n69K58Q81J207J417J335O89
54382A93215j42l49K17Q17R13P87Q31P86K95l19m19j9K24l0l68k28L40Q57J083
54363A98491J262J606J804J332K31p78j110r02n52q4N35Q51L99m17o62j76K17
54346B02047o5o06p64n25k12Q5L95N46L79l4o53j498k262k335j585o43j30JN1
54327A92192j4l33p70j132j395j401q51J32Q78J019R82J216J513J537J487J612
54311A96672J599J076L12q9P1O29J327J702J266L45%N53R54M44j57J79Q39M82
54293B08204p64j545j371r22m45M84J494J396Q5r39o53J91M73L07L63N97N40K10
54275B07705j13m85j001j352j296j170j354j648j640j317q59k55M33Q08O47L04
$$ plain form
54398 183589 184915 186780 188513 189603 190077 190170 189861 189033 187997 187428 187686 188567 189774 191191 192526 193215
54382 193215 193073 192724 192941 193758 194671 195458 196289 197075 197370 197051 196632 196613 196837 196807 196439 196211 196551 197408 198491
54363 198491 199753 201359 203163 204495 204726 203948 202838 201936 201384 201300 201835 202686 203085 202668 202006 201830 202047
54346 202047 201982 201376 200612 200087 199875 199960 200355 200901 201280 201246 200593 199095 196833 194498 192913 192270 192140 192141 192192
54327 192192 192178 191845 191075 189943 188548 187147 186296 186428 187306 188325 189307 190523 192036 193573 195060 196672
54311 196672 198271 199347 199659 199570 199641 200270 201597 203299 204565 204910 204910 205463 206417 206861 206704 206883 207722 208204
54293 208204 207440 205895 204524 203602 203157 203641 205135 206531 206616 205677 205024 205215 205688 205995 206358 206955 207495 207705
54275 207705 207592 207107 206106 204754 203458 202288 200934 199286 197646 196329 195470 195215 195648 196456 197103 197407
54259A97407J75J65M4p9j08k85p10q90m47J81L14N5M6L57L61j98o33j36J121K025
54239A98765J703M83m16j87P38J374J348J001N06l49j435k007j500j94J149J951
54223B02930J917J020k95j264j503j265q99m44N2L35L43L56M75M66K82K41L51
54206B03098J26o08j302j491j365j178p96m06p57j877k359j088Q94J500L74p34
54190A92031l99Q89J848J999J666J163P01N47P15P56K79n09j090j249j085o15
54174A97647K61J324J906J425J07j107j561j557j724j933j470k75P05P49K57l2
54158A94722LK15P98J712K118J348Q2m50k31l01r32j203n74K48M92L91N05P50
54140A99693Q18R22J399J942J913J273O54O06J096J711J974J704J239J229J935
$$ plain form
54259 197407 197582 197747 197791 197712 197604 197319 196609 195719 195272 195453 195767 195822 195868 196225 196586 196388 195755 195619 196740 198765
54239 198765 200468 200951 200535 200348 201086 202460 203808 204809 205315 204966 203531 201524 200024 199830 200979 202930
54223 202930 204847 205867 205572 204308 202805 201540 200641 200197 200249 200584 200927 201283 201758 202224 202506 202747 203098
54206 203098 203224 202616 201314 199823 198458 197280 196484 196078 195321 193444 191085 189997 190891 192391 192765 192031
54190 192031 191632 192521 194369 196368 198034 199197 199898 200445 201160 201916 202195 201686 200596 199347 198262 197647
54174 197647 197908 199232 201138 202563 202670 201563 200002 198445 196721 194788 193318 193043 193748 194497 194754 194722
54158 194722 194725 194940 195738 197450 199568 200916 200998 200548 200317 200016 199084 197881 197307 197555 198047 198438 198943 199693
54140 199693 200511 201433 202832 204774 206687 207960 208614 209220 210316 212027 214001 215705 216944 218173 220108
54125B20108K870L267K778J625L27o16j029j203j451j572j145m05k34r50j740
54110B20630j734j138o99m98l2P50J258J165P95N04K94J46K17L81J28p28j607
54093B19832j863j575j267j071o69m7K67j16q98j413j338q62l22J21M84P86R32
54076B10981P76L68M4J09M47O60O18N69N45J31q41j682j588q38o10j439k503k675
54058B03072j827p15L9M68R50J751K707L201K765J852J552K230K895K459J185
54043B24584K66L31J081K141L353M258M249L500K989L283L966M503M913N147M666
54028B73230L300J964J642K049K124J579J063R18P03J29l98n38o29r97j299j160
54012B83680j058j793l199m132l852k869k193k207k586k871k737j990p95K12N26
$$ plain form
54125 220108 222978 226245 229023 230648 230975 230359 229330 228127 226676 225104 223959 223554 223320 222370 220630
54110 220630 218896 217758 217059 216561 216529 217279 218537 219702 220497 221001 221295 221441 221658 222039 222167 221439 219832
54093 219832 217969 216394 215127 214056 213387 213340 213607 213491 212593 211180 209842 208980 208658 208779 209263 210049 210981
54076 210981 211757 212125 212169 212278 212725 213385 214003 214572 215117 215248 214407 212725 211137 210299 209689 208250 205747 203072
54058 203072 201245 200530 200569 201037 201987 203738 206445 209646 212411 214263 215815 218045 220940 223399 224584
54043 224584 224850 225181 226262 228403 231756 236014 240263 243763 246752 250035 254001 258504 263417 268564 273230
54028 273230 276530 278494 280136 282185 284309 285888 286951 287869 288572 288701 288303 287765 287136 286139 284840 283680
54012 283680 282622 280829 277630 273498 269646 266777 264584 262377 259791 256920 254183 252193 251398 251610 252136
53997B52136M24N91J125J467J358J200J180O82p61k416l022k436j785j878k280
53982B45585k207j689j278j106r48r70j625k739l322k684j336l90k99n29m21P2
53966B24114N78R06J109J165R15L80j16k83j64J08O26J500K412K731K248J439
53950B39668Q61M45k10j043j405q13N33K018L168L717L521K758K030J764J643
53935B58655J028P0k36P39K394L665M263M672N181N557N614N574N680N804N584
53920C14244M769L422K060J506K111L184L623L195K703K752L003K911K580K394
53906C54457K287J962J528J279J065M58n42j505k172k611k833k766k599k675l010
53891C42323l392l965n123o648p543p083n756m675m290m044l308k267j704k018
$$ plain form
53997 252136 252560 253151 254276 255743 257101 258301 259481 260163 259402 256986 253964 251528 249743 247865 245585
53982 245585 243378 241689 240411 239305 238357 237387 235762 233023 229701 227017 225681 225291 224992 224463 224042 224114
53966 224114 224692 225598 226707 227872 228787 229167 229051 228768 228604 228712 229338 230838 233250 235981 238229 239668
53950 239668 240529 240974 240764 239721 238316 237503 238036 240054 243222 246939 250460 253218 255248 257012 258655
53935 258655 259683 259753 259517 260256 262650 266315 270578 275250 280431 285988 291602 297176 302856 308660 314244
53920 314244 319013 322435 324495 326001 328112 331296 334919 338114 340817 343569 346572 349483 352063 354457
53906 354457 356744 358706 360234 361513 362578 363036 362494 360989 358817 356206 353373 350607 348008 345333 342323
53891 342323 338931 334966 329843 323195 315652 308569 302813 298138 293848 289804 286496 284229 282525 280507
53877B80507k709k924k369j536j039j004j195j407j505j345r26n51m72n63n59
53862B60403n07o93j162j664j980k056j902j617j427j478j619j656j619j554j231
53847B38238m46N83J432J905J931J403N15o4N9L29j3q04j334j561j912k103j402
53830B36756k38j34j407k243j033J288K415J579J04n71k04P82J959K728K447J252
53814B45480J91J38Q32J364J253Q45P74J359K432L523M157M033L162K003J360
53799B72906J784K930L848M025L779L493K984K072J266J263J938K501K460J939
53785C09188J095q8j360k163k291k087j914j790j746j949k241k100j412r06j295
53770B86941k302l036l150l009k805k218j184l73m24j000j228q85o02q06j134
$$ plain form
53877 280507 277798 274874 272505 270969 269930 268926 267731 266324 264819 263474 262548 261997 261525 260962 260403
53862 260403 259896 259203 258041 256377 254397 252341 250439 248822 247395 245917 244298 242642 241023 239469 238238
53847 238238 237792 238375 239807 241712 243643 245046 245561 245497 245556 245885 245872 245068 243734 242173 240261 238158 236756
53830 236756 236518 236384 234977 232734 231701 232989 235404 236983 237087 236516 236312 237094 239053 241781 244228 245480
53814 245480 245671 245809 246641 248005 249258 250103 250877 252236 254668 258191 262348 266381 269543 271546 272906
53799 272906 274690 277620 281468 285493 289272 292765 295749 297821 299087 300350 302288 304789 307249 309188
53785 309188 310283 310195 308835 306672 304381 302294 300380 298590 296844 294895 292654 290554 289142 288236 286941
53770 286941 284639 281603 278453 275444 272639 270421 269237 268864 268440 267440 266212 265327 264725 263919 262785
53755B62785j181j233j677k136j933j206p34o74l41M84J013P22L18O33J208J010
53739B57058J45k30L36J064J255J187J262J309J171J224J614J642P69k80k51R84
53723B70259K328K906K866K736K693K692K670K416J709Q22M55Q21J283J167O70
53708B98493N44J102J971K604K751K540K386K673L249L390K671J649J287J796
53694C29106K531K977L235L424L203K307J183O62J084J952K335J595rj383j572
53679C52630q28k76m52p02l78J14J16o3L47J157J337O10n5J60Q84J261J082P53
53661C57697O31P98J113J238J012R96K018L844N109N084M867N962Q291J0560J2270
53646D21490J4185J6921K0209K3830K8180L3360L8496M2532M5086M5876M3772
$$ plain form
53755 262785 261604 260371 258694 256558 254625 253419 252685 252011 251670 252154 253167 253889 254207 254840 256048 257058
53739 257058 257203 256973 257309 258373 259628 260815 262077 263386 264557 265781 267395 269037 269806 269526 269275 270259
53723 270259 272587 275493 278359 281095 283788 286480 289150 291566 293275 294097 294552 295373 296656 297823 298493
53708 298493 299037 300139 302110 304714 307465 310005 312391 315064 318313 321703 324374 326023 327310 329106
53694 329106 331637 334614 337849 341273 344476 346783 347966 348628 349712 351664 353999 355594 355585 354202 352630
53679 352630 351802 351526 351074 350372 349994 350108 350224 350161 350508 351665 353002 353612 353557 353717 354601 355862 356944 357697
53661 357697 358328 359126 360239 361477 362489 363485 365503 369347 374456 379540 384407 390369 398660 409220 421490
53646 421490 435675 452596 472805 496635 524815 558175 596671 639203 684289 730165 773937
53635G73937L7339K6277J1864l873j8956l1586m0349m4696m5148m2855l8946l4094
53623E48914k8448k2074j5673j0624p872o836n990m514k941k040j662j053J50
53610D39337J680L032L734L503K679K192K525K901K245Q13L2O00J579J782J221
53595D69855O29K01m08j187j692j725j491j164q53q15j217j743k025k216k609
53580D51540k952k866k704l046l491l074k029j852l118m353l984k482j508j601
53566D12480j772j229l66ql85j065j418j120n30m01q78j122m78M12L99m94j010
53549D01015l61R43K001K528K576K060J118M94R50K389L882M572M402M039M140
53534D36748M724N314N720O296P213Q007Q355Q844J0178J1844J2668J2614J2934
$$ plain form
53635 773937 811276 837553 849417 845544 826588 795002 754653 709957 664809 621954 583008 548914
53623 548914 520466 498392 482719 472095 464223 457387 451397 446883 443942 441902 440240 439187 439337
53610 439337 441017 444049 447783 451286 453965 456157 458682 461583 463828 464641 464673 465273 466852 468634 469855
53595 469855 470484 470685 470277 469090 467398 465673 464182 463018 462165 461350 460133 458390 456365 454149 451540
53580 451540 448588 445722 443018 439972 436481 433407 431378 429526 426408 422055 418071 415589 414081 412480
53566 412480 410708 409479 409113 409105 408720 407655 406237 405117 404587 404186 403308 402186 401708 402120 402519 402025 401015
53549 401015 400654 401597 403598 406126 408702 410762 411880 412374 413324 415713 419595 424167 428569 432608 436748
53534 436748 441472 446786 452506 458802 466015 474022 482377 491221 501399 513243 525911 538525 551459
53521E51459J4294J5821J6561J6804J7224J7616J7516J7414J8198J9734K1063
53510G43704K1887K2798K4045K5056K5422K5512K5744K5936K5751K5238K4541
53499A015634K3592K2431K1471K0979K0719K0381K0147K0434K1273K2290K3049
53488A252400K3250K2720K1601K0306J9108J7980J6979J6408J6300J6080J5240
53477A458372J4012J2909J1824J0262Q275O425M770K660j99l129n287o606p607
53464A506681q693j0097j1995j4185j5885j6490j6332j6279j6726j7475j8399
53453A344125j9609k0880k1637k1721k1719k2156k2717k2650k1769k0680k0079
53442A108508j9970j9676j8566j6688j4720j3215j2034j0654q893p124n720m507
$$ plain form
53521 551459 565753 581574 598135 614939 632163 649779 667295 684709 702907 722641 743704
53510 743704 765591 788389 812434 837490 862912 888424 914168 940104 965855 991093 1015634
53499 1015634 1039226 1061657 1083128 1104107 1124826 1145207 1165354 1185788 1207061 1229351 1252400
53488 1252400 1275650 1298370 1319971 1340277 1359385 1377365 1394344 1410752 1427052 1443132 1458372
53477 1458372 1472384 1485293 1497117 1507379 1515654 1522079 1526849 1529509 1529310 1526181 1520894 1514288 1506681
53464 1506681 1497988 1487891 1475896 1461711 1445826 1429336 1413004 1396725 1379999 1362524 1344125
53453 1344125 1324516 1303636 1281999 1260278 1238559 1216403 1193686 1171036 1149267 1128587 1108508
53442 1108508 1088538 1068862 1050296 1033608 1018888 1005673 993639 982985 974092 966968 961248 956741
53430I56741k895n30K166M264N295N947P421R971J2624J4555J6184J8270K0598
53417A070611K2455K4111K6618L0075L3283L5534L7724M1136M5900N1326N6940
53406A475713O2444O7253P0972P3792P5487P4435O8864N9125M7815L7547K9429
53395B142876K3706K0847K1255K4493K9416L4819L9725M3422M5684M6837M7257
53384B520337M6973M5914M4333M2619M0764L8325L4924L0644K5839K0786J5650
53373B907108J0744O498K942o32n056j0298j5503k0169k4780k9912l5178l9702
53361B746062m3414m7003n0697n3866n6148n8109o0182o1626o1400n9855n8566
53350B135196n8275n7828n5771n2439m9704m8703m8681m8256m7087m5788m4755
$$ plain form
53430 956741 953846 953316 955482 959746 965041 970988 978409 988380 1001004 1015559 1031743 1050013 1070611
53417 1070611 1093066 1117177 1143795 1173870 1207153 1242687 1280411 1321547 1367447 1418773 1475713
53406 1475713 1538157 1605410 1676382 1750174 1825661 1900096 1968960 2028085 2075900 2113447 2142876
53395 2142876 2166582 2187429 2208684 2233177 2262593 2297412 2337137 2380559 2426243 2473080 2520337
53384 2520337 2567310 2613224 2657557 2700176 2740940 2779265 2814189 2844833 2870672 2891458 2907108
53373 2907108 2917852 2924350 2927292 2926660 2921604 2911306 2895803 2875634 2850854 2820942 2785764 2746062
53361 2746062 2702648 2655645 2604948 2551082 2494934 2436825 2376643 2315017 2253617 2193762 2135196
53350 2135196 2076921 2019093 1963322 1910883 1861179 1812476 1763795 1715539 1668452 1622664 1577909
53339A577909m3780m2617m1171l9216l6644l3991l2056l0803k9319k7077k4581
53328A196654k2445k0570j8650j6891j5582j4465j3132j1681j0364q980p221n330
53316A031343l790k647j691r02j39J128L050M762N485N843P111R270J1104J2127
53302A082054J3139J4645J6041J6997J8418K1135K4389K6697K7722K8408K9418
53291A319063L0390L0778L0703L0646L0651L0217K8916K6890K4588K2218J9708
53280A624768J7208J5121J3388J1277Q362N241K684M43k150m756o266o499o576
53267A672245p337q412r320j0520j2717j5813j9259k2903k6810l0679l4095l7049
53255A437331l9735m1971m3307m3494m2631m1101l9530l8419l7564l6275l4414
$$ plain form
53339 1577909 1534129 1491512 1450341 1411125 1374481 1340490 1308434 1277631 1248312 1221235 1196654
53328 1196654 1174209 1153639 1134989 1118098 1102516 1088051 1074919 1063238 1052874 1043894 1036673 1031343
53316 1031343 1027553 1024906 1023215 1022313 1022174 1023302 1026352 1031114 1036599 1042442 1049553 1058823 1069927 1082054
53302 1082054 1095193 1109838 1125879 1142876 1161294 1182429 1206818 1233515 1261237 1289645 1319063
53291 1319063 1349453 1380231 1410934 1441580 1472231 1502448 1531364 1558254 1582842 1605060 1624768
53280 1624768 1641976 1657097 1670485 1681762 1690124 1695365 1698049 1698492 1696342 1691586 1685320 1678821 1672245
53267 1672245 1664908 1656496 1647176 1636656 1623939 1608126 1588867 1565964 1539154 1508475 1474380 1437331
53255 1437331 1397596 1355625 1312318 1268824 1226193 1185092 1145562 1107143 1069579 1033304 998890
53244I98890l2653l1492l0535k9189k7432k5514k3521k1756k0889k1045k1240
53233G13624k0485j9026j7755j6803j5602j4023j2600j1638j0936j0433j0398
53222E53925j0829j1230j1218j0879j0459j0066r746r506r198q659p979p346o744
53209D30066o055n380m946m754m611m415m183l891l586l486l681l853l576k867
53195C70782k244k245k980l940m317l783k953k631k599j850j94J212J359O49K7
53180C44293l95j051j857k340k408k191j462j16J062J127K54n92j033j398j664
53165C30229j380o79k90l81l34J01L39l8n88p33m82k10k45q02j760k400k113j368
53147C16866j204j671j768j070l71l26n18m45m25p70q70l9J289K069J925J225
$$ plain form
53244 998890 966237 934745 904210 875021 847589 822075 798554 776798 755909 734864 713624
53233 713624 693139 674113 656358 639555 623953 609930 597330 585692 574756 564323 553925
53222 553925 543096 531866 520648 509769 499310 489244 479498 469992 460794 452135 444156 436810 430066
53209 430066 424011 418631 413685 408931 404320 399905 395722 391831 388245 384759 381078 377225 373649 370782
53195 370782 368538 366293 363313 359373 355056 351273 348320 345689 343090 341240 341046 342258 343617 344266 344293
53180 344293 343898 342847 340990 338650 336242 334051 332589 332473 333535 334662 334916 334324 333291 331893 330229
53165 330229 328849 328170 327880 327499 327165 327266 327605 327567 326979 326246 325764 325554 325309 324507 322747 320347 318234 316866
53147 316866 315662 313991 312223 311153 310782 310456 309938 309493 309068 308298 307428 307389 308678 310747 312672 313897
53131C13897L10n57r07n50j28l59q87p13L22J237J202M40k32l23J27P63J087Q17
53113C15546K40N1O00J375J438L91j102j841j243Q1J055J277J068O06k89j344
53097C17909j653p88M72J082R83Q30R15J094J417J910K024J196l5l96M31J466
53081C28857J991K458L323L954L581K638K065J795J026j20n41P8O74M65J42N05
53065C52891Q66j5j869l057k749j755j104r25j085j799k874l267k306p96o9l34
53049C29753q01r91r97p08J92J422K253K517K695K927K847K519K571L048L071
53034C52318K133R02O3q12k448m368n280m729l589k888k805k909k833k531k225
53019C17999k216k496k580k001r73k10o7j78q9J14L5k96l27L18J228J547R56P6
$$ plain form
53131 313897 314207 313650 312743 312193 312065 311706 310819 310106 310428 311665 312867 313307 313075 312752 312879 313642 314729 315546
53113 315546 315786 315837 316437 317812 319250 319641 318539 316698 315455 315536 316591 317868 318936 319542 319253 317909
53097 317909 316256 315468 315940 317022 318005 318835 319750 320844 322261 324171 326195 327391 327356 326960 327391 328857
53081 328857 330848 333306 336629 340583 344164 346802 348867 350662 351688 351568 351027 351105 351779 352244 352386 352891
53065 352891 353757 353742 351873 348816 346067 344312 343208 342283 341198 339399 336525 333258 330952 330156 330087 329753
53049 329753 328952 327961 326964 326256 326448 327870 330123 332640 335335 338262 341109 343628 346199 349247 352318
53034 352318 354451 355353 355416 354604 352156 347788 342508 337779 334190 331302 328497 325588 322755 320224 317999
53019 317999 315783 313287 310707 308706 307733 307523 307456 307278 307189 307303 307338 307042 306715 307033 308261 309808 310764 310840
53001C10840k67j2K01q4o52j051j105q53k95M85J063R06k0r94j090j46R25J110
52983C08961N70M91J425K380K127R63L65J045K233K956L158L221L145K692J890
52968C37622J038M85N90J404K268K259J275J52m92q51j120r21j55L36k87j659
52952C41944k729l095l181l356l594l796l773l141j832n80k03n34o84k70K65N18
52936C11959O34P85P96N06J37N9L65P97R01L71n99j369j458j011m84j67j86n88
52918C11448j095j142o35j90j95o8Q36J987K270J573Q38N83L98k9k81k9L50M13
52900C17032K53O4k83p98r61l47O65J329J458J485J671J661R41m40j696j932j075
52883C19027m0J96m22j217j726k028k185j955j221l45J52J6o29j346j559j050
$$ plain form
53001 310840 310573 310561 310762 310678 310026 308975 307870 307017 306722 307207 308270 309176 309156 308162 307072 306926 307851 308961
52983 308961 309531 310022 311447 313827 315954 316917 317282 318327 320560 323516 326674 329895 333040 335732 337622
52968 337622 338660 339145 339735 341139 343407 345666 346941 347093 346601 345750 344630 343709 343554 343890 343603 341944
52952 341944 339215 336120 332939 329583 325989 322193 318420 315279 313447 312867 312664 312130 311446 311176 311441 311959
52936 311959 312593 313378 314174 314680 314817 314876 315241 316038 316939 317310 316711 315342 313884 312873 312389 312222 312036 311448
52918 311448 310353 309211 308576 308386 308191 308123 308959 310946 313216 314789 315627 316210 316608 316579 316298 316269 316619 317032
52900 317032 317285 317349 317066 316268 315307 314960 315625 316954 318412 319897 321568 323229 324170 323730 322034 320102 319027
52883 319027 318987 319183 318761 317544 315818 313790 311605 309650 308429 308084 308236 308252 307623 306277 304718 303668
52867C03668k87R7J10L01Q22J135P06l37j435k056j946j313p65o88o80j69N60
52850B97723O72P8m15m43n98j203j538r45N0M94L38K02K71K57J83L59P06Q38Q16
52831B97845J082J627J894J628J349J718K739L704L733K414J91j832k735k498
52817C12859j812j340j274j322q97L94K128L271L417L449M431O149P429P649P103
52802C51634N946L714K65l560o675q719r863j0096r217p391n271l548k527k053
52788B92639j725j273q74r49j561k184k224j604p06J73J034J868K312J898O97
52773B87521m84q67o13n57r51j040k74O90Q45L38J68N37N59j84q38n42K83O25
52755B85216K91j45l06k25J37P29R45J93j034j445n51O36R14L62L6N20J282J411
$$ plain form
52867 303668 303381 303478 303588 303889 304711 305846 306552 306215 304780 302724 300778 299465 298700 298012 297332 297163 297723
52850 297723 298395 298473 298058 297615 297017 295814 294276 293331 293381 293875 294213 294415 294686 294943 295126 295485 296191 297029 297845
52831 297845 298927 300554 302448 304076 305425 307143 309882 313586 317319 319733 319924 318092 315357 312859
52817 312859 311047 309707 308433 307111 306214 306608 308736 312007 315424 318873 323304 329453 336882 344531 351634
52802 351634 357580 361294 361559 357999 351324 342605 332742 322646 313429 306038 300767 297219 294692 292639
52788 292639 290914 289641 288767 287818 286257 284073 281849 280245 279539 279712 280746 282614 284926 286824 287521
52773 287521 287037 286170 285557 285000 284049 283009 282735 283425 284270 284608 284776 285313 285872 285688 284850 284308 284591 285216
52755 285216 285507 285362 285056 284831 284968 285697 286642 286835 285801 284356 283805 284441 285355 285717 285753 286273 287555 288966
52737B88966O62l80r69q51k61N56J534K434K688J981Q17Q2Q6L44K83k01q65j382
52719B95524j448j055o93q63j320j333p85l93n53o51k7R25J276Q57K96Pk10n44
52701B89010p86o90k70K57N55K99l31n45J51J089J159L26l43k01K58M25M09M89
52683B91261M54R4j78J37Q49J378J483J266Q56N59R31K018K894K635J552P88P94
52666C09771R72P15J28l70n33k55L78Q84P65J95o6L64J080J512J534J326J089
52649C19489R84J024Q63J78o78r26m24K5k68r72j288r74m83k38j75R6Q87K015
52631C19135K772K617J931J713K377L307L776L720L291K279O29r54j660j661j857
52616C41415k586l218l115k343j369n23j2l0m78q42o34O6P84J218J520J929K306
$$ plain form
52737 288966 289628 289248 288279 287428 287167 287723 289257 291691 294379 296360 297177 297259 297345 297689 297972 297771 296906 295524
52719 295524 294076 293021 292328 291465 290145 288812 288027 287634 287081 286430 286403 287328 288604 289461 289757 289764 289554 289010
52701 289010 288224 287534 287264 287521 288076 288375 288044 287499 287650 288739 289898 290224 289881 289680 289938 290363 290772 291261
52683 291261 291715 291809 291631 291768 292617 293995 295478 296744 297600 298159 299090 301108 304002 306637 308189 308977 309771
52666 309771 310743 311458 311586 311216 310683 310428 310806 311690 312455 312650 312584 312948 314028 315540 317074 318400 319489
52649 319489 320473 321497 322360 322538 321860 320934 320510 320535 320267 319295 318007 317033 316550 316312 316137 316233 317120 319135
52631 319135 321907 324524 326455 328168 330545 333852 337628 341348 344639 346918 347547 346593 344933 343272 341415
52616 341415 338829 335611 332496 330153 328784 328261 328249 328219 327741 326899 326265 326331 327115 328333 329853 331782 334088
52599C34088K157J295L08R0Q19J674J724R63J79K6N03J179J592J457Q14Q0k70
52582C48678j62O9R7j07l55m35k08L03Q74J258J369J261J009O97M10O6n58j363
52564C52903j736j161oO81K70q74j876k125j499k29J143J954J904J364J014J162
52548C52889J566J764J494P98j8m83k64M73J065R32J52o46r19o13M1P81J264J171
52530C61447O51L98Q77J655J987J851J776J809J490R36J032K086L126L199K670
52515C86990K486K664K516J936J492J328J091R42J580K923L684K820P88j124k221
52500D09895k758l311m236n364n965n340l775k442k096k283k191j740j291q54
52486C66249k77R1k71j065j251k80J199K076J844Q81r5o17o98n62k45L54J031
$$ plain form
52599 334088 336245 337540 337848 337938 338757 340431 342155 343118 343297 343323 343826 345005 346597 348054 348868 348948 348678
52582 348678 348516 348585 348682 348575 348220 347785 347577 347880 348754 350012 351381 352642 353651 354348 354758 354824 354266 352903
52564 352903 351167 350006 350000 350681 350951 350077 348201 346076 344577 344348 345491 347445 349349 350713 351727 352889
52548 352889 354455 356219 357713 358511 358493 358010 357746 358219 359284 360216 360368 359722 358803 358190 358231 359012 360276 361447
52530 361447 362098 362496 363373 365028 367015 368866 370642 372451 373941 374877 375909 377995 381121 384320 386990
52515 386990 389476 392140 394656 396592 398084 399412 400503 401445 403025 405948 409632 412452 413240 412116 409895
52500 409895 407137 403826 399590 394226 388261 382921 379146 376704 374608 372325 370134 368394 367103 366249
52486 366249 365972 366063 365792 364727 363476 363196 364395 366471 368315 369196 369101 368484 367786 367224 366979 367333 368364
52469C68364J288J095J229K322L833M533M033L286L399M384N204M866L250J081
52455D12167q58k421l885n098n358m488l486l398l911l888l105k427k257j944
52441C65643j097m52o79j180q86K66J440K065K069J361p8j611k292j815o10Q04
52425C62948J962K225J330P7m78m71q68j618j431J62J762K037J597J824K710L194
52409C76962L222L855N373O758P454Q287R919J1442J1483J0004P949N562K185
52396D70455k289o728r792j1088j0993r959q282o269m256k567j512j195j208q78
52382C93439k3Q09J083R24P46O29N33R14K372M588O295O641O106N719N701N444
52366D41920M574L409K291J015p58k797m296m502l369j637l51j03o21j121j024
$$ plain form
52469 368364 369652 370747 371976 374298 378131 382664 386697 389983 393382 397766 402970 407836 411086 412167
52455 412167 411309 408888 405003 399905 394547 390059 386573 383175 379264 375376 372271 369844 367587 365643
52441 365643 364546 364094 363415 362235 361349 361615 363055 365120 367189 368550 368472 366861 364569 362754 362144 362948
52425 362948 364910 367135 368465 368542 368064 367593 366725 365107 363676 363838 365600 367637 369234 371058 373768 376962
52409 376962 380184 384039 389412 396170 403624 411911 421830 433272 444755 454759 462708 468270 470455
52396 470455 468166 461438 451646 440558 429565 419606 411324 405055 400799 398232 396720 395525 394317 393439
52382 393439 393416 394225 395308 396232 396978 397607 398140 399054 401426 406014 412309 418950 425056 430775 436476 441920
52366 441920 446494 449903 452194 453209 452451 449654 445358 440856 437487 435850 435499 435396 434775 433654 432630
52351D32630k43R76K105K431J652M96J82J066K320L171L808M541M851M143L062
52336D67191K969M136N461O192O879Q188R752J0922J1960J3483J5100J5697J5148
52323E93078J4681J5223J6046J5689J3822J1568J0056R318Q754Q180P965Q312
52311G32692Q946R566J0216J0908J1260J0868R988R341R263R430R457R348R249
52298H60532R063Q549P590O169M312K223J88j786l975o351q219q752p735n719
52284H56089l600k159j685j764j696j242o86q3R64K495L783M332M742N720O745
52269H71955O708N800N514O600Q059Q689Q691R026R819J0318J0143R758R738J0199
52255I91017J0960J1819J2526J2852J2739J2214J1241R855Q294O676M769K485
$$ plain form
52351 432630 432387 433363 435468 437899 439551 440047 440229 441295 443615 446786 450594 455135 459986 464129 467191
52336 467191 470160 474296 479757 485949 492828 501016 510768 521690 533650 547133 562233 577930 593078
52323 593078 607759 622982 639028 654717 668539 680107 690163 699481 708235 716415 724380 732692
52311 732692 741638 751204 761420 772328 783588 794456 804444 813785 823048 832478 841935 851283 860532
52298 860532 869595 878144 885734 891903 896215 898438 898626 896840 892865 886514 878295 869543 861808 856089
52284 856089 852489 850330 848645 846881 845185 843943 843257 843174 844138 846633 850416 854748 859490 865210 871955
52269 871955 878663 884463 889977 896577 904636 913325 922016 931042 940861 951179 961322 971080 980818 991017
52255 991017 1001977 1013796 1026322 1039174 1051913 1064127 1075368 1085223 1093517 1100193 1104962 1107447
52243A107447M55m46k10K77M18N55J078J652J840K042K962M314M966M517L885
52228A135752L941M339M252L672L223L104L130L481M455N505N629M977M920O117
52214A196497P533Q081Q134Q507Q831Q296P388P373Q282Q900Q836R028R901J0475
52200A316062J0065R509R785J0440J0475R974R697R705R500R123Q952Q689P657
52187A439633O016M640L790K839J284q50l614p091j0606j3018j4090j4677j5228
52174A379028j5135j3998j2500j1320j0069q124n814l867k254n95Q05J386J608
52161A299151K669M834O998Q078P999P100N410L091R12l08n90o63j092j769k113
52146A339707j624l54R88J557J095o1j522l147m793o244p471q577r337r262q357
$$ plain form
52243 1107447 1107902 1107456 1107246 1107523 1107941 1108496 1109574 1111226 1113066 1115108 1118070 1122384 1127350 1131867 1135752
52228 1135752 1139693 1144032 1148284 1151956 1155179 1158283 1161413 1164894 1169349 1174854 1180483 1185460 1190380 1196497
52214 1196497 1204030 1212111 1220245 1228752 1237583 1245879 1253267 1260640 1268922 1277822 1286658 1295686 1305587 1316062
52200 1316062 1326127 1335636 1345421 1355861 1366336 1376310 1386007 1395712 1405212 1414335 1423287 1431976 1439633
52187 1439633 1445649 1450289 1454079 1456918 1458202 1457352 1453738 1446647 1436041 1423023 1408933 1394256 1379028
52174 1379028 1363893 1349895 1337395 1326075 1316006 1307882 1302068 1298201 1295947 1295352 1296157 1297543 1299151
52161 1299151 1301820 1306654 1313652 1321730 1329729 1336829 1342239 1345330 1346242 1345934 1345344 1344681 1343589 1341820 1339707
52146 1339707 1338083 1337729 1338717 1340274 1341369 1341308 1339786 1336639 1331846 1325602 1318131 1309554 1300217 1290955 1282598
52131A282598p324o628n775l970j261J552L978O281Q871J1707J4426J6779J8766
52118A340000K0491K2014K3295K4297K5112K5799K5994K5089K3034K0677J8906
52107A594708J7641J6162J4231J2449J1470J1427J2146J3350J4526J5082J4947
52096A748139J4642J4485J4017J2532R925O777L692P92k296n992j0071j3354j4438
52083A778850j2996r989o502k775J355N476Q743J0768J1830J2242J2070J1503
52071A820575J1073J1292J2303J3912J5713J7050J7247J6060J3848J1215Q633
52060A968921O379M629L436K710K230J668O72q66k691m496o235q002r663j0990
52046A947702j2098j3362j4775j5724j5673j4837j3824j2791j1317r148o661m416
$$ plain form
52131 1282598 1275274 1268646 1262871 1258901 1257640 1259192 1263170 1269451 1278322 1290029 1304455 1321234 1340000
52118 1340000 1360491 1382505 1405800 1430097 1455209 1481008 1507002 1532091 1555125 1575802 1594708
52107 1594708 1612349 1628511 1642742 1655191 1666661 1678088 1690234 1703584 1718110 1733192 1748139
52096 1748139 1762781 1777266 1791283 1803815 1813740 1820517 1824209 1825001 1822705 1816713 1806642 1793288 1778850
52083 1778850 1765854 1755865 1749363 1746588 1747943 1753419 1762162 1772930 1784760 1797002 1809072 1820575
52071 1820575 1831648 1842940 1855243 1869155 1884868 1901918 1919165 1935225 1949073 1960288 1968921
52060 1968921 1975300 1979929 1983365 1986075 1988305 1989973 1990645 1989779 1987088 1982592 1976357 1968355 1958692 1947702
52046 1947702 1935604 1922242 1907467 1891743 1876070 1861233 1847409 1834618 1823301 1814153 1807492 1803076
52034A803076k443l43J902L591L994L147J713J78j410k950m083m695n238o216
52020A790223p606r067j0377j1322j1432j0459q937p743p145o793o555o738p427
52007A678622q193q785r518j0743j2414j4522j7390k1037k4645k7347k9212l0804
$$ plain form
52034 1803076 1800633 1800290 1802192 1805783 1809777 1812924 1814637 1814815 1813405 1810455 1806372 1801677 1796439 1790223
52020 1790223 1782617 1773550 1763173 1751851 1740419 1729960 1721023 1713280 1706135 1699342 1692787 1686049 1678622
52007 1678622 1670429 1661644 1652126 1641383 1628969 1614447 1597057 1576020 1551375 1524028 1494816 1464012
$$ [...]
##END NTUPLES=NMR SPECTRUM
##END=
