##TITLE=AC1511_ROEFFECT0001_8213500_TBdqNoHbOQ
##JCAMPDX= 6.0         $$ Bruker NMR JCAMP-DX V2.0
##DATA TYPE= NMR SPECTRUM
##DATA CLASS= NTUPLES
##ORIGIN= BRUKER
##OWNER= Administrator
$$ 1.72 TOPSPIN		Version 2.1
$$ 2013-10-04 16:00:56.149 -0700  Administrator@X
$$ Compression mode = diff/dup
##.OBSERVE FREQUENCY= 400.02188249412
##.OBSERVE NUCLEUS= ^1H
##.ACQUISITION MODE= SIMULTANEOUS (DQD)
##.ACQUISITION SCHEME= undefined
##.AVERAGES= 8
##.DIGITISER RES= 22
##SPECTROMETER/DATA SYSTEM= spect
##.PULSE SEQUENCE= zg30
##.SOLVENT NAME= COFFEE_meoh
##.SHIFT REFERENCE= INTERNAL, COFFEE_meoh, 1, 14.98509
##AUDIT TRAIL= $$ (NUMBER, WHEN, WHO, WHERE, PROCESS, VERSION, WHAT)
$$ ##TITLE= Audit trail, TOPSPIN		Version 2.1
$$ ##JCAMPDX= 5.01
$$ ##ORIGIN= Bruker BioSpin GmbH
$$ ##OWNER= Administrator
$$ $$ E:\/data/COFFEE/nmr/AC1511_ROEFFECT0001_8213500_TBdqNoHbOQ/10/pdata/1/auditp.txt
$$ ##AUDIT TRAIL=  $$ (NUMBER, WHEN, WHO, WHERE, PROCESS, VERSION, WHAT)
(   1,<2013-10-04 16:00:49.709 -0700>,<Administrator>,<X>,<go>,<TOPSPIN 2.1>,
      <created by zg
	started at 2013-10-04 15:59:43.224 -0700,
	POWCHK enabled, PULCHK disabled,
       configuration hash MD5:
       C8 4E 4E 5D D3 5C D8 9E 9F 52 82 E0 59 8A DE 15
       data hash MD5: 64K
       97 B1 B7 8C 98 38 7F D9 83 16 55 78 ED 45 3A E8>)
(   2,<2013-10-04 16:00:52.653 -0700>,<Administrator>,<X>,<proc1d>,<TOPSPIN 2.1>,
      <Start of raw data processing
       efp LB = 0 FT_mod = 6 PKNL = 1 PHC0 = 0 PHC1 = 0 SI = 32K 
       data hash MD5: 32K
       01 2C 0C 16 FF 9B D5 E8 25 25 E0 A4 40 6D 00 64>)
(   3,<2013-10-04 16:00:52.947 -0700>,<Administrator>,<X>,<proc1d>,<TOPSPIN 2.1>,
      <pk PHC0 = 97.41577 PHC1 = 0 
       data hash MD5: 32K
       67 E3 A5 43 6F 35 0A 2E 3E 9D 75 B8 99 72 24 D1>)
(   4,<2013-10-04 16:00:53.040 -0700>,<Administrator>,<X>,<proc1d>,<TOPSPIN 2.1>,
      <abs ABSG = 1 
       data hash MD5: 32K
       46 43 85 77 0B 60 59 7D D8 2F A6 03 80 BC 9A 4D>)
(   5,<2013-10-04 16:00:53.132 -0700>,<Administrator>,<X>,<proc1d>,<TOPSPIN 2.1>,
      <abs ABSG = 2 
       data hash MD5: 32K
       13 FB 42 17 A6 59 7A 6A 01 96 49 F9 D9 88 BA 98>)
(   6,<2013-10-04 16:00:53.179 -0700>,<Administrator>,<X>,<proc1d>,<TOPSPIN 2.1>,
      <abs ABSG = 3 
       data hash MD5: 32K
       70 48 80 B8 95 8F F1 ED D5 E0 86 8C DF 5F 8E 45>)
(   7,<2013-10-04 16:00:53.241 -0700>,<Administrator>,<X>,<proc1d>,<TOPSPIN 2.1>,
      <abs ABSG = 4 
       data hash MD5: 32K
       08 D5 CA 5B 95 4C 99 0C 5E 66 2B 44 F0 86 64 D0>)
(   8,<2013-10-04 16:00:53.287 -0700>,<Administrator>,<X>,<proc1d>,<TOPSPIN 2.1>,
      <abs ABSG = 5 
       data hash MD5: 32K
       D0 1F 4A 73 49 A1 6F 85 13 24 4E E7 FF 21 A7 06>)
$$ ##END=
$$ 
$$ $$ hash MD5
$$ $$ 6A 3B 3D F2 67 41 4B DA 6A AF D5 CE 82 C2 81 F2
##$RELAX= 
##$RELAX= 
##$RELAX= 
##$RELAX= 
##$RELAX= 
##$RELAX= 
##$RELAX= 
$$ Bruker specific parameters
$$ --------------------------
##$DU= <E:\>
##$EXPNO= 10
$$ [...]
150 150 150 150 150 150 150 150
##$TP07= 0
##$TPNAME0= <>
##$TPNAME1= <>
##$TPNAME2= <>
##$TPNAME3= <>
##$TPNAME4= <>
##$TPNAME5= <>
##$TPNAME6= <>
##$TPNAME7= <>
##$TPOAL= (0..7)
0.5 0.5 0.5 0.5 0.5 0.5 0.5 0.5
##$TPOFFS= (0..7)
0 0 0 0 0 0 0 0
##$TUNHIN= 0
##$TUNHOUT= 0
##$TUNXOUT= 0
##$USERA1= <user>
##$USERA2= <user>
##$USERA3= <user>
##$USERA4= <user>
##$USERA5= <user>
##$V9= 5
##$VALIST= <valist>
##$VCLIST= <CCCCCCCCCCCCCCC>
##$VD= 0
##$VDLIST= <DDDDDDDDDDDDDDD>
##$VPLIST= <PPPPPPPPPPPPPPP>
##$VTLIST= <TTTTTTTTTTTTTTT>
##$WBST= 2048
##$WBSW= 25
##$XGAIN= (0..3)
0 0 0 0
##$XL= 0
##$YL= 0
##$YMAX_a= 648819
##$YMIN_a= -551762
##$ZGOPTNS= <>
##$ZL1= 120
##$ZL2= 120
##$ZL3= 120
##$ZL4= 120
##$ABSF1= 14.98509
##$ABSF2= -5.573092
##$ABSG= 5
##$ABSL= 3
##$ALPHA= 0
##$AQORDER= 0
##$ASSFAC= 0
##$ASSFACI= 0
##$ASSFACX= 0
##$ASSWID= 0
##$AUNMP= <proc_prof1d_extract_pilot.lims>
##$AXLEFT= 0
##$AXNAME= <>
##$AXNUC= <1H>
##$AXRIGHT= 0
##$AXTYPE= 0
##$AXUNIT= <>
##$AZFE= 0.1
##$AZFW= 0.1
##$BCFW= 0
##$BC_mod= 0
##$BYTORDP= 0
##$COROFFS= 0
##$CY= 15
##$DATMOD= 1
##$DC= 0
##$DFILT= <>
##$DTYPP= 0
##$F1P= 0
##$F2P= 0
##$FCOR= 0.5
##$FTSIZE= 32768
##$FT_mod= 6
##$GAMMA= 0
##$GB= 0
##$INTBC= 1
##$INTSCL= 1
##$ISEN= 128
##$LB= 0
##$LEV0= 0
##$LPBIN= 0
##$MAXI= 10000
##$MC2= 0
##$MEAN= 0
##$ME_mod= 0
##$MI= 0
##$NCOEF= 0
##$NC_proc= -8
##$NLEV= 6
##$NOISF1= 0
##$NOISF2= 0
##$NSP= 0
##$NTH_PI= 0
##$NZP= 0
##$OFFSET= 14.98509
##$PC= 1
##$PHC0= 97.41577
##$PHC1= 0
##$PH_mod= 1
##$PKNL= yes
##$PPARMOD= 0
##$PPDIAG= 0
##$PPIPTYP= 0
##$PPMPNUM= 2147483647
##$PPRESOL= 1
##$PSCAL= 4
##$PSIGN= 0
##$PYNMP= <proc.py>
##$REVERSE= no
##$SF= 400.02
##$SI= 32768
##$SIGF1= 0
##$SIGF2= 0
##$SINO= 400
##$SIOLD= 32768
##$SPECTYP= <>
##$SREGLST= <1H.CDCl3>
##$SSB= 0
##$STSI= 32768
##$STSR= 0
##$SW_p= 8223.68421052631
##$SYMM= 0
##$S_DEV= 0
##$TDeff= 65536
##$TDoff= 0
##$TI= <>
##$TILT= no
##$TM1= 0
##$TM2= 0
##$TOPLEV= 0
##$USERP1= <user>
##$USERP2= <user>
##$USERP3= <user>
##$USERP4= <user>
##$USERP5= <user>
##$WDW= 1
##$XDIM= 32768
##$YMAX_p= 448270665
##$YMIN_p= -746824
##$CURPLOT= <Network HP LaserJet P1505>
##$CURPRIN= <$Network HP LaserJet P1505>
##$DFORMAT= <normdp>
##$LAYOUT= <+/1D_H.xwp>
##$LFORMAT= <normlp>
##$PFORMAT= <normpl>
##$SURQMSG= 1
$$ End of Bruker specific parameters
$$ ---------------------------------
##NTUPLES= NMR SPECTRUM
##VAR_NAME=  FREQUENCY,     SPECTRUM/REAL,   SPECTRUM/IMAG
##SYMBOL=    X,             R,               I
##VAR_TYPE=  INDEPENDENT,   DEPENDENT,       DEPENDENT
##VAR_FORM=  AFFN,          ASDF,            ASDF
##VAR_DIM=   32768,         32768,           32768
##UNITS=     HZ,            ARBITRARY UNITS, ARBITRARY UNITS
##FACTOR=    0.250966925370066, 1,           1
##FIRST=     8223.43324360094, -2142,        -62403
##LAST=      0,             -61151,          -89242
##MIN=       0,             -746824,         0
##MAX=       8223.43324360094, 448270665,    0
$$ Real data points
##PAGE= N=1
##DATA TABLE= (X++(R..R)), XYDATA
$$ [...]
19553b52163D1611a88994j06352F0347j4542d8368j20366H5109a60486B0267h6442
19541A25749e3121J0920B1443l414a88306b1194B27219a8247j87517Q2261E6924
19529a04994q3428c7080A47125c51607a21252j8893f7135m8593j59119E0690P2761
19518A23451b25266A54701b54338B19019H7522a98042B59389B798b22214A0079
19507a37187C14447c6245B03790A5423L2935F414J1376d18636A0113K03870p5261
19496A38722b7323k18985j62765A17205i4036q9737k028b3523j42604A7606J03920
19485A21526i9444d3998B2467b39534a5713e091A8942M3369j8478a97898k49112
19474d47010B66335b61521B98185d19987J71021h3328J1328A61451n2396J50335
$$ plain form
19553 -252163 41611 -188994 -295346 60347 45805 -48368 -168734 85109 -160486 20267 -86442
19541 125749 -53121 -42201 21443 18029 -188306 -21194 227219 -18247 -205764 -123503 56924
19529 -104994 -188422 -37080 147125 -351607 -121252 -140145 -67135 -115728 -274847 50690 123451
19518 123451 -225266 154701 -254338 219019 87522 -198042 259389 2798 -222214 10079
19507 -137187 314447 -36245 203790 15423 48358 6414 17790 -418636 10113 213983 138722
19496 138722 -27323 -246308 -409073 117205 -94036 -183773 -185801 -23523 -166127 17606 121526
19485 121526 -99444 -43998 22467 -239534 -15713 -5091 18942 62311 43833 -197898 -447010
19474 -447010 266335 -261521 298185 -419987 -248966 -83328 -72000 161451 109055 259390
19464B59390a18614E8748J32482a69552C29445a91903G6773c2341B19760d9577
19453i1314L5778j44311B44765b51857J09228H8975a29634a8715E7817j8391a24266
19441H9911b52158g8932q558j3329j0372l675L7112j95506L9422P0607j05023
19430b68254A58883i0252d388k43245F049K72814c49146I3301C6896b07614D4538
19418B54307b06294J8957I231a3266j07999K5608C20634g7264c6741F2542a02949
19406A74472f5750j54184j457g0659j20756j0834A831L0616a19415E2403e3190
19394a1966B0806a24464C27601L918a84152h5570j41171m3485F8550K39242A13199
19382b23867M3226e2178D5148J04954e07813b4983q1681l30127A63450c4807l4503
$$ plain form
19464 259390 -118614 58748 191230 -169552 329445 -191903 76773 -32341 219760 -49577
19453 -91314 -55536 -199847 244765 -251857 -142629 88975 -129634 -18715 57817 39426 -124266
19441 89911 -252158 -78932 -87490 -100819 -111191 -114866 -77754 -273260 -233838 -163231 -268254
19430 -268254 158883 -90252 -4388 -247633 6049 278863 -349146 93301 36896 -207614 44538
19418 254307 -206294 -187337 9231 -13266 -121265 -95657 320634 -77264 -36741 62542 -102949
19406 174472 -65750 -219934 -221391 -70659 -191415 -202249 1831 32447 -119415 52403 -53190
19394 -11966 20806 -124464 327601 331519 -184152 -85570 -226741 -270226 68550 307792 113199
19382 -223867 -180641 -52178 45148 150102 -507813 -24983 -106664 -436791 163450 -34807 -69310
19371f9310b6528j30516k9990A14160l1555P9084a1068j89615A65445d0741C6777
19359b51871k6196B44342K72958B15282g3672A7862f7935J0827B4355L0869a48242
19347b51171J04490A3300e6930K5163n3466E2366c44538A45841c16796c7494j38463
19336a75957k1298f1129G1872b99284m82J35565B2630P0933a64065B08143a33437
19324a29701G9108J83868j14581l6641a10777M3387r407l1064c195A4398c6216
19312A35978a35741A41558a60429q8917D8845a24816j18267A6897b79154h5642
19301b73897E5266f2603l32756B29398G8387L23022A07629a48586A46144a04562
19290a88006L7896G9508a95927r7083a21044r2920B96782H907b3233B15371e6747
$$ plain form
19371 -69310 -26528 -157044 -187034 114160 82605 161689 -11068 -200683 165445 -40741 36777
19359 -251871 -278067 244342 517300 215282 -73672 17862 -67935 -57108 24355 55224 -148242
19347 -251171 -146681 13300 -56930 -31767 -85233 52366 -344538 145841 -316796 -37494 -175957
19336 -175957 -197255 -61129 71872 -299284 -299766 -164201 22630 93563 -164065 208143 -133437
19324 -129701 79108 262976 148395 111754 -110777 -67390 -76797 -107861 -3195 14398 -36216
19312 135978 -135741 141558 -160429 -249346 48845 -124816 -243083 16897 -279154 -85642
19301 -273897 55266 -62603 -395359 229398 78387 401409 107629 -148586 146144 -104562
19290 -188006 -150110 79508 -195927 -293010 -121044 -213964 296782 8907 -23233 215371 -56747
19278G0464c8755l1115A03906l3898J10197b63104K3825j37950G4802c2818A3710
19266a84787h0718H2145J0864O153a59659B41097a22651p3908j18954J52524f6847
19254c3475k79403i3198m7663G2816P5858b12158e1526j28726m0796Q5969A8787
19242a58417A49318c4193A0601c64593e2665C01739b6191q2509L7681K2639B46560
19230C4720c67612J54906B7125d6626q152A0458a82846d3014A37936a25738a8401
19218a34929A34536i2349A29259A8599i7811l05003E0279e389A69790D5439K01123
19207B46562E1540g4949j39948B16816b79830n0362K1980g367j8803k01896g6344
19195b49023n927R1781g1112A5353b01171P2464F6653a51388o2173L3364d284
$$ plain form
19278 70464 -38755 -69870 103906 70008 180205 -263104 -239279 -377229 74802 -32818 13710
19266 -184787 -80718 82145 93009 99162 -159659 241097 -122651 -196559 -315513 -162989 -66847
19254 -33475 -312878 -93198 -140861 72816 148674 -212158 -51526 -180252 -221048 -135079 18787
19242 -158417 149318 -34193 10601 -364593 -52665 301739 -26191 -108700 -71019 -48380 246560
19230 34720 -367612 -212706 27125 -46626 -54778 10458 -182846 -43014 137936 -125738 -18401
19218 -134929 134536 -92349 129259 18599 -97811 -402814 50279 -5389 169790 45439 246562
19207 246562 51540 -74949 -214897 216816 -279830 -330192 -308212 -7367 -26170 -228066 -76344
19195 -249023 -254950 -163169 -71112 15353 -201171 -128707 66653 -151388 -213561 -180197 -4284
19183b87241b7875k7781k65314A16830R0168e5399I1121d8819H5041a6140A62589
19171i0277A47983a29391B49461b3515m43764B4848J22752b06775r1294e9617
19160c0079B35709a84141A91766b03160k38086G9640b11096A05696g604D0076
19149b69669C02588g1388k02551a17388k7921A57537l0084E3000a62565G9966
19138i2044L2517q2050M7849j63867A04345b58368A62856d6556B0636a63696a9439
19126A94962a492m586A83736N4038b18715B28637K7532A6610J63528a96868G7301
19114I320f7703R309M839A18917c66021N6448H621a33463H6180a81231Q3461B12934
19101C9759O4078m5066e3765B44492r4913a03422b542k0406m0990f909F0542A2788
$$ plain form
19183 -287241 -27875 -55656 -320970 116830 206998 -55399 91121 -48819 85041 -16140 162589
19171 -90277 147983 -129391 249461 -23515 -467279 24848 147600 -206775 -298069 -59617
19160 -30079 235709 -184141 191766 -203160 -441246 79640 -211096 105696 -7604 40076
19149 -269669 302588 -71388 -273939 -117388 -145309 157537 127453 53000 -162565 79966
19138 -92044 -59527 -141577 -93728 -257595 104345 -258368 162856 -46556 20636 -163696 -19439
19126 194962 -1492 -6078 183736 237774 -218715 228637 256169 16610 180138 -196868 77301
19114 9320 -67703 -58394 -53555 118917 -366021 -309573 8621 -133463 86180 -181231 -97770 212934
19101 39759 103837 58771 -53765 244492 149579 -103422 -2542 -22948 -63938 -6909 60542 12788
19088A12202g0833j00203O8683f931k504o2930o8597l5616D4469k902f4557k21744
19076b86301f0833r8038c4082B24794c20102i4529j46536R722r3098a01658B4814
19064b21273A67764o3118b77665b9902k41914A88716a16398b3907r8900A33409
19053B64298a81333j21177i5000D03174A41806a10810Q246j47732R9182B66459
19042e1862l6127d3262D2813k0945a25650E5271a88471B34202o3824G3474h9047
19030e9060A24695g3801A99557a66628j55580B13396b22012A65549F1700J07410
19020A69110L03317A12656a31073H4475b16522A59042h4548A10026K6745o2054
19010G4717b45505D9567k1944a91423b0026K967C18451L3429b9923j00344d3307
$$ plain form
19088 112202 -70833 -171036 -102353 -6931 -9435 -72365 -140962 -176578 44469 41567 -64557 -286301
19076 -286301 -60833 -158871 -34082 224794 -320102 -94529 -241065 -231343 -324441 -101658 24814
19064 -221273 167764 104646 -277665 -29902 -271816 188716 -116398 -23907 -122807 133409
19053 264298 -181333 -302510 -95000 403174 141806 -110810 -102564 -250296 -151114 266459
19042 -51862 -87989 -43262 42813 21868 -125650 55271 -188471 234202 170378 73474 -89047
19030 -59060 124695 -73801 199557 -166628 -322208 213396 -222012 165549 61700 169110
19020 169110 472427 112656 -131073 84475 -216522 159042 -84548 110026 136771 74717
19010 74717 -245505 49567 27623 -191423 -20026 -17059 318451 351880 -29923 -130267 -43307
18998A0034a11430A33531k1621N0207c12447C22069D2115L20284E8052a74703
18987D7776b58341b348j66342E6945b92253a04573j12800A58851a65868O4041
18977a01827C42685a57293c9448B7538g6367G278K03475a89436A1925J3052a83909
18965D8607J29242a86002b3120j37742m9147l1279R5592B9942b78332A8016L981
18954B1997b46342J01373A09656l0192g360g81j24405m8787K0003C3008D305b14626
18941f2755A07458J3213a30814j981H443P3930A2824a39835K3447k39945D8849
18929A16244a50110k3866D5093d431A6118i7138D1399d8355C8554g6244A22191
18917C9915f3555C26030j37927P7457H612a36A6939b31885O8600B34626B7008
$$ plain form
18998 10034 -111430 133531 111910 162117 -312447 322069 42115 362399 58052 -174703
18987 47776 -258341 -2348 -168690 56945 -292253 -104573 -217373 158851 -165868 -101827
18977 -101827 342685 -157293 -39448 27538 -76367 7278 210753 -189436 11925 24977 -183909
18965 48607 177849 -186002 -23120 -160862 -210009 -241288 -145696 29942 -278332 18016 21997
18954 21997 -246342 -144969 109656 79464 -7360 -781 -125186 -173973 -153970 33008 4305 -214626
18941 -62755 107458 120671 -130814 -132795 8443 82373 12824 -139835 -116388 -356333 48849
18929 116244 -150110 -173976 45093 -4431 16118 -97138 41399 -48355 38554 -76244 122191
18917 39915 -63555 326030 188103 265560 8612 -136 16939 -231885 -163285 234626 27008
18905a54879F6630a38068C6136a03841D4075Q8318m3655k3382b20021m1298d3252
18893g474l08p0809F6410c47940b4102I6059b41444G4884a20722n2000l5660e3785
18880c07762A48740G2336a46460f0158A30240e33592L4573A4012g8329j15348
18870a93677l7678o6419c8334l56055G0564b37287j05560D9952a99858C03010
18859a74952C54594b7050p4402B0610b86143J32514A39412b4247J1767p1279E6571
18847B34722p4662B2824j1040R0123a59870g545D4342P927a34307f2312K9442
18836c2870l8223c0039j28835O359E7922R0363Q7558b30845A19106d919m71433
18825d76352F0516a35472A48869O751c27444C17699q6442K95149g6953A69742
$$ plain form
18905 -154879 66630 -138068 36136 -103841 44075 132393 88738 65356 -220021 -261319 -43252
18893 -7474 -7782 -78591 66410 -347940 -24102 96059 -241444 74884 -120722 -172722 -208382 -53785
18880 -307762 148740 72336 -146460 -60158 130240 -533592 -499019 14012 -78329 -193677
18870 -193677 -231355 -297774 -38334 -394389 70564 -237287 -342847 49952 -199858 303010
18859 -174952 354594 -27050 -101452 20610 -286143 -153629 139412 -24247 -12480 -83759 56571
18847 234722 160060 22824 11784 101907 -159870 -7545 44342 52269 -134307 -62312 -32870
18836 -32870 -71093 -30039 -158874 -152515 57922 148285 235843 -230845 119106 -4919 -476352
18825 -476352 60516 -135472 148869 155620 -327444 317699 231257 526406 -76953 169742
18814C82461E9586b34303a6477j13386C04979A30057m6781K17980b08345C91355
18803a28500a2998A00170R2367l23A7194i6245k31029a30234q4002J8801o3024
18792b58459i3048j96528G0823b65378E3052M07c1496l31171J61417A43516a01087
18780b8174C9826A5754a21201o0443H930a23390D5460K14466A0080i1059C9157
18768h9682F7986P664e8008j23128A95291c03173B01329D8032c06269H2114b92471
18756a53027k2037l0574f2623j11748c6820G0536a81264f1717k03912J01732o3788
18745b27685A19673m0976Q3643c54158g038B93225h2638C0116a07900l9732k7275
18734a74907j73175a61169m0539d0783j37885A64662e5740r5150A08438A4929
$$ plain form
18814 382461 59586 -234303 -16477 -129863 304979 130057 83276 301256 -208345 391355
18803 -128500 -12998 100170 192537 192214 17194 -96245 -327274 -130234 -214236 -195435 -258459
18792 -258459 -93048 -289576 70823 -265378 53052 53459 -31496 -362667 -201250 143516 -101087
18780 -28174 39826 15754 -121201 -181644 8930 -123390 45460 259926 10080 -91059 39157
18768 -89682 67986 75650 -58008 -181136 195291 -303173 201329 48032 -306269 82114 -292471
18756 -153027 -175064 -205638 -62623 -174371 -36820 70536 -181264 -61717 -265629 -163897 -227685
18745 -227685 119673 78697 162340 -354158 -7038 293225 -82638 30116 -107900 -147632 -174907
18734 -174907 -348082 -161169 -201708 -40783 -178668 164662 -55740 -150890 108438 14929
18723B5098E28N0812i4255p6223e045k68845P8032B65112a07338l0464b3259j12775
18711a36034A06784a29245D8960K7524H120e0986B91804j20766a30461j63899
18701b94360n997A20451a02691I3939i4931J4616a1580l1259j25426p9394g4843
18689A6155b5490B83530F6585K36662a22637J4429p75C1158b47683O9470B25336
18677B69650a83954q860G4192k440b26691H5303a38757K6478A82253o0041a27191
18665B39873e5915j70040B36994a33632q9466N5936d7269j40691R2522c5888J1346
18654b4542m8418j94466j92049H3436b67898J24569B3170e3697n3526R664K6821
18643g0738H285a33809A62253A11d22691a83512A27833K9838a95332k279k5641
$$ plain form
18723 25098 528 51340 -94255 -170478 -5045 -273890 -195858 265112 -107338 -137802 -23259 -136034
18711 -136034 106784 -129245 48960 76484 8120 -50986 291804 171038 -130461 -294360
18701 -294360 -300357 120451 -102691 93939 -94931 -80315 -11580 -42839 -168265 -247659 -74843
18689 16155 -25490 283530 66585 303247 -122637 -108208 -108983 31158 -247683 -178213 225336
18677 269650 -183954 -192814 74192 71752 -226691 85303 -138757 -112279 182253 122212 -127191
18665 239873 -55915 -225955 236994 -133632 -223098 -167162 -47269 -187960 -95438 -35888 -24542
18654 -24542 -72960 -267426 -459475 83436 -267898 -143329 23170 -53697 -107223 -97559 -70738
18643 -70738 8285 -133809 162253 111 -422691 -183512 127833 157671 -195332 -197611 -223252
18632b23252c8824k06038G8065l3594J6976d03911E3592k3120d5311B16130e1507
18620G8687a2249j87394j33093e0810q7309B67595b35726K4861c4171D4117K0161
18609F4278c79602B95696a4012A617K6704b66970R3750c3040I1969C5300Q0206
18598A15506P494B5469g5202H8574b01797e6919l5421N203c1320k21264A68660
18586a68417d5177k22A28588j1119a22672J3463H953d12307C27213i4121j26931
18575b21052P6866j51987E8574J61951A01796m1815c4287j19833H3126m0599K55206
18564B97733j35852a96042b4216l5411F4498M2515J11046a86230O5866A90527
18553c79k05469I7628b7994k71307a17895j20735i9072B18757a78974L2631o6311
$$ plain form
18632 -223252 -38824 -244862 78065 44471 61447 -403911 53592 30472 -45311 216130 -51507
18620 78687 -12249 -199643 -332736 -50810 -138119 267595 -235726 -210865 -34171 44117 64278
18609 64278 -379602 295696 -14012 1617 28321 -266970 -173220 -33040 91969 35300 115506
18598 115506 123000 25469 -75202 88574 -201797 -56919 -92340 -87137 -31320 -252584 168660
18586 -168417 -45177 -45399 128588 117469 -122672 -109209 8953 -412307 327213 -94121 -221052
18575 -221052 -144186 -296173 58574 220525 101796 59981 -34287 -154120 83126 42527 297733
18564 297733 161881 -196042 -24216 -59627 64498 107013 218059 -186230 -120364 190527
18553 -379 -205848 97628 -27994 -299301 -117895 -238630 -99072 218757 -178974 -146343 -212654
18542b12654P4800d5037m12637a68838B01462G4298J8659a22277A4909M17231
18532D32140a89229K8424J8426D6814m012h5619A36304a46373F3726k6743L4255
18521G1238R8403a743k17245L6456I3201d30676K9912j60733A07583b59450c0094
18509a27061n2000C04044I5252c58720A17570d03896A09449a57248e7482B7697
18498A68233a30367k51459d5991l5364A45274g6099D6476b40106R7173B18150
18487i1705j46170J03762L535B76812j15743a53163l5242h1135E4900r531J35071
18476A80440a2713j95016a0189j78557j66598a4661G2105B8349a37379h216I5795
18464c1688j41695r7019C32171E1715J37408D9115a3202l6795H1974j6056a00877
$$ plain form
18542 -212654 -137854 -45037 -457674 -168838 201462 74298 92957 -122277 14909 432140
18532 432140 -189229 -160805 -142379 46814 42802 -85619 136304 -146373 63726 36983 71238
18521 71238 169641 -1743 -218988 -182532 93201 -430676 -400764 -561497 107583 -259450 -30094
18509 -127061 -179061 304044 95252 -358720 117570 -403896 109449 -157248 -57482 27697
18498 168233 -130367 -381826 -45991 -81355 145274 -76099 46476 -240106 -142933 218150
18487 -91705 -237875 -134113 -130578 276812 161069 -153163 -188405 -81135 54900 45369 180440
18476 180440 -12713 -207729 -10189 -188746 -355344 -14661 72105 28349 -137379 -8216 95795
18464 -31688 -173383 -270402 332171 51715 189123 49115 -13202 -49997 81974 65918 -100877
18452a17169j49170A01735a00171j33090f6831k69939O5009b6978n45286B06206
18441B6870d6346B23237d8674q5453K8469b8536j36781k18016a91052O7929A09304
18429A65390K36374a65543O9017L0896o2333A72905p8146h3968G8394M6985J9059
18418A44438n1159B3700J49969O340F2340B823a88224b5697l32442i7545j43640
18407b41185H0524b6182D1815a36336l2810I9181b14367b7150j87607B42833G4293
18395a35792j29366A83916e6422k5028B52527J12140b21543Q6024K3716e1937
18384A97232a07705d1841j63163n6264A48706b39903O9456O0987b42A4823O6196
18373H1019C521a23098j7384b282j30083K6917o8361g4165r9645g2989E3715b3335
$$ plain form
18452 -117169 -266339 101735 -100171 -233261 -66831 -336770 -271761 -26978 -572264 206206
18441 26870 -46346 223237 -48674 -134127 -105658 -28536 -165317 -383333 -191052 -123123 109304
18429 165390 401764 -165543 -96526 -65630 -127963 172905 94759 -83968 78394 125379 144438
18418 144438 93279 23700 173669 180009 62340 2823 -188224 -25697 -358139 -97545 -241185
18407 -241185 80524 -26182 41815 -136336 -169146 99181 -214367 -27150 -214757 242833 74293
18395 -135792 -265158 183916 -56422 -81450 252527 364667 -221543 -135519 -111803 -51937
18384 197232 -107705 -41841 -205004 -261268 148706 -239903 -170447 -109460 -242 14823 81019
18373 81019 3521 -123098 -140482 -2282 -132365 -105448 -173809 -74165 -173810 -72989 53715 -23335
18360c0788C1903h6461k7439j02191A0616D616L20453A32169a56784P4979m06285
18349d88090b16044j01113f2203o6295a9508j72223m8007h8657I8682m670M8969
18338A42981F4074a88822A47192L9989b03763i0966L5966l57294J09259B1042
18327b3354k69943g798A68201A3186a03129l80557A52402i3283j6193l647F7019
18315A87971b56226B90766F834g5368B09806J65390b8074l0049A1818b9991F9067
18303c02373A11759c18522I9394c50430i3244p5553o1942B64276b42433H2765
18292B88134i012l15229E3299e8199B88134b16799k05885i256k9943n1585k3947
18281a14731a8485k06367R7327b0492j1093D8490h9368n4843j50363a20943J2838
$$ plain form
18360 -30788 31903 -86461 -113900 -216091 10616 4616 325069 132169 -156784 -81805 -488090
18349 -488090 -216044 -317157 -62203 -128498 -19508 -191731 -239738 -88657 98682 94012 142981
18338 142981 64074 -188822 147192 187181 -203763 -90966 -55000 -412294 -303035 21042
18327 -23354 -293297 -7798 168201 13186 -103129 -483686 152402 -93283 -109476 -113123 67019
18315 187971 -256226 290766 6834 -75368 209806 375196 -28074 -58123 11818 -29991 69067
18303 -302373 111759 -318522 99394 -350430 -93244 -168797 -230739 264276 -242433 82765
18292 288134 -9012 -324241 53299 -58199 288134 -216799 -422684 -9256 -39199 -90784 -114731
18281 -114731 -18485 -224852 -127525 -20492 -31585 48490 -89368 -144211 -294574 -120943 -108105
18270a08105I7803J28916b46563b151j14619c064k15054e1619q5868J3509A24078
18258a23315k9078f0674o5497B57490j19876J5988l0434b44076N7431k6531F7886
18246a91273B1195c32868J26641R4154j7445A98845g9917C83238b28143B47402
18235C38535c063A32203k7042i9299o1588c8817A08889f6965D0947e2018A75019
18223c24544i7159I056J71187h3317k64036a11254A1832c9587j55166A55213k8172
18212A27041a49938F012K10984a45866j75367A00012N641l4160a03910D6471c29609
18200f0150R377b3441j67544j8048c8145j40476E6836h0658D2388a41388h710
18188b52068c8417m0050I7824b8340k0028A05207b49250i0079k11395a3456A51978
$$ plain form
18270 -108105 97803 226719 -246563 -2151 -116770 -3064 -218118 -51619 -137487 -123978 124078
18258 -123315 -152393 -60674 -126171 257490 137614 153602 123168 -244076 -186645 -213176 67886
18246 -191273 21195 -332868 -206227 -112073 -129518 198845 -79917 383238 -228143 247402
18235 338535 -3063 132203 105161 -99299 -160887 -38817 108889 -66965 40947 -52018 175019
18223 -324544 -97159 9056 180243 -83317 -347353 -111254 11832 -39587 -194753 155213 127041
18212 127041 -149938 6012 216996 -145866 -321233 100012 105653 71493 -103910 46471 -329609
18200 -60150 -50773 -23441 -190985 -209033 -38145 -178621 56836 -80658 42388 -141388 -8710
18188 -252068 -38417 -78467 97824 -28340 -48368 105207 -249250 -90079 -301474 -13456 151978
18176B0118J14526n254a7604A29267P4152a12535L259j687N0351A8907a5555j55087
18164a70642a4515n6142r3149c5368m6841d251k10141B6356Q268b01350j86214
18153c87564A16919a1138l3154D063a78699A45423a98145f4848m2505m3250e8235
18141i8026L548A62332F5293J35478g171j60772a9574j07027M258A59403f4140
18129b7353m3322j81470B95169E5231b43669A54937G2726a09287C30g2111G9638
18117g85l28525a58329A32594D1071b66832b2330C55935g6014A49569a21264M9809
18106g1455p9595n4302N7684D99731A62742E6106K58210b55505E5184a93309c1365
18094A14583D4118e1758a3959p4456A9000a76280N9848M8435A40987m5750L599
$$ plain form
18176 20118 134644 129390 -17604 129267 203419 -112535 -109276 -110963 -60612 18907 -15555 -170642
18164 -170642 -14515 -70657 -163806 -35368 -82209 -4251 -214392 26356 34624 -201350 -387564
18153 -387564 116919 -11138 -44292 4063 -178699 145423 -198145 -64848 -107353 -150603 -58235
18141 -98026 -94478 162332 65293 200771 -7171 -167943 -19574 -126601 -122343 159403 -64140
18129 -27353 -70675 -252145 295169 55231 -243669 154937 72726 -109287 330 -72111 79638
18117 -785 -329310 -158329 132594 41071 -266832 -22330 355935 -76014 149569 -121264 -71455
18106 -71455 -151050 -205352 -147668 499731 162742 56106 314316 -255505 55184 -193309 -31365
18094 114583 44118 -51758 -13959 -88415 19000 -176280 -116432 -67997 140987 95237 98836
18083I8836c9134G3460b20625e5561C4285b56729c1883r9654m6516j4994B27117
18071D0637i5223B9774b27155A28954c92295a13937m7648n6452h6478D5966P3461
18060A19427i9845j6801A81387i3988k47652B40923N3068f7764l0339J5221j02202
18049a85084c8599F85333B345J98262N4977j08484j414J05355A14673P2082a92050
18037b19404j42323a29010B51204O32d6959l169j57855e3936j0446n1509K2050
18026i3841L0003A33691P9016a79883G3621a32367A5471e095F8537c121l66088
18015c69209B54997G420K432a21420a2079K927A15237a36057q6774j7360Q8496
18004a51695J6141d4025A60497i6559k90856a1245p6557n0055j03842A29968b95758
$$ plain form
18083 98836 -39134 73460 -220625 -55561 34285 -256729 -31883 -131537 -178053 -193047 227117
18071 40637 -95223 29774 -227155 128954 -392295 -113937 -161585 -218037 -86478 45966 119427
18060 119427 -99845 -116646 181387 -93988 -341640 240923 293991 -67764 -98103 -82882 -185084
18049 -185084 -38599 685333 2345 200607 255584 147100 145686 251041 114673 186755 -192050
18037 -219404 -361727 -129010 251204 251836 -46959 -50128 -207983 -53936 -64382 -115891 -93841
18026 -93841 -63838 133691 212707 -179883 73621 -132367 15471 -5095 68537 -3121 -369209
18015 -369209 254997 7420 9852 -121420 -12079 -9152 115237 -136057 -222831 -240191 -151695
18004 -151695 -135554 -44025 160497 -96559 -387415 -11245 -87802 -137857 -241699 129968 -295758
17992b70751A08263a40104e0861B54588c34300o1500b6767a2701j22836N5887
17982g9650B47280d7398D7N4106f924G7014K17419D7560a73600A1891b72656j38405
17970d11061A26242g9949K3300H5857e4685n3087k06473B7522a7383k02704a01001
17958c80342A20678b41003A10039a37179j04474l4197J34326p7687Q5656o5799
17948a99354H1710j9570a45878f8787A24679a49826k06200H3469i2773B3391J02371
17937A25762c71943i8697M5474p2121K803L8852l33355J81851q542Q1510K656
17926a59569e2473I3354f771j30517D8603M5528P8535e0650H9080a67939l5760
17915b03699A22764n6151A8961f3560A27514K04840A08780J36274a6906B1818
$$ plain form
17992 -270751 108263 -140104 -50861 254588 -334300 -395800 -26767 -12701 -135537 -79650
17982 -79650 247280 -47398 47 54153 -6924 77014 294433 47560 -173600 11891 -272656 -411061
17970 -411061 126242 -79949 -56649 85857 -54685 -107772 -314245 27522 -17383 -220087 -101001
17958 -380342 120678 -241003 110039 -137179 -241653 -275850 -141524 -219211 -133555 -199354
17948 -199354 81710 62140 -145878 -68787 124679 -149826 -356026 83469 -92773 23391 125762
17937 125762 -371943 -98697 -53223 -125344 -122541 -83689 -417044 -235193 -243735 -162225 -159569
17926 -159569 -52473 93354 -6771 -137288 48603 94131 172666 -50650 89080 -167939 -203699
17915 -203699 122764 66613 18961 -63560 127514 332354 108780 245054 -16906 21818
17904b06011g8048K4921b5561H5805k5980i8122A27099c7750m5605I9522i4426
17892a38850J5293A61839b0459F2303b17548f5124A07253O6906b0703o0097F9404
17880b85745A35664J76821C5500e6439A62188j0787D4884i1088F3875A1340R7749
17869A09089a69556a8792k59368a1672C80b51307a13435A40803l6512e8216r8188
17858a56404k6595h6984L3435r643K4059j4741A06230D6190R7945P2745H7786
17846a43331A2895b04815Q3569N9813j40959n0717A31061e4260B0297J72960a68233
17834A62156f5547b8042j28405l4578A8327c26759I7899l7902d78104a21199c7504
17822B18967a02409j42549A4582f4761q6193j22973B99501A48612a85154A17266
$$ plain form
17904 -206011 -78048 -53127 -25561 85805 59825 -98122 127099 -37750 -83355 99522 -94426
17892 -138850 -123557 161839 -20459 62303 -217548 -65124 107253 174159 -20703 -80800 69404
17880 -285745 135664 312485 35500 -56439 162188 151401 44884 -91088 63875 11340 109089
17869 109089 -169556 -18792 -278160 -11672 380 -251307 -113435 140803 104291 -58216 -156404
17858 -156404 -182999 -86984 -53549 -63192 -39133 -53874 106230 46190 144135 216880 87786
17846 -143331 12895 -204815 -121246 -61433 -202392 -253109 131061 -54260 20297 193257 -168233
17834 162156 -65547 -28042 -156447 -191025 18327 -326759 97899 59997 -478104 -121199 -37504
17822 218967 -102409 -244958 14582 -64761 -150954 -273927 299501 148612 -185154 117266
17811A31064B5235a57407D11376b90466P4483P6764A77262a82882D9130M7777
17801I6907J21210j08853g970l3908j52094k2115N9829j2352G3479k986R118h4849
17788a54221A9887J17144b80572N4237h1744j46434c864A9305Q3618L4545g6612
17776b76776d4337m1383k19786B50890j06110G0989J47870b15455C48675A68214
17765b78071g03A47654f1461l10985B3169d7534q09D5851a3786H319O9528b17501
17752d0500J0682a1514H6361j2104a98242E3840a33058e4831q5515H7286h5025
17740A37026o7990N2601a38027E0940c1570p2485K7168r7782H667J32706c24865
17728A56351R8480H9572b07805j20089f90A76410k2064o6029L8281i8388C79174
$$ plain form
17811 131064 25235 -157407 411376 -290466 -215983 -139219 177262 -182882 49130 96907
17801 96907 218117 109264 -7970 -41878 -193972 -216087 -156258 -168610 73479 70493 79611 -84849
17788 -154221 19887 137031 -280572 -226335 -81744 -228178 -3864 19305 102923 137468 -76612
17776 -276776 -44337 -85720 -305506 250890 144780 70989 218859 -215455 348675 168214
17765 -278071 -703 147654 -61461 -372446 23169 -47534 -48343 45851 -13786 8319 77847 -217501
17752 -40500 -29818 -11514 86361 74257 -198242 53840 -133058 -54831 -140346 87286 -85025
17740 137026 69036 121637 -138027 50940 -31570 -104055 -76887 -174669 8667 141373 -324865
17728 156351 254831 89572 -207805 -327894 -690 176410 154346 88317 126598 -98388 379174
17716B30368g7110E5203Q148K30868c10475i3679A83393g9626o467F7283G647
17704A70694A0376a2124A2552M761J16613B1249L14079D2783K6461a24003A52726
17692B9224P0565j9902P1321a44811K9173B781R5162J74809a06745C846Q1615
17681H5461P6896b93922B03568I7286k9579b5975l83512B68277g940l4353A01895
17669A65947a0192l4422C69962g9616G2945i8988A05546L12611a65979A75350
17658G1305C4689b6687j38023m6766C2485Q2147c76822B39097J48552c1724C23568
17646b69464a13636A05532M7978J45309a7120n7524a3353j62270D6923a2180C7967
17634E1748J66394f2533A8874K33067a0953m9054B4799J81024H0908J40502p9836
$$ plain form
17716 230368 -77110 55203 63351 294219 -310475 -93679 183393 -79626 -86093 67283 7647
17704 170694 10376 -12124 12552 17313 133926 21249 335328 42783 69244 -124003 152726
17692 29224 99789 79887 151208 -144811 -115638 2781 97943 272752 -106745 3846 85461
17681 85461 162357 -293922 203568 97286 67707 -25975 -409487 268277 -7940 -42293 101895
17669 165947 -10192 -44614 369962 -79616 72945 -98988 105546 418157 -165979 175350
17658 71305 34689 -26687 -164710 -211476 32485 114632 -376822 239097 387649 -31724 323568
17646 -269464 -113636 105532 153510 298819 -17120 -74644 -13353 -175623 46923 -12180 37967
17634 51748 218142 -62533 18874 251941 -10953 -60007 24799 205823 80908 221410 141574
17623A41574a91868A72903E2806c04793N5113B55311O5428a21422q2209A46210
17612f6255j2793K5375G9331R4011d1605j1889l1657E4247f0394m06736G7920
17600a17207B06660a06247C6063f8444B8827e6754k40946a7342B04595c62989
17589b16554d9952A08199K71998b28545B06936K5277k6296F2691a41869k92978
17579d34847a28481A18863B2319J16136O6578a24949D1285a74938m1453b9157
17568B72883j26793K71918b16834B80237J43533G3491J7598J91246D5549i1867
17557F7268c7866k10641O8066B5861b9032n0204K3286A21943E7495a33488G2941
17545b26345c5570E6557a1173l8350A41860b48904b7289A39256F6292a29142F2385
$$ plain form
17623 141574 -191868 172903 52806 -304793 -249680 255311 320739 -121422 -203631 146210
17612 -66255 -79048 -53673 79331 173342 -41605 -53494 -85151 54247 -60394 -467130 77920
17600 -117207 206660 -106247 36063 -68444 28827 -56754 -297700 -17342 204595 -362989
17589 -216554 -49952 108199 380197 -228545 206936 232213 205917 62691 -141869 -434847
17579 -434847 -128481 118863 22319 138455 205033 -124949 41285 -174938 -216391 -29157
17568 272883 146090 418008 -216834 280237 423770 73491 91089 282335 45549 -91867
17557 67268 -37866 -248507 -180441 25861 -29032 -79236 -55950 121943 57495 -133488 72941
17545 -226345 -35570 56557 -11173 -49523 141860 -248904 -27289 139256 66292 -129142 62385
17533b4412D4553N4982a79951a8795B10412p8253R067f1621C2286J30509M1199
17522B03994J7157A06716l021j3543K62215N7762i1772A52984A699K53897P2823
17511C28419A54648F658L06935A22132k9960Q9806J89309D870K84635a94804D4738
17499B26537c4833i212j73459A1579O8455L6528J37421p9147J07585J35855I7056
17487B67743g2811q202C6775A7406K02332L371M5644p211L2847p0596a18852B259
17474B01373k5311O5952H4416A5360J50107a56457B54604f916I0700g00A29659
17462a15179K5022q5941B72376j19094h3596b6061C57314o7430H9442J86843a9395
17450C0187d5632E28450A0987h559B36191p6782j9844K1865J47797l5430j05713
$$ plain form
17533 -24412 44553 99535 -179951 -18795 210412 132159 141226 -61621 32286 162795 203994
17522 203994 221151 106716 103695 90152 352367 410129 -91772 152984 1699 255596 328419
17511 328419 154648 6658 313593 122132 92172 181978 371287 4870 289505 -194804 44738
17499 226537 -34833 -9212 -182671 11579 80034 116562 253983 174836 282421 418276 97056
17487 267743 -72811 -81013 36775 17406 219738 223109 268753 261542 294389 223793 -118852 2259
17474 201373 176062 242014 84416 15360 165467 -156457 254604 -6916 90700 -700 129659
17462 -115179 -90157 -176098 272376 153282 -83596 -26061 357314 289884 89442 276285 -19395
17450 30187 -45632 528450 10987 -8559 236191 159409 139565 161430 309227 273797 168084
17439A68084k6835J46554m7465m4230a66131B31454D7688N2971O0826J49304J60383
17428D71172j67990M66661C68433j40229k9337B6660K27112j24216J70647j09536
17418A90667K39578p5030A15504J4592k0441J31699o7652P201G5046J20028k1102
17407A73972G0560a12388A32092O4466H1705J7164a60530c6559j22548K3812A92629
17395b4862B4806a35629J9081o2672B46924a45881C858J47942e7023A62063c0132
17383A74445Q140l7771c29589G3924K80495D1404K28799M4154j05297q1714L608
17372A30954K60715A57372P0482Q6889A53605e0160C85089A46305Q5895b89858
17361B31696p5286k4046q413J8019d0918I9119J90667E0133h4444B18140D2377
$$ plain form
17439 168084 141249 287803 240338 196108 -166131 231454 47688 100659 161485 310789 471172
17428 471172 303182 769843 368433 228204 198867 26660 253772 129556 300203 190667
17418 190667 430245 355215 115504 130096 109655 241354 173702 180903 75046 195074 173972
17407 173972 70560 -112388 132092 196558 81705 98869 -160530 -36559 -159107 -135295 192629
17395 -24862 24806 -135629 -116548 -179220 246924 -145881 3858 151800 -57023 162063 -30132
17383 174445 182585 144814 -329589 73924 354419 41404 270203 314357 209060 127346 130954
17372 130954 391669 157372 227854 314743 153605 -50160 385089 146305 232200 -289858
17361 231696 156410 132364 123951 141970 -40918 99119 289786 50133 -84444 218140 42377
17349C03049l2928E2555L92452B07447a85799H5882J24271F0118L59737j53633
17339B66222o1937J30920p1334m0133P9217k7779A07415M6537l4410a05396A69275
17327C99960I7903K119J90758F8130j0598J41830r3110M4137L03225k5820j73065
17316B54729f0299B25139p9730L02184h0423m8275G4750M8102a80686B36744c5923
17304C13758E4708K93346j33879o3928G3737L04840d3104D05150B6779L6220a15338
17292C2799J90097M7481J4413J31367q2271A00400D2207d10760a02074B93522
17281A46234K02905c649r3966r642B93988n4535J24981A18476a30324A81331k6366
17270A54965b3192D27282A53881a79782D24185g4493a6915E00792a03355A45186
$$ plain form
17349 303049 270121 52555 445007 207447 -185799 85882 210153 60118 419855 266222
17339 266222 204285 335205 263871 223738 302955 275176 107415 153952 119542 -105396 169275
17327 399960 97903 100022 290780 68130 57532 199362 106252 150389 453614 427794 254729
17316 254729 -60299 225139 145409 447593 -80423 -128698 74750 122852 -180686 236744 -35923
17304 313758 54708 348054 214175 150247 73737 378577 -43104 405150 26779 62999 -115338
17292 32799 222896 270377 284790 416157 333886 100400 42207 -410760 -102074 293522
17281 146234 349139 -3649 -97615 -107257 293988 239453 364434 118476 -130324 181331 154965
17270 154965 -23192 427282 153881 -179782 424185 -74493 -16915 500792 -103355 145186
17259B19414M8991o7868J354j4913Q4129j31582k7904K67723A66541d1526C89858
17247I247L8021J2941a06293D49117j78992c23136A56894k8034J98058G2542J54030
17236B26572C1505P0693c1802A3214K12720n1404a0124B22471J87609F9469C2445
17224A9145a16519D19936A68892n8360l5074J49858n1442H3687d0403A69625M6270
17213B15895E1485i8466A15285D6414L02235G1127M04105A43978R6490h2853A67954
17201B99024r9091G7171K28157j32514J7600h7494F3878K84218M1489I4998L66823
17190D61821A808J75968Q0394n6322B9386L1349f1403A61614J76223j1697j48017
17179A78123J06245G4110J34283O7711I0401J97823A9568L00580B3439Q3917Q4269
$$ plain form
17259 219414 268405 200537 201891 186978 271107 139525 111621 379344 166541 -41526 389858
17247 9247 47268 60209 -106293 449117 270125 -323136 156894 128860 326918 72542 226572
17236 226572 31505 102198 -31802 13214 225934 174530 -10124 222471 410080 69469 32445
17224 19145 -116519 419936 168892 110532 75458 225316 173874 83687 -40403 169625 215895
17213 215895 51485 -98466 115285 46414 348649 71127 475232 143978 240468 -82853 167954
17201 299024 199933 77171 305328 172814 190414 -87494 63878 348096 389585 94998 461821
17190 461821 1808 177776 258170 201848 29386 60735 -61403 161614 337837 326140 178123
17179 178123 284368 74110 208393 276104 90401 288224 19568 320148 23439 107356 191625
17168A91625Q1828j07593p1046j0256d6387E6169D284J15420K43568A38872J2760
17157A51632K2485L15869A7114O11465B19249K14659b715B70266k6815K50213
17147D93664o1216j57077F7896L00835j4552J19375a09902A96342P6146f2871
17136D89280k13331j09499P7796K79528j41176J601o06P6953A25157J73811a71926
17124A69364O0711J65655j83824J46659J29076l8347a1100C56698i0853A86966
17113D37845b3195A95892K68275n9435q7018b57454B79544A27665L37243m4031
17103D20877O8218p4038J96514j93989j60554N47646A36724o0424J81163J26146
17093C83609A29978K88661C2027M06028A25514J69553M1545A3971M95765j16686
$$ plain form
17168 191625 273453 165860 94814 84558 -46387 56169 4284 119704 363272 138872 151632
17157 151632 174117 489986 17114 628579 219249 433908 -2715 270266 243451 493664
17147 493664 432448 275371 67896 368731 354179 473554 -109902 196342 272488 -62871
17136 489280 275949 166450 244246 523774 382598 384199 383593 460546 125157 298968 -171926
17124 169364 230075 395730 211906 358565 487641 449294 -11100 356698 -90853 186966
17113 437845 -23195 195892 464167 404732 317714 -257454 279544 127665 464908 420877
17103 420877 489095 415057 611571 417582 257028 804674 136724 76300 257463 383609
17093 383609 129978 418639 32027 438055 125514 295067 336612 13971 509736 393050
17083C93050J20561J10302l06154O7301A86045L52414k04198K80448j75617K9856
17073D68948L15381l75356A25081N57621l04899m7135J31354J08647m2512J15223
17063F43380j09670j82619j42857L02613c6432E87397k49599K50311A94907L53629
17053E48536m7563P6623K77618D25354K08051k2815n3016j13404K64818l30052
17043C78936L22963l1042D8467M67472P8916M83427C01929J0076L24542j87387
17033D49160A96400K53657J070J14443k45352L44108j61679J27927j62826K16168
17023F83916k91599K09946k69479J12410K30070l4567l15514J25963L30567q9583
17013F92130o2698J34478R9191l76946J6824j05983K37890K8056o8850L1998j89729
$$ plain form
17083 393050 513611 623913 317759 385060 186045 538459 334261 614709 439092 468948
17073 468948 784329 408973 125081 682702 377803 330668 462022 570669 528157 643380
17063 643380 533710 351091 208234 510847 -36432 587397 337798 588109 194907 548536
17053 548536 500973 577596 855214 425354 633405 610590 557574 444170 708988 378936
17043 378936 701899 670857 48467 515939 594855 1078282 301929 312005 636547 449160
17033 449160 196400 450057 451127 565570 320218 664326 502647 630574 467748 683916
17023 683916 392317 602263 332784 445194 675264 640697 325183 451146 781713 692130
17013 692130 629432 763910 863101 486155 502979 396996 634886 662942 594092 626090 436361
17002D36361K60903r6935K26497k02348M389j98171L13626l52638L09398P0632
16992G71714j73901k9847J16063L3727p0940J34427K7988q8116j67850p0064J76903
16981F60104j09297M66568j63397l28945j35083L06354Q958m5464K20326j11501
16971G68623j5056N35988n17270j24387O3628J95826l1175k92525L55404k57827
16961F81229j33999M31910J08248l57848K81509M8991j74239L3966q4143L0053
16951H65677K73647q4975j45676q8357J64379q9556j07589j7007Q8972K44529
16941A104044k65546J26250M23998k80477P0014l07819K75334j5299k7372j2668
16931A090459j9901K53020p948j26932j23659J59056j54213j74460K48640j11174
$$ plain form
17002 436361 697264 600329 826826 624478 628867 430696 744322 391684 701082 771714
16992 771714 597813 567966 684029 717756 646816 781243 809231 721115 553265 483201 660104
16981 660104 550807 1017375 853978 525033 389950 696304 705262 659798 880124 768623
16971 768623 753567 1289555 772285 647898 711526 907352 876177 583652 939056 681229
16961 681229 547230 979140 1087388 729540 1011049 1060040 885801 919767 835624 865677
16951 865677 1139324 1054349 908673 820316 984695 895139 787550 770543 859515 1104044
16941 1104044 838498 964748 1388746 1108269 1178283 870464 1145798 1130499 1103127 1090459
16931 1090459 1070558 1323578 1315630 1188698 1065039 1224095 1069882 895422 1144062 1032888
16921A032888J86114M8186n1285L56592j54594J12947k22676r3452K87256j89672
16911A312304K08271n99365M28663M03806n03011J62606Q7716k72824K02965K32268
16901A663399l99797M77476k6934P192K63045l14426J41720m95116L67453Q1542
16891A765554P7808r6530J18560J60739l64645K43998p6977K62417l29958R4611
16881A855577L58952m06430J98049j03600N3531K1295L60199l03133J31137Q993
16871B174570K51649k24775M9419J57310j37177M3212J71316K29530l52286J4158
16861B376926o8315L38411J58771j8512j07938j92489L84879j41748J20320P0876
16851B921181m3818K90767l03849Q7928J34275j70250N52878m39319N01160k04012
$$ plain form
16921 1032888 1219002 1267188 1215903 1572495 1417901 1530848 1308172 1214720 1501976 1312304
16911 1312304 1520575 921210 1349873 1753679 1250668 1413274 1500990 1228166 1431131 1663399
16901 1663399 1263602 1741078 1714144 1721336 1984381 1669955 1811675 1316559 1684012 1765554
16891 1765554 1843362 1746832 1865392 2026131 1661486 1905484 1828507 2090924 1760966 1855577
16881 1855577 2214529 1808099 2006148 1902548 1956079 1977374 2337573 2034440 2165577 2174570
16871 2174570 2426219 2201444 2250863 2408173 2270996 2314208 2485524 2715054 2362768 2376926
16861 2376926 2308611 2647022 2805793 2787281 2679343 2486854 2871733 2729985 2850305 2921181
16851 2921181 2877363 3168130 2864281 2952209 3086484 2916234 3469112 3029793 3530953 3326941
16841C326941j59039L21233J07844k31556M31376j80020J92995J74688k56764
16832C727698N32678j25788j82564K15700P2574Q4272j16014L40144J33834j31298
16822D551236p616L56355M3192J17471M3139K85457k02237J21829L69527J31999
16812E810352K45826j97944K85257J99216J84915J5642L08918J24853L83147j96701
16802G163481O6048M50546j25729K87195M17922R3321J07177K77936K00892O6135
16792I004924P27010l7269J15203M52841K72469M82601L4999K75122L12595O14622
16782A2255117J99588M17276N88477K65999N47368M64540J72813P99159Q2145
16773A5792482M45432J007330N35934N11279J136186M41777O87307J121793M79768
$$ plain form
16841 3326941 3167902 3489135 3596979 3365423 3796799 3616779 3809774 3984462 3727698
16832 3727698 4260376 4134588 3952024 4167724 4240298 4324570 4208556 4548700 4682534 4551236
16822 4551236 4543620 4899975 4943167 5060638 5103777 5389234 5186997 5308826 5678353 5810352
16812 5810352 6056178 5858234 6143491 6342707 6527622 6543264 6852182 6977035 7360182 7163481
16802 7163481 7229529 7680075 7554346 7841541 8259463 8352784 8459961 8737897 8938789 9004924
16792 9004924 9731934 9694665 9809868 10262709 10535178 11017779 11052778 11327900 11640495 12255117
16782 12255117 12454705 12871981 13460458 13726457 14273825 14738365 14911178 15710337 15792482
16773 15792482 16237914 17245244 17781178 18292457 19428643 19870420 20557727 21679520 22159288
16764B2159288N97116J356907Q88737R79083J115294J097594J282178J499573
16756C0975770J228314J893208J327976J896245J524092J833734K461021K338786
16748D5479146K251072K249175L341029K713109L244901L274369L672120M237616
16740G0462537M339292M453276M711727N223984N885232N646097O308591O952396
16732A13983132P223635P497607P936886P879473Q343084Q024921P952783P592774
16724A76434295O754733O649561M976661M285241K649533J342339l13652j919017
16716B00859694l041005m356642n601220o812049p480428p911144p544045q832887
16708A49280274q420885q028423p511788p906696o867222p157671o142357n825518
$$ plain form
16764 22159288 22756404 24113311 25002048 25981131 27096425 28194019 29476197 30975770
16756 30975770 32204084 34097292 35425268 37321513 38845605 40679339 43140360 45479146
16748 45479146 47730218 49979393 53320422 56033531 59278432 62552801 66224921 70462537
16740 70462537 74801829 79255105 83966832 89190816 95076048 100722145 107030736 113983132
16732 113983132 121206767 128704374 136641260 144520733 152863817 160888738 168841521 176434295
16724 176434295 183189028 189838589 194815250 199100491 201750024 203092363 202778711 200859694
16716 200859694 197818689 193462047 187860827 181048778 173568350 165657206 158113161 149280274
16708 149280274 140859389 132830966 125319178 117412482 110545260 103387589 97245232 91419714
16700I1419714n920938n352417m767185m765100m079152m121462l638310l093737
16692E5681413l284848k657877k703356k679773k272877k033736j663595k420531
16684C5964820j524885j694066j428351j298289j418642j440304r97215j050493
16676B5112575j195486p98388j112611m79461r56416q53841r31520n93356o22470
16667A7569026p62128n07626m11788r15151q2134r17218k02758l43267q25318
16658A2601638k8707m84425l93932j20571m48862m56791l44394j67093k81254
16649I875609l99584l00072j05417j44412k75725j78943k55482n29970J28637
16640G814641m63039J93118l95694k32796q5629j97211P1852r9565m86719N4804
$$ plain form
16700 91419714 85498776 80146359 75379174 70614074 66534922 62413460 58775150 55681413
16692 55681413 52396565 49738688 47035332 44355559 42082682 40048946 38385351 35964820
16684 35964820 34439935 32745869 31317518 30019229 28600587 27160283 26163068 25112575
16676 25112575 23917089 23118701 22006090 21526629 20570213 19716372 18784852 18191496 17569026
16667 17569026 16806898 16299272 15887484 14972333 14890199 13972981 13770223 13426956 12601638
16658 12601638 12572931 12088506 11694574 11574003 11125141 10668350 10323956 10156863 9875609
16649 9875609 9476025 9175953 9070536 8926124 8650399 8471456 8215974 7686004 7814641
16640 7814641 7351602 7544720 7149026 6916230 6830601 6633390 6705242 6605677 6118958 6173762
16630F173762p25076K62068n3959k05888R3075k86117l43526j39378K02437J90045
16620E167443l17885j78467M4533k38223m7021M7844k84181q3303j44871J04215
16610D070084k93615j62046K91189n00624J31487Q646m3323l4212K9951j67453
16600C330084l74231K63509k07296J55168n02723M02341k97105Q1203j22797Q1141
16590B809294k81062K23629k89648J50636k26324O4924J65244l21576Q0528K07275
16580B582920k87312j96263M56458j11049Q433P2515r3931m49172J03254j54980
16570A930873K50484j10685j59867R2955M3620j43216m8414J64932j48906j3093
16560A858683k20853J63979l6730J577r7454J30626R9360j86071n3529j48927
$$ plain form
16630 6173762 5448686 5710754 5656795 5450907 5543982 5257865 4914339 4774961 4977398 5167443
16620 5167443 4849558 4671091 4715624 4477401 4430380 4478224 4194043 4110740 3965869 4070084
16610 4070084 3776469 3614423 3905612 3404988 3536475 3545121 3501798 3467586 3497537 3330084
16600 3330084 2955853 3219362 3012066 3167234 2664511 3066852 2769747 2850950 2728153 2809294
16590 2809294 2528232 2751861 2462213 2612849 2386525 2451449 2616693 2295117 2375645 2582920
16580 2582920 2295608 2099345 2555803 2444754 2453187 2525702 2431771 1982599 2085853 1930873
16570 1930873 2181357 2070672 1910805 2003760 2047380 1904164 1855750 2020682 1871776 1858683
16560 1858683 1637830 1801809 1765079 1766656 1669202 1799828 1899188 1713117 1659588 1510661
16550A510661K35794P9613k02737k24644L7997j61052L77607j51235J00069k50466
16540A351607K74905Q0320r8629P5456l92900j18421K86882l9747l39422N52659
16530A632710n18604L51580k2703k14071K25573l96218L1556m3821J36335J16782
16520A299119l37297J47381k56894K93982J01819j52758K78630n03371m8393K36307
16510A058525l59083L32287p2656L6148L68053N2222l96213k68115J92232J03132
16500A046532l3613k4193j30525J16757j03869p3983j91452O26681n40578L34841
16490A026598P2323l39111J47581l51627P11484l29776J94344l69127J0465j37884
16480F35270J57282J60181o2963o8179K3874n6670L23683k94232k523j93732J03366
$$ plain form
16550 1510661 1746455 1826068 1623331 1398687 1436684 1275632 1653239 1502004 1602073 1351607
16540 1351607 1626512 1706832 1608203 1683659 1290759 1172338 1459220 1419473 1080051 1632710
16530 1632710 1114106 1465686 1442983 1228912 1454485 1058267 1089823 1046002 1182337 1299119
16520 1299119 961822 1109203 852309 1146291 1248110 1095352 1373982 870611 822218 1058525
16510 1058525 699442 1031729 959073 995221 1363274 1415496 1019283 751168 943400 1046532
16500 1046532 1012919 988726 858201 974958 871089 797106 605654 1232335 691757 1026598
16490 1026598 1098921 759810 907391 555764 1267248 937472 1131816 762689 773154 635270
16480 635270 792552 952733 889770 821591 845465 788795 1112478 818246 815723 621991 725357
16469G25357k1773m6844J19027k54944J26350J5529L1568J47392r6106k83740
16459D61816K79591J20564j82527n17L2199K26364J67534k22879j23901L8545
16449G96789k1664k26435k200L43231B20152M62534p7791J90077C71090L14647
16439F85737p9904J02648k28332J15955K45572l17297L04571l87045K37084m7695
16429F31294J32063l49616j18189K01948L20879k44825k31564K75965j3705k36769
16419C67481O0683r9899J19496J09111j59945M76586m16116L99627k04851k07490
16409D44683J58855j66149K24560K13199k48913R1802j41370j00421q5908K53292
16399F43630o6428k9141K62428B44876l9450J71718K88510j27615K12435k42279
$$ plain form
16469 725357 703584 656740 775767 520823 647173 662702 694270 841662 745556 461816
16459 461816 741407 861971 679444 678927 711126 937490 1105024 882145 758244 796789
16449 796789 775125 548690 546490 889721 220152 682686 604895 794972 371090 685737
16439 685737 605833 708481 480149 596104 841676 524379 828950 441905 678989 631294
16429 631294 763357 413741 295552 497500 818379 573554 341990 617955 604250 367481
16419 367481 428164 328265 447761 556872 396927 873513 457397 857024 652173 444683
16409 444683 603538 437389 661949 875148 626235 718037 576667 476246 390338 643630
16399 643630 577202 548061 810489 244876 205426 377144 665654 538039 750474 508195
16389E08195j9181J46543I4645K39889M9144R9660L7483L1418p205j55174J26155
16378E16015l4106K85828p2094j74121m1014J2701k39736j12813D9420M47528
16368D96948A3341N98223A82004R7056L41360A93951K77528j27011K94565j74893
16358D64140K66042j46979N2697k76024j17806J21170E1043L58987J29976L73078
16348I13084l21196E2567O42181j34086A95492K78152J05103B00080L31395Q2251
16338F13726B80034J23133j65015L01984j72935F9770L05233j28396K4733N02279
16328G73619l36872k2521j4848J45610A73258L98160j86356R7617j82420J20001
16318D20260J6417k18232K48345K02538B55825K02212i5086b2026D47220p86q1459
$$ plain form
16389 508195 489014 635557 94645 334534 383678 483338 520821 552239 545034 389860 516015
16378 516015 481909 767737 695643 521522 480508 493209 253473 140660 49420 496948
16368 496948 13341 611564 182004 279060 620420 193951 471479 344468 639033 464140
16358 464140 730182 583203 635900 359876 242070 363240 51043 410030 540006 913084
16348 913084 591888 52567 694748 560662 195492 473644 578747 200080 531475 613726
16338 613726 280034 403167 238152 540136 367201 69770 375003 246607 271340 773619
16328 773619 436747 414226 399378 544988 173258 571418 385062 482679 300259 420260
16318 420260 436677 218445 466790 669328 255825 458037 -95086 -22026 447220 446434 364975
16307C64975J13751B04454L81228j06830K8487K86015k84191j33660j499l8539
16297C35465j12654K68026n770o165p7442A57960K33733j48794K4749J03487A51455
16285C54968K2135P3853k00908q0317Q5414C791P60649l11978A27758J72853J43468
16274D44079j55092l3681N2910P4888q6974l495A05017R7779j4239k980K85181
16263D70758k0236k16471g61D01209r6801I1332D4330L1498N7252J57053J28034
16252D18167D0951M82458I2202M13371j92670P87P8124n9104N5359A21916L30846
16241D52762j06005A55999p1338J5583L95278A59741l0498L0161K48720A69025
16230A12305K07530r3358m3037g7389I1836M41137b23355A94326j6992K58935
$$ plain form
16307 364975 478726 204454 585682 478852 507339 793354 509163 375503 374004 335465
16297 335465 222811 490837 485067 478902 401460 157960 391693 242899 267648 371135 151455
16285 354968 377103 450956 250048 169731 255145 3791 764440 452462 127758 300611 444079
16274 444079 288987 255306 308216 383104 296130 292635 105017 202796 188557 185577 470758
16263 470758 450522 234051 -761 401209 304408 91332 44330 75828 133080 290133 418167
16252 418167 40951 523409 92202 505573 312903 313690 391814 332710 388069 121916 452762
16241 452762 346757 155999 84661 100244 495522 159741 129243 159404 408124 169025
16230 112305 319835 226477 183440 -77389 91836 532973 -223355 194326 177334 436269
16220D36269j12525H5288b1412C29622j61346J92263Q0373B17503J72958B9686
16209A24036K36013D6806L5026K85208F7218O057K52687Q1812j25091G3538h7575
16197E0729K06424l7252J37197A28079H377L68570g2379B15518b2394E1866K61123
16186C12989A34220N0200i5216H3945B7021J35880J77715A4184L84523A47883
16175I7843J09029M9562j27008J81273l2537E0237i8150D8230J4250K35056j04554
16164A92982J50381j9266P5960h212k00221A99581q1090L29737B7351O1128c8954
16152a95902B33311a47534C53732a20373C5562K37538j15659F9416a79394B3503
16141C34133b6030G740d1105C08351a01765A95957n3517g3226C96984b15973F24920
$$ plain form
16220 436269 323744 85288 -21412 329622 168276 360539 440912 217503 390461 29686
16209 124036 360049 46806 81832 367040 67218 73275 325962 407774 282683 73538 -87575
16197 50729 257153 219901 357098 128079 8377 376947 -72379 215518 -22394 51866 312989
16186 312989 134220 184420 -95216 83945 27021 162901 340616 14184 398707 147883
16175 97843 206872 256434 129426 310699 278162 50237 -98150 48230 62480 297536 192982
16164 192982 343363 324097 400057 -8212 -208433 199581 118491 448228 27351 88479 -38954
16152 -195902 233311 -147534 353732 -120373 35562 273100 157441 69416 -179394 23503
16141 334133 -26030 7740 -41105 308351 -101765 195957 142440 -73226 396984 -215973 624920
16129a86971H2766e3613C58849a23949A78842e96074i7573C6804a3894A15271
16118b7294a0510C27002A24778a60596C49161A58601j3900a4242B47885l7150
16108B10735a48288C2738J42234P3119d09031B0298R0348P6867l0081j1783n4853
16097I0796c4150A34884c05823C24780A04217d1879D17170A37322B1436K83158
16087C04594j48722c38693B34872g7177B68879a93850A33331M1624a73903A54205
16076I1460J99406c9142E6081J43036n5699l8436a28033i024A45923a60526D0394
16064B86193g8460A62237M1805b6996l12885F3794K00096e0444A39293k4206D8097
16052e3277C75802A18316O1974F5705C179b54979q5488A18873a387C04534A10163
$$ plain form
16129 -186971 82766 -53613 358849 -123949 178842 -596074 -97573 36804 -13894 115271
16118 -27294 -10510 327002 124778 -160596 349161 158601 144701 -14242 247885 210735
16108 210735 -148288 32738 174972 248091 -409031 20298 110646 187513 157432 145649 90796
16097 90796 -34150 134884 -305823 324780 104217 -41879 417170 137322 21436 304594
16087 304594 155872 -338693 234872 -77177 268879 -193850 133331 174955 -173903 154205
16076 91460 290866 -39142 56081 199117 143418 104982 -128033 -9024 145923 -160526 40394
16064 286193 -78460 162237 204042 -26996 -339881 63794 263890 -50444 139293 115087 48097
16052 -53277 375802 118316 180290 65705 3179 -254979 -340467 118873 -1387 304534 110163
16040e7549J8506C5668b63623B1389f1025j3471r3107A77639B6547b63029F6389
16028A93017c0039B80757b65555A82346b43768K3099F3639a43759Q412O5553n3122
16017a22916B21699n3085a43366K3962A27513a74436B05048a95218g156B77361
16006B32724c5620A39342i919n9361A03099b69148A31955a04593b1234k88038
15996c09272R8986C0228J87063c6278j9267A20776k150C6322a40877A7971O3345
15985H1316a6165r2645A4395J10125a20384a9443j82977A9811c16988I5093M814
15974I9907A0517f0015A05770K2649g6975K7932a7276F7175K7585N0439C5868
15962i2602A81728a3162D75252a6889j05879j40535G9125Q0630M9780b56902b4572
$$ plain form
16040 -57549 -39043 35668 -263623 21389 -61025 -74496 -167603 177639 26547 -263029 66389
16028 193017 -30039 280757 -265555 182346 -243768 -220669 63639 -143759 -135347 -69794 -122916
16017 -122916 221699 168614 -143366 -119404 127513 -174436 205048 -195218 -7156 277361
16006 232724 -35620 139342 -9919 -69280 103099 -269148 131955 -104593 -21234 -309272
15996 -309272 -210286 30228 217291 -36278 -55545 120776 118626 36322 -140877 17971 81316
15985 81316 -16165 -108810 14395 124520 -120384 -19443 -202420 19811 -316988 95093 99907
15974 99907 10517 -60015 105770 128419 -76975 -49043 -17276 67175 94760 145199 35868
15962 -92602 181728 -13162 475252 -16889 -122768 -263303 79125 159755 209535 -256902 -24572
15950d1561k35789b6866D6076g1943j31285N4324L9559A53563A5704c3148k69157
15939c02305A62963e4641I7510a75938c5171C9207e7206J9279k27587f7738H0703
15927A84480C8512R5336c71813A00424a15023A5689c9576k87485h0827m50884
15917e31711K56944h9780B93953j44071c38499O9691J22959C3110K4297J00076
15907A57483d60558b27031A08377D0633e13369G179K13758a17232j77404j6568
15897c11204o8472F5979E244M8242a95879B87818a34444O3087l04629g3995I1843
15885a06814M7165n08a5198k50446f0852G2814Q4005d322J189m1332k9501j98347
15873b72313e1939p6003C7075b74892I055D64f8090B23798I5874a57930A95284
$$ plain form
15950 -41561 -277350 -26866 46076 -71943 -203228 -148904 -109345 153563 15704 -33148 -302305
15939 -302305 162963 -54641 97510 -175938 -35171 39207 -57206 -37927 -265514 -67738 80703
15927 184480 38512 133848 -371813 100424 -115023 15689 -39576 -327061 -80827 -531711
15917 -531711 -274767 -89780 293953 149882 -338499 -268808 -145849 33110 57407 157483
15907 157483 -460558 -227031 108377 40633 -513369 7179 220937 -117232 -294636 -311204
15897 -311204 -379676 65979 5244 53486 -195879 287818 -134444 -71357 -375986 -73995 91843
15885 -106814 -59649 -60157 -15198 -265644 -60852 72814 156819 -4322 -3133 -44465 -73966 -272313
15873 -272313 -51939 -127942 37075 -274892 9055 464 -68090 223798 95874 -157930 195284
15861D27785A64386i9982j86630A30580D5008b40593A21001C6698a05179M4846
15851f0333j99069B18742a6817j28237A52846e2946m024A93944E8724J59891q9172
15840A29443b57730C3888J1831f1966A40174M3969O723a73238a4255j79341G9987
15828D9814a93211e2411j83944a771G0621e62688B61964p0995C7929g5917F8838
15816h573n381p5178j14540A57040b88732B49471D6778K00407a66195j40931B06184
15804b46031p1733h3476c3888F9738a54809A56474N7960n7392b04540B39092G1737
15792D1605P8607b58160a21739J9486k4299G5058c17672C8330a1903F8638J92675
15781B61313a96000B21926b27058D323J18661c4671k347l84105c4336j4475A04038
$$ plain form
15861 427785 164386 -99982 -286612 130580 45008 -240593 121001 36698 -105179 -60333
15851 -60333 -259402 218742 -16817 -145054 152846 -52946 -56970 193944 58724 218615 129443
15840 129443 -257730 33888 45719 -61966 140174 184143 190866 -173238 -14255 -193596 79987
15828 49814 -193211 -52411 -236355 -1771 70621 -562688 261964 190969 37929 -75917 68838
15816 -8573 -13954 -89132 -203672 157040 -288732 249471 46778 247185 -166195 -307126 206184
15804 -246031 -317764 -83476 -33888 69738 -154809 156474 214434 157042 -204540 239092 71737
15792 41605 120212 -258160 -121739 -102253 -126552 75058 -317672 38330 -11903 68638 261313
15781 261313 -196000 221926 -227058 4323 122984 -34671 -37018 -421123 -34336 -48811 104038
15769a21520J1710A58358a84292L1818k6307d1371B23090f396j73844A41784h7690
15757d9421E7155o910d8416q2018m8114Q6850C8815a32425b0353l6330A7645d5983
15744b09550I2060J10384b92154h6297n9183I3479d384A1840m722c6310n8610
15733i4920o7840j17578A37255A6109b00755P9890C07371i3046b2215H5206a3614
15721a50339N5872F2321N1056D0376d38758A28371b23489A03788a76977k29997
15711d06974B9899J50984e9608A45251b23081D1583a08925L6904j25961j05506
15701c03488d7490C5022a22042m946F2427O910f2344b177A49462B7997J1152R1750
15689A30899h7990q0465M6691A3156c1007j75512G8412j5653d46742K05496j39991
$$ plain form
15769 -121520 -109810 158358 -184292 -152474 -178781 -41371 223090 -6396 -180240 141784 -87690
15757 -49421 57155 50245 -48416 -130434 -178548 -91698 38815 -132425 -20353 -56683 17645 -45983
15744 -209550 92060 202444 -292154 -86297 -145480 93479 -4384 11840 7118 -36310 -94920
15733 -94920 -162760 -280338 137255 16109 -200755 -120865 307371 -93046 -22215 85206 -13614
15721 -150339 -94467 62321 113377 40376 -438758 128371 -223489 103788 -176977 -406974
15711 -406974 29899 180883 -59608 145251 -223081 41583 -108925 -72021 -197982 -303488
15701 -303488 -47490 35022 -122042 -126988 62427 69337 -62344 -2177 149462 27997 39149 130899
15689 130899 -87990 -168455 -121764 13156 -31007 -206519 78412 62759 -446742 -241246 -381237
15678c81237A1863a3633r6679q6190M4387f1210F8486K90638I9583B4823a04581
15666c4476j54431B45538e87695b10003M4864l0606P3854c9438j98007D8298d4769
15654a33429B04308h3326A07687g675n4437e60D7082a76970c7405k21139N5332
15643b03212B13189B7546a95353g5076k24813A86437F906J3330a91792N4863j99018
15632c35947a07754j39625k06592a18601j279A40315M4719b89103h0878j78477
15622b59355a10664N5129A55356p4709a09795C4757c8508A45178g5830A44449
15611a83678f1079j08692j5594I6883b2202j14606F2640J13392a78574m7432H4729
15599d4092I9258a67787A54627J10917h4142j66328j05254c1346m90947B61073
$$ plain form
15678 -381237 11863 -13633 -110312 -196502 -152115 -61210 68486 359124 99583 24823 -104581
15666 -34476 -188907 245538 -587695 -210003 -165139 -195745 -121891 -39438 -237445 48298 -44769
15654 -133429 204308 -83326 107687 -7675 -62112 -560 47082 -176970 -37405 -258544 -203212
15643 -203212 213189 27546 -195353 -75076 -299889 186437 6906 20236 -191792 -136929 -335947
15632 -335947 -107754 -247379 -453971 -118601 -119880 140315 185034 -289103 -80878 -259355
15622 -259355 -110664 -55535 155356 80647 -109795 34757 -38508 145178 -75830 144449
15611 -183678 -61079 -169771 -185365 96883 -22202 -136808 62640 176032 -178574 -226006 84729
15599 -44092 99258 -167787 154627 265544 -84142 -250470 -355724 -31346 -522293 261073
15588a79102A07710a68334H1088j2299J48202I6928J5601d3099j10749r7324k6780
15577b77952J30194b956o7807k3212E3008a07232A76659p8173b06785A22938B4794
15565B87814A42442a92183h3505G7300A1977K69847B6278i8937A15065l1421K60620
15554C44264E3935K7178b86928E58785B10819o0559a09739A81399J43079D4134
15543B29030q6381m0763d6085A00036j6049a95479g5894B09322I4361A3688L4596
15532D8284a34232B13350I6916M9090D65J25910D076K74854i0907o221A39014
15520a5025n4884G8513K44511h3477p9149p4434k3328A37641B8267g1485B24965
15508H2135M3076M4319b9124I043M5098g773A37821a62792B908d2556d879A6087
$$ plain form
15588 -179102 107710 -168334 81088 68789 216991 96928 112529 -43099 -153848 -251172 -277952
15577 -277952 -147758 -2956 -70763 -93975 53008 -107232 176659 98486 -206785 122938 24794
15565 287814 142442 -192183 -83505 77300 11977 281824 26278 -98937 115065 83644 344264
15554 344264 53935 81113 -286928 558785 210819 150260 -109739 181399 324478 44134
15543 229030 142649 101886 -46085 100036 83987 -195479 -75894 209322 94361 13688 48284
15532 48284 -134232 213350 96916 146006 465 126375 4076 278930 -90907 -97128 139014
15520 -15025 -69909 78513 323024 -83477 -162626 -237060 -260388 137641 28267 -71485 224965
15508 82135 125211 169530 -29124 9043 54141 -7773 137821 -162792 2908 -42556 -4879 16087
15495E7679J99024b20659A20145m3546A0698b397D01915r0460b81104F0404d8843
15483e958A41493N4573D0356h8056B04180a97409A40714b16028b9591k66291J35011
15472a60871a0756k28681L8110I636b82358A22114d3500I7434d142A3266K24958
15461B38224H4362C3837K28463O3517b60772A36855a5011B7356h2309E011L09433
15450C14444A22128f9720G6141J34542c09330a6136B0363a92025a8178j90019
15440b08197Q2757o7937b8246A54118d7441A41422J17760p5837J14202i7477c84
15428C6365b17816A38408a2044A97755i8124B03521D5178E705O3186c48890A01371
15416A9079K09098p3110P7022p5679k7579a61650C32222G7682b21882P2388R784
$$ plain form
15495 57679 256703 -220659 120145 76599 10698 -2397 401915 311455 -281104 60404 -48843
15483 -5958 141493 196066 40356 -88056 204180 -197409 140714 -216028 -29591 -295882 -160871
15472 -160871 -10756 -239437 -201327 9636 -282358 122114 -43500 97434 -4142 13266 238224
15461 238224 84362 33837 262300 325817 -260772 136855 -15011 27356 -82309 5011 314444
15450 314444 122128 -69720 76141 210683 -309330 -16136 20363 -192025 -18178 -208197
15440 -208197 -125440 -193377 -28246 154118 -47441 141422 259182 183345 297547 -97477 -384
15428 36365 -217816 138408 -12044 197755 -98124 203521 45178 5705 68891 -348890 101371
15416 19079 228177 155067 232089 156410 128831 -161650 332222 77682 -221882 -149494 -139710
15405a39710O3556B7983a4856m58992A47640R5260i1344A18775a1365G4146N23
15394G4669a28763N9987A78721N39k3759c02644q8976J78801a1032B68759G4015
15382D5287h1256D776h3093H2888k2671Q8878a57756G4900R747a62859B2812m154
15370A8658a4463A82720d32765c0312j25636e0100C27510b25770G6699d4009B6976
15358a28759A32757g5700k2989H9184N2392b10317N733B46854a39948E3806K05407
15347B59213E0142O7432g4093H2901J82896G5739a56352J4219j08135a02265a3845
15335B35048f3228A70368N6536a39561l2523O033n3359G1729c8891C39607A36664
15323B51668f4150H4692l9103a37424L5106A16841K57163a57721C51461j70011
$$ plain form
15405 -139710 -76154 27983 -14856 -473848 147640 242900 -91344 118775 -11365 74146 74669
15394 74669 -128763 -68776 178721 179260 155501 -302644 -391620 -212819 -11032 268759 74015
15382 45287 -81256 4776 -83093 82888 60217 149095 -157756 74900 84647 -162859 22812 18658
15370 18658 -14463 182720 -432765 -30312 -155948 -50100 327510 -225770 76699 -44009 26976
15358 -128759 132757 -75700 -98689 89184 141576 -210317 -204584 246854 -139948 53806 259213
15347 259213 50142 117574 -74093 82901 265797 75739 -156352 -142133 -250268 -102265 -13845
15335 235048 -63228 170368 226904 -139561 -172084 -166051 -219410 71729 -38891 339607 136664
15323 251668 -64150 84692 45589 -137424 -102318 116841 374004 -157721 351461 181450
15313A81450b23213d8943m4078L1589j6895b7095B6677a20825A38127P6698a22518
15301c4642J0205B58583a92439d5237A02773h9363B2839L69745j64969H9197l3134
15290E6063d84823B64249B6880N3752Q5314h3587A8692a84467B78777j37836b21646
15278c13309d350H0254a73426a3217A11304M1400j4651e7728H0500a84094B47754
15266c0472j6602q0407A64514g8891H9191Q9914q7181f0973A35437P7211N0207
15255B62855A04179c04723H1321K36197Q3284m1476M04762R09682n30610K08463
15245A351623j40960D90720A42319j7471m2305r337Q0757n4220K46481E3409R8435
15234A51844k3662c5105m9378A64177p0690k19e4917A42070J26503D2881e5187
$$ plain form
15313 181450 -223213 -48943 -93021 -61432 -78327 -27095 26677 -120825 138127 214825 -122518
15301 -34642 -24437 258583 -192439 -45237 102773 -89363 22839 392584 227615 89197 56063
15290 56063 -484823 264249 26880 80632 165946 -83587 18692 -184467 278777 140941 -221646
15278 -313309 -4350 80254 -173426 -13217 111304 152704 138053 -57728 80500 -184094 247754
15266 -30472 -47074 -127481 164514 -78891 89191 179105 91924 -60973 135437 212648 262855
15255 262855 104179 -304723 81321 317518 400802 359326 764088 1673770 1143160 1351623
15245 1351623 1210663 490720 142319 124848 82543 73206 153963 99743 346224 53409 151844
15234 151844 128182 -35105 -84483 164177 93487 93268 -54917 142070 268573 42881 -55187
15222B01733n7591a41201A64156a12970I4225a3721A37002P2755E5313a14720
15211i8671B66161l7899a53114A80804i6052j5623H5218a71569A01710K9615N5697
15200A87022m7180m1049a18407j86922F0105a09161B32097m27e4760A79480j1857
15189A67623G2727K5674m3248d0444B22182b4508b390B74725g3925J0804G0147
15177C55144c91898C4929K37065a5379p210l0286A14178L749J49023J07345b4676
15165B33517H0075a69096O3366I6550J45088a32197D3048L53117a0378F8609k7133
15154D1476b58683D16672D8721J2866h7204F121h7508B63532j15658g3016D90185
15142a98143C5939a5428C02008j23008R9934a74066p958A04062J54992B1647L46404
$$ plain form
15222 201733 144142 -141201 164156 -112970 94225 -13721 137002 209757 55313 -114720
15211 -98671 266161 228262 -153114 180804 -96052 -111675 85218 -171569 101710 131325 187022
15200 187022 139842 98793 -118407 -305329 60105 -109161 232097 231670 -54760 179480 167623
15189 167623 72727 98401 55153 -40444 222182 -24508 -2390 274725 -73925 -63121 70147
15177 355144 -391898 34929 271994 -15379 -22589 -52875 114178 117927 266950 374295 -24676
15165 233517 80075 -169096 -105730 96550 241638 -132197 43048 396165 -10378 68609 41476
15154 41476 -258683 416672 48721 61587 -87204 6121 -87508 263532 147874 -73016 490185
15142 -198143 35939 -15428 302008 179000 278934 -174066 -182024 104062 259054 21647 368051
15131C68051n8411g8940j67300C09454j36359K04684q3191g6960l85070B27538
15120A37989b23679C4847a08911C90131A15691Q3671b842C27691a13494A21683
15109b98181b8858k3899A32239g5404B1101R4321K93803j10778i1187n5010P2409
15098g3788B39267H9320J42710a9909A27521D9838e8678j01649B50306q2056J29670
15087B97920r7502r0652l1138R3211j0759p581K24851q5294N8103b2219j42948
15076a65167A48034F3796N036J82350d19923H7600a10773C0501M15638a9571A20528
15064B57513i4210G9040j9249K50207J04780I5909J50225G3144J24432F4769L7739
15053A02508N608k0543K69105r1576K6067A43046b39339E7350i0645D06928b34607
$$ plain form
15131 368051 309640 -78940 -246240 309454 173095 377779 294588 -76960 -462030 227538
15120 137989 -223679 34847 -108911 390131 115691 199362 -2842 327691 -113494 121683
15109 -298181 -28858 -52757 132239 -75404 21101 115422 409225 298447 -91187 -146197 -73788
15098 -73788 239267 89320 232030 -19909 127521 49838 -58678 -160327 250306 168250 297920
15087 297920 200418 109766 78628 171839 161080 153499 378350 293056 351159 -22219 -165167
15076 -165167 148034 63796 68832 251182 -419923 87600 -110773 30501 446139 -19571 120528
15064 257513 -94210 79040 59791 309998 414778 95909 246134 73144 197576 64769 102508
15053 102508 108116 87573 356678 265102 291169 143046 -239339 57350 -90645 406928 -234607
15041a55113B35791p2953f8021A70345O9889M5666n791E6818J17058b6383C06003
15029D58081q1932r4013G3426J68616O871R912J12783E9433J6197d3131A77077
15017A70016N3836j3753o9051J85822j49418Q8891b5032B9917b63588B34794F9184
15005A58478c1475q1944B09175m3248P2740J24762L4613r5414j13271K3243D7253
14993B79076c7913E78415k06656E8842L3110K00150A18672K06675j48729p2832
14983A03786J03698K43788A7888K8525h610C61115m2044j13435J93438n6262E4109
14971B75534K02711j62251F0684M16879I2258J89740L2420J15064A09198l8304
14961G0894b1293P117B92642J72355i6996B92558n1322O4599j22232L03628A72156
$$ plain form
15041 -155113 235791 162838 -68021 170345 240234 285900 280109 56818 173876 -26383 306003
15029 458081 376149 282136 73426 242042 248913 258825 371608 59433 75630 -43131 177077
15017 170016 223852 210099 141048 326870 177452 266343 -25032 29917 -263588 234794 69184
15005 158478 -31475 -113419 209175 165927 238667 363429 398042 302628 189357 212600 47253
14993 279076 -37913 578415 371759 58842 91952 292102 118672 325347 176618 103786
14983 103786 207484 451272 17888 46413 -8610 361115 319071 205636 399074 342812 54109
14971 275534 478245 315994 60684 477563 92258 281998 314418 429482 109198 70894
14961 70894 -21293 -14176 292642 464997 -96996 292558 241236 305835 183603 487231 172156
14949a48314I80K93409n7017q8913R2501L1139J13853j00963J89424A55789K51842
14938D07631N8198f4162A03594L08709A46985K11018N2779A80349J10087A29430
14927B26816J10801f8581C97886j20369K50090A26478L30855A62227l2269J77809
14917C07767q0546M8940P0154J70068j21549j51794J36522o9001j17941H8746
14906D58419l8046A57798L11990A07422N34662a6101D80091j31753J95152J50905
14896F94395C29641O9854A78787F0672M29069j45586j63197K15220K8453k8842
14886C95789o1149j35615K47746j32926q996J4362J9880j54755l0709J37551L2121
14875C23299R8923Q769A59751L87371j7269j76265K40384k89004L60707Q0538
$$ plain form
14949 -148314 980 294389 237372 148459 240960 272099 385952 284989 474413 155789 407631
14938 407631 465829 -64162 103594 412303 146985 358003 410782 180349 290436 129430
14927 226816 337617 -68581 397886 277517 527607 126478 457333 162227 129958 307767
14917 307767 227221 276161 346315 516383 394834 243040 379562 310561 192620 88746
14906 458419 420373 157798 469788 107422 642084 -16101 480091 348338 543490 694395
14896 694395 329641 399495 178787 60672 489741 344155 180958 396178 424631 395789
14886 395789 334640 199025 446771 313845 304849 319211 339091 184336 153627 291178 323299
14875 323299 422222 430991 159751 547122 529853 353588 593972 304968 665675 746213
14865G46213l2673k47628K47J57103C4514L85711P009J27536j17518n6225j05655
14854B75372K81768N369j75268K652J06789j66259J29839R1728B32034J55790
14844C87824Q880L7682O7770J15768j72573k9553j66757A6675M44425J82296J14060
14833G57456B73352p936L64176j61267j91271I4098J77856J5890J54430o451J42894
14822E78717A71504M13102B69737K28983J3570j707N0372J17092l08699K90409
14812F59757j81915J27263k45939L64238Q1152B44783K55350J57833l1314k92356
14802C34296J5337L57786j62452J55654k53574j9940n854k4163J17593k38787
14792B75896K17299k01837L67900j56137A24405L16884R2516R6970n2099B47320
$$ plain form
14865 746213 713540 465912 466159 623262 34514 420225 427234 554770 437252 381027 275372
14854 275372 557140 562509 387241 389893 496682 330423 460262 551990 232034 387824
14844 387824 396704 434386 502156 617924 445351 415798 249041 16675 461100 643396 757456
14833 757456 273352 265416 629592 468325 277054 94098 271954 287844 442274 435823 578717
14822 578717 171504 584606 269737 498720 512290 510583 560955 678047 369348 659757
14812 659757 477842 605105 359166 723404 804556 244783 500133 657966 626652 334296
14802 334296 349633 707419 544967 700621 447047 427107 421253 397090 514683 275896
14792 275896 493195 291358 659258 503121 124405 441289 533805 630775 578676 247320
14781E65569P1386M30042E14578n4728j15520M65352B93883K59776l7054L1456
14771E48061l0448O5636P5424R3311l1549B71492O03980l15567J27005j65028
14761E21882k8045L28137l91781K65961m7444J23510k32171J98088k398j9269
14751G16470m6784j69421J84039K1963C22963K63819N01563l83148Q8823q2450
14741G11570j72788k1600q2277K46192R2740J7808j82471q923J80236j78134n5360
14730E46993M92729m19226l6943r5047K22680J11639k42676K70605K3216l23385
14720E50585J8145J78165J88971N5300l3966j03310J09696j7426P6308l95455
14710F27013L98702m22700K60389J07811j50251N2419j45945K83038l79723L58142
$$ plain form
14781 565569 636955 1066997 514578 459850 344330 809682 293883 553659 516605 548061
14771 548061 517613 583249 658673 751984 720435 271492 875472 559905 686910 521882
14761 521882 493837 821974 430193 696154 648710 772220 540049 738137 735739 716470
14751 716470 669686 500265 684304 706267 322963 586782 1088345 705197 794020 711570
14741 711570 538782 517182 434905 681097 773837 791645 609174 600251 780487 602353 546993
14730 546993 1039722 620496 583553 488506 711186 822825 580149 850754 873970 550585
14720 550585 568730 746895 935866 991166 957200 853890 963586 946160 1022468 627013
14710 627013 1025715 603015 863404 971215 820964 873383 727438 1010476 630753 988895
14700I88895r7838K04009r8891m47659K91079j0723N4906j6854J8066J01390p2758
14689I13622p5862N682J26905j00879o348n1628K54924Q4221k2053k35807J27598
14678A020375q9394J93611k34059K95258l70593L66963j24749k76102L35601o232
14668A110679q7482P981m4208L98887l51149j38496L45911j69371J32443p3285
14658A131910k71556m6600O13524m56605K89663j16567J56446r7727J35763j47616
14648A190635l72447N76366k78399J26204P8776k61580J04197J2610J65135K88688
14638A630185k64744j20997L9563K200J4459p5044j83506K58861Q2136J1763j45735
14627A249141N5897k4997J28316j13304K15225O233J05275j74659l74503K13943
$$ plain form
14700 988895 891057 1095066 996175 548516 839595 828872 883778 866924 884990 986380 913622
14689 913622 837760 843442 970347 869468 863120 811492 1066416 1150637 1128584 892777 1020375
14678 1020375 930981 1124592 890533 1185791 815198 1182161 1057412 781310 1116911 1110679
14668 1110679 1023197 1031178 986970 1385857 1034708 896212 1242123 1072752 1205195 1131910
14658 1131910 860354 813754 1427278 970673 1260336 1143769 1300215 1202488 1338251 1190635
14648 1190635 818188 1394554 1116155 1242359 1321135 1059555 1163752 1176362 1341497 1630185
14638 1630185 1365441 1244444 1284007 1286207 1300666 1225622 1042116 1300977 1383113 1394876 1249141
14627 1249141 1305038 1280041 1408357 1295053 1510278 1516511 1621786 1447127 1072624 1286567
14617A286567k55807M32354K61827k93511K87764l00438J67000j34307J32325
14608A583774n4620j21186P1977J09715L05195l80490N8013K63530q2333k98872
14598A454703m822j9672O4064L39877k15106K36501J61864k82300K42538r6861
14588A880786O7357k44428j05621K40800P450L67359l12361O6403J6515J43486
14578B127746N3159n25547L50215K99684k32556K31523k77175Q2449p5317L38805
14568B372986j17240K6383q9626M28656k05485L1575M92300j58641j49266J45049
14558B776691K87057J37000k0427N6620N980R42032J41444Q96276O03876K228527
14548H055076M229845Q410442J5049303P814360k0208935I920462m823296j657643
$$ plain form
14617 1286567 1030760 1463114 1724941 1431430 1719194 1418756 1585756 1451449 1583774
14608 1583774 1529154 1407968 1479945 1589660 1894855 1514365 1572378 1835908 1753575 1454703
14598 1454703 1449881 1430209 1494273 1834150 1619044 1855545 2017409 1735109 1977647 1880786
14588 1880786 1948143 1703715 1598094 1838894 1846344 2213703 1901342 1967745 1984260 2127746
14578 2127746 2180905 1655358 2005573 2305257 2072701 2304224 2027049 2109498 2034181 2372986
14568 2372986 2255746 2282129 2192503 2621159 2415674 2447249 2939549 2780908 2631642 2776691
14558 2776691 3063748 3200748 3180321 3236941 3242921 4184953 4326397 5222673 5826549 8055076
14548 8055076 12284921 20695363 35744666 43559026 23350091 9920462 5097166 3439523
14540C439523j037270p9139J84187l06380K4296j43470q3559K43418J9183Q6492
14530B347281j2695q9743K30719j20729J9898k2984K46960k58139J76314K649
14520B519531j17675n413J71577N610M14629k77640j27002N657o5920M04675l05648
14509B622381K1641K48814M1603j79978J52263M2027o3447K57532j89221L05769
14499C259384o4777L73162j63600N281o1215r1510N233R2461O4864p8840K22036
14488C562479j1161n7275J27596J57871J07196k54918K77660k19363K19279J30408
14478D039772j31350M0181j12153K61919N184j42250K49041P1546M09087l57197
14468D333780K19435K37041k99401K61210N4001l82301J53217R1970L21321J77998
$$ plain form
14540 3439523 2402253 2323114 2507301 2200921 2225217 2081747 1998188 2241606 2260789 2347281
14530 2347281 2334586 2244843 2475562 2354833 2374731 2351747 2598707 2340568 2516882 2519531
14520 2519531 2401856 2396443 2568020 2573630 2988259 2710619 2583617 2589274 2523354 2928029 2622381
14509 2622381 2644022 2892836 2934439 2754461 2906724 2948751 2885304 3142836 2953615 3259384
14499 3259384 3194607 3567769 3404169 3409450 3348235 3256725 3261958 3354419 3419283 3340443 3562479
14488 3562479 3551318 3494043 3621639 3779510 3886706 3631788 3909448 3690085 3909364 4039772
14478 4039772 3908422 3948603 3836450 4098369 4103553 3961303 4210344 4281890 4690977 4333780
14468 4333780 4553215 4790256 4490855 4752065 4806066 4423765 4576982 4668952 4990273 5168271
14458E168271j1286l3724J68529J73057m91855M91604P7833L9616o7215J00113
14448E614943J43580j69258J94222J21809m5878K21620j60710M64157J17132m71156
14438F030461M95336j28805R2829j36063K42683M18362p823Q4224P2846q5302
14428G078748n4126K53897O0538M55653l03442J44737K29926j09566K68912j88828
14418G836449M70693J78078P208K04606K4234n0828L13245j397N51861j52288
14408I381861L68446m7633J47260K30653l75736O90276J21096J17838n1098J57579
14398A0740542K41853L42451j0135M04707j93136O00084j1536L59686Q9731M64759
14388A3029006q8600L76856L13824L73072P7343M97568Q1005K659N09497K84426
$$ plain form
14458 5168271 5156985 5123261 5291790 5464847 4972992 5464596 5542429 5582045 5514830 5614943
14448 5614943 5758523 5589265 5783487 5905296 5859418 6081038 5920328 6384485 6501617 6030461
14438 6030461 6525797 6396992 6489821 6353758 6596441 7014803 7006980 7091204 7164050 7078748
14428 7078748 7024622 7278519 7339057 7794710 7491268 7636005 7865931 7756365 8025277 7836449
14418 7836449 8307142 8485220 8492428 8697034 8721268 8670440 8983685 8982288 9534149 9381861
14408 9381861 9750307 9702674 9849934 10080587 9704851 10395127 10516223 10634061 10582963 10740542
14398 10740542 10982395 11324846 11314711 11719418 11526282 12126366 12114830 12474516 12564247 13029006
14388 13029006 12940406 13317262 13631086 14004158 14081501 14579069 14660074 14662733 15172230 15456656
14378A5456656P4082J35342P49538J02167K93897L26491L09772L70862M40369
14369A8259176J29889N22969P41168p1348O06190J81092Q34092L71197K27336
14360B1801761N23089L76589R54927O61782L23525L99089L39670R56678N81328
14351B6918438L95102P39159P73032Q94724M06200Q27160R58172R24335P79707
14342C3616029R21070O79933R49708J193525J017073J105779J369592Q94781J545026
14333D3292516Q47953J482525J150201J736605J615569J307097J803633J668357
14325E4904456J832517J752200K026722K294002K055370K341226K104704K527503
14317G1838700K781082K484231K946045L091665L348570L331652L694666L959642
$$ plain form
14378 15456656 15530738 15666080 16415618 16517785 16811682 17138173 17447945 17818807 18259176
14369 18259176 18389065 18912034 19653202 19581854 20188044 20369136 21203228 21574425 21801761
14360 21801761 22324850 22701439 23656366 24318148 24641673 25040762 25380432 26337110 26918438
14351 26918438 27313540 28052699 28825731 29720455 30126655 30953815 31911987 32836322 33616029
14342 33616029 34537099 35217032 36166740 37360265 38377338 39483117 40852709 41747490 43292516
14333 43292516 44140469 45622994 46773195 48509800 50125369 51432466 53236099 54904456
14325 54904456 56736973 58489173 60515895 62809897 64865267 67206493 69311197 71838700
14317 71838700 74619782 77104013 80050058 83141723 86490293 89821945 93516611 97476253
14309I7476253L465290M143878M476758M777553N130435N167333N306765N663038
14301A35607303O427262O267068O896379P031587P966553P899009Q397278R337488
14293A95829927R389553J0079942J0455760J1289498J0979064J2195226J2789717
14286B73008687J2644480J3336197J3915127J3817772J3966698J4091045J3800692
14279C68580698J3666026J3112014J2243231J1095135R997160Q078263N871870
14272D42644397K825409J362223J47436J291200r40176l435527n595843p489617
14264D30809502r831391j1034927j1870198j2877521j3626771j4585204j4595649
14257C42387841j4953216j4677435j3401677j3691552j3445327j3027790j2329066
$$ plain form
14309 97476253 100941543 105085421 109562179 114339732 119470167 124637500 129944265 135607303
14301 135607303 142034565 148301633 155198012 162229599 170196152 178095161 186492439 195829927
14293 195829927 205219480 215299422 225755182 237044680 248023744 260218970 273008687
14286 273008687 285653167 298989364 312904491 326722263 340688961 354780006 368580698
14279 368580698 382246724 395358738 407601969 418697104 428694264 436772527 442644397
14272 442644397 445469806 446832029 446979465 448270665 447330489 443894962 438299119 430809502
14264 430809502 420978111 409943184 398072986 385195465 371568694 356983490 342387841
14257 342387841 327434625 312757190 299355513 285663961 272218634 259190844 246861778
14250B46861778j2003341j1408385j0712149j0237823r493544r151627q683105
14243A75171804p731902q123851p361688o893666o229746o280749n181944n382582
14235A21985676n357648n039680m482579m050854m301312l840878l701389l356836
14227H7854500l679223l086993k859246k874409k757918k277865k340368k466996
14219F5511482j898475k491754k154063j728442j694378j611319j322725k100531
14211E0509795j300452j781436j031140j321097j132998j153363j467730j159090
14203D0162489j093401j230529j046159k04952j284116o66276j142399q93496
14195C2601161p47593r10564m11230q72276q44522o57071p81166o55738o95421
$$ plain form
14250 246861778 234858437 223450052 212737903 202500080 193006536 183854909 175171804
14243 175171804 167439902 159316051 151954363 145060697 138830951 132550202 127368258 121985676
14235 121985676 116628028 111588348 107105769 103054915 98753603 94912725 91211336 87854500
14227 87854500 84175277 81088284 78229038 75354629 72596711 70318846 67978478 65511482
14219 65511482 63613007 61121253 58967190 57238748 55544370 53933051 52610326 50509795
14211 50509795 49209343 47427907 46396767 45075670 43942672 42789309 41321579 40162489
14203 40162489 39069088 37838559 36792400 36587448 35303332 34637056 33494657 32601161
14195 32601161 31853568 30943004 30531774 29659498 28814976 28157905 27376739 26721001 26025580
14186B6025580l79468q45683l57935j75117n27453j151231k46310k57887n91025
14177B1493471l20325n89375l94007n59106o5294p03960k65588n56085j40671
14168A7899060k07616n45217O752m08887o94255k59605l30425q4896k53466K58707
14158A5380152n01053m17058l03052j21525l49703k29540J69922n89767l84015
14149A2654361k02859n4226M1612j12561m88004k68686j95482P0277m25986j02972
14139A0915474j45556j67802k60792k8690k07471k63478O9781m8246k81872j53364
14129I427984j22888k1108l14893k53642m5143N7017J26947p65103O7420M4379
14119H200970k92040K88435r0113o7086k93684m09180J40940j8326o5112k42498
$$ plain form
14186 26025580 25646112 24800429 24442494 24267377 23739924 22588693 22342383 22084496 21493471
14177 21493471 21173146 20583771 20189764 19630658 19565364 18861404 18595816 18039731 17899060
14168 17899060 17691444 17146227 17152979 16744092 16049837 15790232 15459807 15374911 15121445 15380152
14158 15380152 14879099 14462041 14158989 14037464 13687761 13458221 13628143 13038376 12654361
14149 12654361 12451502 12397276 12438888 12326327 11838323 11569637 11374155 11444432 11018446 10915474
14139 10915474 10769918 10602116 10341324 10312634 10105163 9841685 9911466 9863220 9581348 9427984
14129 9427984 9305096 9283988 8969095 8715453 8670310 8727327 8854274 8089171 8156591 8200970
14119 8200970 7908930 8197365 8107252 8040166 7746482 7337302 7478242 7459916 7394804 7152306
14109G152306j14622K70305j78842k15144o1693k94145K97531l36943l9576J44943
14099F624120l33870K06102o77242L16956n7794k80802K28992J37690k49246k07690
14089E707216L1539r7603k7294k72241q2171K89241j36128l24139P3827p8794
14079E083453j59874L25277j22465l79078N36333o47741m7291K12782J04209l51777
14069D553828r4139j07144l84039N59018J55136j31398m8318n59642K84273j7265
14059D210310j18105n5393l91681M28355o8229m0879j50831m8951K68742n4457
14049C978881j92386R9889m02630q611P6446k09954L95208j96586O870o16973
14039B930154M84957K55052m50914K67777j95435j66270Q6506J6537q388l72348
$$ plain form
14109 7152306 7037684 7307989 7129147 6914003 6852310 6558165 6855696 6518753 6479177 6624120
14099 6624120 6290250 6496352 5819110 6136066 6078272 5797470 6026462 6164152 5914906 5707216
14089 5707216 5738755 5641152 5613858 5341617 5259446 5548687 5412559 5088420 5162247 5083453
14079 5083453 4923579 5248856 5126391 4747313 5283646 4635905 4588614 4801396 4905605 4553828
14069 4553828 4459689 4352545 3968506 4527524 4682660 4551262 4502944 3943302 4227575 4210310
14059 4210310 4092205 4036812 3645131 4073486 4005257 3964378 3813547 3764596 4033338 3978881
14049 3978881 3786495 3886384 3483754 3475143 3551589 3341635 3736843 3540257 3547127 2930154
14039 2930154 3415111 3670163 3219249 3487026 3291591 3125321 3211827 3228364 3219976 2847628
14029B847628M28537o0031k0710j70121k26875K13310l07679Q9232m2178K55766
14019C006879P9363l51161J19862k23504l6514J60461j5936k88165M6940Q2284
14009B580509j4264l32174m7139L08455N6398j40134m562k67154L04917m47150
13999A997702L76943J02714O5044j639l08624r0753L04885O6642R1249N85704
13989C189867J008918L263784O990406J5040846J3213350j5385724j2988395n573788
13981H759264k354721r45801r63754n58172k09658n07119k05499k38801L25981
13972C101720K15373m81191k97137O1195r3071l24204K51829J25738Q2267k77108
13962B365411m71754P5645N26656n62468M36686j66906J14033p3558k22577Q6776
$$ plain form
14029 2847628 3276165 3216134 3195424 3025303 2798428 3011738 2704059 2793291 2751113 3006879
14019 3006879 3086242 2735081 2854943 2631439 2594925 2755386 2739450 2451285 2498225 2580509
14009 2580509 2566245 2234071 2186932 2495387 2551785 2411651 2407089 2139935 2444852 1997702
13999 1997702 2374645 2477359 2542403 2540764 2232140 2141387 2446272 2512914 2604163 3189867
13989 3189867 4198785 7462569 14452975 29493821 42707171 27321447 14333052 8759264
13981 8759264 6404543 5458742 4494988 3936816 3727158 3220039 3014540 2775739 3101720
13972 3101720 3317093 2835902 2538765 2599960 2506889 2182685 2434514 2560252 2642519 2365411
13962 2365411 1893657 1969302 2495958 1933490 2370176 2203270 2317303 2243745 2021168 2107944
13952B107944k8621j5135m466j50369M47859n08956L8930J52285o7782L79232
13942B350921k49462n4377j0671n0817j98642J91403J1928o3540J48557l20848
13932A754452n2592J85546n2003l07856J19951P8676p3116o9282l2449j55146
13922A396181L57324o7286J18888m3321n43375M91749m0218o2115J03422j06663
13912A604586j42582P3170j41613J99477l20426J08191Q1576j04820Q8201P4187
13902A519947l87311J54291J71303j9653m1518N5347L25505l34906O5302p9860
13892A428447J74338p6240j74725R7244K4378j48175k56730j14890M77528q1953
13882A349222j58085J72624J8378k88513L40035k72837M7767j0575m5925J77628
$$ plain form
13952 2107944 2079323 2064188 2059722 1909353 2357212 1848256 1887186 2039471 1971689 2350921
13942 2350921 2101459 2047082 2036411 1985594 1786952 1978355 1990283 1926743 2075300 1754452
13932 1754452 1701860 1887406 1835403 1527547 1647498 1726174 1653058 1583776 1551327 1396181
13922 1396181 1753505 1686219 1805107 1761786 1218411 1710160 1669942 1607827 1711249 1604586
13912 1604586 1462004 1535174 1393561 1593038 1272612 1380803 1462379 1357559 1445760 1519947
13902 1519947 1132636 1286927 1458230 1438577 1397059 1452406 1777911 1443005 1508307 1428447
13892 1428447 1602785 1526545 1351820 1449064 1473442 1325267 1068537 953647 1431175 1349222
13882 1349222 1191137 1363761 1382139 1093626 1433661 1160824 1208591 1198016 1152091 1329719
13872A329719J1628j43542J39916j97122j57946K7425J70798R9759k19081q2143
13862I79411L63011k49243k76758M29463l33600N90258n10212L93208F54813M35281
13852A090094m3872L71894k44631l38222J63633L82159l03235M1200j65118Q0746
13842A034648j38154K01774j31882R0028K8454J00922k17132K40736n04774J52471
13832H57091n828J49830j52194M1217K18515R5695k50496J53129j77324j80031
13822G49604K38319m330j74534J14846o5747q737j56526J74782P8807j43475J39104
13811I42113K41643k28116L90957m67271N4424l19373K38700j13853j39031L44971
13801I45164j48918k2753L4049J24532k15022M8110M1587l2480M06912l36638
$$ plain form
13872 1329719 1341347 1197805 1337721 1140599 982653 1010078 1180876 1280635 1061554 979411
13862 979411 1342422 1093179 816421 1245884 912284 1502542 992330 1385538 654813 1090094
13852 1090094 1046222 1418116 1173485 835263 998896 1381055 1077820 1119020 953902 1034648
13842 1034648 896494 1098268 966386 1056414 1084868 1185790 968658 1209394 704620 857091
13832 857091 851263 1001093 848899 890116 1108631 1204326 953830 1106959 929635 749604
13822 749604 987923 983593 809059 923905 858158 849421 692895 867677 946484 803009 942113
13811 942113 1183756 955640 1346597 879326 933750 614377 853077 739224 600193 945164
13801 945164 796246 773493 807542 932074 717052 765162 806749 774269 1181181 844543
13791H44543p5159J1773J68619k16319M99883j15481m44700J82120Q8336j39877
13781H03738J85558k76185J06601R8492r8223N0778k88357P9533j73158L07260
13771G96037J69782l34585O8883J98167m29484K82787J5186o1447N6168n7908
13761G03586O6045K40634p1207C63205L59140n8089K02864n0742j08293m2970
13751F65115j07423P2882N2343M00534m90272K70492k52236j69489L61511j44791
13741F58666R0023K13893m64877o5983K46379j87705L74962l13970B02762J36799
13731C39561N29025k56303n2836P3408L78129m24067o927M29108l77639p2027
13721E59432L43605C45046L70119K13749m38822J08625R2237j3510p0224j45464
$$ plain form
13791 844543 769384 781157 949776 733457 1233340 1117859 673159 855279 943615 803738
13781 803738 989296 713111 819712 918204 819981 870759 582402 661935 488777 796037
13771 796037 965819 631234 700117 898284 468800 751587 766773 705326 761494 703586
13761 703586 769631 1010265 939058 363205 722345 664256 867120 816378 708085 665115
13751 665115 557692 630574 682917 1083451 593179 863671 611435 441946 803457 658666
13741 658666 748689 962582 497705 431722 678101 490396 865358 551388 202762 339561
13731 339561 868586 612283 559447 632855 1010984 586917 579990 1009098 631459 559432
13721 559432 903037 345046 715165 928914 490092 598717 690954 677444 607220 461756
13711D61756J42928q9614J66601J18531j73168l0227B74293J53019K67394J61244
13701H55950k30999k94589K39833o7051m451j80178J88352l9273o7684j49077
13691B50833J39784k9298J03803r4404N32031m38301B04245N04580j61135m9764
13681D97926K18385r2737J6180p3685k37224J10738j43922K45879P6827k94133
13671C24234P733J10756K51331j46516K13542K95971m39721k79924K46458j66939
13661D16925k05097K54155j11684j3102J48486j81277J85593k5031K32802C03200
13650A43078K08759o9931M00998k07161K3519j96942K40822J02751k15200k1211
13640D09482P2392j37525L6613m9144q0326r8429M55274k22187N8524j71806L29566
$$ plain form
13711 461756 604684 515070 681671 800202 627034 596807 274293 427312 694706 855950
13701 855950 624951 330362 570195 503144 498693 318515 506867 467594 399910 250833
13691 250833 390617 361319 465122 370718 902749 464448 204245 708825 547690 497926
13681 497926 716311 623574 639754 566069 328845 439583 295661 541540 618367 324234
13671 324234 331967 442723 694054 547538 761080 1057051 617330 337406 583864 416925
13661 416925 211828 465983 354299 341197 489683 308406 493999 468968 701770 303200
13650 143078 351837 281906 682904 475743 499262 302320 543142 645893 430693 409482
13640 409482 481874 344349 380962 331818 251492 153063 608337 386150 444674 272868 602434
13629F02434J8896B17239J01908K934M53937l36381J32631l4960j88116K42211
13619E91403B93618L59112k87077j73913J57814J37699M2924C7081K25648O4140
13609C26869m4477J92847j4386k15645m9538J89775l8556o3413R4791F4354L67809
13598D32163A53571L35056E624N49927k5567J12648B76250J59196q1014m3732
13588C10700J22657n9903p7905J43407j19706O6887m6044N5704j62524K62015
13578D95288j86816K42600k29648J31822R8718j60992A86665L98074j85290c5266
13567B82179J10148q4229r1976K49448j93689j7360M2739J90369j32895k1937
13557C32797j62609L38975l4942l6019J4482j5069j34383r5586L95934B52140
$$ plain form
13629 602434 621330 217239 319147 322081 776018 439637 572268 537308 349192 591403
13619 591403 293618 652730 365653 191740 349554 487253 530177 37081 262729 326869
13609 326869 282392 475239 460853 245208 195670 385445 346889 283476 378267 64354 432163
13598 432163 153571 488627 5624 555551 529984 642632 276250 435446 354432 310700
13588 310700 433357 373454 295549 438956 319250 386137 340093 395797 233273 495288
13578 495288 308472 551072 321424 453246 551964 390972 186665 584739 399449 -35266
13567 282179 392327 308098 216122 465570 271881 254521 297260 487629 354734 332797
13557 332797 170188 509163 474221 438202 452684 437615 303232 207646 603580 252140
13546D09917j7940q4633n7425K85724k03808j3289a10105A88502Q1878J52396
13536D22776p9312N5252j02055m050J10586m6176n9506J7591H0214J70963K06254
13525D57431j17189o3959M2054J93524i690F52419A12682R279J72283J18177j67751
13514B44670r9144L95716F8640M82230a86906C28194P2280K6009o2968J46788
13504E10303j22757r7112a56072A57474J01074K16700q4749m9550R1239j99992
13494B32196L5276K52524j87062L25936B49810F0331K77632A32977b7268C56341
13483B40716j08356M41731k17330j69687F7620J66310K59519A82776h2238B92232
13472F33756B73245O0744j45928J53913K00000j79166J85501B11828E7017M8821
$$ plain form
13546 409917 391977 307344 249919 535643 331835 318546 -110105 188502 270380 422776
13536 422776 343464 398716 296661 292611 403197 357021 297515 315106 80214 251177 457431
13525 457431 340242 276283 318337 511861 -9690 652419 112682 121961 294244 412421 244670
13514 244670 145526 541242 68640 550870 -186906 328194 400474 426483 363515 510303
13504 510303 387546 290434 -156072 157474 258548 475248 390499 340949 432188 232196
13494 232196 267472 519996 332934 658870 249810 60331 337963 132977 -27268 356341
13483 240716 132360 574091 356761 187074 67620 233930 493449 182776 -82238 292232
13472 633756 273245 333989 188061 341974 541974 362808 548309 211828 57017 105838
13462A05838K57832j06688k2633O5070o3858Q132r7952J76652k271J02928a1294
13450a36702C48000I571M88164k14933A25048J45477p4968p2475J44670A16439
13439A5732N49760C4075M54476A49567K11974J37622k42798J68258a52290B65730
13428C30199G0226L34532A90544D8778K04285j14503J20405k9217o7502A9182
13417B34197N2738J77189j31692L977A51349b1980F7678K57959m1193j29908M0870
13406A95406O9623J20863p3844K79438k83933m3617o4270g7479D1647K33575a79268
13394A55247b5095C14855P6649A68742O5569f6486A80642K5608O9720j20823K69712
13383D24859k02466p8326L932n0668K07119k8303J39141K9250j24138J61681I7404
$$ plain form
13462 105838 363670 256982 234349 299419 235561 243693 145741 322393 320122 423050 -11294
13450 -136702 348000 9571 497735 282802 125048 270525 195557 123082 267752 116439
13439 15732 565492 34075 488551 149567 361541 499163 256365 424623 -152290 265730
13428 330199 70226 404758 190544 48778 253063 138560 258965 229748 162246 19182
13417 234197 286935 464124 332432 336409 151349 -21980 67678 325637 284444 154536 195406
13406 195406 265029 385892 312048 591486 307553 263936 199666 -77479 41647 275222 -179268
13394 155247 -25095 314855 391504 168742 234311 -66486 180642 206250 275970 155147 424859
13383 424859 222393 144067 147999 97331 304450 276147 415288 444538 320400 482081 97404
13371A20804P2362M3156N6857m2485A03617K11629R196j24758K63946R1089a60918
13359c2251B75941d596A17699K38064L36521A48728F0145R6511P5713n5840k9533
13348A46996J21033K85486M9341A87003J89198H9825L45818k1435q1464K84353
13338F17097l05751A3306K71927p4728C8870K83002m7899N2613a18827o1598A68300
13326a41951c1298D53629A66020J00002m0429J35724J7228l1276F7732P6499j9164
13315A25067a35012C73281j70040I3114b32312B66286g5558B58663a58253B10058
13304b4549m4884C84780j5456d574p7386C88743a10253E7186b86812B92932k5461
13293B67471j31256D2432K49602A02785A6165M62228q1951a71003C94746B6987
$$ plain form
13371 120804 193166 236322 293179 250694 103617 315246 324442 199684 463630 554719 -160918
13359 -32251 275941 -4596 117699 355763 692284 148728 60145 156656 232369 176529 146996
13348 146996 268029 553515 602856 187003 376201 89825 435643 414208 332744 617097
13338 617097 311346 13306 285233 210505 38870 321872 273973 326586 -118827 -180425 168300
13326 -141951 -31298 453629 166020 266022 225593 361317 378545 347269 67732 144231 125067
13315 125067 -135012 373281 203241 93114 -232312 266286 -75558 258663 -158253 210058
13304 -24549 -69433 384780 369324 -4574 -81960 388743 -110253 57186 -286812 292932 267471
13293 267471 136215 42432 292034 102785 16165 478393 396442 -171003 394746 26987
13282B63636j00930P0714I8065K59924n2932k9665a67310B13718L6495Q4809J10609
13271D45631k02279J3948N3701a1925n7136D10844I2430P7154p3425B0361K52530
13260B72891b9988F4840J30842R4228b18479B38500n3134n2202J67514r5973l7316
13249A67389i2639A43494P1645P8491h7195D65326j35610G3838A5544a51583A07539
13237A24687m4616L89128B19248F6078L78209A16335J95927A14890K08136i286
13226A73594J17305D8101O7975A2614J9187P0456E917c64957C51968A10944f4521
13214B36715d73875C30674E9768M1092L7989b77C14099j36890J03492G6261h69
13202H4408J30479B3776M28115A98540H4320a49294A07257K10L430D5251e3187
$$ plain form
13282 263636 162706 233420 98065 357989 305057 275392 -167310 213718 250213 335022 445631
13271 445631 243352 257300 311001 -11925 -69061 410844 92430 169584 96159 20361 272891
13260 272891 -29988 64840 195682 289910 -218479 238500 185366 133164 300678 204705 167389
13249 167389 -92639 143494 215139 293630 -87195 465326 329716 73838 15544 -151583 107539
13237 124687 80071 469199 219248 66078 444287 116335 312262 114890 323026 -9286
13226 173594 290899 48101 116076 12614 31801 102257 5917 -364957 351968 110944 -64521
13214 236715 -473875 330674 59768 100860 138849 -277 314099 177209 280701 76261 -869
13202 84408 214887 23776 451891 198540 84320 -149294 107257 107467 110897 45251 -53187
13190A90276a47322A90646E8093J42240n1250L17705j61956k8179M5877A16812
13179b24819B674N7434d5426G3411a70547A98128L7678p6469K7620d5039A32935
13167A33993O2096D4845b9900A75480J70861F7859l1517i780B69438l230A4970
13155A08009K1906o3177b50186C33985p0715l5106D3512J46825a28804b6652B22468
13143B46387I1926A7986L54388b2183q4851B63915c73397A30383J32217n6043
13133B06557b6061R298C46686j51148I2082a28236D3108O5638e7975B71629L0211
13122C01840d0365j37030r632f7165B37226b07321C06157A06757b1454F76K05879
13111B06555G256J6043J81177c5051B81729F5522K67824A49721c30262a24095
$$ plain form
13190 190276 -147322 190646 58093 200333 149083 466788 304832 276653 322530 116812
13179 -224819 2674 60108 -45426 73411 -170547 198128 235806 159337 186957 -45039 132935
13167 133993 196089 44845 -29900 175480 346341 67859 36342 -9780 269438 266208 14970
13155 108009 129915 66738 -250186 333985 263270 228164 43512 190337 -128804 -26652 222468
13143 246387 91926 17986 372374 -22183 -107034 263915 -373397 130383 262600 206557
13133 206557 -26061 -16763 346686 195538 92082 -128236 43108 108746 -57975 271629 301840
13122 301840 -40365 -177395 -187027 -67165 237226 -207321 306157 106757 -21454 676 206555
13111 206555 7256 23299 204476 -35051 281729 65522 333346 149721 -330262 -124095
13100e6795o4233j0394m7891I5456j4690C1201J56075A7579L14682A63475q0220
13089H3255c59661H0984C3013c9745o4211B76721c0750D4588K6072C3253N5479
13078H8732J37705J06177j42819l8155K203h4593a3055A78710f1650R941B47288
13066d6887B33586j6716k9294r3359d5425C61018h9632E3018a58330k08247H8127
13054B20380J3057B6089L40476L1461A74030a20941f0402n8155A47919J36556
13044B84475J59208c6435d302B8888Q1700Q0712E3251K01216A1811g0j44127H3159
13031B742L9204J81964O7539i9160j12887B1475L01198e1170I0260j1035a32957
13019a41199B42610O815D2572J45618B0522L07829A62362a08055C33458E2199
$$ plain form
13100 -56795 -121028 -131422 -179313 95456 80766 31201 187276 17579 332261 163475 83255
13089 83255 -359661 80984 33013 -39745 -103956 276721 -30750 44588 70660 33253 88732
13078 88732 226437 332614 189795 151640 153843 -84593 -13055 178710 -61650 -51709 247288
13066 -46887 233586 216870 187576 94217 -45425 361018 -89632 53018 -158330 -366577 88127
13054 220380 233437 26089 366565 398026 174030 -120941 -60402 -118557 147919 284475
13044 284475 443683 -36435 -4302 28888 110588 191300 53251 254467 11811 -70 -144197 83159
13031 2742 41946 223910 291449 -99160 -212047 21475 322673 -51170 90260 79225 -132957
13019 -141199 242610 249425 42572 188190 20522 328351 162362 -108055 333458 52199
13008H3553F618K34388K11204A56128B9266J85763q6262E6091J39259q0975a44089
12996C2948N0489L57177k14226k9294p3717f0692b1818E3641K04143A02831b1189
12984A04155L9868H276a82766D046J32189f9460A51892k2210L9699k9603a45726
12972e5134A24217K7855d7021A32310I671M0280K7487b2641j55691h994A94462
12960H8693R9500a86543A160K505J93523n9528a10844M8998m24749A17926a54472
12948a13552p2497j4761f043j06005B83417o0430A6999i5036j27107B94143A19430
12936B90985f5553D6610a75764A22703K37827D7583K77457D8393j4925c394n9024
12925f2418B54516a04184B6880J37800J85202f5067l15408A07240a35569j37169
$$ plain form
13008 83553 6618 241006 452210 156128 29266 215029 128767 56091 195350 114375 -144089
12996 32948 83437 440614 226388 197094 123377 -60692 -21818 53641 257784 102831 -21189
12984 104155 144023 8276 -182766 4046 136235 -69460 151892 129682 169381 139778 -145726
12972 -55134 124217 152072 -47021 132310 9671 49951 77438 -22641 -178332 -8994 194462
12960 88693 188193 -186543 1160 3665 197188 137660 -110844 -61846 -486595 117926 -154472
12948 -113552 -186049 -200810 -6043 -112048 283417 222987 16999 -95036 -222143 294143 119430
12936 290985 -65553 46610 -175764 122703 360530 47583 325040 48393 33468 -3394 -62418
12925 -62418 254516 -104184 26880 164680 349882 -65067 -380475 107240 -135569 -272738
12915b72738A14439b8070j69259L0786A00575J10360f1110A82949a16529D68527
12904d5632C04K52341f2888b0817k17249a06236A88584p3100K0765n9956K5680
12893A01973C1288P3102k7548a76917G7614i1237A25665J47850K5905g5281F3270
12881a810D7471J17488m8396a18826N4422B56866a48902I8289a13516G3229l3774
12870C9455a03505E14835B01338A2900J8079d9100A54289f8221j25092b2184A23227
12858D54556A42855l5278b87747A48746j9161Q0291i9070m5791B11750K14318
12848D26068F2085L0484B8958J50189o0212P458J19323j8532m4243C244K55190
12837B58434P7804a15348D39391b0424j34444Q413d9638G2377g984A12964n5464
$$ plain form
12915 -272738 114439 -28070 -197329 -166543 100575 210935 -61110 182949 -116529 468527
12904 -45632 304 252645 -62888 -20817 -238066 -106236 188584 115484 136249 76293 101973
12893 101973 31288 104390 76842 -176917 77614 -91237 125665 273515 299420 -75281 63270
12881 -1810 47471 164959 116563 -118826 -64404 256866 -148902 98289 -113516 73229 39455
12870 39455 -103505 514835 201338 12900 30979 -49100 154289 -68221 -193313 -22184 123227
12858 454556 142855 107577 -287747 148746 129585 209876 -99070 -144861 211750 426068
12848 426068 62085 92569 28958 179147 118935 126393 245716 227184 182941 3244 258434
12837 258434 336238 -115348 439391 -20424 -154868 -146455 -49638 72377 -7984 112964 57500
12826E7500J33152a10405C35292b50547A59646k5247b24702O0981A33961J6329
12816A50290b37779g7132b6532A09412a37673q1658F0948N3710a2155r1402L4739
12805f8818k7753b7075n057i922A53577m6724C6152J98781B4505N5052k3995J86466
12793B42028N7885a1097k2424B35821B2139K10038E6224C592O5404c46696F4401
12781a81675I9789d1057H731R0070a52147A91996q4513a72768A81255q1459a57553
12769h6590B15465f5868i891r5213f718j46488a1923j7960B54905D0382d92190
12757a94845B67086A00534a33325a6646C940c23383a05463A1800b32403i6447
12746A28676D5543g1769A15474n2120J29360r4436B9806K3955K64434H17d0206
$$ plain form
12826 57500 190652 -110405 335292 -250547 159646 134399 -224702 -163721 133961 150290
12816 150290 -237779 -77132 -26532 109412 -137673 -219331 60948 114658 -12155 -103557 -68818
12805 -68818 -96571 -27075 -32132 -9922 153577 106853 36152 234933 24505 79557 55562 242028
12793 242028 299913 -11097 -33521 235821 22139 232177 56224 3592 68996 -346696 64401
12781 -181675 99789 -41057 8731 98801 -152147 191996 107483 -172768 181255 99796 -157553
12769 -86590 215465 -65868 -9891 -105104 -6718 -153206 -11923 -29883 254905 40382 -492190
12757 -194845 267086 100534 -133325 -16646 3940 -323383 -105463 11800 -232403 -96447
12746 128676 45543 -71769 115474 63354 192714 98278 29806 53761 318195 817 -40206
12734h93j73411E8385J8951a1719G3467d8878B84955a09334K1986B54098j20935
12723A33163J1712d8460l1294A49700R0675a75942g5491n4779B74544K26480C1344
12711B04578e251m8651n6285c9337F01491a89212g0620B40916d2015J9667l8036
12700f0384A27629g5529G1879J15663J3118K38685A31580j4145J01557I7241b63408
12688H8164a63247a4215q6887j20939Q3341C91565D7210J53930R7975G7291M2483
12677A19774a26183B05648p7237B8959J36963J97964j07816j826j26008D7019
12666H9013A0408a6683j47849e0004B8233d21449b1366C9434K5724a64134D81270
12654A38404R0298B5322J37792h9528D0166L7297J3975c1991G857J01710M11417
$$ plain form
12734 -893 -174304 58385 77336 -11719 73467 -48878 284955 -109334 -87348 254098 133163
12723 133163 144875 -48460 -79754 149700 240375 -175942 -75491 -130270 274544 501024 31344
12711 204578 -5251 -53902 -110187 -39337 601491 -189212 -70620 240916 -42015 -22348 -60384
12700 -60384 127629 -75529 71879 187542 200660 439345 131580 117435 218992 97241 -263408
12688 88164 -163247 -14215 -101102 -222041 -138700 391565 47210 201140 299115 77291 119774
12677 119774 -126183 205648 128411 28959 165922 363886 256070 254244 128236 47019
12666 89013 10408 -16683 -164532 -50004 28233 -421449 -21366 39434 65158 -164134 481270
12654 138404 228702 25322 163114 -89528 40166 77463 91438 -31991 7857 109567 520984
12643E20984A5326M1247J5281K55348n6496i5140m9603A52352l8767j0000K1016
12632A24601C9089L0417c18369A59399J68785J50813j14478j57086q8632C5091
12621a08115D16021a14263A13243b8226l27196I9933j0143c114C72361E1404c5088
12609c28066F5244J85665r7870J31477c05827J33109A49523D1460A9089f596B04142
12597C7097M03751H8088k6146L61203B01679G9928P7180J07528H4617a5292H7225
12585D7389J35237i0700q0228b4825C04829b4082B10131O1128j24547J59042a71122
12573B38998G3840J8563l1198a10776A2701J3385P1282i1861B16947q2259a22315
12561A44482k3290a00558j08846A69707K23865A27515c78237a36019a873A28533
$$ plain form
12643 520984 15326 56573 71854 327202 270706 -95140 -144743 152352 113585 103585 124601
12632 124601 39089 69506 -318369 159399 328184 478997 364519 207433 118801 35091
12621 -108115 416021 -114263 113243 -28226 -355422 99933 89790 -3114 372361 51404 -35088
12609 -328066 65244 250909 153039 284516 -305827 -172718 149523 41460 19089 -6596 204142
12597 37097 440848 88088 61942 423145 201679 79928 157108 264636 84617 -15292 87225
12585 47389 182626 -90700 -170928 -24825 304829 -24082 210131 271259 146712 305754 -171122
12573 238998 73840 92403 61205 -110776 12701 26086 97368 -91861 216947 134688 -122315
12561 144482 121192 -100558 -209404 169707 393572 127515 -378237 -136019 -1873 128533
12550H9166J0966K29951a77423d8995G3284b87602G5852c1332A5657i8968C1566
12538B77153C5141g8321K1640k39443i2319j06166e8061C06208A46913l3120a95576
12526D4158a79909F5898p017J80378l3720c0838G0542a50208C97059b2679j59763
12515a82442K3886B67237a84010C4153J20579b85453a18628E7397R844K12031
12505B79272h8415o0724C90633A0859K73194l0090a29247A26352C3547h5686b7332
12493E06384A22703a49470C56603b18075b0430l42132B89300j18727j4555k0886
12483A35132m985j854h2967B36801J18945A30831J24633j06313e2092A96161K4349
12472B20510J0416a1035m0315A44452m8466b07341g9449j00269B03256f6788p3146
$$ plain form
12550 89166 100132 330083 -177423 -48995 73284 -287602 75852 -31332 15657 -98968 31566
12538 277153 35141 -78321 -56681 -296124 -92319 -198485 -58061 306208 146913 113793 -195576
12526 44158 -179909 65898 58881 239259 205539 -30838 70542 -150208 397059 -22679 -182442
12515 -182442 -158556 267237 -184010 34153 154732 -285453 -118628 57397 67241 279272
12505 279272 -88415 -149139 390633 10859 284053 253963 -129247 126352 33547 -85686 -27332
12493 506384 122703 -149470 356603 -218075 -20430 -362562 289300 170573 156018 135132
12483 135132 130147 128293 -82967 236801 355746 130831 255464 149151 -52092 196161 220510
12472 220510 230926 -11035 -51350 144452 95986 -207341 -79449 -179718 203256 -66788 -139934
12461a39934a2111A09494J9529a0412A85753c1185G4084J04020i7159A38071a82859
12449F3027c6670B7585J29828c57650B3357J02167e190A56497a32662A94471n6714
12438A37757n468i4681A9520b63897B62221E0791a99516R5292A00245c468A96560
12426d9523E4840O8082J9393P6433j8825a35152E111d160r5810j4038B70155e48197
12413b60659A79820a84246G0510a07063A4718b52220j30375g1469E608b13010
12402D7461a83904H6357J63925A434a88974b0997A91708q7598n0251e5311k01656
12391b56967P8475o2332a11329B7599i6646B78674e1979k1504j33926Q2449j66232
12380b91192h0034C59402j78068b6462J2986A54049Q1961j6089n7439j5884d8815
$$ plain form
12461 -139934 -12111 109494 129023 -10412 185753 -31185 74084 178104 -97159 138071 -182859
12449 63027 -36670 27585 157413 -357650 23357 125524 -5190 156497 -132662 194471 137757
12438 137757 132289 -94681 19520 -263897 262221 50791 -199516 -104224 100245 -3468 196560
12426 -49523 54840 122922 142315 218748 199923 -135152 5111 -4160 -99970 -114008 270155 -548197
12413 -260659 179820 -184246 70510 -107063 14718 -252220 -382595 -71469 5608 -213010
12402 47461 -183904 86357 250282 1434 -188974 -20997 191708 104110 53859 -55311 -256967
12391 -256967 -178492 -240824 -111329 27599 -96646 278674 -51979 -73483 -207409 -124960 -291192
12380 -291192 -80034 359402 181334 -26462 -13476 154049 236010 219921 162482 146598 -48815
12368A67486C0516J95A2969e0280A48754b1905P972A1805a03393k679h980j51818
12356a60798j87486C11651j49310a7497j5756k49196a5818l1212q3966l3919A06253
12344D45457C6840a50678j9844A81231G3939J8281A3266a40046J9953A7356c56360
12332F8462J1670i7549A04913L8905L130L327n575J06116d6245I588a03422A16351
12319a4146B49546H3192K04657g3695o9746B06937a2691l42088a8650A38491h0816
12307F0417a05213J1062C44614a61089r431M568O5267j99202i1622A44945F520
12295a90160E7171j9800p395J79156h4640b5182n7805C04611j10717D7403K70410
12284C17813i3700L940A43557a42703l2484D0500J44865D8344N5512C1747K84651
$$ plain form
12368 167486 30516 30711 12969 -50280 148754 -21905 -13933 11805 -103393 -106072 -8980 -160798
12356 -160798 -348284 311651 162341 -17497 -33253 -282449 -15818 -47030 -130996 -164915 106253
12344 445457 36840 -150678 -170522 181231 73939 92220 13266 -140046 -120093 17356 -356360
12332 68462 80132 -97549 104913 143818 146948 150275 144700 250816 -46245 9588 -103422 116351
12319 -14146 249546 83192 287849 -73695 -143441 206937 -12691 -354779 -18650 138491 -80816
12307 60417 -105213 -94151 344614 -161089 -170520 -165952 -100685 -299887 -91622 144945 6520
12295 -190160 57171 37371 29976 209132 -84640 -25182 -82987 304611 193894 47403 317813
12284 317813 -93700 -89760 143557 -142703 -175187 40500 185365 48344 103856 31747 316398
12273C16398i5873I0309a38046B80146C9523J60147R6848A35156C2290a69643
12262B0825L23623j8140j00490J28469H6179P4249j4326K3736K86572b14049i9286
12250b03193A56477J53053A21471a06777A07085A3105L22192F7320g2678B55145
12239a71911A2285K80547h4908A06716a89617l3022L5328a4532A82457b5125C12885
12227D81615j30232I7043J13481a9464B07896m0765E5158J04309R3152o1459N5706
12216B46866G4873C2802K44225E8210R5071K9183q9967k8465e4105A70401h279
12204A81140c0692C27277H4390J26811e3024B48445Q380o0887b0120D05404l8060
12193C67344I2936K42896A1721K3564A3546N3372J19989h0574A71064C3365i7531
$$ plain form
12273 316398 -95873 90309 -138046 280146 39523 199670 296518 135156 32290 -169643
12262 20825 344448 326308 225818 354287 86179 160428 146102 169838 456410 -214049 -99286
12250 -203193 156477 309530 121471 -106777 107085 13105 335297 67320 -72678 255145
12239 -171911 12285 292832 -84908 106716 -189617 -222639 -187311 -14532 182457 -25125 312885
12227 481615 351383 97043 210524 -19464 207896 167131 55158 159467 252619 191160 246866
12216 246866 74873 32802 277027 58210 153281 182464 92497 64032 -54105 170401 -8279
12204 181140 -30692 327277 84390 211201 -53024 248445 256825 195938 -20120 405404 367344
12193 367344 92936 335832 11721 35285 13546 66918 186907 -80574 171064 33365 -97531
12181D5055R2120A1462L4092i5914I9760L133C4221L85304k9871j14902a15874
12169A84483H8366J24827c5416F2492M91006A01142K56095H6112J96654A19964
12158B47481J5304C1134J56044o6009K563H332L5769R0696J88750b15865g6938
12146a05966l5255f633A6515J03252L2071n0911J6393n6711a02958M815A60110
12134A65022c0838P358I830J86058a47786D1464h3229I2332K03518c36299B3181
12122a96537P3256A5833a93814A39786L405i2537B9806J20061C9001a76955A20373
12110C89149A63686b07527c6978A48976o11C7388J00461e0946j38363d4747I2483
12098f0166A06472D2470E297J90941a32692B7583b55339R0642A25487L32652j67934
$$ plain form
12181 45055 137175 11462 45554 -95914 99760 102893 34221 419525 389654 274752 -115874
12169 184483 88366 213193 -35416 62492 553498 101142 357237 86112 282766 119964
12158 247481 262785 31134 187178 121169 123732 8332 44101 134797 323547 -215865 -76938
12146 -105966 -141221 -6633 16515 119767 151838 100927 117320 60609 -102958 -98143 160110
12134 165022 -30838 -23480 9830 195888 -147786 41464 -83229 92332 295850 -336299 23181
12122 -196537 -123281 15833 -193814 139786 143191 -92537 29806 149867 39001 -176955 120373
12110 389149 163686 -207527 -36978 148976 148365 37388 137849 -50946 -189309 -44747 92483
12098 -60166 106472 42470 5297 196238 -132692 27583 -255339 -164697 125487 458139 290205
12087B90205G6096J81631e712G5670a98687B01872b60903M7265A79817G294b83543
12075a68700G0099a24077I8106b88877B36484H9323C7117d9074K2471I4952D300
12063c41995a63377g0289m2418l59799b1108A14105a06958c3927H3389K3543a21706
12051a46851f1015E3603b82276C3889b15100A43688A2277O6621a83924E1073e3768
12039C03458j00805b25969n0768h8539K5779D1536a69702B7172c55553C9841a32232
12027e038k05756Q5487H0408j4796P208a52246B7461a07397E98667j02378j73635
12016C22654o6825E2869d2226p2506b3857J0959D4559a3318B1500O1811B2099
12004G9687B8213c0156C05221H3738b04174A86574J5726E8141f5706j76809D1039
$$ plain form
12087 290205 76096 257727 -5712 75670 -198687 201872 -260903 -213638 179817 7294 -283543
12075 -168700 70099 -124077 98106 -288877 236484 89323 37117 -49074 -26603 94952 4300
12063 -341995 -163377 -70289 -112707 -472506 -21108 114105 -106958 -33927 83389 106932 -121706
12051 -146851 -61015 53603 -282276 33889 -215100 143688 12277 78898 -183924 51073 -53768
12039 303458 202653 -225969 -276737 -88539 -62760 41536 -169702 27172 -355553 39841 -132232
12027 -5038 -210794 -125307 80408 65612 72820 -152246 27461 -107397 598667 496289 322654
12016 322654 255829 52869 -42226 -114732 -23857 -12898 44559 -13318 21500 83311 22099
12004 79687 28213 -30156 305221 83738 -204174 186574 202300 58141 -65706 -242515 41039
11992a9861q1269k9367C5548d75335b2301l48085B06299d949k8329C50751c78747
11980g534j08135m1865A0445d58373a64927I2012f3556j07446C9530a67087I129
11968A2040J84299f3677H4723e1392o2129E2600a84120B88535C102J99383a09725
11956F2373k7772g1726A44422a4913A47262d1225k28006J26507C65604b73491
11945A86340F8621J08862F9631o525P3656b77288b862D6441d570A01825K8651
11934A30476K0240a41397d5857A70595c3296o7305A20431C7831a01276F6329a63140
11922a02751A58133b84318C7012h839B12033C8327d82968a32200k41216d4224
11911b12536k46616B0949a43118A87108a56106g3001B41809I9204k794M9400b10393
$$ plain form
11992 -19861 -101130 -130497 35548 -475335 -22301 -370386 206299 -4949 -33278 350751 -378747
11980 -7534 -115669 -157534 10445 -458373 -164927 92012 -63556 -171002 39530 -167087 9129
11968 12040 196339 -63677 84723 -51392 -113521 52600 -184120 288535 3102 202485 -109725
11956 62373 34601 -71726 144422 -14913 147262 -41225 -269231 -142724 365604 -273491
11945 186340 68621 177483 69631 63106 136762 -277288 -2862 46441 -4570 101825 130476
11934 130476 150716 -141397 -45857 170595 -33296 -100601 120431 37831 -101276 66329 -163140
11922 -102751 158133 -284318 37012 -8839 212033 38327 -482968 -132200 -373416 -44224
11911 -212536 -459152 20949 -143118 187108 -156106 -73001 241809 99204 96410 145810 -210393
11899A48899a133D0768a30104N5436A55274a3090o1272j43046m0518Q2887j18065
11888b93104A35442a46314E3764b06704A61859B1767K83126j7201a53883A00344
11877a31756M8032p6837A02216b00987b3684A7780a50018C3827b38817c561B99264
11865c0381H2700a44585k47752A87663b57169c7222k73543A11705c57316l3237
11855c90553A12562K216g1441j06803A5887L84547A85987q8234b42219A31437
11844A55648o9222b03142O8593A36355o3531b65674m33C8532b3008k63107g8965
11832b58068I7816b2362j96562H830b00710A09273c0211r4842c9072A37741h8876
11820B94343b78840B55198E1218g686j06497J6224k42648C1573a08675I3630e4365
$$ plain form
11899 148899 -1133 40768 -130104 -74668 155274 -13090 -74362 -217408 -257926 -175039 -293104
11888 -293104 135442 -146314 53764 -206704 161859 21767 304893 287692 -153883 100344
11877 -131756 -83724 -160561 102216 -200987 -23684 17780 -150018 33827 -238817 -3561 299264
11865 -30381 82700 -144585 -392337 187663 -257169 -37222 -310765 111705 -357316 -390553
11855 -390553 112562 114778 -71441 -178244 15887 400434 185987 97753 -242219 131437
11844 155648 86426 -203142 -134549 136355 72824 -265674 -266107 38532 -23008 -286115 -78965
11832 -258068 97816 -22362 -218924 8830 -200710 109273 -30211 -125053 -39072 137741 -88876
11820 294343 -278840 255198 51218 -7686 -114183 -97959 -340607 31573 -108675 93630 -54365
11808B54790F3872d7061p0662A1091a2538q8734p2942B59857m2531c23149i734
11796C08971A33920a74751B18821m2604a64688j58824a09614L8137A53452h4131
11785B08531C4352J15520b86987D5961O7348a23250F8777b5387C89012B7219f6261
11773A04436b07261M8750N0271C08524k5439d8533j40003l6469A26801J3906b4700
11761c04219C33932j31574J55896c14979B20064a09345b1370B1078b61661e4628
11750G8748a03300A13325a1349k23138M2291h5877H9895J1882b42086J01364B38105
11738A07769h4516G3235i4257B24882f2401k40046A6392a10263A72641J8763E3894
11726a00586A97001I5551a28479A55404a53462E8824N6842d8086k9362A21042
$$ plain form
11808 254790 63872 -47061 -117723 11091 -12538 -101272 -174214 259857 217326 -323149 -9734
11796 308971 133920 -174751 218821 176217 -164688 -323512 -109614 -71477 153452 -84131
11785 208531 34352 149872 -286987 45961 113309 -123250 68777 -25387 389012 27219 -66261
11773 104436 -207261 -158511 -108240 308524 283085 -48533 -188536 -225005 126801 140707 -24700
11761 -304219 333932 202358 358254 -314979 220064 -109345 -21370 21078 -261661 -54628
11750 78748 -103300 113325 -11349 -234487 -192196 -85877 89895 101777 -242086 -140722 238105
11738 107769 -84516 73235 -94257 224882 -62401 -302447 16392 -110263 172641 191404 53894
11726 -100586 197001 95551 -128479 155404 -153462 58824 115666 -48086 -77448 121042
11715a12219r599l506o3047c5488j84396L8255d1048k01544D5624K4935B9837
11703c77408A95157A597O1081K72081c59715J73447B6548b08962E00087B10964
11692i3210D8396J00698b11012L2084A33821J03397I0701P683m5599k0476a69317
11680b37187c081E5005J22928F4774c5263q8906n9855g4669K3029j60581D5531
11668i9782C01049b18734A63720E347h506E6035c14380O7553A63519n7028a31525
11656A57832j0073d3075d161A19330J1701J1481m9287C6249d2902J7853d715A44410
11643b50666e0342n4878j29338F2505a97371A16398A0204f6283J2320f116C4746
11631A59020o1173c416E3501N9686g6808k17872p1034G4524d0886J5913B34037
$$ plain form
11715 -112219 -121818 -125324 -188371 -35488 -219884 -181629 -41048 -242592 45624 70559 29837
11703 -377408 195157 1597 62678 334759 -359715 -186268 26548 -208962 500087 210964
11692 -93210 48396 149094 -211012 -178928 133821 237218 90701 98384 52785 32309 -169317
11680 -237187 -3081 55005 177933 64774 -35263 -124169 -184024 -74669 -51640 -212221 45531
11668 -99782 301049 -218734 163720 5347 -8506 56035 -314380 -246827 163519 106491 -131525
11656 157832 147759 -43075 -4161 119330 131031 142512 93225 36249 -42902 -25049 -4715 144410
11643 -250666 -50342 -105220 -234558 62505 -197371 116398 10204 -66283 -53963 -6116 34746
11631 159020 97847 -3416 53501 113187 -76808 -294680 -365714 74524 -40886 -24973 234037
11619B04493q1125b58147c463k45920p2761a29163b0084C5622M3508j7458a90355
11607A63113c773n8425A02394J9560k4189a77316D4284K14878d2981j713J846
11596d2848h176j91560I8548b8171A35016J66B9056M8481O6276E8888K7007M3474
11584A29369L8597O6437A05238k8304K00003H8128L15808A12536O5116J4019I4245
11572A27202E6054L35i0480d0775B30822a6755C37866A05511k8673A4924f2309
11560A49628F4519H438g1867E3998a93872h5773B9473b29918A1224b25215i6345
11548E1653c8854A12534f021j75496f6546r698I7635N5060a94359d8514m1096
11537h9610B77657K0603J17625A54183G5020a03406A70588a18190j61662O8691
$$ plain form
11619 204493 123368 -258147 -3463 -249383 -322144 -129163 -20084 35622 79130 61672 -190355
11607 163113 -3773 -62198 102394 121954 97765 -177316 44284 259162 -42981 -44694 -42848
11596 -42848 -8176 -199736 98548 -28171 135016 135182 29056 77537 143813 58888 85895 129369
11584 129369 167966 234403 105238 76934 276937 88128 403936 112536 177652 191671 94245
11572 127202 56054 56389 -90480 -40775 230822 -16755 337866 105511 76838 14924 -62309
11560 149628 64519 8438 -71867 53998 -193872 -85773 29473 -229918 11224 -225215 -96345
11548 51653 -38854 112534 -6021 -181517 -66546 -76244 97635 152695 -194359 -48514 -89610
11537 -89610 277657 298260 415885 154183 75020 -103406 170588 -118190 -279852 -211161
11527b11161B42513H7617R7408a1124B63886G9412a26517D38152f8159A37359
11516A69731m3898e0071A31678j0430A7337a04113H4658Q2765o2756E44J4688
11505A5232n811N0745N8957K8048M3501l6442i6610e930B68251A16670n6195K01705
11493B62180A18732Q7954P2954j26701C7824b8415C23640C9215R9383c34005D37177
11481A67401j0360O0728J95971b9227C33633A57450k6384n3497a5202b151B28826
11469C22289I280K6821N1697J20644J14132j42577a64745B12437J26336H0781
11458B25214q967e9296j13714M222C59977c1384d006A21776b50305F5139N1422
11447A16561J82354J80742A57516N076p0076J19480a1656A50897l3271J10a5710
$$ plain form
11527 -211161 242513 87617 185025 -11124 263886 79412 -126517 438152 -68159 137359
11516 169731 125833 -50071 131678 121248 17337 -104113 84658 167423 104667 544 15232
11505 15232 9421 60166 119123 147171 190672 154230 -96610 -5930 268251 116670 60475 262180
11493 262180 118732 206686 279640 152939 37824 -28415 323640 39215 138598 -334005 437177
11481 167401 157041 217769 413740 -29227 333633 157450 131066 77569 -15202 -2151 228826
11469 322289 9280 36101 87798 208442 322574 179997 -164745 212437 338773 80781
11458 225214 216247 -59296 -173010 -168788 359977 -31384 -4006 121776 -250305 65139 116561
11447 116561 298915 479657 157516 162592 92516 211996 -11656 150897 117626 117736 -15710
11435a75032A87297q9786a9862A57752K2887a04841B90127a37548C13791d1968
11424a764A2396M03580A80039A7812J44156a41263I9002l7005M8685b13243C08250
11412a28972e1646H443N7905k1544f2650D1678a65368f2028A44130j8005a92724
11400d6494A83245b4311F239J19772c17044A49184C3545F57J28379n1676a19214
11388G5665a08254I4531B7080c67538a10848j2948c2873H1726c2135o1374C58686
11376g9604A1595a69043n1246A99355o1750k8140a12139l51609a13527E6148J70533
11365B26681E1778L28599g8209o6061A52715d038A40945h2914C2837c1135A57220
11353f5899k10610O2657e0660j55722j7737r9792g3885a1416B73419c4429j55938
$$ plain form
11435 -175032 187297 97511 -19862 157752 180639 -104841 290127 -137548 313791 -41968
11424 -1764 12396 415976 180039 17812 161968 -141263 99002 61997 110682 -213243 308250
11412 -128972 -51646 8443 66348 44804 -62650 41678 -165368 -62028 144130 126125 -192724
11400 -46494 183245 -24311 6239 126011 -317044 149184 33545 657 129036 77360 -119214
11388 75665 -108254 94531 27080 -367538 -110848 -123796 -32873 81726 -32135 -93509 358686
11376 -79604 11595 -169043 -220289 199355 137605 109465 -112139 -463748 -113527 56148 226681
11365 226681 51778 380377 -78209 -144270 152715 -4038 140945 -82914 32837 -31135 157220
11353 -65899 -276509 -213852 -50660 -206382 -224119 -323911 -73885 -11416 273419 -34429 -190367
11342a90367K9024C9516A2097a18905k2444A84306c5033j76654a0313j2775j86817
11331b09905n9211H6199A0972b3128j31919C62981A09069r110b35391e6116B2745
11319D373Q7267e0773m6147C90626A18502B4766a79453g327l40366E4201b90540
11307a75082F8698a03022B95596a29404A21546P0748Q8093A06014b7718j96595
11297b24313D4738b71294B27399L5234b12998d7523l5233a0264k35887L7982P024
11286b01145P7877C14171b15923e486p5592b9142B8317i7983A16122J00133a46510
11274B32633O3998e3322m7582j03482h1007H6322A0801d2837j852D5388b8498
11262B7044K13218k6152b14255E9442b09045a5184I1118P8520a48577j38560D2759
$$ plain form
11342 -190367 -161343 39516 12097 -118905 -141349 184306 -35033 -211687 -10313 -23088 -209905
11331 -209905 -269116 86199 10972 -23128 -155047 362981 109069 99959 -235391 -56116 22745
11319 4373 91640 -50773 -96920 390626 118502 24766 -179453 -7327 -347693 54201 -290540
11307 -175082 68698 -103022 295596 -129404 121546 192294 280387 106014 -27718 -224313
11297 -224313 44738 -271294 227399 262633 -212998 -47523 -82756 -10264 -246151 -208169 -201145
11286 -201145 -123268 314171 -215923 -5486 -81078 -29142 28317 -97983 116122 216255 -146510
11274 232633 296631 -53322 -100904 -204386 -81007 86322 10801 -42837 -44689 45388 -28498
11262 27044 240262 214110 -214255 59442 -209045 -15184 91118 169638 -148577 -287137 42759
11250a61109e3175B59355e4902A22521d6695A30207a03281a2915l3876n969a3381
11238f0862n8629A00589L6667k0035a87291Q6333a486m1322B16065F9482b76580
11226a9287j06898A37568b77435C15180E7586b01535b7612A20205h1528j5517
11216i7045A76064C3474J9492a20152I7499g0271q3945M0067J8583I7676b16719
11204a14773k87248B60577C425J65874b15041k09331A33862a34161c2507m8920
11194h1427H2816a2962q4639B16651q7709a27634q181A05944b42570A88499p408
11183A81091f78092A93943E3937r694K77903E2198c30999a3739B12308f9545Q512
11172f1033k61010k4028J47207A5317f7490A5118b43493g7918A69472E3135B2974
$$ plain form
11250 -161109 -53175 259355 -54902 122521 -46695 130207 -103281 -12915 -46791 -52760 -13381
11238 -60862 -119491 100589 137256 117221 -187291 -100958 -1486 -42808 216065 69482 -276580
11226 -19287 -126185 137568 -277435 315180 57586 -201535 -27612 120205 -81528 -97045
11216 -97045 176064 33474 52966 -120152 97499 -70271 -154216 -114149 -95566 97676 -216719
11204 -114773 -402021 260577 3425 169299 -215041 -424372 133862 -134161 -32507 -81427
11194 -81427 82816 -12962 -97601 216651 128942 -127634 -135815 105944 -242570 188499 181091
11183 181091 -678092 193943 53937 44243 322146 52198 -330999 -13739 212308 -69545 -61033
11172 -61033 -322043 -346071 -198864 15317 -67490 15118 -243493 -77918 169472 53135 22974
11160b02372g856G73a35692k4596A93665b6850B906c5812H813J78965E8595L3092
11148I1687b32709a01877D16425b477A43780J0211D2893n482E33a48286j16564
11137b64850B18656c895m8002k76366B8493a84013B21111n2295J93821j65467
11127A97170f9848I5389C9019j3595J12925l6574J5812C8912f7999G8849G61M0969
11115D1730K36072g9657D21972C77J70368O2513m5366J25064a5876A97739n1377
11104A46362C3326R9572N2866c50147a74962A27042K96176A80602p857J96406
11094C69151q0599A15631J23259B4190K86119b12601H8286J89622r8553C0872
11083A19930k2697O4684G0217R5127J03033D6662d0073B11779K00541j00726o4708
$$ plain form
11160 -202372 -7856 773 -135692 -160288 193665 -26850 2906 -35812 8813 187778 58595 91687
11148 91687 -232709 -101877 416425 -2477 143780 153991 42893 37411 533 -148286 -264850
11137 -264850 218656 -3895 -51897 -328263 28493 -184013 221111 168816 362637 197170
11127 197170 -69848 95389 39019 25424 138349 101775 117587 38912 -67999 78849 761 41730
11115 41730 277802 -79657 421972 377 170745 233258 187892 312956 -15876 197739 146362
11104 146362 33326 132898 185764 -350147 -174962 127042 423218 180602 172745 369151
11094 369151 288552 115631 238890 24190 310309 -212601 88286 277908 179355 30872
11083 119930 97233 161917 70217 165344 268377 46662 -40073 211779 412320 311594 246886
11072B46886g0945C54208A23502O4917n9671J83978P0604A6905K21247n589M80427
11061G12990B64755O9629N57128k65613q5954j28043q5360J78070L66982n7193
11051H14401K9075j86401P6820l4245Q7123P6616j53653j48997M42441j01655
11041I01525j11116P4918l43284K5324N56596l74918m25j19725K26007N1860k01884
11030F84878O3682k05653J69929K03570j63587n6556Q3318P6501n1362j20236
11020F84484k71500K18588L4595J78172l7723L6354M1714l03077k2837K8759L90940
11009I78469m18047K38287j08232R2931p6652L7936C69917N31713l01828J51291
10999G51093L06865j34208j63354J39801k44308K36526k29128N9807K45964r5727
$$ plain form
11072 246886 -70945 354208 123502 188419 128748 312726 383330 16905 238152 232563 712990
11061 712990 264755 334384 891512 625899 539945 411902 326542 504612 871594 814401
11051 814401 843476 657075 733895 699650 786773 863389 709736 560739 1003180 901525
11041 901525 790409 865327 522043 547367 1103963 729045 728620 608895 834902 886762 684878
11030 684878 748560 542907 712836 916406 752819 696263 779581 856082 804720 684484
11020 684484 412984 631572 666167 844339 806616 842970 884684 581607 558770 587529 978469
11009 978469 560422 798709 690477 783408 706756 744692 369917 901630 599802 751093
10999 751093 1057958 923750 760396 900197 655889 892415 663287 723094 969058 873331
10989H73331j30462K18095K21117m79642N4929L92142k99344M2538L48611P3375
10979A314690P6719L06791k1311L67378M9829K41708L48937L93212K09963Q8749
10969C376665J45938Q7052l9482m94195m59649m32396k06893l56262N0967n72083
10959A099662L84746J04334k47326k582M9133j60363j72323m70137K9898N1407
10949F66449k43001L1393R9880R7412B25314Q5709F7863N32039A61997F7194J81365
10938B48559I961J83539K74562A48822J68958E3476a89779B74389r7237f5227
10927F7586J5392J14715L4723h9732j44186G9665K00406A16306M3762a31509d9257
10915h7621N63L6893A12927c2154B4250d9788l4485c7680q6564N7886C38559G0995
$$ plain form
10989 873331 742869 960964 1182081 702439 757368 1149510 850166 892704 1241315 1314690
10979 1314690 1391409 1698200 1676889 2044267 2094096 2335804 2684741 3077953 3287916 3376665
10969 3376665 3522603 3609655 3570173 3075978 2616329 2183933 1977040 1620778 1671745 1099662
10959 1099662 1484408 1588742 1341416 1338834 1387967 1227604 1055281 585144 615042 666449
10949 666449 423448 454841 554721 652133 225314 311023 67863 599902 161997 67194 248559
10938 248559 9961 193500 468062 148822 317780 53476 -189779 274389 177152 -65227
10927 67586 82978 197693 232416 -89732 -233918 79665 280071 116306 160068 -131509 -49257
10915 -87621 -87058 -50165 112927 -32154 24250 -49788 -84273 -37680 -124244 -66358 338559 70995
10902D6348P5496B7564a55182F5471a36112B32480g2219A19939a5051j89712B41948
10890a77088B2022K7363J67287c4170A75101B5800K06946a23127C0930b2614J0346
10879a2268k79216a5131k4175q1660M5442b4752D4773a63185j67599B861f9890
10867F1143a43801H8084i5092E5599J36995a7082j29941n516A47638O6112b10600
10855C9812d7311j25600A28038D4682a61021q4525I4593J41580f2135E4252d5504
10843a06500B46702G3506R0421c5074B3014d2622l7322k017A09165c290A8659
10831A52334J56463b60884R7235B48380G3751J07348c34181a46274f3850A03453
10820a6585j78031G1796b5737j75084O0916j2719A92344l9137d0199A28319d5548
$$ plain form
10902 46348 121844 27564 -155182 65471 -136112 232480 -72219 119939 -15051 -204763 241948
10890 -177088 22022 49385 216672 -34170 175101 25800 232746 -123127 30930 -22614 -12268
10879 -12268 -291484 -15131 -39306 -120966 -75524 -24752 44773 -163185 -330784 2861 -69890
10867 61143 -143801 88084 -95092 55599 192594 -17082 -147023 -152539 147638 213750 -210600
10855 39812 -47311 -172911 128038 44682 -161021 -245546 94593 236173 -62135 54252 -45504
10843 -106500 246702 73506 163927 -35074 23014 -42622 -79944 -81961 109165 -3290 18659
10831 152334 308797 -260884 -163649 248380 73751 181099 -334181 -146274 -63850 103453
10820 -16585 -194616 71796 -25737 -200821 -139905 -152624 192344 153207 -40199 128319 -45548
10808B68144a26777d3067D496b8810n021j66466C65168h4194n2667j94921A70797
10796c3784k03873G1987c01283B548P2674P2689K4246h9827n2801A9365J41094
10785A60459o5320k0997H50e8314j16225f1854k3358C49986A72871e7956A37822
10773b0981j55716D5705P7956J04761G8702i9333M7370R927F7580b0523B06103
10761G5002a86989A02842b7284k20036D02761A53445a9463A93789f8309j95781
10751b64090b7449a694o2860F2756R4724D2862d931r4556L4201j16736o6380e4756
10738a24826A31798P6446B9247e0795F496K35702E734K33257a01779c4869E3655
10726a08824K3285k30186b4572D11636a23366r6533J05991G4368a67457G8757
$$ plain form
10808 268144 -126777 -43067 4496 -28810 -33831 -200297 365168 -84194 -136861 -331782 170797
10796 -33784 -237657 71987 -301283 2548 75222 147911 172157 -89827 -142628 19365 160459
10785 160459 95139 74142 850 -58314 -174539 -61854 -85212 349986 172871 -57956 137822
10773 -20981 -176697 45705 123661 228422 78702 -99333 -51963 -42036 67580 -20523 206103
10761 75002 -186989 102842 -27284 -247320 402761 153445 -19463 193789 -68309 -264090
10751 -264090 -27449 -1694 -64554 62756 157480 42862 -4931 -99487 -65286 -182022 -248402 -54756
10738 -124826 131798 208244 29247 -50795 6496 242198 5734 238991 -101779 -34869 53655
10726 -108824 -85539 -315725 -24572 411636 -123366 -219899 -113908 74368 -167457 78757
10715b70956g3082c4442q161j17313e5794l5503l17217J45403J383J26929j00830
10704b35629d9326j64727A44983o4358k8369J07785a83399D60106c7546j5146
10694e2692k92647J0079C11886b22381A62340F5597J14691b89577a9403e708C2089
10682a55078o4988c2672j5140A92684n4770c26399F1522L83925A17773a89553
10671a54470d7122A34971b3335r4525B24718a73330A11252a04047j28253a02802
10660d68337B52804c29661f4950l43698f240j49781C5348a03798j65828A25925
10649E841c40194i1985m1152k17319e0335B73497j03035a66149d6118C29275i3897
10637b56279a5843j35810C18200A57303d5240j97002d2162q5409k46882g215q7143
$$ plain form
10715 -270956 -73082 -34442 -42603 -159916 -55794 -91297 -408514 -263111 -261728 -134799 -235629
10704 -235629 -49326 -214053 144983 80625 52256 160041 -183399 460106 -37546 -52692
10694 -52692 -345339 -335260 311886 -222381 162340 65597 180288 -289577 -19403 -5708 32089
10682 -155078 -220066 -32672 -47812 192684 137914 -326399 61522 445447 117773 -189553
10671 -154470 -47122 134971 -23335 -117860 224718 -173330 111252 -104047 -232300 -102802
10660 -468337 252804 -329661 -64950 -408648 -6240 -156021 35348 -103798 -269626 125925
10649 5841 -340194 -91985 -133137 -350456 -50335 273497 170462 -166149 -46118 329275 -93897
10637 -256279 -15843 -151653 318200 157303 -45240 -242242 -42162 -127571 -374453 -7215 -94358
10626i4358b8947E4490F607b43655g9370B87913D9416R9300g2613k32271h0270
10614i5760j09466q8118B8992K3658g6512b4654l8796F4862i0476J7117b8674
10602A39119a84496J3038j2121a9463k38856b95n4963G9832J85747r2048k7944
10591A45587N5756b07817a2307H0687a3156A21252K6247f9849G8421c9663j79719
10580b19382j63382a31659F3723a77272B9429K2606a2758B16305e0556B89565
10569A76287o3581a84881j0081k8192J00088g952j43686D803K461M7757a66149
10557E01533E3200g7511A60171l1995d3950A91072c1618n4701K1350H7041a64738
10545B50996b31979P4926B93245i1075A21690J24626H3367J24306f7172I5561
$$ plain form
10626 -94358 -28947 54490 6607 -243655 -79370 287913 49416 148716 -72613 -304884 -80270
10614 -95760 -205226 -293344 28992 52650 -76512 -24654 -63450 64862 -90476 -73359 -28674
10602 139119 -184496 -171458 -183579 -19463 -258319 -295 -55258 79832 265579 173531 145587
10591 145587 201343 -207817 -12307 80687 -13156 121252 147499 -69849 78421 -39663 -219382
10580 -219382 -382764 -131659 63723 -177272 29429 52035 -12758 216305 -50556 289565
10569 176287 112706 -184881 -194962 -223154 -123066 -7952 -151638 4803 7264 55021 -166149
10557 501533 53200 -77511 160171 128176 -43950 191072 -31618 -86319 -64969 87041 -164738
10545 250996 -231979 -157053 293245 -91075 121690 246316 83367 207673 -67172 95561
10534A08576c27279A24470b55071O9148B5694J948c49245J30676R7812N1118A85129
10522a17146B116J72212b34189n7767G4603b09710F1468K01424g2612A3799N6882
10511G0681a24657C4422a03864b5994j0727r7231k08745B63422a2992j6013B1753
10499B29204j5904b34940e5691B78957A3515L5893c20390a48717B0235P0069a7611
10487a34897D14341I9967k2173c3736J3953C40194j48576L23043j10623A70574
10476I856d37844b18073j49064J47271C09433B710J7975a25477a7274k4849j40733
10465a82856P7935j09554Q6313m1771e0071A15847d8070a8908B00616n5353B9564
10453e8786a2754k1235k6058j71137B0235Q4921b29497M1766C67799e902l13867
$$ plain form
10534 108576 -327279 124470 -255071 -185923 25694 27642 -349245 -218569 -120757 -69639 185129
10522 -117146 2116 174328 -234189 -291956 74603 -209710 61468 262892 -72612 13799 70681
10511 70681 -124657 34422 -103864 -25994 -36721 -133952 -342697 263422 -12992 -29005 21753
10499 229204 213300 -234940 -55691 278957 13515 49408 -320390 -148717 20235 90304 -17611
10487 -134897 414341 99967 77794 -33736 -19783 340194 191618 514661 404038 170574
10476 9856 -437844 -218073 -367137 -219866 309433 2710 20685 -125477 -17274 -42123 -182856
10465 -182856 -104921 -214475 -128162 -169933 -50071 115847 -48070 -18908 200616 145263 29564
10453 -58786 -12754 -33989 -60047 -231184 20235 105156 -229497 -187731 367799 -5902 -319769
10442c19769A09322a20816d0963A03474f6997Q843A1564i0387K1549M152A6786
10430a67858q4684M2246J6476d2132j16990A47884a70734A49088D5699b8447k11876
10419b40323J14767B01664L2709O9836a00311B79507g6470B35636o7952O6453
10409B34137F6339i7248j41645J02035B99147c7068p6052C52878A56266c5855
10398c3599j5649C7257b1719k5471m8371F8148L38579h2247G0217f8937A31142
10386B32899j11936a33882c5749j01659A06009J15006j05677N3886R8070L7757
10376C05051j44388N8946K4637L34616j57569j17634M8492j59485J07855K53369
10366E53890q9427p5034J16586F1632J42763l8353K19697J59394i0803B40218
$$ plain form
10442 -319769 109322 -120816 -40963 103474 -66997 -58154 11564 -90387 -68838 -64686 16786
10430 -167858 -252542 -210296 -193820 -42132 -159122 147884 -170734 149088 45699 -28447 -240323
10419 -240323 -125556 201664 234373 304209 -100311 279507 -76470 235636 167684 234137
10409 234137 66339 -97248 -238893 -136858 299147 -37068 -113120 352878 156266 -35855
10398 -33599 -49248 37257 -21719 -47190 -95561 68148 406727 -82247 70217 -68937 131142
10386 232899 120963 -133882 -35749 -137408 106009 221015 115338 169224 267294 305051
10376 305051 160663 219609 244246 578862 421293 303659 352151 192666 300521 553890
10366 553890 464463 389429 506015 61632 204395 166042 385739 545133 -90803 240218
10355C24977K41058A55482K65026K57891j1183j10884J32523C21508K21576B06902
10344F1996L44480M5705q6488P0449A68109K24436j89517L6606J06670C0415L93862
10333D24277j58472J16743a09917C40344h4969A63804b50081D3136O0577L04257
10323D07970J18848A2154K27357K69548q5340A70818a68011C4448p506M093b45253
10311H5033J44895c62966B4840M5992K04024a95249C91693c10515e2766A50943
10300A35040K04387A25592Q8981l3125e8519B06934C926a69503f5060B98875j33741
10289A65134i474c712q3997n7868B40665K8664L9834a35717A9248a31384j3059
10278a44443D03269e7149E7111J2308L16926b35866J05475B18834b0455r6044
$$ plain form
10355 324977 566035 155482 420508 678399 667216 556332 688855 321508 543084 206902
10344 61996 406476 452181 365693 436142 168109 392545 203028 239634 346304 30415 424277
10333 424277 265805 382548 -109917 340344 -84969 163804 -250081 43136 103713 407970
10323 407970 526818 12154 239511 509059 423719 170818 -168011 34448 26942 31035 -245253
10311 85033 229928 -362966 24840 70832 274856 -195249 391693 -310515 -52766 150943
10300 135040 339427 125592 214573 181448 -58519 206934 3926 -169503 -65060 298875 165134
10289 165134 -9474 -3712 -87709 -145577 240665 269329 309163 -135717 19248 -131384 -144443
10278 -144443 403269 -57149 57111 69419 386345 -235866 -130391 218834 -20455 -116499
10268a16499K1601H210d45902G7563J36287C1994Q3827L30982A28854P4417K37129
10257D40400A50539K95836a23025j61189J03376A18437D8559J76336R862G9373
10246c70466J33537k7356a985o45365H0607a21702A70546L3294J42674d2018a5731
10234d0201G011L01390a36127A91035a09940l4760d1508E6094e8941m32425D5825
10222a03369K5362J0333k57830b3214j41642O4951a014n3582A63366a8055E7583
10210b67834P0915N589p8104B39090d2281j66850A19884j3744B522a41208A8467
10198a05235j30208E6838e4923C8724c95124D51529b08296B31483b07371B93669
10187A28058b16074A9950a03162H786i5747F8656J57265G0039L6473b14289P8320
$$ plain form
10268 -116499 -94898 8210 -445902 77563 213850 31994 115821 446803 128854 203271 440400
10257 440400 150539 446375 -123025 -284214 -180838 118437 48559 224895 234757 79373
10246 -370466 -236929 -264285 -1985 -647350 80607 -121702 170546 203840 346514 -42018 -15731
10234 -40201 7011 308401 -136127 191035 -109940 -144700 -41508 56094 -58941 -491366 45825
10222 -103369 -78007 -67674 -325504 -23214 -164856 -99905 -1014 -54596 163366 -18055 57583
10210 -267834 -196919 -191330 -269434 239090 -42281 -209131 119884 106140 2522 -141208 18467
10198 -105235 -235443 56838 -54923 38724 -395124 451529 -208296 231483 -207371 293669
10187 128058 -216074 19950 -103162 8786 -95747 68656 225921 70039 106512 -214289 -135969
10176a35969A13545a99655I1231C5731c4805j25451F1493a53807F8056d6301j50301
10165a96602j60032f872j93473L5138b6219k19203j979e3630r2443N5893k31525
10154c21705a36876H8403b98887e4313j43539j2587j54867B73548b83357i9370
10143f2478A07527c38796f9850k23795p9204a75120D16505A16140m4257J319a21203
10131d7180I5657a44454k26376A63046c4628j49642A8714p500c32663O3085A95308
10119b744l4365A53841C0709j49b92689f2784p3660B5327c41409A21793d4981
10107E3486f9654j75886Q0252A22875a0488k78479D517M402J4859J183a70464
10095A61131G5218N2874a67262e0812j77028a1869k86308J27518l9448M1043j25066
$$ plain form
10176 -135969 113545 -199655 91231 35731 -34805 -160256 61493 -153807 68056 -46301 -196602
10165 -196602 -356634 -6872 -200345 -165207 -26219 -245422 -247401 -53630 -146073 -90180 -321705
10154 -321705 -136876 88403 -298887 -54313 -197852 -210439 -365306 273548 -283357 -99370
10143 -62478 107527 -338796 -69850 -293645 -372849 -175120 416505 116140 71883 73202 -121203
10131 -47180 95657 -144454 -370830 163046 -34628 -184270 18714 11214 -332663 -269578 195308
10119 -2744 -37109 153841 30709 30560 -292689 -62784 -136444 25327 -341409 121793 -44981
10107 53486 -69654 -245540 -165288 122875 -10488 -288967 4517 8919 23778 24961 -170464
10095 161131 75218 128092 -167262 -50812 -227840 -11869 -298177 -170659 -210107 -169064 -294130
10084b94130a40100F3374a82853A31673c36867Q3948c0187G6508a58849j9588
10074a78437a3100j29536j12745B06938g7946j04385g8294m2113o9621C25407
10063H7908d4997G3651b33520h4421o9539a534p2808j17937B21191b05913j58175
10052c64088a44082A02019l4929J57659c03699C67811a60574D15725b9464p1031
10042a00495d0546B4371b43277i9961j69348p1656J07660d4944n8003g725G8336
10030c63380I9698B4239J30081L8112h4986B10529c4042m1544k9477r05j6575
10019a22543I4479j6023Q2232p1355J6102f276A3251b63359D22248a29205j76314
10008c05519B00643b71546d8686D04274b01090e8807G9364K22819J9886f6767
$$ plain form
10084 -294130 -140100 63374 -182853 131673 -336867 -252919 -30187 76508 -158849 -178437
10074 -178437 -13100 -142636 -255381 206938 -77946 -182331 -78294 -120407 -190028 325407
10063 87908 -44997 73651 -233520 -84421 -153960 -1534 -74342 -192279 221191 -205913 -364088
10052 -364088 -144082 102019 67090 224749 -303699 367811 -160574 415725 -29464 -100495
10042 -100495 -40546 24371 -243277 -99961 -269309 -340965 -233305 -44944 -102947 -7725 78336
10030 -363380 99698 24239 154320 192432 -84986 210529 -34042 -75586 -105063 -105968 -122543
10019 -122543 94479 78456 160688 89333 105435 -6276 13251 -263359 422248 -129205 -305519
10008 -305519 200643 -271546 -48686 404274 -201090 -58807 79364 302183 322069 -66767
9997a84843Q6841j46637N293A05578a3800E2209a36686l3793a1688n34540F7588
9985a18803I1634a77864b8907k5562q4273L8237C7790g0677A85802c06372A14002
9973e29889c3529B30576F5889N2223d85675E805j868b08058d2562A76618a10291
9961B1140b51212A81748a37875A26833m9382a14913q9868j77903A50283a61284
9950A95404Q7044b13488k98104b51826B26727i6019m296j67132I5050C8117c3031
9938B55069A12848a54340L7523B1070e6714B854g9254C8461h095B45820A8400
9926a31966B28163a20269b4400o1626j10160K4752l5741A08304Q907a78286M9959
9915a28327j00515H6787a29498j5057j6574j05161B41492r9694A9347J73761e7140
$$ plain form
9997 -184843 -98002 -244639 -239346 105578 -13800 52209 -136686 -170479 -11688 -546228 67588
9985 -118803 91634 -177864 -28907 -54469 -138742 -100505 37790 -70677 185802 -306372 114002
9973 -529889 -33529 230576 65889 118112 -485675 5805 3937 -208058 -42562 176618 -110291
9961 21140 -251212 181748 -137875 126833 77451 -114913 -204781 -382684 150283 -161284
9950 195404 282448 -213488 -511592 -251826 226727 -96019 -100315 -267447 95050 38117 -33031
9938 255069 112848 -154340 -116817 21070 -56714 2854 -79254 38461 -8095 245820 18400
9926 -131966 228163 -120269 -24400 -86026 -196186 -171434 -207175 108304 117211 -178286 -128327
9915 -128327 -228842 86787 -129498 -144555 -161129 -266290 241492 141798 19347 193108 -57140
9903d0873B8335P7934E1328A7795J06067b36341k15775F3133c13326I7342k6931
9892G0411g9477j0871o5303q6598f0187C15720b012k9755l49575M8374c8960G5591
9879g3813j26607C32270C8227A729L9500a71177j48695k0935G8325a1264j07397
9868a18661A39544g3417j50369c4148j70525g9278b7422A49772a72018B05851
9857a38409j69897B28972b37294O5822P3535o4964e7892A37946a5677j66747c8785
9845b60831d5206q3275A1334b28870M5981c6121B5592K4848b81213A29625a04261
9833A83439E6240a74839G0082c69248F0699f8932C37156c50194J59849D8330b01570
9821A47471h5859l05396l0785a14454e3818j82867d5533E3092e1690G8914J59533
$$ plain form
9903 -40873 28335 106269 51328 17795 123862 -236341 -452116 63133 -313326 97342 70411
9892 70411 -79477 -90348 -155651 -242249 -60187 315720 -2012 -31767 -381342 -332968 -38960 75591
9879 -73813 -200420 332270 38227 1729 41229 -171177 -319872 -340807 78325 -11264 -118661
9868 -118661 139544 -73417 -223786 -34148 -204673 -79278 -27422 149772 -172018 205851
9857 -138409 -308306 228972 -237294 -171472 -97937 -162901 -57892 137946 -15677 -182424 -38785
9845 -260831 -45206 -128481 11334 -228870 -182889 -36121 25592 50440 -281213 129625 -104261
9833 183439 56240 -174839 70082 -369248 60699 -68932 337156 -350194 -190345 48330 -201570
9821 147471 -85859 -391255 -422040 -114454 -53818 -236685 -45533 53092 -51690 78914 238447
9810B38447G1438b70637A757h0302J5473m3197n467r1745A95998b63870G8681
9798D0009A4372a61747q5318I0173g2150A03728a70584M7972a0269l85341J53264
9787b42346j4713c0424j39551A45884a88163p8650k48198d5012k02307A44665
9776a86478k970A32416a08778q7017D613a84045g9300j06221k41475a43596O0378
9765h3218m3258C71379G9548a87158e8264A19157M6212a62315c222o4439k8836
9754i6497D4118a04961L0137A01581i5207F2144j2460K05843e0725A13397b68075
9742G9934B3597b78367B97885d24050A06552k8123a39444A02211b7356C3585f1158
9730b25589D570c51215C1027m266c55400h5313c9029j40216j75429a21436M1655
$$ plain form
9810 238447 71438 -270637 1757 -80302 -64829 -108026 -113493 -205238 195998 -263870 78681
9798 40009 14372 -161747 -247065 90173 -72150 103728 -170584 -122612 -10269 -395610 -242346
9787 -242346 -257059 -30424 -169975 145884 -188163 -266813 -515011 -45012 -247319 144665
9776 -186478 -189448 132416 -108778 -195795 4613 -184045 -79300 -185521 -426996 -143596 -83218
9765 -83218 -126476 371379 79548 -187158 -58264 119157 165369 -162315 -3222 -67661 -96497
9754 -96497 44118 -104961 -74824 101581 -95207 62144 49684 255527 -50725 113397 -268075
9742 79934 23597 -278367 297885 -424050 106552 78429 -139444 102211 -27356 33585 -61158
9730 -225589 4570 -351215 31027 26761 -355400 -85313 -39029 -179245 -354674 -121436 -79781
9719g9781m414j781j21922b2565j32120c2329k51062P9792j45790J64757r429
9708a94061H5426R6213O2701h658G9129a01437B31443a33363a594k01700F6642
9696E2840a18248p1891D3681P8632m6655A8529J22853g1423A66006a48901i210
9684h004k9304o1595n4392J3558C3681a25555N5961c1776k70452k04461D9612
9672A70056f2501B3161e0788H2753a21999k5317J9938A35684b12370J04408Q01
9661a07161A02260a69646A82433c9109B00623a29525p0697e5536F4522b75696
9650A0579N9457a34007j34532D1707e8444B5571e4988A3454L9188N6417A2648
9638a41746p3401l9791b3552a357o9063c1648A4171c2711F5515c36646J17797
$$ plain form
9719 -79781 -84195 -85976 -207898 -22565 -154685 -32329 -283391 -203599 -349389 -184632 -194061
9708 -194061 85426 181639 244340 -8658 79129 -101437 231443 -133363 -1594 -203294 66642
9696 52840 -118248 -190139 43681 122313 75658 18529 141382 -71423 166006 -148901 -9210
9684 -8004 -37308 -98903 -153295 -139737 33681 -125555 -69594 -31776 -302228 -506689 49612
9672 170056 -62501 23161 -50788 82753 -121999 -147316 -127378 135684 -212370 -107962 -107161
9661 -107161 102260 -169646 182433 -39109 200623 -129525 -200222 -55536 64522 -275696
9650 10579 70036 -134007 -268539 41707 -58444 25571 -54988 13454 52642 109059 12648
9638 -141746 -215147 -254938 -23552 -1357 -70420 -31648 14171 -32711 65515 -336646 -218849
9627b18849i8532A31578K6024d75979A73362c6314l93947b07433k56095F0775
9616h8702k36229I3180P2644b25415A10475b21932J03952D16554I6218D6375A8141
9604a60883e9976C6528a57482b864A78321p5489a63186j58647A48052a23692m1851
9593a65543N8676j92659A15615K5478a77347O1901F7138C0648a39946j64433B28399
9581A33266b40671P1678j41400A78660b7342l8869r2963C14637a10470q176N0780
9570f7866A38485Q6878B8360O5916h6037b6761j49072J2865J0722k37627E187
9558a60730A58924b06397h4226A51231h0677l36025A51710c14930R2811j80023
9548d02142a11039m12569K35758h5199A28179E9351d1695J83r7278k93753B94274
$$ plain form
9627 -218849 -98532 131578 157602 -475979 173362 -36314 -430261 -207433 -463528 60775
9616 -88702 -324931 93180 165824 -225415 110475 -221932 -117980 416554 96218 46375 18141
9604 -160883 -59976 36528 -157482 -2864 178321 102832 -163186 -321833 148052 -123692 -165543
9593 -165543 -106867 -299526 115615 141093 -177347 -115446 67138 30648 -139946 -304379 228399
9581 133266 -240671 -168993 -310393 178660 -27342 -66211 -159174 314637 -110470 -118646 -67866
9570 -67866 138485 225363 28360 94276 -86037 -26761 -175833 -162968 -152246 -389873 5187
9558 -160730 158924 -206397 -84226 151231 -80677 -416702 151710 -314930 -222119 -402142
9548 -402142 -111039 -523608 -287850 -85199 128179 59351 -41695 -41512 -138790 -432543 294274
9536A01602d4717B6056J112d17870B52554n0535g1382C43897e2515B08663b917
9524E1778B3558e8783J34o5852j471a0790l0387F3456J03503n3666b34739A54580
9511D4955f0520j78981G529b13620a924j39475B3772a0089A44125a10768K6060
9500h4708a205o7202P412k60134E7212a57320q9391A40136i6993d2109l1104j867
9488g5080l32182C4359R1915a16187d9280l44031B6963a39761D6856J98601b2804
9476d0240A50942L2922f9558C4373c6602l6388a7437A84393a60367b2834j23495
9465a46329r910L6080J1217K2J3327D38127a07335A11603A6820a08739J525i674
9452c15787m322l8596A79227G6948a15825C43075a23100a6669j91281B46891p9793
$$ plain form
9536 101602 -44717 26056 27168 -417870 252554 202019 -71382 343897 -52515 208663 -2917
9524 51778 23558 -58783 -58649 -124501 -125972 -10790 -41177 63456 166959 113293 -234739 154580
9511 44955 -60520 -239501 7529 -213620 -1924 -141399 23772 -10089 144125 -110768 -84708
9500 -84708 -1205 -68407 -60995 -321129 57212 -157320 -246711 140136 -96993 -42109 -73213 -75080
9488 -75080 -407262 34359 126274 -116187 -49280 -393311 26963 -139761 46856 245457 -22804
9476 -40240 150942 183864 -69558 34373 -36602 -72990 -17437 184393 -160367 -22834 -146329
9465 -146329 -156239 -120159 -108942 -108920 -95593 438127 -107335 111603 16820 -108739 -107214 -9674
9452 -315787 -320109 -358705 179227 76948 -115825 343075 -123100 -16669 -207950 246891 167098
9441A67098i7537a4637j3517A6560a53077H4952a72163B03591C4854a10862D9796
9429b87973J17818q8684N7045k5459D0544a09543p6696P2200j84933F1468K00438
9418B61906a12186A06449b55934F4472a59855E3484M8080a43205b0521B18845
9407b2553A75578d2371r6009l5301A82564f6956D6754f3175k6223M2793j01734
9396a48339N540g0443k00282j29986H8470a5598B000a24818E7178i796j03249
9385a13045A44450a46683j9873k28793C65937a12638k58344p8417C74823b01094
9374E7469A6913L4587b59218a08477q7067l1324G7107b43901i7013j72046E1117
9362E9687j7939Q2945b24864d8775k22974Q6327P9655q570E2304J21969O4882
$$ plain form
9441 167098 -97537 -14637 -28154 16560 -153077 84952 -172163 203591 34854 -110862 49796
9429 -287973 -170155 -258839 -201794 -227253 40544 -109543 -186239 -114039 -298972 61468 261906
9418 261906 -112186 106449 -255934 64472 -159855 53484 101564 -143205 -20521 218845
9407 -22553 175578 -42371 -138380 -173681 182564 -66956 46754 -63175 -89398 -46605 -148339
9396 -148339 -142799 -70443 -270725 -400711 88470 -15598 2000 -124818 57178 -9796 -113045
9385 -113045 144450 -146683 -166556 -395349 365937 -112638 -370982 -449399 374823 -201094
9374 57469 16913 51500 -259218 -108477 -195544 -226868 77107 -243901 -97013 -269059 51117
9362 59687 41748 124693 -224864 -48775 -271749 -185422 -105767 -114337 52304 174273 239155
9351B39155b60124D4047f0350b7604k40608c7320o9963G1669b8719B32118g0723
9339I3632J77783C2638R5987g0126C82632L947a709k05480D4918a31851I1522
9327b36621B11482e7636D7486b96351b1703h974j07998e647k33782A57131a86461
9315a27346b9747j5005B87194a80559A9885a90532j17486g6637D0285a63081B87532
9303d09672L3764f5491C21075A41066a66980l25456a2543A4173J41546J0296a81522
9291c8897k7244r2502o1279I1218a11890k81029D9127a62872P6565i507A39666
9279C17537b04574L6471N1748p2893e4132j77825L5408q109d6649k40214g4861
9267A64970J20248i3233E3612a55445r4879L5918c707q5264G2489J38458i4821
$$ plain form
9351 239155 -260124 44047 -60350 -27604 -268212 -37320 -107283 71669 -28719 232118 -70723
9339 93632 271415 32638 128625 -70126 382632 386579 -1709 -207189 44918 -131851 91522
9327 -236621 211482 -57636 47486 -296351 -21703 -8974 -116972 -5647 -239429 157131 -186461
9315 -127346 -29747 -44752 287194 -180559 19885 -190532 -308018 -76637 40285 -163081 287532
9303 -409672 -375908 -65491 321075 141066 -166980 -492436 -12543 14173 155719 166015 -181522
9291 -38897 -66141 -158643 -219922 91218 -111890 -392919 49127 -162872 -86307 -9507 139666
9279 317537 -204574 -168103 -116355 -189248 -54132 -231957 -196549 -204658 -46649 -286863 -74861
9267 164970 285218 -93233 53612 -155445 -250324 -214406 -3707 -88971 72489 210947 -94821
9255A93293b46855D46311k7040f2723j56881I0415J26434m7582b89420C9823g7666
9243g8630j63097D4623h7835k19572G5723a21576k57897h5392P015A62158G6881
9231H1191h0183A73977b64442A06339g3608k1099r7681n1245E6107B3357g5880
9219A41982a45800E1665o86e6109k63252e0493B34838G6045c2164k53535J03205
9208a82494l3692I1338d98585a17862I6222a16708d4828A40709a69136A24107
9197a49033b762D5023K07013c0804j14699I633O5310N9627c28734a43698J6920
9186a26778o3927Q582P9668L5398k06299i1178q4859C42884I5627e2540C0209
9174I3448b40005P4115D0613b85342A19181b78221a31882J797N5016j7230j39551
$$ plain form
9255 193293 -246855 446311 419271 -62723 -219604 90415 216849 169267 -289420 39823 -77666
9243 -78630 -241727 44623 -87835 -307407 75723 -121576 -379473 -85392 -78377 162158 76881
9231 81191 -80183 173977 -264442 106339 -73608 -94707 -192388 -243633 56107 23357 -75880
9219 141982 -145800 51665 50979 -56109 -319361 -50493 234838 76045 -32164 -285699 -182494
9208 -182494 -216186 91338 -498585 -117862 96222 -116708 -44828 140709 -169136 124107
9197 -149033 -2762 45023 252036 -30804 -145503 9633 74943 134570 -328734 -143698 -126778
9186 -126778 -190705 -182123 -102455 -67057 -273356 -91178 -176037 342884 95627 -52540 30209
9174 93448 -240005 -165890 40613 -285342 119181 -278221 -131882 -130085 -75069 -92299 -231850
9163b31850a06527B7682J57029a44813A33965a13145b0249k58570A46806a01525
9152B04169c3961j48800A80022f2243O4I195M2041J99627c62917J27430K8985
9141b06502G8138N0436l6247h2659p1633O9340B77937d5209a7970l30966a52369
9129h9453k23384A18266d4474j10431A45156a15746p5506O4030p7310B74232b4010
9117a57888k94394C50492b11971P8221K249b3813k71890B1227b7926H3037a4854
9105A25794L2211G8903a6008o9600o3112e4455K3768j48745O1554H9857j4822
9094G5035d32913D3588a60553A80251A0400J00763b76382J02288a0320E9692d1484
9082i6953k0804B8175i902n623A7684R0527D4338L220a60625C2683a77543c939
$$ plain form
9163 -231850 -106527 27682 184711 -144813 133965 -113145 -20249 -278819 146806 -101525
9152 204169 -33961 -182761 180022 -62243 -62179 9195 51236 250863 -362917 -235487 -206502
9141 -206502 78138 128574 92327 -82659 -154292 -84952 277937 -45209 -17970 -348936 -152369
9129 -89453 -312837 118266 -44474 -154905 145156 -115746 -191252 -127222 -204532 274232 -24010
9117 -157888 -452282 350492 -211971 -133750 -131501 -23813 -295703 21227 -27926 83037 -14854
9105 125794 158005 78903 -16008 -85608 -148720 -54455 -30687 -179432 -117878 89857 75035
9094 75035 -432913 43588 -160553 180251 10400 111163 -276382 -174094 -10320 59692 -41484
9082 -96953 -117757 28175 -9902 -15525 17684 108211 44338 47558 -160625 32683 -177543 -3939
9069B2790c43101a46688I8997b96066A09166c75082d0366k86254C34398A08730
9058b34302B4560a71242A74509M747a00129H1592c36111K1475d4083A2867a14818
9046b3468F2239L1476c66199a09277P966m7746A06321a24244N9587j26317R3349
9035i7625d8639K37l0027I0862a06025A77483b09512j83816B79088b8051B95643
9023g1574j34715J5921f8119l82648g3696A78834b4872L004F759K4462b52634
9011a5904j79075n9207g3547D0306a09158k8044j9479A05760a3729k45436l6803
9000b95968A60168a7374m3408j65346E2466J89143m2159b5738j78492B1450b38693
8988b98025a01969d6493j6021I182h8909R526j54748A14879a38923C871K6041
$$ plain form
9069 22790 -343101 -146688 98997 -296066 109166 -375082 -40366 -326620 334398 108730
9058 -234302 24560 -171242 174509 179256 -100129 81592 -336111 -314636 -44083 12867 -114818
9046 -23468 62239 93715 -366199 -109277 -101311 -149057 106321 -124244 -64657 -190974 -97625
9035 -97625 -48639 -48402 -78429 90862 -106025 177483 -209512 -393328 279088 -28051 295643
9023 -71574 -206289 -190368 -68119 -450767 -73696 178834 -24872 -21868 6759 31221 -252634
9011 -15904 -194979 -254186 -73547 40306 -109158 -137202 -156681 105760 -13729 -259165 -295968
9000 -295968 160168 -17374 -60782 -226128 52466 241609 199450 -25738 -204230 21450 -238693
8988 -298025 -101969 -46493 -62514 9182 -88909 -79383 -234131 114879 -138923 3871 29912
8977B9912g2848j69391j4695J26722A49164E4374b73712f3110o3811L8259A8614
8965a60375N5179A1917d73329J63733i7143A74686a98786k54931g9026l23244
8955d02270g7966D40009a41601A80047J63957a51804C7063J69549f9893B4809
8944A24908a82163o1471C67936F3206c4003PB4705K08865L5471J02361r275D3154
8931A3832b86998j54724a72599E8650N46651F5759O24448O88667L048054R878542
8921A4305470R05863C109721I75116m05986j8018B74041n6572i5320A52842K19461
8911C72303b94753J43007C69000J38569g388C1975Q0338c05740h3772j63411B5797
8899a07512j62676B00046B686a27115j62122E1397Q209J6496a49345p5930i3157
$$ plain form
8977 29912 -72848 -242239 -256934 -130212 149164 54374 -273712 -63110 -126921 -88662 18614
8965 -160375 -105196 11917 -473329 -309596 -97143 174686 -198786 -453717 -79026 -402270
8955 -402270 -77966 440009 -141601 180047 344004 -151804 37063 206612 -69893 24809
8944 124908 -182163 -243634 367936 63206 -34003 -33996 24705 233570 269041 371402 362127 43154
8931 13832 -286998 -441722 -172599 58650 605301 65759 690207 1378874 4426928 14305470
8921 14305470 15211333 3109721 975116 569130 551112 274041 217469 -95320 152842 372303
8911 372303 -294753 -151746 369000 507569 -7388 31975 112313 -305740 -83772 -247183 25797
8899 -107512 -270188 200046 2686 -127115 -289237 51397 59606 76102 -149345 -225275 -93157
8887a31243j39107a09526A29345J30000F419a40771A25474B8822a06110r060j119
8876a16289o0440a4967E5982k7546g8344A25626J44071f7961k07671a29082A50103
8864a74216h5209A30397J80901A52038A266R9547B6118d9629A51114d70890h5146
8852c02090j5647Q6638a00524C55540C1873b04934D02508A10088I611N02051B32955
$$ plain form
8887 -131243 -270350 -109526 129345 259345 6419 -140771 125474 28822 -106110 -115170 -116289
8876 -116289 -176729 -14967 55982 28436 -78344 125626 269697 -67961 -275632 -129082 150103
8864 -174216 -85209 130397 311298 152038 1266 100813 26118 -49629 151114 -470890 -85146
8852 -302090 -317737 -231099 -100524 355540 31873 -204934 402508 110088 9611 511662 232955
$$ [...]
##END NTUPLES=NMR SPECTRUM
##END=
