##TITLE=AC1511_ROEFFECT0001_8213500_TBdqNoHbOQ
##JCAMPDX= 6.0         $$ Bruker NMR JCAMP-DX V2.0
##DATA TYPE= NMR SPECTRUM
##DATA CLASS= NTUPLES
##ORIGIN= BRUKER
##OWNER= Administrator
$$ 1.72 TOPSPIN		Version 2.1
$$ 2013-10-04 16:13:52.979 -0700  Administrator@X
$$ Compression mode = diff/dup
##.OBSERVE FREQUENCY= 400.02188249412
##.OBSERVE NUCLEUS= ^1H
##.ACQUISITION MODE= SIMULTANEOUS (DQD)
##.ACQUISITION SCHEME= undefined
##.AVERAGES= 64
##.DIGITISER RES= 22
##SPECTROMETER/DATA SYSTEM= spect
##.PULSE SEQUENCE= noesygpps1d.comp
##.SOLVENT NAME= COFFEE_meoh
##.SHIFT REFERENCE= INTERNAL, COFFEE_meoh, 1, 14.96087
##AUDIT TRAIL= $$ (NUMBER, WHEN, WHO, WHERE, PROCESS, VERSION, WHAT)
$$ ##TITLE= Audit trail, TOPSPIN		Version 2.1
$$ ##JCAMPDX= 5.01
$$ ##ORIGIN= Bruker BioSpin GmbH
$$ ##OWNER= Administrator
$$ $$ E:\/data/COFFEE/nmr/AC1511_ROEFFECT0001_8213500_TBdqNoHbOQ/12/pdata/1/auditp.txt
$$ ##AUDIT TRAIL=  $$ (NUMBER, WHEN, WHO, WHERE, PROCESS, VERSION, WHAT)
(   1,<2013-10-04 16:13:48.252 -0700>,<Administrator>,<X>,<go>,<TOPSPIN 2.1>,
      <created by zg
	started at 2013-10-04 16:02:18.898 -0700,
	POWCHK enabled, PULCHK disabled,
       configuration hash MD5:
       C8 4E 4E 5D D3 5C D8 9E 9F 52 82 E0 59 8A DE 15
       data hash MD5: 64K
       44 7C 41 89 78 BD CC 15 81 E3 70 7B 67 D4 AB 00>)
(   2,<2013-10-04 16:13:51.058 -0700>,<Administrator>,<X>,<proc1d>,<TOPSPIN 2.1>,
      <Start of raw data processing
       efp LB = 0.3 FT_mod = 6 PKNL = 1 PHC0 = 0 PHC1 = 0 SI = 128K 
       data hash MD5: 128K
       31 2D 04 0E 7C BA C3 73 F9 72 E5 32 52 BC 90 A7>)
(   3,<2013-10-04 16:13:52.089 -0700>,<Administrator>,<X>,<proc1d>,<TOPSPIN 2.1>,
      <pk PHC0 = -80.39246 PHC1 = 0 
       data hash MD5: 128K
       D8 FD 69 C3 6A 24 8B BB F4 36 0C 04 1E C7 2E DC>)
(   4,<2013-10-04 16:13:52.495 -0700>,<Administrator>,<X>,<proc1d>,<TOPSPIN 2.1>,
      <abs ABSG = 1 
       data hash MD5: 128K
       EA B3 80 6E 83 DA 21 42 4F D7 ED 91 92 AE 82 A7>)
(   5,<2013-10-04 16:13:52.589 -0700>,<Administrator>,<X>,<proc1d>,<TOPSPIN 2.1>,
      <abs ABSG = 2 
       data hash MD5: 128K
       58 AB 66 0A 37 0F 7F 81 14 AF 25 1B 0B 68 B3 14>)
(   6,<2013-10-04 16:13:52.651 -0700>,<Administrator>,<X>,<proc1d>,<TOPSPIN 2.1>,
      <abs ABSG = 3 
       data hash MD5: 128K
       08 3F 85 D5 3E 66 75 4A 94 CA 10 FC C7 FD D4 1C>)
(   7,<2013-10-04 16:13:52.729 -0700>,<Administrator>,<X>,<proc1d>,<TOPSPIN 2.1>,
      <abs ABSG = 4 
       data hash MD5: 128K
       49 B8 E9 85 49 D4 F1 55 7E 87 81 BE E4 71 66 EE>)
(   8,<2013-10-04 16:13:52.808 -0700>,<Administrator>,<X>,<proc1d>,<TOPSPIN 2.1>,
      <abs ABSG = 5 
       data hash MD5: 128K
       05 B3 56 AB DF FF A0 F0 63 DF BF F5 38 52 B7 0A>)
$$ ##END=
$$ 
$$ $$ hash MD5
$$ $$ EB 62 C1 31 F1 C7 0D EB 02 AA 5E B5 C0 19 0B B3
##$RELAX= 
##$RELAX= 
##$RELAX= 
##$RELAX= 
##$RELAX= 
##$RELAX= 
##$RELAX= 
##$RELAX= 
$$ Bruker specific parameters
$$ --------------------------
##$DU= <E:\>
##$EXPNO= 12
$$ [...]
##$TP07= 0
##$TPNAME0= <>
##$TPNAME1= <>
##$TPNAME2= <>
##$TPNAME3= <>
##$TPNAME4= <>
##$TPNAME5= <>
##$TPNAME6= <>
##$TPNAME7= <>
##$TPOAL= (0..7)
0.5 0.5 0.5 0.5 0.5 0.5 0.5 0.5
##$TPOFFS= (0..7)
0 0 0 0 0 0 0 0
##$TUNHIN= 0
##$TUNHOUT= 0
##$TUNXOUT= 0
##$USERA1= <user>
##$USERA2= <user>
##$USERA3= <user>
##$USERA4= <user>
##$USERA5= <user>
##$V9= 5
##$VALIST= <valist>
##$VCLIST= <CCCCCCCCCCCCCCC>
##$VD= 0
##$VDLIST= <DDDDDDDDDDDDDDD>
##$VPLIST= <PPPPPPPPPPPPPPP>
##$VTLIST= <TTTTTTTTTTTTTTT>
##$WBST= 2048
##$WBSW= 25
##$XGAIN= (0..3)
0 0 0 0
##$XL= 0
##$YL= 0
##$YMAX_a= 6814279
##$YMIN_a= -13340280
##$ZGOPTNS= <>
##$ZL1= 120
##$ZL2= 120
##$ZL3= 120
##$ZL4= 120
##$ABSF1= 14.96087
##$ABSF2= -5.597312
##$ABSG= 5
##$ABSL= 3
##$ALPHA= 0
##$AQORDER= 0
##$ASSFAC= 0
##$ASSFACI= 0
##$ASSFACX= 0
##$ASSWID= 0
##$AUNMP= <proc_prof1d_extract.lims>
##$AXLEFT= 0
##$AXNAME= <>
##$AXNUC= <1H>
##$AXRIGHT= 0
##$AXTYPE= 0
##$AXUNIT= <>
##$AZFE= 0.1
##$AZFW= 0.1
##$BCFW= 0
##$BC_mod= 0
##$BYTORDP= 0
##$COROFFS= 0
##$CY= 15
##$DATMOD= 1
##$DC= 0
##$DFILT= <>
##$DTYPP= 0
##$F1P= 0
##$F2P= 0
##$FCOR= 0.5
##$FTSIZE= 131072
##$FT_mod= 6
##$GAMMA= 0
##$GB= 0
##$INTBC= 1
##$INTSCL= 1
##$ISEN= 128
##$LB= 0.3
##$LEV0= 0
##$LPBIN= 0
##$MAXI= 10000
##$MC2= 0
##$MEAN= 0
##$ME_mod= 0
##$MI= 0
##$NCOEF= 0
##$NC_proc= -2
##$NLEV= 6
##$NOISF1= 0
##$NOISF2= 0
##$NSP= 0
##$NTH_PI= 0
##$NZP= 0
##$OFFSET= 14.96087
##$PC= 1
##$PHC0= -80.39246
##$PHC1= 0
##$PH_mod= 1
##$PKNL= yes
##$PPARMOD= 0
##$PPDIAG= 0
##$PPIPTYP= 0
##$PPMPNUM= 2147483647
##$PPRESOL= 1
##$PSCAL= 4
##$PSIGN= 0
##$PYNMP= <proc.py>
##$REVERSE= no
##$SF= 400.020009690162
##$SI= 131072
##$SIGF1= 0
##$SIGF2= 0
##$SINO= 400
##$SIOLD= 131072
##$SPECTYP= <>
##$SREGLST= <1H.CDCl3>
##$SSB= 0
##$STSI= 131072
##$STSR= 0
##$SW_p= 8223.68421052631
##$SYMM= 0
##$S_DEV= 0
##$TDeff= 65536
##$TDoff= 0
##$TI= <>
##$TILT= no
##$TM1= 0
##$TM2= 0
##$TOPLEV= 0
##$USERP1= <user>
##$USERP2= <user>
##$USERP3= <user>
##$USERP4= <user>
##$USERP5= <user>
##$WDW= 1
##$XDIM= 131072
##$YMAX_p= 417922554
##$YMIN_p= -10824
##$CURPLOT= <Network HP LaserJet P1505>
##$CURPRIN= <$Network HP LaserJet P1505>
##$DFORMAT= <normdp>
##$LAYOUT= <+/1D_H.xwp>
##$LFORMAT= <normlp>
##$PFORMAT= <normpl>
##$SURQMSG= 1
$$ End of Bruker specific parameters
$$ ---------------------------------
##NTUPLES= NMR SPECTRUM
##VAR_NAME=  FREQUENCY,     SPECTRUM/REAL,   SPECTRUM/IMAG
##SYMBOL=    X,             R,               I
##VAR_TYPE=  INDEPENDENT,   DEPENDENT,       DEPENDENT
##VAR_FORM=  AFFN,          ASDF,            ASDF
##VAR_DIM=   131072,        131072,          131072
##UNITS=     HZ,            ARBITRARY UNITS, ARBITRARY UNITS
##FACTOR=    0.0627417313425164, 1,          1
##FIRST=     8223.62146879497, 3450,         -69550
##LAST=      0,             5653,            -68621
##MIN=       0,             -10824,          0
##MAX=       8223.62146879497, 417922554,    0
$$ Real data points
##PAGE= N=1
##DATA TABLE= (X++(R..R)), XYDATA
$$ [...]
63794C17804j048n99r16j638j938j524q72m71l13j85N8N12J059J129K25j182j935
$$ 317804 316756 316157 315241 313603 311665 310141 309269 308798 308485 308300 308358 308870 309929 311058 311283 310101 308166
63777C08166j630j221j697k759l361l165k712k362j816q59O7L73R6r5L92J540
$$ 308166 306536 305315 303618 300859 297498 294333 291621 289259 287443 286584 286651 287024 287120 287025 287417 288957
63761B88957K763L500L822M400N755P558Q919R343R042Q287O843M333Q74k995
$$ 288957 291720 295220 299042 303442 309197 316755 325674 335017 344059 352346 359189 363522 364396 361401
63747C61401o768j0005j2038j2209j0680q573p031o239n580m518l088j631m64
$$ 361401 354633 344628 332590 320381 309701 301128 294097 287858 282278 277760 274672 273041 272577
63734B72577K36M60M38N49J028J862K897L940M779N306N597N816O040O333O807
$$ 272577 272813 273273 273711 274260 275288 277150 280047 283987 288766 294072 299669 305485 311525 317858 324665
63719C24665P397P724P460O744N921N017L869K648J675P21q18k867m446m902m727
$$ 324665 332062 339786 347246 353990 359911 364928 368797 371445 373120 373841 373023 370156 365710 360808 356081
63704C56081m748n014n121n116n289n376m804l650k585j858j060k6P63R38Q03
$$ 356081 351333 346319 341198 336082 330793 325417 320613 316963 314378 312520 311460 311434 312197 313135 313938
63689C13938Q09R15Q93Q78J252K091L029L519L202K212J237R78J387J759J603
$$ 313938 314747 315662 316555 317433 318685 320776 323805 327324 330526 332738 333975 334953 336340 338099 339702
63674C39702J136Q02P77J119J941L070L911M083L940M063M476M723M575M110L349
$$ 339702 340838 341640 342417 343536 345477 348547 352458 356541 360481 364544 369020 373743 378318 382428 385777
63659C85777K294J262N94kj264l290n144n909n732n454n422n170m219k698j113
$$ 385777 388071 389333 389927 389925 388661 385371 380227 374318 368586 363132 357710 352540 348321 345623 344510
63644C44510K06J236K096K986M216N981Q086R957J1078J1364J1206J1134J1374
$$ 344510 344716 345952 348048 351034 355250 361231 369317 379274 390352 401716 412922 424056 435430
63631D35430J1634J1382J0475R369Q596Q108P409O283N020L906K888J912J221
$$ 435430 447064 458446 468921 478290 486886 494994 502403 508686 513706 517612 520500 522412 523633
63618E23633J012J138J523K599M813P763J0399J2172J3623J5635J8395K1327K3808
$$ 523633 524645 525783 527306 529905 534718 542481 552880 565052 578675 594310 612705 634032 657840
63605F57840K5748K7482K9216L0638L1072L0068K7663K4068J9337J3580P301J196
$$ 657840 683588 711070 740286 770924 801996 832064 859727 883795 903132 916712 924013 925209
63593I25209m210q436j0843j1093r813q282p414p393q284j0384j3746j7774k1610
$$ 925209 920999 912563 901720 890627 880814 872532 865118 857725 849441 839057 825311 807537 785927
63580G85927k4647k6597k7369k7050k5795k3714k1094j8589j6638j4776j2179
$$ 785927 761280 734683 707314 680264 654469 630755 609661 591072 574434 559658 547479
63569E47479q973o251m560l151j171J134K983M192N119O004P032Q607J0744J2556
$$ 547479 538506 532255 527695 524544 523373 524507 527490 531682 536801 542805 549837 558444 569188 581744
63555E81744J3169J3012J3435J5225J8120K1669K5730L0167L4930M0523M7716
$$ 581744 594913 607925 621360 636585 654705 676374 702104 732271 767201 807724 855440
63544H55440N6621O6432P5798Q2502Q2861P3129N2772K6187M34j8963l0283l4800
$$ 855440 912061 978493 1054291 1136793 1219654 1292783 1345555 1371742 1372176 1353213 1322930 1288130
63532A288130l4711l1774k7111k1684j6584j2744j0501r797j0711j3452j7789
$$ 1288130 1253419 1221645 1194534 1172850 1156266 1143522 1133021 1123224 1112513 1099061 1081272
63521A081272k2917k7990l2442l5785l7555l7654l6414l4222l1438k8626k6366
$$ 1081272 1058355 1030365 997923 962138 924583 886929 850515 816293 784855 756229 729863
63510G29863k4619k2799k0627j8438j6460j4442j2244j0342r268r010r237r702
$$ 729863 705244 682445 661818 643380 626920 612478 600234 589892 580624 571614 562377 552675
63498E52675j0139j0306j0385j0812j1376j1198j0008q715q096p699o830n852
$$ 552675 542536 532230 521845 511033 499657 488459 478451 469736 461640 453941 447111 441259
63486D41259n456n179l928j717K95J494K308L073L573M040N318P501R424J0155
$$ 441259 435803 430624 426696 424979 425274 426768 429076 432149 435722 439762 445080 452581 462005 472160
63472D72160J0194J0485J0927J0699R527P819N928M074K762K535L211M013M471
$$ 472160 482354 492839 503766 514465 523992 531811 537739 541813 544575 547110 550321 554334 558805
63459E58805M858N626O749P682P741O585M550K441Q40l68j672l219m540m861l625
$$ 558805 563663 569289 576038 583720 591461 598046 602596 605037 605877 605509 603837 600618 596078 591217 587592
63444E87592j018J923M042N201O461Q915J2658J7213K2635K9641L8674M9358O0907
$$ 587592 586574 588497 592539 597740 604201 613116 625774 642987 665622 695263 733937 783295 844202
63431H44202P2469Q2536Q8082Q5080P0821M6482J7368r908l0918m4500n1237n1802
$$ 844202 916671 999207 1087289 1172369 1243190 1289672 1307040 1297132 1266214 1221714 1170477 1118675
63419A118675m6978l8272k7671j6859o849J973R797J6959K3179K7496K9263K8751
$$ 1118675 1071697 1033425 1005754 988895 982046 984019 993816 1010775 1033954 1061450 1090713 1119464
63407A119464K6383K1950J5278P282l56o442j0610j2788j3153j2482j1823j1704
$$ 1119464 1145847 1167797 1183075 1190357 1190001 1183559 1172949 1160161 1147008 1134526 1122703 1110999
63395A110999j2245j3846j7021k1571k6621l1416l5410l7806l8097l7118l6364
$$ 1110999 1098754 1084908 1067887 1046316 1019695 988279 952869 915063 876966 839848 803484
63384H03484l5989l4540l1173k7015k3605k0976j8172j4926j1691q613n514k694
$$ 803484 767495 732955 701782 674767 651162 630186 612014 597088 585397 576784 571270 568576
63372E68576p15N15J669L086M646O448Q757J1297J3476J5390J7861K1281K5089
$$ 568576 567861 568376 570045 573131 577777 584225 592982 604279 617755 633145 651006 672287 697376
63359F97376K8721L2308L6054L9485M1991M3737M5438M7261M8455M8123M6048
$$ 697376 726097 758405 794459 833944 875935 919672 965110 1012371 1060826 1108949 1154997
63348A154997M2540L7748L1398K3449J4720O558k19n684r934j2353j2237j0019
$$ 1154997 1197537 1235285 1266683 1290132 1304852 1311410 1311191 1305507 1295573 1283220 1270983 1260964
63336A260964p275n447n026o061q815j3491j9627k6179l2157l6931l9978m0789
$$ 1260964 1253689 1248242 1243216 1237155 1228340 1214849 1195222 1169043 1136886 1099955 1059977 1019188
63324A019188l9129l5272k9759k2964j4996n997L666J3283K1292K4544J9048L022
$$ 1019188 980059 944787 915028 892064 877068 871071 874737 888020 909312 933856 952904 955926
63312I55926k0121m2666n7512o2473o0095n4194m7285m0430l3948k7826k2133
$$ 955926 935805 893139 835627 773154 713059 658865 611580 571150 537202 509376 487243
63301D87243j7398j4172j2250j0844r565q636q132p666p012o405n943n335m518
$$ 487243 469845 455673 443423 432579 423014 414378 406246 398580 391568 385163 379220 373885 369367
63288C69367l925l779l657l190k624k285j931j285p41q89j491j682j109k92K17
$$ 369367 365442 361663 358006 354816 352192 349907 347976 346691 345950 345061 343570 341888 340779 340487 340704
63273C40704M98R25J516J867J650J018N44O45J104J274Q49J72l11n19m49J83J583
$$ 340704 341202 342127 343643 345510 347160 348178 348722 349367 350471 351745 352594 352766 352455 351936 351487 351670 353253
63256C53253L313M576N013M958M944N263N821O196N924N024M079L561L282K923
$$ 353253 356566 361142 366155 371113 376057 381320 387141 393337 399261 404285 408364 411925 415207 418130
63242D18130K760L307M336N003M972M748M769M816M678M712N219N765N801N661
$$ 418130 420890 424197 428533 433536 438508 443256 448025 452841 457519 462231 467450 473215 479016 484677
63228D84677O191P443Q504Q774Q730R063R624R826R680R742J0194J0657J1032
$$ 484677 490868 498311 506815 515589 524319 533382 543006 552832 562512 572254 582448 593105 604137
63215F04137J1749J2887J3656J3279J1962J0422Q836O882M516K027o50l834p271
$$ 604137 615886 628773 642429 655708 667670 678092 686928 693810 698326 700353 699703 695869 688598
63202F88598j0150j2088j3415j4270j4248j3299j2138j1178r743p104l784r65
$$ 688598 678448 666360 652945 638675 624427 611128 598990 587812 578069 570965 567181 566216
63190E66216J031K841M886P013R210J1815J4797J7598J9939K2159K4516K6655
$$ 566216 567247 570088 574974 581987 591197 603012 617809 635407 655346 677505 702021 728676
63178G28676K8036K8482K8114K7071K5492K3464K0867J7659J4368J1880J0559
$$ 728676 756712 785194 813308 840379 865871 889335 910202 927861 942229 954109 964668
63167I64668R943R396Q665P629N966L386j49m603r984j5961k1721k6568l0461
$$ 964668 974611 984007 992672 1000301 1006267 1009653 1009504 1004901 994917 978956 957235 930667 900206
63154I00206l3753l6511l8349l8820l7845l5818l3414l1092k8818k6325k3611
$$ 900206 866453 829942 791593 752773 714928 679110 645696 614604 585786 559461 535850
63143E35850k0935j8399j5938j3699j1955j0652r455q334p596p164o433n085l604
$$ 535850 514915 496516 480578 466879 454924 444272 434817 426483 418887 411723 405290 400205 396601
63130C96601k613k137j890j797j876j929j829j739j739j579j204j133j729k510
$$ 396601 393988 391851 389961 388164 386288 384359 382530 380791 379052 377473 376269 375136 373407 370897
63116C70897k699k189j430o58J27P17R00R66J327J753J707J351J423K152L031
$$ 370897 368198 366009 364579 363921 364048 364765 365665 366631 367958 369711 371418 372769 374192 376344 379375
63101C79375L784M749O099P417Q457R629J1328J3294J5120J6906J8940K0945K2098
$$ 379375 383159 387908 394007 401424 409881 419510 430838 444132 459252 476158 495098 516043 538141
63088E38141K1537J8698J3524O731m54p108j2920j7547k0267k0720j9554j7741
$$ 538141 559678 578376 591900 598631 598177 591069 578149 560602 540335 519615 500061 482320
63076D82320j5558j2824r853p375n607m062k420r88j07M88J402K964M939O690
$$ 482320 466762 453938 444085 436710 431103 427041 424621 423633 423526 424014 425416 428380 433319 440009
63062D40009P618P716P699Q293R433J0532J1449J2658J4370J6094J7383J8531
$$ 440009 447627 455343 463042 471335 480768 491300 502749 515407 529777 545871 563254 581785
63050E81785K0010K1618K2723K3183K3494K4072K4804K5385K5695K5758K5672
$$ 581785 601795 623413 646136 669319 692813 716885 741689 767074 792769 818527 844199
63039H44199K5688K6036K6539K6703K6481K6592K7680K9276L0123K9545K8048
$$ 844199 869887 895923 922462 949165 975646 1002238 1029918 1059194 1089317 1118862 1146910
63028A146910K6422K4560K1619J7074J1292N024j228p342j3318j9089k4300k8264
$$ 1146910 1173332 1197892 1219511 1236585 1247877 1252901 1251673 1244331 1231013 1211924 1187624 1159360
63016A159360l0382l0778l0191k9039k6904k3288j8538j3479q312k548L929J0385
$$ 1159360 1128978 1098200 1068009 1038970 1012066 988778 970240 956761 948449 945901 949830 960215
63004I60215J6150K1422K6706L1864L6220L9389M1412M2200M1470L9349L6532
$$ 960215 976365 997787 1024493 1056357 1092577 1131966 1173378 1215578 1257048 1296397 1332929
62993A332929L3611L0714K8004K6143K5767K6690K8018K8971K9261K8728K7123
$$ 1332929 1366540 1397254 1425258 1451401 1477168 1503858 1531876 1560847 1590108 1618836 1645959
62982A645959K4374K0714J6237J0555L186n799j5753k5927l5725m4571n1988n7896
$$ 1645959 1670333 1691047 1707284 1717839 1721025 1715226 1699473 1673546 1637821 1593250 1541262 1483366
62970A483366o2499o5787o7387o7171o5632o3317o0176n5979n1163m6666m2811
$$ 1483366 1420867 1355080 1287693 1220522 1154890 1091573 1031397 975418 924255 877589 834778
62959H34778l8966l4594l0125k6422k3704k1496j9435j7643j6357j5539j4908
$$ 834778 795812 761218 731093 704671 680967 659471 640036 622393 606036 590497 575589
62948E75589j4201j3352j2592j2178j1919j1229r906q567p882p702p404o810o134
$$ 575589 561388 548036 535444 523266 511347 500118 490212 481645 473763 466061 458657 451847 445713
62935D45713n235l850k516k222k929l439l172l007l676m256l498j878j002j219
$$ 445713 440478 436628 434112 431890 428961 425522 422350 419343 415667 411411 407913 406035 405033 403814
62921D03814j245k55J004J587J696K016K640L364M401N882P240P854P997Q348
$$ 403814 402569 402314 403318 404905 406601 408617 411257 414621 419022 424904 432144 439998 447995 456343
62907D56343Q699Q014N723K349j172m159o258p407p938q184p884o484m175j976
$$ 456343 465042 473056 478779 481128 479956 475797 469539 462132 454194 446010 438126 431642 427467 425491
62893D25491n84L61J457K572L133L055K693K153J233N0q59j182j141r92o65n8
$$ 425491 424907 425268 426725 429297 432430 435485 438178 440331 441564 441614 440755 439573 438432 437440 436775 436717
62877D36717O44J235J811K493L005K826J809L67r56j947k728l471m193m728m784
$$ 436717 437361 438596 440407 442900 445905 448731 450540 450907 449951 448004 445276 441805 437612 432884 428100
62862D28100m180l047j845j042p63p57p02m94k17P6L97O26N13m7p69j223j206
$$ 428100 423920 420873 419028 417986 417223 416466 415764 415270 415053 415129 415526 416152 416665 416618 415849 414626 413420
62845D13420p66j8P74J076N43l53n92K31J414K088K241K347K479K398K285K582
$$ 413420 412654 412636 413410 414486 415029 414676 414084 414315 415729 417817 420058 422405 424884 427282 429567 432149
62829D32149L172L492L504L806M552N127N199N310N846O145N460M151L059K070
$$ 432149 435321 438813 442317 446123 450675 455802 461001 466311 472157 478302 483762 487913 490972 493042
62815D93042L91j937l789m374m003l302k476j577p45J19J270K406K795K407K197
$$ 493042 493433 491496 487707 483333 479330 476028 473552 471975 471230 471349 472619 475025 477820 480227 482424
62800D82424K768L533L813L995M788N943O718P166P831Q473Q274P398P165Q326
$$ 482424 485192 488725 492538 496533 501321 507264 513982 521148 528979 537452 545726 553124 560289 568615
62786E68615J0190J1935J3820J6400J9273K1605K3499K5897K9242L2966L6430
$$ 568615 578805 590740 604560 620960 640233 661838 685337 711234 740476 773442 809872
62775H09872L9673M2982M6162M8573M9688M9401M7899M5347M1683L6723L0534
$$ 809872 849545 892527 938689 987262 1036950 1086351 1134250 1179597 1221280 1258003 1288537
62764A288537K3610J6481R154J286p037j4962k1576k6752l1088l5057l8502m1036
$$ 1288537 1312147 1328628 1337782 1339068 1332031 1317069 1295493 1268741 1237653 1202596 1164094 1123058
62752A123058m2610m3432m3523m2758m1385m0038l8936l7458l4916l1552k8216
$$ 1123058 1080448 1037016 993493 950735 909350 869312 830376 792918 758002 726450 698234
62741F98234k5213k2128j8896j6226j4541j3167j1322r419q503q549q318p046
$$ 698234 673021 650893 631997 615771 601230 588063 576741 567322 558819 550270 541952 534906
62729E34906n361m090l032j570O6J043J269J559K432L362L628L398L538M560O157
$$ 534906 529545 525455 522423 520853 520919 521962 523231 524790 527222 530584 534212 537610 541148 545708 551865
62714E51865P678Q795R665J0663J2070J3909J6021J8239K0539K3026K5745K8554
$$ 551865 559543 568338 578003 588666 600736 614645 630666 648905 669444 692470 718215 746769
62702G46769L1234L3815L6734M0480M5057M9895N4394N8399O2025O5314O8241
$$ 746769 778003 811818 848552 889032 934089 983984 1038378 1096777 1158802 1224116 1292357
62691A292357P0858P3025P4166P3644P1392O7683O2268N4255M3113K9438J4468
$$ 1292357 1363215 1436240 1510406 1584050 1655442 1723125 1785393 1839648 1882761 1912199 1926667
62680A926667q38j5933l0182m2826n3406o1970o8726p3724p6854p8034p7384p5290
$$ 1926667 1925829 1909896 1879714 1836888 1783482 1721512 1652786 1579062 1502208 1424174 1346790 1271500
62668A271500p2202o8299o3568n8277n3130m8669m4744m0832l6721l2583k8624
$$ 1271500 1199298 1130999 1067431 1009154 956024 907355 862611 821779 785058 752475 723851
62657G23851k5017k2076j9987j8401j6742j4937j3438j2492j1766j0820r581q255
$$ 723851 698834 676758 656771 638370 621628 606691 593253 580761 568995 558175 548594 540339
62645E40339p188o832p387q222q208o883n030l686k981k329j472p36l52o5M34
$$ 540339 533151 526319 518932 510710 502502 495619 490589 486903 483922 481593 480121 479385 479033 478968 479402
62630D79402R71J019K77r30j853j971j419p72m24m41q37j528k010j600l47Q00
$$ 479402 480373 481392 481669 480739 478886 476915 475496 474724 474300 473859 473022 471494 469484 467884 467537 468337
62614D68337J137J054J276J715J731J265Q83Q55R57J224K032L232L992L972L951
$$ 468337 469474 470528 471804 473519 475250 476515 477398 478253 479210 480434 482466 485698 489690 493662 497613
62599D97613M715N870O513O762P735J0010J2773J4803J5879J6840J8503K0761
$$ 497613 502328 508198 514711 521473 529208 539218 551991 566794 582673 599513 618016 638777
62587F38777K2713K3489K2892K1362J9399J7145J4451J1199P405L127j484o033
$$ 638777 661490 684979 707871 729233 748632 765777 780228 791427 798832 801959 800475 794442
62575G94442r981j3113j5742j8254k0498k1910k2293k2143k1893k1163j9320j6758
$$ 794442 784461 771348 755606 737352 716854 694944 672651 650508 628615 607452 588132 571374
62563E71374j4849j4321j4228j3182j1222r650r121q833p772o024m385l281k652
$$ 571374 556525 542204 527976 514794 503572 493922 484801 475968 468196 462172 457787 454506 451854
62550D51854k480k767l117k963k223j379q62p15q05r66q97k86Q29K105L289M272
$$ 451854 449374 446607 443490 440527 438304 436925 436063 435348 434543 433577 432680 432394 433223 435328 438617 442889
62534D42889M781M499L649L042L191L666L711L272L032L514M560N750O942Q278
$$ 442889 447670 452169 455818 458860 462051 465717 469428 472700 475732 479246 483806 489556 496498 504776
62520E04776R924J1961J4331J6797J9091K1184K3287K5562K7980L0574L3548L6965
$$ 504776 514700 526661 540992 557789 576880 598064 621351 646913 674893 705467 739015 775980
62508G75980M0439M3321M5045M5230M3748M0921L7314L2960K7081J9090R733O03
$$ 775980 816419 859740 904785 950015 993763 1034684 1071998 1104958 1132039 1151129 1160862 1161465
62496A161465p423j4603k1174k6618l0461l2998l4605l4908l3468l0884k8297
$$ 1161465 1154042 1139439 1118265 1091647 1061186 1028188 993583 958675 925207 894323 866026
62485H66026k5950k3147j9632j6143j3320j0855q128n104k175M37K612L975M089
$$ 866026 840076 816929 797297 781154 767834 756979 748851 743747 741572 742009 744621 748596 752685
62472G52685K919Q80j422l401m783n948p630j0114j2957j5664j8112k0054k0856
$$ 752685 755604 756484 755062 751661 746878 740930 733300 723186 710229 694565 676453 656399 635543
62459F35543k0309j9271j8788j8842j8637j7851j6838j5675j3935j1564r252p581
$$ 635543 615234 595963 577175 558333 539696 521845 505007 489332 475397 463833 454581 447000
62447D47000o337n059l771k786k150j668j265r79p06l12J24M26N86P87J179J724
$$ 447000 440663 435604 431833 429047 426897 425229 423964 422985 422279 421967 422091 422517 423103 423890 425069 426793
62431D26793K090J798P13n81j204r02k52J25J27j37p21j566k255k472k403k275
$$ 426793 428883 430681 431394 430813 429609 428707 428455 428580 428707 428570 427849 426283 424028 421556 419153 416878
62415D16878j868r86j10P8l73q28j058j396j814j683o79O10J373J436J118P10
$$ 416878 415010 414024 413914 413992 413619 412791 411733 410337 408523 406840 406161 406771 408144 409580 410698 411408
62399D11408M43O07J209J803K112K537L594M967N753N588N038M763M746M559M017
$$ 411408 411851 412458 413667 415470 417582 420119 423713 428680 434433 440021 445059 449822 454568 459127 463144
62384D63144L373L006L104L492L751L636L375L324L453L525L788M916O965Q915
$$ 463144 466517 469523 472627 476119 479870 483506 486881 490205 493658 497183 500971 505887 512852 521767
62370E21767R801R921J0331J1285J2016J2140J2490J3956J6140J7864J8874K0223
$$ 521767 531568 541489 551820 563105 575121 587261 599751 613707 629847 647711 666585 686808
62358F86808K2911K6794L1149L5725M0686M5850N0629N4677N8006O0377O1037
$$ 686808 709719 736513 767662 803387 844073 889923 940552 995229 1053235 1113612 1174649
62347A174649N9312N5200M9170M1600L2762K3108J3329M095m158j1297j7515k3222
$$ 1174649 1233961 1289161 1338331 1379931 1412693 1435801 1449130 1453225 1449067 1437770 1420255 1397033
62335A397033k8753l4262l9780m5084m9364n1525n1190m9160m6531m3592m0053
$$ 1397033 1368280 1334018 1294238 1249154 1199790 1148265 1097075 1047915 1001384 957792 917739
62324I17739l6091l2457k9565k7111k4767k2656k0947j9507j8237j7313j6740
$$ 917739 881648 849191 819626 792515 767748 745092 724145 704638 686401 669088 652348
62313F52348j6095j5046j3830j2833j1992j0950r569p971o373n137m656m778m689
$$ 652348 636253 621207 607377 594544 582552 571602 562033 554062 547689 542552 537896 533118 528429
62300E28429l860k838k528k913l137k739k174k040k332k588k333j316L16J999
$$ 528429 524569 521731 519203 516290 513153 510414 508240 506200 503868 501280 498947 497631 497947 499946
62286D99946L287M374N615O659O727N865N160N415O096O103N096L639K382J497
$$ 499946 503233 507607 513222 519881 526608 532473 537633 543048 549144 555247 560343 563982 566364 567861
62272E67861P88K8p40j088n70P18K237L725N369P211Q978J0805J3459J7323K1669
$$ 567861 568649 568677 567937 566849 566279 566997 569234 572959 578328 585539 594517 605322 618781 636104 657773
62257F57773K5617K9389L3862L9211M4737M9960N5008N9738O3269O4702O3883
$$ 657773 683390 712779 746641 785852 830589 880549 935557 995295 1058564 1123266 1187149
62246A187149O1038N6086M8711L9072K8111J7091O872k379j0809j8379k5003l1040
$$ 1187149 1248187 1304273 1352984 1392056 1420167 1437258 1444130 1441751 1430942 1412563 1387560 1356520
62234A356520l7146m3362m8835n2789n5275n6486n5857n2782m7929m2889l8488
$$ 1356520 1319374 1276012 1227177 1174388 1119113 1062627 1006770 953988 906059 863170 824682
62223H24682l4349l0175k6456k3540k0953j8223j5666j3785j2440j1265j0355
$$ 824682 790333 760158 733702 710162 689209 670986 655320 641535 629095 617830 607475
62212F07475r887r500q819q192q168q488q404p786p092o402n286l719k229j065
$$ 607475 597588 588088 579269 571077 562909 554421 546017 538231 531139 524737 519451 515732 513503 512438
62198E12438L3R75J203P34N29J246K317K976L540M851O792Q365R103R603J0517
$$ 512438 512471 513446 514649 515383 515912 517158 519475 522451 525991 530842 537634 545999 555102 564705 575222
62183E75222J1730J2754J3325J3386J2940J2183J1378J0354Q599O058L520J837
$$ 575222 586952 599706 613031 626417 639357 651540 662918 673272 681871 687929 691449 693286
62171F93286J110R30J160K089M029P123J1331J6291K1356K6111L0699L5331L9640
$$ 693286 694396 695326 696486 698575 702604 709727 721058 737349 758705 784816 815515 850846 890486
62158H90486M2942M4928M5567M4435M0837L4721K7010J8798J0746L318k951p918
$$ 890486 933428 978356 1023923 1068358 1109195 1143916 1170926 1189724 1200470 1203788 1200837 1192919
62146A192919j2177j6526k1209k5934l0390l4365l7541l9412l9436l7210l2875
$$ 1192919 1180742 1164216 1143007 1117073 1086683 1052318 1014777 975365 935929 898719 865844
62135H65844k7498k2590j8792j5310j1065o125j472K395N975R868J4002J7936
$$ 865844 838346 815756 796964 781654 770589 764464 762992 765387 771362 781230 795232 813168
62123H13168K1455K4575K7306K9667L1783L3734L5297L5850L4506L0635K4570
$$ 813168 834623 859198 886504 916171 947954 981688 1016985 1052835 1087341 1117976 1142546
62112A142546J7741J1733P187L770J060r99k468l745n345p518j0075j2297j3091
$$ 1142546 1160287 1172020 1179207 1182977 1184037 1183038 1180570 1176825 1171480 1163962 1153887 1141590 1128499
62099A128499j1747q580m434L81O118J2483J8256K2353K4811K6409K7729K8944
$$ 1128499 1116752 1108172 1103738 1104119 1110237 1122720 1140976 1163329 1188140 1214549 1242278 1271222
62087A271222L0012L0722L0893L0830L1196L2249L3696L5567L8518M2695M7038
$$ 1271222 1301234 1331956 1362849 1393679 1424875 1457124 1490820 1526387 1564905 1607600 1654638
62076A654638N0451N3125N5807N8222N9334N8800N7037N3870M8444M0759L2206
$$ 1654638 1705089 1758214 1814021 1872243 1931577 1990377 2047414 2101284 2149728 2190487 2222693
62065B222693K4025J6195Q379J187m227p281p993o417k768K189P542J2825J7753
$$ 2222693 2246718 2262913 2271292 2272479 2268252 2260971 2252978 2246561 2243793 2245982 2253524 2266349 2284102
62052B284102K1755K4444K6304K8188L0058L0797K9211K4829J7660P920l797j6456
$$ 2284102 2305857 2330301 2356605 2384793 2414851 2445648 2474859 2499688 2517348 2525268 2521471 2505015
62040B505015k9021m0855n1672o1381p0057p7782q4385q9422r2535r3707r3217
$$ 2505015 2475994 2435139 2383467 2322086 2252029 2174247 2089862 2000440 1907905 1814198 1720981
62029A720981r1445q8616q4630p9309p2968o6580o1001n6231n1766m7476m3656
$$ 1720981 1629536 1540920 1456290 1376981 1304013 1237433 1176432 1120201 1068435 1020959 977303
62018I77303m0339l7152l3966l1186k9135k7563k5931k3970k1695j9222j6719
$$ 977303 936964 899812 865846 834660 805525 777962 752031 728061 706366 687144 670425
62007F70425j4277j1737q894n960l439j413O61L188N848P919Q933Q747P455N481
$$ 670425 656148 644411 635517 629557 626118 624705 625366 628554 634402 642321 651254 660001 667456 672937
61993F72937L479J709j94k572n168p500r420j0939j1924j2416j2879j3594j4092
$$ 672937 676416 678125 677931 675359 670191 662691 653271 642332 630408 617992 605113 591519 577427
61980E77427j3841j3150j2737j2559j1866j0342q483o856n668n000m733m219k926
$$ 577427 563586 550436 537699 525140 513274 502932 494449 487593 481925 476925 472192 467973 465047
61967D65047j497j189k034k500j517J00R54Q99P69R50J212J549K136K657K616
$$ 465047 463550 462361 460327 457827 456310 456410 457364 458263 459032 459982 461194 462743 464879 467536 470152
61952D70152K308K551L457M269M617N120O456Q428J0366J2045J3794J5924J8335
$$ 470152 472460 475011 478468 482737 487354 492474 498930 507358 517724 529769 543563 559487 577822
61939E77822K0596K2389K3972K6042K8846L1555L2967L2813L1884L0931K9938
$$ 577822 598418 620807 644779 670821 699667 731222 764189 797002 828886 859817 889755
61928H89755K8593K6830K4679K2079J9143J6164J3069R299M609l56m674q049j0799
$$ 889755 918348 945178 969857 991936 1011079 1027243 1040312 1049611 1054220 1053864 1049190 1041141 1030342
61915A030342j3178j5068j6107j5804j3770j0226o036j913K272O991J2199J7341
$$ 1030342 1017164 1002096 985989 970185 956415 946189 940153 938240 940512 947503 959702 977043
61903I77043K1978K5816K8237K8523K6596K3032J8212J2077M910k343q947j5051
$$ 977043 999021 1024837 1053074 1081597 1108193 1131225 1149437 1161514 1166424 1164081 1155134 1140083
61891A140083k0938k6043k9462l1286l2604l3954l4512l3236l0357k7167k4604
$$ 1140083 1119145 1093102 1063640 1032354 999750 965796 931284 898048 867691 840524 815920
61880H15920k2650k0998j9652j8668j7837j6943j6039j5209j4317j3241j2023
$$ 815920 793270 772272 752620 733952 716115 699172 683133 667924 653607 640366 628343
61869F28343j0510q254n250k420p87k29K76J246K279L125M358O480R083J1462
$$ 628343 617833 609579 604329 601909 601122 600893 601169 602415 604694 607819 612177 618657 627740 639202
61855F39202J3645J6200J9249K2460K5858K9978L4983M0178M4643M8093N0805
$$ 639202 652847 669047 688296 710756 736614 766592 801575 841753 886396 934489 985294
61844I85294N2960N4260N4171N2397M9125M4795L9619L3365K5689J6642O801k955
$$ 985294 1038254 1092514 1146685 1199082 1248207 1293002 1332621 1365986 1391675 1408317 1415118 1412163
61832A412163j1721j8712k3415k5544k4907k1529j6024r488k705M341J1800J9060
$$ 1412163 1400442 1381730 1358315 1332771 1307864 1286335 1270311 1260823 1258118 1262459 1274259 1293319
61820A293319K5014K9100L1441L1906K9672K4124J5758N785m936j6153k7537l8100
$$ 1293319 1318333 1347433 1378874 1410780 1440452 1464576 1480334 1486119 1481183 1465030 1437493 1399393
61808A399393m6523n2007n4851n6108n6506n5776n3282m9294m5090m1622l8584
$$ 1399393 1352870 1300863 1246012 1189904 1133398 1077622 1024340 975046 929956 888334 849750
61797H49750l5187l1478k8214k5624k3051k0017j7082j5201j4475j3967j2716
$$ 849750 814563 783085 754871 729247 706196 686179 669097 653896 639421 625454 612738
61786F12738j0623q338o561n556n169n109n130n104n088n255n722o394p068p632
$$ 612738 602115 593777 587216 581660 576491 571382 566252 561148 556060 550805 545083 538689 531621 523989
61772E23989q029q089p589o618n646n061m843m818m957n193n094m237k876j787
$$ 523989 515960 507871 500282 493664 488018 482957 478114 473296 468339 463146 458052 453815 450939 449152
61758D49152j328j035l86M13P94O84O30J072J867K552K821K683K296J816J274
$$ 449152 447824 446789 446403 446816 447610 448294 448924 449996 451863 454415 457236 459919 462215 464031 465305
61743D65305O43P2n0N36J529K218K187J783J802K785M566O475P832Q409Q449Q391
$$ 465305 465948 466020 465970 466506 468035 470253 472440 474223 476025 478810 483376 489851 497683 506092 514541 522932
61727E22932Q597R321J0605J2068J3021J3134J2814J2632J2472J1743J0424R286
$$ 522932 531529 540850 551455 563523 576544 589678 602492 615124 627596 639339 649763 659049
61715F59049Q903Q922Q650Q011P403O848N747L461j11m436q583j1678j3458j4283
$$ 659049 667952 676874 685524 693535 700938 707786 713533 716994 716883 712447 703864 692186 678728 664445
61701F64445j4491j3950j2549j0783r298q092o724n256m256l864l541k930k260
$$ 664445 649954 636004 623455 612672 603374 595282 588558 583302 579046 575182 571641 568711 566451
61688E66451j602n03J042J983J435O0o72m00r0k89k80N40J442J380O40M17R19
$$ 566451 564849 564346 565388 567371 568806 568866 568194 567794 567704 567415 567135 567675 569117 570497 571137 571554 572473
61671E72473J006p0j518k177k179k569l638m565m719m467m390m382m041l452l010
$$ 572473 573479 573409 571891 569714 567535 564966 561328 556763 552044 547577 543187 538805 534764 531312 528302
61656E28302k693k160j419r05p78o87l02K26N22M63L22M97J079J654J678J315
$$ 528302 525609 523449 522030 521125 520347 519660 519358 519584 520106 520569 520891 521388 522467 524121 525799 527114
61640E27114J500K724M056M083K713J272O61K93p44k274l449m030m450m920n256
$$ 527114 528614 531338 535394 539477 542190 543462 544123 544416 543672 541398 537949 533919 529469 524549 519293
61625E19293n504n973o517o423n273l488j791l90R79K424L690M527N045N420N448
$$ 519293 513789 507816 501299 494876 489603 486115 484324 483934 484913 487337 491027 495554 500599 506019 511467
61610E11467M598K695L16j757l317m672n902o741p161p490p736p385o235m911
$$ 511467 516065 518760 519076 517319 514002 509330 503428 496687 489526 482036 474300 466915 460680 455769
61596D55769m004l210j963n23L60O74J211K343L550M308M695M842M458L410K241
$$ 455769 451765 448555 446592 446069 446429 447103 448314 450657 454207 458515 463210 468052 472510 475920 478161
61581D78161J569J254P15j91j091j797k447l003l132k834k751l442m566n278n321
$$ 478161 479730 480984 481699 481508 480417 478620 476173 473170 470038 467204 464453 461011 456445 451167 445846
61566D45846n305n777o481o827o727o519o287n842n251m839m569m041l213k536
$$ 445846 440541 434764 428283 421456 414729 408210 401923 396081 390830 385991 381422 377381 374168 371632
61552C71632k118j489n95l32j334k850l621l485l253l298l303l233l404l446k385
$$ 371632 369514 368025 367430 367098 365764 362914 359293 355808 352555 349257 345954 342721 339317 335871 333486
61537C33486j99J663K022J468J433K337L424L949L689K622R60n67j230j274j668
$$ 333486 333287 334950 336972 338440 339873 342210 345634 349583 353272 355894 356854 356287 355057 353783 352115
61522C52115k793l922m238l814l201k556j676p22k55m64q16p32l43k43o50j212
$$ 352115 349322 345400 341162 337348 334147 331591 329915 329193 328938 328474 327658 326926 326583 326340 325690 324478
61506C24478j643k085k615k831k359j584j311j689j980j607r47p64j146j462j252
$$ 324478 322835 320750 318135 315304 312945 311361 310050 308361 306381 304774 303827 303063 301917 300455 299203
61491B99203p99o63q83r26l92L98P23K66n04q68n08L96J471K313K509J982J246
$$ 299203 298404 297741 296858 295932 295540 295938 296661 296927 296423 295555 295047 295443 296914 299227 301736 303718 304964
61474C04964J013J474K126K358J971J191M67K04M38P72P88M95J73p0k30j49K40
$$ 304964 305977 307451 309577 311935 313906 315097 315564 315768 316206 316978 317766 318261 318434 318364 318134 317985 318225
61457C18225M98J56m34l78M93J307J308P43K66M2p7j1L47P32P96O00M14K85K15
$$ 318225 318723 318879 318445 318067 318560 319867 321175 321918 322184 322226 322149 322138 322485 323217 324013 324613 325027 325312 325527
61438C25527M68J250K315L292M185N113N783N770N211M649M317L935L248K264
$$ 325527 325995 327245 329560 332852 337037 342150 347933 353703 358914 363563 367880 371815 375063 377327
61424C77327J065k10j186j489j164m70N95K080L506M138L952L696L862M139M125
$$ 377327 378392 378182 376996 375507 374343 373873 374468 376548 380054 384192 388144 391840 395702 399841 403966
61409D03966L841L205J693p77l135m218m222m310m849m998m276l549l868m978
$$ 403966 407807 411012 412705 411928 408793 404575 400353 396043 391194 386196 381920 378371 374503 369525
61395C69525n682n366m398l297k305j754j961k550k573j722p97n29n58j50N96
$$ 369525 363843 358477 354079 350782 348477 346723 344762 342212 339639 337917 337120 336591 336033 335883 336479
61380C36479R72P99N12L12M5j32K16R17J130M87l55o39m33k33j11K11Q26J529
$$ 336479 337451 338250 338762 339074 339119 338987 339203 340120 341250 341737 341382 340743 340310 340077 339966 340177 341003 342532
61362C42532K141K568K767K788K720K513K203K223L035M288N009M913M891N766
$$ 342532 344673 347241 350008 352796 355516 358029 360232 362455 365490 369778 374787 379700 384591 390357
61348C90357P154Q151Q631R207J0160J1134J1788J2090J2091J1852J1533J1190
$$ 390357 397511 405662 414293 423500 433660 444794 456582 468672 480763 492615 504148 515338
61336E15338J0599R634Q604P810P018N810M199K479P13j106k654l694m609n842
$$ 515338 525937 535571 544175 551985 559003 564813 569012 571491 572204 571098 568444 564750 560141 554299
61322E54299p024p405p013o587o398n977n153m445m153l864l257k700k557k511
$$ 554299 547275 539870 532857 526270 519872 513895 508742 504297 500144 496280 493023 490323 487766 485255
61308D85255k054j301o92k99J65Q14J578K503L657M835N727O296O652O558N481
$$ 485255 483201 481900 481208 480909 481074 481888 483466 485969 489626 494461 500188 506484 513136 519694 525175
61293E25175L255M96j767k942l319l686m471n329n635n229m498l802l154k457
$$ 525175 528430 528926 527159 524217 520898 517212 512741 507412 501777 496548 492050 488248 485094 482637
61279D82637j804j343j080q57m33M10J684L068M137M744N071N336N639N980O296
$$ 482637 480833 479490 478410 477553 477120 477530 479214 482282 486419 491163 496234 501570 507209 513189 519485
61264E19485O415O231N868N544N315N178N313N998P283Q956J0778J2586J4275
$$ 519485 525900 532131 537999 543543 548858 554036 559349 565347 572630 581586 592364 604950 619225
61251F19225J5828J7132J7720J6982J4962J2512J0253P805M608J025k132m857
$$ 619225 635053 652185 669905 686887 701849 714361 724614 732419 737027 738052 735920 731063
61239G31063p752j0681j2714j3548j3950j4416j4358j3214j1491j0099r225q538
$$ 731063 723311 712630 699916 686368 672418 658002 643644 630430 618939 608840 599615 591077
61227E91077p935p356o372m712k921j736j013L6J659L286M368M865M911M542L971
$$ 591077 583142 575786 569414 564702 561781 560045 559032 559068 560727 564013 568381 573246 578157 582699 586670
61212E86670L637L759M095M251M042L522K905K443K168J816J233P97J106K258
$$ 586670 590307 594066 598161 602412 606454 609976 612881 615324 617492 619308 620541 621338 622444 624702
61198F24702L774N231O652Q280J0298J2899J6251K0104K3683K6303K8122K9965
$$ 624702 628476 633707 640359 648639 658937 671836 688087 708191 731874 758177 786299 816264
61186H16264L2271L4334L4819L3093K9909K6698K4335K2686K1262J9910J8820
$$ 816264 848535 882869 917688 950781 980690 1007388 1031723 1054409 1075671 1095581 1114401
61175A114401J8044J7311J6182J4296J1490P911M001K87k923n707q405j1326j4502
$$ 1114401 1132445 1149756 1165938 1180234 1191724 1199635 1203636 1203923 1201000 1195293 1186888 1175562 1161060
61162A161060j7652k0418k2638k4461k6245k8292l0475l2150l2651l1914l0461
$$ 1161060 1143408 1122990 1100352 1075891 1049646 1021354 990879 958729 926078 894164 863703
61151H63703k8722k6682k4282k1715j9068j6130j2883r857p490n550l753k569
$$ 863703 834981 808299 784017 762302 743234 727104 714221 704364 696874 691324 687571 685002
61139F85002k687l822m922n523o077o779o913n735l440q55J401L161M565O017
$$ 685002 682315 678493 673571 668048 661971 655192 648279 642544 639104 638249 639650 642811 647376 653393
61125F53393P949J0382J2975J5590J8433K1549K4623K7489L0352L3366L6431L9558
$$ 653393 661342 671724 684699 700289 718722 740271 764894 792383 822735 856101 892532 932090
61113I32090M2903M6180M8658M9989N0646N1201N1596N1363N0200M8035M5056
$$ 932090 974993 1021173 1069831 1119820 1170466 1221667 1273263 1324626 1374826 1422861 1467917
61102A467917M1847L9010L6318L2783K7878K2162J6411J0659M540k052r066j6436
$$ 1467917 1509764 1548774 1585092 1617875 1645753 1667915 1684326 1694985 1699525 1697473 1688407 1671971
61090A671971k3616k9541l3736l6988m0317m3668m6254m7783m8582m8788m8208
$$ 1671971 1648355 1618814 1585078 1548090 1507773 1464105 1417851 1370068 1321486 1272698 1224490
61079A224490m6909m5340m3752m1926l9513l6393l2810k9326k6406k3880k1128
$$ 1224490 1177581 1132241 1088489 1046563 1007050 970657 937847 908521 882115 858235 837107
61068H37107j7974j4999j2733j1058r619q335p120n673l916k156m63J484L549
$$ 837107 819133 804134 791401 780343 770724 762389 755269 749596 745680 743524 743061 744545 748094
61055G48094M937N388N877P380R660J1898J3832J5572J6972J8109J9683K2040
$$ 748094 753031 758419 764296 771676 781336 793234 807066 822638 839610 857719 877402 899442
61043H99442K4402K6093K7825L0768L4791L8770M2197M5267M7835M9516N0687
$$ 899442 923844 949937 977762 1008530 1043321 1082091 1124288 1169555 1217390 1266906 1317593
61032A317593N2255N4486N7013N9607O2049O3555O3430O2035O0231N8415N7105
$$ 1317593 1369848 1424334 1481347 1540954 1603003 1666558 1729988 1792023 1852254 1910669 1967774
61021A967774N7668O1049O6363P2238P8904Q7316R6927J06369J16114J28507J45560
$$ 1967774 2025442 2086491 2152854 2225092 2303996 2391312 2488239 2594608 2710722 2839229 2984789
61010B984789J68720K00312K42742K96338L60545M37352N31415O47585P91416
$$ 2984789 3153509 3353821 3596563 3892901 4253446 4690798 5222213 5869798 6661214
61001F661214R70624J190245J444923J718882J988200K207193K287597K116537
$$ 6661214 7631838 8822083 10267006 11985888 13974088 16181281 18468878 20585415
60993B0585415J636021R25829J95728l29445n35356m48650j74524J65954M41675
$$ 20585415 22221436 23147265 23342993 23013548 22478192 22029542 21855018 22020972 22462647
60984B2462647N05047K42002l39513j078662j742914k160032k290330k198283
$$ 22462647 22967694 23209696 22870183 21791521 20048607 17888575 15598245 13399962
60976A3399962j978696j707919j435258j188584r78057q02120o56627n38764m44418
$$ 13399962 11421266 9713347 8278089 7089505 6111448 5309328 4652701 4113937 3669519
60967C669519l67499l03908k53126k14637j85477j62512j44439j30116j17321
$$ 3669519 3302020 2998112 2744986 2530349 2344872 2182360 2037921 1907805 1790484
60958A790484j04803r3601q4574p6311o7126n7649m9677m3550l8444l4380l2107
$$ 1790484 1685681 1592080 1507506 1431195 1364069 1306420 1256743 1213193 1174749 1140369 1108262
60947A108262l1363l0789k9546k7859k6065k4113k1987j9912j8051j6519j5517
$$ 1108262 1076899 1046110 1016564 988705 962640 938527 916540 896628 878577 862058 846541
60936H46541j5095j4962j4930j5167j5690j5992j5553j4418j2939j1447j0439
$$ 846541 831446 816484 801554 786387 770697 754705 739152 724734 711795 700348 689909
60925F89909j0444j1220j1630j0848r302q033p498p462p515p211o161m552l226
$$ 689909 679465 668245 656615 645767 636465 628432 620934 613472 605957 598746 592585 588033 584807
60912E84807k790k970l110k841k043q02K03M5j168k143k126j924k448l074k674
$$ 584807 582017 579047 575937 573096 571053 570251 570454 570499 569331 567188 565062 563138 560690 557616 554942
60897E54942j570j097j571k080k242k718l798m742n026n183n760o284o035n265
$$ 554942 553372 552275 550704 548624 546382 543664 539866 535124 530098 524915 519155 512871 506836 501571
60883E01571m947n483o241o329n492m326l668l799m162m058l444k815k444k150
$$ 501571 496624 491141 484900 478571 473079 468753 465085 461286 457124 453066 449622 446807 444363 442213
60869D42213j748j299q48l44J50N17Q33J264J722K114K711L722M593M482L490
$$ 442213 440465 439166 438318 437974 438124 438641 439474 440738 442460 444574 447285 451007 455600 460082 463572
60854D63572K605K264J870J122Q69J843L298L841L227K373J794J076q4j224j825
$$ 463572 466177 468441 470311 471433 472302 474145 477443 481284 484511 486884 488678 489754 489670 488446 486621
60839D86621k068k420k994l636m363n262o140o585o362n687n094n056n544n975
$$ 486621 484553 482133 479139 475503 471140 465878 459738 453153 446791 441104 436010 430954 425410 419435
60825D19435n760m925l997l320k774k213j772j529j229o44lK13j08o47j065j282
$$ 419435 413675 408750 404753 401433 398659 396446 394674 393145 391916 391272 391269 391482 391374 390727 389662 388380
60809C88380j314j092n03M39J444K023J927J593J807K758L693L836L411L269L665
$$ 388380 387066 385974 385471 385910 387354 389377 391304 392897 394704 397462 401155 404991 408402 411671 415336
60794D15336L974L675L048K678K674K703K481J983J307N98j4m93q48r58p41m58
$$ 415336 419310 422985 426033 428711 431385 434088 436569 438552 439859 440457 440443 439950 439102 438144 437403 436945
60778D36945m86o81n01M5P5j025k621l554l545l242l045k679j971j310j132j327
$$ 436945 436459 435778 435277 435322 435397 434372 431751 428197 424652 421410 418365 415686 413715 412405 411273 409946
60762D09946j500j428j124q26r98j968l337m093l572k108o04K06R5n75q86mJ837
$$ 409946 408446 407018 405894 405068 404070 402102 398765 394672 391100 388992 388388 388594 388689 388114 387228 387224 389061
60745C89061L346L570K910K395K308K101J402M67l13q29j052r77q08q67j093j032
$$ 389061 392407 395977 398887 401282 403590 405691 407093 407560 407247 406418 405366 404389 403581 402714 401621 400589
60729D00589m06M86J121J267J107J003J207J622J852J696J569K052K962L304K427
$$ 400589 400183 400669 401790 403057 404164 405167 406374 407996 409848 411544 413113 415165 418127 421431 423858
60714D23858R43R1L46R55R47K50l69l18O0j08j184k512l071k519j510r66j169
$$ 423858 424801 424892 425238 426193 427140 427390 427021 426703 426763 426655 425471 422959 419888 417369 415859 414893 413724
60697D13724j591j531r31m93q94j883k446k032j321j364k196k845k695k191k002
$$ 413724 412133 410602 409671 409178 408284 406401 403955 401923 400602 399238 397042 394197 391502 389311 387309
60682C87309k015j646p56K19R03J258J387J426J672K348L172L457K782J473L32
$$ 387309 385294 383648 382892 383111 384014 385272 386659 388085 389757 392105 395277 398734 401516 402989 403321
60667D03321m1L71J086J646J998K388K836L024K806K486K298J932J069J48m7N35
$$ 403321 403280 403651 404737 406383 408381 410769 413605 416629 419435 421921 424219 426151 427220 427368 427321 427856
60651D27856J203J614K177L112L819L625K663J571O60j03o98j071j359j677j892
$$ 427856 429059 430673 432850 435962 439781 443406 446069 447640 448300 448197 447499 446428 445069 443392 441500
60636D41500j931j998k079j750r77n83j149j850j389Q6J104J002P12J122J729
$$ 441500 439569 437571 435492 433742 432765 432182 431033 429183 427794 427880 428984 429986 430698 431820 433549
60621D33549J646J119J138K021L149L854L894L322K461J854J756J751J332O18
$$ 433549 435195 436314 437452 439473 442622 446476 450370 453692 456153 458007 459763 461514 462846 463464
60607D63464J44J32M43R19J316J238O66K50M30O25J01o82o39K04O84L91L97J552
$$ 463464 463608 463740 464183 465102 466418 467656 468322 468572 469002 469627 469728 469046 468407 468611 469295 469686 470083 471635
60589D71635L109L743L227K265J388P37M86N69L82m38j255j263p73o98j013q22
$$ 471635 474744 478487 481714 483979 485367 486104 486590 487159 487541 487103 485848 484585 483812 483114 482101 481279
60573D81279j5M19Ml96RO62P05M62Q71J909K663K784K854L248L567L452L130K867
$$ 481279 481264 481683 481687 481291 481300 481962 482667 483129 484000 485909 488572 491356 494210 497458 501025 504477 507607 510474
60555E10474K513J951J393Q55J9r83j194J2J867K975K911K424K245K459K910L491
$$ 510474 512987 514938 516331 517186 517205 516222 515028 515040 516907 519882 522793 525217 527462 529921 532831 536322
60539E36322L852L601K927K463K300J785N62p17j201q34j81L54P07R57J361K295
$$ 536322 540174 543775 546702 549165 551465 553250 553812 553095 551894 551060 550879 551233 551940 552897 554258 556553
60523E56553L641M563M421L715L527M201N120N745O226O879P593Q027Q100Q019
$$ 556553 560194 564757 569178 572893 576420 580621 585741 591486 597712 604591 612184 620211 628311 636330
60509F36330Q015Q126Q112P668O825O071N823N945O045O154O661P657Q802R930
$$ 636330 644345 652471 660583 668251 675076 681147 686970 692915 698960 705114 711775 719432 728234 738164
60495G38164J1322J3222J5409J7422J8938J9722J9426J7751J4719J0785O673K991
$$ 738164 749486 762708 778117 795539 814477 834199 853625 871376 886095 896880 903553 906544
60483I06544j70l240o425r112j0369j0154r554r639j0326j0638r875q335p008
$$ 906544 906374 903134 896709 887597 877228 867074 857520 847881 837555 826917 817042 808707 801699
60470H01699o681p354q400r283r933j0408j0572j0462j0618j1418j2184j1756
$$ 801699 795018 787664 779264 769981 760048 749640 739068 728606 717988 706570 694386 682630
60458F82630j0053q407p977q482q898q892q931r272r571r484r152q928q862q650
$$ 682630 672577 664170 656193 647711 638813 629921 620990 611718 602147 592663 583511 574583 565721 557071
60444E57071p979o938o058n822o156o546o664o602o478o223n925n967o495p039
$$ 557071 549092 542154 536096 530274 524118 517572 510908 504306 497828 491605 485680 479713 473218 466179
60430D66179p013o385n553m780m080l507l144k880k533k165k037k215k446k411
$$ 466179 459166 452781 447228 442448 438368 434861 431717 428837 426304 424139 422102 419887 417441 415030
60416D15030j987j282n71j21n1l37r58j798k435k333j460m12K11L16J00l34q54
$$ 415030 413043 411761 411190 411069 411018 410681 409723 407925 405490 403157 401697 401285 401496 401812 401912 401578 400724
60399D00724j068o68J34P76Q74M44k19o59m83K28R14J126R56P22M80J03m11r58
$$ 400724 399656 398988 399122 399898 400772 401216 400997 400338 399855 400083 400997 402123 403079 403801 404281 404384 403973 403015
60381D03015j383j346n83M84Q65K68l56j26M52K65o49j198q95m13k97k84j44l09
$$ 403015 401632 400286 399703 400187 401052 401320 400964 400838 401290 401555 400906 399708 398813 398400 398103 397819 397675 397366
60363C97366j015j636j541j013o51l49L33J064R55j29j213j349o17K58Q08J020
$$ 397366 396351 394715 393174 392161 391510 391161 391494 392558 393513 393384 392171 390822 390205 390463 391271 392291
60347C92291R95Q45Q00J057J484J741J719J576J355R27M80O92J923L469M209L941
$$ 392291 393286 394131 394931 395988 397472 399213 400932 402508 403863 404790 405270 405962 407885 411354 415563 419504
60331D19504L559L760M204M220L770L260K812K210J403M91n48j757k937l888m615
$$ 419504 423063 426823 431027 435247 439017 442277 445089 447299 448702 449193 448645 446888 443951 440063 435448
60316D35448m926m252k438m43N39M57K48M88J038J828L080M527N479N938O807
$$ 435448 430522 426270 423832 423389 423928 424385 424633 425121 426159 427987 431067 435594 441073 447011 453818
60301D53818Q592J0591J1861J2200J1692J0060P222L849N79k830o765j0549j2844
$$ 453818 462410 473001 484862 497062 508754 518814 526036 529885 530464 527634 520869 510320 497476
60288D97476j3131j2027j0249q091n891m246l416l049k697k244j743j179n93j36
$$ 497476 484345 472318 462069 453978 448087 443841 440425 437376 434679 432435 430692 429513 428920 428784
60274D28784J09J34j41p17j246j310j027r87j469k053k109j465m57L86O62L58
$$ 428784 428893 429027 428886 428169 426923 425613 424586 423599 422130 420077 417968 416503 416046 416432 417094 417452
60258D17452n9j8N64J268J773K196K772L469M075M495M751M857M756M256L091
$$ 417452 417393 417375 417939 419207 420980 423176 425948 429417 433492 437987 442738 447595 452351 456607 459698
60243D59698J273o40j960k653l318m240m903m708l825k931k376k016j666j216
$$ 459698 460971 460331 458371 455718 452400 448160 443257 438549 434724 431793 429417 427401 425735 424519
60229D24519m63O88J840K476K647K840L099K889K130J679K258L346L801L371K871
$$ 424519 424056 424744 426584 429060 431707 434547 437646 440535 442665 444344 446602 449948 453749 457120 459991
60214D59991K936L276L413L469L808M309M531M478M635N228N794N757N175M685
$$ 459991 462927 466203 469616 473085 476893 481202 485733 490211 494846 500074 505868 511625 516800 521485
60200E21485M709M958M885M474M283M578M815M276L052J921J303R24N35L93O36
$$ 521485 526194 531152 536037 540511 544794 549372 554187 558463 561515 563436 564739 565663 566198 566591 567227
60185E67227P57K36o27j123j241j648k608l478l586l121k912l516m676n578n522
$$ 567227 567984 568220 567593 566470 565229 563581 560973 557495 553909 550788 547876 544360 539684 534106 528584
60170E28584m568l557l267l548l507k551r42O65J824K349K217J770J664K260L194
$$ 528584 524016 520459 517192 513644 510137 507586 506644 507309 509133 511482 513699 515469 517133 519393 522587
60155E22587L818L896L608L067K277J492J181J490K018K306K357K518L052M019
$$ 522587 526405 530301 533909 536976 539253 540745 541926 543416 545434 547740 550097 552615 555667 559686
60141E59686N480P455R629J1390J2455J3318J4721J6702J8432J9044J8234J5993
$$ 559686 565166 572621 582250 593640 606095 619413 634134 650836 669268 688312 706546 722539
60129G22539J2275P351K097k634o720j0409j3348j4602j3759j1543r176p435o369
$$ 722539 734814 742165 744262 741628 734908 724499 711151 696549 682790 671247 662071 654636 648267
60116F48267n560m545l258k111j413q30J53J277J698J234O99P32Q73L36q42j908
$$ 648267 642707 638162 634904 632793 631380 630550 630703 631980 633678 634912 635611 636343 637216 637552 636710 634802
60100F34802k389k418k289k150k088k137k229k290k290k042j244J08J582K815
$$ 634802 632413 629995 627706 625556 623468 621331 619102 616812 614522 612480 611236 611344 612926 615741
60086F15741L843M806N703O661P895R065R280Q276P016O375N764L963J042j614
$$ 615741 619584 624390 630093 636754 644649 653714 662994 671270 678286 684661 690425 694388 695430 693816
60072F93816l233m479o073p585q166p829p322p098p018o895o793o794o813o672
$$ 693816 690583 686104 680031 672446 664280 656451 649129 642031 635013 628118 621325 614531 607718 601046
60058F01046o265n664n172n053n125m827l882k688j825j344p69K21J395K278K647
$$ 601046 594781 589117 583945 578892 573767 568940 565058 562370 560545 559201 558432 558653 560048 562326 564973
60043E64973K595K281J840J580J919K889L875M233M111M274N026N753N755N015
$$ 564973 567568 569849 571689 573269 575188 578077 581952 586185 590296 594570 599596 605349 611104 616119
60029F16119L872K382N16j349k747l817n108o803q611j0307j1854j3060j3609
$$ 616119 619991 622373 622889 621540 618793 614976 609868 603065 594454 584147 572293 559233 545624
60016E45624j3551j3192j2570j1555j0414r647r168q303o881n586m955m603l881
$$ 545624 532073 518881 506311 494756 484342 474695 465527 457224 450343 444757 439802 435199 431318
60003D31318k794j762q92m8O79J046J097J099J206J451J888K421K705K591K440
$$ 431318 428524 426762 425870 425822 426501 427547 428644 429743 430949 432400 434288 436709 439414 442005 444445
59988D44445K672L178L505L520L450L466L546L672L802L710L167K269J299M00
$$ 444445 447117 450295 453800 457320 460770 464236 467782 471454 475256 478966 482133 484402 485701 486101
59974D86101m04r95j314j557j895k141k046j782j646j392n11Q31J773J878J685
$$ 486101 485697 484702 483388 481831 479936 477795 475749 473967 472321 470929 470418 471249 473022 474900 476585
59959D76585J780J822R89q83l127m983o048o115n181l766k714k341k111j376k69
$$ 476585 478365 480187 481176 480293 477166 472183 466135 460020 454839 451073 448359 446018 443907 442531 442262
59944D42262M99N57K34o3l73r58j749k340k500k398k400k678l108l415l434l241
$$ 442262 442761 443318 443552 443489 443116 442158 440409 438069 435569 433171 430771 428093 424985 421570 418136 414895
59928D14895l013k763k333j727j242j096j111r78p10n48m69j87L43P69Q15O69
$$ 414895 411882 409119 406786 405059 403817 402721 401610 400632 399922 399374 398905 398718 399061 399830 400645 401314
59912D01314P35J166J743K081J946J514J250J380J594J640J926K961M188M276
$$ 401314 402049 403215 404958 407039 408985 410499 411749 413129 414723 416363 418289 421250 425438 429714
59898D29714K915J533J595K787L642L599L421L758M283M506M638N161O045O847
$$ 429714 432629 434162 435757 438544 442186 445785 449206 452964 457247 461753 466391 471552 477597 484444
59884D84444P280P328P046O620O491O961P795Q372Q370P967P431O670N361L440
$$ 484444 491724 499052 506098 512718 519209 526170 533965 542337 550707 558674 566105 572775 578136 581576
59870E81576J232r02k978n170p319q850r373r128q683q258p589o360m606k748
$$ 581576 582808 581906 578928 573758 566439 557589 548216 539088 530405 522147 514558 508198 503592 500844
59856E00844j333n75p0Q31K242L612M632N829P789J0054J1445J1342J0051P965
$$ 500844 499511 498936 498866 499697 501939 505551 510183 516012 523801 533855 545300 556642 566693 574658
59842E74658N184K163j06j017r93p05k08O33J243O35j412m022o030o816o365n000
$$ 574658 579842 582005 581899 580882 579889 579184 578976 579609 580852 581487 580075 576053 570023 563207 556842 551842
59826E51842l200j445q7N87L55p29k196l555m741n987p367q642r495r650q937
$$ 551842 548642 547197 547110 547697 548052 547323 545127 541572 536831 530844 523477 514835 505340 495690 486753
59811D86753p466n722m230l200k627k517k696k646j980r35r0L52N36M38m3o48
$$ 486753 479287 473565 469335 466135 463508 460991 458295 455649 453669 452734 452644 452996 453532 453970 453927 453279
59795D53279j028j469k571m107m991m703l973l610l403k769j864j231p99j60M49
$$ 453279 452251 450782 448211 444104 439113 434410 430437 426827 423424 420655 418791 417560 416761 416601 417050
59780D17050L42m37j035r23m24M2M89R23J082R88J151J803K450K595K452K465
$$ 417050 417392 416955 415920 414997 414573 414615 415104 416027 417109 418097 419248 421051 423501 426096 428548 431013
59764D31013K516K201J648J446J815K331K509K225J638J016O76P34R17Q51N04
$$ 431013 433529 435730 437378 438824 440639 442970 445479 447704 449342 450358 451034 451768 452685 453536 454040
59749D54040R5l29q36j233j207p94k96K95J188K026J977R34K0K81J262J666J095
$$ 454040 454135 453806 452970 451737 450530 449736 449440 449735 450923 452949 454926 455860 455880 456161 457423 459089 460184
59732D60184L64Q4j36p53j324j130k74M96Q43J086J446J697J691J669J814J917
$$ 460184 460548 460632 460496 459743 458419 457289 457015 457511 458354 459440 460886 462583 464274 465943 467757 469674
59716D69674J815J775K028K225J838R48J86p0j7J33M62R95J450J587J539J482
$$ 469674 471489 473264 475292 477517 479355 480303 480489 480419 480402 480535 480997 481992 483442 485029 486568 488050
59700D88050J282P66J55j94l07n53j097j663j865j492n86N34J266J115J59j024
$$ 488050 489332 490098 490253 490059 489752 489199 488102 486439 484574 483082 482496 483030 484296 485411 485570 484546
59684D84546j865k079j528l12R73J544J275Q82R31R92K39j332k807l438l336k978
$$ 484546 482681 480602 479074 478762 479735 481279 482554 483436 484367 485359 485598 484266 481459 478021 474685 471707
59668D71707k597k279k262k685l218l385l073k477j649n12P17J602K129K793L809
$$ 471707 469110 466831 464569 461884 458666 455281 452208 449731 448082 447570 448287 449889 452018 454811 458620
59653D58620M644M714M209L858M008M399M741M974M940M297K930J153o53k257
$$ 458620 463264 467978 472187 476045 480053 484452 489193 494167 499107 503404 506334 507487 506834 504577
59639E04577l390l738l405k964k784k606k065j266n17K12J095J932K323K232J943
$$ 504577 501187 497449 494044 491080 488296 485690 483625 482359 481842 482054 483149 485081 487404 489636 491579
59624D91579J632J416J672K646L764M009L161K026J175J28j728l900n147m856
$$ 491579 493211 494627 496299 498945 502709 506718 509879 511905 513080 513208 511480 507580 502433 497577
59610D97577l518j909l49J176K706M221N616O552O592N698M356L005J541l58k440
$$ 497577 494059 492150 491801 492977 495683 499904 505520 512072 518664 524362 528718 531723 533264 532906 530466
59595E30466l808l795k768j824j739k367l113l665m102m443m422l834k910k211
$$ 530466 526658 522863 520095 518271 516532 514165 511052 507387 503285 498842 494420 490586 487676 485465
59581D85465k159k691l310l489l080k414j997k070k415k523j985q58L08Q72O76
$$ 485465 483306 480615 477305 473816 470736 468322 466325 464255 461840 459317 457332 456474 456782 457654 458330
59566D58330J08l33m11o5P15J716K446K581K363K282K450K598K557K443K389K384
$$ 458330 458438 458105 457694 457629 458344 460060 462506 465087 467450 469732 472182 474780 477337 479780 482169 484553
59550D84553K382K271J858J198Q57J378K521L486L954M430N464P046Q922J1041
$$ 484553 486935 489206 491064 492262 493119 494497 497018 500504 504458 508888 514352 521398 530320 541361
59536E41361J3513J6546K0424K4793K7626K5878J8286P316k389p581q083n543
$$ 541361 554874 571420 591844 616637 644263 670141 688427 695743 693354 685773 677690 672147
59524F72147j580K762O804J0257J3136J5303J6222J5453J3202J0120O753L327
$$ 672147 670567 673329 680133 690390 703526 718829 735051 750504 763706 773826 780579 783906
59512G83906j03l508o864j0048j2798j4891j6332j7246j7647j7469j6822j6004
$$ 783906 783803 780295 773431 763383 750585 735694 719362 702116 684469 667000 650178 634174
59500F34174j5114j3851j1940r636p581o062m731l216j655l55P87J989K927L002
$$ 634174 619060 605209 593269 583633 576052 569990 565259 562043 560388 560033 560820 562809 565736 568738
59486E68738K301J714J901K694L700M922O416P941R387J1094J3197J5070J6070
$$ 568738 571039 572753 574654 577348 581048 585970 592386 600327 609714 620808 634005 649075 665145
59473F65145J6506J7084J7652J7235J5338J2472R265N833K329n51k078k155j050
$$ 665145 681651 698735 716387 733622 748960 761432 770697 776530 778859 778308 776230 774075 773025
59460G73025J190M590Q673J2541J5696J8586K2123K6630L1373L5246L7908M0094
$$ 773025 774215 778805 787478 800019 815715 834301 856424 883054 914427 949673 987581 1027675
59448A027675M2813M6424N0509N4068N5512N2869M4572L0236J0696j2122l4986
$$ 1027675 1070488 1116912 1167421 1221489 1277001 1329870 1374442 1404678 1415374 1403252 1368266
59437A368266n3776o5350o9304o7483o2003n4435m6450l9838l5258l1800k8351
$$ 1368266 1314490 1249140 1179836 1112353 1050350 995915 949465 909627 874369 842569 814218
59426H14218k4727k1083j7032j2165o915k128K036O105J0460J4970J9293K2975
$$ 814218 789491 768408 751376 739211 732296 730168 732204 738309 748769 763739 783032 806007
59414H06007K5494K6715K7230K7795K8553K9016K8332K5122J7684N514r305k2944
$$ 806007 831501 858216 885446 913241 941794 970810 999142 1024264 1041948 1047462 1038157 1015213
59402A015213l2302l6349l5549l1000k4269j6967r952l605P84P57n167j5328k5582
$$ 1015213 982911 946562 911013 880013 855744 838777 828825 825220 826004 826761 821594 806266 780684
59389G80684l2210l4003l1999k8035k3645j9670j6330j3558j1304r511p965o427
$$ 780684 748474 714471 682472 654437 630792 611122 594792 581234 569930 560419 552454 546027
59377E46027m927l767l104k662j993r97j37N1l70o69k28P21J360J266Q54Q31J513
$$ 546027 541100 537333 534229 531567 529574 528577 528440 528491 528121 527452 527224 527945 529305 530571 531425 532256 533769
59360E33769K772M362O066P678R048J0180J1219J2415J4053J6177J8436K0455
$$ 533769 536541 540903 546969 554647 563695 573875 585094 597509 611562 627739 646175 666630
59348F66630K2344K4479K6801K8825L0453L2068L3580L4036L2805L0579K8406
$$ 666630 688974 713453 740254 769079 799532 831600 865180 899216 932021 962600 991006
59337I91006K6139K2728J7781J1861N294k165j0179j7418k2910k7065l0715l3774
$$ 991006 1017145 1039873 1057654 1069515 1074809 1072644 1062465 1045047 1022137 995072 964357 930583
59325I30583l5642l6384l6592l6287l4848l2086k8673k5368k2376j9612j7123
$$ 930583 894941 858557 821965 785678 750830 718744 690071 664703 642327 622715 605592
59314F05592j4955j2968j0985r005p140n496m075k607o12K083M975P374R269J1302
$$ 605592 590637 577669 566684 557679 550539 545043 540968 538361 537749 539832 544807 552181 561450 572752
59300E72752J3906J6743J8935J9389J6981J1153K788n834j2380j5802j6396j5074
$$ 572752 586658 603401 622336 641725 658706 669859 672647 666813 654433 638631 622235 607161
59288F07161j2804j0390q210o229m382k856j790q88L32K035L963N803P460R023
$$ 607161 594357 583967 575757 569528 565146 562290 560500 559612 559944 561979 565942 571745 579205 588228
59274E88228J0583J2130J3635J5318J7629K0539K3010K3762K2736K1195K0081
$$ 588228 598811 610941 624576 639894 657523 678062 701072 724834 747570 768765 788846
59263G88846J8842J6474J3094R665O417K526k463p726j2051j5115j7416j9302
$$ 788846 807688 824162 837256 846921 853338 855864 853401 845675 833624 818509 801093 781791
59251G81791k0535k0712j9800j8162j6255j4278j2119r625o904m206j593J076
$$ 781791 761256 740544 720744 702582 686327 672049 659930 650305 643401 639195 637602 638678
59239F38678L776O225Q232R965J1686J3388J4845J5906J6496J6403J5340J3256
$$ 638678 642454 648679 656911 666876 678562 691950 706795 722701 739197 755600 770940 784196
59227G84196J0434P170L507n96m958r232j3168j6559j9003k0121k0198k0161k0555
$$ 784196 794630 801800 805307 804711 799753 790521 777353 760794 741791 721670 701472 681311 660756
59214F60756k0808j9959j7918j5537j3460j1590r734q163p178o622o179n784n421
$$ 660756 639948 619989 602071 586534 573074 561484 551750 543587 536409 529787 523608 517824 512403
59201E12403m870m031l196k645k226j778j557j741j802j071J75Q91O00N7K64J262
$$ 512403 507533 503502 500306 497661 495435 493657 492100 490359 488557 487486 487661 488552 489152 489209 489473 490735
59185D90735K148K138J418R20J327K294K888K780K666L249M246M924N260N999
$$ 490735 492883 495021 496439 497359 498686 500980 503868 506648 509314 512563 516809 521733 526993 532992
59171E32992P580R665J1706J3421J4611J5175J5535J6560J8588K0799K1878K1260
$$ 532992 540572 550237 561943 575364 589975 605150 620685 637245 655833 676632 698510 719770
59159G19770J9463J7302J5035J2284Q691M439M9m181q194j1735j4309j5800j6649
$$ 719770 739233 756535 771570 783854 792545 796984 797033 792852 784658 772923 758614 742814 726165
59146G26165j7166j7162j6584j5955j5568j4818j3079j0945r594r222q976q392
$$ 726165 708999 691837 675253 659298 643730 628912 615833 604888 595294 586072 577096 568704
59134E68704p827p440o811n903n343n344n213m446l506k928k343j116O26K279
$$ 568704 560877 553437 546626 540723 535380 530036 524823 520377 516871 513943 511600 510484 511110 513389
59120E13389L627M783N655O195O827P990R457J0701J1630J2409J2840J2647J2169
$$ 513389 517016 521799 527454 533649 540476 548466 557923 568624 580254 592663 605503 618150 630319
59107F30319J2062J2349J2460J2231J2083J2113J1727J0621R435Q912Q737P899
$$ 630319 642381 654730 667190 679421 691504 703617 715344 725965 735400 744312 753049 760948
59095G60948O088M105K712J600K7j875l043k824j791r44o07n35p34j490k755m174
$$ 760948 767036 771141 773853 775453 775480 773605 770562 767738 765947 765003 764396 763861 763127 761637 758882 754708
59079G54708n725p721j0096j2299j3991j5297j6189j6257j5397j4164j3087j2057
$$ 754708 748983 741262 731166 718867 704876 689579 673390 657133 641736 627572 614485 602428
59067F02428j0749r236p836o705n874n373m975m284l351k824l068l537l475k897
$$ 602428 591679 582443 574607 567902 562028 556655 551680 547396 544045 541221 538153 534616 531141 528244
59053E28244k447k468k663k572k063j499j498k269l151l231k547k104k459k916
$$ 528244 525797 523329 520666 518094 516031 514532 513034 510765 507614 504383 501836 499732 497273 494357
59039D94357k553j424k32O89J353J583J250Q18J067K270L992N469N990N436M750
$$ 494357 491804 490380 490148 490837 492190 493773 495023 495841 496908 499178 503170 508639 514629 520065 524815
59024E24815N289P221R173J0091J0654J2016J3849J4818J4632J4257J4204J3725
$$ 524815 530104 537325 546498 556589 567243 579259 593108 607926 622558 636815 651019 664744
59012F64744J1974R018N550K350J86n81m46j99J37J142K806M424N728P287R473
$$ 664744 676718 685736 691286 693636 693822 693241 692795 692596 692733 693875 696681 701105 706833 714120 723593
58997G23593J1851J3870J5419J6417J6561J5933J5175J4639J3909J2497J0505
$$ 723593 735444 749314 764733 781150 797711 813644 828819 843458 857367 869864 880369
58986H80369Q145N244J640k352o325j0232j3995j7044j8663j8617j7135j4640
$$ 880369 888514 893758 895398 893046 886721 876489 862494 845450 826787 808170 791035 776395
58974G76395j1800r376p605n868l452m93K189L969M975N784O849Q213R612J0887
$$ 776395 764595 755219 747614 741746 738294 737801 739990 743959 748934 754718 761567 769780 779392 790279
58960G90279J2089J3151J3635J3177J2020J0601Q745N824J725k936p543j1842
$$ 790279 802368 815519 829154 842331 854351 864952 873697 879521 881246 878310 870767 858925
58948H58925j5406j7548j8163j8017j7745j6990j5024j1783p903m018m09K847
$$ 858925 843519 825971 807808 789791 772046 755056 740032 728249 720346 716328 715919 718766
58936G18766N659P568P559M814o0n217r356j2720j5817j7967j8108j6614j5032
$$ 718766 724425 731993 739552 744366 744306 739089 729733 717013 701196 683229 665121 648507 633475
58923F33475j4073j2930j0881q570p064o311n317l598j719m53J41N51J208K248
$$ 633475 619402 606472 595591 587021 579957 573646 568329 564731 563012 562559 562700 563251 564459 566707
58909E66707L670N306O721P501P826Q472R995J2119J4175J5925J7558J9040K0013
$$ 566707 570377 575683 582404 589905 597731 606203 616198 628317 642492 658417 675975 695015 715028
58896G15028K0388K0465K0348J9690J8458J7471J7739J9431K1988K5089K8948
$$ 715028 735416 755881 776229 795919 814377 831848 849587 869018 891006 916095 945043
58885I45043L3520L7981M1327M3273M4061M3386M0121L3579K4807J5998Q468J620
$$ 945043 978563 1016544 1057871 1101144 1145205 1188591 1228712 1262291 1287098 1303096 1311564 1313184
58873A313184n864j4398k3338l1941l9656m5661m8977m9306m7319m4005l9992
$$ 1313184 1307320 1292922 1269584 1237643 1197987 1152326 1103349 1054043 1006724 962719 922727
58862I22727l5576l0958k6378k2286j9344j7835j7143j6283j4951j3633j2685
$$ 922727 887151 856193 829815 807529 788185 770350 753207 736924 721973 708340 695655
58851F95655j1992j1488j1350j1398j1013r955q736p807o995o080n323m935m538
$$ 695655 683663 672175 660825 649427 638414 628459 619723 611916 604921 598841 593518 588583 584045
58838E84045l768l000k881l379l904m102m041l807l522l617m397n333n378m150
$$ 584045 580277 577277 574396 571017 567113 563011 558970 555163 551641 548024 543627 538294 532916 528766
58824E28766k366r94l59j89j46O7P78K119L716M904N393N544N765N857N274M076
$$ 528766 526400 525406 525047 524858 524712 524779 525557 527676 531392 536296 541689 547233 552998 558855 564129 568205
58808E68205L107K928K968K269Q26m27r52j212j772k436k650k366j996j764j546
$$ 568205 571312 574240 577208 579477 580303 579876 578924 577712 575940 573504 570854 568488 566492 564728 563182
58793E63182j254j043j024j013o58J14Q93J240J356K006L569N546P305Q829J0176
$$ 563182 561928 560885 559861 558848 558190 558304 559197 560437 561793 563799 567368 572914 580219 589048 599224
58778E99224J0728R884Q263P170O819O138M510K655J358L37r28k106k500k151
$$ 599224 609952 619836 628099 635269 642088 648226 652736 655391 656749 657086 656158 654052 651552 649401
58764F49401j705j631k020k792l550l712l268k899k876k472j034R29K528L769
$$ 649401 647696 646065 644045 641253 637703 633991 630723 627824 624948 622476 621442 622371 624899 628668
58750F28668N218O769P715P864P735P671P520P119O557N922N431N589O583P653
$$ 628668 633886 640655 648370 656234 663969 671640 679160 686279 692836 698758 704189 709778 716361 724014
58736G24014P748O811N784N340N252N024M535M021L891M637O300Q051Q892Q827
$$ 724014 731762 738573 744357 749697 754949 759973 764508 768529 772420 777057 783357 791408 800300 809127
58722H09127Q740Q946Q650P110M776K728J481Q70R02J985M247P022R347J0793
$$ 809127 817867 826813 835463 842573 847349 850077 851558 852428 853330 855315 859562 866584 875931 886724
58708H86724J1608J2018J1756J0404Q041N194K234q76m211p690j1283j4951j8306
$$ 886724 898332 910350 922106 932510 940551 945745 947979 947103 942892 935202 923919 908968 890662
58695H90662k0719k2043k2767k3209k2979k1556j9076j6133j3211j0583q517p162
$$ 890662 869943 847900 825133 801924 778945 757389 738313 722180 708969 698386 689869 682707
58683F82707o465o470p336q752r806r875r307q738q197p322o085m731l276j605
$$ 682707 676242 669772 662436 653684 643878 634003 624696 615958 607761 600439 594354 589623 586347 584742
58669E84742J70J954L981O347Q562J0124J1319J2795J4585J6100J6768J6195J3929
$$ 584742 584912 586866 590847 597194 605756 615880 627199 639994 654579 670679 687447 703642 717571
58656G17571R963N292J315j371l036l944m051l548k966k613k408k268k225k227
$$ 717571 727534 732826 734141 732770 729734 725790 721739 718191 715225 712612 710204 707936 705711 703484
58642G03484k294k741l683m472m211k772p54J393L564N410O391O512O406O504
$$ 703484 701190 698449 694766 690294 686083 683311 682557 683950 687514 692924 699315 705827 712233 718737
58628G18737O578O172N031L152R39p63j337j108q39n02P62L394O772R973J2698
$$ 718737 725315 731487 736518 739670 740609 739846 738509 737401 736562 736060 736822 740216 746988 756961 769659
58613G69659J5201J7723K0198K2205K3083K2371K0099J6598J2158P205K469j453
$$ 769659 784860 802583 822781 844986 868069 890440 910539 927137 939295 946500 948969 947516
58601I47516m454o505p271o745n853n623n996o180n904n457m755l433j770n37
$$ 947516 943062 936557 929286 922541 916688 911065 905069 898889 892985 887528 882773 879340 877570 877033
58587H77033K44J352L088M878O444Q329J0801J3126J4475J4959J5163J5150J4440
$$ 877033 877277 878629 881717 886595 893039 901368 912169 925295 939770 954729 969892 985042 999482
58574I99482J2671R984O959M364K664J672J025R04J778L545N541P512R852J2740
$$ 999482 1012153 1022137 1029096 1033460 1036124 1037796 1038821 1039725 1041503 1045048 1050589 1058101 1067953 1080693
58560A080693J5667J8041J9730K0747K0911K0050J8128J5064J0889O077J349k897
$$ 1080693 1096360 1114401 1134131 1154878 1175789 1195839 1213967 1229031 1239920 1245997 1247346 1244449
58548A244449o507r091j0304j0501j0457j0387j0071r781j0222j1453j2789j3914
$$ 1244449 1237942 1228851 1218547 1208046 1197589 1187202 1177131 1167350 1157128 1145675 1132886 1118972
58536A118972j5207j6760j7977j8466j8453j7979j6558j4028j1041q231n580k921
$$ 1118972 1103765 1087005 1069028 1050562 1032109 1014130 997572 983544 972503 964272 958692 955771
58524I55771l30K307N276Q146R804R901R553R867J0461J0150Q593O541M771L418
$$ 955771 955441 957748 963024 971170 980974 990875 1000428 1010295 1020756 1030906 1039499 1046040 1050811 1054229
58510A054229K259J122J17m24l19J64O54J225K056K791K945K952L795N543P095
$$ 1054229 1056488 1057610 1057727 1057303 1056984 1057148 1057802 1059027 1061083 1063874 1066819 1069771 1073566 1079109 1086204
58495A086204P712P862Q255Q875R358R496Q954P348N020K883J116j076l900o244
$$ 1086204 1093916 1101778 1110033 1118908 1128266 1137762 1146716 1154064 1159084 1161967 1163083 1162007 1158107 1151863
58481A151863p159p165p135o770n196k540N3J719K436K550K363J902P05j835n512
$$ 1151863 1144704 1137539 1130404 1123634 1118438 1115898 1115951 1117670 1120106 1122656 1125019 1126921 1127626 1125791 1120279
58466A120279r191j1947j3778j4791j4634j3314j1827j1052j0528r121o556l605
$$ 1120279 1111088 1099141 1085363 1070572 1055938 1042624 1030797 1019745 1009217 1000096 993540 989935
58454I89935j081P24J913K871L987N088N447M650K967O79k208n185p143p683p752
$$ 989935 988854 989578 991491 994362 998349 1003437 1008884 1013534 1016501 1017180 1014972 1009787 1002644 994961 987209
58439I87209q145q137o575l733j001R19K494M123N455O056O166O512P620R326
$$ 987209 979064 970927 964352 960619 959618 960537 963031 967154 972609 978665 984831 991343 998963 1008289
58425A008289J0930J2015J3050J4708J6650J7816J7962J7905J7889J6839J3912
$$ 1008289 1019219 1031234 1044284 1058992 1075642 1093458 1111420 1129325 1147214 1164053 1177965
58414A177965R918O341L692J625r1j596l317n416p285q379r089j0074j1211j1844
$$ 1177965 1187883 1194224 1197916 1199541 1199450 1197854 1194537 1189121 1181836 1173457 1164368 1154294 1143083 1131239
58400A131239j1628j0442q086m832j710M77K025L545M931N832O402O767O264M265
$$ 1131239 1119611 1109169 1101083 1096251 1094541 1095018 1097043 1100588 1105519 1111351 1117753 1124520 1130784 1135049
58386A135049J312j426l550n402p077q362r331j0192j0700j0462r639q652p473
$$ 1135049 1136361 1134935 1131385 1125983 1118906 1110544 1101213 1091021 1080321 1069859 1060220 1051568 1044095
58373A044095n772l625j529R3J129J808K709M227N891O932P587Q902J0973J2609
$$ 1044095 1038323 1034698 1033169 1033262 1034391 1036199 1038908 1043135 1049026 1055958 1063545 1072447 1083420 1096029
58359A096029J3219J3728J4810J5657J5499J5007J4871J4099J1375P310L744J327
$$ 1096029 1109248 1122976 1137786 1153443 1168942 1183949 1198820 1212919 1224294 1231604 1235348 1236675
58347A236675p03k638l699l295j780J39K046L938O204R137J2190J4376J5712J7249
$$ 1236675 1235972 1233334 1229635 1226340 1224560 1224699 1226745 1230683 1236887 1246024 1258214 1272590 1288302 1305551
58333A305551J9219K0440K0319K0044K0604K1048K0027J7864J5632J3312J0533
$$ 1305551 1324770 1345210 1365529 1385573 1406177 1427225 1447252 1465116 1480748 1494060 1504593
58322A504593Q102O991O545N490M149L870M799N880O670P533Q467R211J0253J2226
$$ 1504593 1512695 1519686 1526231 1531721 1535870 1539740 1544539 1550419 1557089 1564622 1573089 1582300 1592553 1604779
58308A604779J4712J6990J9407K2554K5657K7381K7781K7914K7980K7414K6475
$$ 1604779 1619491 1636481 1655888 1678442 1704099 1731480 1759261 1787175 1815155 1842569 1869044
58297A869044K6077K6215K6003K5085K3776K2185K0416J9244J9321K0214K1268
$$ 1869044 1895121 1921336 1947339 1972424 1996200 2018385 2038801 2058045 2077366 2097580 2118848
58286B118848K2723K4807K6662K7490K7900K8703K9331K8860K7695K6721K5964
$$ 2118848 2141571 2166378 2193040 2220530 2248430 2277133 2306464 2335324 2363019 2389740 2415704
58275B415704K5623K7173L1626L7892M4594N2126O0921O9168P4526P6887P7273
$$ 2415704 2441327 2468500 2500126 2538018 2582612 2634738 2695659 2764827 2839353 2916240 2993513
58264B993513P5567P1907O8724O8412P0137P1761P3613P7240Q1648Q4336Q5271
$$ 2993513 3069080 3140987 3209711 3278123 3348260 3420021 3493634 3570874 3652522 3736858 3822129
58253C822129Q6496Q8405Q9774R0846R3087R6302R9338J03023J09133J16913J24111
$$ 3822129 3908625 3997030 4086804 4177650 4270737 4367039 4466377 4569400 4678533 4795446 4919557
58242D919557J30899J39338J49420J59243J68699J79357J91046K02170K13098
$$ 4919557 5050456 5189794 5339214 5498457 5667156 5846513 6037559 6239729 6452827
58233F452827K25706K39972K54448K69475K86406L04602L23008L43465L68355
$$ 6452827 6678533 6918505 7172953 7442428 7728834 8033436 8356444 8699909 9068264
58224I068264L96279M24588M54737M90161N30452N73135O19733O73994P35451
$$ 9068264 9464543 9889131 10343868 10834029 11364481 11937616 12557349 13231343 13966794
58215A3966794Q01246Q73347R57109J053688J161236J282825J425438J591696
$$ 13966794 14768040 15641387 16598496 17652184 18813420 20096245 21521683 23113379
58207B3113379J780954J998405K254623K556389K907417L318833L810269M401029
$$ 23113379 24894333 26892738 29147361 31703750 34611167 37930000 41740269 46141298
58199D6141298N109843N962459O988478Q212074R659416J1376763J3429864J5885428
$$ 46141298 51251141 57213600 64202078 72414152 82073568 93450331 106880195 122765623
58191A22765623J8797002K2182718K5967416K9917329L3612907L6423175L7437482
$$ 122765623 141562625 163745343 189712759 219630088 253242995 289666170 327103652
58184C27103652L5497148K9577591J9472751O271412p877150k0613326l0215937
$$ 327103652 362600800 392178391 411651142 417922554 410045404 389432078 359216141
58177C59216141l5958908l7998087l7073300l4192377l0331295k6219383k2290896
$$ 359216141 323257233 285259146 248185846 213993469 183662174 157442791 135151895
58170A35151895j8764006j5726211j3175930j1057425r304619p861693o674948
$$ 135151895 116387889 100661678 87485748 76428323 67123704 59262011 52587063
58163E2587063n690475m867588m181725l610988l131517k727228k391251k114148
$$ 52587063 46896588 42029000 37847275 34236287 31104770 28377542 25986291 23872143
58155B3872143j880565j679661j509042j365621j241128j129141j028703r38574
$$ 23872143 21991578 20311917 18802875 17437254 16196126 15066985 14038282 13099708
58147A3099708q54811p76120p05091o42209n84550n31542m85855m47258m11808
$$ 13099708 12244897 11468777 10763686 10121477 9536927 9005385 8519530 8072272 7660464
58138G660464l78729l51974l32886l16879k99630k81563k64041k45984k26846
$$ 7660464 7281735 6929761 6596875 6279996 5980366 5698803 5434762 5188778 4961932
58129D961932k08855j93745j80491j68186j57846j49763j42090j33759j25949
$$ 4961932 4753077 4559332 4378841 4210655 4052809 3903046 3760956 3627197 3501248
58120C501248j19412j13162j06841j01671r7963r4432r0777q8213q6658q4211
$$ 3501248 3381836 3268674 3161833 3060162 2962199 2867767 2776990 2688777 2602119 2517908
58110B517908q0244p6287p3146o9902o6538o4517o3847o2289n8559n3671m8241
$$ 2517908 2437664 2361377 2288231 2218329 2151791 2087274 2023427 1961138 1902579 1848908 1800667
58099A800667m1234l2594k4475j8582j4627j2532j3647j8267k4154k9024l2720
$$ 1800667 1759433 1726839 1702364 1683782 1669155 1656623 1642976 1624709 1600555 1571531 1538811
58088A538811l5697l7251l6711l4807l2552l0032k7311k5221k4232k3706k2946
$$ 1538811 1503114 1465863 1429152 1394345 1361793 1331761 1304450 1279229 1254997 1231291 1208345
58077A208345k1990k0922j9602j8451j8126j8192j7565j6380j5877j6215j6133
$$ 1208345 1186355 1165433 1145831 1127380 1109254 1091062 1073497 1057117 1041240 1025025 1008892
58066A008892j5100j4039j3560j3140j2493j2055j1718j0761r486r190j0063j0841
$$ 1008892 993792 979753 966193 953053 940560 928505 916787 906026 896540 887350 877287 866446
58054H66446j1013j1571j3058j4513j5027j4755j3845j2019r808q540q474q406
$$ 866446 855433 843862 830804 816291 801264 786509 772664 760645 750837 742297 733823 725417
58042G25417p720p163p166o998o322n947o263o416n747m729l865l117k863l866
$$ 725417 717697 710534 703368 696370 690048 684101 677838 671422 665675 660946 657081 653964 651101 647235
58028F47235n704o829o722o424o417n810m360l401l772m492m544m323m325m030
$$ 647235 641531 634702 627980 621556 615139 609329 604969 601568 597796 593304 588760 584437 580112 576082
58014E76082l248k964l648m200l908l936n352p022p169o005n215n441n811n514
$$ 576082 572834 569870 566222 562022 558114 554178 548826 541804 534635 528630 523415 517974 512163 506649
58000E06649m546l235k044j536j789k191k305k340k350j874q96k42l81p52r16
$$ 506649 502103 498868 496824 495288 493499 491308 489003 486663 484313 482439 481543 481301 480920 480168 479252
57985D79252j339k307l105l095k716k573k490k228k163k363k094j148o63j439
$$ 479252 477913 475606 472501 469406 466690 464117 461627 459399 457236 454873 452779 451631 450968 449529
57971D49529k468k340j346q87j417k247k844l110k729j504j52L05j38n93o61q18
$$ 449529 447061 444721 443375 442488 441071 438824 435980 432870 430141 428637 428485 428790 428652 428059 427398 426580
57955D26580j434k192k551k413k149k198k595k921k915k939l341l660l249k494
$$ 426580 425146 422954 420403 417990 415841 413643 411048 408127 405212 402273 398932 395272 392023 389529
57941C89529k318k512j912m39N76N35O04J765L325M273M802N354N411M557L691
$$ 389529 387211 384699 382787 382348 382924 383459 384063 385828 389153 393426 398228 403582 408993 413550 417241
57926D17241L684L657K209k31j931k394k860m177n659o326o221o061o292o811
$$ 417241 420925 424582 426791 426560 424629 422235 419375 415198 409539 403213 396992 390931 384639 377828
57912C77828p161o855n730m075k282o99J69r4j027j424p85k3k51j380k550l355
$$ 377828 370667 363812 358082 354007 351725 351026 351195 351101 350074 348650 347865 347842 347591 346211 343661 340306
57896C40306l921m155l725k635j308l11j49q74j706j614o29J85K64K28N35O34
$$ 340306 336385 332230 328505 325870 324562 324251 324102 323228 321522 319908 319279 319464 319728 319956 320491 321125
57880C21125R5l92j69J42m20j569k255k234k197k647l501m515n299n318m541l690
$$ 321125 321220 320828 320659 320801 320381 318812 316557 314323 312126 309479 305978 301463 296164 290846 286305 282615
57864B82615l243k791k027j588j955k271j412L06J610K136K576L237L651L600
$$ 282615 279372 276581 274554 272966 271011 268740 267328 267634 269244 271380 273956 277193 280844 284444
57850B84444L470L520L601L649L747L741L443L073K954K940K665K076J185k54
$$ 284444 287914 291434 295035 298684 302431 306172 309615 312688 315642 318582 321247 323323 324508 324254
57836C24254k127l552l815l392l199l318l242l027l120l441l517l366l295l099
$$ 324254 322127 318575 314760 311368 308169 304851 301609 298582 295462 292021 288504 285138 281843 278744
57822B78744k395j475r37o69j25N93J011J397K416L723M042K781O47j510l493
$$ 278744 276349 274874 273937 273268 273143 273736 274747 276144 278560 282283 286325 289106 289753 288243 284750
57807B84750n268o580p379p931q217p910p016n975n050m244l791l989m483m415
$$ 284750 279482 272902 265523 257592 249375 241465 234449 228474 223424 219180 215389 211400 206917 202502
57793B02502l493k301j481j154j221j596k041k217k055j716j323j017j025j140
$$ 202502 199009 196708 195227 194073 192852 191256 189215 186998 184943 183227 181904 180887 179862 178722
57779A78722n83J032K873L835L989M267M944N394N287N048N032N030M761M182
$$ 178722 178139 179171 182044 185879 189868 194135 199079 204473 209760 214808 219840 224870 229631 233813
57765B33813L254K023Q63R5n99j708l068m119m755n152n088m328l404l032k931
$$ 233813 237067 239090 239953 240048 239449 237741 234673 230554 225799 220647 215559 211231 207827 204795 201864
57750B01864k318j369r30r27m12O54J122N57P1O53J756K231J743O75n69j514j693
$$ 201864 199546 198177 197247 196320 195908 196562 197684 198241 198312 198965 200721 202952 204695 205370 204801 203287 201594
57733B01594j342j318j846k080j470o83m75m97j4P83J142R94R31J224J618J907
$$ 201594 200252 198934 197088 195008 193538 192855 192380 191883 191869 192652 193794 194788 195719 196943 198561 200468
57717B00468K044J782Q67m17j396j764j777j741j643j353r37n64k68J00O15J037
$$ 200468 202512 204294 205161 204744 203348 201584 199807 198066 196423 195070 194133 193569 193301 193401 194016 195053
57701A95053J013O33N09J084J996K462K111J150m1j107j716j819j855k209k672
$$ 195053 196066 196699 197208 198292 200288 202750 204861 206011 205970 204863 203147 201328 199473 197264 194592
57686A94592k792k511j960j009L26J402J711J853K857M677O409P926J0174J3686
$$ 194592 191800 189289 187329 186320 186646 188048 189759 191612 194469 199146 205555 213481 223655 237341
57672B37341J7930K2465K7619L3646M0080M6475N2713N7714N8510N1611L5568
$$ 237341 255271 277736 305355 339001 379081 425556 478269 535983 594493 646104 681672
57661F81672J2305j3466l6072n1286n8033n8028n3769m7198l9843l3005k7192
$$ 681672 693977 680511 644439 593153 535120 477092 423323 376125 336282 303277 276085
57650B76085k2060j7417j3738j1391r948q725p438o030m483l138k558k654k591
$$ 276085 254025 236608 222870 211479 201531 192806 185368 179338 174855 171717 169159 166505 163914
57637A63914j952j264j013q86n62l81n52m20N56J660J727P66j40m05n25j101j966
$$ 163914 161962 160698 159685 158799 158237 157856 157304 156884 157440 159100 160827 161593 161453 161048 160523 159422 157456
57620A57456k490k368j909j707k014k457k559k408k430k551k185j209k93J1j17
$$ 157456 154966 152598 150689 148982 146968 144511 141952 139544 137114 134563 132378 131169 130876 130887 130770
57605A30770k51k91j77K64Q31R56M85m6k69l88m93k67K33L41j75p61j220k219
$$ 130770 130519 130228 130051 130315 131146 132102 132587 132541 132272 131884 131391 131124 131357 131698 131523 130762 129542 127323
57587A27323l851m883m421l374l038l097k451j408j331k312k820j911m53K42j
$$ 127323 123472 118589 114168 110794 107756 104659 102208 100800 99469 97157 94337 92426 91973 92215 92214
57572I2214m48n15j66J84%p97j561j688j481j652k181k363j885j096k69O19J353
$$ 92214 91766 91251 91085 91269 91269 90472 88911 87223 85742 84090 81909 79546 77661 76565 76296 76915 78268
57555G8268J485J007M32J45J81O00J416K237K532K288J810J105J29n40k04Q14
$$ 78268 79753 80760 81192 81337 81518 82118 83534 85771 88303 90591 92401 93506 93635 93095 92891 93705
57539I3705J413J178P03M64K85R2J91M35J10r29j834j917j509j154o92K29J317
$$ 93705 95118 96296 96999 97463 97748 97840 98031 98466 98576 97647 95813 93896 92387 91233 90541 90770 92087
57522I2087J980K034J588O70n10j356j443r90l80L21R99J184P06J94K88P30Q99
$$ 92087 94067 96101 97689 98359 97849 96493 95050 94060 93680 94001 95000 96184 96890 97084 97372 98102 99001
57505I9001Q78J226J826J871J019j36r46j469k010k428k253j361k41L89J40p93
$$ 99001 99879 101105 102931 104802 105821 105685 104739 103270 101260 98832 96579 95218 94977 95366 95506 94713
57489I4713j832k454k444j808p04M45J067R56M65J6m00r08j201q51o7L80R4n26
$$ 94713 92881 90427 87983 86175 85471 85916 86983 87939 88404 88420 88020 87112 85911 85060 84993 85373 85467 84941
57471H4941r63j188j369j413j166q32p25p96q22r00j279j694j491o20N0j76q04
$$ 84941 83978 82790 81421 80008 78842 78010 77285 76489 75667 74767 73488 71794 70303 69683 69733 69557 68753
57454F8753p77J12J033J279R92O34K98o1j78K27Q77J181R81P26P99J038J013O08
$$ 68753 67976 68088 69121 70400 71392 72026 72324 72263 72085 72312 73189 74370 75351 76077 76876 77914 78927 79535
57436G9535P7k94m36l82j34K75O47O96L70m9k45k11j17L4L43P03Q28O52L90J49
$$ 79535 79612 79318 78882 78500 78366 78641 79288 79984 80354 80305 80060 79849 79732 79766 80109 80812 81640 82292 82682 82831
57416H2831j68m85n05k12rr5j01K62O18M90R5pJ58J00j11K00J188K004J875J143
$$ 82831 82663 82178 81673 81461 81452 81357 81256 81518 82136 82626 82721 82714 82872 82972 82861 83061 84249 86253 88128 89271
57396H9271O92P27P36M54K20L27N33M91L13L69P04R83R73Q43Q71J042J075Q24
$$ 89271 89963 90690 91426 91880 92100 92427 92960 93451 93764 94133 94837 95820 96793 97636 98507 99549 100624 101448
57378A01448M86L71N22O57N04J09k35l22j55K54R20J642J920J537J026J116J753
$$ 101448 101934 102305 102827 103484 103988 104097 103862 103540 103385 103639 104559 106201 108121 109658 110684 111800 113553
57361A13553K143J935J774K309L168L484L082K556K324K262K232K398K859L383
$$ 113553 115696 117631 119405 121714 124882 128366 131448 134004 136328 138590 140822 143220 146079 149462
57347A49462L619L327K474J417Q78J214J848J966J696J881K712L362L223K724
$$ 149462 153081 156408 158882 160299 161177 162391 164239 166205 167901 169782 172494 175856 179079 181803
57333A81803K485K384J930J161O43P95J585K635L421L651L599L783M291M850N464
$$ 181803 184288 186672 188602 189763 190406 191201 192786 195421 198842 202493 206092 209875 214166 219016 224480
57318B24480O349P194P342O982P186Q311R336R418R231R756J0583J0522R540Q885
$$ 224480 230829 238023 245365 252347 259533 267844 277180 286598 295829 305585 316168 326690 336230 345115
57304C45115R344J0400J1271J1894J2634J3527J4082J3714J2388J0969J0594J1438
$$ 345115 354459 364859 376130 388024 400658 414185 428267 441981 454369 465338 475932 487370
57292D87370J2428J2551J1942J1267J0658R919R292R143R171Q722P697O476N235
$$ 487370 499798 512349 524291 535558 546216 556135 565427 574570 583741 592463 600160 606636 611871
57279F11871M009L105K769K640K382K412L221M239M444L877L538L891M491N032
$$ 611871 615880 618985 621754 624394 626776 629188 632409 636648 641092 644969 648507 652398 656889 661921
57265F61921N740O667P639Q936J0920J2964J3849J3583J3588J4713J6142J6769
$$ 661921 667661 674328 681967 690903 701823 714787 728636 742219 755807 770520 786662 803431
57253H03431J6582J6044J5102J3685J2456J2223J2895J3706J4097J3954J3417
$$ 803431 820013 836057 851159 864844 877300 889523 902418 916124 930221 944175 957592
57242I57592J2855J2750J3224J4005J4995J6272J7433J7799J7564J7843J9072
$$ 957592 970447 983197 996421 1010426 1025421 1041693 1059126 1076925 1094489 1112332 1131404
57231A131404K0229K0392K0222K0988K2693K4244K5151K5963K7167K8576K9935
$$ 1131404 1151633 1172025 1192247 1213235 1235928 1260172 1285323 1311286 1338453 1367029 1396964
57220A396964L1323L2729L3835L4449L4728L4792L4484L3646L2418L1078K9778
$$ 1396964 1428287 1461016 1494851 1529300 1564028 1598820 1633304 1666950 1699368 1730446 1760224
57209A760224K8611K7790K7573K7878K8132K7814K7216K7314K8528L0045L0840
$$ 1760224 1788835 1816625 1844198 1872076 1900208 1928022 1955238 1982552 2011080 2041125 2071965
57198B071965L1011L1317L1703L1343L0152K9151K8993K9144K9034K8994K9383
$$ 2071965 2102976 2134293 2165996 2197339 2227491 2256642 2285635 2314779 2343813 2372807 2402190
57187B402190K9682K9381K8975K9103K9284K8612K7291K6414K6320K6231K5529
$$ 2402190 2431872 2461253 2490228 2519331 2548615 2577227 2604518 2630932 2657252 2683483 2709012
57176B709012K4381K3034K1318J9127J6672J4047J1156Q241N929M490L512K497
$$ 2709012 2733393 2756427 2777745 2796872 2813544 2827591 2838747 2846988 2852917 2857407 2860919 2863416
57164B863416J334Nj678l714n660p042p790q110q173q047p588o276l604M3L283
$$ 2863416 2864750 2864755 2863077 2859363 2853703 2846661 2838871 2830761 2822588 2814541 2806953 2800677 2797073 2797116 2800399
57149B800399N061N854P108R576J2697J5621J8260K1031K3987K6719K8909L0569
$$ 2800399 2805460 2811314 2818422 2827998 2840695 2856316 2874576 2895607 2919594 2946313 2975222 3005791
57137C005791L1765L2460L2626L2137L0633K7992K5117K3627K4388K6688K9255
$$ 3005791 3037556 3070016 3102642 3134779 3165412 3193404 3218521 3242148 3266536 3293224 3322479
57126C322479L1753L4834L9014M3950M8774N2779N6090N9954O6039P4859Q5128
$$ 3322479 3354232 3389066 3428080 3472030 3520804 3573583 3629673 3689627 3755666 3830525 3915653
57115C915653R5079J04096J12580J20796J28793J37207J47137J59357J74452J93546
$$ 3915653 4010732 4114828 4227408 4348204 4476997 4614204 4761341 4920698 5095150 5288696
57105E288696K17793K47225K81268L20615L67602M24530M92710N73260O67627
$$ 5288696 5506489 5753714 6034982 6355597 6723199 7147729 7640439 8213699 8881326
57096H881326P76641R00059J037328J187760J349421J518839J692304J866424
$$ 8881326 9657967 10558026 11595354 12783114 14132535 15651374 17343678 19210102
57088A9210102K036670K196129K335960K446286K516738K537546K499687K391353
$$ 19210102 21246772 23442901 25778861 28225147 30741885 33279431 35779118 38170471
57080C8170471K194667J891930J481300R86548M48007r6954o24137j117319j560126
$$ 38170471 40365138 42257068 43738368 44724916 45172923 45075969 44451832 43334513 41774387
57071D1774387j936108k233670k447851k578663k630249k611098k532837k407993
$$ 41774387 39838279 37604609 35156758 32578095 29947846 27336748 24803911 22395918
57063B2395918k249064k068580j878271j687615j503398j330244j170968j026842
$$ 22395918 20146854 18078274 16200003 14512388 13008990 11678746 10507778 9480936
57055I480936q98254p85249o87187o02448n29128m65874m11767l65687l26382
$$ 9480936 8582682 7797433 7110246 6507798 5978670 5512796 5101029 4735342 4408960
57046D408960k92854k64266k39599k17917j98846j82341j67942j54657j41664
$$ 4408960 4116106 3851840 3612241 3394324 3195478 3013137 2845195 2690538 2548874
57037B548874j28890j16710j05267r4195q2987p1455n9656m7401l4210j9869m943
$$ 2548874 2419984 2303274 2198007 2103812 2020825 1949370 1889714 1842313 1808103 1788234 1783291
57026A783291R222K0345K4780J8286j024k9764n9906q3158r5286r6883r1157q1475
$$ 1783291 1792513 1812858 1837638 1855924 1854900 1825136 1765230 1682072 1586786 1489903 1398746 1317271
57014A317271p0363n9601n0436m3439l8294l4116l0295k6962k4501k2849k1645
$$ 1317271 1246908 1187307 1136871 1093432 1055138 1021022 990727 963765 939264 916415 894770
57003H94770k0807k0475k0496k0494k0432k0604k1041k1382k1444k1442k1503
$$ 894770 873963 853488 832992 812498 792066 771462 750421 729039 707595 686153 664650
56992F64650k1324k0534j9107j7319j5443j3563j1468q855n902l459k288k219
$$ 664650 643326 622792 603685 586366 570923 557360 545892 537037 531135 527676 525388 523169
56980E23169k569l263m850p395r957j1567j2160j2257j2041j1143r277o755m380
$$ 523169 520600 517337 512487 505092 495135 483568 471408 459151 447110 435967 426690 419935 415555
56967D15555k827k045j330o9J661L376M808O067P425R212J1547J3758J4423J2594
$$ 415555 412728 410683 409353 409284 410945 414321 419129 425196 432621 441833 453380 467138 481561 494155
56953D94155Q748M041j025o491j1789j5682j7479j7527j6475j4759j2890j1391
$$ 494155 502903 506944 505919 499428 487639 471957 454478 436951 420476 405717 392827 381436
56941C81436j0100q224n369k037J091L854O407Q939J1729J4904J7949J9939K0372
$$ 381436 371336 363112 357743 355706 356797 360651 367058 375997 387726 402630 420579 440518 460890
56928D60890J9160J5797R480M82r210j7173k2097k3993k3566k1838j9759j7705
$$ 460890 480050 495847 505327 505809 496599 479426 457329 433336 409770 387932 368173 350468
56916C50468j5507j3115j0794q631o549m902m304m591m693l986k988k399k152
$$ 350468 334961 321846 311052 302421 295872 290970 286666 282075 277382 273396 270408 268009 265857
56903B65857j908j709j604j251n07J95O03J157K205L316M028M695N913P648R558
$$ 265857 263949 262240 260636 259385 258878 259073 259676 260833 263038 266354 270382 275077 280990 288638 298196
56888B98196J1654J3945J5949J7183J7614J6982J4460R804M239p67n039q935j1768
$$ 298196 309850 323795 339744 356927 374541 391523 405983 415787 420026 419259 414220 405285 393517
56875C93517j2348j0819q558o260l467j39K746M664O492R336J3179J7340K1578
$$ 393517 381169 370350 361792 355532 352065 351926 354672 359336 365828 375164 388343 405683 427261
56862D27261K6096L0802L5155L8443L9876L8572L3790K5193J3078j181j5004k5549
$$ 427261 453357 484159 519314 557757 597633 636205 669995 695188 708266 707085 692081 666532
56850F66532l1263l2413l0233k5953k0571j4915r475m388M04N264J0941J7929
$$ 666532 635269 602856 572623 546670 526099 511184 501709 497321 497725 502989 513930 531859
56838E31859K5688L3090L9833M6669N3997O0711O4801O4428N8064M4475K3813
$$ 531859 557547 590637 630470 677139 731136 791847 856648 921076 979140 1023615 1047428
56827A047428j150k5628m5191n7632o3023o2685n8330n1621m3916l6046k8305
$$ 1047428 1046278 1020650 975459 917827 854804 792119 733789 682168 638252 602206 573901
56816E73901k0656j3069n737J134P728J4613K2084K9595L6156M1234M4798M6172
$$ 573901 553245 540176 534439 535573 543301 557914 579998 609593 645749 686983 731781 777953
56804G77953M3249L3691J7314k852k2220l7348m7142n2020n2759n0175m5334l9397
$$ 777953 821202 854893 872207 869355 847135 809787 762645 710625 657866 607691 562357 522960
56792E22960l3261k7341k1604j5796r910m491j51L353P101J1797J6819K0871K3255
$$ 522960 489699 462358 440754 424958 415048 410557 410406 413759 420860 432657 449476 470347 493602
56779D93602K4005K2874J8948J1543J313r867k0024k7935l3041l5061l4125l1199
$$ 493602 517607 540481 559429 570972 572285 562418 542394 514459 481418 446357 412232 381033
56767C81033k7703k4393k0966j7151j3747j1874j1346j0703r005o832n270m595
$$ 381033 353330 328937 307971 290820 277073 265199 253853 243150 234145 227313 222043 217448
56755B17448m402m395m418m168l463k631k174k200k447k607k431j852j297j396
$$ 217448 213046 208651 204233 200065 196602 193971 191797 189597 187150 184543 182112 180260 178963 177567
56741A77567k057k378j780p63l0M62J010J261O78m29j159j128o89k69q7l36q56
$$ 177567 175510 173132 171352 170589 170559 171021 172031 173292 173970 173541 172382 171254 170565 170296 170209 169873 169017
56724A69017r16JJ273J825J571J411J827K321K336J939J373O38k07q29r48o12
$$ 169017 168101 168102 169375 171200 172771 174182 176009 178330 180666 182605 183978 184616 184409 183580 182632 182020
56708A82020l6M56M48j40p55p94l93p9O7K42J06q58k230k804k112r47j98M3j4
$$ 182020 181984 182440 182888 182748 181993 181199 180806 180727 180794 181036 181142 180284 178054 175250 173138 172191 171993 172036 172022
56689A72022m03r67j132o46pK95L95N77O81M50L3k16r5M81J435K144J757K97j069
$$ 172022 171619 170652 169520 168874 168867 169162 169557 170134 170815 171265 171298 171082 170987 171468 172903 175047 176804 177101 176032
56670A76032j315o46N6L98N07M26Q4l25m74l10L1N15J104J587J838J980K046J811
$$ 176032 174717 174071 174127 174525 175032 175458 175542 175217 174743 174433 174464 174979 176083 177670 179508 181488 183534 185345
56652A85345J296R76J121J255Q24J19m8N16J165J287R32N10K25l3m31r37j265
$$ 185345 186641 187617 188738 189993 190817 190936 190888 191404 192569 193856 194788 195298 195523 195490 195059 194122 192857
56635A92857j130o53l17l96o38o74m80k28R8N93J064J124O18j94q85j185j059
$$ 192857 191727 191074 190757 190361 189723 189049 188569 188341 188439 189032 190096 191220 191838 191644 190759 189574 188515
56618A88515o94l66k56l65n72p33p42o23m54j73L91J134J587J534J350J348J097
$$ 188515 187821 187455 187199 186834 186262 185529 184787 184164 183710 183537 183928 185062 186649 188183 189533 190881 191978
56601A91978N8j287j826j212j71O75J349J727J278R6p00l48N20R04Q30R53J319
$$ 191978 192036 190749 188923 187711 187540 188215 189564 191291 192569 192665 191965 191617 192137 193041 193871 194824 196143
56584A96143J436J188Q06J99p65j538j327k95N35P04Q04J340J851J617P29m5j59
$$ 196143 197579 198767 199573 199772 199007 197469 196142 195847 196382 197086 197890 199230 201081 202698 203427 203382 203223
56567B03223L39J147K081L033L819M227M266M245M445M727M725M466M376M469
$$ 203223 203562 204709 206790 209823 213642 217869 222135 226380 230825 235552 240277 244743 249119 253588
56553B53588L995K379K40j064q67K24J163J378Q85k0r06j324j128o00j82p4j71
$$ 253588 257583 259962 260202 259138 258271 258495 259658 261036 261921 261901 260995 259671 258543 257943 257761 257687 257516
56536B57516l15m50n54m59m1M07K74o58j802k453k731l263m003m082l018j466
$$ 257516 257201 256751 256197 255738 255697 256104 256378 255720 253918 251465 248734 245471 241468 237386 234368 232902
56520B32902m21j69l97p82r87o35J17L97l38j388j597q41k3K46J73K9l02q04r93
$$ 232902 232481 232312 231915 231133 230146 229511 229628 230025 229687 228299 226702 225861 225838 226084 226257 226286 225984 225180 224187
56501B24187n36K52Q35J057J031P52J76m24o01k42K20K38k61q09r45p50o76r08
$$ 224187 223651 223903 224738 225795 226826 227578 227754 227330 226729 226487 226707 226945 226684 225875 224930 224180 223504 222596
56483B22596j121q86k01N06Q16O28K52J27L86P04P67O87P26P79O20N00Q58J434
$$ 222596 221475 220589 220388 220894 221710 222338 222590 222717 223103 223807 224574 225261 225987 226766 227386 227886 228744 230178
56465B30178J365M18n68p55k39M19R44J150O72m88j535j590o21O75J595J781J283
$$ 230178 231543 231961 231393 230638 230399 230818 231762 232912 233584 233096 231561 229971 229350 230025 231620 233401 234684
56448B34684P32Q83J559J668O91m81q09m67j52K00R63J703J645R41L59m3p37j409
$$ 234684 235416 236299 237858 239526 240217 239736 238927 238460 238308 238508 239471 241174 242819 243760 244119 244076 243339 241930
56430B41930j135N2R54Q75M49M13O02N78M25M04M45M89P60J298J659J491R58L57
$$ 241930 240795 240847 241801 242676 243125 243538 244140 244718 245143 245547 245992 246481 247241 248539 250198 251689 252647 253004
56412B53004k29o96p39k82L79R71J509J972K194K209K280K414K271J725J102P10
$$ 253004 252775 252079 251340 251058 251437 252408 253917 255889 258083 260292 262572 264986 267257 268982 270084 270794
56396B70794N42M87N16N39N18O51J047J302R24Q4n98r09j043r55m82j5r9m05r3
$$ 270794 271336 271823 272339 272878 273396 274047 275094 276396 277320 277404 276806 275897 274854 273899 273417 273402 273303 272898 272805
56377B72805O97R28M45M31J389K076J318%o3J403K917L186K310J180N36O04R92
$$ 272805 273502 274430 274875 275306 276695 278771 280089 280089 280026 281429 284346 287532 289842 291022 291558 292162 293154
56360B93154R52K30m52k63O36J367J497J359J257J067O70K81J08L5j43l46k70
$$ 293154 294106 294336 293884 293621 294257 295624 297121 298480 299737 300804 301474 301755 301863 301898 301755 301409 301139
56343C01139K17P98R72O78M95R70J788K109J681J124J012J177J178R66P78P65
$$ 301139 301356 302154 303126 303804 304299 305269 307057 309166 310847 311971 312983 314160 315338 316304 317082 317847
56327C17847J009J485J834J637J154J212K007K645K335J488R86R37P87L64J7j07
$$ 317847 318856 320341 322175 323812 324966 326178 328185 330830 333165 334653 335639 336576 337363 337727 337744 337637
56311C37637j85k22l6K82M03K68R6m0j48P2J037K558L782M070L633L189L184L436
$$ 337637 337452 337230 337194 337476 337879 338147 338243 338203 338055 338127 339164 341722 345504 349574 353207 356396 359580 363016
56293C63016L438K954K300J951J928J824J581J723K565L505L608K798J994K068
$$ 363016 366454 369408 371708 373659 375587 377411 378992 380715 383280 386785 390393 393191 395185 397253
56279C97253K972L969M452M500M641N158N678N662N172M833N018N480N950O507
$$ 397253 400225 404194 408646 413146 417787 422945 428623 434285 439457 444290 449308 454788 460738 467245
56265D67245P159P493P179O488N933N670N677O126P095Q138Q753R140J0025J1715
$$ 467245 474404 481897 489076 495564 501497 507167 512844 518970 526065 534203 542956 552096 562121 573836
56251E73836J3774J5675J7375J9144K1149K3329K5610K8073L0842L3766L6207
$$ 573836 587610 603285 620660 639804 660953 684282 709892 737965 768807 802573 838780
56240H38780L7384L7085L5867L4466L3051L1143K8091K3588J7906J1631N180j375
$$ 838780 876164 913249 949116 983582 1016633 1047776 1075867 1099455 1117361 1128992 1134172 1132797
56228A132797p891j3903j9064k3513k7304k9855l0680l0454l0364l0473k9776
$$ 1132797 1124906 1111003 1091939 1068426 1041122 1011267 980587 950133 919769 889296 859520
56217H59520k7991k6155k5017k3931k2082j9864j8122j6789j5216j3384j1884
$$ 859520 831529 805374 780357 756426 734344 714480 696358 679569 664353 650969 639085
56206F39085j0952j0269r543q668p491n982m445l205k338j985k367l060k921j446
$$ 639085 628133 617864 608321 599653 592162 586180 581735 578530 576192 574207 571840 568780 565859 564413
56192E64413L45J058O36J30K32P59J351J843K091K071K047K172K195K002K039
$$ 564413 564758 565816 566452 566582 566814 567573 568924 570767 572858 574929 576976 579148 581343 583345 585384
56177E85384K637L353L652L791M232M620M219L182K480K684L495M350M837M701
$$ 585384 588021 591374 595026 598817 603049 607669 611888 615070 617550 620234 623729 628079 632916 637617
56163F37617M130L860M370N211N712O004O679P744Q778R811J1186J2718J3801
$$ 637617 641747 645607 649977 655188 660900 666904 673583 681327 690105 699916 711102 723820 737621
56150G37621J4232J4219J3838J3208J2923J3526J4829J6520J9033K2809K7136
$$ 737621 751853 766072 779910 793118 806041 819567 834396 850916 869949 892758 919894
56139I19894L0880L4313L8994M5845N4355O3615P2951Q1341Q7353Q9983Q8859
$$ 919894 950774 985087 1024081 1069926 1124281 1187896 1260847 1342188 1429541 1519524 1608383
56128A608383Q3559P3955O1592M9726M1261L6907L5319L4287L1683K6123J7507
$$ 1608383 1691942 1765897 1827489 1877215 1918476 1955383 1990702 2024989 2056672 2082795 2100302
56117B100302O867m235j4002k0737k3906k4934k6266k9649l5717m4544n5419o6201
$$ 2100302 2107169 2102934 2088932 2068195 2044289 2019355 1993089 1963440 1927723 1883179 1827760 1761559
56105A761559p4186p7940p7601p3625o6318n6696m6619l7600l0077k3927j8863
$$ 1761559 1687373 1609433 1531832 1458207 1391889 1335193 1288574 1250974 1220897 1196970 1178107
56094A178107j4327r881n905l211j821r14J11J300K723M462O044O778O739O611
$$ 1178107 1163780 1153899 1147994 1144783 1142962 1142048 1142159 1143459 1146182 1150644 1156688 1163466 1170205 1176816
56080A176816O715O985P621Q715R541R396Q966R583J1276J2862J3872J4889J6003
$$ 1176816 1183531 1190516 1198137 1206852 1216393 1225789 1234755 1244338 1255614 1268476 1282348 1297237 1313240
56067A313240J6548J6588J7101J8322J9338J9768K0380K1547K2464K2523K2358
$$ 1313240 1329788 1346376 1363477 1381799 1401137 1420905 1441285 1462832 1485296 1507819 1530177
56056A530177K2872K4180K5879K7433K8086K7434K6285K5840K6001K5708K4884
$$ 1530177 1553049 1577229 1603108 1630541 1658627 1686061 1712346 1738186 1764187 1789895 1814779
56045A814779K4549K4958K5253K5137K5204K5349K4687K3390K2847K3473K4319
$$ 1814779 1839328 1864286 1889539 1914676 1939880 1965229 1989916 2013306 2036153 2059626 2083945
56034B083945K5453K8835L5803M5314N5432O4951P2730P7286P8197P6662P3890
$$ 2083945 2109398 2138233 2174036 2219350 2274782 2339733 2412463 2489749 2567946 2644608 2718498
56023B718498P0228O6427O3981O3435O3849O4640O6335O8949P1512P3931P7403
$$ 2718498 2788726 2855153 2919134 2982569 3046418 3111058 3177393 3246342 3317854 3391785 3469188
56012C469188Q2220Q7091R1363R5847J00679J04719J08092J12820J19707J27001
$$ 3469188 3551408 3638499 3729862 3825709 3926388 4031107 4139199 4252019 4371726 4498727
56002D498727J33500J40496J49026J57775J65567J73605J83213J93493K03290
$$ 4498727 4632227 4772723 4921749 5079524 5245091 5418696 5601909 5795402 5998692
55993E998692K13537K25621K39253K53776K69709K87259L05360L23942L45108
$$ 5998692 6212229 6437850 6677103 6930879 7200588 7487847 7793207 8117149 8462257
55984H462257L70320L98468M28477M61425M98485N39203N83543O33091O88541
$$ 8462257 8832577 9231045 9659522 10120947 10619432 11158635 11742178 12375269 13063810
55975A3063810P48895Q14895Q90109R76891J074859J185353J313447J463319J636064
$$ 13063810 13812705 14627600 15517709 16494600 17569459 18754812 20068259 21531578 23167642
55966B3167642J834925K068436K345679K673435L061576L526496M085979M755892
$$ 23167642 25002567 27071003 29416682 32090117 35151693 38678189 42764168 47520060
55958D7520060N555199O508312P639802Q975617J0555973J2441254J4699681J7388896
$$ 47520060 53075259 59583571 67223373 76198990 86754963 99196217 113895898 131284794
55950A31284794K0532321K4071760K7806070L1353391L4124797L5264590L3647065
$$ 131284794 151817115 175888875 203694945 235048336 269173133 304437723 338084788
55943C38084788K8177815J8471585N486836q523529k0905297k9741341l4439415
$$ 338084788 366262603 384734188 390221024 381697495 360792198 331050857 296611442
55936B96611442l5527024l4049341l1066111k7418135k3674844k0162978j7035117
$$ 296611442 261084418 227035077 195968966 168550831 144875987 124713009 107677892
55929A07677892j4341051j2070766j0177543q602565p294547o210457n309171
$$ 107677892 93336841 81266075 71088532 62485967 55191420 48980963 43671792
55922D3671792m555073l923895l397592k956826k583962k268688k004037j779887
$$ 43671792 39116719 35192824 31795232 28838406 26254444 23985756 21981719 20201832
55914B0201832j585749j416717j271195j145189j033531r34306q47491p71069
$$ 20201832 18616083 17199366 15928171 14782982 13749451 12815145 11967654 11196585
55906A1196585p02300o40970n87730n40938m98296m59737m25693l94441l64155
$$ 11196585 10494285 9853315 9265585 8724647 8226351 7766614 7340921 6946480 6582325
55897F582325l35759l10797k88295k66460k45763k27610k11541j96398j82599
$$ 6582325 6246566 5935769 5647474 5381014 5135251 4907641 4696100 4499702 4317103
55888D317103j70711j59374j47246j35547j26046j18074j10263j03893j01505
$$ 4317103 4146392 3987018 3839772 3704225 3578179 3460105 3349842 3245949 3144444
55879C144444j02892j05098j05797j04510j01268r6361r1016q6345q1992p7289
$$ 3144444 3041552 2936454 2830657 2726147 2624879 2528518 2437502 2351157 2269165 2191876
55869B191876p3002p0308o8883o7655o6485o5424o3276n8811n2601m5863l8371
$$ 2191876 2118874 2048566 1979683 1912028 1845543 1780119 1716843 1658032 1605431 1559568 1521197
55858A521197k9456k0344j3436r705q521r572j3039j8093k3037k6958k9983l2161
$$ 1521197 1491741 1471397 1457961 1448256 1439735 1430163 1417124 1399031 1375994 1349036 1319053 1286892
55846A286892l3329l3813l3973l3396l1687k9552k7941k6660k5057k3438k2427
$$ 1286892 1253563 1219750 1185777 1152381 1120694 1091142 1063201 1036541 1011484 988046 965619
55835I65619k1490j9640j7175j5289j4232j3192j1806j0406r121p980p609q506
$$ 965619 944129 924489 907314 892025 877793 864601 852795 842389 833268 825288 817679 809173
55823H09173r821j0254r917j0114j1392j3039j4339j5115j5147j4285j3131j2507
$$ 809173 799352 789098 779181 769067 757675 744636 730297 715182 700035 685750 672619 660112
55811F60112j2254j1611j0565r744r137q148o825n831n186m221k870j851j285
$$ 660112 647858 636247 625682 615938 606801 598653 591828 585997 580811 576590 573720 571869 570584
55798E70584l90J177K582K967K534K044J848J778J670J565J571J553J036k67j674
$$ 570584 570194 571371 573953 576920 579454 581498 583346 585124 586794 588359 589930 591483 592519 592252 590578
55783E90578j899o99L70n73l907q613j3455j7343j9222j8783j7042j5240j3474
$$ 590578 588679 587980 588350 587777 583870 575257 561802 544459 525237 506454 489412 474172 460698
55770D60698j1219q799p165o495o063n489n064m882m568l976l337k746k153j800
$$ 460698 449479 440680 433515 427020 420957 415468 410404 405522 400954 396978 393641 390895 388742 386942
55756C86942j900k064j866j738k435l786m967n824o903q149q740q337p578p019
$$ 386942 385042 382978 381112 379374 376939 373153 368186 362362 355459 347310 338570 330233 322655 315636
55742C15636o477n648m671l804l174k974l282l595l188k067r62l69j73k02m71
$$ 315636 309159 303511 298840 295036 291862 288888 285606 282011 278823 276756 275794 275425 275252 275050 274579
55727B74579p96r46j152j901l085m013m293m084l482k376r69J94Q69J240J456
$$ 274579 273783 272837 271685 269784 266699 262686 258393 254309 250827 248451 247482 247676 248545 249785 251241
55712B51241J535J692K111K505K487K265K255K217J577M63m56j118k078l407m544
$$ 251241 252776 254468 256579 259084 261571 263836 266091 268308 269885 270348 269892 268774 266696 263289 258745
55697B58745n350o241p117p109n871m218l139k817k910l099l054k585k066k038
$$ 258745 253395 247154 240037 232928 227057 222839 219700 216883 213973 210874 207820 205235 203169 201131
55683B01131k226j762n72L77N52O28J295K136K371J982J417P11l58j646k718l274
$$ 201131 198905 197143 196571 196948 197500 198128 199423 201559 203930 205912 207329 208040 207682 206036 203318 200044
55667B00044l110k118o77L63O26O61J079J654J810J582J460J601J750J804J962
$$ 200044 196934 194816 194139 194502 195128 195789 196868 198522 200332 201914 203374 204975 206725 208529 210491
55652B10491K319K693K838K678K434K552L264M106M185L148J576K12p59j463j836
$$ 210491 212810 215503 218341 221019 223453 226005 229269 233375 237560 240708 242284 242496 241737 240274 238438
55637B38438j860j989k766m053n035n065m315l465k926k481j735p83k07l30p77
$$ 238438 236578 234589 231823 227770 222735 217670 213355 209890 206964 204483 202748 201965 201758 201428 200651
55622B00651r53o60K9J084K240K784K298J345P01Q5j409l647n216n172m158l403
$$ 200651 199698 199038 199067 200151 202391 205175 207473 208818 209519 209604 208195 204548 199332 194160 190002 186599
55606A86599l294l500l827m250m474m117l264k467k223k564l059l083k401j489
$$ 186599 183305 179805 175978 171728 167254 163137 159873 157406 155183 152619 149560 146477 144076 142587
55592A42587j003q89n26K20O92M13j86l90p6L64O02N71L31J01J76N53Q56Q88R50
$$ 142587 141584 140695 140169 140389 141081 141494 141308 140918 140842 141206 141808 142379 142710 142811 142987 143540 144396 145284 146234
55573A46234J445K343L281L992M495M977N506N729N056L410J650O65K55n56k095
$$ 146234 147679 150022 153303 157295 161790 166767 172273 178002 183058 186468 188118 188783 189038 188482 186387
55558A86387l621m415m563m432m048l343k518j829j410j391j761k030j662q66
$$ 186387 182766 178351 173788 169356 165308 161965 159447 157618 156208 154817 153056 151026 149364 148498
55544A48498l77k48K07J108J536Q26m33j299j636j773j705j360j135j440j996
$$ 148498 148121 147873 148080 149188 150724 151550 151117 149818 148182 146409 144704 143344 142209 140769 138773
55529A38773k249k101j774j364j001j023j346j161L1J439J861J251O70P31R12
$$ 138773 136524 134423 132649 131285 130284 129261 127915 126754 126785 128224 130085 131336 132006 132737 133649
55514A33649M53o59j791k350k254j899j715j616j142k62L54J45n51r58q17m77
$$ 133649 134102 133443 131652 129302 127048 125149 123434 121818 120676 120414 120768 120913 120362 119404 118587 118110
55498A18110k66k29l30n48q50j241j689j843j237j6R53J005M08j51l33r2N97J429
$$ 118110 117844 117615 117285 116737 115887 114646 112957 111114 109877 109861 110814 111819 112227 112076 111743 111651 112248 113677
55480A13677J613P24o11j382j360j063q57o58l12J62O70J017R81O60M06K50j48
$$ 113677 115290 116014 115403 114021 112661 111598 110741 110083 109771 109933 110603 111620 112601 113261 113667 113917 113769
55463A13769o59n39L73J078P85K18N43J543J912J141k8q68j358j621j652j715
$$ 113769 113110 112571 112944 114022 114807 115025 115568 117111 119023 120164 120136 119268 117910 116289 114637 112922
55447A12922k097k312j529Q9J323J483J127R22O95J85j46K12Q59R44L81j34j38
$$ 112922 110825 108513 106984 107073 108396 109879 111006 111928 112623 112808 112662 112874 113733 114677 115058 114924 114786
55430A14786J18J97M0j27j57j02o9o8l4M6J26K29M46O90O25J06n10p24n12k94
$$ 114786 114904 115101 115141 115014 114857 114755 114686 114618 114584 114630 114756 114985 115431 116121 116746 116852 116342 115618 115106 114812
55410A14812l50m70k83K78Q45R56N68K26M21Q29O20l71j300j402r09m68j86J31
$$ 114812 114462 113992 113709 113987 114832 115788 116356 116582 117003 117832 118452 118081 116781 115379 114470 114002 113816 113947
55392A13947K61j55q40j116q53n44m80m48k50L5K94M70M08Q3j50K5K91J06l67
$$ 113947 114208 114053 113213 112097 111244 110700 110220 109772 109522 109557 109851 110321 110729 110812 110662 110687 110978 111084 110717
55373A10717l83L33J189J473J038K05n45p62l53K30N67Q17J241J418P19m71r49
$$ 110717 110334 110667 111856 113329 114367 114572 114027 113265 112912 113142 113709 114526 115767 117185 117904 117433 116484
55356A16484l03M88M09l16p64n88k05j6j5m9p9j27q3K63Q71J193N96p23j717j736
$$ 116484 116181 116669 117078 116762 115998 115410 115205 115189 115174 115125 115046 114919 114836 115099 115970 117163 117759 117036 115319 113583
55336A13583j366j423j659j278m20m8m08p17n37l94o04n99Q1Q76J020O39L55K66
$$ 113583 112217 110794 109135 107857 107437 107389 106981 106264 105727 105333 104729 104130 104211 105087 106107 106746 107101 107367
55318A07367K0m16o52m46Q7P04J224J616K005K377K251J152m75j438j143k87J55
$$ 107367 107387 106971 106319 105873 105960 106664 107888 109504 111509 113886 116137 117289 116814 115376 114233 113946 114101
55301A14101N9j51l24n00m82j19K12J09j11K75J309K151K038J121K39J01O89J349
$$ 114101 114160 114009 113685 113185 112703 112584 112796 112905 112794 113069 114378 116529 118567 119688 119927 120028 120717 122066
55283A22066J430Q98K22k91p38j176j368j182r09q43q56o57k91j02k51n50o16
$$ 122066 123496 124394 124616 124325 123587 122411 121043 119861 118952 118109 117253 116596 116305 116203 115952 115402 114786
55266A14786k23L84N80R4m09n7R45J401P46j48k79Q8Lo48j048o64J40P63J023
$$ 114786 114563 114947 115527 115621 115212 115155 116100 117501 118247 118099 117820 117908 117911 117263 116215 115551 115691 116454 117477
55247A17477J057J016R27O66P3o32q02q9R26J296Q49K72N1j35p65j631k008j549
$$ 117477 118534 119550 120477 121143 121216 120584 119782 119693 120619 121915 122764 123036 123087 122952 122187 120556 118548 116999
55229A16999o84j51k28n11m30J27P28R39P29L40o5m41o86o50l39J6J70J03P6L23
$$ 116999 116315 116164 115936 115425 114995 115122 115850 116789 117518 117858 117793 117352 116666 116016 115677 115693 115863 115966 116042 116365
55209A16365P35R19O80K48n7j87j92O1O02J010Q42K78p5j9J32K40N32R87J118
$$ 116365 117100 118019 118699 118947 118890 118703 118511 118572 119174 120184 121026 121304 121229 121210 121342 121582 122114 123101 124219
55190A24219O23j30n79n66l26j67k88o01o51j39N03N24j15o73o75l33J32Q15J507
$$ 124219 124842 124712 124133 123567 123241 123074 122786 122185 121534 121395 121898 122422 122307 121634 120959 120626 120758 121573 123080
55171A23080J560Q76K47L13P82J166J537J970K039J625J524K264K973K479J138
$$ 123080 124640 125516 125763 126076 126858 128024 129561 131531 133570 135195 136719 138983 141956 144435 145573
55156A45573M01P35J179R30K67k88p10j040j068q83j035j753k525k784k483j800
$$ 145573 145974 146709 147888 148818 149085 148797 148087 147047 145979 145096 144061 142308 139783 136999 134516 132716
55140A32716q22Q9K65m59j341j588j258q65n30j27J18j09m54k23M81O64j41j077
$$ 132716 131894 131983 132248 131789 130448 128860 127602 126737 126207 126080 126198 126089 125635 125412 125893 126557 126416 125339
55122A25339j101m08J3r9j10J95J82l92o79k0Q15O37l78r66o25j01NM3M11P92
$$ 125339 124238 123830 123843 123744 123634 123829 124011 123619 122940 122920 123735 124372 123994 123028 122403 122302 122307 122350 122761 123553
55102A23553P72M55J08k17l33J08Q76J170P49L26L67L75k0j66M77J133P69k29
$$ 123553 124325 124780 124888 124671 124338 124446 125322 126492 127241 127567 127934 128309 128289 128123 128600 129733 130502 130273
55084A30273n84l7M67L42n3l21n29n84j33O91J146Q57K38j92l70l57r8L00N11
$$ 130273 129689 129652 130119 130461 130408 130087 129558 128974 128841 129532 130678 131535 131773 131581 131211 130854 130756 131056 131567
55065A31567L86Q3k83o44p49l98O7O0m43q94r81q80p09l47J44N01P46J097J304
$$ 131567 131953 132036 131753 131109 130360 129962 130029 130089 129646 128752 127771 126891 126182 125835 125979 126480 127226 128323 129627
55046A29627P54m98j493j413m86M39P37K91n80j211j045k11N82R05R60J064J210
$$ 129627 130381 129883 128390 126977 126491 126930 127667 127958 127378 126167 125122 124911 125493 126398 127358 128422 129632
55029A29632J284J259R94L52l65n63j66J88M0l12l51r3O5k8j40qL78P32P06L20
$$ 129632 130916 132175 133169 133521 133156 132593 132427 132615 132655 132343 131992 131899 131964 131936 131796 131788 132166 132898 133604 133924
55009A33924N0K40N88O25M82O30R43Q24K76J2L02M88P2m42l30K67O26M72J85J48
$$ 133924 133974 134214 134802 135427 135909 136539 137482 138306 138582 138594 138896 139384 139456 139014 138684 138951 139577 140049 140234 140382
54989A40382L53N27L80j78q73j235j086o74k76P8M38Q03J154J365J151M97j5J45
$$ 140382 140735 141262 141642 141464 140591 139356 138270 137596 137320 137398 137836 138639 139793 141158 142309 142806 142791 142936
54971A42936N80M28l15p85n76k67l67o01o97q62j058o41N20J450J353P81O55Q16
$$ 142936 143516 143944 143629 142844 142268 142001 141634 141033 140336 139474 138416 137775 138295 139745 141098 141879 142534 143350
54953A43350N76K20O16J587J878Q88n12j178r14k80J56Q1m30q02m33M64R19L60
$$ 143350 143926 144146 144762 146349 148227 149115 148603 147425 146511 146231 146387 146468 146038 145236 144803 145267 146186 146546
54935A46546o71j223r83l97P2M22R06J538J952J777J189Q77J331K291L123L509
$$ 146546 145875 144652 143669 143272 143344 143766 144672 146210 148162 149939 151128 152005 153336 155627 158750 162259
54919A62259L570L469L335L476M189N278O052N970N114L870K425P39j069k554
$$ 162259 165829 169298 172633 176109 180298 185576 191628 197598 202712 206582 209007 209746 208677 206123
54905B06123l312l464l628m263n118n518n122m228l346k782k599k634k463j711
$$ 206123 202811 199347 195719 191456 186338 180820 175698 171470 168124 165342 162743 160109 157646 155935
54891A55935n77K57L78K3l82p01q98p99l45K48Q64J692K725L440L375K749K187
$$ 155935 155358 155615 155993 156016 155634 154933 154035 153236 152891 153139 154003 155695 158420 161860 165235 167984 170171
54874A70171K079K538L602M990N973O047N515M916M108K545L46j616k748l276
$$ 170171 172250 174788 178390 183380 189353 195400 200915 205831 209939 212484 212830 211214 208466 205190
54860B05190l638l866l880l906m249m777m932m267k961j722j193j419j946k384
$$ 205190 201552 197686 193806 189900 185651 180874 175942 171675 168714 166992 165799 164380 162434 160050
54846A60050k637k617k149j369p74n89l88J95P63O33j65q97j063p92l91L5M06
$$ 160050 157413 154796 152647 151278 150504 149915 149527 149722 150485 151118 150953 150056 148993 148201 147810 147845 148251
54829A48251N68N12M03L96N21P55R59R00N20R6p7l1R5L24O44P73N43K65L46O51
$$ 148251 148819 149331 149734 150130 150651 151406 152365 153265 153785 153881 153804 153773 153868 154192 154836 155609 156152 156417 156763 157414
54809A57414P26M28j8m34o94n91j32K17J20j05k2J32q9l44P2R51J206L98o63j096
$$ 157414 158140 158568 158550 158116 157422 156831 156699 156916 157036 156931 156909 157041 156952 156608 156680 157631 158837 159235 158572 157476
54789A57476r13n44j54K11M05M92P33R28M35p11j412p82O88J759J857J338P95
$$ 157476 156563 156019 155865 156076 156481 156973 157706 158634 159069 158358 156946 156164 156852 158611 160468 161806 162601
54772A62601O65J218K277L181L477L443L613M052M518N015N572N889N715N386
$$ 162601 163266 164484 166761 169942 173419 176862 180475 184527 189045 194060 199632 205521 211236 216622
54758B16622N304N111M096K337O39o64k015l597m766n008m805m986n548n770n296
$$ 216622 221926 227037 231133 233470 234109 233445 231430 227833 223067 218059 213254 208268 202720 196950 191654
54743A91654m512l850l227k386j475r82j154j667j918j591q82k41M9O5J02M15
$$ 191654 187142 183292 180065 177679 176204 175222 174068 172401 170483 168892 168010 167769 167818 167883 167985 168400
54727A68400J012J643J965J833J427J080J062J527K565M024N421O172O139N703
$$ 168400 169412 171055 173020 174853 176280 177360 178422 179949 182514 186538 191959 198131 204270 209973
54713B09973N206M420K847N94j471k637l261m284n840o851o363m925m021m162
$$ 209973 215179 219599 222446 223040 221569 218932 215671 211387 205547 198696 192333 187408 183387 179225
54699A79225m212k957q33N00J70r70j556j286q73p95p40l15K27L59j5n30q49q19
$$ 179225 175013 172056 171223 171723 171893 170923 169367 168081 167208 166413 165673 165358 165585 165944 165929 165399 164550 163731
54681A63731l24N27J115Q22p0n32j03M31J18q14j303q57m3M26M38K47K8q7O5M47
$$ 163731 163407 163934 165049 165871 165801 165269 165166 165597 165715 164901 163598 162741 162698 163124 163562 163809 163837 163750 163815 164262
54661A64262P57Q02O94N62L35L3n8J99M32J98l67o89m81k7K80L46K53L0k37k92
$$ 164262 165019 165821 166515 167077 167412 167445 167387 167586 168018 168216 167849 167160 166679 166652 166932 167278 167531 167561 167324 167032
54641A67032K7M71N92L08L9J59N14O63M57J44n0j65l48o16q97j129j240j200j168
$$ 167032 167059 167530 168122 168430 168469 168628 169142 169805 170262 170406 170356 170191 169843 169227 168330 167201 165961 164761 163593
54622A63593j322j512j356p78j80Q4J16J42R2j23j96K43J037J628J697J340P16
$$ 163593 162271 160759 159403 158625 158445 158529 158645 158787 158879 158756 158560 158803 159840 161468 163165 164505 165221
54605A65221m1o65r07q87q99q67m52K93Q17P19K01k78m24j30M72Q73N20m75j280
$$ 165221 165180 164515 163608 162721 161822 160955 160503 160796 161613 162332 162533 162255 161831 161701 162173 163046 163566 163091 161811
54586A61811j259o30LL80N85O17L69p9m91p28p78o60n07n45p53p33k25M40O45
$$ 161811 160552 159922 159925 160305 160890 161507 161876 161797 161306 160578 159800 159140 158633 158088 157335 156602 156377 156817 157462
54567A57462K39l45n84k91L80J066J323J000M95L89P48J001O72j4m54m17j96j69
$$ 157462 157701 157356 156772 156481 156861 157927 159250 160250 160745 161134 161882 162883 163555 163541 163087 162670 162474 162305
54549A62305m02q22j311j556j034L74J903K452J675K91p86j245j216p90n8O66
$$ 162305 161903 161081 159770 158214 157180 157554 159457 161909 163584 163875 163089 161844 160628 159838 159780 160446
54533A60446J069J156J064P78L40Q3K17M21K97OjK40L54L46N44Q37P24K61J47
$$ 160446 161515 162671 163735 164513 164853 164936 165153 165574 165871 165877 165876 166116 166470 166816 167360 168197 168921 169182 169329
54514A69329O26J003O41j72q09j123j193q33k8O40O18K25J37L00J24l65m16J89
$$ 169329 169955 170958 171599 171427 170618 169495 168302 167469 167441 168081 168699 168924 169061 169361 169485 169120 168704 168893
54496A68893N85m9j254j754r98K00O61J31o36q99o60k86J60P53J209J080M87M5
$$ 168893 169478 169429 168175 166421 165423 165623 166284 166415 165779 164880 164220 163934 164094 164847 166056 167136 167623 167668
54478A67668m5j69m36l23L50Q54N79M1M9L45P3n93m76Q01K036J952P60l54p60
$$ 167668 167623 167454 167018 166695 167045 167899 168478 168519 168568 168913 168986 168393 167917 168718 170754 172706 173466 173112 172352
54459A72352p73q33r30q46n11pN33R38R99O05r7o37n43J10N89K73n14q13k40M87
$$ 172352 171579 170746 169816 168970 168459 168452 168985 169923 170922 171527 171430 170793 170250 170360 170949 171222 170708 169895 169655 170142
54439A70142M92j15m37JO31O10q5o07l32L19M25j70n61j5R22J096L09l81r0P29
$$ 170142 170634 170519 170082 170083 170714 171324 171239 170632 170300 170619 171044 170874 170313 170298 171220 172316 172625 172244 172154 172883
54419A72883J005M82r3m3M32P03N38K27P8M7o3k57l50k76k48m84q38r45o53j72
$$ 172883 173888 174370 174277 174234 174666 175369 175907 176134 176212 176259 176196 175939 175589 175313 175065 174581 173743 172798 172145 171973
54399A71973K76P21J172J347R18L6o78p41k11N62J334J973K266K058J548J170
$$ 171973 172249 172970 174142 175489 176407 176443 175765 175024 174813 175375 176709 178682 180948 183006 184554 185724
54383A85724J108J113Q96M96J41q5k80n37q72j235j418j161n32l0j9k09mO15J091
$$ 185724 186832 187945 188841 189337 189478 189393 189113 188576 187704 186469 185051 183890 183358 183328 183309 183100 183096 183711 184802
54364A84802J099R02P22L54l08p50m06M50R67P64K94L7j61o52j216j178l26O79
$$ 184802 185901 186803 187525 187879 187571 186821 186415 186865 187832 188596 188890 188927 188766 188114 186898 185720 185394 186073
54346A86073R89N84K21L82O10J97p76j496j509j172r60q07n45m73r92j830k175
$$ 186073 187062 187646 187867 188249 188859 189056 188280 186784 185275 184103 183143 182336 181791 181318 180326 178496 176321
54329A76321j639o40J22L47J73m7K0M56R49J106R21P35O87N48K17O7N00J382K169
$$ 176321 174682 174042 174164 174511 174684 174637 174657 175113 176062 177168 178089 178824 179511 180059 180276 180343 180843 182225 184394
54310A84394K476K295J747R59J60l88o25o94o29l57l1n8n62j044r48l83N0Q0J
$$ 184394 186870 189165 190912 191871 192031 191643 191018 190324 189695 189338 189307 189249 188687 187643 186695 186312 186362 186442 186443
54291A86443J38M54P52Q49N00l39j088r40k9M97po96m50M54Q11K78k97k60J56
$$ 186443 186581 187035 187787 188636 189136 188797 187709 186769 186740 187237 187230 186534 186084 186538 187349 187627 187330 187070 187226
54272A87226N90J040J342J103M33l5k20p88j832k381j835r64o29m00N14J614J715
$$ 187226 187816 188856 190198 191301 191734 191699 191479 190691 188859 186478 184643 183679 183050 182650 183164 184778 186493
54255A86493P83r5m47q18j325j161J5J217J368O56L6p9O2L10P90J388J624J148
$$ 186493 187276 187181 186734 185916 184591 183430 183445 184662 186030 186686 186722 186643 186705 187015 187805 189193 190817 191965
54237A91965J50q09j205r19l16P2J6k36k94l9K62K47j55n91o78n48p14j256j515
$$ 191965 192115 191306 190101 189182 188866 188938 188954 188718 188424 188385 188647 188894 188739 188148 187470 186922 186208 184952 183437
54218A83437r80j47P0m12q04o09j61Q6J95L76N07M08K46K93M81N40L54J6k81k49
$$ 183437 182457 182310 182380 181968 181164 180555 180394 180480 180675 181051 181558 181966 182212 182505 182986 183526 183880 183896 183615 183366
54198A83366K69Q78P91j93j212j280n17Q6M8n1M12J183J535J288Q69N52J81l38
$$ 183366 183635 184513 185304 185111 183899 182619 182102 182188 182236 182185 182597 183780 185315 186603 187472 188024 188205 187867
54180A87867p26p64o74p62r24q54n41k16N5L18M08J27k46j67L90P98O52K26o5
$$ 187867 187141 186377 185703 184941 184017 183163 182622 182406 182461 182779 183187 183314 183068 182901 183291 184089 184741 184967 184902
54161A84902k54n06o90n89k92K9M04Q05R78Q01N43M28L53L11O40J359J743J162
$$ 184902 184648 184142 183452 182863 182571 182600 183004 183809 184787 185588 186131 186559 186912 187223 187863 189222 190965 192127
54143A92127K7p46r30r06p52k20N31R21P97N90O09P54R53J258J508J431J135J042
$$ 192127 192154 191408 190478 189572 188820 188600 189131 190052 190849 191439 192048 192802 193755 195013 196521 197952 199087 200129
54125B00129J331J889K646L385L444K389P93l43q27j135j239p28l4k42j335j923
$$ 200129 201460 203349 205995 209380 212824 215213 216006 215663 214836 213701 212462 211734 211700 211458 210123 208200
54109B08200j226k19o6n27p88q76j118j035o4J078J120J44m63p9L68k5p98j016
$$ 208200 206974 206755 206689 206162 205374 204498 203380 202345 202281 203359 204479 204623 204160 204081 204449 204424 203626 202610
54091B02610p43p94j364j670j062K3N60J37o76j114j011o37q9P10J596K161K227
$$ 202610 201867 201073 199709 198039 196977 197000 197560 197697 197021 195907 194896 194259 194170 194880 196476 198637 200864
54074B00864J952J492Q82K96Ml1j31m05o48p45p92p89o76o31q25r11m21L56O56
$$ 200864 202816 204308 205190 205486 205490 205459 205328 204923 204275 203530 202738 201949 201273 200642 199817 198906 198485 198841 199497
54055A99497M95O88J353J481N44m25k34P70J372J219R22Q68R82J396K281L127
$$ 199497 199992 200680 202033 203514 204058 203633 203399 204169 205541 206760 207682 208550 209532 210928 213209 216336
54039B16336L177K659K634L531M634N194N236N004M405L478K812K891L341L404
$$ 216336 219513 222172 224806 228337 232971 238165 243401 248405 252810 256288 259100 261991 265332 268736
54025B68736K910K356K029J593O98k99o21m7P51R86N86k7o73j442k093k182j900
$$ 268736 271646 274002 276031 277624 278322 278023 277402 277355 278106 279092 279678 279651 278978 277536 275443 273261 271361
54008B71361k177l507n141n882n363m169l062k411k180k045j705j182o60k2Q89
$$ 271361 269184 265677 260536 254654 249291 245122 242060 239649 237469 235424 233719 232537 231877 231855 232744
53993B32744J610J387M34jP33J776K110J894J657J048m35k078k581j887j173j107
$$ 232744 234354 235741 236175 236174 236907 238683 240793 242687 244344 245392 244957 242879 240298 238411 237238 236131
53977B36131j287j327j445j726j842j792k026k552k695k018q93Q7O00M35l69j093
$$ 236131 234844 233517 232072 230346 228504 226712 224686 222134 219439 217421 216528 216615 217215 217650 217281 216188
53961B16188q29K64R96P20J16O4N35J033J457J804J726J044L52L07O83P44M15
$$ 216188 215359 215623 216619 217339 217455 217519 218054 219087 220544 222348 224074 225118 225470 225777 226460 227204 227619
53944B27619M33J232K272K643K141J504J609K505L351L321K482J567J157J360
$$ 227619 228052 229284 231556 234199 236340 237844 239453 241958 245309 248630 251112 252679 253836 255196
53930B55196K154L500N124O557P537Q064Q077P474O407N205M018K959K458K862
$$ 255196 257350 260850 265974 272531 280068 288132 296209 303683 310090 315295 319313 322272 324730 327592
53916C27592L704M066L781L631M135M757M704L950L107K660K611K548J895M65
$$ 327592 331296 335362 339143 342774 346909 351666 356370 360320 363427 366087 368698 371246 373141 373606
53902C73606j093j872j813j726k086k497k600k695l053l315l195l173l781m675
$$ 373606 372513 370641 368828 367102 365016 362519 359919 357224 354171 350856 347661 344488 340707 336032
53888C36032n117n022m886m924n010n150n402n507n210m766m530m221l320k061
$$ 336032 330915 325893 321007 316083 311073 305923 300521 295014 289804 285038 280508 276287 272967 270906
53874B70906j305j404j838k146k471k987l398l388l089k716k127j210m36m53j197
$$ 270906 269601 268197 266359 264213 261742 258755 255357 251969 248880 246164 244037 242827 242391 241938 240741
53859B40741j858j806j207n76j14K28L05o5n76n75M4N82M45q9l85l77l93k75M73
$$ 240741 238883 237077 235870 235294 235180 235408 235713 235648 235072 234497 234541 235123 235568 235479 235094 234717 234324 234049 234522
53840B34522J712K537K361J556P97L34J35J74J98k04r76j432j201p82p45q15m35
$$ 234522 236234 238771 241132 242688 243485 243819 243954 244128 244326 244122 243146 241714 240513 239731 238986 238171 237736
53823B37736J96L54p1m48l37N0M13Q09J310J695J724J485J275J300J649K317L130
$$ 237736 237932 238286 238215 237767 237430 237480 237893 238702 240012 241707 243431 244916 246191 247491 249140 251457 254587
53806B54587L745L924L769L634L748L997M035L698L168K716K443K351K528K877
$$ 254587 258332 262256 266025 269659 273407 277404 281439 285137 288305 291021 293464 295815 298343 301220
53792C01220K878K059P06l06n53m47m98o22m53J5L84K64n11j743k818l101k612
$$ 301220 304098 306157 306863 306557 306004 305557 305059 304437 303984 303999 304383 304647 304136 302393 299575 296474 293862
53775B93862k033j935k322k943l569l820l321k383j887k130k309j681p01m60j323
$$ 293862 291829 289894 287572 284629 281060 277240 273919 271536 269649 267519 265210 263529 262828 262368 261045
53760B61045k645l512l304j993l51M73J51m00k29N31J237J754K095J775N45n96
$$ 261045 258400 254888 251584 249591 249240 249713 249864 249464 249235 249766 251003 252757 254852 256627 257172 256576
53744B56576m20O71J021M6j034j013j83M44M93J84k48n73m67R0O83J057J423J910
$$ 256576 256156 256827 257848 257894 256860 255847 255664 256108 256601 256785 256537 255964 255497 255587 256270 257327 258750 260660
53726B60660K235K199K116K336K750L069L247L334L237K893K411J832J086L81
$$ 260660 262895 265094 267210 269546 272296 275365 278612 281946 285183 288076 290487 292319 293405 293786
53712B93786K26P83J546J909J780J449J245J483K323L354L743L156K237J838K096
$$ 293786 294012 294795 296341 298250 300030 301479 302724 304207 306530 309884 313627 316783 319020 320858 322954
53697C22954K559K855K904K740K557K677L105L300K764J729R25P75J035J167Q29
$$ 322954 325513 328368 331272 334012 336569 339246 342351 345651 348415 350144 351069 351844 352879 354046 354875
53682C54875J18m61m50m4qp99j906k364j799p75j62l27q64j029n70n5j61p24r39
$$ 354875 354993 354532 354082 354038 354030 353231 351325 348961 347162 346387 346225 345898 345034 344005 343435 343380 343219 342495 341556
53663C41556n24n6RK5M26Q81P89K30k32m54p19j020r75n20p0J36L32P24J138J397
$$ 341556 341032 340976 340985 341010 341436 342317 343106 343336 343104 342650 341931 340911 339936 339416 339346 339482 339814 340538 341676 343073
53643C43073J716K378L233L715L433K634K044K165K750L166L278L641M629N797
$$ 343073 344789 347167 350400 354115 357548 360182 362226 364391 367141 370307 373585 377226 381855 387652
53629C87652O581P274Q736J1164J3796J5935J7742J9914K2998K7162L2246L7695
$$ 387652 394233 401507 410243 421407 435203 451138 468880 488794 511792 538954 571200 608895
53617F08895M2784M7040N0001N0352M5889L5142J9108J083j5343k8011l6396m0830
$$ 608895 651679 698719 748720 799072 844961 880103 899211 900294 884951 856940 820544 779714
53605G79714m1821l9921l5890l0863k6055k2075j8578j4907j1165q269o804o221
$$ 779714 737893 697972 662082 631219 605164 583089 564511 549604 538439 530170 523366 517145
53593E17145n516m430l540l220l139k889k627k724l102l305l094k616k114j781
$$ 517145 511629 507199 503659 500439 497300 494411 491784 489060 485958 482653 479559 476943 474829 473048
53579D73048j785k082k360k417k576l193l944m126l687l352l532l748l437k826
$$ 473048 471263 469181 466821 464404 461828 458635 454691 450565 446878 443526 439994 436246 432809 429983
53565D29983k508k586k701k627k360j903j381j126j169r78j99N44L49o52j345
$$ 429983 427475 424889 422188 419561 417201 415298 413917 412791 411622 410644 410445 410989 411338 410686 409341
53550D09341j119m85j11Q2M89J097J669K207K774L171L225L215L563M254M900
$$ 409341 408222 407737 407626 407708 408197 409294 410963 413170 415944 419115 422340 425555 429118 433372 438272
53535D38272N301N616O031O537P041P471P805Q170Q824R936J1396J2899J4119
$$ 438272 443573 449189 455220 461757 468798 476269 484074 492244 501068 511004 522400 535299 549418
53522E49418J4764J4779J4644J5124J6345J7488J7726J7279J7038J7441J8333
$$ 549418 564182 578961 593605 608729 625074 642562 660288 677567 694605 712046 730379
53511G30379J9747K2004K4767K6799K7175K6414K5886K6322K7258K7757K7257
$$ 730379 750126 772130 796897 823696 850871 877285 903171 929493 956751 984508 1011765
53500A011765K5878K4260K3075K2530K2313K2133K2063K2185K2325K2421K2827
$$ 1011765 1037643 1061903 1084978 1107508 1129821 1151954 1174017 1196202 1218527 1240948 1263775
53489A263775K3678K4294K3867K2617K1562K1149K0853K0262J9668J9289J8654
$$ 1263775 1287453 1311747 1335614 1358231 1379793 1400942 1421795 1442057 1461725 1481014 1499668
53478A499668J7381J5897J4702J3466J1560R173P056N451M066K855J883M59k414
$$ 1499668 1517049 1532946 1547648 1561114 1572674 1581847 1588903 1594354 1598420 1601275 1603158 1603617 1601203
53465A601203o505j0263j2671j4265j5798j6852j6718j5997j6179j7795j9925
$$ 1601203 1594698 1584435 1571764 1557499 1541701 1524849 1508131 1492134 1475955 1458160 1438235
53454A438235k1515k2390k2857k3091k3222k3447k3720k3711k3231k2450k1495
$$ 1438235 1416720 1394330 1371473 1348382 1325160 1301713 1277993 1254282 1231051 1208601 1187106
53443A187106k0177j8328j6134j4047j2415j1265j0208q748p083o371p498r633
$$ 1187106 1166929 1148601 1132467 1118420 1106005 1094740 1084532 1075784 1068701 1062330 1054832 1045199
53431A045199j0724r756p681n810m064j588J597M604P013R191J1320J3140J4735
$$ 1045199 1034475 1024719 1017038 1011228 1007164 1005576 1007173 1011777 1018790 1027981 1039301 1052441 1067176
53418A067176J6688J9151K1475K3178K4551K5963K7291K8553L0316L2755L4885
$$ 1067176 1083864 1103015 1124490 1147668 1172219 1198182 1225473 1254026 1284342 1317097 1351982
53407A351982L5706L5754L6564L8704M1343M3779M6280M9084N1553N3122N4446
$$ 1351982 1387688 1423442 1460006 1498710 1540053 1583832 1630112 1679196 1730749 1783871 1838317
53396A838317N6737O0173O3595O5784O6576O6783O7345O8555O9876P0587P0730
$$ 1838317 1895054 1955227 2018822 2084606 2151182 2217965 2285310 2353865 2423741 2494328 2565058
53385B565058P1149P2404P4016P5195P6017P7175P8723P9505P7826P2099O1128
$$ 2565058 2636207 2708611 2782627 2857822 2933839 3011014 3089737 3169242 3247068 3319167 3380295
53374C380295M4776K4754M183j4067k8434l8341m3817m5913m6599m7368m8334
$$ 3380295 3425071 3449825 3454008 3439941 3411507 3373166 3329349 3283436 3236837 3189469 3141135
53363C141135m9210n0596n3292n6783n9641o1481o3389o6051o8568o9732o9587
$$ 3141135 3091925 3041329 2988037 2931254 2871613 2810132 2746743 2680692 2612124 2542392 2472805
53352B472805o8915o7781o5658o2701n9863n7681n5807n3968n2644n2351n2712
$$ 2472805 2403890 2336109 2270451 2207750 2147887 2090206 2034399 1980431 1927787 1875436 1822724
53341A822724n2750n1826n0000m7713m5498m3738m2312m0568l7998l4895l1995
$$ 1822724 1769974 1718148 1668148 1620435 1574937 1531199 1488887 1448319 1410321 1375426 1343431
53330A343431k9551k7186k4688k2474k1003k0110j9244j8201j7150j6039j4384
$$ 1343431 1313880 1286694 1262006 1239532 1218529 1198419 1179175 1160974 1143824 1127785 1113401
53319A113401j1912r079o759n404m727m082l008j412N34K530M317N830P161Q344
$$ 1113401 1101489 1092410 1085651 1080247 1075520 1071438 1068430 1067018 1067552 1070082 1074399 1080229 1087390 1095734
53305A095734R277J0003J0942J2522J4582J6385J7448J8172J9449K1663K4337
$$ 1095734 1105011 1115014 1125956 1138478 1153060 1169445 1186893 1205065 1224514 1246177 1270514
53294A270514K6709K8419K9613L0613L1677L2875L3967L4424L3809L2194L0096
$$ 1270514 1297223 1325642 1355255 1385868 1417545 1450420 1484387 1518811 1552620 1584814 1614910
53283A614910K7965K5771K3241K0395J7649J5244J2751R380M980M45l035n118
$$ 1614910 1642875 1668646 1691887 1712282 1729931 1745175 1757926 1767306 1772286 1772731 1769696 1764578
53271A764578o435p769r373j1123j2893j4609j6195j7736j9487k1399k2864k3299
$$ 1764578 1758143 1750374 1741001 1729878 1716985 1702376 1686181 1668445 1648958 1627559 1604695 1581396
53259A581396k2909k2576k2877k3620k4339k4938k5565k6184k6682k7366k8889
$$ 1581396 1558487 1535911 1513034 1489414 1465075 1440137 1414572 1388388 1361706 1334340 1305451
53248A305451l1550l4809l7727l9726m0764m0946m0332l9154l7813l6437l4685
$$ 1305451 1273901 1239092 1201365 1161639 1120875 1079929 1039597 1000443 962630 926193 891508
53237H91508l2285k9611k7384k5902k4855k3906k2990k2024k0758j9098j7321
$$ 891508 859223 829612 802228 776326 751471 727565 704575 682551 661793 642695 625374
53226F25374j5703j4228j2851j1776j1242j1152j1201j1112j0684r870r048q850
$$ 625374 609671 595443 582592 570816 559574 548422 537221 526109 515425 505555 496507 487657
53214D87657r354r749r214p896o642n953n736n820o132o366o142n584n268n482
$$ 487657 478303 468554 459340 451444 444802 438849 433113 427293 421161 414795 408653 403069 397801 392319
53200C92319n932o185n994n215m024l247l676m871n334m257k483j243o79k21J46
$$ 392319 386387 380202 374208 368993 364969 361722 358046 353175 347841 343584 341101 339858 339179 338958 339104
53185C39104j15j028j887k130j832j288o79k74l50p99j071p92k04J59K9m07p15
$$ 339104 338989 337961 336074 333944 332112 330824 330145 329871 329521 328722 327651 326859 326655 326814 326843 326436 325721
53168C25721o46m86p99j647k308k113j355q54p92o56l02l52j181k162k356j601
$$ 325721 325075 324589 323790 322143 319835 317722 316367 315513 314721 314065 313763 313411 312230 310068 307712 306111
53152C06111m88M00Q09O75J40l91o11o97j013j529j818j614j008k41M40P60O44
$$ 306111 305623 306023 306832 307507 307647 307256 306645 305948 304935 303406 301588 299974 298966 298725 299165 299925 300569
53135C00569L90L43L91J89j74j86K76N98K09o01r58l36R26J927J858O51q24j449
$$ 300569 300959 301302 301693 301882 301708 301522 301798 302396 302605 302004 301046 300710 301636 303563 305421 306072 305248 303799
53117C03799r49j08K83L02M08M79M2p22r98m74J48J77j02O6P95J477J628J339
$$ 303799 302850 302742 303025 303327 303735 304214 304256 303534 302536 302062 302210 302387 302285 302351 303146 304623 306251 307590
53099C07590Q90L93j01m12l92j21J64L11L62M03L78J32k77m10J37J089J599J227
$$ 307590 308480 308873 308772 308360 307968 307847 308011 308322 308684 309087 309465 309597 309320 308910 309047 310136 311735 312962
53081C12962N76O83J795L111L725L556L165K922K624J933R73K33m8j39l50n96
$$ 312962 313538 314221 316016 319127 322852 326408 329573 332495 335119 337052 338025 338258 338210 338071 337721 337125
53065C37125o68o64p75p66l16J80j31j314k301k309j932k203l017l346k790k070
$$ 337125 336457 335793 335018 334252 333936 334116 333985 332671 330370 328061 326129 323926 320909 317563 314773 312703
53049C12703j953k313k476j949o60J021K348K671K069J150K33q58k069k768k501
$$ 312703 310750 308437 305961 304012 303352 304373 306721 309392 311461 312611 312844 311986 309917 307149 304648
53034C04648j722j340j683k191k084j149P5P88O18j04p69j007p77j89M34N85R1
$$ 304648 302926 301586 299903 297712 295628 294479 294554 295342 295960 295856 295087 294080 293303 293114 293548 294133 294224
53017B94224n06n06P0N90P17O92P81R44J136J347J297O68k32n86q4Q07J691K784
$$ 294224 293718 293212 293282 293872 294589 295281 296062 297006 298142 299489 300786 301454 301222 300636 300552 301359 303050 305834
52999C05834M214N464N948N753N361N025M787M714M682M230L036J312m81k084
$$ 305834 310048 315512 321460 327213 332574 337599 342386 347100 351782 356012 359048 360360 359879 357795
52985C57795l395m290m722m714m197l237k412k306k587k326j468r57j099q73M22
$$ 357795 354400 350110 345388 340674 336477 333240 330828 328522 325935 323609 322141 321184 320085 319212 319634
52970C19634J880K261J719J208R19N10L30J011K094K393J660P63K18k91r10j308
$$ 319634 321514 323775 325494 326702 327621 328131 328461 329472 331566 333959 335619 336382 336600 336309 335399 334091
52954C34091j541k108k897l120k576k016j926j918j684j531j567j343q53q85j699
$$ 334091 332550 330442 327545 324425 321849 319833 317907 315989 314305 312774 311207 309864 309011 308126 306427
52939C06427k271j702o32l23q78j388j340r80n25M0M93M81J28r2p3l8J9K68M41
$$ 306427 304156 302454 301822 301499 300621 299233 297893 296913 296388 296428 296921 297402 297530 297438 297365 297327 297346 297614 298055
52920B98055J8q85j473j280o69j06M77J234J814J756J165N44N7n61j286j571j058
$$ 298055 298073 297188 295715 294435 293766 293660 294137 295371 297185 298941 300106 300650 300707 300146 298860 297289 296231
52903B96231j53M71P25R75J194Q19k68j226j095J0J060J324R45M76K72L96P22
$$ 296231 296078 296549 297274 298249 299443 300262 299994 298768 297673 297683 298743 300067 301012 301488 301760 302156 302878
52886C02878R64R23P42O81O46L01l73r74j256j421j713j999j998j617r79l01J25
$$ 302878 303842 304765 305507 306188 306834 307135 306762 305788 304532 303111 301398 299399 297401 295784 294805 294504 294629
52869B94629J30j14k56j83n0P5K55L78K00k64o99r15r25o94k34K9l60j085j290
$$ 294629 294759 294645 294389 294206 294156 294231 294486 294864 295064 294800 294101 293186 292261 291567 291333 291362 291002 289917 288627
52850B88627q44n76r26j126m26N37N39m15j037n27M60Q50M83k6l01n13q22r73
$$ 288627 287783 287207 286281 285155 284729 285266 285805 285390 284353 283826 284286 285136 285619 285593 285292 284779 283957 282984
52832B82984o25J93J202K314L620M822N093L901J756k50j597k508l167l318k808
$$ 282984 282359 282552 283754 286068 289688 294510 299603 303504 305260 305010 303413 300905 297738 294420 291612
52817B91612j915r55nP70J043Q74Q43J323K049K711L536M844O466P954Q976R008
$$ 291612 289697 288742 288737 289507 290550 291424 292267 293590 295639 298350 301886 306730 313196 321150 330126 339134
52801C39134P149L030k251o700r031r435q870q113p388o576n550m437l461k601
$$ 339134 346283 349313 347062 340362 331331 321896 313026 304913 297525 290949 285399 280962 277501 274900
52787B74900j664p81l91n07n22r0L08J17l82n37k63J8K41P02J364J738J509Q63
$$ 274900 273236 272455 272064 271557 271035 270945 271253 271370 270988 270451 270188 270206 270447 271149 272513 274251 275760 276623
52769B76623K07r8J34O45P60J23q08j322j345j253j151q81n48l69k08J44L95J46
$$ 276623 276830 276732 276866 277511 278271 278394 277586 276264 274919 273666 272515 271634 271086 270717 270509 270653 271048 271194
52751B71194k91k08L99Q18P21N12N35O92R09J285J528J082N6p06p42n42o24q02
$$ 271194 270903 270695 271094 271912 272633 273145 273680 274372 275281 276566 278094 279176 279232 278526 277784 277242 276618 275816
52733B75816p45o27o38m63K07J062J575J728J724J455P51o6m53l82l02n19r59
$$ 275816 275071 274444 273806 273343 273550 274612 276187 277915 279639 281094 281845 281779 281326 280944 280642 280123 279164
52716B79164j458j908k125j911j256l68M21P47N02J29K53Q25J064M95l81p95o62
$$ 279164 277706 275798 273673 271762 270506 270138 270559 271306 271808 271937 272190 273015 274079 274574 274193 273398 272736
52699B72736l05K57J130J902J917J195M67K48L76N34O84Q49R07Q48Q94J124J306
$$ 272736 272431 272688 273818 275720 277637 278832 279299 279547 279923 280457 281141 281990 282897 283745 284639 285763 287069
52682B87069J251J076R23O95K93q4j19J90N44P65R88J375J735J660J040L34N7
$$ 287069 288320 289396 290319 291014 291307 291223 291104 291294 291838 292603 293591 294966 296701 298361 299401 299735 299792
52665B99792J20k2n25q32m44K98O98P29J018J764K298J977J126O40R00J457J657
$$ 299792 299912 299890 299365 298533 298089 298387 299085 299814 300832 302596 304894 306871 307997 308637 309537 310994 312651
52648C12651J256M30m61j042j102p78m52l76m39l66q5J92J66k33p24q42l06P40
$$ 312651 313907 314337 313876 312834 311732 310954 310502 310126 309687 309321 309236 309428 309594 309361 308637 307795 307489 308229
52630C08229J872K725L111K956K398K019K526L861M863M261K063m61k175l009
$$ 308229 310101 312826 315937 318893 321291 323310 325836 329697 334560 338821 340884 340423 338248 335239
52616C35239l397l369k710j652q08m33k99k64n21j054j332q10L66J490J958J742
$$ 335239 331842 328473 325763 324111 323303 322870 322571 322307 321786 320732 319400 318590 318956 320446 322404 324146
52600C24146J271J052J250J579J602J212P07L85K20L5k05l80l91j92J89N82P80
$$ 324146 325417 326469 327719 329298 330900 332112 332819 333204 333424 333459 333254 332874 332483 332291 332480 333062 333842
52583C33842Q27J048J569K019J911J311P79P57J161J613J788J511Q13L1m37n99
$$ 333842 334669 335717 337286 339305 341216 342527 343306 344063 345224 346837 348625 350136 350949 350980 350543 349944
52567C49944q84j486j930j629p68j97m07r92j298j187r17n46L4O21P90N75N71
$$ 349944 349060 347574 345644 344015 343247 343050 342643 341651 340353 339166 338249 337703 337737 338358 339148 339723 340294
52550C40294J101J667J528P44J80M94J372J903J566P25J79L07P00P30L32N3L35
$$ 340294 341395 343062 344590 345334 345514 346008 347380 349283 350849 351574 351753 352060 352760 353490 353822 353875 354210
52533C54210R80J405J254O46l8l80j80L66P35N38j05p59j105j120q79l97L59J301
$$ 354210 355190 356595 357849 358495 358457 358077 357897 358263 358998 359536 359431 358672 357567 356447 355568 355171 355530 356831
52515C56831K104K280J684Q78P12J369K190K562K649K900L253L258K815K270J795
$$ 356831 358935 361215 362899 363777 364489 365858 368048 370610 373259 376159 379412 382670 385485 387755 389550
52500C89550J145J0j616l396m756n163m655l908l479l101k235j030k09K7K09O59
$$ 389550 390695 390705 389089 385693 380937 375774 371119 367211 363732 360631 358396 357366 357157 357184 357393 358052
52484C58052J029J081J315K233L433L966L453K385J355M76l48r62j062o91l19
$$ 358052 359081 360162 361477 363710 367143 371109 374562 376947 378302 378778 378430 377468 376406 375715 375396
52469C75396l15m60k67K88P16P92R62J631K495L040L309L560L474K475Q16n39
$$ 375396 375081 374621 374354 374642 375358 376150 377112 378743 381238 384278 387587 391147 394621 397096 397912 397373
52453C97373j232j877k887l716l831l638l792m093l860l096k530k531k603k135
$$ 397373 396141 394264 391377 387661 383830 380192 376400 372307 368447 365351 362821 360290 357687 355552
52439C55552j130j15M28L86L5k14j16K50O69R30Q64M34o8k33o6k3l02m29J08J057
$$ 355552 354422 354307 354735 355121 355156 354942 354826 355076 355745 356675 357539 357973 357905 357672 357606 357583 357281 356852 356960 358017
52419C58017J644J529J098Q41P87P43P71J205K149L151L610L569L864N171P125
$$ 358017 359661 361190 362288 363129 363916 364659 365430 366635 368784 371935 375545 379114 382978 388149 395274
52404C95274Q756R737J0548J1323J1221R352N898J854k029n473q202r772r980
$$ 395274 404030 413767 424315 435638 446859 456211 462109 463963 461934 456461 448259 438487 428507
52391D28507r037p386n617m362l872l679l062j907p97k63j98j42J01L47M40O26
$$ 428507 419470 412084 406467 402105 398233 394554 391492 389585 388788 388525 388327 388185 388286 388633 389073 389699
52375C89699J308K467L518L991M132M550N346O002O120N758N001L797K385J346
$$ 389699 391007 393474 396992 400983 405115 409665 415011 421013 427133 432891 437892 441689 444074 445420
52361D45420Q20K07r71k325l183l432l348k945k099j009rQ95J750K234K047J565
$$ 445420 446240 446447 445476 443151 439968 436536 433188 430243 428144 427135 427126 428021 429771 432005 434052 435617
52345D35617J494J997K661L193L619L952M223M690N434N957N777N348N615O752
$$ 435617 437111 439108 441769 444962 448581 452533 456756 461446 466880 472837 478614 483962 489577 496329
52331D96329Q079R242J0586J2243J3623J4281J4553J4939J5368J5619J5913J6525
$$ 496329 504408 513650 524236 536479 550102 564383 578936 593875 609243 624862 640775 657300
52319F57300J7099J6927J5841J4474J3567J3259J3015J2232J0933R893R840J0632
$$ 657300 674399 691326 707167 721641 735208 748467 761482 773714 784647 794540 804380 815012
52307H15012J1449J1731J1531J1016J0181R201Q521Q243P873P006N942N279N067
$$ 815012 826461 838192 849723 860739 870920 880121 888642 896885 904758 911764 917706 922985 928052
52294I28052M706L610J707n86k698m304n422o105o105n261m106l596l980m422
$$ 928052 932758 936368 938075 937489 934791 930487 925065 918960 912855 907594 903488 899892 895912 891490
52280H91490m059l040k085j339l01J302L060M448N395O134O738P080P228P576
$$ 891490 887431 884391 882306 880967 880666 881968 885028 889476 894871 901005 907743 914823 922051 929627
52266I29627Q447R612J0426J0559J0381J0413J0624J0579J0198R863R777R713
$$ 929627 938074 947686 958112 968671 979052 989465 1000089 1010668 1020866 1030729 1040506 1050219
52254A050219R550R619J0204J1072J1724J1899J1537J0544Q924P013N218L660
$$ 1050219 1059769 1069388 1079592 1090664 1102388 1114287 1125824 1136368 1145292 1152305 1157523 1161183
52242A161183K213Q38l33j060j061k56Q77J577J731K185L663N613O697O350N289
$$ 1161183 1163396 1164234 1163901 1162841 1161780 1161524 1162401 1163978 1165709 1167894 1171557 1177170 1183867 1190217 1195506
52227A195506M470M104L956M022M438M964N133M902M762N116N821O475O945P336
$$ 1195506 1199976 1204080 1208036 1212058 1216496 1221460 1226593 1231495 1236257 1241373 1247194 1253669 1260614 1267950
52213A267950P642P699P523P395P604Q217R175J0324J1322J1743J1488J0849J0101
$$ 1267950 1275592 1283291 1290814 1298209 1305813 1314030 1323205 1333529 1344851 1356594 1368082 1378931 1389032
52200A389032R257Q485Q299R015J0154J0892J0905J0429R682Q744P867P274O647
$$ 1389032 1398289 1406774 1415073 1424088 1434242 1445134 1456039 1466468 1476150 1484894 1492761 1500035 1506682
52187A506682N449L782K323J290J10j637l621n470p438r832j2213j3782j4281
$$ 1506682 1512131 1515913 1518236 1519526 1519636 1517999 1514378 1508908 1501470 1491638 1479425 1465643 1451362
52174A451362j4028j3292j2177j0933r905r139q346p255n725l750j577L40J847
$$ 1451362 1437334 1424042 1411865 1400932 1391027 1381888 1373542 1366287 1360562 1356812 1355235 1355575 1357422
52161A357422L288M904O297O947P048P214P451P028N490L337J401m4j292k542
$$ 1357422 1360710 1365614 1371911 1378858 1385906 1393120 1400571 1407599 1413089 1416426 1417827 1417783 1416491 1413949
52147A413949l538l834l319k376j566j132r89j140j857l267n006o569p836q936
$$ 1413949 1410411 1406577 1403258 1400882 1399316 1398184 1397195 1396055 1394198 1390931 1385925 1379356 1371520 1362584
52133A362584r748r915r293q071o440m456k223J50K765N795R068J2122J4758J7289
$$ 1362584 1352836 1342921 1333628 1325557 1319117 1314661 1312438 1312588 1315353 1321148 1330216 1342338 1357096 1374385
52119A374385K0068K3043K5785K7829K8834K8792K8120K7371K6614K5348K3265
$$ 1374385 1394453 1417496 1443281 1471110 1499944 1528736 1556856 1584227 1610841 1636189 1659454
52108A659454K0867J8950J7613J6132J3955J1505R708Q957Q900R213J0027J1301
$$ 1659454 1680321 1699271 1716884 1733016 1746971 1758476 1768184 1777141 1786041 1795254 1805281 1816582
52096A816582J2176J1693J0070Q630Q180Q051P079N095K747K47k907o761j0162
$$ 1816582 1828758 1840451 1850521 1859151 1867331 1875382 1882461 1887556 1890303 1890550 1887643 1880882 1870720
52083A870720j1563j0339p102k959J228N048Q389J1210J3406J4843J5485J5451
$$ 1870720 1859157 1848818 1841716 1838757 1839985 1845033 1853422 1864632 1878038 1892881 1908366 1923817
52071A923817J4983J4435J4216J4602J5536J6648J7399J7251J5888J3526J0880
$$ 1923817 1938800 1953235 1967451 1982053 1997589 2014237 2031636 2048887 2064775 2078301 2089181
52060B089181Q619O883N367L781J963k20k620m594n505n645o230q125j0843j3124
$$ 2089181 2097800 2104683 2110050 2113831 2115794 2115574 2112954 2108360 2102855 2097210 2090980 2082855 2072012 2058888
52046B058888j4390j5188j6229j7386j7981j7766j7188j6603j5700j4058j1873
$$ 2058888 2044498 2029310 2013081 1995695 1977714 1959948 1942760 1926157 1910457 1896399 1884526
52035A884526r622p174l970k65K553L448L084K959L482L575K246j45k434m008
$$ 1884526 1874904 1867730 1863760 1863495 1866048 1869496 1872580 1875539 1879021 1882596 1884842 1884697 1882263 1878255
52021A878255n282p035r447j1824j3210j3353j2914j2615j2455j2076j1566j1334
$$ 1878255 1872973 1865938 1856491 1844667 1831457 1818104 1805190 1792575 1780120 1768044 1756478 1745144
$$ [...]
##END NTUPLES=NMR SPECTRUM
##END=
