##TITLE=AC1512_ROEFFECT0002_8201667_SdSD7zFh7y
##JCAMPDX= 6.0         $$ Bruker NMR JCAMP-DX V2.0
##DATA TYPE= NMR SPECTRUM
##DATA CLASS= NTUPLES
##ORIGIN= BRUKER
##OWNER= Administrator
$$ 1.72 TOPSPIN		Version 2.1
$$ 2013-09-26 18:15:07.952 -0700  Administrator@X
$$ Compression mode = diff/dup
##.OBSERVE FREQUENCY= 400.02188249412
##.OBSERVE NUCLEUS= ^1H
##.ACQUISITION MODE= SIMULTANEOUS (DQD)
##.ACQUISITION SCHEME= undefined
##.AVERAGES= 8
##.DIGITISER RES= 22
##SPECTROMETER/DATA SYSTEM= spect
##.PULSE SEQUENCE= zg30
##.SOLVENT NAME= COFFEE_meoh
##.SHIFT REFERENCE= INTERNAL, COFFEE_meoh, 1, 14.98509
##AUDIT TRAIL= $$ (NUMBER, WHEN, WHO, WHERE, PROCESS, VERSION, WHAT)
$$ ##TITLE= Audit trail, TOPSPIN		Version 2.1
$$ ##JCAMPDX= 5.01
$$ ##ORIGIN= Bruker BioSpin GmbH
$$ ##OWNER= Administrator
$$ $$ E:\/data/COFFEE/nmr/AC1512_ROEFFECT0002_8201667_SdSD7zFh7y/20/pdata/1/auditp.txt
$$ ##AUDIT TRAIL=  $$ (NUMBER, WHEN, WHO, WHERE, PROCESS, VERSION, WHAT)
(   1,<2013-09-26 18:15:01.217 -0700>,<Administrator>,<X>,<go>,<TOPSPIN 2.1>,
      <created by zg
	started at 2013-09-26 18:13:55.545 -0700,
	POWCHK enabled, PULCHK disabled,
       configuration hash MD5:
       C8 4E 4E 5D D3 5C D8 9E 9F 52 82 E0 59 8A DE 15
       data hash MD5: 64K
       9D 2A 97 E8 14 B3 80 88 3A CC 05 F9 85 C0 0B 68>)
(   2,<2013-09-26 18:15:04.201 -0700>,<Administrator>,<X>,<proc1d>,<TOPSPIN 2.1>,
      <Start of raw data processing
       efp LB = 0 FT_mod = 6 PKNL = 1 PHC0 = 0 PHC1 = 0 SI = 32K 
       data hash MD5: 32K
       01 7A 50 4E C9 74 EA 2C 0B 4E D2 B1 69 A3 8A E7>)
(   3,<2013-09-26 18:15:04.513 -0700>,<Administrator>,<X>,<proc1d>,<TOPSPIN 2.1>,
      <pk PHC0 = 93.49915 PHC1 = 0 
       data hash MD5: 32K
       B0 06 D4 95 0F AA 3D 2E 76 87 67 7B D0 EA 3F D5>)
(   4,<2013-09-26 18:15:04.607 -0700>,<Administrator>,<X>,<proc1d>,<TOPSPIN 2.1>,
      <abs ABSG = 1 
       data hash MD5: 32K
       79 07 4E 21 7C 34 91 8F 9B AE D3 50 17 75 DD 2F>)
(   5,<2013-09-26 18:15:04.654 -0700>,<Administrator>,<X>,<proc1d>,<TOPSPIN 2.1>,
      <abs ABSG = 2 
       data hash MD5: 32K
       84 DF B6 A2 55 A2 A0 2E D9 E6 9C 37 7E A2 92 6D>)
(   6,<2013-09-26 18:15:04.717 -0700>,<Administrator>,<X>,<proc1d>,<TOPSPIN 2.1>,
      <abs ABSG = 3 
       data hash MD5: 32K
       75 35 C8 23 39 27 A0 70 1C 91 13 E7 3D B9 E9 78>)
(   7,<2013-09-26 18:15:04.763 -0700>,<Administrator>,<X>,<proc1d>,<TOPSPIN 2.1>,
      <abs ABSG = 4 
       data hash MD5: 32K
       29 1F FE 38 08 F6 27 D4 24 9A D6 3D 70 39 44 0B>)
(   8,<2013-09-26 18:15:04.857 -0700>,<Administrator>,<X>,<proc1d>,<TOPSPIN 2.1>,
      <abs ABSG = 5 
       data hash MD5: 32K
       4B 7C 3A DB 30 9B 5F 8F CB 75 35 76 98 C8 64 C4>)
$$ ##END=
$$ 
$$ $$ hash MD5
$$ $$ D6 70 6C 71 2E 7A 30 1C 30 9A 50 60 8C E5 56 08
##$RELAX= 
##$RELAX= 
##$RELAX= 
##$RELAX= 
##$RELAX= 
##$RELAX= 
##$RELAX= 
$$ Bruker specific parameters
$$ --------------------------
##$DU= <E:\>
##$EXPNO= 20
$$ [...]
##$TP= (0..7)
150 150 150 150 150 150 150 150
##$TP07= 0
##$TPNAME0= <>
##$TPNAME1= <>
##$TPNAME2= <>
##$TPNAME3= <>
##$TPNAME4= <>
##$TPNAME5= <>
##$TPNAME6= <>
##$TPNAME7= <>
##$TPOAL= (0..7)
0.5 0.5 0.5 0.5 0.5 0.5 0.5 0.5
##$TPOFFS= (0..7)
0 0 0 0 0 0 0 0
##$TUNHIN= 0
##$TUNHOUT= 0
##$TUNXOUT= 0
##$USERA1= <user>
##$USERA2= <user>
##$USERA3= <user>
##$USERA4= <user>
##$USERA5= <user>
##$V9= 5
##$VALIST= <valist>
##$VCLIST= <CCCCCCCCCCCCCCC>
##$VD= 0
##$VDLIST= <DDDDDDDDDDDDDDD>
##$VPLIST= <PPPPPPPPPPPPPPP>
##$VTLIST= <TTTTTTTTTTTTTTT>
##$WBST= 1024
##$WBSW= 4
##$XGAIN= (0..3)
0 0 0 0
##$XL= 0
##$YL= 0
##$YMAX_a= 641331
##$YMIN_a= -543288
##$ZGOPTNS= <>
##$ZL1= 120
##$ZL2= 120
##$ZL3= 120
##$ZL4= 120
##$ABSF1= 14.98509
##$ABSF2= -5.573092
##$ABSG= 5
##$ABSL= 3
##$ALPHA= 0
##$AQORDER= 0
##$ASSFAC= 0
##$ASSFACI= 0
##$ASSFACX= 0
##$ASSWID= 0
##$AUNMP= <proc_prof1d_extract_pilot.lims>
##$AXLEFT= 0
##$AXNAME= <>
##$AXNUC= <1H>
##$AXRIGHT= 0
##$AXTYPE= 0
##$AXUNIT= <>
##$AZFE= 0.1
##$AZFW= 0.1
##$BCFW= 0
##$BC_mod= 0
##$BYTORDP= 0
##$COROFFS= 0
##$CY= 15
##$DATMOD= 1
##$DC= 0
##$DFILT= <>
##$DTYPP= 0
##$F1P= 0
##$F2P= 0
##$FCOR= 0.5
##$FTSIZE= 32768
##$FT_mod= 6
##$GAMMA= 0
##$GB= 0
##$INTBC= 1
##$INTSCL= 1
##$ISEN= 128
##$LB= 0
##$LEV0= 0
##$LPBIN= 0
##$MAXI= 10000
##$MC2= 0
##$MEAN= 0
##$ME_mod= 0
##$MI= 0
##$NCOEF= 0
##$NC_proc= -8
##$NLEV= 6
##$NOISF1= 0
##$NOISF2= 0
##$NSP= 0
##$NTH_PI= 0
##$NZP= 0
##$OFFSET= 14.98509
##$PC= 1
##$PHC0= 93.49915
##$PHC1= 0
##$PH_mod= 1
##$PKNL= yes
##$PPARMOD= 0
##$PPDIAG= 0
##$PPIPTYP= 0
##$PPMPNUM= 2147483647
##$PPRESOL= 1
##$PSCAL= 4
##$PSIGN= 0
##$PYNMP= <proc.py>
##$REVERSE= no
##$SF= 400.02
##$SI= 32768
##$SIGF1= 0
##$SIGF2= 0
##$SINO= 400
##$SIOLD= 32768
##$SPECTYP= <>
##$SREGLST= <1H.CDCl3>
##$SSB= 0
##$STSI= 32768
##$STSR= 0
##$SW_p= 8223.68421052631
##$SYMM= 0
##$S_DEV= 0
##$TDeff= 65536
##$TDoff= 0
##$TI= <>
##$TILT= no
##$TM1= 0
##$TM2= 0
##$TOPLEV= 0
##$USERP1= <user>
##$USERP2= <user>
##$USERP3= <user>
##$USERP4= <user>
##$USERP5= <user>
##$WDW= 1
##$XDIM= 32768
##$YMAX_p= 478609765
##$YMIN_p= -872480
##$CURPLOT= <Network HP LaserJet P1505>
##$CURPRIN= <$Network HP LaserJet P1505>
##$DFORMAT= <normdp>
##$LAYOUT= <+/1D_H.xwp>
##$LFORMAT= <normlp>
##$PFORMAT= <normpl>
##$SURQMSG= 1
$$ End of Bruker specific parameters
$$ ---------------------------------
##NTUPLES= NMR SPECTRUM
##VAR_NAME=  FREQUENCY,     SPECTRUM/REAL,   SPECTRUM/IMAG
##SYMBOL=    X,             R,               I
##VAR_TYPE=  INDEPENDENT,   DEPENDENT,       DEPENDENT
##VAR_FORM=  AFFN,          ASDF,            ASDF
##VAR_DIM=   32768,         32768,           32768
##UNITS=     HZ,            ARBITRARY UNITS, ARBITRARY UNITS
##FACTOR=    0.250966925370066, 1,           1
##FIRST=     8223.43324360094, -57311,       -119824
##LAST=      0,             -92341,          -8700
##MIN=       0,             -872480,         0
##MAX=       8223.43324360094, 478609765,    0
$$ Real data points
##PAGE= N=1
##DATA TABLE= (X++(R..R)), XYDATA
$$ [...]
19542i6619D73504H1927i2675c0826k3432q3242l21009H8159g6874j8541j33650
19531b29065A07235i6586G2377J29181a03680Q305B49723G5858c28777A7607a73731
19519b72049C35474a95789A13843D0547j1005K9072e1057A40613a1345j53609
19509a64954K5836M2017k14457H0531J03309E615e744C9260N5294J4147a96296
19497b8448A37555a74686A4623a24621a2960A01285b76826A10166c76662A18365
19486C8946b93768b6871G8419c84845h8651i824k0772A20666J47762e2593B06219
19474d2806j17412B6443K4667a22617B5467b40368G6054a0147k52924j12716G1
19462a32713F3728a35126j4802N8663H6379j7057m730h2028D8360c9676H5074
$$ plain form
19542 -96619 473504 81927 -92675 -30826 -54258 -137500 -458509 88159 -76874 -95415 -229065
19531 -229065 107235 -96586 72377 201558 -103680 -95375 249723 75858 -328777 17607 -173731
19519 -272049 335474 -195789 113843 40547 29542 58614 -51057 140613 -11345 -164954
19509 -164954 -139118 -97101 -311558 80531 183840 5615 -5744 39260 94554 108701 -196296
19497 -28448 137555 -174686 14623 -124621 -12960 101285 -276826 110166 -376662 118365
19486 38946 -293768 -26871 78419 -384845 -88651 -9824 -30596 120666 268428 -52593 206219
19474 -42806 -160218 26443 51110 -122617 25467 -240368 76054 -10147 -263071 -375787 71
19462 -132713 63728 -135126 -149928 -91265 86379 69322 64592 -82028 48360 -39676 85074
19450c46701f8117a860p6113m5525J2715L4862A33196i1763j9426C2923J71205
19439B04128M913E2228d28069J22411J45449B024b24548B6505e1547q5188J6400
19428a20335j22545a0905j59676O3422k2650d2677j41538L4473K7072j03536i4595
19416a9618l4343j9337B08297b9491B15523e09054I4254L2485D8398c0649k51918
19405b82567a27273k75114J94492J6904F0528b96408B291O289b05544B4321Q0199
19394A04520a75603B15099c23067B9406K8162J01505c54446a03205a5997j0130
19384b6127G2424l702e5706j70965m5602e5891K5289l62975B2596g2034A0814
19372b4862j3854J5598B29764a03618C6137a77844q2880k045a04416k34227C13495
$$ plain form
19450 -346701 -68117 -1860 -77973 -123498 -110783 -75921 133196 -91763 -111189 32923 204128
19439 204128 209041 52228 -428069 -305658 -160209 2024 -224548 26505 -51547 -136735 -120335
19428 -120335 -242880 -10905 -170581 -107159 -129809 -42677 -184215 -149742 -122670 -226206 -94595
19416 -19618 -53961 -73298 208297 -29491 215523 -509054 94254 126739 48398 -30649 -282567
19405 -282567 -127273 -402387 -207895 -190991 60528 -296408 2291 8580 -205544 24321 104520
19394 104520 -175603 215099 -323067 29406 57568 159073 -354446 -103205 -15997 -26127
19384 -26127 72424 68722 -55706 -226671 -272273 -55891 -30602 -393577 22596 -72034 10814
19372 -24862 -38716 -23118 229764 -103618 36137 -177844 -260724 -262769 -104416 -338643 313495
19360A06707a64964j51738A49492c74597a962G7697a31225j2358O0157a3335j82444
19349a95779N9440A94625a10530C03811a96741A20731a8620k72961a00838A31394
19338a45536I5491f4869A57789a00605l87483a09176l8046A11161f8053A37187
19327A08426b56322H9035b0206l50355d3984A68510J01137g9849q3791j92927
19317c56567A77037d9828l5759B4159b24408L8431j22174A29010E8995j3638c5966
19305b40209J7829A8832i469j84577G8056R2764e03931h2647A4487a73154A32738
19293a22602A83169e3552k1120j58659b3012q9011I0452J5762a89877O7669L7094
19282h5114A65249a76124K7944b2276k50506A21553J482J6041C9790b70006A38528
$$ plain form
19360 106707 -164964 -316702 149492 -374597 -1962 77697 -131225 -143583 -83426 -13335 -195779
19349 -195779 -136339 194625 -110530 303811 -196741 120731 -18620 -291581 -100838 131394
19338 -145536 95491 -64869 157789 -100605 -488088 -109176 -147222 111161 -68053 137187
19327 108426 -256322 89035 -20206 -370561 -43984 168510 269647 -79849 -163640 -356567
19317 -356567 177037 -49828 -85587 24159 -224408 -185977 -308151 129010 58995 45357 -35966
19305 -240209 -222380 18832 -9469 -194046 78056 170820 -503931 -82647 14487 -173154 132738
19293 -122602 183169 -53552 -74672 -233331 -23012 -112023 90452 106214 -189877 -122208 -85114
19282 -85114 165249 -176124 -148180 -22276 -272782 121553 123035 139076 39790 -270006 138528
19270c23561A70161e48017a55985F8480b29023a7921A04246a30787o7139j71409
19260c69335O9526g573C3132N3349f8452j59629E3948M428b0266G2481k0969d07937
19247a36023D4737K70399i8752j22420i1793k388B87995f1844q2635A32711L2197
19236A64908O8142g4781j08793b5202A44488N8562D5203M7631A89L04717A07937
19224f5176k5141C69849A26031p705a88059k4482C70143D3831j3841g4992p5026
19213a50018C53002a58719J251N2450c2649F1592K1287D659J80388p1418k0218
19202I3411g6169j62919P219C03005C3648a87853P6023J2668l10848a53269j68348
19191c21617A30647J5336I069L7970j6250J26758j0343R3219I9700a66574O0368
$$ plain form
19270 -323561 170161 -548017 -155985 68480 -229023 -17921 104246 -130787 -197926 -369335
19260 -369335 -299809 -7573 33132 86481 -68452 -228081 53948 58376 -20266 72481 51512 -407937
19247 -136023 44737 315136 -98752 -221172 -91793 -94181 287995 -61844 -144479 132711 164908
19236 164908 233050 -74781 -183574 -25202 144488 203050 45203 92834 189 304906 107937
19224 -65176 -90317 369849 126031 118326 -188059 -212541 370143 43831 29990 -74992 -150018
19213 -150018 353002 -158719 -157468 -105018 -32649 61592 82879 4659 185047 113629 93411
19202 93411 -76169 -239088 -231869 303005 33648 -187853 -111830 -99162 -410010 -153269 -321617
19191 -321617 130647 145983 9069 47039 30789 157547 147204 240423 99700 -166574 -106206
19180a06206m27974O2024O0771i2619c4257E16666b76465B2572c42360B8393a40444
19168c93808g6364O291C7987i7083k85006A07564b53430C0399L8008b5365j34018
19157a59383f7677r0473B53394a4681m242k25167k44357C9701b00985g4741k77897
19146c52638R4590C10358A13121A5864a95887g1823b1347A26123d5602j05158
19136a50760B73578a03600J6989A4941J42861L23152C02P3206L4665J0961g4442
19124C4944c67900d9295k55529C80882b71422A32668a13269r7934R6841c3018
19113C14549f5956p6480A33164J034A0581b12299G8115J95289p6613E1682K0968
19102G2650a78540A52211E1670b0231j42461B4347c4205G806L7480c75405D8155
$$ plain form
19180 -106206 -534180 -472156 -411385 -92619 -34257 516666 -276465 22572 -342360 28393 -140444
19168 -393808 -76364 -70073 37987 -97083 -382089 107564 -253430 30399 68407 -25365 -159383
19157 -159383 -67677 -158150 253394 -14681 -18923 -244090 -488447 39701 -200985 -74741 -352638
19146 -352638 -258048 310358 113121 15864 -195887 -71823 -21347 126123 -45602 -150760
19136 -150760 273578 -103600 -86611 14941 157802 480954 302 73508 108173 119134 -74442
19124 34944 -367900 -49295 -304824 380882 -271422 132668 -113269 -211203 -114362 -33018
19113 314549 -65956 -142436 133164 134198 10581 -212299 78115 273404 196791 51682 72650
19102 72650 -178540 152211 51670 -20231 -162692 24347 -34205 7806 45286 -375405 48155
19090A67500c51375J46664G5629a49118B11974b25975o9088a23798j04593B4968
19079a73335B08028f9258E993b79826a34287F1384B8536a88304m2784A33470a92059
19067A12666f9149l94957a8708j37575m164F0794L0601a18663M8787C6681K22602
19056B59283p3477a39424I0209h4142j77180A90926c8755k12875G8120L2501I106
19044b86312a01196d7169p3092c6356k89580Q1826A47793b85665H3451f4061j50132
19033b14193C28746m0566h6805c182B32K86969a13411r2025P6574j50941B73921
19021I6493a05109k21094C41869A05937a42587C13467a20159G7484K1068i0590
19010A93352e8845A37774b39942g6270A40167c50056M4220m8070J71461M3367
$$ plain form
19090 167500 -351375 -204711 75629 -149118 211974 -225975 -295063 -123798 -228391 24968
19079 -173335 208028 -69258 5993 -279826 -134287 61384 28536 -188304 -231088 133470 -192059
19067 112666 -69149 -464106 -18708 -156283 -160447 60794 91395 -118663 -69876 36681 259283
19056 259283 185806 -139424 90209 -84142 -261322 190926 -38755 -251630 78120 110621 9106
19044 -286312 -101196 -47169 -120261 -36356 -325936 -244110 147793 -285665 83451 -64061 -214193
19033 -214193 328746 288180 -86805 -3182 232 287201 -113411 -205436 -128862 -279803 273921
19021 96493 -105109 -326203 341869 105937 -142587 313467 -120159 77484 98552 -90590
19010 193352 -58845 137774 -239942 -76270 140167 -350056 -305836 -353906 -182445 -139078
19000a39078A13293J6480f1324B6581J97782e8355a9357j54522J9164E6475a04538
18988B08151a39443K3854j32606e2425k84716A48414O3593r5188m7724k3913J03165
18977A48347h1473j76483i4396B3700i8434k04442F1821J08586B4798a38742o6732
18966b05474L1215A96173a05151A73777E9705e5746J9800O286q1139L6141j08625
18955a83283H438c19908a07117C84364F6968A8167b35374c3830j56855r5435a02452
18943a8430A61900a00770A81548J2334B1185K2106J26341H2360h1980k44211B29948
18931A20921j2495l7351a04600k459K9068A29268g5952P043p2555f572o7652J9719
18919e4505k5535o4810j03801A88775R5796j00860E5579f8269l1927B82993a71154
$$ plain form
19000 -139078 113293 129773 -61324 26581 224363 -58355 -19357 -173879 -154715 56475 -104538
18988 208151 -139443 -115589 -248195 -52425 -337141 148414 212007 116819 69095 45182 148347
18977 148347 -81473 -257956 -94396 23700 -98434 -302876 61821 170407 24798 -138742 -205474
18966 -205474 -174259 196173 -105151 173777 59705 -55746 -35946 -29660 -110799 -74658 -183283
18955 -183283 8438 -319908 -107117 384364 66968 18167 -235374 -33830 -190685 -286120 -102452
18943 -18430 161900 -100770 181548 193882 21185 43291 169632 82360 -81980 -326191 229948
18931 120921 108426 71075 -104600 -107059 -77991 129268 -75952 -68909 -141464 -6572 -74224 -54505
18919 -54505 -80040 -144850 -248651 188775 284571 183711 55579 -68269 -100196 282993 -171154
18907d6625B91316m2029I3464D0367a65531k4230B51007b51847F1172h3217A16672
18895a9156l5441A27124c08467J13419j72086E5659J22963b17609A38477a70524
18884e8192J3878j9771A5344b61628c1463A09015a70602p0684E7892a23568G2409
18872a46929A55325a05907a6839h386F810b52374P4994K4854O9036B0764a24185
18860D5012f6330D3501h7752j90937G6144a21400J4061I5263d3769C8146a12452
18848a02592l5332A4292a34388n6099q7830J09361C0854a85440Q8053b5777m2182
18837f7959F5739a84399A03661g4734o1859I9847c88957e1991A67452F7044c14297
18825f6227A07316a10400l3831K9054j65167J32681B1979l536K73497a22819A46359
$$ plain form
18907 -46625 291316 249287 93464 40367 -165531 -189761 251007 -251847 61172 -83217 116672
18895 -19156 -54597 127124 -308467 -195048 -367134 55659 178622 -217609 138477 -170524
18884 -58192 -44314 -64085 15344 -261628 -31463 109015 -170602 -241286 57892 -123568 72409
18872 -146929 155325 -105907 -16839 -8386 6810 -252374 -177380 -152526 -83490 20764 -124185
18860 45012 -66330 43501 -87752 -278689 76144 -121400 -107339 95263 -43769 38146 -112452
18848 -102592 -137924 14292 -134388 -190487 -278317 -168956 30854 -185440 -97387 -25777 -67959
18837 -67959 65739 -184399 103661 -74734 -136593 99847 -388957 -51991 167452 67044 -314297
18825 -66227 107316 -110400 -144231 -115177 -280344 -147663 21979 18443 291940 -122819 146359
18813a15502k28701B56413J60823j98405j08524m9431a28172A22232a69348j00940
18803b70288A6057b53040B8440a6432k21723J08312j36604d7623A18376M3949
18793A62325G2182b37231b9290r0572A56657d74791g2621D3500c80365g0651K6179
18782d4472C39959M9511b6950I1851j9517c57748a73158A29248c16071J41962
18772a74109o9880H8647f990j70334j57686a28772a2118k91004B2110b27015Q5474
18761a41541E5752K7962B8334i7913c395A94451Q1012j15080J0176b48146D0310
18749D1795J90750a45374E3874a84565F5410p282e8697B28403e8621n5608D3047
18737d07858J03551i9232p8990f1012A2068h7903A634K20662a08446m930l223
$$ plain form
18813 -115502 -344203 256413 417236 218831 110307 60876 -128172 122232 -169348 -270288
18803 -270288 16057 -253040 28440 -16432 -238155 -129843 -266447 -47623 118376 162325
18793 162325 72182 -237231 -29290 -119862 156657 -474791 -72621 43500 -380365 -70651 -44472
18782 -44472 339959 389470 -26950 91851 72334 -357748 -173158 129248 -316071 -174109
18772 -174109 -243989 88647 -6990 -177324 -335010 -128772 -12118 -303122 22110 -227015 -141541
18761 -141541 55752 83714 28334 -97913 -3395 194451 275463 160383 170559 -248146 40310
18749 41795 232545 -145374 53874 -184565 65410 58128 -58697 228403 -58621 -114229 43047
18737 -407858 -304307 -99232 -178222 -61012 12068 -87903 1634 222296 -108446 -113376 -116599
18726a16599j52125a08379B1877b07881N3946N9083G0857C274a50148j94853J29743
18715b15258K6738g2182j98288F0797e3596p9021m5882m11j63167a53551B91101
18703A9858J35846f1254o5962F5108a18573A15755B4163Q3024c9619A2790J7126
18692B9916a57720A15045b61267c7449I3431D3383b97269B62769E7421a4329D23549
18680a82710j13276k2434g1199k43666c4981I617a04681k46186H4768a83422G6561
18668B71452b21752h0012C3245e83311E52925B5848e8785j85A65183a23946F9405
18656b4029A15707B8213K07258a25212j7499b6733j39082B8898J40855J59442
18646C29195g2930A07119j0602a24386C15937H9544P5022J5699i1363L6123j85142
$$ plain form
18726 -116599 -268724 -108379 21877 -207881 -153935 -94852 70857 3274 -150148 -345001 -215258
18715 -215258 -188520 -72182 -270470 60797 -53596 -132617 -178499 -178910 -342077 -153551 291101
18703 19858 155704 -61254 -127216 65108 -118573 115755 24163 107187 -39619 12790 29916
18692 29916 -157720 115045 -261267 -37449 93431 43383 -297269 262769 57421 -14329 423549
18680 -182710 -295986 -318420 -71199 -314865 -34981 9617 -104681 -350867 84768 -183422 76561
18668 271452 -221752 -80012 33245 -583311 552925 25848 -58785 -58970 165183 -123946 69405
18656 -24029 115707 28213 235471 -125212 -142711 -26733 -165815 28898 169753 329195
18646 329195 -72930 107119 96517 -124386 315937 89544 164566 180265 -91363 -55240 -240382
18635b40382B42933c62586a7842H6045a52058C3249J11698C1551c38838g5940
18624a55979f0142j85249F0925R6186b22922A36363c82823a69505M9610k2217
18614a42112N484J7009B0619b58402J01676M9748A92083B4814e02905c124l18441
18603c21565I529b05704G9279c33851A39419C4910d76761c4120q76j34135e6335
18591a23761A20026b19929F9217b50465G2464K19279A9032Q8269J43202a50239
18580F4105R7089Q7054q9819c24066g4682B3153Q6948a13872h972j20106D1742
18568B04022b28896e1821k45272A26453b30279i2455o2850f7698k21442E7919
18557b43703b6854k82033D9734d9134r8283B7680a21272j95233C1094c72368d4976
$$ plain form
18635 -240382 242933 -362586 -17842 86045 -152058 33249 144947 31551 -338838 -75940
18624 -155979 -60142 -245391 60925 157111 -222922 136363 -382823 -169505 -119895 -142112
18614 -142112 -136628 -119619 20619 -258402 -156726 -106978 192083 24814 -502905 -3124 -321565
18603 -321565 9529 -205704 79279 -333851 139419 34910 -476761 -34120 -34996 -169131 -56335
18591 -123761 120026 -219929 69217 -250465 72464 291743 19032 107301 250503 -150239
18580 64105 161194 248248 158429 -324066 -74682 23153 110101 -113872 -8972 -129078 41742
18568 204022 -228896 -51821 -297093 126453 -230279 -92455 -155305 -67698 -289140 57919
18557 -243703 -26854 -308887 49734 -49134 -147417 27680 -121272 -316505 31094 -372368 -44976
18545B75921d3227C7651a29812A27460b9682B12383p0776B6028J63445a94626
18534H7829c85080A64754b75121A09781b01728b8572N554h479D1697J54235G4279
18522I5858K073c7124F2800J52223b89801h6834A79282o6501P5914b50976a08300
18510d8041b2270p3825n7995A60645B8664L0622f1048j4163K2465n3410L4245
18499g1911j12717B09048i8252F9515b82521j30084A73117a65426f1343j57771
18489b19114I7175B2579a00565A15714b11405C76682b75151J07455a1152M797
18479f355B18333B436Q5477c65650N7638j73956c8850D4304O5620J81916G7413
18467b03817d278m7492E9918g9611k4740A23442n9705b12715a1719l11446A55485
$$ plain form
18545 275921 -43227 37651 -129812 127460 -29682 212383 141607 26028 189473 -194626
18534 87829 -385080 164754 -275121 109781 -201728 -28572 -23018 -8479 41697 195932 74279
18522 95858 97931 -37124 62800 215023 -289801 -86834 179282 112781 188695 -250976 -108300
18510 -48041 -22270 -96095 -154090 160645 28664 59286 -61048 -75211 -52746 -106156 -71911
18499 -71911 -184628 209048 -98252 69515 -282521 -412605 173117 -165426 -61343 -219114
18489 -219114 97175 22579 -100565 115714 -211405 376682 -275151 -167696 -11152 -6355
18479 -6355 218333 2436 87913 -365650 -308012 -481968 -38850 44304 109924 291840 77413
18467 -203817 -4278 -51770 59918 -79611 -104351 123442 63737 -212715 -11719 -323165 155485
18455b96335O8759g7274p3833b6918A26067c1094k21428M9535p4574A90688M9491
18444B40179b97642A46102a24762e8136A63259b52189A37732d0386D8860q261
18434D0599Q1747M0324A4539M4766B8924f01030C8643a45288m4145L2332D1191
18422C1958a02347M7919C4468h2499j31856L8917k17359a08386c426j15212B56941
18410a6406A31398a17755B5510Q4765K40824a08918E6846e8603k881B35766D1603
18398a97947N2100A20577f5193q1679c7215m15906a07993p926k92387a31571A15195
18386a3079I3657f9194D3954A4245Q3113a76763B29031a69545o5523d0650J0278
18375c0372E1565a32963A52469e9717j95906G5117J1239b70485J04597A94753
$$ plain form
18455 -296335 -227576 -77274 -151107 -26918 126067 -31094 -252522 -202987 -277561 190688 240179
18444 240179 -297642 146102 -124762 -58136 163259 -252189 137732 -40386 48860 40599
18434 40599 122346 162670 14539 59305 28924 -601030 38643 -145288 -189433 -157101 41191
18422 31958 -102347 -54428 34468 -82499 -214355 -175438 -392797 -108386 -3426 -118638 256941
18410 -16406 131398 -117755 25510 110275 351099 -108918 56846 -58603 -61484 235766 41603
18398 -197947 -145847 120577 -65193 -146872 -37215 -453121 -107993 -115919 -408306 -131571 115195
18386 -13079 93657 -69194 43954 14245 97358 -176763 229031 -169545 -235068 -40650 -30372
18375 -30372 51565 -132963 152469 -59717 -255623 75117 86356 -270485 -165888 194753
18364b9454C23638a20708A46632J29578j4308G5724h2068B96420a39088D2750
18353c53680b3047C03521d83161a38885e2403j13320D4106a65214e1363B9575
18342a38656p0467R6937l26707f4427C14445H566b2379B28411b89768B9095M7440
18331G6535f588a809j14073p4609j8160I8337R8465m8193a42833j1575A08309
18319b1766b687B49044d4151A49870M1936a37293N4994O008J244k32076a42517
18307D1337A0292N0073P8541a55971B41450a37701L9882B5701d1642G1631c8829
18295a77200A64217g4102b0768r0445D6554a6506C3552a0376r9734b8333j02597
18284a30930K0869k8553f2582A18409l423b57594E9538P4082B5345d21651B0994
$$ plain form
18364 -29454 323638 -120708 146632 276210 261902 75724 -82068 296420 -139088 42750
18353 -353680 -23047 303521 -483161 -138885 -52403 -165723 44106 -165214 -51363 29575
18342 -138656 -209123 -112186 -438893 -64427 314445 8566 -22379 228411 -289768 29095 76535
18331 76535 -6588 -1809 -115882 -190491 -208651 98337 196802 148609 -142833 -154408 108309
18319 -21766 -2687 249044 -44151 149870 191806 -137293 -82299 -76291 -75047 -307123 -142517
18307 41337 10292 60365 138906 -155971 241450 -137701 -97819 25701 -41642 71631 -38829
18295 -177200 164217 -74102 -20768 -111213 46554 -16506 33552 -10376 -110110 -28333 -130930
18284 -130930 -110061 -138614 -62582 118409 114986 -257594 59538 133620 25345 -421651 20994
18272h1925E23553i9811A09844J1131a35866o4923G1962J42571h1829E8790c6553
18260G1951b3485A52774D5263c14690r5009d2320A59022e7992A78997G2415b06237
18248B17444F4402a21124A97844J7500B4959b40064e5722a6904B7134a04736L408
18237a01328E2059J60853b03885k48A7205e5064C8652a96251o5653q5172A31828
18225a1183j58045p6409F0190b02945P9119b8234k48474i8464c8697R438m8232
18214g7491k7571p6303A93323H7074h7758L3857A77840J53015a39286j85149J4915
18203c09520i2482A33663e4683k43329A002J70174b4737j49060C50483A5903N6565
18192G2468J3616K64566a90769k4228N026A36264J25243m3345c79891h7482j82781
$$ plain form
18272 -81925 523553 -99811 109844 120975 -135866 -200789 71962 214533 -81829 58790 -36553
18260 71951 -23485 152774 45263 -314690 -409699 -42320 159022 -57992 178997 72415 -206237
18248 217444 64402 -121124 197844 215344 24959 -240064 -55722 -16904 27134 -104736 -101328
18237 -101328 52059 212912 -203885 -204133 17205 -55064 38652 -196251 -261904 -347076 131828
18225 -11183 -169228 -245637 60190 -202945 -123826 -28234 -276708 -98464 -38697 -29259 -77491
18214 -77491 -105062 -181365 193323 87074 -87758 -53901 177840 330855 -139286 -324435 -309520
18203 -309520 -92482 133663 -54683 -298012 1002 171176 -24737 -173797 350483 15903 72468
18192 72468 86084 350650 -190769 -214997 -209971 136264 261507 218162 -379891 -87482 -270263
18181b70263B71098j10299a96457m9915C8422N5942a38722L249o4451A50502R7938
18170B48440i5877k9951N8B8549d0381j53061F7845I146J41701j5494O3402G1909
18157a97521G098N0026J12013p8653C4536K12241b70950K7082c4045o5722k58011
18146c57778A74836a39625H4606J05972a12262j43674k01808J59113i5992c6481
18135g079A70797d73090B07929b59750k8284D7413B2559a45256O6918k24214D0881
18123a54787q254J3000l6103j52933a38866I1933c18417D13423d7200m5699f735
18111A77922l8361a76427j63454C6830b40256B64577c7874g451j63276F1095J02073
18100A63168l4540a54290L4081b4604B49744b56902B22364C6213a06179k42367
$$ plain form
18181 -270263 271098 160799 -196457 -246372 38422 94364 -138722 -135473 -199924 150502 248440
18170 248440 -95877 -125828 -125770 28549 -40381 -193442 67845 9146 150847 135353 198755 71909
18157 -197521 7098 57124 169137 90484 34536 246777 -270950 -243868 -34045 -99767 -357778
18146 -357778 174836 -139625 84606 190578 -112262 -255936 -457744 -298631 -95992 -36481
18135 -7079 170797 -473090 207929 -259750 -288034 47413 22559 -145256 -78338 -302552 40881
18123 -154787 -163041 -150041 -186144 -339077 -138866 91933 -318417 413423 -47200 -92899 -6735
18111 177922 139561 -176427 -339881 36830 -240256 264577 -37874 -7451 -170727 61095 163168
18100 163168 128628 -154290 -120209 -24604 249744 -256902 222364 36213 -106179 -348546
18090c48546A23110G6b05656j04971G3757J50226p989b8083j56559A65521a52246
18078a67284f2014g07B0400K19138n6119b49660K4L4546c5828l46997J34448A96076
18065i422B61515A18585a0088H558a37888e5311B47602c10439B6073a13500I4627
18053b17194J6078a4912j7744j92882R0996k63841J69878l2940D1930E126h6225
18041g4202j80704K2289K262O6746I7784d6075A5084b9607k29908J02685B47693
18029b01718J2753A21514b05681R9721j6394N2368k90832m9556B02476q5642J1308
18018A28142o0354a79750o3992q1078a49092B74358C632b84223c6839k55047H1195
18006I8628g4471B01467e8613k1034k3200g236A10789J8978A3002b08777B77787
$$ plain form
18090 -348546 123110 76 -205656 -310627 73757 223983 215994 -28083 -184642 165521 -152246
18078 -167284 -62014 -707 20400 239538 183419 -249660 -249636 -215090 -35828 -382825 -248377 196076
18065 -9422 261515 118585 -10088 8558 -137888 -55311 247602 -310439 26073 -113500 94627
18053 -217194 -201116 -14912 -32656 -225538 -134542 -398383 -228505 -261445 41930 5126 -86225
18041 -74202 -254906 -232617 -230355 -163609 97784 -46075 15084 -29607 -259515 -156830 247693
18029 -201718 -188965 121514 -205681 -105960 -122354 -69986 -360818 -410374 202476 116834 128142
18018 128142 67788 -179750 -243742 -324820 -149092 274358 3632 -284223 -36839 -291886 81195
18006 98628 -74471 201467 -58613 -79647 -102847 -7236 110789 129767 13002 -208777 277787
17994e698A3693K1198o002M3450a24286o6287F99J45297l6002b37509K0604e9472
17981b1585E936a88499A30187f3440A4146N2053O4831a08662j3041B34120B8340
17969a41303a5541A39466a40552G8L146J23321k7113a32225L5344A1210b45070
17957E8281J67802a32636H5996j0912d22186G7150c5436G3095J0640b31109J14206
17946a16903l087r1483L7283E0042a71584n48945g0856J1640C52937b2751B76736
17934F6897a48116C7989e2612A18457c650k40908A40118n2569a54614j37278A75019
17922e1849B9640r646J06946h3639o7270K8717A29391a54917B155a65828o688
17911a72516j05490R801F46e3360C52940l3246j48046b88189f8310j06987f2717
$$ plain form
17994 -5698 13693 34891 28889 72339 -124286 -190573 699 145996 109994 -237509 -216905 -59472
17981 -21585 5936 -188499 130187 -63440 14146 66199 131030 -108662 -121703 234120 28340
17969 -141303 -15541 139466 -140552 78 3224 126545 99432 -132225 -96881 11210 -245070
17957 58281 226083 -132636 85996 75084 -422186 77150 -35436 73095 83735 -231109 -116903
17946 -116903 -119990 -211473 -174190 50042 -171584 -720529 -70856 -59216 352937 -22751 276736
17934 66897 -148116 37989 -52612 118457 -3650 -244558 140118 87549 -154614 -291892 175019
17922 -51849 29640 19994 126940 -83639 -150909 -122192 129391 -154917 2155 -165828 -172516
17911 -172516 -278006 -268205 646 -53360 352940 319694 171648 -288189 -68310 -175297 -62717
17899A85460a67218b7879D4504J40838b88708J3193E707R4891A0047J54886d1105
17887b02466p3656r5330I5448b06854E225b22628c367j32631C77752G942J00346
17876A08288J40515J73641A24895b09479A30384f0054j42603Q9144K9189k4133
17866a08457c7117A54762a38999B05983c62656Q6071A85105R6591N1944A03048
17855E8821j9172a77935J4066g9003A05971A9316b55051g540B82950c28260a3245
17843A25257a6567B07423F7295k3960a9257k39400p0351A33519b82003Q7390F0620
17831a9466A96148C7954i4476C36327j01602d6452j71052o9631F8130a52131j10838
17820b62969C330g7972A60017d3291B21075P1664h547A60356a7041C8394a76027
$$ plain form
17899 185460 -167218 -27879 44504 185342 -288708 -275515 5707 100598 10047 164933 -41105
17887 -202466 -276122 -371452 95448 -206854 5225 -222628 -3367 -135998 377752 7942 108288
17876 108288 248803 422444 124895 -209479 130384 -60054 -202657 -113513 -84324 -108457
17866 -108457 -37117 154762 -138999 205983 -362656 -276585 185105 281696 333640 103048
17855 58821 39649 -177935 -163869 -79003 105971 19316 -255051 -7540 282950 -328260 -13245
17843 125257 -16567 207423 67295 43335 -19257 -258657 -329008 133519 -282003 -194613 60620
17831 -19466 196148 37954 -94476 336327 234725 -46452 -217504 -287135 68130 -152131 -262969
17820 -262969 3330 -77972 160017 -43291 221075 292739 -8547 160356 -17041 38394 -176027
17808a12621j19122d1158k80931J50490Q0589D53631j62538j28896c06709C3729
17797A16852a41387B140K78293o3890Q527p3473K00567A67870a03770m4322f9549
17785g58E0148J0295a87327j03946A41812a27900e2005E7536M8294Q8889n7742
17774A36977a09295j11126j15106Q6861h6578D9029h2377A07357b55354K5570
17764b29784P5822B2592c11789A51045a64078j8215L5086E1391d14209C14826
17753C36057G5358c1923J4110B30320b10751C11863G1977P0729D2222c95682J94563
17742b01119G7433h2724B44558B8114F098a25494n2196C97549A00754A2985J71344
17731A84329i6198B73769b62564d4818L978J0684I9322e2981A96983k7615b7564
$$ plain form
17808 -112621 -231743 -41158 -322089 -171599 -91010 453631 291093 162197 -306709 33729
17797 116852 -141387 2140 280433 216543 225070 151597 352164 167870 -103770 -148092 -69549
17785 -758 50148 60443 -187327 -291273 141812 -127900 -52005 57536 105830 194719 136977
17774 136977 -109295 -220421 -335527 -248666 -86578 49029 -82377 107357 -255354 -229784
17764 -229784 -153962 22592 -311789 151045 -164078 -182293 -147207 51391 -414209 314826
17753 336057 75358 -31923 -17813 230320 -210751 311863 71977 142706 42222 -395682 -201119
17742 -201119 77433 -82724 244558 28114 6098 -125494 -177690 397549 100754 12985 184329
17731 184329 -96198 273769 -262564 -44818 -40840 -30156 99322 -52981 196983 169368 -27564
17719b92820J31226G7887c53286I1067j0835B8960M6931C1049O4471R0271g3234
17707i3259E3079F411J57392e9087k7862q5815B12836b26077j72859a50261b1406
17695A82275F3669K26068a78357Q5412B32393l5961D5991J82594G9605d0424j85946
17684b26370c9776B39295a41975G5271N8037J01616h2908D6182a90284B89540
17673A8283b29954F6764d2089A58985d3935n3008G8488g424C14093h7865B52072
17661c45011c7923G8860b20065b6810B1623J62520a87790m8429R2026c6679m3987
17650h0666C8148a19116e7562b5642j20542q6054A33915F2569k4497a23310B02524
17638c47123e7635j14587D1556b7884C77449E7807i2530A14426a01779A24885
$$ plain form
17719 -292820 -161594 77887 -353286 91067 80232 28960 75891 31049 95520 185791 -73234
17707 -93259 53079 6411 163803 -59087 -86949 -172764 212836 -226077 -398936 -150261 -21406
17695 182275 63669 289737 -178357 -92945 232393 196432 45991 228585 79605 -40424 -226370
17684 -226370 -39776 239295 -141975 75271 133308 234924 -82908 46182 -190284 289540
17673 18283 -229954 66764 -42089 158985 -43935 -96943 78488 -7424 314093 -87865 252072
17661 -345011 -37923 78860 -220065 -26810 21623 184143 -187790 -236219 -144193 -36679 -80666
17650 -80666 38148 -119116 -57562 -25642 -146184 -232238 133915 62569 38072 -123310 202524
17638 -347123 -57635 -172222 41556 -27884 377449 57807 -92530 114426 -101779 124885
17627B54122e2502j90806G244b24580A36188c5481B12852j4055O7461c33903e3988
17615e65253F0349J28764D4092L07237H7319i4048A22285N8854n9010l2290M3810
17604A33649H823K43181j12788P9828l6492a71353C1950i0824G6315a30390g143
17592a3183B79868a5154E1371J21246a05015D35635C6734J07231B6198J23193
17582A49391c7672A02638R1471I2327Q2058a94067j08275j12829A44326C759N7044
17571F0803P2594c38746F0035b60903D175f4646o428o099r099k18009A40849n2676
17559H8173b7614n7179K4389a5672k09297A62626B6649R8361l5649b8906n1509
17548h0415c322j48177d8242l3939c6118j07165j09119B20746f3454J3944j58490
$$ plain form
17627 254122 -52502 -243308 7244 -224580 136188 -35481 212852 198797 266258 -333903 -53988
17615 -565253 60349 189113 44092 351329 87319 -94048 122285 181139 122129 89839 133649
17604 133649 8823 252004 139216 219044 182552 -171353 31950 -90824 76315 -130390 -7143
17592 -13183 279868 -15154 51371 172617 -105015 435635 36734 143965 26198 149391
17582 149391 -37672 102638 194109 92327 174385 -194067 -302342 -415171 144326 3759 60803
17571 60803 133397 -338746 60035 -260903 4175 -64646 -71074 -77173 -86272 -304281 140849 88173
17559 88173 -27614 -84793 -60404 -15672 -224969 162626 26649 125010 89361 -28906 -80415
17548 -80415 -3322 -151499 -48242 -82181 -36118 -143283 -252402 220746 -63454 -49510 -208000
17537b08000C5373b39046i7393C46021K9386G327J16750d8953B08651b43334C7939
17525G4700M23544A91878A8582L31734a27594B21136a53403C80393N788A25731
17514A9341J34216J70152a93285B00096i0285B41578i093B78270j05100b3439
17503C75707C5381K6432B8177J73111J29592H4584J0299J91294A05483P2654C2127
17491d6565A32788J84765j41898Q372g7297C07142A04065a71987j15949B42308
17480C13901b806B43281Q5464B3022L26424I4027J94116a08584A94351B5563L3475
17469E9038b32454D8668J60925j3818H1686a38964K9483B39000p6840K11602a0743
17457B95813h225A0428L76757H0959K36772A31052K43639K3347h4035C13872m7300
$$ plain form
17537 -208000 35373 -239046 -97393 346021 375407 7327 124077 -48953 208651 -243334 37939
17525 74700 498244 191878 18582 350316 -127594 221136 -153403 380393 386181 125731
17514 19341 153557 323709 -193285 200096 -90285 241578 -9093 278270 173170 -23439
17503 375707 35381 61813 28177 201288 330880 84584 94883 286177 105483 178137 32127
17491 -46565 132788 317553 175655 184027 -77297 307142 104065 -171987 -287936 242308
17480 313901 -2806 243281 328745 23022 349446 94027 288143 -108584 194351 25563 59038
17469 59038 -232454 48668 209593 195775 81686 -138964 -109481 239000 162160 373762 -10743
17457 295813 -8225 10428 387185 80959 317731 131052 374691 398038 -84035 313872 266572
17446B66572o9037o0693K22844C7327J80264b790C98308n658j58189P7298O2718
17435C74477o3360D3370d834B39074E4647K58747A0813J40136p2911J57159J01439
17424C36636K52240F0148a87351C04529A12749i1402L3082A53082J27808J16030
17414C96920J40697k56954F6212h1361j94369C10869h680m2022D62841f7030I8177
17402b1792C26493j05262D5039a27700B6205L31425j36574a01316j89099B01995
17391C10140G687J38250n3449K52861A49420K11967a09220B13024R0986F6509
17380C51036A27660D5497O4451J57305a90919B5788a80083A91549l5699o4086
17370I1764b88873A54544d5439C05245q3643m9159D7150J06435f997A05963J86292
$$ plain form
17446 266572 197535 136842 359686 37327 217591 -2790 398308 392650 234461 311759 374477
17435 374477 311117 43370 -4834 239074 54647 313394 10813 150949 78038 235197 336636
17424 336636 588876 60148 -187351 304529 112749 -91402 -58320 153082 280890 396920
17414 396920 537617 280663 66212 -81361 -275730 310869 -8680 -50702 462841 -67030 98177
17402 -21792 326493 221231 45039 -127700 26205 357630 221056 -101316 -290415 201995
17391 310140 7687 145937 92488 345349 149420 361387 -109220 213024 304010 66509
17380 351036 127660 45497 109948 267253 -190919 25788 -180083 191549 155850 91764
17370 91764 -288873 154544 -45439 305245 221602 172443 47150 153585 -6997 105963 292255
17359B92255o8451H8598L12959B8011j036c9904A97728C3303R65a3828A32555
17347a01362B22100M5635A14250J76528o3032d3711a0144C2944L00376j54809
17337A78511F7164c7605C2965J38546J64381C7720a59129b6573A71330a95094
17326e9444A07394k4365K8581e1938C41280A06081h347D61230b63280c0974B01268
17314I8390M1446J14315c7234j84306J3340A20559a10711I1942K84425a41805
17303C23905A52149O7631R3775a76373A4861L65756j396j19340p0448b7473C16033
17291D42110B12342M0754a76551A04577i1252L1175A70433J97614j42158J31858
17281C57747J53923A17956c30627A14838J24752J87964F081a1741E6308M57390
$$ plain form
17359 292255 223804 88598 401557 28011 26975 -39904 197728 33303 34268 -13828 132555
17347 -101362 222100 267735 114250 290778 227746 -43711 -10144 32944 333320 178511
17337 178511 67164 -37605 32965 171511 335892 37720 -159129 -26573 171330 -195094
17326 -59444 107394 83029 111610 -51938 341280 106081 -8347 461230 -263280 -30974 201268
17314 98390 139836 254151 -37234 -221540 -208200 120559 -110711 91942 376367 -141805
17303 323905 152149 219780 313555 -176373 14861 380617 379221 259881 189433 -27473 316033
17291 442110 212342 253096 -176551 104577 -91252 -60077 170433 368047 225889 357747
17281 357747 511670 117956 -330627 114838 239590 427554 6081 -11741 56308 513698
17271E13698C5368L52939j02967j08964E4140J20803K0271B4910K02566N6705
17261B84181L473q0008L12168e1319C5506A3187J77973Q3639F7579J06099k5768
17250A47910N9242d1971A41726i9140a953B05129m4011K3534L241Q9442K35868
17239E13203A48828J60656K11933k07741b5467r7461A12609P1146k0592D8711
17228A70144n8279K23473p6503J01975G755M7028K52131j39645A7826L34104j20046
17217B31884J14181J01934A86350m1243M08151j99080j01167L7874b0696B18082
17206A06447K22120J06683i245A84966c903C63311q8466q5154G0671K22115J29874
17195D22660A90663d7288B55548J10328j69932j4724H6702L77780N3196a06844
$$ plain form
17271 513698 35368 388307 285340 176376 54140 174943 195214 24910 227476 284181
17261 284181 287654 207646 519814 -51319 35506 13187 191160 274799 67579 173678 147910
17250 147910 207152 -41971 141726 -99140 -1953 205129 161118 184652 187893 277335 513203
17239 513203 148828 309484 521417 313676 -25467 -122928 112609 183755 163163 48711
17228 170144 111865 335338 258835 360810 7755 54783 306914 167269 17826 351930 231884
17217 231884 346065 447999 186350 145107 553258 354178 253011 290885 -20696 218082
17206 106447 328567 435250 -9245 184966 -3903 363311 274845 189691 70671 292786 422660
17195 422660 190663 -47288 255548 365876 195944 181220 86702 464482 517678 -106844
17184C08481k1914Q8368K8048A17266L01667H5843f9087F36227B77468J74680
17174D52148k20060N853j2852p6633N9899n7152P4049K57137G238J01004b90905
17162C63912J24800k06284Q3016j28302M17924A54725K26575P4874k5524B4764
17151d5820E15100B07660Q2245D9054J21308J20281f1934B81476L0914J92608
17141E04998f9439D43050d270H7150N7757J48316p9559L6007J94248j3328B11474
17129E39471K8325a8365A1448M01679A31782K60815j82170R9150J95993j39894
17119C65676j72239L41204B19933K80257e1564A42276P5430K17739J46713r6032
17109D86126q6811o9640K3205H9948N44654l02615J14635A27538M39787k08099
$$ plain form
17184 308481 286567 374935 402983 117266 418933 85843 -69087 636227 277468 452148
17174 452148 232088 237941 225089 148456 208355 151203 225252 482389 7238 108242 -290905
17162 363912 488712 282428 365444 237142 655066 154725 381300 456174 430650 24764
17151 -45820 515100 207660 289905 49054 170362 290643 -61934 281476 312390 504998
17141 504998 -69439 443050 -4270 87150 144907 293223 213664 249671 443919 430591 211474
17129 539471 567796 -18365 11448 413127 131782 392597 210427 309577 505570 365676
17119 365676 193437 534641 219933 500190 -51564 142276 217706 435445 582158 486126
17109 486126 399315 329675 352880 89948 634602 331987 446622 127538 567325 359226
17099C59226j57972R5361M12234l27416m2048A0312L01954j162o0341J73446J9646
17088D43855Q1901j45369j21020D1699L12150j60565M22965B44042L23664B82762
17077C40876J03088A21611M97211j15388k8994K66464B95502P56127C02896I7008
17066C52476L16847l26962K70282J52208A60308L24273j83208L49389B60041K97025
17056E57066j22259O8827j99404K43926N5567j64304Q4283B51279L61208B22729
17045B90869A44030M85649n693k55759N8043j61366l0524J23495n1631N3535M7427
17034D07206N05657D09717M04966l12449M718N5949j54295R3566K70268j50676
17024F21764J65524q0437k52417J66793N3427B77210k4173L63302K8647j60884
$$ plain form
17099 359226 201254 296615 708849 381433 339385 10312 312266 311104 250763 424209 443855
17088 443855 525756 380387 259367 41699 353849 193284 616249 244042 567706 282762
17077 340876 443964 121611 618822 503434 474440 740904 295502 1051629 302896 97008
17066 352476 669323 342361 612643 764851 160308 484581 301373 650762 260041 557066
17056 557066 434807 503634 304230 548156 603723 439419 523702 251279 612487 222729
17045 290869 144030 629679 623986 368227 426270 264904 234380 357875 306244 359779 407206
17034 407206 912863 409717 814683 502234 506952 562901 408606 502172 772440 621764
17024 621764 787288 706851 454434 621227 674654 277210 253037 616339 644986 484102
17014D84102J17723o419k4288L35289j97422M0329j68334K54876j74652K5071
17004F86275k0554j80639M9155J49377N621j05666K36133C51986R7398K57414
16994G06798K6080J81705l38041k57033M36752L4716o9241Q9238k6230k73237
16984E11507j0947K28397J23206J74991k58854o9834J13641J73018k56431j20555
16974F08139J60661L91215j34936m07183J24505q941L27755j39884M9720L88710
16964A359761o36238l0748K8248M08799m64596J36439L26749l49898R5682K30920
16954A105118J41421k96594J39063j40976J60421K1864O0347k03988o1788l9127
16944H85761M85633j0362j35685k06233K04477L73048n95997j18559L66311J08081
$$ plain form
17014 484102 601825 595406 571118 906407 708985 749314 580980 835856 661204 686275
17004 686275 665721 485082 534237 683614 689235 583569 819702 351986 449384 706798
16994 706798 732878 914583 576542 319509 756261 790977 721736 810974 784744 511507
16984 511507 500560 728957 852163 1027154 768300 698466 812107 985125 728694 608139
16974 608139 768800 1160015 1025079 617896 742401 733460 1061215 921331 971051 1359761
16964 1359761 723523 692775 721023 1129822 665226 801665 1128414 778516 874198 1105118
16954 1105118 1246539 949945 1089008 948032 1108453 1130317 1190664 986676 924888 885761
16944 885761 1371394 1361032 1225347 1019114 1223591 1596639 1000642 882083 1248394 1356475
16934A356475m49973K03641p1868j44731L37009K10114m26991J6105K68910J25175
16924A423866Q702l58856J21479r1901J02915K14292j72995L87468k11409m50280
16914I73281O21196l45369p3964K56442j15256J95357j5130J01270J61939j62781
16904A596985j07847L08500j23465n29022N14171n8931j56683M1582K63767l164
16894A745893p3353j6944M05471l22079j6970o5323j87119M37764j73823J6289
16884A749806L86215n49615J65852J98694L24157l52860J95208m51485j5485P32593
16874B383080k83230m3778J4454O3535J88629j13551L21936q8355o9283P6104
16864B449541k43811L94189j83070L19139r8440m6252r4366M4043J40017K57662
$$ plain form
16934 1356475 906502 1110143 1038275 893544 1230553 1440667 1013676 1029781 1298691 1423866
16924 1423866 1432568 1073712 1195191 1103290 1206205 1420497 1247502 1634970 1423561 973281
16914 973281 1594477 1249108 1175144 1431586 1316330 1511687 1496557 1597827 1759766 1596985
16904 1596985 1489138 1797638 1674173 1145151 1659322 1600391 1443708 1485290 1749057 1745893
16894 1745893 1672540 1655596 2061067 1738988 1722018 1656695 1469576 1907340 1733517 1749806
16884 1749806 2136021 1586406 1752258 1950952 2275109 1922249 2117457 1665972 1650487 2383080
16874 2383080 2099850 2056072 2070526 2134061 2322690 2209139 2531075 2442720 2373437 2449541
16864 2449541 2205730 2599919 2416849 2735988 2637548 2591296 2496930 2540973 2680990 2938652
16854B938652m30103P6200J81130J69851K3842J10955j43735J40068j77670R2518
16844B981708O4439j3908M43423k19678M22606k89892L1992J95814L1500K25947
16834C873951j38837K18294m7697k316K14680j44078N12435j8688m3325m0279
16824D384140L71356k43659J52843J7768Q4717N34721l56712k5483K02058K73392
16814E395141K80807r7596R3841j299K42100J1893j03973N09822K10768K05181
16804F746685O0047J20709M63257p55036R18428l1560J97763N5652J64622L36844
16794H277411J58722Q06477j11771J97328J22752J85804K84547L6609N00448J69967
16784A0628294J24528M92002L31998N12103N46795J03602L75210L29620O87284
$$ plain form
16854 2938652 2508549 2584749 2765879 2935730 2959572 3070527 2926792 3066860 2889190 2981708
16844 2981708 3046147 3032239 3475662 3255984 3678590 3388698 3420690 3616504 3648004 3873951
16834 3873951 3735114 3953408 3905711 3903395 4118075 3973997 4486432 4467744 4424419 4384140
16824 4384140 4755496 4511837 4664680 4682448 4767165 5301886 4945174 4919691 5121749 5395141
16814 5395141 5675948 5578352 5672193 5670894 5912994 5924887 5820914 6330736 6541504 6746685
16804 6746685 6806732 6927441 7390698 6635662 7554090 7522530 7720293 7775945 7940567 8277411
16794 8277411 8436133 9242610 9130839 9328167 9450919 9636723 9921270 9957879 10458327 10628294
16784 10628294 10752822 11244824 11576822 12088925 12635720 12739322 13114532 13444152 14131436
16775A4131436L06897L14510K57459O34570O51451K45731R03623K46272J062805
16766A8754754M99970Q45301O29369R92099O80303Q76109J224301P02135J210698
16757B6415039J184004J071901J641506P91867J824356J296622J683134J988014
16749C7896443J724971K018029J996855K349646K693083K612062K822031K671572
16741E6784692L795168L182531M147015L904231M233152M573888N307146M979302
16733I0907125N887116O356443O049241P552670P308270O965617Q057013P555302
16725A46638797Q281037P695823P842161O785815O762626N366066M642522L698014
16717A97712861J745264L18135r63632j982916l634872m453018n438513o357866
$$ plain form
16775 14131436 14438333 14752843 15010302 15644872 16296323 16542054 17445677 17691949 18754754
16766 18754754 19254724 20100025 20729394 21721493 22401796 23277905 24502206 25204341 26415039
16757 26415039 27599043 28670944 30312450 31104317 32928673 34225295 35908429 37896443
16749 37896443 39621414 41639443 43636298 45985944 48679027 51291089 54113120 56784692
16741 56784692 60579860 63762391 67909406 71813637 76046789 80620677 85927823 90907125
16733 90907125 96794241 103150684 109199925 116752595 124060865 131026482 139083495 146638797
16725 146638797 154919834 162615657 170457818 177243633 184006259 189372325 194014847 197712861
16717 197712861 199458125 199776260 198812628 196829712 193194840 188741822 183303309 176945443
16709A76945443p315162p515861p945260q112161p799495p728279p799048p172421
16701A15557756o848122o672547o009939o008405n222415n635481m306186m643202
16693G0211459m219970l730024l524324l470290k684959k661695k900867k412296
16685D4607034k315755k051620k037991j761604j799356j589931j480583j615720
16677B9954474j096489j481523j025748j039951r39743j441621m42540j465554
16669B1021305m51990o95837r13150o20445l88506q00315l29354j067170l27167
16660A5427371m89637q99667k27459m38335l25663n25819m73212j23239l06202
16651A1618138m47329r55349O7153l73593N0964j49677k00976k75914l83976m66938
$$ plain form
16709 176945443 169630281 162114420 154169160 146056999 138257504 130529225 122730177 115557756
16701 115557756 108709634 102037087 96027148 90018743 84796328 79160847 74854661 70211459
16693 70211459 65991489 62261465 58737141 55266851 52581892 49920197 47019330 44607034
16685 44607034 42291279 40239659 38201668 36440064 34640708 33050777 31570194 29954474
16677 29954474 28857985 27376462 26350714 25310763 24371020 22929399 22486859 21021305
16669 21021305 20569315 19873478 18960328 18339883 17951377 17151062 16821708 15754538 15427371
16660 15427371 14937734 14038067 13810608 13372273 13046610 12520791 12047579 11924340 11618138
16651 11618138 11170809 10215460 10282613 9909020 9959984 9810307 9609331 9333417 8949441 8482503
16641H482503l8962r1080m96192l15748k45990j05854M33283r51503M55505l81649
16631F744313n41560L03341m09798L49751m70680J07680m19742O323J09336k00482
16621E578482m48357K74748m4093l61756j83328j25802l13397J87691l80783K37310
16611D420715j1426j46090P2940j67210k92542l29154K70408l84680K89672n0124
16601C672509o4029k6583J37288k36314j85267M0424j15304J30211j95794j24248
16591C032893L58810j44172m21632j41030N69633m34694l0442R0939k77888l7381
16581B565036J71526j34789k25877L41951l64133K6584l0943J97509O4932n33937
16571B077859L08374j73207k10684J85346J10675l09031K9841k9016k4072P8603
$$ plain form
16641 8482503 8443541 8352461 7856269 7540521 7294531 7188677 7621960 6670457 7125962 6744313
16631 6744313 6202753 6506094 6096296 6446047 5975367 6083047 5663305 5669628 5778964 5578482
16621 5578482 5130125 5404873 5360780 4999024 4815696 4689894 4376497 4564188 4183405 4420715
16611 4420715 4409289 4263199 4336139 4168929 3876387 3547233 3817641 3432961 3722633 3672509
16601 3672509 3608480 3581897 3719185 3482871 3297604 3338028 3222724 3352935 3157141 3032893
16591 3032893 3391703 3247531 2825899 2684869 3254502 2819808 2789366 2880305 2602417 2565036
16581 2565036 2736562 2601773 2375896 2717847 2353714 2380298 2349355 2546864 2611796 2077859
16571 2077859 2386233 2213026 2002342 2187688 2298363 1989332 2019173 1990157 1966085 2044688
16561B044688J41460l43873K21660j8369j87898l51560M70251l03022K20063k82796
16551A610604K28329j09833J07729k46975N8640j35365O3246q6038J44910k63158
16541A372089M17915N3136n46431K90917q2538J10401l9811j01260k26120M92003
16531A740301m69265J12040J83789k85753L48267l59838K50824l8467O3642n23346
16521A022194J83359j19029Q0677R9924m84819K30502K64466j9194J97029l07625
16511A147484J86251l55710L34355J00178l99609j34036Q3412k2406J36848k69408
16501H07359q1022L48388m42801L33182j44722l61292M22609J74141j93186J65530
16491A028186j49237Q3975k47136j701L40775K75432l90287j74564j07520k77033
$$ plain form
16561 2044688 2186148 1842275 2063935 2045566 1857668 1506108 1976359 1673337 1893400 1610604
16551 1610604 1838933 1729100 1836829 1589854 1648494 1513129 1576375 1490337 1635247 1372089
16541 1372089 1790004 1843140 1296709 1587626 1505088 1615489 1575678 1474418 1248298 1740301
16531 1740301 1271036 1383076 1566865 1281112 1629379 1269541 1520365 1481898 1545540 1022194
16521 1022194 1205553 1086524 1167201 1267125 782306 1012808 1277274 1258080 1455109 1147484
16511 1147484 1333735 978025 1312380 1412558 1012949 878913 962325 939919 1076767 807359
16501 807359 726337 1074725 631924 965106 820384 459092 881701 1055842 862656 1028186
16491 1028186 878949 962924 715788 714087 1054862 1330294 940007 765443 657923 380890
16481C80890P12671j68320j04253L71406r1369q9419l14382N9777J0965k7807
16471G40159O8266j23494K5236K98477D88740K35925k53390M49164D42090M55064
16461H97154J6104m03742M10119k2985l08528L49212C95028L11124k52869K98431
16451G51714j33388J02991j23189L4949J86493D07992o4042L67391q1871j4882
16441F14588j15374j53118o1349J31516K57597j28342J22020j37698L1932J2905
16431E74677j25598J10809k12303L55263A83758M37437j59853r331k6590l5735
16421C89686P2370J90552j6236J8097o7427o4247k6422A70565L32136J6730j9920
16410D99511A51488M97484J01231K2985C59274O1980p8600P630L21449j63703
$$ plain form
16481 380890 1093561 925241 820988 1192394 1101025 1011606 697224 757001 767966 740159
16471 740159 808425 684931 710167 1008644 488740 724665 471275 920439 442090 897154
16461 897154 913258 509516 919635 896650 588122 937334 395028 706152 453283 751714
16451 751714 618326 721317 598128 633077 819570 407992 343950 711341 629470 614588
16441 614588 499214 346096 284747 416263 673860 545518 667538 529840 561772 574677
16431 574677 449079 559888 347585 702848 183758 621195 461342 452011 425421 389686
16421 389686 462056 652608 636372 654469 587042 522795 496373 170565 502701 519431 499511
16410 499511 151488 648972 750203 773188 359274 421254 342654 350284 671733 508030
16400E08030a9214B80310K0270j07150N08131k78930K83964B95519J37871K74456
16390G07846B87906O92874l48070A71616M31637j76188j61155M67359B50566J62312
16380D12878K99417j71579J58792B02427L91472J06681l30508K3408m5123K91165
16370F39522k94097J20975m9768A39398M8288O2923P3316r461K60273j02306j28764
16359C43667Q5439K55027l25448M4946N4876A23691L49143A87833J08205J33617
16349D29655B04930D8901N06118A68323l86K00105L38980l53409l1652p2046D0778
16337D48114K474J45127B75229i149C48496L75721k10334j39514J40005k49263
16327B65111L9618L49988C03100p4829P8174F3325k9656a01803C4992M57332g3448
$$ plain form
16400 508030 -19214 280310 300580 193430 701561 422631 706595 295519 433390 707846
16390 707846 287906 980780 632710 171616 603253 427065 265910 733269 250566 412878
16380 412878 712295 540716 699508 202427 593899 700580 370072 393480 348357 639522
16370 639522 345425 466400 416632 139398 187686 250609 323925 314464 574737 472431 343667
16359 343667 429106 684133 358685 403631 458507 123691 472834 187833 296038 429655
16349 429655 204930 48901 555019 168323 167937 368042 707022 353613 321961 249915 40778
16337 448114 450588 595715 275229 -9149 348496 724217 513883 374369 514374 265111
16327 265111 304729 654717 303100 228271 306445 63325 33669 -101803 34992 492324 -73448
16315B57035O0072A00926J96700K15350E3134N06004A62573J65446M4127A30694
16304A25026N8085J36814K253j47837O1175q7967B5339K19284D2411K75752A22957
16292D6338K44368H5330K58240H1834J17125K30627K25215l23468J38140j55706
16282C13767H6569K7755D5738J28556J05533R6770A72418K91153A75987N9830
16272B35817j9167J9530N0215J14101A85557k1851G8796M61699B19489j9872q3655
16261A15962a78682D25298A89660K11709j47731A2525N0141a2500A40328M29699
16251E70027B50759A23140K96208j75388N6705A27915J81985A463K20058g9463
16240A01398J93368a20558I4328M68878k59372m0840J40369A49208J51841A7049
$$ plain form
16315 257035 317107 100926 297626 512976 53134 559138 162573 328019 372146 130694
16304 125026 183111 319925 322178 174341 235516 147549 25339 244623 42411 318163 122957
16292 46338 290706 85330 343570 81834 198959 429586 654801 331333 469473 313767
16282 313767 86569 114324 45738 174294 279827 376597 172418 463571 175987 235817
16272 235817 216650 236180 286395 400496 185557 163706 78796 540495 219489 199617 115962
16261 115962 -178682 425298 189660 401369 253638 12525 62666 -12500 140328 570027
16251 570027 250759 123140 419348 243960 300665 127915 309900 1463 221521 -79463
16240 101398 294766 -120558 94328 563206 303834 262994 403363 149208 301049 17049
16229B48056m8901o0168K81282j02178A28698K03956A00963L2181i5620C43719
16218B32170L8892r996Q1789m3990Q3704A57852L40225a90770A62965F3823M1450
16207A05273d8166A34293J97675j24512K30598I9348k9871b611j37214b1022B66562
16195D50358j17894A45832K89453j73107i7521D04503o5440K12262k30302j42792
16185A78231K53464b6491B50622r9647A0811N644J72609j719C0467c84361J45426
16174b38935H9132L64969A15346J68108I5871h1845A00623a02198L8713j29768
16164a93253N8913A86821E1208B0629J39276f5346C52K32003k9729a2082E00269
16152a75240B40733j5078a09430B38275m5687B9815L42716A76379R74c0179E58112
$$ plain form
16229 248056 199155 138987 420269 318091 128698 332654 100963 133144 -95620 343719
16218 232170 271062 261066 342855 298865 382569 157852 498077 -190770 162965 63823 105273
16207 105273 -48166 134293 331968 207456 438054 99348 69477 -2611 -139825 -21022 266562
16195 450358 332464 145832 435285 262178 -97521 404503 339063 551325 321023 178231
16185 178231 431695 -26491 250622 150975 10811 16455 189064 187345 30467 -384361 -238935
16174 -238935 89132 454101 115346 283454 95871 -81845 100623 -102198 -63485 -193253
16164 -193253 -134340 186821 51208 20629 159905 -65346 352 232355 202626 -12082 500269
16152 -175240 240733 225655 -109430 238275 192588 29815 372531 176379 177353 -30179 558112
16140a68112F6508P6706n1823d1155b007E53243A32406b1148B32810m2634a7012
16128a76322B54628r1052C3284J39604D6120K3872A8188Q027f2776B89545r7513
16117A92032G6770C2121a09789D32159q7334F2219J42221a1476n9576A93665D598
16105G314a96388A16808j0918J767a11397b7981k49627c7011r2628e010k9488
16094c4498j39894b4319p6470C00335I9370K31494j18747b83831g3991B64476
16083i701k23488m032l6533A16200K90372a33682A63278a36786k229A638Q5316
16072H6954b34467A64496C2779d9848m0253c8313I310K7406j5764d9899o2049
16061a11948A58962h6577E9053L7931c9549n0349r4093L1804H6912K3607a59156
$$ plain form
16140 -168112 66508 143214 91391 -41155 -2007 553243 132406 -21148 232810 190176 -17012
16128 -176322 254628 163576 33284 172888 46120 69992 18188 26215 -62776 289545 192032
16117 192032 76770 32121 -109789 432159 344825 62219 204440 -11476 -71052 193665 4598
16105 7314 -196388 116808 105890 107657 -111397 -27981 -277608 -37011 -129639 -5010 -34498
16094 -34498 -174392 -24319 -100789 300335 99370 330864 212117 -283831 -73991 264476
16083 -9701 -233189 -237221 -273754 116200 406572 -133682 163278 -136786 -139015 1638 86954
16072 86954 -234467 164496 32779 -49848 -90101 -38313 9310 36716 20952 -49899 -111948
16061 -111948 158962 -86577 59053 96984 -39549 -89898 -183991 -152187 86912 110519 -159156
16049H9363b98665O6772R2869a7261H3934k8545J6843L4722c08347B25374b73193
16037a13428B6150b6736D7250a60996M6850r806k45211C4143a57866J6073m5085
16026a86878i400j5687j01853N8493j56903j08797J64190m2557A47155J7164g108
16014h611j2071A29335m8663a06068c8579a8113D9968B4944L37626b42510G113
16002a63093B70326I4965K26957a3096G480Q2236j5290b4878D9934J7536b40939
15990A69211b16809g7434a7947E5146K02184j12364b41612A12346j7125f1648
15979A29396a41620k36136C4634f7096B5078i7966m9204B69450a62106l3307B31383
15967A65304b56732b9263A06247K23317b42094a16898C48064C8600O8154e9347
$$ plain form
16049 89363 -298665 -231893 -139024 -17261 83934 55389 72232 106954 -308347 225374 -273193
16037 -113428 26150 -26736 47250 -160996 -114146 -123952 -369163 34143 -157866 -141793 -186878
16026 -186878 -9400 -25087 -126940 -68447 -225350 -334147 -169957 -212514 147155 164319 -7108
16014 -8611 -20682 129335 80672 -106068 -38579 -18113 49968 24944 362570 -242510 7113
16002 -163093 270326 94965 321922 -13096 7480 89716 74426 -24878 49934 67470 -240939
15990 169211 -216809 -77434 -17947 55146 257330 144966 -241612 112346 95221 -61648
15979 129396 -141620 -377756 34634 -67096 25078 -97966 -147170 269450 -162106 -195413 231383
15967 165304 -256732 -29263 106247 329564 -242094 -116898 348064 38600 106754 -59347
15956a0446B98489R058i2469n9545a5851k97330B3561C856O7321a2042q1817c0323
15943b88291a42904d4510A09402J19309B6345h3017n6860I9721k2113i6346o9577
15932a65923A48695g8739m08005b24597B11973E1152b61444K4149c9945l38561
15922c78506J84461a2162j12758B8005a47397i43j22188C03505b07608C16793
15911H6405N5700h2389A09609a62484P6050k64369J13265C38293A62814F0288
15900c68180C3871G605K16866b39742Q7881l77238H1345d026n0486o7601G3861
15888A09791J4891b06401d8029r7185r5431D9957L9325c34413F9199B2859b2967
15876a6655b085B4666J4871M3438N7434h2947A02646D9576J03245a2913B48510
$$ plain form
15956 -10446 298489 307547 -92469 -152014 -15851 -313181 23561 3856 71177 -12042 -93859 -30323
15943 -288291 -142904 -44510 109402 228711 26345 -83017 -139877 99721 77608 -96346 -165923
15932 -165923 148695 -78739 -486744 -224597 211973 51152 -261444 -237295 -39945 -378506
15922 -378506 -194045 -12162 -124920 28005 -147397 -943 -123131 303505 -207608 316793
15911 86405 142105 -82389 109609 -162484 -86434 -350803 -237538 338293 162814 60288
15900 -368180 33871 7605 224471 -239742 -151861 -529099 81345 -4026 -54512 -122113 73861
15888 109791 124682 -206401 -48029 -145214 -240645 49957 89282 -334413 69199 22859 -22967
15876 -16655 -2085 24666 39537 82975 140409 -82947 102646 49576 152821 -12913 248510
15864B06554B3875c20437d8152j44749l98235A36746O4333b2058A22914b57992
15853c5788D3540j9981d6680a4391A96801k6692a78275b7877C21579f1771j85586
15842b47357F5881L2832d61662J00605a7428B52097c12183J41779B38748G4709
15831e1430m179D8875J54474M5075r5167c05531e2901F7635a96498A9153c87924
15819G3350a48789D5429a23453d1223A61998E4793b32288h4114j6935j13576i2587
15807c30098A88631f5317n2253p8061f8748k64630B3166K5611i1197k07006C12
15795b65034j41995J57533C0278Q637P7009a31038A87983b55147O9028K6227j07289
15784b67181J27497b8219J2515k87763F1778J07712E4426j0545a63410A71217
$$ plain form
15864 206554 23875 -320437 -48152 -192901 -591136 136746 201079 -22058 122914 -257992
15853 -35788 43540 23559 -46680 -14391 196801 170109 -178275 -27877 321579 -61771 -247357
15842 -247357 65881 98713 -461662 -361057 -17428 252097 -312183 -170404 238748 74709
15831 -51430 -55609 48875 203349 248424 153257 -305531 -52901 67635 -196498 19153 -387924
15819 73350 -148789 45429 -123453 -41223 161998 54793 -232288 -84114 -101049 -214625 -92587
15807 -330098 188631 -65317 -117570 -195631 -68748 -333378 23166 48777 -91197 -298203 312
15795 -265034 -407029 -249496 30278 38915 115924 -131038 187983 -255147 -186119 -159892 -267181
15784 -267181 -139684 -28219 -15704 -303467 61778 169490 54426 43881 -163410 171217
15773a49343d7979A58089N804e5283D20332b7656j31184j6525D6074N9726a33659
15761g7087A20297J10783I7169i9879o2886E368b03747B11545f1690b5981j11391
15750a37372A64998d532I8895a74011d0228C42720m2068b57444d4827m00321d9270
15738h7422b2407r517k24325J26111l8606A04053a33936K3123J5702r012B59166
15726A28241l6738J49716a90514B0684M3445h9699B3675c65531p3797d32E9500
15714a35621N306j52801J30864H262c0498k6307A29125c04971a49206r7955M5615
15703b01546D3501b58668B3362b40065J19467E4085J9146b43738e1068k6064A86694
15691g7766p8403A75021A1853a15348k9041j44137N0562O9324m33519b09444a1053
$$ plain form
15773 -149343 -47979 158089 163893 -55283 420332 -27656 -158840 -175365 46074 105800 -133659
15761 -77087 120297 231080 97169 -99879 -162765 5368 -203747 211545 -61690 -25981 -137372
15750 -137372 164998 -4532 98895 -174011 -40228 342720 300652 -257444 -44827 -445148 -49270
15738 -87422 -22407 -31924 -256249 -130138 -168744 104053 -133936 -110813 -95111 -104123 259166
15726 128241 91503 241219 -190514 20684 64129 -89699 23675 -365531 -439328 -432 59500
15714 -135621 -130315 -283116 -152252 8262 -30498 -56805 129125 -304971 -149206 -247161 -201546
15703 -201546 43501 -258668 23362 -240065 -120598 54085 73231 -243738 -51068 -77132 186694
15691 -77766 -156169 175021 11853 -115348 -144389 -288526 -237964 -168640 -602159 -209444 -11053
15679b72063J7828L0934J05488c5858p2315B738a60436D4360b15239P0958d7101
15667B1283h8495j46117C3637K0949a9487l32461k4444a71291l8790A69200b8273
15655D0327a81985a6534q1739F3079a53228A77308b50236i4989B1539J36813P9681
15644B38033p6389b74806A00307A5119h2251j52825P3103E7311f8463q4754N1892
15633a01325K3561L6828C420g659H4509N2237J28639e36380b39020B42360f8508
15621a95380B07535K27817d6626l1839B9619G710c18102e1092A06009k8515a64306
15609A14480n4914Q5431f13459K72868A33179K45788A3185N038b02228A93605
15598A75425q5052J26338p1851a23759b9245j583A4615M972J77284o384B9236
$$ plain form
15679 -272063 -254235 -223301 -117813 -35858 -108173 2738 -160436 44360 -215239 -144281 -47101
15667 21283 -88495 -234612 33637 54586 -19487 -351948 -376392 -171291 -210081 169200 -28273
15655 40327 -181985 -16534 -98273 63079 -153228 177308 -250236 -94989 21539 158352 238033
15644 238033 161644 -274806 100307 15119 -82251 -235076 -161973 57311 -68463 -153217 -101325
15633 -101325 -77764 -40936 3420 -7659 84509 136746 265385 -536380 -239020 242360 -68508
15621 -195380 207535 435352 -46626 -78465 29619 7710 -318102 -51092 106009 77494 -164306
15609 114480 59566 144997 -613459 -340591 133179 378967 13185 18223 -202228 193605
15598 175425 90373 216711 144860 -123759 -29245 -30828 14615 19587 196871 190487 29236
15586H4503N4023h3097A71042i1757A66152d1448A08461N7638f6760B31690h8828
15574b7972k25846k8325a3944I1968a80166g2885l3010D16255A11426a16241j40767
15563b57008R9649H1732j8192a42884B74399i7389B16782b89966J00580I3922
15552h6065A4626L1283L4877L51222b05248A1337K52645a99852F8177K1592e3651
15540f2248q854l747a8624A7410g8813a5075G9130l4544J60181c0376A08458A1147
15527e3953C48339A47019J35905c50454G1826M650K0108a95846d1464k41887c3432
15515h9195C56481A5114J53719e8576A55138b15054B45826o5765c1057A12959
15504a38845J2851b1646E7637h163r8663a723A2373c86890f1447A05911b40847
$$ plain form
15586 84503 138526 -83097 171042 -91757 166152 -41448 108461 166099 -66760 231690 -88828
15574 -27972 -253818 -282143 -13944 91968 -180166 -72885 -105895 416255 111426 -116241 -257008
15563 -257008 -157359 81732 63540 -142884 274399 -97389 216782 -289966 -189386 93922
15552 -86065 14626 45909 80786 432008 -205248 11337 263982 -199852 68177 89769 -53651
15540 -62248 -71102 -74849 -18624 17410 -78813 -15075 79130 44586 204767 -30376 108458 11147
15527 -53953 348339 147019 282924 -350454 71826 76476 96584 -195846 -41464 -283351 -33432
15515 -89195 356481 15114 168833 -58576 155138 -215054 245826 180061 -31057 112959
15504 -138845 -125994 -21646 57637 -8163 -106826 -1723 12373 -386890 -61447 105911 -240847
15492A51385a20437H4094g1633j61547E1530d06814B6712a16531o8781H115J0028
15481A8143b1826l6227A25938J20453C7583J32498k6816a36837A76570a67944
15470a73457B2788a90133d0117L70j69323c097q6367D3071g2985j41422I8002
15458B1322h4083B42331b71094G4945J70548A03391a46511G3080a83424L0434
15448a52990N5811l6230B56103J5065A8977a20453E4428a95957q5159e2480A572
15436a09723A32421H879e3348A60636J6290A200f9912l06277a84945B01765d16817
15424a5196B63211c7146k4039j3398k4473j36717a05188k4124o090B41803F3278
15412I5118b14438J2364R5204C2631J23927k2250k2584C9912g02077a20618A78656
$$ plain form
15492 151385 -120437 84094 -71633 -233180 51530 -406814 26712 -116531 -185312 8115 18143
15481 18143 -21826 -58053 125938 246391 37583 170081 143265 -136837 176570 -167944
15470 -173457 22788 -190133 -40117 -39747 -209070 -3097 -89464 43071 -72985 -214407 98002
15458 21322 -84083 242331 -271094 74945 245493 103391 -146511 73080 -183424 -152990
15448 -152990 -97179 -133409 256103 271168 18977 -120453 54428 -195957 -281116 -52480 1572
15436 -109723 132421 8879 -53348 160636 176926 1200 -69912 -376189 -184945 201765 -416817
15424 -15196 263211 -37146 -61185 -74583 -99056 -235773 -105188 -129312 -135402 241803 63278
15412 95118 -214438 -202074 -106870 32631 156558 134308 111724 39912 -702077 -120618 178656
15400A71454B5031a02378k54222d4388p3673B3944J30247c59943c1871a3040A57088
15388a2854p7790k09642B6808L57394b41842Q1192j39236a0290A0433a39640M7065
15377i2575q584c3555j62667K1616P8022A86009a56596I3568K91339a03755A49185
15365C23780F1439B3951K1221i5957j25805A62254a24851c5093k06625q5511A6176
15353a49451B60684b5749k51040B92515J75989g6576a2353l03197D043g5428C79034
15341i923A75407E6691g8487j7280A9923b53679O8891B10620I8830M38800A33046
15329B10873e12959B31972E9048J68381g9676j3544L9820k19413j78647D53818
15318A32561h9003k5363C79365g6616A66537B8587a97486A87534C7046J41674
$$ plain form
15400 171454 25031 -102378 -356600 -44388 -118061 23944 154191 -359943 -31871 -13040 157088
15388 -12854 -90644 -300286 26808 384202 -241842 -160650 -299886 -10290 10433 -139640 -92575
15377 -92575 -101159 -33555 -196222 -174606 -96584 186009 -156596 93568 384907 -103755 149185
15365 323780 61439 23951 45172 -95957 -221762 162254 -124851 -35093 -241718 -327229 16176
15353 -149451 260684 -25749 -276789 292515 468504 -76576 -12353 -315550 4043 -75428 379034
15341 -9923 175407 56691 -78487 -95767 19923 -253679 -184788 210620 98830 537630 133046
15329 210873 -512959 231972 59048 227429 -79676 -93220 -53400 -272813 -451460 453818
15318 132561 -89003 -114366 379365 -76616 166537 28587 -197486 187534 37046 178720
15308A78720c29443I3789b71467d2264l0483H5907A7310K61829F8713J38220K9258
15297B36191a57319I3859k7214l1166m652a50395B11119j5094o6016a4247k00933
15286b15180B21551C9246J40116a37066A01152K27768B4681N4369K2409P0641
15276A72100Q208J15676h6112A15274J17795b17193G5688K29225G7269L5304K45762
15265C58335a59798r560A34638D2386N9503a92478B01794G7168J57566d4808k50006
15254b94814A92779a320A00114A1358a2269A11586J118604j93694N93882m77411
15244A152967Q9085B65243k7475F3476R2407D6721J39402I0311J2613B7475J40458
15233A67933J09094A29729C3300J90551H3588M8570J05252j9937o1191j6435B2096
$$ plain form
15308 178720 -329443 93789 -271467 -42264 -72747 85907 17310 279139 68713 206933 236191
15297 236191 -157319 93859 66645 35479 30827 -150395 211119 196025 130009 -14247 -215180
15286 -215180 221551 39246 179362 -137066 101152 328920 24681 79050 101459 172100
15276 172100 180308 295984 -86112 115274 233069 -217193 75688 304913 77269 112573 358335
15265 358335 -159798 -169358 134638 42386 101889 -192478 201794 77168 234734 -44808 -294814
15254 -294814 192779 -1320 100114 11358 -12269 111586 1230190 1036496 1630378 1152967
15244 1152967 1242052 265243 237768 63476 155883 46721 186123 90311 102924 27475 167933
15233 167933 277027 129729 33300 223851 83588 132158 237410 217473 156282 139847 22096
15221b31208J03101A22460i5765A24359a15205A43508a06549D69349B3714b56613
15210E8883b3668G1611b996A64800a33832b9601B47676j02799Q3651a89848C26642
15198a19818D60642j99709B257a48059B11055d0370D8615k0325J1725a08516F0111
15186c7624k6292J8039A96159a64915B1502m798O078K82839E862K97077n7033
15175B45906d2556G241a09282D53237b34195A04880a29503A24257C0984g8905
15164g7699l59224f2477h094l48803E31919f2075A53907J3569e1915G9329R9888
15153A79217J50887o6270o8435c9728D6100K2554a36134G6341L65288F6176J3745
15142G9921K44693A44325J0579d2846C35198j36842o1925c1799A4969K61410D8112
$$ plain form
15221 -231208 -128107 122460 -95765 124359 -115205 143508 -106549 469349 23714 -256613
15210 58883 -23668 71611 -2996 164800 -133832 -29601 247676 144877 228528 -189848 326642
15198 -119818 460642 260933 2257 -148059 211055 -40370 48615 28290 40015 -108516 60111
15186 -37624 -63916 -45877 196159 -164915 21502 16704 22782 305621 5862 302939 245906
15175 245906 -42556 7241 -109282 453237 -234195 104880 -129503 124257 30984 -78905
15164 -77699 -436923 -62477 -8094 -356897 531919 -62075 153907 167476 -51915 79329 179217
15153 179217 330104 263834 195399 -39728 46100 68654 -136134 76341 441629 66176 79921
15142 79921 324614 144325 154904 -42846 335198 198356 136431 -31799 14969 276379 48112
15130A93982P5295j066j26041o8013K42824k7222A04771c1163C94054D7392K90689
15119C38081A00687M8620b9987k7560I9381a9103H5403a12699G4486d18010H6062
15107B15780j02020m1772J6026J07493I4992M58862h6153L6233G0212J45310j7365
15096A98157m8672h8612A42495E5407L1794M6804J3658a98745i2222C06136b41972
15084B54274g3348k9409A80595J4167l4088K5241q7995K4738C8541d9591A16450
15072C0887J36457A1933M19284J2527A35894b07998C78158C3857J61976N2J04207
15061C00092A36202M4663D4138d5866F3071K56407j07865J2147H8234d4198A30482
15049D79884C5506b01464C44041i3991B61948F5920M22627A27553Q0405o0965
$$ plain form
15130 193982 269277 268211 142170 74157 316981 289759 104771 -31163 394054 47392 338081
15119 338081 100687 149307 -29987 -57547 99381 -19103 85403 -112699 74486 -418010 86062
15107 215780 113760 71988 88014 195507 94992 553854 -86153 -49920 70212 215522 198157
15096 198157 149485 -88612 142495 55407 87201 134005 147663 -198745 -92222 306136 -241972
15084 254274 -73348 -102757 180595 194762 160674 185915 97920 122658 38541 -49591 116450
15072 30887 167344 11933 431217 443744 135894 -207998 378158 33857 195833 195885 300092
15061 300092 136202 180865 44138 -45866 63071 319478 211613 223760 88234 -44198 130482
15049 479884 35506 -201464 344041 -93991 261948 65920 488547 127553 207958 146993
15039A46993J02610p016k1290j6213e1350A77627J2901K7413M3830A16090J97186
15028C13276d2429A73217R0900P9965a17126H654J79171K20911g2311B55613D4454
15016C51601j17370r348J5344A19930R690K63844m3222D3616J93672n3320g8025
15004C62804R8524K26205B47251J19135A30717J20747r6305b9127k8434A64278
14993B59950e2888C1356J82259R3973j1318b79206A77968J68283i255r3289B38250
14981B54880J58345b8607G5394f6766H3813P6762J42847j02234K29293p9826j25209
14970B25446E8532j2842R4258K9503J10515J11975o1024d734A65295B9873O6488
14959I6361j5777J89543I9401L39990A57832a8133B32068K9542J00693k6275M719
$$ plain form
15039 146993 249603 242587 221297 205084 -51350 177627 190528 217941 261771 116090 313276
15028 313276 -42429 173217 264117 344082 -117126 8654 187825 408736 -72311 255613 44454
15016 351601 234231 224883 240227 119930 129620 393464 350242 43616 237288 183968 -78025
15004 362804 461328 687533 247251 366386 130717 251464 155159 -29127 -57561 164278
14993 259950 -52888 31356 213615 307588 296270 -279206 177968 346251 -9255 -102544 238250
14981 254880 413225 -28607 75394 -66766 83813 160575 303422 201188 430481 350655 225446
14970 225446 58532 45690 139948 169451 279966 391941 330917 -4734 165295 29873 96361
14959 96361 80584 270127 99401 439391 157832 -18133 232068 261610 362303 336028 340747
14948C40747B1057K59561M3117M9228M9516A94156G8649C202L33683A58537E2780
14936E78135B62206L44548f5689A73070g5939F8732J28066J1043J76646P5766
14926D60253j46543A36677J96364j09831c0959B08446K11426A38282k3701L44398
14916D58979A76986p7676K39092D918O90925B97497K31694L4206j78379J9510
14906D04528o6900A59720l217J40390K32089A79140K54825p2442n3688K32081
14896E39916o670J39309m4220B49448K21666k20418K95722o2846K59894l14182
14886D29284r1044r4050G8485K19595J44884A21133J54765d2273C18246F6604
14875C94264L4664o0779r277N6552A59164L87619k14763J3049A14892N42500k83964
$$ plain form
14948 340747 21057 280618 323735 372963 422479 194156 78649 3202 336885 158537 52780
14936 578135 262206 606754 -65689 173070 -75939 68732 196798 207841 384487 460253
14926 460253 313710 136677 333041 223210 -30959 208446 419872 138282 114581 458979
14916 458979 176986 99310 338402 4918 695843 297497 529191 563397 385018 404528
14906 404528 337628 159720 156503 296893 528982 179140 433965 361523 307835 539916
14896 539916 533246 672555 628335 249448 471114 250696 546418 483572 743466 429284
14886 429284 338240 244190 78485 298080 442964 121133 275898 -42273 318246 66604
14875 394264 428928 368149 358872 415424 159164 546783 332020 345069 114892 657392 373428
14864C73428n554l1507R7274j42886L82644l03691J02583k19721K71856B11487
14853B89768o8486L31435j53234M2730o355k09967O4540M2919r9728J5606K97818
14842E47046o6748j03201N5825J75196k82666M87008B25156L20523J35893p0636
14832F10936k54647A13127J10012J74620J33911D9743K53620j2677a0834D08509
14821D60452j27116L71658k21688n8960L38870C68780N9183J89041q540j21545
14811D86919n8834j59667l495K04800H9129M05471J91320j93130j25458J17607
14801D84939K2019J81721j34944j27040J06744j68858J85754k9482Q9130j6240
14791E93743B38056J61412O85036l31631l11782K67736A51252K95087o6654K27710
$$ plain form
14864 373428 367874 336367 433641 290755 673399 369708 472291 252570 524426 211487
14853 289768 221282 552717 399483 442213 435858 225891 290431 333350 233622 249228 547046
14842 547046 480298 377097 432922 608118 325452 812460 225156 545679 681572 610936
14832 610936 356289 113127 223139 397759 531670 49743 303363 290686 -10834 408509
14821 460452 333336 704994 483306 424346 763216 368780 427963 617004 608464 486919
14811 486919 428085 268418 264923 469723 89129 494600 685920 492790 367332 484939
14801 484939 506958 688679 553735 426695 533439 364581 550335 520853 609983 593743
14791 593743 238056 399468 1084504 752873 441091 708827 151252 446339 379685 607395
14781F07395k57170J32409J28949B04072J90442J75499M1584j5079B31760K95871
14771E27631j05197M39102l03670j5318p623J62041j62496j35166J72247J30938
14761G02489E8101N53245K73239l02812q2032p6106j0393L31099j61744B75034
14750I59582C94431J39619j025K27971J6682B72705L81188j73660n8933P7916
14740D99216J27225K61127Q4407k57454N1144k1599m5763L8964r4070k0478K76115
14729H98834C93278J91398K37860J39793k98461J50368j00919J06049q0803J5694
14719G54257j281J7671J73Q8503K96046l50533K79144j31260r4242j21082K77040
14708A014436K1095l63527J73154K98800l37572l46446N08326l68626O8672J13812
$$ plain form
14781 607395 350225 482634 611583 204072 394514 570013 611597 596518 231760 527631
14771 527631 422434 861536 557866 542548 534925 696966 534470 399304 571551 702489
14761 702489 58101 611346 884585 581773 499741 423635 413242 744341 582597 275034
14750 959582 394431 534050 533025 760996 777678 272705 653893 480233 421300 499216
14740 499216 626441 887568 971975 714521 765665 744066 698303 737267 643197 622719 898834
14729 898834 393278 584676 822536 962329 663868 814236 713317 819366 738563 754257
14719 754257 752976 770647 770820 859323 1155369 804836 1083980 952720 858478 737396 1014436
14708 1014436 1035531 672004 845158 1143958 806386 459940 968266 599640 668312 782124
14698G82124J8653J73777k3270J59337J050m06173K55017q8424k7098o6885L16401
14687A094509k03635l84730M26170j43287r045K96936j92187J63266j8878j01908
14677I27211O9515R5946l46634J84935M441l7393n0208N8933j6952k06382K43939
14666I27351k6512j16397K62137j60608k4110p7794O56769m32080Q8227K0255
14656A117238m3039j65629J14687L60097l50657P835K87088q9240k8304k8347
14646A181729J09237j00935k3260k27516L96627j66531J2319k5125K52075k30291
14636A178329L06789j13698k84428K02662K66032k75552m9809o9876j9558M80959
14626A621850l61165O3552J10299M9093k5261p1861O0818r1475N7739k53091N26904
$$ plain form
14698 782124 800777 974554 951284 1110621 1111671 705498 960515 872091 844993 778108 1094509
14687 1094509 890874 506144 932314 789027 779982 1076918 884731 1047997 1029119 927211
14677 927211 996726 1092672 746038 930973 935414 898021 847813 906746 889794 683412 927351
14666 927351 900839 784442 1046579 885971 861861 784067 1440836 1008756 1096983 1117238
14656 1117238 1074199 908570 1023257 1383354 1032697 1040532 1327620 1238380 1210076 1181729
14646 1181729 1290966 1190031 1166771 939255 1335882 1169351 1181670 1156545 1408620 1178329
14636 1178329 1485118 1371420 1086992 1289654 1555686 1280134 1230325 1160449 1140891 1621850
14626 1621850 1260685 1324237 1434536 1483629 1458368 1386507 1447325 1355850 1413589 1160498 1687402
14615A687402j43495j11192j22397J86906p1029n9317J49886q5876p193j25947
14605A297748K30671O1011j184K57643l25530R226k10882M23793k55978k29651
14595A256867O7293M32004j80664P5439J28137o1323Q3916Q5099l63207p4525
14585A449036L54998L08933j03415m1470j80158K24895l9256J09187J02809j91804
14575A993755p0199M2520r4337L37880J35135j55076J0618J75246j1784r9337
14565B264421K29114j23308L1081L86122m24880K50626N0901J95984K46242j13487
14555B992816j3248L64503M53384O58384L30531J383228K001363N328550J1567058
14546B5066569J0176702K173116j4779425j0506121E780249k134516r14890n46575
$$ plain form
14615 1687402 1543907 1432715 1310318 1497224 1426195 1366878 1516764 1430888 1423695 1297748
14605 1297748 1528419 1589430 1588246 1845889 1520359 1529585 1318703 1742496 1486518 1256867
14595 1256867 1324160 1756164 1575500 1650939 1779076 1717753 1801669 1886768 1523561 1449036
14585 1449036 1804034 2112967 2009552 1968082 1787924 2012819 1973563 2082750 2185559 1993755
14575 1993755 1923556 1966076 1871739 2209619 2344754 2189678 2200296 2375542 2363758 2264421
14565 2264421 2493535 2370227 2401308 2787430 2362550 2613176 2664077 2860061 3106303 2992816
14555 2992816 2979568 3344071 3797455 4455839 4786370 6169598 8170961 13499511 25066569
14546 25066569 35243271 37416387 22636962 12130841 5780249 3645733 2730843 2184268
14538B184268j36234J60840J38059n27122j44228M22656m0323k30848L01464o5384
14528B063148l601K11038K57391l72052M29692j02738P1372k20024L59519o07542
14518B086203R9699L83960K1459K48450k8484k12029J37915j03617L326N02073
14508C138955n06272N206P1570J71669L21196l45903J96771l4099k07805J95735
14498C007023P9218K26651J88540l20977K77782l96439L66984j19503l06769K84513
14488C287023K7135J39691M1167J54676j27847J85969J36160Q4829J96429l26348
14478C798884J2301K7607J04460M5078K53483l83847M15722k78O121j96483K19803
14467D302851m06054M66269K56772l51055J60193L50737j20426K08659j75508
$$ plain form
14538 2184268 2048034 2208874 2346933 1819811 1675583 2098239 2057916 1827068 2128532 2063148
14528 2063148 2059547 2270585 2527976 2155924 2585616 2482878 2554250 2334226 2693745 2086203
14518 2086203 2185902 2569862 2591321 2839771 2811287 2599258 2737173 2633556 2636882 3138955
14508 3138955 2632683 2637889 2709459 2881128 3202324 2856421 3053192 3019093 2811288 3007023
14498 3007023 3086241 3312892 3501432 3180455 3458237 3061798 3428782 3309279 3002510 3287023
14488 3287023 3314158 3453849 3495016 3649692 3521845 3707814 3843974 3928803 4125232 3798884
14478 3798884 3811185 3838792 3943252 3988330 4241813 3857966 4273688 4273410 4279531 4083048 4302851
14467 4302851 3896797 4363066 4619838 4268783 4428976 4779713 4659287 4867946 4692438
14458D692438p271P8168J25767j65476K83499j29819N40616k53499j59685K36612
14448E241350K73284l92054L41685J47832j37093L63604r8522o3027K91437j57924
14438E810572j9386q5165L74192p568L33832j72660M4196N11085p7991J34027
14428F845134M670k49488L19106M55030k52766J87376p4147K43876k22406M03710
14418G660095K88921o00K87121l42660K49692K74906Q6616Q1687N93981k15538
14408H964221Q4511j77930p1460O80618m5437L21122K14340k5158L75071N4597
14398A0374495M69216o7167L9432L75089j59242M97266m6897L33859J18348K78261
14388A2212660K37487J44414L78909J37513L68047J74900L97254L2011M27502
$$ plain form
14458 4692438 4685167 4763335 4889102 4723626 5007125 4877306 5417922 5164423 5004738 5241350
14448 5241350 5514634 5122580 5464265 5612097 5475004 5838608 5740086 5677059 5968496 5810572
14438 5810572 5791186 5706021 6080213 6072645 6406477 6233817 6278013 6789098 6711107 6845134
14428 6845134 6849804 6600316 6919422 7374452 7121686 7309062 7234915 7478791 7256385 7660095
14418 7660095 7949016 7948416 8235537 7892877 8142569 8417475 8504091 8585778 9179759 8964221
14408 8964221 9048732 8870802 8799342 9479960 9434523 9755645 9969985 9944827 10319898 10374495
14398 10374495 10843711 10776544 10815976 11191065 11031823 11529089 11482192 11816051 11934399 12212660
14388 12212660 12450147 12594561 12973470 13110983 13479030 13653930 14051184 14083195 14510697
14379A4510697J63975K49935O21452L9130K50018K91347Q04176j25927L28257
14370A7133060J79272M50168K21345Q20266j16776N16984O31079K12112K01153
14361B0248663P62626M84486M86369M41053N91232L56444J015963N97693M80829
14352B5465358M43135O51306M83355J099572N66519O11086O75867N31875J026201
14343C1554274J005897N79483J173518M57492J681821R58602N86720J190546J459510
14334D0647863J257103J200908R71480J249297J366022J940213J083916J927159
14326E1643961J855289J486903J881350K412416J565413K322219K044060K713199
14318F7924810K269052L113825K585791K703784L629628K568467L962582L564087
$$ plain form
14379 14510697 14674672 14924607 15546059 15585189 15835207 16126554 16930730 16804803 17133060
14370 17133060 17312332 17762500 17983845 18804111 18687335 19204319 19835398 20047510 20248663
14361 20248663 21011289 21495775 21982144 22423197 23014429 23370873 24386836 24984529 25465358
14352 25465358 25908493 26559799 27043154 28142726 28709245 29320331 29996198 30528073 31554274
14343 31554274 32560171 33139654 34313172 34770664 36452485 37411087 37997807 39188353 40647863
14334 40647863 41904966 43105874 44077354 45326651 46692673 48632886 49716802 51643961
14326 51643961 53499250 54986153 56867503 59279919 60845332 63167551 65211611 67924810
14318 67924810 70193862 73307687 75893478 78597262 82226890 84795357 88757939 92322026
14310I2322026L713326M252237M505089M527832M901495M948717O006311N707563
14302A30884596O104829O805629O945219P325688Q477023Q035332Q891786R526349
14294A92996451J0289278J0653975J1355386J1882931J2798685J2684821J3904705
14287B76566232J4451294J5057303J5242160J6022360J6093302J6211495J6484548
14280C86128694J5647662J5768960J4761851J3538413J2192585J0378633P037978
14273D75454776L154989m53725m098583p422050O41166j634251o758063p626602
14265D51257657r767060j1632691j3631447j4974352j5606922j5969441j6405271
14258C53270473j5994649j6675885j5865617j5633778j4373028j3997912j3240509
$$ plain form
14310 92322026 96035352 100287589 104792678 109320510 114222005 119170722 125177033 130884596
14302 130884596 136989425 143795054 150740273 158065961 166542984 174578316 183470102 192996451
14294 192996451 203285729 213939704 225295090 237178021 249976706 262661527 276566232
14287 276566232 291017526 306074829 321316989 337339349 353432651 369644146 386128694
14280 386128694 401776356 417545316 432307167 445845580 458038165 468416798 475454776
14273 475454776 478609765 478156040 474057457 466635407 467276573 465642322 458884259 451257657
14265 451257657 441490597 429857906 416226459 401252107 385645185 369675744 353270473
14258 353270473 337275824 320599939 304734322 289100544 274727516 260729604 247489095
14251B47489095j3053057j2105128j1296883j0674910j0308627r630437q517732
14244A71902321q460362p885107p175796p470085n974532o325435n698037n135798
14236A17777169n480446m950569m494264m469421l797675l381547l934055l407090
14228H3862102l368274l161493k868773k691755k870470k284820k405274k106033
14220F2105210j973210j895743j999364k266297j392202j721302j471757j118932
14212D8266403j944664j572424j463835j016958q87757j143084j145801j202817
14204C7889063j102731j049296r78999j43134j366662p88415j191258q21889o80986
14195B9765693p50626o50330l94907j254241o25825n44515j96150r15020o66010
$$ plain form
14251 247489095 234436038 222330910 211034027 200359117 190050490 180420053 171902321
14244 171902321 163441959 155556852 148381056 140910971 134936439 128611004 122912967 117777169
14236 117777169 112296723 107346154 102851890 98382469 94584794 91203247 87269192 83862102
14228 83862102 80493828 77332335 74463562 71771807 68901337 66616517 64211243 62105210
14220 62105210 60132000 58236257 56236893 53970596 52578394 50857092 49385335 48266403
14212 48266403 46321739 44749315 43285480 42268522 41380765 40237681 39091880 37889063
14204 37889063 36786332 35737036 34758037 34614903 33248241 32459826 31268568 30446679 29765693
14195 29765693 29015067 28364737 27969830 26715589 26089764 25545249 25349099 24434079 23768069
14186B3768069p22929J36371q49089n00748m10933k36628r01606k47294m80303
14177A9554910l67004l93969j99319m30408p61791j2490j51823o32962m9415l57966
14167A6197763l99088p37983N33239q30176j50944L905n62516n68420J41023k72852
14157A3353951n95631J5268K94850q40317J00795m02586j02650j47393p4830J04964
14147A1706421n30041K54789m59176k72005k68143k51941J39970k2877k39911
14138A0057086n09655J37453J07944j65727m37262j88736k93933L8902o3021q3171
14128H599880l48672j61701K05281j95643J8453n2265j94796o8211j87142j67687
14118G447497j23113J53737k30939l32820J93483n7093l09236K51534k95012l90153
$$ plain form
14186 23768069 23045140 23181511 22332422 21831674 21420741 21184113 20282507 20035213 19554910
14177 19554910 19187906 18793937 18594618 18164210 17402419 17389929 17238106 16605144 16555729 16197763
14167 16197763 15798675 15060692 15593931 14763755 14612811 14616716 14054200 13485780 13626803 13353951
14157 13353951 12758320 12773588 13068438 12228121 12328916 11926330 11823680 11676287 11601457 11706421
14147 11706421 11176380 11431169 10971993 10699988 10431845 10179904 10319874 10296997 10057086
14138 10057086 9547431 9684884 9792828 9627101 9189839 9001103 8707170 8746072 8683051 8599880
14128 8599880 8251208 8089507 8294788 8099145 8117598 8065333 7870537 7802326 7615184 7447497
14118 7447497 7324384 7478121 7247182 6914362 7107845 7050752 6741516 6993050 6698038 6307885
14108F307885P3203q2197j18261K41628o9470J66837n59815J83192k17575Q7120
14098F012547q9773o90657L86104K42725l11245j00126j9554K15026o35035J22880
14088E132892M9813m36920K24634k28483K38905J50616n30050L1566K9723k98682
14078D364014K15145j61427O5486j95444K08524L8302j43327k06801k28629N32494
14068D488337m60050M3643K0202m8489m2669j82994J7532J3135J88965l07897
14058C729715K59193j09805j98307Q2967k8060l48308M80534n14285K46286n5396
14048C544534k26711j3312M83396n48325j33590J13385p7213l2644j03737K87474
14038C293257j78935o8082J28706k93303L4709j5218j69303M64545j94273K7230
$$ plain form
14108 6307885 6381088 6298891 6180630 6422258 6352788 6519625 5959810 6143002 5925427 6012547
14098 6012547 5922774 5232117 5618221 5860946 5549701 5449575 5430021 5645047 5010012 5132892
14088 5132892 5182705 4745785 4970419 4741936 4980841 5131457 4601407 4632973 4662696 4364014
14078 4364014 4579159 4417732 4483218 4287774 4496298 4534600 4391273 4184472 3955843 4488337
14068 4488337 4028287 4071930 4092132 4043643 4000974 3817980 3835512 3848647 4037612 3729715
14058 3729715 3988908 3879103 3680796 3763763 3735703 3387395 3867929 3353644 3599930 3544534
14048 3544534 3317823 3304511 3787907 3239582 3105992 3219377 3142164 3109520 3005783 3293257
14038 3293257 3114322 3046240 3174946 2881643 2916352 2901134 2731831 3196376 3002103 3029333
14028C029333k33618j82325J72127J1789r9160k51473j69271P66163l78560j71919
14018B493086j41509J26140R3542j67595l09175P0355K46405J07970l09673M6996
14008B256542j11808J89894L81191k56706m51848k96167N72520k02202J77027
13999B258443j09897l3768j79197J73982R4166k64179j59990M39482j11853P14718
13989B821907J344338L744895J0287245J3246073N531301j1123385j1366186n486369
13981H999819l015657j073593n85013q65102J08443n29897r7739k99031l7987
13972B604243M7629n4916l59753M592k4070K4160j69081N0771N4940J03561r9907
13961B182169l3815j73131K5470j60967K85991l46042K26627j57043m644J95195
$$ plain form
14028 3029333 2795715 2613390 2785517 2797306 2698146 2446673 2277402 3043565 2665005 2493086
14018 2493086 2351577 2477717 2571259 2403664 2094489 2164844 2411249 2519219 2209546 2256542
14008 2256542 2144734 2334628 2715819 2459113 2007265 1711098 2283618 2081416 2258443
13999 2258443 2148546 2114778 1935581 2109563 2203729 1939550 1779560 2219042 2107189 2821907
13989 2821907 4166245 7911140 18198385 31444458 36975759 25852374 14486188 8999819
13981 8999819 5984162 4910569 4325556 3460454 3568897 3039000 2941261 2642230 2604243
13972 2604243 2651872 2596956 2237203 2241795 2217725 2241885 2072804 2123575 2178515 2282076 2182169
13961 2182169 2148354 1975223 2000693 1839726 2125717 1779675 2006302 1849259 1844615 2039810
13951B039810L6675k39685j17510K32622K05008k75746q0332J67268l45585m6121
13941A576404M33885l52669K23033l03362J43787j06426p147j10369P6474J04681
13931A678291j25515j98845r479M00730J66334k15583m34246O1785K12915K73112
13921A809499l96506J37165k89287L94051j78500k38201J1386l1354K75716m28811
13911A065158K70652J13181M51582o50048J6383L1603L5872q9374L40798N9646
13901A645453l83728L62601l27767P7213Q8896l95272J3955J93886j78533k29850
13891H66854P10033l27022O2186r8409k75461K93069l11620J01039J66744n9720
13881A127693K8411k01100M44854j61508l44290J30523K26870j49900j40170J20558
$$ plain form
13951 2039810 2076485 1836800 1719290 1951912 2156920 1881174 1800842 1968110 1622525 1576404
13941 1576404 2010289 1657620 1880653 1577291 1721078 1614652 1607505 1497136 1573610 1678291
13931 1678291 1552776 1353931 1344452 1745182 1911516 1695933 1261687 1323472 1536387 1809499
13921 1809499 1412993 1550158 1260871 1654922 1476422 1238221 1249607 1218253 1493969 1065158
13911 1065158 1335810 1448991 1900573 1250525 1266908 1298511 1334383 1245009 1585807 1645453
13901 1645453 1261725 1624326 1296559 1373772 1462668 1067396 1081351 1275237 1096704 866854
13891 866854 1576887 1249865 1312051 1213642 938181 1231250 919630 1020669 1187413 1127693
13881 1127693 1156104 955004 1399858 1238350 894060 1024583 1251453 1101553 961383 1081941
13871A081941Q9188k22033N69755o06047K32796K41053K44262o71154J28561j77967
13861I10355K65165j274n5777J16390l6298R0539l04254m9674J46645M854j49261
13850I37410m9138P8809L27533n25167L23659l26898K50685k463k5922m0889n1387
13839H96232J51551m83820L66857J02382k29310l0679K47967M40997F07840M33754
13829A041594l56461J57882N6039j87121J23206o7623L58032m89144J20490P7001
13819H33895J15693m7116j57506J7213j4991j38293J10970M08362l37062k56397
13809E34768j3380L26714k66318L31371J21239l13381q7768J30334k24491J96014
13799G35102K16657j78802l15623N34184k69478l2415J82384C48040N48827n1768
$$ plain form
13871 1081941 1171129 949096 1518851 912804 1145600 1386653 1630915 959761 1088322 910355
13861 910355 1175520 1174246 1118469 1234859 1198561 1289100 984846 935172 1081817 1086671 937410
13850 937410 888272 967081 1294614 769447 1093106 766208 1016893 1014430 988508 947619 896232
13839 896232 1047783 563963 930820 1033202 803892 773213 1021180 1462177 607840 1041594
13829 1041594 685133 843015 899054 711933 835139 767516 1125548 636404 756894 833895
13819 833895 949588 902472 744966 762179 747188 608895 719865 1128227 791165 534768
13809 534768 521388 848102 581784 913155 1034394 721013 633245 763579 539088 735102
13799 735102 951759 772957 457334 991518 722040 689625 872009 348040 896867 845099
13789H45099D07475N13537k92761j45697J34046L64905j30738j78046J32222k65948
13779E38995j5526J59898J9206J12117K31548q8871j29612k71710K84796j5058
13769H25783n3101m0776q7051R9434j08354j40122l7633R7564L6172k59808L68893
13758G01001m2435k38734J70922j14038K59414j37878j64133M05368C62643M75574
13748H38217m00764B05569L53835q9355K09255k18426K79860C53731J84830K53068
13738G91629j89352l071m4909m4281o3551K43544N6078k83426R4934H9384O08936
13727F98320j96727J17900M31265n07224j08107P0952O6280P4023m4653k72577
13717C29452K80927p1797K94195r4008Q655j49116j8430J0213B04160L88067o0317
$$ plain form
13789 845099 407475 921012 628251 482554 616600 981505 850767 672721 804943 538995
13779 538995 523469 683367 702573 814690 1046238 957367 827755 556045 840841 825783
13769 825783 772682 731906 644855 744289 635935 495813 458180 555744 591916 332108 701001
13758 701001 658566 419832 590754 476716 736130 598252 434119 839487 362643 838217
13748 838217 437453 205569 559404 470049 679304 460878 740738 353731 538561 791629
13738 791629 602277 599206 554297 510016 446465 690009 746087 462661 557595 89384 698320
13727 698320 501593 619493 1050758 543534 435427 506379 572659 646682 602029 329452
13717 329452 610379 538582 832777 738769 747424 598308 579878 590091 204160 592227 531910
13706E31910r6627J15871A63838K63123R6298A11306N63922R1967r4155k16671
13696D56369j6950J28506p917Q1662j01651M6966N8045n3899j40122K00005k57646
13685C93368K14851j15825k40498I9484M07964A40931M33238B60247K14116B24189
13674C90372J11453m0331o8894K15644J7392k58191K16699j03787K53946j31040
13664F03263B24461J79308R5045J84804l33728P1141K96225B81444R4306L65574
13654G41324C70134J02826k4036L7857Q3640j80284l4740k2780P4183K58199A66353
13642D86508K99639p7523j86625B30046P5188A36130l8191K92832K14751A40405
13631B54804J30095j75777K53166q4085p623k9766p2036E3806M3928N60502B83313
$$ plain form
13706 531910 435283 551154 163838 426961 523259 111306 675228 767195 673040 456369
13696 456369 439419 567925 560008 641670 540019 586985 645030 591131 451009 651014 393368
13685 393368 608219 492394 251896 99484 507448 140931 574169 260247 474363 224189
13674 390372 501825 461494 392600 608244 625636 367445 584144 480357 734303 603263
13664 603263 224461 403769 498814 683618 349890 421031 717256 281444 375750 741324
13654 741324 370134 472960 448924 486781 570421 390137 355397 332617 406800 664999 166353
13642 486508 786147 708624 521999 230046 305234 136130 97939 390771 605522 140405
13631 254804 384899 209122 462288 378203 370580 340814 268778 53806 97734 658236 283313
13619D38444A06258J14648K79598j90710P3865J2497A92029L75130j78j83272
13609C83709J23142j41493J60477B29396J89512L07756A6105M50845j08233J4620
13599C73337l5547A11490L82177A68731R3613a31200C07353o2355q1931J50343
13589C13410l5326l7766Q2874j49722j4520K47878p4696l1740R8931f9900I1129
13577H2001L36995M5750B26483j2027K54021j77128J92859m7076j9747P6376B34430
13565A02575J64875O6804A41957M29271A90170p8151K32561A07294L6015J37153
13555B80462A35680M25173M9499A41271J33659m3990a39209D04820K54478A83993
13544A70746J29644J79754j93246J31492b5071B3864J6331Q433L29889O0668A64458
$$ plain form
13619 438444 106258 220906 500504 309794 383659 396156 192029 567159 566981 383709
13609 383709 506851 365358 525835 229396 418908 726664 16105 466950 358717 373337
13599 373337 337790 111490 493667 168731 262344 -131200 307353 244998 163067 313410
13589 313410 278084 240318 323192 173470 158950 406828 332132 300392 399323 -69900 91129
13577 82001 418996 464746 226483 214456 468477 291349 484208 437132 417385 493761 234430
13565 102575 267450 334254 141957 571228 190170 112019 344580 107294 143309 280462
13555 280462 135680 560853 610352 141271 274930 230940 -139209 404820 659298 183993
13544 170746 300390 480144 286898 418390 -25071 23864 40195 48628 378517 439185 164458
13532C92852a54511F0045J95420M1298J06921A00957K19108j06483L78076A06878
13521C27026j00630K75498j39589J60050j184j6198j12937m8672A0758M11108
13511D21866D9979K80809J19422J15376j26878G5482L08572P1329d5121I5935
13500E17904c28799C90315A64426J35374l8300L06702B14401K00586l6125g3461
13489C74907j33535K4205r0316k0943l5529a00612B20034A2762K1653J21487b7951
13477A71718K05242j11148e435B19612A04137J55015P0015j19368K68780a14512
13466A56911m1531L18733A84794J75664L7205m4335a11282C02964o026d563C49241
13454I5970J68220A29671l8087N54M82252A49147K2406E9009J82305B9340K559
$$ plain form
13532 392852 -154511 60045 255465 296763 403684 100957 320065 213582 591658 106878
13521 327026 226396 501894 362305 522355 521171 504973 392036 343364 10758 421866
13511 421866 49979 330788 450210 565586 438708 75482 384054 455383 -45121 95935
13500 517904 -328799 390315 164426 299800 261500 568202 214401 414987 378862 -73461
13489 374907 241372 265577 175261 154318 118789 -100612 220034 12762 34415 155902 -27951
13477 171718 376960 265812 -5435 219612 104137 259152 329167 209799 478579 -114512
13466 156911 115380 434113 184794 360458 397663 353328 -111282 302964 296938 -4563 349241
13454 95970 264190 129671 91584 92138 574390 149147 171553 59009 241314 29340 31899
13443C1899P0645L9224A2136a3648H4060K7017E4043c8749C9144M8715L58543
13432D46402j31997A14234N7556E7378K93702M759R6306J19225F3209J53520a51462
13420D92266A27266K45302J12085j00138O237j09446M1536g9094B40665F5149
13409B99836a34967F8377M9415K00429j48638J26041l7447J07750M8190A87085
13398C68633p4520E0920J38948e0122A85973N1655E3063Q0337i5580I0286B5246
13386C39079F3634K7334K49256B5917K77212J01361j67046b1068A08297a30167
13375B48570C0813L54564r8792n9473l2577I698L84651o2921r6824J36007Q8870
13364D59481B20022G1043L44825A58843i2797F27524k42190A57841g9316B95406
$$ plain form
13443 31899 102544 141768 12136 -13648 84060 111077 54043 -38749 39144 87859 446402
13432 446402 314405 114234 171790 57378 351080 355839 452145 571370 63209 216729 -151462
13420 492266 127266 372568 484653 384515 390752 281306 322842 -79094 240665 65149
13409 299836 -134967 68377 117792 318221 169583 295624 258177 365927 414117 187085
13398 368633 294113 50920 189868 -50122 185973 237628 53063 133400 -95580 90286 25246
13386 339079 63634 90968 340224 25917 303129 404490 237444 -21068 108297 -130167
13375 248570 30813 385377 286585 227112 194535 9698 394349 331428 234604 370611 459481
13364 459481 220022 71043 415868 158843 -92797 627524 385334 157841 -79316 295406
13353B59755A18801B8130N2057J65966J06014J03502k05466D4954L78966L21762
13343G45682B92336j14459J20234Q780m9191A23895O6291J7161G8617d20861A71578
13331a27326B00310Q6363q5438D7630J76885j09340J16511B7348L30253A12794
13320B20382D0713a26B21287k5303f3235A00283L48704A72716R4290a76145A24097
13308B24391a82021C57070A73675J77160R0403A58898k4096K12318j25722n0809
13298A70589J75554c1172A60681B5177R349L4965K49393j2759h5828L5754A46300
13286F0038f48A40915J30567a77417A80158c9178K151A48989C5350J01996M0049
13275A77395K753D8169g1469A99536K42363A99246c1109k49466F5144N7432i1749
$$ plain form
13353 259755 118801 28130 80187 246153 352167 455669 250203 44954 423920 745682
13343 745682 292336 177877 298111 306891 257700 123895 190186 207347 78617 -420861 171578
13331 -127326 200310 286673 201235 47630 224515 115175 231686 27348 357601 112794
13320 220382 40713 -126 221287 195984 -63235 100283 448987 172716 267006 -176145 124097
13308 224391 -182021 357070 173675 350835 441238 158898 134802 347120 221398 170589
13298 170589 346143 -31172 160681 25177 34526 69491 318884 306125 -85828 -50074 146300
13286 60038 -648 140915 271482 -177417 180158 -39178 -37027 148989 35350 137346 177395
13275 177395 180148 48169 -71469 199536 441899 199246 -31109 -280575 65144 122576 -91749
13263D51682a39329C43096C8556K92640B5485h9513O830G75Q7911A9494J66254
13252A85748o1038b95621B66243j20r7273J91348A0553b04642E3534N8243J59312
13241B71089H9982P9323O984a22091I0274R3821a15878j20594B15673A05606a8268
13229a19582A6029b0572E07102H5449K05590G7122a92110A12766n0583g8282B97653
13217f7371j08016D10301A88329f6472G0580j7891L28648g6140A66898J8018O3297
13206B48213A12015J13168f3892l7057A88224c6972k14457G1006a55694A20053
13195B81860I8988b4568C42741c6544r1452B48648b30272C4334N5431a00565G6093
13183C72241r9785J27464A62493n7969b35280a01100F0730k3455a43023L1875
$$ plain form
13263 451682 -139329 343096 38556 331196 25485 -89513 -82683 775 88686 19494 185748
13252 185748 124710 -295621 266243 266123 168850 360198 10553 -204642 53534 111777 271089
13241 271089 89982 169305 176289 -122091 90274 184095 -115878 -236472 215673 105606 -18268
13229 -119582 16029 -20572 507102 85449 291039 77122 -192110 112766 62183 -78282 297653
13217 -67371 -175387 410301 188329 -66472 70580 52689 381337 -76140 166898 184916 248213
13206 248213 112015 225183 -63892 -100949 188224 -36972 -251429 71006 -155694 120053
13195 281860 98988 -24568 342741 -36544 -127996 248648 -230272 34334 89765 -100565 76093
13183 372241 272456 399920 162493 104524 -235280 -101100 60730 37275 -143023 -111148
13173a11148A05349b3488j2102k95734h4104G3526K12587n2756j03556K27502
13163C57303i4502a1990A09178A0850J23444r603J68891h5759A78161m6802c29438
13151A50534E7832a25538B61424j20613a4460k08382a05169B72129q1173r1122
13141I9834K05196a18552D1981K3290J16944D0387K65391b8104E993J89301J38906
13130C34200o7622j01369a4632I1567J93623N7389j24594J8994F0088n013a01648
13118B18765I5886a88846A43328g9353C3006a17430c842n9359A03900n1847d6799
13106i6542A95813N9106a2394A85143p5206J00210p2199l3436c07018d8022A39679
13094B73930j6623c353A87318P4561a34426A07769K23921r7677A12004f9589G9314
$$ plain form
13173 -111148 105349 -23488 -35590 -331324 -84104 73526 286113 233357 129801 357303
13163 357303 -94502 -11990 109178 10850 134294 124691 293582 -85759 178161 131359 -329438
13151 150534 57832 -125538 261424 140811 -14460 -222842 -105169 272129 190956 99834
13141 99834 305030 -118552 41981 65271 182215 40387 305778 -28104 5993 195294 334200
13130 334200 266578 165209 -14632 91567 285190 342579 217985 236979 60088 55075 -101648
13118 218765 95886 -188846 143328 -79353 33006 -117430 -3842 -63201 103900 52053 -46799
13106 -96542 195813 254919 -12394 185143 109937 210147 137948 104512 -307018 -48022 139679
13094 273930 257307 -3353 187318 261879 -134426 107769 331690 234013 112004 -69589 79314
13082a78509k3425A39207d8015j14700B93912c7294A11654i2667F2350c3139J0052
13071b3087j05141A62107M0446M8727p6088a87568o0971f1434B07283J78081m9122
13060C36242b46687B24098j00837a36464B45597A16595l7704J54521A3224a35088
13049B69984L2310j12833b67257a29455D96446A43723j5414c172A9313L7800K4879
13038H1992m78J79941M4589a30669A72481R260b0326B41100a30937C91218A76001
13026B55470j23432a22971j21762N4430A60458J46211H6123B6811L05743E3539
13015B31753N1092B6354K92386G1802A4936g5420A82153H3163P3994l954R1779
13004B44982k0351d11982B11449q8605K2183b3591A36548m6787L3997a28512E4052
$$ plain form
13082 -178509 -201934 139207 -48015 -162715 293912 -37294 111654 -92667 62350 -33139 -23087
13071 -23087 -128228 162107 202553 251280 175192 -187568 -248539 -61434 207283 385364 336242
13060 336242 -246687 224098 123261 -136464 245597 116595 78891 233412 13224 -135088
13049 269984 302294 189461 -267257 -129455 496446 143723 128309 -3172 19313 57113 81992
13038 81992 81514 261455 306044 -130669 172481 181741 -20326 241100 -130937 391218 176001
13026 255470 132038 -122971 -244733 -190303 160458 306669 86123 26811 332554 53539
13015 231753 282845 26354 318740 71802 14936 -75420 182153 83163 157157 153203 244982
13004 244982 224631 -411982 211449 122844 145027 -23591 136548 89761 123758 -128512 54052
12992B29497M3178K53402E5735O1898J93345A08945a56886A2409a80610A92945
12981H9334J43539K94969A82462d2508E2203a57308A606K43440I2478L033L6379
12970A31890a28758k4922d000E0155d3340D30601A22312C1805K85564R9647a67268
12958a78665E6591J04433F5686Q292a40495e6497B49427a54207d307F0598a6479
12946A38060A9519J16476K00862A19162a41856E9559j3982a78953g1896C1003
12935f5420c076B70224g6302K9526o8205q9639A90557a10672d9692A2667a42969
12923c3775n9568m1673C9592j1361a67906c5684j64784j10644A0936K9643J7764
12912E8343e2019A36126k6151J2770h7329J4540k49897H8828A1249J00331g7280
$$ plain form
12992 229497 272675 526077 55735 117633 310978 108945 -156886 12409 -180610 192945
12981 89334 232873 527842 182462 -42508 52203 -157308 1606 245046 92478 95511 131890
12970 131890 -128758 -153680 -4000 50155 -43340 430601 122312 31805 317369 417016 -167268
12958 -178665 56591 161024 65686 73978 -140495 -56497 249427 -154207 -4307 60598 -16479
12946 138060 19519 135995 336857 119162 -141856 59559 45577 -178953 -71896 31003
12935 -65420 -3076 270224 -76302 -46776 -114981 -204620 190557 -110672 -49692 12667 -142969
12923 -33775 -93343 -135016 39592 28231 -167906 -35684 -200468 -311112 10936 40579 58343
12912 58343 -52019 136126 109975 122745 -87329 -72789 -322686 88828 11249 111580 -77280
12900b0159k93668A20776R7385g0869D48057a02570b2534B205J2060J64456o4002
12889A14719E4959a91926A05777a61326C44931I967J91415c35404B79774r8239
12879A81535M3502c31929F6141b31697B3833K64993a83763d5626r9068A87823
12868C21695r5549a27218l4937j9493B04J91164e7880A26691D9889a93336b9301
12856B34077C108b6305C02682A7272a04325k60032B30637r8846D2131K4163l2470
12845C3824b8722A69907H3330M0872J31050k2873r4381D2904L81494j26116A39772
12833A87629o8463a59528f4050A1360L1365K0533L6838a15054N1041B88393a95369
12821a06772A5850J5757J67970a66719A67967a79244f3795m6324B68007l9303
$$ plain form
12900 -20159 -313827 120776 218161 -70869 448057 -102570 -22534 2205 14265 178721 114719
12889 114719 54959 -191926 105777 -161326 344931 9967 201382 -335404 279774 181535
12879 181535 225037 -331929 66141 -231697 23833 288826 -183763 -45626 -144694 187823
12868 321695 226146 -127218 -162155 -181648 204 191368 -57880 126691 49889 -193336 -29301
12856 234077 3108 -26305 302682 17272 -104325 -364357 230637 131791 42131 66294 33824
12845 33824 -28722 169907 83330 124202 255252 232379 137998 42904 424398 298282 139772
12833 187629 119166 -159528 -64050 11360 42725 63258 100096 -115054 -64013 288393 -195369
12821 -106772 15850 31607 199577 -166719 167967 -179244 -63795 -110119 268007 228704
12811B28704b5190D1003F467e4831j50978l05535G8172A8317R4159J96672b81720
12799B76810l1013b60317A20002f5954C49446c4901F0023a33405l5356A4748a99089
12787A38990a60503k46637G1339Q4473F1416a83916O5915n8041N8576H3397C0017
12775G0813R7283a7498B0453c21256A9998a52314b8618C76311g5540A56512e6589
12763a60278F7820B1661h6777I5043f9641G9579K0519Q6788B1344P887L05646
12752C34877G5223g2389D4908K06743n9832O7544h5197B46908E1199K49046b25292
12740A96465a97993e3599o6608A32149K23360b5761j13179m4360e6678A02056
12729A04025Q5737C4828i663k21674f4872P085A37152D9110a82130I1045b55411
$$ plain form
12811 228704 -25190 41003 6467 -54831 -205809 -511344 78172 18317 112476 309148 -281720
12799 276810 245797 -260317 120002 -65954 349446 -34901 60023 -133405 -168761 14748 -199089
12787 138990 -160503 -407140 71339 155812 61416 -183916 -118001 -176042 -117466 83397 30017
12775 70813 168096 -17498 20453 -321256 19998 -152314 -28618 376311 -75540 156512 -56589
12763 -160278 67820 21661 -86777 95043 -69641 79579 100098 186886 21344 29231 334877
12752 334877 75223 -72389 44908 251651 191819 259363 -85197 246908 51199 300245 -225292
12740 196465 -197993 -53599 -120207 132149 355509 -25761 -138940 -183300 -56678 102056
12729 104025 189762 34828 -9663 -231337 -64872 -57787 137152 49110 -182130 91045 -255411
12717d98798a43611B08906h9131p6903a3214D66818j18971j10980a13521A32845
12706i2390A28642P7444J19791M6184F5066J52773i6336A78916O7798n5222a15764
12694A22857j408d4925B28079g6253l01615B10560b99455f5131j24287f0098q180
12683f8278D3846K55961A19687n3698J71800A09633b26227A4900K04431b0486
12672A50438n8664B594J17473O2674b54142C24612a63421f2507B22073A08159
12661B49823J76134i2365A287L36563I4009M3078K67747r102H0095K07N2807J7739
12649A50848b08705e4494B70746J02193A42732f8136n5439A4688a44455A05569
12638b36213C8021j552G183P0562K07623J12592j27050j32084J01020K76982h1845
$$ plain form
12717 -498798 -143611 208906 -89131 -166034 -13214 466818 347847 236867 -113521 132845
12706 -92390 128642 206086 325877 372061 65066 217839 -96336 178916 246714 191492 -115764
12694 122857 121449 -44925 228079 -76253 -377868 210560 -299455 -65131 -189418 -60098 -68278
12683 -68278 43846 299807 119687 65989 237789 109633 -226227 14900 219331 -20486
12672 150438 91774 2594 120067 182741 -254142 324612 -163421 -62507 222073 108159
12661 249823 425957 -92365 1287 337850 94009 137087 404834 395732 80095 80302 133109 150848
12649 150848 -208705 -54494 270746 372939 142732 -68136 -123575 14688 -144455 105569
12638 -236213 38021 36469 7183 77745 285368 397960 270910 138826 239846 516828 -81845
12626E67372A23992D1087A8639J22862J76611F3162P6097C3312L8752P6953B277
12614A45489b16155G2333P5006P4802a6106l21015c494j02061l1087C06512A07833
12602b27061A2607M0501K91869I148f93B32165F6765P7475K12732c05353k33581
12591e38934H1012b7601l65953C31974D7641J82491a74047B62907h6291L4023
12581e2268A04815i7721j84975a34276k63798A83318K3612h7875K0078a035k69021
12570b70056P1410E3511k4380M12215A50472i1267N94H0158a00371b9974a1603
12558B07436b96287D12831A20899D5830K39951i7150C663Q347J4575c28104A10024
12546b12028C87370g5231j08301H737J98474g9511F7997L62274a64084B62218
$$ plain form
12626 567372 123992 41087 18639 141501 318112 63162 139259 33312 72064 149017 2277
12614 145489 -216155 72333 147339 222141 -16106 -337121 -3494 -105555 -136642 306512 107833
12602 -227061 12607 53108 344977 9148 -693 232165 66765 144240 356972 -305353 -538934
12591 -538934 81012 -27601 -393554 331974 47641 230132 -174047 262907 -86291 -52268
12581 -52268 104815 -97721 -282696 -134276 -398074 183318 206930 -87875 -67797 -1035 -270056
12570 -270056 -198646 53511 29131 441346 150472 -91267 -90673 80158 -100371 -29974 -11603
12558 207436 -296287 412831 120899 45830 285781 -97150 3663 12010 26585 -328104 110024
12546 -212028 387370 -75231 -183532 8737 207211 -79511 67997 430271 -164084 262218
12535B4119b0864n9821k74553L8948a11743m4714B08192a71979J2385B3085J99300
12524B22385a26082a1033B18426a97317A28725c1067k56717a24947B59856A22696
12513D62943G2656Q1210f512D1616J22974a15475f095A48467n3337d95332B34078
12501b83624e3700j91576a15635A12733E0749g6854B91080m7535N3117Q3988a15984
12489A73355A1835d5966A2443J06699N83748A64224k6397j8295D0852i4028E0969
12477A49944J13438B119a13568G874P7758b04233A72486J54574a28779a7568o8565
12466h6133h757B76325J13474E0747b8433A58918a03918j80840b6255l7221K3342
12455d0134G7311B8699L4508b6949A47548a97862K6559C9005a9280j30351j25266
$$ plain form
12535 24119 -20864 -80685 -355238 -316290 -111743 -156457 208192 -171979 -159594 23085 222385
12524 222385 -126082 -11033 218426 -197317 128725 -31067 -287784 -124947 259856 122696
12513 462943 72656 153866 -6512 41616 164590 -115475 -6095 148467 95130 -495332 234078
12501 -283624 -53700 -245276 -115635 112733 50749 -76854 291080 243545 296662 380650 -115984
12489 173355 11835 -45966 12443 119142 702890 164224 137827 119532 40852 -94028 50969
12477 149944 263382 2119 -113568 7874 85632 -204233 172486 327060 -128779 -17568 -86133
12466 -86133 -8757 276325 389799 50747 -28433 158918 -103918 -284758 -26255 -63476 -40134
12455 -40134 77311 28699 63207 -26949 147548 -197862 -171303 39005 -19280 -149631 -274897
12444b74897A35884J30867D9458a0903m1004j75821A0173J13759c26283h7191
12433A18532e2822j48974j13454a03856I2750Q8360H5476h7051C16501A46434
12422b84563A64551a1174B02996a54170A9654h5787A63632O6048J62476f2244
12411a8136E2787a79984A16148L6115b8287k10827o4754B7281a59964A12021d4865
12399A75332D9839R4022k3403l2269b54894a15585b3717A35903a464p9194c5848
12387a71704B6883K24884A5572L05620G2819b03785A18994a23148R837C49803
12376f1575J8844B22932G0334M3379J14384q1631c08453d9991F3290J2630b6963
12364I6679a27006A82210L2157P7230e50181J77688F5244J2276l3894p343J17072
$$ plain form
12444 -274897 135884 266751 49458 -10903 -51907 -227728 10173 123932 -326283 -87191
12433 118532 -52822 -201796 -315250 -103856 92750 181110 85476 -87051 316501 146434
12422 -284563 164551 -11174 202996 -154170 19654 -85787 163632 229680 392156 -62244
12411 -18136 52787 -179984 116148 152263 -28287 -239114 -303868 27281 -159964 112021 -44865
12399 175332 49839 143861 120458 88189 -254894 -115585 -23717 135903 -1464 -80658 -35848
12387 -171704 26883 251767 15572 321192 72819 -203785 118994 -123148 -113311 349803
12376 -61575 -42731 222932 70334 113713 228097 146466 -308453 -49991 63290 75920 -26963
12364 96679 -127006 182210 214367 291597 -550181 -372493 65244 77520 43626 36283 153355
12353A53355o3227b9700H9753b77422b9543r2150B34526b68668m1899H4509J13292
12342A97801a40451J6199G3208k8614e9031n5192C38640I3630c20450B48863A02242
12330A22603J2753j6223E3626i8938J8486B07230b30199B36251h489r2894A5651
12318B65957B8733J63517b9093m3495m3867a2078A21482a89257E4794j8890c84890
12306a04470A3756c7508l5533D7166g6225B88635a04780j74785Q9597P5558E125
12294b1963q8483H9484Q5709M7569m6941H2170N4270k351A7309Q5174a69596N1090
12282a18506A57507K24111A54775J78523e8881g555D05199A88942m1825P2394
12272B19511r8997E6619e813C9991J95304j00831a30729q9732A9725J80096a48137
$$ plain form
12353 153355 90128 -29700 89753 -277422 -29543 -121693 234526 -268668 -310567 84509 197801
12342 197801 -140451 -124252 73208 44594 -59031 -114223 338640 93630 -320450 248863 102242
12330 122603 135356 119133 53626 -98938 -80452 207230 -230199 236251 -8489 -101383 15651
12318 265957 28733 192250 -29093 -72588 -116455 -12078 121482 -189257 54794 35904 -384890
12306 -104470 13756 -37508 -73041 47166 -76225 288635 -104780 -279565 -189968 -114410 5125
12294 -21963 -110446 89484 175193 222762 175821 82170 136440 134089 17309 102483 -169596 -118506
12282 -118506 157507 381618 154775 333298 -58881 -7555 405199 188942 147117 219511
12272 219511 120514 56619 -5813 39991 235295 134464 -130729 -220461 19725 199821 -148137
12260A47226E3861L0501a8490B23753K1922a4427j17170A11290k2016n063L35070
12249D19281A38755a81402f4939B64355g3921m4758D7627J35215a80023I002J9978
12238B8980B387a39987n561C6006L3670a36499A46775M61920A24501J80996r6690
12227B08807L39729j73188A04683J48935M0894D6226J48874M3568P5184l8699
12217B75153G7484L173C5422M0611J03534B6627J58442J09640j06647q642G61
12205B1631a58005j11795B6980N6598K22300j4936i2529B9617J00317K96500n782
12194D20652H7390J45459k1927p5553J9439b60025A3837K43453n1089b27274c4075
12182f7014B04462f1377b189E3386d6952A09197h5736b707E700L63283J13646
$$ plain form
12260 147226 53861 84362 -18490 223753 245675 -14427 -131597 111290 89274 84211 419281
12249 419281 138755 -181402 -64939 264355 -73921 -118679 47627 182842 -180023 9002 28980
12238 28980 2387 -139987 -145548 36006 69676 -136499 146775 608695 124501 305497 208807
12227 208807 548536 375348 104683 253618 294512 46226 195100 238668 313852 275153
12217 275153 77484 80657 35422 76033 179567 26627 185069 294709 188062 179420 761
12205 21631 -158005 -269800 26980 83578 305878 290942 -92529 29617 129934 426434 420652
12194 420652 87390 232849 210922 135369 154808 -260025 13837 257290 206201 -227274 -34075
12182 -67014 204462 -61377 -2189 53386 -46952 109197 -85736 -2707 5700 368983 482629
12171D82629A65135L3780q6660b41879A06489d9775B48278O0313B0826J72326
12161A93152a10653B51777G2535b37643A16792m8703j0035c9496C16446E220b54860
12149B35049L52954D7076N6169l0823L60170q0327k1938j42810B5338N3625P285
12138H6248h2131c4992A88298b17538A5010c4500m3486A71826k6873J50488j10031
12127A85410L4183f8415I0400L32e6862A48803M5656a493A5696J1937h8489c7091
12114g1455K2560j59630j80587I8524J2088c6889l0134A71218b50558i4617o1065
12103a55682A34783a31993p9338D4099b15398j20293K7933J45168e7961A53426
12092a31087k93407A10433c07024m1453j46432a57514O1315I2343I379a37210
$$ plain form
12171 482629 165135 198915 112255 -241879 106489 -49775 248278 308591 20826 193152
12161 193152 -110653 251777 72535 -237643 116792 68089 58054 -39496 316446 5220 -254860
12149 235049 588003 47076 103245 72422 432592 352265 330327 187517 25338 78963 86248
12138 86248 -82131 -34992 188298 -217538 15010 -34500 -77986 171826 144953 295441 185410
12127 185410 219593 -68415 90400 90732 -56862 148803 194459 -1493 15696 27633 -88489 -37091
12114 -71455 -48895 -208525 -389112 98524 110612 -36889 -67023 171218 -250558 -94617 -155682
12103 -155682 134783 -131993 -211331 44099 -215398 -335691 -307758 -162590 -57961 153426
12092 -131087 -424494 110433 -307024 -348477 -494909 -157514 -96199 92343 9379 -137210
12081G1854k9686c69406A71655i2431L3232B49492d6413j03087N5037B46456a2366
12069b60208h8584c9815B95290b7261m1942A83266e9502b4292B38779L187J23822
12058C65788a17503B762Q4843j0866a33632I8065b82632j97891C3119P9654J06764
12047B19537J1676A64f379G7745c5546D119J34272a39755G4557b12197R8658D2722
12034A86925b1277j98031E2136J33618a31197j97316h7895E1296L66168L78302
12024G95766K64814n05499A44699E8225h215A36666P6179b06680B69512a69282
12013A56538c44672J63930A66789C8782L7388k1104J9891a7195j86142b1466j12352
12002a33818B23810J3534b43495B0662e14782C3255c0689B28121F8186e4942k60138
$$ plain form
12081 71854 42168 -369406 171655 -92431 -59199 249492 -46413 -149500 -94463 246456 -12366
12069 -260208 -88584 -39815 295290 -27261 -69203 183266 -59502 -24292 238779 241966 365788
12058 365788 -117503 2762 87605 76739 -133632 98065 -282632 -480523 33119 112773 219537
12047 219537 231213 164 -6379 77745 -35546 4119 138391 -139755 74557 -212197 -113539 42722
12034 186925 -21277 -219308 52136 185754 -131197 -328513 -87895 51296 417464 795766
12024 795766 1060580 555081 144699 58225 -8215 136666 212845 -206680 269512 -169282
12013 156538 -344672 -180742 166789 38782 76170 55066 74957 -17195 -203337 -21466 -133818
12002 -133818 223810 237344 -243495 20662 -514782 33255 -30689 228121 68186 -54942 -315080
11991c15080c7097E944K92467o7263E1894b702B46239A127c40018D6261N2637
11980I8898b03564A59410M2252c47021g9462A68700a09784n5431A01740L8491
11970A40231e4820k908G7687a08173j09073j63537A51137a37229A21785K89500
11960D11285P349a14489C37367j38839a34175l3841j42881G9946R1571d09016
11949I5264A9467L50841p6534g6894J349B68862k5535j12190m7803K7150b63201
11937a40704m9004A02568b45295h9375B18626b0273B07163P040a66095M1198j01530
11926b26427J07367I3506A8708J75018M4856b314o3595F6017J01988a94976F0539
11914a41578A60707a89567d616B08727j9799I3761b20437C8013k412e6582A53826
$$ plain form
11991 -315080 -37097 5944 298411 231148 51894 -2702 246239 1127 -340018 46261 98898
11980 98898 -203564 159410 201662 -347021 -79462 168700 -109784 -165215 101740 140231
11970 140231 -54820 -57728 77687 -108173 -217246 -380783 151137 -137229 121785 411285
11960 411285 418634 -114489 337367 198528 -134175 -168016 -310897 79946 171517 -409016
11949 95264 19467 370308 293774 -76894 -75545 268862 243327 131137 83334 110484 -263201
11937 -140704 -189708 102568 -245295 -89375 218626 -20273 207163 214203 -166095 -124897 -226427
11926 -226427 -119060 93506 18708 193726 238582 -2314 -65909 66017 168005 -194976 60539
11914 -141578 160707 -189567 -4616 208727 188928 93761 -220437 38013 35601 -56582 153826
11902d59931f9377A34428b3895o3187B6765P073N02356A2409i2768B19197c0775
11890a23847A08896D4125N0438d7151k94467A996J49960F0521K03761F981c35785
11878F4489J61942b86346d7566B2846O8409O6570E9171h0989m7932e9429o7687
11867a27116B1549f3716A70616b4545m8391N756A43758a05151m7883C95767A94354
11855C02248c67725g3796k07244J02314A54923g9739L3839G6030L14926E8758
11844c9656k57176A70821E4639L970b5239A11458c94302a37635B0107a96645C51492
11832B79763H887L47683b25335l09467A37773J8686a90889R2466k41209c7422
11821F8708c47844E971g8376E3374Q7703J42930A36393m4879c62073i420k71381
$$ plain form
11902 -459931 -69377 134428 -23895 -87082 26765 33838 536194 12409 -92768 219197 -30775
11890 -123847 108896 44125 94563 -47151 -341618 1996 151956 60521 264282 6981 -335785
11878 64489 226431 -286346 -47566 22846 91255 157825 59171 -80989 -128921 -59429 -127116
11867 -127116 21549 -63716 170616 -24545 -72936 -67180 143758 -105151 -153034 395767 194354
11855 302248 -367725 -73796 -281040 -178726 154923 -79739 -45900 76030 390956 58758
11844 -39656 -296832 170821 54639 58609 -25239 111458 -394302 -137635 20107 -196645 351492
11832 279763 8887 356570 -225335 -534802 137773 156459 -190889 -98423 -339632 -37422
11821 68708 -347844 5971 -78376 53374 141077 284007 136393 91514 -362073 -9420 -280801
11810b80801g8629B93696a58335B29282A9026i9989P621k10420J18386E02636
11799B5392J20282k7953K23354b00103j89925a01460L223d5370C4077a34535D8337
11787A40704p0105a97214P4507j11671g4462j73254M254E7341J05477E6310c4098
11775c74488J42792B5112L2263J04981p5401K2574d1694k04392Q4265A54250c1877
11763H858a02733A03535A0392a06353M6515n7108j54957G8063e4156C756a5172
11751F6541b70671O0003A28976N6900D3492J16490j5185n1496d41516a92321A98914
11739B54243I9084M047b5196l7563j30866f3262j76579G4308R3355c02621A67141
11727B618b58363D6594Q2171K7939c135j43846l3167k3964B4181a01445G5745
$$ plain form
11810 -280801 -78629 293696 -158335 229282 19026 -99989 -92368 -302788 -184402 502636
11799 25392 145674 117721 341075 -200103 -390028 -101460 -98237 -45370 34077 -134535 48337
11787 140704 70599 -197214 -122707 -234378 -74462 -247716 -243462 57341 162818 56310 -34098
11775 -374488 -231696 25112 57375 162356 86955 109529 -41694 -246086 -161821 154250 -31877
11763 8858 -102733 103535 10392 -106353 -59838 -116946 -271903 78063 -54156 3756 -15172
11751 66541 -270671 -210668 128976 185876 43492 159982 144797 93301 -441516 -192321 198914
11739 254243 99084 103131 -25196 -62759 -193625 -63262 -239841 74308 167663 -302621 167141
11727 2618 -258363 46594 128765 156704 -3135 -146981 -180148 -204112 24181 -101445 75745
11715d5258A90271l7862a2092l5349j13808n8367N2183A31528J33429h1071j33722
11704b14793B63783j18859b69033h5730G2330K71254r149J19888B09092C9405
11693B33711G2890K72798A51101C7401e3474A42797a56996d2212j728B15689g4873
11681H2117a44602e9326A12497a93705B40369B4612B098K27370a21000p1476l4397
11670b26873d244k64709a31764q5258B5601P9323a08872A8533P6023K77181b0882
11658A33550k1021g1773j2432j50850a10966B31602a83520A4995b96109h9142
11647B2013i9301o6627B64155a389r7613c1868G2190J36546q4363a2694B62027
11635b07945f4341k6434D257a66187C23146H3040m596R755Q770i5311A71121d5207
$$ plain form
11715 -45258 190271 152409 -12092 -47441 -161249 -219616 -167433 131528 264957 -81071 -214793
11704 -214793 263783 144924 -269033 -85730 72330 343584 334435 454323 209092 39405
11693 233711 72890 345688 151101 37401 -53474 142797 -156996 -42212 -43940 215689 -74873
11681 82117 -144602 -59326 112497 -193705 240369 24612 2098 229468 -121000 -192476 -226873
11670 -226873 -4244 -268953 -131764 -217022 25601 104924 -108872 18533 94556 371737 -20882
11658 133550 112529 -71773 -84205 -235055 -110966 231602 -183520 14995 -296109 -89142
11647 22013 -99301 -165928 264155 -1389 -99002 -31868 72190 208736 124373 -12694 262027
11635 -207945 -64341 -90775 4257 -166187 323146 83040 78444 88199 96969 -95311 171121 -45207
11622B93554a4218j52097m3016j15752A30612K31051B0887R2079J04948F2114
11611A16815b81552A27781i0976H2715B5106K55268L7812a46383k08947f8493
11600B7031c8092j33437d3776A44434p432k9905J9977J04461j08932J48679a47396
11588B21984H2118J49669A11007b10904q0822E5806J53618K27444A55115E2463
11577A57446a00895J9488E40982b02570B43406d7378l1931C6489K6457J51337
11567B14283a62517A4774a13389r0100N5493j41117A81772a58249A52913b09008
11556g111E9328m005M6782b54491i588p6844E0777P6386d4718B52743l2761a86393
11543A93274f379A23707c0875E09457b05453B75993b28831C4866K10639G4374
$$ plain form
11622 293554 -14218 -166315 -209331 -325083 130612 361663 20887 112966 217914 62114
11611 116815 -281552 127781 -90976 82715 25106 280374 318186 -146383 -355330 -68493
11600 27031 -38092 -171529 -43776 144434 137002 107097 127074 231535 122603 271282 -147396
11588 221984 82118 231787 111007 -210904 -291726 55806 209424 436868 155115 52463
11577 157446 -100895 -81407 540982 -202570 243406 -47378 -79309 36489 62946 214283
11567 214283 -162517 14774 -113389 -203489 -147996 -289113 181772 -158249 152913 -209008
11556 -7111 59328 55323 102105 -254491 -9588 -86432 50777 127163 -44718 252743 219982 -186393
11543 193274 -6379 123707 -30875 509457 -205453 275993 -228831 34866 245505 74374
11532A94495B3071P0746J96788A14515d2528A64732a24873C99962a14031H0402
11521c71A41090d44050B35529c5950B25721j09564J9004g5843A6493K30452r7302
11510A49643e7768b3770B71666F9769K77377j30031H4992K05299n486n8753a05297
11498C95144f9750D56364a52321A34505k1915K04545N3743A51672R6056R7497
11488C45225m05A52620Q1017m703J27598H7429e0799C3166K38616k0651J01965
11477C53096j49168b35602C93769j52385m7370J7415r7193L8901k6001J6897L36091
11466D80124B20830K35447k21013e6014n3535C08317E6032d3567j85632F8381
11455C33581B8900a0297A12143a43541D5066g7858m7950A66561M2918L4900J8253
$$ plain form
11532 194495 23071 93817 290605 114515 -42528 164732 -124873 399962 -114031 80402
11521 -371 141090 -444050 235529 -35950 225721 116157 135161 -75843 16493 246945 149643
11510 149643 -57768 -23770 271666 69769 347146 217115 84992 290291 284805 226052 -105297
11498 395144 -69750 456364 -152321 134505 112590 317135 370878 151672 247728 345225
11488 345225 344820 152620 233637 228934 356532 87429 -50799 33166 271782 251131 353096
11477 353096 203928 -235602 393769 241384 194014 211429 114236 153137 127136 144033 480124
11466 480124 220830 456277 235264 -56014 -109549 308317 56032 -43567 -229199 68381
11455 333581 28900 -10297 112143 -143541 45066 -77858 -125808 166561 209479 244379 262632
11444B62632d4429C93343b97937h3855m8621k59181a8885A18214N4809a59555
11433i2885I4282a14277d3569l7563a3298k67433j775F5469J40785M5073n8723
11422A92604o0430J3622M1723h6758A67209A027J19297n1386b55303b4839p5517
11411a00356G5579a11006A7384b87748J21088m6069g2587F2161M12387d6987J8245
11400b8742q5334k4387o9517F2642C0266J03567a73069F6562m710K59581C5483
11388a85611J83G5928a13726L0175n7322B4840e8969B16943B8048K55570a40211
11376c8870B86367c31860I3922b73500q9383A74837a20681B7699a42479j17207
11366b59686A41347b39709A19182b85796B0079b06682p3616K1231P0342c8339
$$ plain form
11444 262632 -44429 393343 -297937 -83855 -132476 -391657 -18885 118214 173023 -159555
11433 -92885 94282 -114277 -43569 -81132 -13298 -280731 -282506 65469 206254 251327 192604
11422 192604 132174 145796 187519 -86758 167209 1027 120324 68938 -255303 -24839 -100356
11411 -100356 75579 -111006 17384 -287748 -166660 -212729 -72587 62161 474548 -46987 -28742
11400 -28742 -114076 -138463 -207980 62642 30266 133833 -173069 66562 61852 321433 35483
11388 -185611 -185428 75928 -113726 -83551 -140873 24840 -58969 216943 28048 283618 -140211
11376 -38870 286367 -331860 93922 -273500 -362883 174837 -120681 27699 -142479 -259686
11366 -259686 141347 -239709 119182 -285796 20079 -206682 -280298 -259067 -188725 -38339
11355g0522A09895K49811b1289B05016A4115M82637c54670A9180K9919P7619L5896
11344A62614a38694r5617c1987A00398k3639a2949l60690h5279A21027b23068
11333a71158A0086f2364H2842a80937q536c2822n2150L619K9781p4295I0612h2985
11320G1704i7313H8147e71671A95909K22614h6533E2453J81182g2300n6146E4334
11308A55053o0090h3245j61934Q8500A0528O3557K38338B785f4816j03998B3048
11296F9879O8775h4639k7959p8681Q6610j75965m0283A3650c63653B9774h6325
11284b15351f0599A02387a09262F9952a703k5757k49677J19428A34706a55004
11273e2513j78396a12442A50658a58018f9882A16005B1738c7977k16097c4537
$$ plain form
11355 -70522 109895 359706 -21289 205016 14115 496752 -354670 19180 49099 126718 162614
11344 162614 -138694 -234311 -31987 100398 76759 -12949 -373639 -85279 121027 -223068
11333 -171158 10086 -62364 82842 -180937 -189473 -32822 -84972 -81353 -51572 -125867 90612 -82985
11320 71704 -97313 88147 -571671 195909 418523 -86533 52453 233635 -72300 -128446 54334
11308 155053 94963 -83245 -245179 -156679 10528 74085 312423 2785 -64816 -168814 23048
11296 69879 138654 -84639 -112598 -191279 -104669 -280634 -320917 13650 -363653 29774 -86325
11284 -215351 -60599 102387 -109262 69952 -1703 -27460 -277137 -157709 134706 -155004
11273 -52513 -230909 -112442 150658 -158018 -69882 116005 21738 -37977 -254074 -34537
11262B19194a58227A8436J66566F7484h0859j1492A60968L53533A67088J67755
11252C34843j33973F9629L6743P7805o4147a57816f4742a43j32468F0588P1021
11241A31609j8794b8080G7541g6666j45116g9625A80325e0056j71051n0382P0091
11230b01398H1046J2608L56131i6196N928r9716k29024C1523f0559j3596G3658
11218A11349c36665a500B26600F8832b27658J11446j2744j17636I3361C6557a04003
11206d6296j18113j19897A0027Q9921O2465c36674d1013A91403c8479D3908b81756
11194a18510a9128q2013C9746a60886K0323d5430H5093K7819J97486A26951g4034
11182d48639a33730I4665a16696B5713g7256B18486J9465I1003e25957a24795
$$ plain form
11262 219194 -158227 18436 185002 67484 -80859 -92351 160968 514501 167088 334843
11252 334843 200870 69629 106372 184177 120030 -157816 -64742 -143 -132611 60588 131609
11241 131609 112815 -28080 77541 -76666 -221782 -79625 180325 -50056 -221107 -271489 -201398
11230 -201398 81046 93654 449785 -96196 -90268 -189984 -419008 31523 -60559 -74155 73658
11218 111349 -336665 -1500 226600 68832 -227658 -116212 -128956 -246592 93361 36557 -104003
11206 -46296 -164409 -284306 10027 99948 162413 -336674 -41013 191403 -38479 43908 -281756
11194 -118510 -19128 -101141 39746 -160886 -140563 -45430 85093 112912 310398 126951 -74034
11182 -448639 -133730 94665 -116696 25713 -77256 218486 237951 91003 -525957 -124795
11171E0387J71267a73930A04586M2421a07224m9380J1667N4696C4488a35874B18267
11159a904j8828j90631a1345q5150l7423n08H1106f9253j74673G5831a8912j89178
11147b08090n8432B5136J57829M9896b2047G3357k1844q539f4417F3381c97002
11135D0497J14635l8753J2865g2101B9837R0694L2954B1122a91645C77378c3196
11123d2438l76484G0375N0531h9689D535K20847L6241F3338Q4823g4865B82284
11111G4819j1541J04075a43354E0815a70046B25519C5673N9287b4867B64178A30881
11099A51819A5599J01051J94803i8706A97242J8104K04108A00681L01207A07489
11088F7830R7628J5141c78002F5140l2508J15550M3395a6655B85946m5199Q3569
$$ plain form
11171 50387 221654 -173930 104586 147007 -107224 -156604 -144937 -90241 34488 -135874 218267
11159 -1904 -20732 -211363 -11345 -96495 -133918 -134426 81106 -69253 -243926 75831 -18912 -208090
11147 -208090 -266522 25136 182965 232861 -22047 73357 51513 42974 -64417 63381 -397002
11135 40497 155132 116379 129244 -72101 29837 120531 153485 21122 -191645 377378 -33196
11123 -42438 -418922 70375 120906 -89689 4535 225382 261623 63338 148161 -74865 282284
11111 74819 63278 167353 -143354 50815 -170046 225519 35673 94960 -24867 264178 130881
11099 151819 15599 116650 311453 -98706 197242 215346 419454 100681 401888 107489
11088 67830 165458 180599 -378002 65140 32632 148182 191577 -16655 285946 240747 324316
11077C24316A61642K58286B04584J01249k9209n458K0471j40960J79071p870L00705
11066F22583k51541A23589M40250j95422r2829Q4417J77838j34986K10667O113
11056F19637k53197L51300l03156j08066O68440J21401l04897j54854J46974l08866
11046D74716Q2338m1704m2977N15294j23796Q8400k53121L2572L68635E11382
11035G78494j25330k25887K53014k79949R4614K46878j34076J62400j06773j24147
11025E39238K69954j32652j5670l0371l8353j1760K9892j55792L52645k96409
11015E10722K04815q0571L8400A86674M29884P057k43252L19124k6601r997O5975
11004G28864k92710J53902K2806K1522J92302k67383J88653k67096J69584j70408
$$ plain form
11077 324316 161642 419928 204584 305833 276624 271166 291637 150677 329748 321878 622583
11066 622583 371042 123589 563839 368417 275588 360005 537843 402857 613524 619637
11056 619637 366440 717740 414584 306518 974958 1096359 791462 636608 783582 474716
11046 474716 557054 515350 472373 987667 863871 952271 699150 731722 1100357 511382
11035 778494 653164 427277 680291 400342 494956 741834 607758 770158 663385 539238
11025 539238 809192 676540 660870 630499 592146 580386 610278 454486 807131 510722
11015 510722 715537 634966 673366 186674 616558 623615 380363 699487 672886 662889 728864
11004 728864 436154 590056 612862 634384 826686 559303 747956 480860 650444 480036
10994D80036L09004N6840C94499J51492L11287L5323k18294J307J92851j5520
10984H52945l60362Q42512E93802P44619k54870P9704L35850K30077K81760q1361
10974A929581P89122j12737N70566j30692j33404O3753L82852o14264k90180l65431
10964B089166K59632n46337j66485n6245k41165J5094j85976Q8247j98274J41723
10954A199380q3757m62426K48296M6329l39412Q2690J95520l95891E9110M4757
10944A03867L6110J65442l6422R7288h2876A73249H4320J53395O9370j22877b6173
10932a40305E15851k39275I7460R9901M3309k9517a16261N89p773L3092c9807
10920A04499E2098j9284J97658a16823q5092A54487g7478J9826A14694J05220
$$ plain form
10994 480036 789040 845880 394499 545991 857278 892601 674307 675614 868465 852945
10984 852945 492583 1335095 593802 1338421 1083551 1163255 1499105 1729182 2010942 1929581
10974 1929581 2718703 2605966 3176532 3045840 2912436 2976189 3359041 2744777 2454597 2089166
10964 2089166 2348798 1802461 1635976 1579731 1338566 1353660 1167684 1255931 1057657 1199380
10954 1199380 1115623 653197 901493 947822 608410 691100 886620 490729 59110 103867
10944 103867 139977 305419 268997 366285 -82876 173249 84320 237715 307085 184208 -26173
10932 -140305 515851 276576 97460 197361 240670 211153 -116261 -115672 -123445 -90353 -39807
10920 104499 52098 32814 230472 -116823 -201915 154487 -77478 -57652 114694 219914
10910B19914k6822i8981j9133B26237c691m2610G6311M9212m1592b45985B85160
10898a01284D8096b69999Q0933F9396e51285A92781R4421K5200a87078r7625a33453
10886a25268E53927G9174M2778B218J10616M08l7769C4582h7624k78415A17483
10874f4442K1797o3314p211I2185b94423D6661c4864J449j37336q5744p8077i8641
10861B11302F4284k7085K49563a47913J3456m3925B5981a70233A02126L88865
10851D90991a238k13343e5658F7545J9895a6306m56460C25609A56501c19536J59561
10840a59975c5713j90056K8758A3249b04493G8416b03592I7292i0393J4343A04089
10828i2232D7196b61351k1416A84289R4574e0248n3524i940q3172k17435a12783
$$ plain form
10910 219914 193092 -98981 -118114 226237 -3691 -46301 76311 125523 83931 -245985 285160
10898 -101284 48096 -269999 -189066 69396 -551285 192781 287202 312402 -187078 -284703 -133453
10886 -125268 553927 79174 121952 2218 112834 113242 75473 34582 -87624 -366039 117483
10874 -64442 -42645 -105959 -113170 92185 -294423 46661 -34864 -33415 -170751 -256495 -334572 -98641
10861 211302 64284 37199 286762 -147913 -134457 -178382 25981 -170233 102126 490991
10851 490991 -1238 -214581 -55658 67545 87440 -16306 -472766 325609 156501 -319536 -159975
10840 -159975 -35713 -225769 -197011 13249 -204493 78416 -203592 97292 -90393 -76050 104089
10828 -92232 47196 -261351 -282767 184289 278863 -50248 -103772 -9940 -93112 -310547 -112783
10816b81118B34983c3931l60217a21440m1945A08879K00392b8698A12640n3554
10806E9086Q5684a56792j53110e9560A63201N996d5260H9227a49822B26579f07630
10794f2625h525B21406b48201H542J83165i1326B03220B6963p162h6190J3508
10783g2682k77075C58219A29594b6114q1380B22183a55628B07528o012I8339a87603
10771f2108H8374L9593J49908I7992b67852j84386c5491H1917b14269D3896c09179
10759A74438b4322j727k2917B49478i9104j38034H6046a897j56911M3465c0942
10747C13443a48885m4554Q1575A09453P1905A7046b2564G4458a9057j28213f438
10735H1233i6979c8968j2115r111q983E3592a61550b5807l1873B36768a54470
$$ plain form
10816 -281118 234983 -33931 -394148 -121440 -163385 108879 309271 -28698 112640 59086
10806 59086 144770 -156792 -309902 -59560 163201 169197 -45260 89227 -149822 226579 -607630
10794 -62625 -8525 221406 -248201 8542 191707 -91326 203220 26963 19801 -86190 -72682
10783 -72682 -349757 358219 129594 -26114 -107494 222183 -155628 207528 201516 98339 -187603
10771 -62108 88374 127967 277875 97992 -267852 -452238 -35491 81917 -214269 43896 -309179
10759 174438 -24322 -26049 -48966 249478 -99104 -237138 86046 -1897 -158808 -115343 -30942
10747 313443 -148885 -193439 -111864 109453 181358 17046 -22564 74458 -19057 -147270 -6438
10735 81233 -96979 -38968 -51083 -60194 -69177 53592 -161550 -25807 -57680 236768 -154470
10723f603o8224J9176a8937A17887b18818j75946a06092o8030r8289L0768G2867
10711B16085a93399B60470p1598G5642K53276q9116g8650n2461K5098d8335j3472
10700f1807j41614h1119C8268c69989A61957J22761b32256l8095A66279e4562
10689e85099G181d80251a13283j62747A82828a45161f7113A35920a5256j5894
10679c1150o8358l44212A34378K8343d61800A60194a26388j11012A56866F6721
10668B10932b21729a06806b4491j7884M756n3536J7115m2086p4470c0494n9991
10657i0485B62326e5517k23577H8397M4850A2241g6633j50482E8430P6437c17786
10645G3251a18634o5839G8969J2023L5565c8070m66028K06809b1026E9389h4400
$$ plain form
10723 -6603 -74827 -55651 -18937 117887 -218818 -394764 -106092 -174122 -272411 -241643 72867
10711 216085 -193399 260470 188872 75642 328918 239802 -78650 -131111 -106013 -48335 -61807
10700 -61807 -203421 -81119 38268 -369989 161957 284718 -232256 -270351 166279 -54562
10689 -585099 7181 -480251 -113283 -276030 182828 -145161 -67113 135920 -15256 -31150
10679 -31150 -99508 -443720 134378 162721 -461800 160194 -126388 -237400 156866 66721
10668 210932 -221729 -106806 -24491 -42375 -37619 -91155 -74040 -116126 -190596 -30494 -90485
10657 -90485 262326 -55517 -279094 88397 133247 12241 -76633 -227115 58430 134867 -317786
10645 73251 -118634 -184473 78969 90992 126557 -38070 -504098 -297289 -21026 59389 -84400
10633G7421d28019G4585C4849a09713c1110H3132J5458d15726F8289a43929C4798
10621d06855E1519L9497a66031L9308B6638d926A24951c36109K8726I4447n193
10610H9254a44993a9426I6501K63576A8216d44644C6369a2492E973P6550c65250
10598G8188O260b26314p0538K5377c431A12427a59513A31923g1780j17274J4984
10587a74070A33675k8421K09576b7911k11010Q04A35598J61512E3141a41850B49685
10575F5895f4359j54665c3175j94653O7635d0879E0478a05495A72733a9702j61676
10564a81378A36939b87939F1765B871a69305e5610a5066k36276A39275a85743
10553D0049c7863L111j12930I373a90232j6047H6125b28431f7827q814k674k70854
$$ plain form
10633 77421 -428019 74585 34849 -109713 -31110 83132 98590 -415726 68289 -143929 34798
10621 -406855 51519 91016 -166031 -126723 26638 -4926 124951 -336109 -307383 94447 89254
10610 89254 -144993 -19426 96501 360077 18216 -444644 36369 -12492 5973 82523 -365250
10598 78188 84448 -226314 -296852 -271475 -3431 112427 -159513 131923 -71780 -189054 -174070
10587 -174070 133675 105254 314830 -27911 -238921 -238117 135598 297110 53141 -141850 249685
10575 65895 -64359 -219024 -33175 -227828 -160193 -40879 50478 -105495 172733 -19702 -181378
10564 -181378 136939 -287939 61765 2871 -169305 -55610 -15066 -251342 139275 -185743
10553 40049 -37863 -34752 -147682 9373 -190232 -206279 86125 -228431 -67827 -76641 -79315 -350169
10541c50169F3881A0395f3057B46637B8309g3242C438c36552D0385J1888L992
10530E6265b44325e6157B29479i6418l5654k46506a06057q5366P0568C00190b36016
10518A04061a27476A09031J52743l0768A01278M47907j82732a08761a822k943
10508d765B21003q7521b62545j7929J18373c7673q3299B50432j9791q7415P967
10497A51193b8860j31861b0665B45197a79271N5838l7425j04535a31097j06372
10487b37469F1507R9547j9912i5799A10289L32142A65603l8582K57552Q4120A21497
10475D7379P895k1739J39913a15234j3746q6147C28031a64891B62254J02817b03876
10463c99452a65685f7433B46098a88525j28835D9603a57316A84201Q9135I5945
$$ plain form
10541 -350169 63881 10395 -63057 246637 28309 -73242 3438 -336552 40385 52273 56265
10530 56265 -244325 -56157 229479 -96418 -132072 -378578 -106057 -191423 -120855 300190 -236016
10518 104061 -127476 109031 261774 231006 101278 549185 366453 -108761 -1822 -4765
10508 -4765 221003 133482 -262545 -280474 -162101 -37673 -120972 250432 230641 143226 151193
10497 151193 -28860 -160721 -20665 245197 -179271 -123433 -160858 -265393 -131097 -237469
10487 -237469 61507 161054 141142 -95799 110289 442431 165603 127021 384573 468693 121497
10475 47379 55274 33535 173448 -115234 -128980 -215127 328031 -164891 262254 365071 -203876
10463 -399452 -165685 -67433 246098 -188525 -317360 49603 -157316 184201 273336 95945
10452d5505C10309a7408k7985N429G4374l5553a59564G1480n665R8644d8357B27376
10439i6234A38832K39823a92585B2296a97755c8306l35411h8093H3814A6632i4046
10427B62204H033g3045L2537B83619f6386B46692b04999b3288l6038B6040b63045
10415c18220G9278a25339M403L2779A66363K7117o7673a22448N1807H9438a18078
10403a63587H6333g9384E7090a57188J1754F8133P7917i9513M7665p3382A09217
10391C60803d9211I0250Q3152b02199E8597K79025M3046G5072d56535C3368b69338
10379F3834d086B74212a43459A99129E5303R1836O4190L6231k2320J32512A05440
10367B33114J19271k5059K91515B22855K98476A06682R5951D967M37564P8638
$$ plain form
10452 -45505 310309 -17408 -45393 -39964 74374 38821 -159564 71480 65815 164459 -48357 227376
10439 -96234 138832 378655 -192585 22296 -197755 -38306 -373717 -88093 83814 16632 -94046
10427 262204 8033 -73045 -40508 283619 -66386 246692 -204999 -23288 -59326 26040 -263045
10415 -318220 79278 -125339 -120936 -88157 166363 193480 125807 -122448 -70641 89438 -118078
10403 -163587 86333 -79384 57090 -157188 -145434 68133 146050 -99513 -51848 -125230 109217
10391 360803 -49211 90250 173402 -202199 58597 337622 380668 75072 -456535 33368 -269338
10379 63834 -4086 274212 -143459 199129 55303 147139 211329 247560 225240 357752 105440
10367 233114 352385 327326 618841 222855 521331 106682 202633 4967 442531 521169
10357E21169D1947J89355K6767O2745J31460j85257L06951P2079n846j48698j84399
10346C07104G5407J84154N139K45262A96067C7438K56058j28115R9126K19258
10336D83765P3807b4790A24847L8149O037n453b84202A47627J0416l4743J49795
10325B73095n5830r3711N19047E5190c386E03536A42133J02001E3246L2363f3702
10313F1766b93131A68709K02334A28764R6402N7079O2730i6516B56872J43421
10303D00293a77410a257j52816c0886a457A49794a23238b0112p3246A21318c7020
10291a51600B80289H4227k2985e3031E4106a83427b230A10159P3238a26184h48
10279C63258e84543a87519g7681B27109n439c7988j4211o8254E0373b29823B036
$$ plain form
10357 521169 41947 231302 258069 320814 452274 267017 573968 646047 640201 491503 307104
10346 307104 75407 259561 264700 509962 196067 37438 293496 165381 264507 483765
10336 483765 557572 -24790 124847 162996 169033 163580 -284202 147627 158043 123300 273095
10325 273095 217265 123554 642601 55190 -3386 503536 142133 244134 53246 85609 -63702
10313 61766 -293131 168709 371043 128764 225166 282245 344975 -96516 256872 400293
10303 400293 -177410 -1257 -154073 -30886 -1457 149794 -123238 -20112 -93358 121318 -37020
10291 -151600 280289 84227 61242 -53031 54106 -183427 -2230 110159 183397 -126184 -848
10279 363258 -584543 -187519 -77681 227109 221670 -37988 -52199 -120453 50373 -229823 2036
10267b31445A58816b22480e4929C01564a06228A32061J8986G0307h2875C13680
10256A72835F1090d9565o6687K1737j8797p1314q1615J18278d8059m9419d0468
10244a2587D01203c0342l34721A38423b22632E3604a79743n3007J08313c355A13086
10232a43021l1683d7807j23076A54872a74130A27796g3744j3361j93820a15008
10221C62187b66801a605l07299j26187b02971A30915a22827l96132J68155a24986
10210b3306l05269F6063a41408j85843N0210P620m6354a9069A65816F4732K87980
10199C52712a58397C0022b68760C40399b06790H194K12022o6908b65495a12746
10188b4822C1004O7268i6932H0091K12619G5800h2579D12636E9590c023A37059
$$ plain form
10267 -231445 158816 -222480 -54929 301564 -106228 132061 151047 70307 -82875 313680
10256 172835 61090 -49565 -116252 -94515 -113312 -184626 -266241 -147963 -48059 -97478 -40468
10244 -12587 401203 -30342 -365063 138423 -222632 53604 -179743 -232750 -124437 -3355 113086
10232 -143021 -174704 -47807 -170883 154872 -174130 127796 -73744 -87105 -280925 -115008
10221 362187 -266801 -1605 -308904 -435091 -202971 130915 -122827 -518959 -350804 -124986
10210 -23306 -328575 66063 -141408 -327251 -277041 -269421 -315775 -19069 165816 64732 352712
10199 352712 -158397 30022 -268760 340399 -206790 8194 220216 153308 -265495 -112746
10188 -24822 31004 98272 -96932 80091 292710 75800 -82579 412636 59590 -3023 137059
10176A19390L09835I7532M2440a87184P3682E1112g8703A11527E5651c84193i1390
10164A77028m3335D9165c31450J18637n4704H2526a55537o453C09330D8582R7994
10153A46576b164D0454c9365B82688b98039a24238A34667c60548o9338a20123
10142A77941F9424C4319a20542m7767A20283a17585d1825n6590L2628j58918A12889
10130D36948o6658H9149a86392Q9611A53841e5294B53868d21953A14347b25658
10119b97774j1601i7605L5216o7399N2837k73975A6840e4956l2237l1118c3481
10107h457A097J17332J65047a54751A82457b08873j05832a46683A81244a59999
10096B18626a15349j10162A60954h1874J5498j9321D1525R9071J7804J23170d5646
$$ plain form
10176 119390 429225 97532 139972 -187184 -113502 51112 -78703 111527 55651 -384193 -91390
10164 177028 133693 49165 -331450 -212813 -267517 82526 -155537 -161990 309330 48582 146576
10153 146576 -2164 40454 -39365 282688 -298039 -124238 134667 -360548 -429886 -120123
10142 177941 69424 34319 -120542 -168309 120283 -117585 -41825 -98415 -65787 -224705 112889
10130 436948 370290 89149 -186392 -96781 153841 -55294 253868 -421953 114347 -225658
10119 -297774 -309375 -97605 -62389 -129788 -76951 -350926 16840 -54956 -87193 -118311 -33481
10107 -8457 1097 118429 283476 -154751 182457 -208873 -314705 -146683 181244 -159999
10096 218626 -115349 -225511 160954 -81874 -66376 -85697 41525 140596 158400 281570 -45646
10084c16566a10630N2056F1411c412k14871D9497F403b7635f806j29416n8646
10073a94868i6233A61326a39458f1031j44245h7604A15591a13434k01411d8507
10062I2689k1279c9294q3308A71121h1563c4032j77667H913b54494J17706j4582
10051a51370f4265A03660g112j28118A42676d2206l31567g6895m33138a03698
10040b5572j94675m9166I2396M7785a51723A54989b16071h0353k60953j14211
10030d55517E3904a92422A02633d1298J4980l46205A52012F4154a16039A1577
10019g5362B3789c30225A1413J72977E5202c915B84323A5717c50408c5663J3059
10008b2604l01551b6728C6638c43427l985G6403J00708b87325J05875g3838D6381
$$ plain form
10084 -316566 -110630 -58574 61411 -3412 -218283 49497 6403 -27635 -6806 -136222 -194868
10073 -194868 -96233 161326 -139458 -61031 -205276 -87604 115591 -113434 -314845 -48507
10062 92689 71410 -39294 -122602 171121 -81563 -34032 -211699 8913 -254494 -136788 -151370
10051 -151370 -64265 103660 -7112 -135230 142676 -42206 -373773 -76895 -510033 -103698
10040 -25572 -220247 -269413 92396 140181 -151723 154989 -216071 -80353 -341306 -455517
10030 -455517 53904 -192422 102633 -41298 -26318 -372523 152012 64154 -116039 11577
10019 -75362 23789 -330225 11413 184390 55202 -3915 284323 15717 -350408 -35663 -22604
10008 -22604 -324155 -26728 36638 -343427 -347412 76403 177111 -287325 -181450 -73838 46381
9996a86151c4308k5592n3578e3723r4628k0233j73107e6922l0822j38672C3994
9984a77354H6803c48879A72164f1198j08831q070A35978f42j4953k02507B0478
9972e9856A47368i507A45755c2266k91409a34527A41151a46734D6319i5994J7488
9961g8506j08814f5930q2009C2528M23203a15412j68763g4096J8809A73413d53657
9949B00707F3235c07550J18326I8089a9492P091e363m5408B4437g942B10023A01905
9936I6192K78276c6029k45835c8381A9792f055I1744M867g0976A79337g7078r8549
9924a75627G9146c3656p6263d2425A37403a01985B79569a77247b8133j02919j51791
9913b82843e4511A3614a42064H3765b07586E2892c7519B9226e9679n7644e7382
$$ plain form
9996 -186151 -34308 -59900 -113478 -53723 -148351 -168584 -341691 -56922 -87744 -226416 33994
9984 -177354 86803 -348879 172164 -61198 -170029 -178099 135978 -642 -15595 -218102 20478
9972 -59856 147368 -9507 145755 -32266 -323675 -134527 141151 -146734 46319 -95994 -78506
9961 -78506 -187320 -65930 -147939 32528 455731 -115412 -284175 -74096 -55287 173413 -453657
9949 200707 63235 -307550 -189224 98089 -19492 -12401 -5363 -50771 24437 -7942 210023 101905
9936 96192 374468 -36029 -281864 -38381 19792 -6055 91744 96611 -70976 179337 -77078 -175627
9924 -175627 79146 -33656 -109919 -42425 137403 -101985 279569 -177247 -28133 -131052 -282843
9913 -282843 -54511 13614 -142064 83765 -207586 52892 -37519 29226 -59679 -117323 -57382
9901g4840k88540I5583J76492E3268h7634m894o0615O2580F9267c63001j3515
9890c76516F6633g2310j02838L9280F4124b97382E7744a57535e4536B4061K1661
9879D5722J49763R9407c4687G6551K58135a61114e0842j2007k3768k12726a39136
9867c39391f0880k59810A74185a40185j72587k5142g7976F54896b09206g0711
9856i3272k90801a55532o8851k14179i0246j10439k00040B69949c7093H8227k1542
9845F6685c86872a05172n0910l4401H2065c52895a11808C62628h1101j74725E9136
9833a9583p1923E9622A3888a70478o923f9552C0280a05232c1053B64888B033b943
9820b44841f7420D231a17170k1169A5078h7867c8476m854k47633C44484b20070
$$ plain form
9901 -74840 -363380 95583 272075 53268 -87634 -92528 -153143 -90563 69267 -363001 -376516
9890 -376516 66633 -72310 -175148 -135868 64124 -297382 57744 -157535 -54536 24061 45722
9879 45722 195485 294892 -34687 76551 334686 -161114 -50842 -62849 -86617 -299343 -139136
9867 -339391 -60880 -320690 174185 -140185 -312772 -337914 -77976 654896 -209206 -70711
9856 -93272 -384073 -155532 -224383 -438562 -90246 -200685 -400725 269949 -37093 88227 66685
9845 66685 -386872 -105172 -156082 -190483 82065 -352895 -111808 362628 -81101 -255826 59136
9833 -19583 -91506 59622 13888 -170478 -177401 -69552 30280 -105232 -31053 264888 2033 -2943
9820 -244841 -67420 4231 -117170 -138339 15078 -87867 -38476 -43330 -290963 344484 -220070
9808c44385D4233b45822J5839h6942j24651g7144k6697A49850p4842a53012k39375
9797c92387B01024a40452B16127q3574d9271j07187a8997A05056f2268j38083
9787b00351J9148L9258B18234E8514h8494l2094A49086h9547D3628f1426A45892
9775b56146a17529b5901A02458c23535B75764c30961l6999b0651p956j23814l80623
9764e33044B19604i7400a0405F5853C069d70315c1043A49070a47331r7388a20517
9752G9148c29314N8169J08048j19244B4595J9355f2989B7170b31813E2594j551
9741E1043e13242B4424J6596g2557a6444A92804h0377l3105j45840A33110J31543
9730B64653b46647A29802J3915a82416c402q3543A78303a3827n77274g7878B77133
$$ plain form
9808 -344385 44233 -245822 -229983 -86942 -211593 -77144 -103841 149850 75008 -153012 -392387
9797 -392387 201024 -140452 216127 132553 -49271 -156458 -18997 105056 -62268 -200351
9787 -200351 -181203 -141945 218234 58514 -88494 -120588 149086 -89547 43628 -61426 145892
9775 -256146 -117529 -25901 102458 -323535 275764 -330961 -367960 -20651 -28607 -152421 -533044
9764 -533044 219604 -97400 -10405 65853 3069 -470315 -31043 149070 -147331 -244719 -120517
9752 79148 -329314 -271145 -163097 -282341 24595 43950 -62989 27170 -231813 52594 51043
9741 51043 -513242 24424 41020 -72557 -16444 192804 -80377 -113482 -259322 133110 264653
9730 264653 -246647 129802 143717 -182416 -3402 -86945 178303 -13827 -591101 -77878 277133
9718h2362j18355Q1387A39981m2492b68051C0323b09920C620a01559j43912A01513
9706a11826k07814R3392B39338I7449i0H1441a27272O0698j47836A12028K06887
9695C18915c3410A67773D4154L79702k11629b65475h2936F2154b64575h3264j09859
9684a93123E6327P6181c01955a7434A24952d4029r3997j5706A75149a04475B46804
9672A05557g8002c1767A69998b29686j39085b9128i936A56308b19189k17286A55767
9660A43843c31620K466J34462o1143L3002l8210J11069n8283M071L7225A89279
9648H1291b9639r0709M9746n3732p9539P9377M362F3789f179F3625a31465O5049
9636f6416C7692L0550b53118E0078A5051J58128A7467a56443J4432B07013B4013
$$ plain form
9718 -82362 -200717 -119330 139981 97489 -268051 30323 -209920 3620 -101559 -245471 101513
9706 -111826 -319640 -226248 239338 97449 -90 81441 -127272 -66574 -214410 112028 318915
9695 318915 -33410 167773 44154 423856 212227 -265475 -82936 62154 -264575 -83264 -193123
9684 -193123 56327 132508 -301955 -17434 124952 -44029 -138026 -153732 175149 -104475 246804
9672 105557 -78002 -31767 169998 -229686 -368771 -29128 -9936 156308 -219189 -436475 155767
9660 143843 -331620 -329154 -194692 -255835 -222833 -261043 -149974 -208257 -204186 -166961 189279
9648 81291 -29639 -120348 -70602 -124334 -203873 -124496 -120134 63789 -6179 63625 -131465 -66416
9636 -66416 37692 68242 -253118 50078 15051 173179 17467 -156443 -142011 207013 24013
9624c18920J8635A23465h705B3027b58249A08124e4420o8078K5157J0738b3160
9612e0688l51543B2552e8310k07828B34896b23854g9058p7144b9488M26M034k61229
9600b86257C53146h48j54923j84873e6856b7313m00190A72928a42611A72961b740
9588A48300b76314P9209A86853c1769l10008i7524A63593b32722f0937a6103m03499
9577d19602a34753L0275l5133B83514a50305g2614D6665a46839K8262G7116d7079
9565f0657F5118R6467a85460I6733Q1142e6863I5831b76334A7300e9886p8373
9554a38259C920b81100j23515J51965R5925m0741Gi6198E3593c14204F0676d973
9541c60481a08994q1983B4907e0853B35145b66317A33108j0270b86509A48500
$$ plain form
9624 -318920 -300285 123465 -8705 23027 -258249 108124 -54420 -122498 -97341 -86603 -23160
9612 -50688 -402231 22552 -58310 -266138 234896 -223854 -79058 -156202 -29488 -29062 -25028 -286257
9600 -286257 353146 -848 -155771 -340644 -56856 -27313 -427503 172928 -142611 172961 -2740
9588 148300 -276314 -197105 186853 -31769 -341777 -97524 163593 -232722 -60937 -16103 -419602
9577 -419602 -134753 -104478 -139611 283514 -150305 -72614 46665 -146839 -118577 77116 -47079
9565 -60657 65118 161585 -185460 96733 177875 -56863 95831 -276334 17300 -59886 -138259
9554 -138259 3920 -281100 -404615 -252650 -156725 -197466 7 -96198 53593 -314204 60676 -4973
9541 -360481 -108994 -190977 24907 -50853 235145 -266317 133108 122838 -286509 148500
9530A4661h5574j05935O9077q2047J1979H9707J71174h3617o9262j97542A48753
9518b36284J04478a6953p9440d4754n9543B08179c12960J00367A04578J5452A0368
9506a98998l01675a81212J7089H7728b066o4094G1496e59832K75547e8091H7586
9494a97368A1335L84460A1177a20030c6360j69886G5766c53819J55893C03452
9483b50943A22262a1720k21751K3052B80927r7059a05650B1500K7468M4997b45479
9471A08311i5922q1974b4648F2003K9866a96671j00668A883b18033D322M4702
9460D9024i4561k61821g8778d818j74787m7554o0635J30620d4435H2061a32111
9448b2565G7780o837l3479L2338b59775J6118c5539m1726q6578k26535a17552
$$ plain form
9530 14661 -85574 -191509 -122432 -204479 -192500 89707 260881 -83617 -152879 -350421 148753
9518 -236284 -131806 -16953 -96393 -44754 -104297 208179 -312960 -212593 104578 120030 10368
9506 -198998 -500673 -181212 -164123 87728 -2066 -66160 71496 -559832 -284285 -58091 87586
9494 -197368 11335 395795 11177 -120030 -36360 -206246 75766 -353819 -197926 303452
9483 -250943 122262 -11720 -233471 -210419 280927 183868 -105650 21500 48968 93965 -245479
9471 108311 -95922 -177896 -24648 62003 91869 -196671 -297339 1883 -218033 4322 49024
9460 49024 -94561 -356382 -78778 -4818 -179605 -227159 -287794 -157174 -44435 82061 -132111
9448 -22565 77780 70943 37464 69802 -259775 -243657 -35539 -77265 -163843 -390378 -117552
9436E0073b5194m0475H4305M2927b32076A22700b44430F9610c20439A7354g6629
9424b17937m1159a01783o0310A49253c35651A09136b27268e7388B00009f3390
9413A36440B2652K40746A08314l3257b9340A40546c54929a16130j74123i9659
9402c4309j99145R0714O4186H3124j1758k3247a92632l508R5573a8718k09757
9391b28475j19305f0080D7405J25791a75934C48430A55898m3428B7293b59407
9380G4465a75127A22312a2318k6240A12131K45356A61522k503c35064B5763a56065
9368A62528f8976l2471b0172B0228b03105A19746g6412P245I0942e801l44326
9357c50127q9530J45577P285A85806a36273k85492J64813a12540q4280j59708
$$ plain form
9436 50073 -25194 -65669 84305 127232 -232076 122700 -244430 69610 -320439 17354 -76629
9424 -217937 -259096 -101783 -162093 149253 -335651 109136 -227268 -57388 200009 -63390
9413 136440 22652 263398 108314 75057 -29340 140546 -354929 -116130 -290253 -99659
9402 -34309 -233454 -142740 -78554 83124 71366 48119 -192632 -196140 -100567 -18718 -228475
9391 -228475 -347780 -60080 47405 173196 -175934 348430 155898 112470 27293 -259407
9380 74465 -175127 122312 -12318 -38558 112131 357487 161522 159019 -335064 25763 -156065
9368 162528 -68976 -101447 -20172 20228 -203105 119746 -76412 -69167 90942 -5801 -350127
9357 -350127 -439657 -294080 -286795 185806 -136273 -421765 -256952 -112540 -196820 -356528
9347c56528B00372J4410c29938A96156K4515a14587B01671b32338d2688F0589
9336f1601D3056a82637p3212i5856J225c3515A05088a77415f6801j16520G4319
9324b1057I8317A5976b47646D1004a01228l7323p6465j85780a17304A85743b17077
9312a59106A06774b1845j19260l0901A35382a32841F0262d23230C93724a26739
9301D7393a18051M1920q5254k09339a32228G8739d0868n1095G0002k3825K4167
9290G0344c87854J07976M604H7843J01670L2843b4218m4363j20984A07006a79973
9278a04427C29772h4294I8907l8170K73748b24073Q0700k21759B59794e94389
9267C36891G7686a20634C4782a73617q7906j09724F6116c05013G5485k8103J96500
$$ plain form
9347 -356528 200372 214782 -329938 196156 220671 -114587 201671 -232338 -42688 60589
9336 -61601 43056 -182637 -255849 -95856 -94631 -33515 105088 -177415 -66801 -183321 74319
9324 -21057 98317 15976 -247646 41004 -101228 -138551 -215016 -400796 -117304 185743 -217077
9312 -159106 106774 -21845 -141105 -172006 135382 -132841 60262 -423230 393724 -126739
9301 47393 -118051 -76131 -161385 -370724 -132228 78739 -40868 -91963 70002 46177 70344
9290 70344 -387854 -279878 -275274 87843 189513 222356 -24218 -68581 -189565 107006 -179973
9278 -104427 329772 -84294 98907 60737 334485 -224073 -143373 -365132 259794 -594389
9267 336891 77686 -120634 34782 -173617 -261523 -371247 66116 -305013 75485 47382 243882
9256B43882A11185a59323B18980c84865a066k1632G9254c23214c1845n8499l3011
9245a23355L5359n6087m3056o8297B42231a69879C3448O6398K5538b34747l8717
9234b73464g2307m06240E1090e6462B57965b53858A31439a48892M6828c8947o8591
9223a07538l0659d3787j911k43768H6907J60115a67639B2257a27309A90553N4481
9212B45034o4080a47371j8984c8004A25774h382k36022g9382b0821G545J8665
9201B6210a05590L1026l00517a00968K2313F0512O0190J04532b57171j5156B7136
9189G7490b40352A14340K27637D8018j4283j3326a18263B29908a27044O2456k91260
9178c55848C81407I18P7516l5633K87303d01980A4369J12691N7617a53704J1977
$$ plain form
9256 243882 111185 -159323 218980 -384865 -1066 -22698 79254 -323214 -31845 -90344 -123355
9245 -123355 -87996 -144083 -187139 -255436 242231 -169879 33448 99846 125384 -234747 -273464
9234 -273464 -72307 -478547 51090 -56462 257965 -253858 131439 -148892 -102064 -38947 -107538
9223 -107538 -138197 -43787 -45698 -289466 86907 247022 -167639 22257 -127309 190553 245034
9212 245034 180954 -147371 -166355 -38004 125774 -8382 -244404 -79382 -20821 7545 26210
9201 26210 -105590 -74564 -375081 -100968 -78655 60512 120702 225234 -257171 -272327 27136
9189 77490 -240352 114340 341977 48018 33735 20409 -118263 229908 -127044 -64588 -355848
9178 -355848 381407 918 78434 42801 330104 -401980 14369 127060 184677 -153704 -141727
9167a41727a8619B55311G3548M3942J40393i3688j34874A72171a47305k6779r7312
9156b71396P2389a4853j95660d2454k01803q7736D8962a65424B20890a94976m509
9145a99485K6698C8996i5149j68458a13546k12220a21753A06432a39502G3991
9134F7438c56476b0675r343H4167c20315C1480c23337a13886F3380K5184A1532
9122h832B7712i2987j88477a2576G972b74815J1789J28988J2142l8982A30300
9110B97501d16390O325J11438B03207n3903f9125H0553b03546k02036a68535n7694
9099b26229A50333f3380l18223J31282A88762b14264I6086a45353H3699g7606
9088A34008j5914i6959D110h3554e46j75485f0731P104k535b2998B77842m0699
$$ plain form
9167 -141727 -18619 255311 73548 117490 257883 -93688 -228562 172171 -147305 -174084 -271396
9156 -271396 -199007 -14853 -210513 -42454 -244257 -331993 48962 -165424 220890 -194976 -199485
9145 -199485 -172787 38996 -95149 -263607 -113546 -325766 -121753 106432 -139502 73991
9134 67438 -356476 -20675 -30018 84167 -320315 31480 -323337 -113886 63380 88564 11532
9122 -8832 27712 -92987 -281464 -12576 7972 -274815 -263026 -134038 -121896 -160878 130300
9110 297501 -416390 -410065 -298627 203207 149304 -69125 80553 -203546 -405582 -168535 -226229
9099 -226229 150333 -63380 -381603 -250321 188762 -214264 96086 -145353 83699 -77606
9088 134008 118094 -96959 4110 -83554 -546 -176031 -60731 -53627 -56162 -22998 277842 237143
9076B37143H8292a1858k55681a17906b4694j06284r8736f4143j8252G405b40651
9064B90117G8808c57410A44907a40191a3782A07265a34995E0182J58036e05038
9053a4674f722j76436A21980j017a65660B45244a53916l02126g6580A1159d0765
9041c35125A96665d54139G7595C1691A1767a07257j43356H0710a05604D0254b79732
9029b13836A0682J4860a44356H4121R7792A2121J3809b96622G3529b67682Q6183
9018a81499g0420A26127F1365b43195I5918a64988k33856g8411E4392a79032j55159
9007c34191A62327a41285H5434A1155b33657N1296g760l7415n28j50559i4400
8995d900k95099A05791b82117E09605H5388K19474h8981L5692C3656b84728I5701
$$ plain form
9076 237143 88292 -11858 -267539 -117906 -24694 -130978 -229714 -64143 -82395 7405 -240651
9064 290117 78808 -357410 144907 -140191 -13782 107265 -134995 50182 208218 -505038
9053 -14674 -6722 -183158 121980 120963 -165660 245244 -153916 -456042 -76580 11159 -40765
9041 -335125 196665 -454139 77595 31691 11767 -107257 -250613 80710 -105604 40254 -279732
9029 -213836 10682 25542 -144356 84121 181913 12121 25930 -296622 73529 -267682 -181499
9018 -181499 -70420 126127 61365 -243195 95918 -164988 -398844 -78411 54392 -179032 -334191
9007 -334191 162327 -141285 85434 11155 -233657 -182361 -7760 -45175 -45703 -196262 -94400
8995 -4900 -299999 105791 -282117 509605 85388 304862 -88981 -53289 33656 -284728 95701
8983a17990q3436E6637J68008d74206K20520A11266Q2149h8522G0110a04388l00573
8972d04961B60013p7015f3709c1434k09184D3772a11018A30881E3424g5348k53248
8961c28596E1938a29831c3119A58280d11978e9905E61a86818a171B6907b64820
8949A38963f6858q9125j55241a4944j96328K9510P4810j48746I9977K21278B6679
8937A00805i4206F13024K1856A61096J27004A35345l6322K38340d4103m7757F30850
8925C49231R68938J548137Q600646K657856l389772D087791A333002m86945l20811
8916E25246J06370A02930Q9172e7661H3543l2144c0536j95314B92362a31687D6023
8904b73917J24307F0118J36441b56531C01375J53495b50408c1690q970Q376B14811
$$ plain form
8983 -117990 -201426 56637 224645 -474206 -253686 111266 193415 -88522 70110 -104388 -404961
8972 -404961 260013 182998 -63709 -31434 -240618 43772 -111018 130881 53424 -75348 -328596
8961 -328596 51938 -129831 -33119 158280 -411978 -59905 561 -186818 -1171 26907 -264820
8949 138963 -66858 -155983 -311224 -14944 -211272 -181762 -106952 -255698 99977 321255 26679
8937 100805 -94206 613024 634880 161096 288100 135345 99023 337363 -44103 -91860 630850
8925 349231 1318169 2866306 11466952 14124808 10735036 4087791 1333002 846057 525246
8916 525246 631616 102930 192102 -57661 83543 51399 -30536 -225850 292362 -131687 46023
8904 -273917 -149610 60118 196559 -256531 301375 454870 -250408 -31690 -40660 -32284 214811
8892a6088A77702a75730F9056J51394b68343m0103a0401k51840l7843E10109H5138
8880c1482k4522k44577i8008k55480d935k2719j39246K3950P0367q0830b3113
8868e4367A56977J46433D7987b90695e5191k6997j20306F31K46958a69832p9300
8857b49132D4542e2392m1568l03820a75783A4467f3763a7959H8880a26268M633
$$ plain form
8892 -16088 177702 -175730 69056 220450 -268343 -308446 -10401 -262241 -300084 510109 85138
8880 -31482 -56004 -300581 -98008 -353488 -4935 -27654 -166900 -142950 -72583 -153413 -23113
8868 -54367 156977 303410 47987 -290695 -55191 -82188 -202494 631 247589 -169832 -249132
8857 -249132 44542 -52392 -93960 -397780 -175783 14467 -63763 -17959 88880 -126268 -121635
$$ [...]
##END NTUPLES=NMR SPECTRUM
##END=
