##TITLE=AC1512_ROEFFECT0002_8201667_SdSD7zFh7y
##JCAMPDX= 6.0         $$ Bruker NMR JCAMP-DX V2.0
##DATA TYPE= NMR SPECTRUM
##DATA CLASS= NTUPLES
##ORIGIN= BRUKER
##OWNER= Administrator
$$ 1.72 TOPSPIN		Version 2.1
$$ 2013-09-26 18:28:06.330 -0700  Administrator@X
$$ Compression mode = diff/dup
##.OBSERVE FREQUENCY= 400.02188249412
##.OBSERVE NUCLEUS= ^1H
##.ACQUISITION MODE= SIMULTANEOUS (DQD)
##.ACQUISITION SCHEME= undefined
##.AVERAGES= 64
##.DIGITISER RES= 22
##SPECTROMETER/DATA SYSTEM= spect
##.PULSE SEQUENCE= noesygpps1d.comp
##.SOLVENT NAME= COFFEE_meoh
##.SHIFT REFERENCE= INTERNAL, COFFEE_meoh, 1, 14.96065
##AUDIT TRAIL= $$ (NUMBER, WHEN, WHO, WHERE, PROCESS, VERSION, WHAT)
$$ ##TITLE= Audit trail, TOPSPIN		Version 2.1
$$ ##JCAMPDX= 5.01
$$ ##ORIGIN= Bruker BioSpin GmbH
$$ ##OWNER= Administrator
$$ $$ E:\/data/COFFEE/nmr/AC1512_ROEFFECT0002_8201667_SdSD7zFh7y/22/pdata/1/auditp.txt
$$ ##AUDIT TRAIL=  $$ (NUMBER, WHEN, WHO, WHERE, PROCESS, VERSION, WHAT)
(   1,<2013-09-26 18:28:01.509 -0700>,<Administrator>,<X>,<go>,<TOPSPIN 2.1>,
      <created by zg
	started at 2013-09-26 18:16:31.406 -0700,
	POWCHK enabled, PULCHK disabled,
       configuration hash MD5:
       C8 4E 4E 5D D3 5C D8 9E 9F 52 82 E0 59 8A DE 15
       data hash MD5: 64K
       44 F3 D2 66 7C 39 E1 55 06 D9 F5 F3 89 F2 7A 44>)
(   2,<2013-09-26 18:28:04.435 -0700>,<Administrator>,<X>,<proc1d>,<TOPSPIN 2.1>,
      <Start of raw data processing
       efp LB = 0.3 FT_mod = 6 PKNL = 1 PHC0 = 0 PHC1 = 0 SI = 128K 
       data hash MD5: 128K
       86 F3 32 C9 14 E3 26 4E 9E CD C5 29 B9 9F BF C6>)
(   3,<2013-09-26 18:28:05.435 -0700>,<Administrator>,<X>,<proc1d>,<TOPSPIN 2.1>,
      <pk PHC0 = -83.8916 PHC1 = 0 
       data hash MD5: 128K
       6A C9 29 11 C4 75 EB 2F 22 4A C1 63 A0 AF 36 5A>)
(   4,<2013-09-26 18:28:05.814 -0700>,<Administrator>,<X>,<proc1d>,<TOPSPIN 2.1>,
      <abs ABSG = 1 
       data hash MD5: 128K
       4D 4F 60 62 C7 93 6B E0 B8 3B D4 C3 AF 06 ED 37>)
(   5,<2013-09-26 18:28:05.920 -0700>,<Administrator>,<X>,<proc1d>,<TOPSPIN 2.1>,
      <abs ABSG = 2 
       data hash MD5: 128K
       A4 3F 47 63 25 F2 04 C5 74 79 E2 A4 5E 0A DB 48>)
(   6,<2013-09-26 18:28:06.042 -0700>,<Administrator>,<X>,<proc1d>,<TOPSPIN 2.1>,
      <abs ABSG = 3 
       data hash MD5: 128K
       B7 13 A6 6A 5B A8 3F D7 5B D9 22 A3 3A EC C5 E6>)
(   7,<2013-09-26 18:28:06.102 -0700>,<Administrator>,<X>,<proc1d>,<TOPSPIN 2.1>,
      <abs ABSG = 4 
       data hash MD5: 128K
       80 31 73 BE F9 D7 3F B6 69 CD 1A 14 BD 93 00 9E>)
(   8,<2013-09-26 18:28:06.178 -0700>,<Administrator>,<X>,<proc1d>,<TOPSPIN 2.1>,
      <abs ABSG = 5 
       data hash MD5: 128K
       31 74 E0 E3 4D 77 2A 5C 48 4C 36 20 C8 2E 12 2C>)
$$ ##END=
$$ 
$$ $$ hash MD5
$$ $$ A7 C9 C5 C2 27 D8 05 E9 A8 CA 7D C7 52 E5 60 6A
##$RELAX= 
##$RELAX= 
##$RELAX= 
##$RELAX= 
##$RELAX= 
##$RELAX= 
##$RELAX= 
##$RELAX= 
$$ Bruker specific parameters
$$ --------------------------
##$DU= <E:\>
##$EXPNO= 22
$$ [...]
150 150 150 150 150 150 150 150
##$TP07= 0
##$TPNAME0= <>
##$TPNAME1= <>
##$TPNAME2= <>
##$TPNAME3= <>
##$TPNAME4= <>
##$TPNAME5= <>
##$TPNAME6= <>
##$TPNAME7= <>
##$TPOAL= (0..7)
0.5 0.5 0.5 0.5 0.5 0.5 0.5 0.5
##$TPOFFS= (0..7)
0 0 0 0 0 0 0 0
##$TUNHIN= 0
##$TUNHOUT= 0
##$TUNXOUT= 0
##$USERA1= <user>
##$USERA2= <user>
##$USERA3= <user>
##$USERA4= <user>
##$USERA5= <user>
##$V9= 5
##$VALIST= <valist>
##$VCLIST= <CCCCCCCCCCCCCCC>
##$VD= 0
##$VDLIST= <DDDDDDDDDDDDDDD>
##$VPLIST= <PPPPPPPPPPPPPPP>
##$VTLIST= <TTTTTTTTTTTTTTT>
##$WBST= 1024
##$WBSW= 4
##$XGAIN= (0..3)
0 0 0 0
##$XL= 0
##$YL= 0
##$YMAX_a= 6879421
##$YMIN_a= -13607036
##$ZGOPTNS= <>
##$ZL1= 120
##$ZL2= 120
##$ZL3= 120
##$ZL4= 120
##$ABSF1= 14.96065
##$ABSF2= -5.597531
##$ABSG= 5
##$ABSL= 3
##$ALPHA= 0
##$AQORDER= 0
##$ASSFAC= 0
##$ASSFACI= 0
##$ASSFACX= 0
##$ASSWID= 0
##$AUNMP= <proc_prof1d_extract.lims>
##$AXLEFT= 0
##$AXNAME= <>
##$AXNUC= <1H>
##$AXRIGHT= 0
##$AXTYPE= 0
##$AXUNIT= <>
##$AZFE= 0.1
##$AZFW= 0.1
##$BCFW= 0
##$BC_mod= 0
##$BYTORDP= 0
##$COROFFS= 0
##$CY= 15
##$DATMOD= 1
##$DC= 0
##$DFILT= <>
##$DTYPP= 0
##$F1P= 0
##$F2P= 0
##$FCOR= 0.5
##$FTSIZE= 131072
##$FT_mod= 6
##$GAMMA= 0
##$GB= 0
##$INTBC= 1
##$INTSCL= 1
##$ISEN= 128
##$LB= 0.3
##$LEV0= 0
##$LPBIN= 0
##$MAXI= 10000
##$MC2= 0
##$MEAN= 0
##$ME_mod= 0
##$MI= 0
##$NCOEF= 0
##$NC_proc= -2
##$NLEV= 6
##$NOISF1= 0
##$NOISF2= 0
##$NSP= 0
##$NTH_PI= 0
##$NZP= 0
##$OFFSET= 14.96065
##$PC= 1
##$PHC0= -83.8916
##$PHC1= 0
##$PH_mod= 1
##$PKNL= yes
##$PPARMOD= 0
##$PPDIAG= 0
##$PPIPTYP= 0
##$PPMPNUM= 2147483647
##$PPRESOL= 1
##$PSCAL= 4
##$PSIGN= 0
##$PYNMP= <proc.py>
##$REVERSE= no
##$SF= 400.020009777903
##$SI= 131072
##$SIGF1= 0
##$SIGF2= 0
##$SINO= 400
##$SIOLD= 131072
##$SPECTYP= <>
##$SREGLST= <1H.CDCl3>
##$SSB= 0
##$STSI= 131072
##$STSR= 0
##$SW_p= 8223.68421052631
##$SYMM= 0
##$S_DEV= 0
##$TDeff= 65536
##$TDoff= 0
##$TI= <>
##$TILT= no
##$TM1= 0
##$TM2= 0
##$TOPLEV= 0
##$USERP1= <user>
##$USERP2= <user>
##$USERP3= <user>
##$USERP4= <user>
##$USERP5= <user>
##$WDW= 1
##$XDIM= 131072
##$YMAX_p= 397565173
##$YMIN_p= -16579
##$CURPLOT= <Network HP LaserJet P1505>
##$CURPRIN= <$Network HP LaserJet P1505>
##$DFORMAT= <normdp>
##$LAYOUT= <+/1D_H.xwp>
##$LFORMAT= <normlp>
##$PFORMAT= <normpl>
##$SURQMSG= 1
$$ End of Bruker specific parameters
$$ ---------------------------------
##NTUPLES= NMR SPECTRUM
##VAR_NAME=  FREQUENCY,     SPECTRUM/REAL,   SPECTRUM/IMAG
##SYMBOL=    X,             R,               I
##VAR_TYPE=  INDEPENDENT,   DEPENDENT,       DEPENDENT
##VAR_FORM=  AFFN,          ASDF,            ASDF
##VAR_DIM=   131072,        131072,          131072
##UNITS=     HZ,            ARBITRARY UNITS, ARBITRARY UNITS
##FACTOR=    0.0627417313425164, 1,          1
##FIRST=     8223.62146879497, 1836,         -69321
##LAST=      0,             4597,            -69910
##MIN=       0,             -16579,          0
##MAX=       8223.62146879497, 397565173,    0
$$ Real data points
##PAGE= N=1
##DATA TABLE= (X++(R..R)), XYDATA
$$ [...]
67494 79922 79735 79095 78159 77055 75832 74735 74208 74305 74473 74376 74602 75872 77764 79095 79604 80325 81987
67477 81987 83883 84871 84807 84345 83826 83124 82276 81530 80895 80274 79988 80577 82038 83741 85141 86126 86681 86739
67459 86739 86470 86239 86074 85670 85121 85113 86004 87140 87618 87424 87225 87226 86946 86231 85731 85924 86179 85448 83727 82197
67439 82197 81855 82468 83090 83155 82728 82046 81306 80794 80747 80983 80984 80497 79837 79488 79615 80086 80729 81380 81846 82056
67419 82056 82197 82518 83016 83476 83747 83825 83712 83372 82846 82242 81587 80812 79964 79310 79121 79405 79914 80364 80593
67400 80593 80551 80229 79625 78742 77579 76111 74363 72576 71292 71045 71778 72660 72788 72139 71579 71833 72686 73451
67382 73451 73952 74659 75907 77424 78704 79426 79424 78697 77738 77412 78034 78830 78783 77855 76828 76106 75327 74162
67364 74162 72852 71762 71028 70885 71705 73311 74806 75632 76324 77638 79288 80212 79860 78570 76886 75257
67348 75257 74312 74555 75550 76133 75711 74893 74561 74871 75514 76380 77434 78243 78224 77392 76515 76449 77378 78669 79471
67329 79471 79600 79773 80705 82057 82766 82463 81974 82115 82587 82511 81673 80698 80188 80204 80476 80683 80586 80235 80006 80158
67309 80158 80450 80518 80423 80429 80403 79899 78890 78009 78024 79298 81722 84806 87837 90239 91858 92800 93175 93294 93814
67290 93814 95075 96351 96365 94702 92244 90094 88611 87704 87418 87767 88347 88661 88667 88638 88633 88498 88324 88473 89099
67271 89099 89849 90153 89711 88786 88107 88390 89705 91344 92446 92743 92607 92464 92382 92196 91843 91464 91257 91290 91458
67252 91458 91633 91862 92312 92980 93578 93786 93581 93226 92970 92815 92521 91866 91038 90696 91405 92872 93995 93914 92887
67233 92887 91932 91753 92243 92838 93008 92451 91279 90160 89933 90762 91848 92170 91513 90601 90272 90668 91244 91473
67215 91473 91485 91923 93112 94541 95375 95428 95277 95310 95108 94076 92416 91020 90520 90897 92001 93804 95925
67198 95925 97440 97687 97033 96411 96270 96444 96910 98037 99902 101837 103001 103113 102398 101161 99778 98836 98733
67181 98733 99137 99291 98933 98584 98748 99228 99499 99524 99762 100414 101045 101168 101025 101464 103003 105154 106834 107418
67163 107418 107225 106919 106703 106385 106142 106749 108720 111395 113315 113588 112683 111761 111478 111643 111804 111817 111782 111821 112087
67144 112087 112780 113856 114764 114770 113691 112245 111572 112317 114092 115815 116699 116920 117218 117877 118410 118385 118238 118862
67126 118862 120517 122530 124025 124612 124393 123777 123411 123876 125192 126817 128273 129531 130685 131596 132094 132250
67110 132250 132245 132207 132377 133111 134407 135674 136322 136427 136562 137144 138201 139592 141152 142749 144438 146314 148018
67093 148018 148790 148396 147673 147603 148158 148637 148904 149502 150602 151627 152128 152391 152899 153720 154689 155717 156661 157284
67075 157284 157610 158001 158703 159629 160730 162145 163859 165619 167425 169589 172080 174314 175943 177384 179132
67060 179132 180934 182114 182412 182114 181693 181780 183108 185806 188931 191267 192579 193658 195267 197538 200251
67045 200251 203094 205576 207218 208040 208544 209199 210237 211851 214112 216610 218725 220430 222396 225040 227875
67030 227875 230138 231751 233308 235311 237765 240467 243342 246458 249901 253655 257425 260602 262673 263781
67016 263781 264701 266090 267886 269658 271407 273633 276529 279579 282272 284877 288043 291820 295649 299211
67002 299211 302686 306160 309501 313009 317385 322547 327171 330171 332189 334899 339104 344260 349636 355042
66988 355042 360415 365496 370220 374791 379160 382938 386146 389583 394113 399841 406158 412333 417907 422899
66974 422899 427841 433364 439580 446085 452647 459573 467301 475889 484999 494101 502677 510574 518242 526241
66960 526241 534530 542669 550704 559164 568034 576499 584177 591975 601069 611495 622366 633119 643832
66947 643832 654578 665263 676186 688075 701338 715621 730221 744656 758839 773019 787608
66936 787608 802756 818093 833180 848221 864042 881289 899902 919384 939364 959856 981138
66925 981138 1003383 1026317 1049420 1072644 1096626 1121832 1147747 1173465 1198945 1225074 1252527
66914 1252527 1281191 1310772 1341187 1372105 1402842 1433301 1464483 1497397 1531810 1566731 1601963
66903 1601963 1638445 1676977 1717215 1758209 1799468 1841146 1883408 1926044 1968745 2011545 2054863
66892 2054863 2099149 2144576 2191008 2238059 2285014 2330947 2375348 2418741 2462247 2506267 2549894
66881 2549894 2591914 2632044 2670775 2708343 2744501 2779173 2812509 2844111 2872953 2898506 2921388
66870 2921388 2942317 2960838 2975759 2986658 2994212 2999048 3001032 2999928 2996107 2990116 2981916 2971092 2957547
66857 2957547 2941471 2922621 2900255 2874023 2844589 2813126 2780365 2746379 2711078 2674514 2636670
66846 2636670 2597299 2556199 2513509 2469596 2424790 2379449 2334170 2289530 2245490 2201352 2156581
66835 2156581 2111504 2066942 2023210 1979795 1936028 1891836 1847788 1804666 1763073 1723118 1684228
66824 1684228 1645484 1606523 1568094 1531488 1497284 1464763 1432576 1399947 1367207 1335292 1304819
66813 1304819 1275712 1247594 1220296 1193763 1167659 1141507 1115302 1089669 1065219 1042025 1019912
66802 1019912 998907 979002 959694 940250 920446 900687 881408 862683 844441 826688 809442
66791 809442 792746 776797 761757 747332 732926 718344 704039 690430 677289 664105 650809
66780 650809 637832 625594 614234 603705 593749 583804 573298 562187 551047 540563 531052 522437
66768 522437 514432 506606 498497 489982 481555 474022 467803 462550 457516 452149 446233 439632 432313 424707
66754 424707 417679 411790 406696 401542 395891 390049 384547 379559 374773 369599 363570 356879 350426 344993
66740 344993 340367 335711 330744 325961 321596 317060 311885 306653 302403 299367 296858 294162 290975 287096
66726 287096 282429 277408 272934 269595 267193 265100 262774 259859 256195 252043 248079 244923 242693 241077
66712 241077 239695 238322 236873 235313 233526 231309 228609 225706 223027 220747 218752 216912 215160 213326
66698 213326 211190 208823 206666 205117 204147 203414 202577 201464 200094 198629 197191 195600 193487 190815 188137
66683 188137 186211 185340 185145 184867 183847 181924 179558 177539 176391 175991 175764 175187 174112 172706 171201 169646
66667 169646 167918 165997 164168 162776 161797 160867 159774 158685 157746 156729 155330 153667 152169 151030 150076
66652 150076 149214 148677 148637 148806 148689 148228 147980 148508 149669 150551 150137 148073 144884 141562 138961 137429 136837
66635 136837 136834 137067 137234 137010 136065 134287 131997 129892 128630 128451 129149 130304 131453 132143 132042 131109 129616
66618 129616 127875 126044 124251 122807 122046 121956 122142 122197 121920 121118 119520 117175 114754 113087 112402 112317 112519
66601 112519 113068 113950 114720 114861 114311 113437 112575 111742 110727 109410 108109 107543 108188 109628 110811 111046 110438
66584 110438 109365 108076 107026 106956 108083 109533 110236 110168 110184 110802 111779 112789 113766 114472 114411 113516 112413 111667
66566 111667 111087 110050 108282 106124 104237 103201 103136 103595 103998 104233 104582 105135 105735 106479 107617 108782 109002
66549 109002 107929 106507 105884 106060 106164 105677 104718 103417 101813 100340 99639 99672 99552 98506 96655 94676
66533 94676 93119 92264 92262 93030 94118 94960 95339 95593 96360 97929 99670 100334 99268 97257 95733 95225 95080
66516 95080 94692 94386 94776 95827 96979 97796 98076 97690 96831 96164 96110 96160 95512 94337 93702 94109 94826 95022 94880
66497 94880 95001 95171 94543 92992 91547 91236 92008 93048 93783 94230 94578 94805 94700 94093 93117 92360 92556 93892
66479 93892 95663 96869 97187 97204 97645 98572 99423 99759 99762 99898 100108 99633 97915 95552 93850 93331 93182 92453
66461 92453 91318 90582 90378 90124 89676 89630 90271 90987 91133 90874 90731 90793 90989 91665 93174 95059 96378 96915
66443 96915 97428 98546 99936 100847 101076 101039 101105 101237 101194 100843 100248 99578 99002 98633 98601 99139 100472 102506 104638
66424 104638 105994 105975 104660 102702 100752 98974 97178 95381 94008 93454 93648 94235 95003 95880 96653 97076
66408 97076 97260 97559 97933 97758 96553 94717 93235 92772 93298 94528 96281 98219 99639 99988 99549 99239 99629
66391 99629 100459 101199 101691 101936 101665 100694 99556 99150 99680 100449 100891 101265 102035 102973 103373 102896 101849 100801
66373 100801 100273 100602 101708 102985 103753 103784 103271 102499 101795 101547 101885 102484 102936 103135 103062 102586 101911 101813 102745
66354 102745 103956 104325 103944 103980 104922 105888 106007 105569 105262 104978 104146 102818 101698 101252 101282 101297 100896 100021 99114
66335 99114 98796 99068 99089 98195 96809 95913 95934 96697 98175 100495 103238 105477 106737 107351 107635 107247 105747
66318 105747 103486 101540 100748 101002 101445 101347 100831 100657 101217 101989 102193 101754 101206 100873 100706 100859 101726 103256
66300 103256 104801 105896 106693 107350 107536 106979 106088 105530 105476 105787 106665 108510 111138 113668 115343 116121 116441
66283 116441 116715 117085 117338 117001 115842 114309 113210 112879 112972 113125 113387 113785 113857 113064 111514 109895 108688
66266 108688 107763 106815 105917 105437 105528 105946 106399 106915 107653 108447 108868 108885 109168 110366 112184 113587 113957 113651
66248 113651 113327 113207 113271 113699 114610 115607 116207 116652 117725 119637 121651 122988 123625 123934 124034 123927 123865 123958
66230 123958 123632 122121 119572 117075 115447 114510 113807 113466 113817 114480 114486 113311 111363 109408 107943 107161 107027
66213 107027 107122 106809 105914 105025 104814 105284 106038 107018 108448 110119 111289 111476 110966 110372 110100 110397 111457 113129
66195 113129 114847 116282 117746 119540 121214 122075 122300 122802 123891 124716 124348 122958 121511 120626 120145 119632
66179 119632 118957 118443 118627 119756 121369 122647 123367 124229 125917 128074 129634 130065 129856 129841 130435 131560 132871
66162 132871 133878 134182 133809 133182 132607 131963 130980 129696 128500 127785 127551 127300 126391 124743 123123 122436 122696
66145 122696 123047 122899 122699 123337 125009 126938 128157 128350 128034 128081 128959 130290 131247 131493 131560 132130 133171 134060
66127 134060 134329 133922 132859 131211 129486 128540 128689 129246 129290 128737 128239 128170 128225 128114 128178 128953 130344 131682
66109 131682 132585 133458 134972 137238 139685 141706 143287 144942 147043 149252 150716 150849 149926 148821 148264
66094 148264 148390 148852 149120 148724 147611 146415 146037 146635 147177 146342 143912 141005 138925 138013 137669 137202 136420
66077 136420 135508 134650 133909 133347 133085 133171 133495 133937 134550 135434 136448 137214 137495 137485 137696 138584 140227 142161
66059 142161 143565 143898 143512 143361 143970 144926 145518 145549 145245 144688 143837 142977 142609 142861 143341 143618 143543 143089 142216
66040 142216 141058 139990 139399 139458 140049 140737 140947 140496 139897 139827 140329 140806 140805 140424 139987 139716 139738 140072 140548 141077
66020 141077 141920 143293 144726 145399 145227 145000 145248 145535 145220 144358 143418 142583 141850 141488 141841 142770 143755 144505
66002 144505 145152 145941 147004 148335 149744 150959 151948 153020 154483 156399 158791 161797 165395 169273 173120
65987 173120 176736 179700 181439 181928 181905 182031 182255 182310 182330 182495 182557 182289 181931 181639 180982 179722 178547 178083
65969 178083 177601 175818 172846 170177 168658 167556 165854 163533 161232 159564 159082 160044 161788 163135 163861
65954 163861 165005 167268 169940 172040 173738 175921 179003 182981 188073 194344 201046 207244 212926 218657
65940 218657 224351 229260 233078 236163 238625 240080 240527 240645 240841 240719 239940 239111 239226 240555 242567 244743
65924 244743 246974 249224 251238 252745 253779 254732 256176 258533 261761 265349 268795 272117 275802 280147
65910 280147 284736 288668 291287 292585 292936 292682 292124 291729 292006 293086 294610 296074 297159 297819 298321 299164
65894 299164 300549 301749 301369 298577 293915 288700 283860 279616 276015 273204 271125 269308 267245 264847
65880 264847 262406 260110 257708 254809 251639 249277 248732 249800 251298 252605 254405 257487 261325 264544
65866 264544 266561 267990 269380 270314 270006 268253 265457 262059 258335 254499 250649 246717 242675 238720 235048
65851 235048 231561 228004 224389 221145 218791 217470 216744 215920 214732 213659 213408 214090 215118 215899 216258 216119
65835 216119 215201 213410 211339 209945 209742 210509 211776 213300 215082 217156 219518 222095 224712 227224 229785
65820 229785 232848 236698 241012 245023 248099 250127 251401 252354 253438 254955 256849 258782 260618 262709
65806 262709 265493 268995 273065 278004 284408 292208 300250 307134 312208 315576 317520 318346 318514 318425 318106
65791 318106 317474 316802 316529 316709 317139 317976 319703 322399 325566 328875 332577 336936 341774 346959 352904 360089
65775 360089 368364 377213 386516 396466 406769 416435 424455 430381 434188 435998 436077 434857 432814 430491
65761 430491 428650 428105 429341 432537 438051 446503 458209 472883 490260 510793 535374 564519 598282
65748 598282 636836 680502 728911 780552 833550 886744 939671 991570 1040684 1084526 1120628
65737 1120628 1147202 1163563 1169976 1166786 1153661 1130122 1096995 1056832 1012481 965492 916293 865546
65725 865546 814677 765152 717952 673873 633665 597545 565005 535475 508834 484894 462820
65714 462820 441678 421463 403110 387455 374503 363649 354207 345681 337876 330941 325142 320529 316953
65701 316953 314360 312772 311955 311379 310560 309291 307581 305670 304145 303667 304420 306033 308138 310774 314156
65686 314156 318352 323356 329171 335690 342785 350750 360345 372108 385953 401719 419851 441112 465876
65673 465876 494250 526764 564365 607678 656623 710695 769094 830551 893567 956978 1019804
65662 1019804 1080489 1136916 1187536 1231936 1269947 1300762 1323595 1338820 1347791 1351773 1351822 1349577
65650 1349577 1347172 1345973 1345977 1346847 1348915 1352534 1356689 1358952 1356951 1349485 1336158 1316450 1289597 1255255
65636 1255255 1213824 1166045 1112577 1054247 992565 929597 867277 806980 749671 696081 646615
65625 646615 601410 560658 524586 492903 464711 439368 417116 398333 382461 368426 355998
65614 355998 345858 338015 330971 323110 314524 306753 300813 296104 291402 286450 282255 279921 279464 279921
65600 279921 280451 281027 281959 283105 283994 284585 285351 286531 287805 288923 290257 292438 295812 300535 306806 314631
65584 314631 323682 333839 345622 359718 376332 395555 418161 445354 477696 514779 556070 601594
65572 601594 651594 705920 763863 824148 884765 943135 996851 1044232 1084043 1114941 1135475
65561 1135475 1144650 1142299 1128967 1105576 1073202 1032926 985811 933048 876247 817564 759355 703488
65549 703488 650917 601965 556831 515673 478380 444858 415527 391002 370983 354050 339044
65538 339044 326179 316132 308523 302186 296815 293237 291783 291354 290685 289820 289587 289961 289752 287834 284137
65523 284137 279362 274265 269390 265113 261570 258551 255713 253024 250991 250302 251112 252717 254055 254531 254293
65508 254293 253881 253844 254557 255978 257472 258194 257840 256859 255897 255264 254926 254656 254063 252893 251595 251311 253043
65491 253043 256966 262649 269559 277080 284498 291452 298230 305182 311969 317810 322378 325972 328795 330467
65477 330467 330379 328245 324223 318789 312623 306359 300247 294125 287800 281337 274946 268702 262540 256503 250907
65462 250907 246220 242700 240137 238017 236003 234194 232941 232476 232744 233385 233846 233782 233522 233949 235666 238405
65446 238405 241489 244683 248299 252543 257143 261638 265727 269243 272066 274274 276271 278555 281344 284420
65432 284420 287297 289539 291036 292030 292864 293667 294313 294670 294861 295240 296081 297300 298531 299512 300279 300989 301728
65415 301728 302678 304209 306465 308965 310888 311683 311046 308625 304445 299593 295562 292612 289548 285585 281636
65400 281636 279045 277779 276897 276392 277404 280638 285580 291376 297541 303486 308257 311302 312986 313947 314368
65385 314368 314178 313389 311804 308850 304232 298539 292775 287486 282599 277851 273107 268599 265191 264026 265404
65370 265404 268236 271064 273438 275850 278583 281297 283770 286336 289321 292530 295767 299605 305228 313420
65356 313420 323919 335863 348812 363182 379569 397741 416440 434179 450010 463519 474499
65345 474499 483005 489442 494070 496402 495610 491662 485624 478567 470519 460836 449355 436717 423615 410337
65331 410337 397201 384974 374383 365427 357617 350847 345602 342230 340422 339579 339330 339384 339245 338483 337101
65316 337101 335178 332302 327878 322013 315537 308958 301840 293530 284162 274639 265864 258323 252203 247456
65302 247456 243718 240493 237565 235118 233456 232793 233335 235316 238745 243111 247560 251469 254786 257630 259609
65287 259609 259911 258293 255750 253765 252960 252834 252796 252966 253792 255321 257198 259122 261027 262980 265162 267803
65271 267803 270874 273992 276853 279651 282840 286611 290843 295457 300562 306302 312784 320112 328266 337013
65257 337013 346087 355305 364200 371620 376087 376754 373946 368766 362303 355120 347181 338207 328235 317847
65243 317847 307676 297793 287935 278399 270312 264707 261524 259885 259192 259568 261170 263475 265611 267219
65229 267219 268630 270182 271685 272707 273066 272825 272028 270740 269230 267773 266334 264756 263180 261893 260826
65214 260826 259665 258549 258142 258820 260239 261941 263931 266289 268666 270647 272262 273588 274176 273509 271939
65199 271939 270457 269413 268000 265198 260834 255598 250439 246155 243280 242003 242241 243790 246269 249009
65185 249009 251298 252909 254181 255531 257053 258658 260334 262106 263813 265059 265436 264909 264003 263360 262867
65170 262867 261484 258335 253826 249229 245294 241835 238718 236564 236047 236958 238389 239665 240724 241706 242511
65155 242511 242805 242307 241059 239482 238080 237084 236490 236435 237358 239741 243801 249357 255826 262559 269470 277197
65139 277197 286158 295655 304518 312655 321199 330910 341252 351480 361937 373582 386771 401275 417128
65126 417128 434599 453403 472676 491762 510469 528567 545589 561112 574582 584809 590352 590726
65114 590726 586783 579612 569519 556338 540324 522256 502906 482827 462553 442666 423685 406029
65102 406029 390079 376057 363862 353072 343115 333500 324077 315107 306996 299970 294122 289590 286327
65089 286327 283754 281189 278739 277265 277152 277574 277398 276388 274966 273098 270202 266192 261910 258260 255474
65074 255474 253545 252930 254243 257379 261388 265271 268666 271788 275003 278608 282834 287850 293660 299932
65060 299932 305953 310970 314808 318126 321835 326121 330140 332717 333289 332175 330135 327833 325632 323653
65046 323653 321848 320047 318085 316080 314577 314196 314905 315771 315764 314817 313724 312873 311490 308459 303622 297772
65030 297772 291499 284623 276899 268812 261301 254933 249626 245030 240937 237346 234375 232158 230725 229996
65016 229996 229915 230508 231763 233576 235952 239121 243298 248403 254142 260350 267138 274752 283384 292991 303126
65001 303126 312942 321551 328509 333984 338466 342296 345408 347497 348520 348976 349616 350926 353152 356734 362285
64986 362285 369890 378783 388059 397473 407147 416635 424716 430087 432021 430448 425855 419071 410766 401076
64972 401076 390027 378255 366771 355975 345492 335244 326168 319410 315158 312631 310944 309590 308412
64959 308412 307668 307997 309773 312477 315167 317524 320021 323033 326263 329090 331042 331802 331275 329887 328382
64944 328382 327050 325550 323754 322249 321562 321334 320963 320799 321886 324477 327534 329953 331670 333197 334547
64929 334547 335133 334498 332718 330112 326835 322702 317355 310842 304128 298656 295038 292500 289992 287487 285624
64914 285624 284391 283013 281212 279757 279423 280038 280997 282221 284129 287042 291184 296977 304689 313865 323661
64899 323661 333799 344717 356767 369740 383320 397517 412356 427543 442812 458449 475108
64888 475108 493152 512347 532078 551614 570139 586760 600601 610784 616359 616510 611078 600958
64876 600958 587879 573623 559276 545117 531193 518014 506616 497863 491720 487359 484023 481594
64864 481594 480031 478366 474757 467872 457998 446466 434173 421129 407362 393528 380292 367584
64852 367584 355028 342799 331499 321254 311508 301802 292319 283568 275904 269575 264842 261760 260029
64839 260029 259309 259484 260315 261078 260941 259747 258095 256620 255475 254656 254438 255136 256553 258056 259312 260663
64823 260663 262655 265410 268657 272133 275657 278962 281866 284667 288033 292470 298177 305405 314449 325059
64809 325059 336266 347187 357755 368310 378703 388135 395708 400764 402952 402396 399752 395666 390279
64796 390279 383638 376429 369754 364125 359228 354793 351211 349065 348364 348517 348865 349133 349485 350225 351344 352548
64780 352548 353883 356011 359371 363354 366919 369890 372894 376150 379368 383009 388583 397085 407852 419543
64766 419543 431559 443935 456571 469326 482372 495668 508566 520709 532874 546115 560492
64755 560492 575548 591578 609256 628218 647212 665719 684208 702514 719031 731923 740224 743396
64743 743396 740833 732586 719846 703965 685446 664534 642322 620563 600602 582999 567918 555332
64731 555332 545059 537009 531184 527064 523481 519620 515855 512971 510849 508684 506453 505440 507205 512491
64717 512491 521206 532937 547242 563722 581866 600636 618335 633333 644903 652875 656523 654457
64705 654457 645873 631442 612688 590938 567221 542747 518785 496086 474754 454747 436231 419484
64693 419484 404710 392035 381477 372820 365682 359796 355138 351690 349154 347101 345434 344538 344809 346116
64679 346116 347901 349835 352162 355362 359710 365271 372064 379966 388615 397671 407043 416536 425357 432360
64665 432360 436762 438397 437346 433859 428690 422956 417354 411821 406272 401212 397162 393783 390173 386020
64651 386020 381977 378892 377174 377035 378766 382327 386959 391697 396307 401462 408018 416311 426173 437404
64637 437404 450140 464811 481772 500903 521600 543161 565047 586641 606921 624634 638728
64626 638728 648360 652568 650481 642080 628488 611194 591298 569737 547847 527021 507802 489899
64614 489899 473226 458434 446159 436221 427962 421027 415328 410437 405574 400291 394783 389473 384590
64601 384590 380217 376396 373072 370202 368042 366994 367057 367727 368742 370625 374109 379146 384899 390733 396952
64586 396952 404522 414337 426840 442059 459844 480132 503002 528244 554831 581124 605892 629061
64574 629061 651190 672246 691107 706241 716611 721777 721409 715108 702832 685320 663870 639613
64562 639613 613159 585044 556432 529010 504037 481651 461396 443284 428006 416035 406912 399650
64550 399650 393673 389145 386482 385787 386733 388855 392013 396642 403329 411892 420985 428917 434752 438315 439376
64535 439376 437485 432774 426262 418934 410870 401718 391715 381714 372400 364052 356983 351585 347793 345038
64521 345038 342966 341731 341281 340883 339888 338703 338392 339293 340552 341172 341140 341287 342305 344213 346665 349515
64505 349515 353037 357765 364148 372232 381595 391665 402176 413243 424944 436882 448314 458698
64493 458698 467897 475767 481820 485635 487610 488911 490563 492789 495433 498684 502960 508174 513534 518200
64479 518200 521803 524170 524823 523076 518598 511691 503086 493691 484465 476258 469562 464486 461069 459540
64465 459540 460134 462695 466643 471389 476610 481922 486337 488398 487087 482439 475188 466050 455677 445069
64451 445069 435333 426828 419024 411528 404859 399708 395795 392115 388363 385463 384503 385607 388076 391262
64437 391262 394979 399382 404921 412297 422107 434401 448749 464680 482043 501111 522549 547166
64425 547166 575576 608201 645718 689288 740121 798990 866338 942515 1027456 1120125 1218577
64414 1218577 1320430 1423078 1523757 1620077 1710613 1794601 1871008 1938211 1994422 2037841 2066427
64403 2066427 2078332 2073048 2051688 2015797 1966196 1903194 1827347 1739618 1641379 1535004 1424220
64392 1424220 1313211 1205355 1103133 1008812 924294 850177 785633 729411 680614 638528 602428
64381 602428 571927 547079 527796 513395 502928 495646 490934 488140 486697 486076 485320 483028 478339
64368 478339 471801 464752 457761 450038 440456 428871 416339 404303 393741 384920 377632 371541 366392
64355 366392 362072 358600 356073 354550 353978 354284 355464 357434 359801 362014 363779 365105 365855 365513 363631
64340 363631 360383 356412 352204 347795 343005 337722 332026 326328 321383 317859 315810 314756 314362 314758 316118
64325 316118 318301 321188 325079 330311 336608 343356 350546 358912 368893 379936 391187 402406 413586
64312 413586 423965 432190 437494 440009 439785 436292 429334 419816 409057 397768 386282 375310 365609
64299 365609 357086 349025 341190 334040 327868 322485 317851 314250 311631 309559 308156 308314 310510 314020
64285 314020 317828 321671 325559 328943 331222 332802 334775 337701 341376 345617 350449 355542 360291 364600
64271 364600 368936 373470 377669 380937 383149 384450 385080 385580 386595 388224 389933 391293 392404 393482 394538
64256 394538 395574 396567 396963 395753 392368 387049 380114 371526 361608 351564 342561 334641 327125 319767
64242 319767 312906 306767 301329 296733 293176 290376 287807 285491 284084 284068 285309 287391 289876 292201 293833
64227 293833 294719 295207 295468 295400 295122 295013 295079 294820 293983 293011 292382 291896 290941 289160 286516 283026 278909 274805
64209 274805 271395 268753 266359 263765 261049 258672 257126 256707 257394 258901 260884 263104 265414 267786 270485
64194 270485 274028 278749 284545 291268 299289 309446 322350 337759 354536 371214 386774 401038
64182 401038 414164 425732 434608 439873 441587 440366 436528 430144 421718 412215 402295 391986 381223
64169 381223 370326 359706 349417 339298 329419 320145 311849 304676 298519 293128 288306 284078 280575
64156 280575 277782 275633 274411 274793 277266 281578 286954 292775 298920 305543 312695 320141 327342 333613
64142 333613 338424 341664 343597 344554 344673 343888 342125 339528 336482 333366 330220 326706 322508 317811 313328
64127 313328 309768 307244 305277 303497 302287 302563 304825 308654 313316 318650 325018 332473 340401 348149
64113 348149 355666 363310 371281 379473 387691 395685 403021 409197 413927 417236 419356 420736 422091 424185
64099 424185 427533 432369 438757 446382 454213 460722 464771 466266 465854 464040 460667 455125 446991 436560
64085 436560 424955 413641 403623 394974 387151 379756 372933 367047 362252 358541 356093 355193 355683 356716
64071 356716 357301 357059 356292 355434 354644 353912 353239 352615 351966 351238 350408 349404 348216 347151 346688 346876 347080 346605
64053 346605 345463 344264 343361 342368 340568 337618 333838 329922 326438 323497 320984 319108 318530 319730 322417
64038 322417 325857 329749 334396 340016 346232 352376 357932 362496 365629 367199 367816 368583 370331 373182 376802
64023 376802 380878 385340 390289 395751 401431 406652 410625 412794 412975 411290 408117 404000 399374 394346
64009 394346 388942 383547 378822 374979 371365 367102 362082 357090 352888 349456 346219 342779 339228 335897
63995 335897 333035 330720 328932 327705 327248 327790 329222 331088 333089 335366 338035 340695 342822 344486 346137
63980 346137 347719 348641 348767 348814 349410 350345 351176 351951 352690 352577 350611 347020 343291 340662 339190 338409 338215
63963 338215 338769 340010 341712 343770 346207 349104 352732 357521 363667 370935 378934 387368 395997 404776
63949 404776 414246 425352 438540 453333 469248 486836 507287 531045 557371 585409 615299 647931
63937 647931 683856 722719 763738 806380 850376 895189 939821 983259 1024802 1063720 1098792
63926 1098792 1128609 1152231 1169168 1178801 1180428 1174066 1160676 1141329 1116517 1086650 1052820 1016524
63914 1016524 978768 939843 899912 859435 819095 779647 741842 706265 673272 643219 616547
63903 616547 593343 573034 554983 539340 526799 517452 510325 504335 499346 495950 494377 494026 494158
63890 494158 494742 496370 499362 503244 507257 511208 515563 520764 526830 533673 541443 550347 560390 571537
63876 571537 583917 597744 613217 630695 650677 673313 698130 724566 752691 783283 817398
63865 817398 856038 899799 948394 1000704 1055808 1113959 1176292 1243754 1316576 1394444 1476527
63854 1476527 1561423 1647705 1734695 1822362 1910356 1997431 2081753 2161440 2234838 2300735 2358347
63843 2358347 2406844 2444939 2471287 2485245 2486897 2476511 2454445 2421431 2378353 2325759 2264146
63832 2264146 2194663 2118931 2038154 1953109 1864985 1775460 1685793 1596715 1509475 1425982 1347326
63821 1347326 1272879 1201562 1133414 1069272 1009568 954316 903870 858644 818156 781184 746968
63810 746968 715686 687698 662902 640877 621167 603289 586847 571722 557894 545134 533248
63799 533248 522505 513339 505617 498608 491782 485243 479322 474082 469398 465211 461516 458220 455164 452204
63785 452204 449248 446247 443075 439433 435058 430134 425194 420470 415738 411048 407092 404287 401929 399028
63771 399028 395818 393666 393443 394729 396798 399652 403740 409245 416124 424499 434533 445955 457847 468715
63757 468715 476762 480580 479911 475511 468219 458409 446493 433366 419926 406484 393152 380633 370091
63744 370091 362165 356466 352156 348805 346537 345471 345302 345598 346456 348555 352297 357081 361778 365854 369611
63729 369611 373402 377172 380963 385304 390625 396588 402329 407258 411409 415293 419638 424899 430593 435372
63715 435372 438170 439173 439309 439047 438141 436335 433677 430187 425875 421236 417177 414175 411912 409944 408300
63700 408300 407108 406066 404769 403331 402212 401509 400869 400123 399603 399694 400349 401200 401972 402603 403112 403504 403789
63683 403789 403951 403912 403624 403171 402740 402532 402775 403797 405924 409247 413467 418021 422407 426531 430802 435755
63667 435755 441381 446913 451532 455291 458978 462913 466249 467789 467271 465385 462696 459121 454592 449610
63653 449610 444794 440234 435727 431430 427850 425284 423702 423215 424291 427388 432593 439675 448252 457873
63639 457873 468234 479427 491717 504905 518099 530304 541065 550417 558497 565463 571498 576521
63627 576521 580016 581656 582058 582421 583300 584249 584920 586036 588824 593836 600874 609878 621208 635012 650940
63612 650940 668790 688957 711890 737469 765288 795247 827355 861057 895164 928398 959583
63601 959583 987339 1010149 1027038 1037989 1043567 1044418 1041286 1035118 1026754 1016632 1005078 992736 980268
63588 980268 967545 953521 937110 918077 896936 874257 850370 825731 801232 777898 756217
63577 756217 735951 716679 698614 682797 670336 661352 654811 649525 645297 642889 642909 644965 648019
63564 648019 651300 654673 658354 662672 668064 674935 683350 693067 703987 716392 730723 747411 767150
63551 767150 791099 820574 856627 900092 951772 1012077 1080342 1154623 1231985 1308402 1378201
63540 1378201 1434415 1471065 1486154 1482570 1465886 1441174 1411804 1380494 1350153 1322950 1299033
63529 1299033 1277002 1255578 1234254 1212550 1189558 1164579 1137544 1108453 1077038 1043508 1009147
63518 1009147 975510 943267 912357 883053 856271 832887 813164 796723 782618 769615 756902
63507 756902 744484 732536 720622 708103 695078 682172 669467 656385 642711 628989 615713
63496 615713 602837 590387 578941 569052 560606 553110 546288 540193 535108 531513 529705 529196 528969 528616
63482 528616 528810 530396 533526 538007 543876 551101 559158 567481 576027 584842 593424 601107 607917 614463
63468 614463 621089 627651 634053 640475 647066 653814 660747 667884 675014 681768 687901 693288 697738 701052
63454 701052 703119 703776 702822 700397 697100 693473 689760 686495 684815 685572 688504 692933 699044 707859 720270
63439 720270 737002 759481 789755 829278 878313 936584 1003676 1078264 1157156 1235180 1305712
63428 1305712 1361827 1398355 1413801 1410244 1391370 1361058 1323676 1284403 1248112 1217977 1195516
63417 1195516 1181548 1176544 1180292 1191758 1209252 1230496 1252799 1273598 1290944 1303496 1310499 1311961
63405 1311961 1308539 1300899 1289501 1275199 1259573 1244074 1228986 1213551 1196791 1177792 1155606 1129651
63393 1129651 1100254 1068278 1034190 998028 960415 923060 887863 855659 826045 798297 772285
63382 772285 748546 727637 709565 693935 680564 669697 661531 655808 652115 650363 650639 652730 656215
63369 656215 661168 668458 679107 693413 710779 730475 752523 777764 807061 840587 878130 919865
63357 919865 966242 1016907 1070179 1124006 1177156 1229095 1278931 1325027 1365616 1399384 1425467
63346 1425467 1443419 1453524 1456920 1455163 1449697 1441742 1432465 1422962 1413832 1404717 1394309 1381033 1363864
63333 1363864 1342527 1317032 1287351 1253688 1216858 1178277 1139708 1103033 1069914 1041545 1019063
63322 1019063 1004187 998708 1002783 1014181 1029611 1046126 1060306 1066798 1059623 1035964 998120 951336
63310 951336 900334 848221 797532 750730 709383 673629 642790 616248 593622 574498 558267
63299 558267 544184 531536 519875 509161 499597 491301 484108 477652 471544 465564 459737 454257 449345
63286 449345 445232 442148 440065 438432 436468 433840 430877 428047 425522 423437 422238 422337 423542 425180 426807
63271 426807 428478 430300 432051 433381 434193 434699 435196 435873 436705 437418 437756 437919 438692 440920 444819 449896
63255 449896 455514 461404 467583 473974 480336 486494 492395 497890 502707 506822 510673 514749 519078 523411
63241 523411 527838 532831 538521 544303 549488 554193 559237 565170 571712 578287 584863 592033 600317 609651
63227 609651 619628 630091 641267 653396 666406 679990 693764 707382 720782 734498 749337 765328
63215 765328 781174 795296 807427 818677 829907 840547 849208 854940 857503 856849 853020 846433 837649
63202 837649 826783 813529 797884 780521 762319 743868 725651 708459 693348 681157 672108 665805
63190 665805 661572 658949 657955 658926 662140 667704 675690 686152 699022 714143 731417 750585 770777
63177 770777 790574 808771 824965 839264 851656 861938 870106 876364 880744 883138 883943 884281 885119
63164 885119 886166 886022 883504 878515 871444 862089 849622 833518 814045 791830 767443 741647 715586
63151 715586 690287 666096 642961 621045 600688 581953 564755 549401 536391 525563 515968 506902
63139 506902 498611 491688 486135 481413 477098 473037 469120 465397 462241 459905 457970 455709 453002 450444
63125 450444 448511 447092 445905 444891 444038 443283 442788 442849 443276 443378 442957 442819 443766 445496 447174 448827 451265
63108 451265 454650 458022 460580 462743 465455 468985 472963 477251 482192 488193 495651 505240 517690 533156
63094 533156 551124 570921 591913 613181 633549 652115 668304 681143 688984 690506 685808 676081
63082 676081 662490 645934 627810 610098 594230 580252 567560 556186 546850 539958 535116 531777
63070 531777 529871 529566 530738 533028 536231 540402 545691 552311 560474 570048 580487 591522 603862 618668
63056 618668 636192 655498 675757 697323 721040 746907 774123 802256 831632 862430 894018
63045 894018 925552 956767 987861 1018933 1049918 1080895 1112104 1143823 1176438 1210435 1245851
63034 1245851 1281842 1317114 1350860 1383009 1413660 1442512 1468790 1491380 1509040 1520770 1526079
63023 1526079 1524705 1516210 1500279 1477415 1448857 1415668 1378318 1337445 1294653 1252174 1211885 1174910
63011 1174910 1141837 1112940 1088382 1068639 1054751 1047802 1048066 1054809 1066826 1082903 1101897 1122755
62999 1122755 1144520 1166133 1186333 1204139 1219462 1232914 1244930 1255420 1264379 1272443 1280578 1289432
62987 1289432 1299165 1309602 1320262 1330421 1339422 1346819 1352026 1354005 1351622 1344279 1332023 1315140 1293897
62974 1293897 1268624 1239741 1207661 1172844 1135981 1097906 1059315 1020733 982810 946415 912266
62963 912266 880510 850774 822660 796202 771885 750161 730936 713598 697586 682756 669062
62952 669062 656156 643647 631643 620658 610926 602121 593863 586148 579052 572241 565094 557334 549365
62939 549365 541956 535666 530509 526167 522437 519383 516961 514684 511989 508896 505959 503456 500992 498114
62925 498114 495024 492385 490573 489432 488687 488343 488690 490059 492537 495904 499989 505134 511969 520547 530034
62910 530034 539531 548833 557949 566240 572685 576831 578857 578792 576497 572598 568610 565672 563648 561865 560208
62895 560208 559020 558335 557804 557107 555890 553631 550155 546136 542503 539527 537067 535538 535778 537904 541081
62880 541081 544716 549098 554441 559889 564103 566514 567413 567102 565555 562915 559736 556598 553693 550888 547930
62865 547930 544592 540822 536844 533068 529924 527750 526594 525996 525224 523979 522672 521805 521361 521157 521462 522709
62849 522709 524706 526701 528302 529801 531491 533136 534369 535245 536171 537506 539352 541386 542860 543195 542758
62834 542758 542663 543625 545446 547814 550915 554726 558361 561031 563437 567285 573358 580775 588306 595611 602770
62819 602770 609261 614103 616799 617609 616926 614853 611439 607093 602579 598653 595669 593435 591484 589577 588000
62804 588000 587403 588343 590934 594727 598960 603149 607543 612800 619124 625936 632581 639179 646529 655303 665642
62789 665642 677517 691115 706705 724376 744215 766650 792390 821956 855418 892670 933705
62778 933705 978408 1026193 1076191 1127909 1181403 1236637 1292900 1349110 1404396 1457974 1508597
62767 1508597 1554798 1595801 1631640 1661961 1685082 1698788 1701973 1695120 1679306 1655212 1623225 1584036
62755 1584036 1538772 1488689 1434961 1378719 1321044 1262917 1205275 1149150 1095592 1045339 998603
62744 998603 955271 915275 878650 845254 814768 787149 762885 742413 725327 710499 697056
62733 697056 684890 674132 664588 656074 648953 643788 640501 638282 636375 634566 632879 631227 629582 628203
62719 628203 627366 627026 627006 627456 628889 631717 635915 641144 647119 653797 661359 670173 680827 694062 710411
62704 710411 729769 751392 774506 798906 824911 852880 882981 915439 950654 988807 1029364
62693 1029364 1071185 1113256 1155349 1197945 1241392 1285020 1327076 1365616 1399408 1427906 1450438
62682 1450438 1465733 1472347 1469483 1457410 1437306 1410746 1379068 1342991 1302890 1259499 1214168 1168304
62670 1168304 1122697 1077591 1033236 990160 949082 910838 876254 845618 818246 792983 769357
62659 769357 747930 729312 713154 698480 684817 672541 662070 653096 644784 636504 628231 620329
62647 620329 613122 606644 600716 595211 590213 585869 582164 578996 576402 574519 573285 572470 572081 572498 573929
62632 573929 575917 577647 578701 579256 579604 579779 579700 579377 578806 577841 576411 574768 573303 572115 570928 569525
62616 569525 568152 567358 567435 568159 569130 570277 571857 574007 576488 578973 581366 583738 586134 588675 591750
62601 591750 595894 601527 608915 618220 629312 641688 655006 669788 687210 708045 731904 757556
62589 757556 783764 809888 836051 862827 890390 917694 942700 963561 979477 990394 996387 997634
62577 997634 994585 987681 976964 962312 943999 922760 899406 874580 848830 822669 796600 771154
62565 771154 746779 723629 701736 681497 663576 648058 634126 621044 609076 598891 590367 582729
62553 582729 575677 569561 564384 559417 554120 548764 543811 539331 535447 532778 531757 531774 531738 531501 532163 534760
62537 534760 538992 543483 547063 549526 551177 552032 551811 550682 549573 549429 550360 551826 553532 555804 559184
62522 559184 564057 570628 578825 588198 598411 609920 623761 640485 659669 680527 702566 725489
62510 725489 749077 773481 799146 826067 853456 880471 906752 931800 954385 973329 988671
62499 988671 1001328 1011531 1018215 1020047 1016760 1009461 1000044 990271 981015 972192 963588 955682 949432 945471
62485 945471 943845 944461 947302 952206 958830 966960 976558 987398 998835 1009859 1019172 1025383 1027615 1025972
62471 1025972 1021039 1012890 1000866 984377 963573 939267 912585 884616 855887 826079 794767 762624
62459 762624 731421 702629 676421 652243 629887 609682 592107 577647 566607 558553 552141 546058
62447 546058 540053 534680 530213 526344 522891 520246 518942 519100 520451 522573 524977 527182 528918 530209
62433 530209 531185 531881 532229 532057 531128 529348 527003 524617 522557 520892 519653 518951 518762 518803 518825 518932 519390
62416 519390 520233 521230 522179 523035 523708 523950 523575 522670 521502 520345 519516 519412 520211 521506 522564 523158 523921
62399 523921 525652 528359 531320 534035 536772 540055 543936 548029 552039 555961 559830 563578 567150 570540
62385 570540 573645 576347 578933 582250 587165 593804 601485 609406 617242 624985 632423 639131 645036 650812
62371 650812 657580 666220 676966 689496 703282 718017 733911 751571 771481 793653 817950 844684
62359 844684 874703 908849 947453 990415 1037572 1088844 1143950 1202039 1261566 1320588 1377155
62348 1377155 1429406 1475458 1513584 1542822 1563205 1575183 1578968 1574739 1563248 1545573 1522232 1493086
62336 1493086 1458360 1419327 1377603 1334172 1289546 1244557 1200307 1157403 1115849 1075905 1038497
62325 1038497 1004355 973061 943489 915150 888652 864639 842672 821594 800848 780906 762316
62314 762316 744898 728317 713046 700006 689253 679685 670307 661307 653541 647393 642595 638853 636039
62301 636039 633829 631686 629387 627285 625885 625317 625361 625855 626928 628771 631228 633814 636361 639471 643890
62286 643890 649372 654726 659280 663709 668878 674340 678749 681603 683667 685646 687282 688054 688079 687841 687563
62271 687563 687331 687510 688572 690753 694257 699532 706985 716640 728475 742948 760770 782403 808203
62258 808203 838910 875349 917526 964498 1015362 1070061 1128859 1191092 1254541 1316039 1372746
62247 1372746 1423028 1466232 1501654 1527884 1543342 1547472 1541266 1526631 1505283 1478100 1445294 1407130
62235 1407130 1364444 1318475 1270338 1220977 1171641 1123822 1078389 1035189 994019 955647 921233
62224 921233 890978 864147 840387 820108 803313 788890 775621 763334 752426 742696 733371 724097
62212 724097 715217 707059 699426 691913 684343 676819 669607 663042 657338 652415 647993 643826 639825 636155
62198 636155 633374 632202 632869 634833 637416 640533 644546 649675 655936 663381 671842 680605 688997 697298
62184 697298 706481 716992 728383 740153 752156 763836 773862 781188 786066 789527 792255 794575 797128
62171 797128 800814 806134 813300 823035 836667 855255 879041 907838 941446 979424 1020822 1064309
62159 1064309 1108317 1150983 1190428 1225432 1255541 1280195 1298120 1308098 1310212 1305825 1296208 1281584
62147 1281584 1261633 1236527 1207107 1174270 1138689 1101225 1063297 1026572 992358 961451 934393
62136 934393 911547 892890 878058 866880 859732 857088 858818 864221 872818 884807 900587 920123
62124 920123 943118 969644 1000110 1034450 1071685 1110558 1150358 1190763 1231022 1269738 1305565
62113 1305565 1337643 1365165 1386962 1402057 1410528 1413325 1411233 1404510 1393745 1380608 1367301 1355342
62101 1355342 1345150 1336714 1330333 1326614 1326060 1328880 1335161 1345086 1358878 1376504 1397439 1420765 1445557
62088 1445557 1471158 1497043 1522519 1546684 1568852 1589069 1608155 1627142 1646661 1666911 1688157
62077 1688157 1710994 1736035 1763547 1793526 1825865 1860111 1895216 1929880 1963117 1994259 2022612
62066 2022612 2047612 2069322 2088285 2104829 2119059 2131686 2144301 2158383 2174305 2191563 2209605
62055 2209605 2228108 2246835 2265758 2285127 2304980 2324669 2343116 2359276 2371965 2379499 2380042 2372302
62043 2372302 2355589 2329409 2293487 2248086 2193803 2131096 2060462 1983078 1900808 1815542 1728856
62032 1728856 1642233 1557116 1474723 1396195 1322851 1255717 1194741 1139040 1088034 1041834 1000423
62021 1000423 963138 929274 898656 871247 846645 824361 804181 785815 768600 752076 736621
62010 736621 723023 711590 702135 694692 689713 687539 688023 690762 695324 701192 707756 714532 721328 728073
61996 728073 734448 739687 742808 743242 741263 737621 732743 726499 718706 709417 698602 686067 672105 657870
61982 657870 644597 632573 621272 610378 600228 591300 583701 577261 571832 567355 563814 561190 559328
61969 559328 557882 556532 555234 554106 553095 551913 550304 548291 546259 544847 544560 545325 546605 548138 550311
61954 550311 553502 557369 561256 565210 570101 576619 584588 593431 603098 614280 627835 644054 662461
61941 662461 682356 703606 726723 752036 779015 806757 834892 863538 892463 920839 947909
61930 947909 973399 997141 1018737 1037839 1054266 1067570 1076919 1081898 1083125 1081658 1077975 1071950 1063643
61917 1063643 1053591 1042390 1030632 1019393 1010317 1004820 1003404 1005931 1012331 1022786 1037422 1056025
61905 1056025 1077898 1101662 1125340 1147112 1166139 1182369 1195455 1204197 1207226 1204021 1194991 1180859
61893 1180859 1162314 1140115 1115071 1087831 1058977 1029402 1000271 972456 946118 920923 896498
61882 896498 872692 849657 827741 807136 787683 769311 752539 738002 725405 713614 702184
61871 702184 692192 685002 680630 678020 676625 676892 679200 683173 688255 694313 701414 709575 719187 731239
61857 731239 746574 765109 786191 809670 836272 866897 901693 939837 980122 1021855 1065288
61846 1065288 1111033 1158906 1207478 1254830 1299578 1340913 1377848 1408867 1432516 1448238 1456566
61835 1456566 1458652 1455768 1449231 1440556 1431413 1423306 1417441 1414982 1417221 1425155 1438871 1457486 1479715
61822 1479715 1504214 1529424 1553477 1574601 1591508 1603174 1608416 1605959 1594914 1575048 1546678 1510605
61810 1510605 1468188 1421150 1371056 1319000 1265922 1213108 1162117 1114221 1070056 1029894 993951
61799 993951 962173 933905 908232 884733 863536 844480 826648 809153 792161 776633 763110
61788 763110 751208 740311 730212 720854 711939 703265 695179 688179 682068 675930 669129 662092 655925
61775 655925 651313 647910 644763 641229 637394 633665 630082 626265 622038 617919 614746 612889 611985 611418 610893
61760 610893 610535 610647 611492 613174 615519 618102 620552 622851 625287 628125 631499 635549 640379 645711 650865
61745 650865 655400 659723 664751 670994 678269 686310 695259 705360 716527 728504 741156 754222 766924
61732 766924 778331 788175 796995 805343 813213 820449 827456 835075 843605 852228 859661 865416 870189 874874
61718 874874 879413 882941 884954 885873 886312 886196 884909 882016 877506 871592 864663 857270 849771 842083 834118
61703 834118 826301 819211 812838 806735 800944 796194 792978 790917 789302 787853 786710 786025 785949 786700 788237
61688 788237 790017 791399 792220 792681 792816 792334 790945 788553 785166 780913 776149 771307 766525 761548 756037
61673 756037 749849 743041 735761 728269 720939 714165 708203 703080 698549 694176 689698 685414 682140 680474
61659 680474 680020 679486 677780 675026 672337 670576 669503 668194 666024 663080 659828 656782 654482 653357 653336
61644 653336 653710 653631 652787 651593 650743 650697 651522 653025 654815 656225 656421 654866 651699 647506 642757 637655
61628 637655 632460 627556 623054 618678 614309 610464 607982 607322 608360 610692 613960 618014 622886 628469
61614 628469 634129 638945 642412 644561 645316 644365 642024 639506 637636 635897 633500 631013 629891 630651 632623
61599 632623 635454 639662 645361 651497 656850 660976 663690 664475 663125 660413 657417 654581 651889 649453
61585 649453 647235 644585 640708 635412 628933 621332 612635 603300 593909 584556 575030 565451 556218 547500
61571 547500 539335 532078 526173 521469 517275 513137 509068 505024 500631 495608 490084 484302 478325 472191
61557 472191 466183 460780 456411 453227 450954 448993 446786 444147 441302 438738 437031 436474 436727 437087 437303
61542 437303 437860 439198 441042 442889 444827 447375 450592 453909 456831 459365 461660 463572 464791 465172 464743
61527 464743 463452 460991 457037 451821 446342 441666 437938 434516 431115 428206 426044 424008 421535 419180
61513 419180 417929 417719 417395 415979 413315 409629 405327 401211 398072 395816 393630 391215 389176 387969 387158
61498 387158 386162 385219 385032 385720 386575 386803 386259 385518 385338 385920 386625 386659 386034 385549 385766 386422 386961 387236 387415
61479 387415 387590 387885 388665 390163 392001 393472 394353 395090 396099 397135 397587 397338 397080 397653 399210 401192
61463 401192 403027 404523 405587 406029 405925 405867 406452 407683 409167 410717 412362 413957 415256 416349 417583
61448 417583 419128 420936 423033 425348 427362 428527 429125 430208 432492 435773 439529 443604 448073 452895
61434 452895 457987 463306 468577 473259 477003 479844 481783 482621 482468 482063 482182 482953 484059 485344 486855
61419 486855 488465 489973 491574 493900 497373 501594 505479 508078 509271 509592 509328 508046 505227 501113 496504
61404 496504 491808 486792 481256 475427 469563 463663 457784 452201 447058 442275 437996 434641 432242 430201
61390 430201 428045 425977 424270 422578 420427 418063 416192 415024 414183 413495 413306 413891 414941 415778 415877 415153
61374 415153 414005 413126 413020 413593 414311 414789 415123 415777 417229 419659 422761 425928 428745 431279 433826 436492
61358 436492 439143 441634 444000 446571 449958 454712 460813 467709 475006 482900 491765 501624 512327 523975
61344 523975 536800 550747 565557 581167 597623 614553 631003 645849 658242 667746 674380 678509
61332 678509 680427 680006 677009 671802 665505 659278 653520 647793 641467 634429 627285 620864 615452 610556
61318 610556 605477 600096 594960 590675 587336 584574 582074 579976 578776 578763 579601 580546 581142 581623 582713 585166
61302 585166 589379 595175 601901 609029 616728 625523 635267 644804 652868 659035 663537 666487 667706 667117
61288 667117 664820 660774 654798 647008 638107 629226 621529 615744 611774 608826 606189 603942 602813 603462
61274 603462 606001 609963 614437 618426 621526 624287 627585 631639 635932 640101 644533 649943 656601 664160
61260 664160 672090 680156 688599 698008 708933 721566 735762 751322 768143 786097 804808 823500
61248 823500 840945 855642 866311 872370 873911 871265 864694 854522 841451 826582 811037 795488
61236 795488 780097 765051 751102 739284 729932 722173 714696 707068 700162 695329 693235 693418 694851
61223 694851 696936 700020 704863 711600 719402 727265 734942 742810 750983 758936 766026 772031 777041 781171
61209 781171 784629 787853 791163 794321 796848 798979 801970 807080 814410 823187 833091 844763 858883 875411
61195 875411 894211 915901 941332 970453 1002381 1036548 1073044 1111813 1152190 1193510 1235507
61184 1235507 1277796 1319475 1359583 1397469 1432416 1463501 1490378 1513738 1534382 1552103 1566046
61173 1566046 1575858 1581788 1583756 1581051 1573096 1560007 1542255 1520073 1493426 1462384 1427465 1389661
61161 1389661 1350020 1309087 1266976 1224150 1181737 1140740 1101275 1063130 1026807 993330 963097
61150 963097 935658 910781 889054 871066 856507 844554 834828 827494 822593 819819 819046 820692 825123
61137 825123 831735 838832 844677 848765 852038 855946 861406 868617 877593 888601 902127 918593 938230
61124 938230 961249 988162 1019759 1056545 1098265 1144220 1194038 1247784 1305287 1365812 1428566
61113 1428566 1493180 1559360 1626362 1693095 1758589 1822138 1883204 1941402 1996353 2047217 2092559
61102 2092559 2130972 2161808 2185231 2201754 2211817 2215490 2212357 2201897 2184100 2159408 2127946 2089344
61090 2089344 2043640 1991915 1935592 1875500 1812120 1746393 1679770 1613630 1549098 1487075 1427944
61079 1427944 1371461 1317523 1266889 1220598 1178777 1140625 1105553 1073845 1046118 1022496 1002408
61068 1002408 984955 969549 956343 945874 938081 932057 927060 923386 921721 921913 922980 924263 926183
61055 926183 929935 936690 946822 959568 973740 989054 1006396 1026556 1049366 1074557 1102659 1134209
61043 1134209 1168696 1205230 1243802 1284899 1328285 1373238 1419647 1467711 1516730 1565435 1613525
61032 1613525 1661757 1710431 1758836 1806350 1853011 1898814 1943351 1986420 2028175 2068464 2106742
61021 2106742 2142761 2176807 2209500 2242124 2276828 2315448 2358472 2406295 2461047 2525743 2602044
61010 2602044 2690796 2794839 2919618 3071263 3256202 3482755 3760783 4099692 4509870 5007340
61000 5007340 5615233 6361464 7279217 8408148 9783048 11408804 13244125 15210709 17210017
60991 17210017 19120765 20790721 22067811 22876701 23276369 23431673 23516017 23632084 23805032
60982 23805032 24013227 24194134 24226083 23943983 23213800 22010884 20430068 18624424 16735822
60973 16735822 14868141 13095011 11467970 10014803 8741140 7640210 6700610 5906761
60965 5906761 5238946 4677581 4206650 3812286 3480584 3198766 2957191 2748754 2567391
60956 2567391 2408316 2268555 2145898 2037880 1942539 1859210 1787420 1725489 1670991 1621995
60946 1621995 1577059 1534600 1493209 1452320 1411949 1372089 1332936 1295171 1259307 1225017 1191777
60935 1191777 1159860 1129998 1102259 1075947 1050610 1026529 1004126 983357 963843 945328 927824
60924 927824 911403 895972 881247 866999 853181 839729 826380 813018 800082 788254 777788
60913 777788 768533 760570 754291 749745 746452 743988 742235 740811 738813 735552 731190 726317 721247 716068
60899 716068 711054 706555 702546 698556 693965 688269 681359 673716 666089 658738 651228 643114 634586 626227
60885 626227 618414 611192 604493 598164 591932 585600 579265 573273 568081 564131 561526 559714 557828 555506
60871 555506 553161 551325 550115 549504 549663 550707 552428 554666 557717 561981 567346 573283 579488 586116 593350
60856 593350 600905 607995 613770 617960 621132 624096 627043 629532 631364 632937 634470 635345 634746 632697 629973
60841 629973 627062 623717 619538 614519 608846 602467 595160 586998 578580 570720 563832 557588 551328 544804
60827 544804 538412 532703 527968 524407 522296 521574 521501 521214 520617 520362 520919 522030 523167 524113 524931 525694 526640
60810 526640 528382 531506 535873 540659 545238 549824 555083 561307 568136 574863 580759 585330 588692 591641
60796 591641 594874 598125 600542 602013 603453 605492 607516 608552 608605 608427 608294 607797 606656 604897 602247
60781 602247 598116 592411 585685 578360 570501 562536 555360 549267 543495 537417 531601 527001 523532 520317
60767 520317 517083 514436 512673 511108 508908 506075 503240 500819 498816 497263 496444 496527 497191 497829 498099 498141
60751 498141 498254 498629 499553 501655 505517 510913 516758 521996 526387 530365 534311 538088 541163 543106 544120
60736 544120 545131 547150 550454 554517 558710 562759 566543 569955 573277 577298 582549 588546 594099 598392
60722 598392 601423 603477 604576 604637 603913 603034 602575 602654 602896 602692 601526 599206 596019 592627 589589 586833
60706 586833 583727 579797 575202 570300 565053 559215 553004 547079 541818 537003 532301 527723 523468 519637
60692 519637 516228 513115 509941 506386 502744 499926 498658 498872 500052 501877 504288 507147 510175 513183
60678 513183 516215 519482 523256 527704 532760 538166 543647 548923 553711 557935 561838 565649 569294 572725
60664 572725 576260 580033 583307 585047 585264 585060 585176 585219 584585 583432 582256 581098 579670 577872 575800 573692
60648 573692 572168 571974 573054 574477 575668 577020 578708 579754 579247 577885 577151 577251 577051 575982 574836
60633 574836 574504 575013 576171 578213 581141 584072 585940 586704 587496 589681 593869 599490 605200 609925 613617
60618 613617 616866 619940 622651 625066 627657 630617 633580 636300 639093 642318 645823 649226 652351 655049
60604 655049 656973 658003 658664 659690 661262 663021 664760 666756 669390 672689 676313 679819 682869 685311
60590 685311 687195 688770 690376 692205 694080 695563 696361 696530 696224 695375 693784 691405 688398 685131 682265
60575 682265 680489 679816 679424 678671 678069 678682 680729 683484 686561 690523 695947 702611 710041 718224 727197
60560 727197 736323 744714 752245 759578 767115 774363 780468 785085 788571 791567 794609 798162 802770 808875
60546 808875 816387 824663 833186 842111 851839 862256 872894 883747 895328 907737 920306 932521
60534 932521 944815 957987 972222 987097 1002251 1017656 1033515 1050353 1068901 1089338 1110889
60523 1110889 1132708 1154966 1178496 1203467 1229117 1254730 1280134 1305105 1329085 1351897 1374077
60512 1374077 1395921 1416561 1434527 1448962 1459864 1467416 1471608 1472433 1469921 1464006 1454789 1442949 1429502
60499 1429502 1415045 1399576 1383114 1366182 1349550 1333788 1319157 1305604 1292632 1279478 1265630
60488 1265630 1250962 1235184 1217439 1196744 1172673 1145402 1115405 1083531 1051130 1019487 989014
60477 989014 959327 930118 901528 873739 846839 821393 798577 779231 762938 748426 734744
60466 734744 721721 709522 698238 687922 678609 670175 662369 654979 647752 640251 632194 623989 616530
60453 616530 610270 604816 599662 594950 591116 587966 584655 580657 576367 572499 569149 565737 561686 556860
60439 556860 551436 545744 540333 535856 532595 530224 528219 526375 524740 523181 521322 518843 515662 511952
60425 511952 508230 505282 503533 502492 501241 499608 498396 498349 499344 500840 502613 504628 506561 508026 509084
60410 509084 510009 510661 510615 509914 509195 508951 509048 509135 509220 509591 510316 511030 511227 510728 509934 509582 510164 511632 513672
60391 513672 516047 518541 520880 523102 525809 529510 533700 537022 538508 538321 537222 535738 534114 532656
60377 532656 531612 530809 529786 528413 527146 526538 526612 526821 526633 526029 525375 524900 524474 523939 523426 523233 523480 524015
60359 524015 524508 524518 523699 522256 521070 521006 522059 523463 524661 525846 527418 529223 530664 531488 532262 533975
60343 533975 537234 541885 547354 553108 558711 563717 568032 572386 577928 585066 593095 601177 609200 617232
60329 617232 624672 630702 635357 639308 642551 644006 642627 638378 631967 624233 616036 608187 601073 594639
60315 594639 588988 584755 582605 582567 583951 585745 587165 588322 590469 595085 602549 612115 623333 636747
60301 636747 652812 670697 688714 705425 719709 730210 735593 735382 730015 720250 707077 692100
60289 692100 677213 663592 651383 640494 631235 624023 618801 615006 611914 608943 605876 602893 600210
60276 600210 597648 594742 591259 587318 583093 578780 574879 572015 570263 569049 567999 567500 568057 569449 571040
60261 571040 572763 575231 578826 583157 587629 592190 597327 603492 610654 618155 624821 629477 631646 631663 630036
60246 630036 626974 622715 617852 612813 607312 600969 594383 588812 584651 580969 576910 572867 569814 568119
60232 568119 567626 568419 570655 573936 577694 582053 587526 593856 600033 605566 610975 616746 622528 627694 632104
60217 632104 635928 639271 642377 645723 649489 653353 657172 661431 666579 672393 678487 684994 692169 699656
60203 699656 706841 713714 720693 727685 733928 738814 742350 744810 746461 747743 749247 751263 753558 755630
60189 755630 756939 756979 755509 752861 749767 746799 744079 741454 738722 735811 732969 730600 728650 726378 723277
60174 723277 719982 717651 716450 715415 714043 713336 714761 718610 723855 729354 734631 739628 744251 748380
60160 748380 752044 755369 758348 760767 762371 763184 763617 764169 764984 765788 766250 766316 766248 766532 767798 770665 775504
60143 775504 782350 790963 800910 811738 823327 836033 850226 865671 881565 897148 911967 925527
60131 925527 937060 945831 951447 953715 952512 948037 941031 932531 923516 914908 907603 902143 898355 895519
60117 895519 892922 890223 887480 885062 883504 883247 884448 886962 890350 893828 896479 897845 898274 898504 898890
60102 898890 899070 898242 895722 891445 886136 880853 876141 871836 867846 864853 863721 864366 865794 867396 869714
60087 869714 873683 879535 886768 894856 903548 912631 921806 930901 939867 948430 955769 960603 961699 958592
60073 958592 951986 943275 933463 922603 910374 896837 882336 867046 851269 836048 822715 811556
60061 811556 801513 791517 781671 772734 764940 757952 751632 746082 740955 735566 729985 725378 722812 722053
60047 722053 721999 722088 722715 724391 727042 730368 734477 739734 746107 753061 760108 767117 773905 779844 784323
60032 784323 787516 790277 793080 795282 795618 793230 788067 780581 771343 760847 749331 736748 723096
60019 723096 708724 694111 679484 664954 651031 638619 628343 620066 613114 606823 600873 595405
60007 595405 590954 588040 586681 586377 586658 587475 589062 591601 595127 599522 604451 609512 614635 620188 626456
59992 626456 633048 639135 644327 649148 654407 660113 665266 668922 671281 673338 675514 677100 677251 676014
59978 676014 673988 671436 668269 664550 660323 655154 648702 641724 635710 631300 627769 624296 621004 618367
59964 618367 616275 614262 612155 609991 607688 605288 603190 601703 600695 600151 600552 602088 603830 604452 603670
59949 603670 602370 601385 600800 600462 600543 601330 602770 604347 605230 604659 602504 599389 596024 592515 588620 584427
59933 584427 580324 576442 572584 568679 564923 561565 558926 557428 557066 556984 556157 554592 553368 553472 555058
59918 555058 557766 561051 564095 566157 567409 569003 571893 575878 580024 583704 587018 590522 594839 600273
59904 600273 606497 612746 618391 623174 626997 629897 632324 634958 638049 641304 644536 647964 651697 655497
59890 655497 659423 664212 670497 678000 685958 693994 702088 709973 717246 724017 730902 738349 746408 755095
59876 755095 764350 773539 781515 787424 791117 792561 791346 787172 780488 772142 762489 751367 738962 726192
59862 726192 714016 702719 692189 682543 674081 666821 660580 655429 651617 649081 647673 647954 651008 657047
59848 657047 664870 673274 682462 693349 705904 719043 731832 743727 753719 760489 763890 765426 766755
59835 766755 768388 770307 773061 777428 783334 789781 795634 800009 802231 802105 800127 796933 792563 786555
59821 786555 778560 768496 756342 742339 727316 712391 698359 685628 674520 665148 657107 649785
59809 649785 643043 637273 632886 630020 628572 628102 627858 627409 627154 627735 628986 629965 629938 628810 626647 623478
59793 623478 619644 615720 611858 607716 603246 598981 595375 592388 590032 588690 588491 588912 589483 590416 591990
59778 591990 593753 595010 595783 596549 597223 597208 596541 596242 597209 599200 601223 602621 603531 604494 605812 607272 608455
59761 608455 609399 610826 613436 617066 620840 624126 626944 629470 631635 633419 635124 637065 639221 641389
59747 641389 643482 645482 647348 649133 651015 653013 654922 656640 658241 659523 659850 658836 656987 655263
59733 655263 654180 653679 653660 654187 655134 656031 656407 656197 655843 656110 657502 659599 661267 661935 662366 663616 665544
59716 665544 667129 668127 669449 671691 674254 676392 678328 680618 683030 684884 686139 687312 688454 689008 688702
59701 688702 687908 687000 685910 684532 683027 681573 680187 679014 678344 678088 677601 676367 674684 673355 672883 673206
59685 673206 674115 675549 677483 679756 682090 684234 686028 687399 688289 688556 688022 686671 684699 682264 679246
59670 679246 675471 671198 667180 664058 661810 660057 658861 658897 660631 663589 666735 669396 671456 672823 673257
59655 673257 672872 672334 672297 672949 674348 676751 680226 684184 687834 690937 693700 695981 697148 696840 695446 693599
59639 693599 691474 688901 686085 683840 682911 683123 683487 683372 683391 684758 687829 691753 695632 699414 703365 707331
59623 707331 711164 715339 720226 724916 727705 727845 726079 723308 719593 714862 709866 705804 703317 702391 702957
59608 702957 705069 708643 713461 719365 726080 732911 738970 743788 747509 750504 752912 754480 754638 752827
59594 752827 748990 743710 737759 731569 725299 719225 713726 708839 704113 698982 693147 686595 679546 672564
59580 672564 666448 661696 658104 655134 652651 651005 650264 649761 648755 647397 646589 646868 647802 648667 649408 650601
59564 650601 652692 655590 658999 662801 666919 670953 674208 676298 677726 679584 682442 685735 688601 691171
59550 691171 694428 698779 703420 707423 710853 714370 718273 722575 727709 734517 743637 755384 769991 787422
59536 787422 807036 827925 849334 870180 888497 902350 911541 917877 923669 930570 939759 952203
59524 952203 968125 986689 1006726 1027403 1047919 1066995 1083222 1095747 1104284 1108621 1108375 1103130
59512 1103130 1092696 1077449 1058573 1037670 1015895 993618 971040 948831 927959 909102 892503
59501 892503 878262 866538 857371 850418 845029 840833 838289 838288 840879 844669 848017 850675 853773 858355
59487 858355 864551 872170 881403 892661 906173 921971 939919 959718 981311 1005306 1032481 1062804
59475 1062804 1095353 1129006 1162360 1192997 1217972 1235690 1246698 1252261 1252966 1249393 1243474 1238183
59463 1238183 1236042 1238414 1245923 1258901 1277620 1302690 1335136 1375574 1423434 1477554 1537562 1604323
59451 1604323 1678987 1761867 1852143 1948130 2047282 2145473 2236070 2310174 2358785 2375646 2358597
59440 2358597 2309136 2231858 2134343 2026030 1915547 1808513 1707674 1614378 1529350 1452593
59430 1452593 1383513 1321484 1266236 1217935 1177177 1144695 1120855 1105466 1098069 1098097 1104776 1117381
59418 1117381 1135627 1159346 1187737 1219512 1253639 1289100 1323942 1355675 1382746 1404213 1417574
59407 1417574 1418694 1405321 1379740 1346818 1310463 1273216 1237954 1207612 1183302 1164306 1149757
59396 1149757 1138534 1127560 1112367 1090398 1062670 1031749 999417 966976 936315 909119 885479
59385 885479 864332 845061 827903 813031 800022 788373 778070 769464 762767 757720 753789 750702
59373 750702 748571 747309 746176 744413 742209 740555 740169 740961 742517 744580 747084 750258 754794 761402 770131
59358 770131 780549 792552 806514 822662 841015 862078 886931 916269 949712 986227 1024883
59347 1024883 1065170 1107083 1151003 1196979 1243911 1289871 1333323 1373503 1409497 1439569 1461762
59336 1461762 1474736 1477853 1471000 1454796 1430561 1399704 1363271 1322154 1277307 1229558 1179724 1129284
59324 1129284 1080447 1035053 993544 955394 920331 888781 861296 837902 818012 800728 785308
59313 785308 771546 759739 750253 743147 738158 734878 732975 732377 733213 735350 738173 741236 745148 751366
59299 751366 760924 773603 788393 804330 820604 836168 849598 859355 864189 863559 857950 848816 838037
59286 838037 827251 817406 808759 801381 795775 792838 793109 796264 801711 809555 820713 836111 855936
59273 855936 879502 905634 933388 962626 993637 1025977 1058047 1088061 1115009 1138212 1156487
59262 1156487 1168568 1174094 1173433 1166724 1153890 1135616 1113532 1089264 1063849 1038057 1012684 988376
59250 988376 965675 945253 927584 912511 899788 889983 884168 882680 884900 890274 898756 910148 923851
59237 923851 939569 957521 977535 998545 1019364 1039398 1058205 1074707 1087261 1094428 1095637 1091443
59225 1091443 1083054 1071161 1055262 1034597 1009603 981891 952973 923818 895484 869127 845181
59214 845181 823363 803666 786411 771189 756822 742843 730069 719258 710132 702223 695670 690423
59202 690423 685565 680384 675491 671936 669630 667493 664873 662025 659395 657140 655378 654363 654394 655672 658013
59187 658013 660570 662348 663337 664680 667376 671280 675754 680730 686538 693123 700111 707523 715977 726239
59173 726239 738788 753556 769983 787674 807101 829173 853968 880445 907585 935122 962857
59162 962857 989920 1015122 1037432 1055800 1069265 1077671 1081569 1081058 1075555 1065140 1051124 1034617
59150 1034617 1015534 993889 971034 948481 926235 903532 880619 858539 837610 817441 798240
59139 798240 780763 764992 750078 735719 722542 710974 700732 691662 684136 678310 673768 670243
59127 670243 668048 667513 668514 670780 674161 678432 683321 688881 695423 703023 711512 720948 731579 743277
59113 743277 755473 767683 779689 791285 802402 813520 825332 837921 850787 863675 876718
59102 876718 889633 901535 911863 920859 928668 934553 937702 938546 938584 938842 939040 938486 937326 936441 936261
59087 936261 936221 935508 933864 931298 927452 921841 914547 905934 895789 883494 869192 854006 838805 823565
59073 823565 808315 793916 781169 769761 758848 748319 738796 730682 723864 718085 713061 708439 704177
59060 704177 700686 698118 695872 693356 690870 689048 687737 686114 683708 680606 676865 672458 667774 663461
59046 663461 659716 656210 652684 649164 645816 643014 641311 640773 640597 640060 639606 640260 642122 644273 646124
59031 646124 648031 650503 653628 657549 662892 670377 680377 692966 707918 724563 742041 759855 777852
59018 777852 795621 812293 827054 839551 849787 857851 863812 867713 869777 870710 871475 872521 873628
59005 873628 874907 877543 882983 891710 903259 917065 932624 949208 966261 983991 1002868 1022626
58993 1022626 1042457 1062068 1081716 1101096 1118871 1133492 1144011 1150073 1151649 1148892 1141936 1130901
58981 1130901 1116457 1100130 1083495 1067267 1051676 1037388 1025200 1015034 1006161 998553 993230 991101
58969 991101 992198 996229 1003198 1013056 1025242 1038948 1053666 1069264 1085685 1102519 1118752 1133132
58957 1133132 1144968 1154231 1160526 1162453 1158636 1149091 1134972 1117270 1096503 1073454 1049392 1025565
58945 1025565 1003021 982728 965263 950661 939208 931905 929202 929555 930358 930184 929011 926401 920924
58932 920924 911812 899989 886856 872922 858180 843053 828210 813882 799987 786729 774772 764904
58920 764904 757563 752372 748258 744438 741242 739591 739902 742019 745856 751266 757533 763983 771090 780029
58906 780029 791147 803811 817815 833843 852260 872443 893732 916170 939861 964393 989310
58895 989310 1014481 1039610 1064205 1088629 1114662 1144489 1179453 1220008 1266266 1318022 1374413
58884 1374413 1433706 1493295 1550109 1601687 1646920 1685295 1715616 1736168 1745948 1744745 1732024 1706950
58872 1706950 1669976 1623470 1570344 1512743 1452528 1392125 1334146 1280414 1231662 1187811 1148331
58861 1148331 1112784 1081166 1053355 1028368 1004933 982718 962175 943172 924793 906715 889808
58850 889808 874969 862207 851154 841633 833296 825526 818154 811627 806093 800993 795759 790136 783631
58837 783631 775589 766184 756450 746970 737441 727943 719553 713045 707803 702681 697344 692252 688034 685346
58823 685346 684674 685775 687934 691012 695475 701115 706804 712016 717615 724457 732101 739463 745876 750841
58809 750841 753680 754242 753264 751368 748440 744570 740690 737544 734885 732419 730614 729711 728849 727190 725171
58794 725171 723633 722482 721265 720322 720234 720675 721078 722054 724964 730269 737279 745268 753867 762593 771030 779476
58778 779476 788482 797787 806377 813558 819367 824043 827739 830627 832777 834064 834628 835098 835884 836600 836726
58763 836726 836407 835980 835180 833556 831419 829703 829105 829924 832431 836716 842322 848619 855346 862387 869363
58748 869363 875926 882160 888242 894170 900239 907215 915401 924048 932346 940442 948650 956257 962150 966424
58734 966424 970352 974842 979874 985527 992711 1002407 1014593 1028181 1041851 1054901 1067413 1079598 1091089
58721 1091089 1101195 1109858 1117875 1126069 1134723 1143916 1153711 1163838 1173914 1184246 1195625 1207904
58709 1207904 1219573 1229150 1236215 1240634 1241752 1239114 1233079 1223832 1210465 1191999 1168868 1142629 1114685
58696 1114685 1086009 1057566 1030093 1003820 979008 956357 936284 918361 902095 887675 875194
58685 875194 863700 851794 838784 824655 809575 794157 779582 766641 755106 744705 736061 729930
58673 729930 726185 724388 724661 727105 731121 736397 743995 755355 770578 788646 808820 830726 853401
58660 853401 875262 894916 911284 923432 931118 935151 936398 934890 930629 924574 917844 910491 902077
58647 902077 892926 883748 874562 865164 856340 849487 845215 843233 843229 844989 848095 852419 858515 866558 875425
58632 875425 883753 891334 898397 904163 907451 908326 907897 906807 905098 903212 901907 901458 902131 905164 912133
58617 912133 923497 938828 958193 982130 1010461 1042141 1075957 1110314 1142688 1170510 1192535
58606 1192535 1208560 1218386 1222237 1221658 1218621 1213906 1207385 1199371 1190454 1180559 1169586 1158515 1148464
58593 1148464 1139126 1129731 1121099 1114987 1111687 1110084 1110028 1112783 1119057 1128387 1140709 1156713 1176086 1196925
58579 1196925 1217459 1237070 1255230 1270868 1283431 1293475 1301583 1307625 1311508 1313839 1315524 1317494
58567 1317494 1321020 1327405 1337116 1349760 1364838 1381913 1400388 1420013 1441216 1463855 1486016 1505210
58555 1505210 1520388 1531532 1537811 1537896 1532020 1522110 1509726 1495298 1479418 1463284 1447550 1432035
58543 1432035 1416747 1401944 1387042 1370762 1352610 1333053 1312299 1290222 1267525 1245577 1224959
58532 1224959 1205509 1187903 1173709 1163560 1156644 1152256 1150689 1152361 1157187 1165019 1175610 1188091
58520 1188091 1201498 1215686 1230579 1244922 1257197 1267501 1276893 1285144 1290913 1294067 1295948 1297250
58508 1297250 1297527 1297020 1297118 1298611 1301168 1304910 1310798 1319090 1329036 1340386 1353578 1368179 1382836 1397031
58494 1397031 1411062 1424027 1433774 1439350 1441591 1440851 1436167 1427369 1416006 1403296 1389030 1373551 1359075
58481 1359075 1347894 1340541 1336585 1335768 1337526 1340780 1345086 1350744 1357028 1361649 1362684 1359785 1353030 1342120
58467 1342120 1327416 1310296 1291671 1271470 1250232 1229702 1211103 1194144 1178449 1164630 1153324
58456 1153324 1144522 1138483 1135965 1136932 1140284 1145225 1151433 1157594 1161554 1162496 1161342 1158558 1153394 1145876
58442 1145876 1137571 1129500 1121114 1112240 1104262 1098407 1094497 1092318 1092559 1095380 1099585 1104207 1109552 1115960
58428 1115960 1123145 1131571 1142825 1157683 1175208 1194399 1215109 1236634 1257201 1275699 1292285 1306594
58416 1306594 1317241 1323981 1328457 1331790 1333147 1331599 1327610 1321722 1313476 1302695 1290279 1276924 1262659
58403 1262659 1248247 1235236 1224024 1213873 1205357 1200511 1199743 1200966 1202673 1205520 1209869 1214278 1217644
58390 1217644 1220367 1222084 1220653 1214913 1206261 1196202 1184665 1172049 1160421 1151054 1143036 1135769 1130410
58377 1130410 1127331 1124744 1121617 1119473 1119465 1120150 1120072 1120126 1121314 1122611 1123246 1124793 1128787 1134408 1140720 1149021
58361 1149021 1160643 1174468 1188840 1203982 1220297 1236214 1249871 1261125 1269972 1275142 1276295 1275445
58349 1275445 1274088 1271084 1265532 1259372 1254866 1251726 1249154 1248463 1251162 1256506 1263403 1272699 1285222 1299702
58335 1299702 1315008 1332222 1352129 1372888 1392631 1411979 1431480 1449021 1462476 1472609 1480707
58324 1480707 1485823 1487165 1486792 1487113 1488130 1489905 1494951 1504899 1517256 1528761 1539634 1551444 1563432
58311 1563432 1574410 1585863 1599614 1614643 1629592 1645987 1665443 1686058 1705206 1723530 1742565
58300 1742565 1760895 1776608 1791255 1807469 1824788 1841563 1858709 1877741 1897403 1916119 1935472
58289 1935472 1957360 1980085 2001156 2021555 2043299 2065364 2086106 2107033 2130012 2153528 2175948
58278 2175948 2199526 2226694 2255416 2283022 2311539 2344256 2380028 2416155 2453849 2495433 2539166
58267 2539166 2582442 2627218 2676589 2728954 2781411 2835875 2895716 2959312 3023129 3088125 3156652
58256 3156652 3226097 3292459 3357317 3424467 3492621 3558592 3624657 3695375 3770092 3846215 3926886
58245 3926886 4017403 4116769 4220767 4330506 4449781 4577073 4708790 4847426 4997698 5157698
58235 5157698 5322987 5496107 5682523 5880648 6086110 6302574 6537549 6790728 7057627
58226 7057627 7341622 7650783 7985911 8343716 8728661 9149280 9606237 10097098 10629375
58217 10629375 11215091 11856395 12551426 13310593 14151541 15082485 16107893 17246719 18527225
58208 18527225 19968837 21589888 23429959 25544416 27983025 30799354 34078472 37930812
58200 37930812 42464508 47793804 54072839 61494900 70273303 80672708 93068711 107947343
58192 107947343 125851489 147338657 172878007 202558698 235739833 270977179 306276460
58185 306276460 339308079 367387730 387610421 397565173 396319234 384832551 365423853
58178 365423853 340776576 313202204 284406258 255571602 227543214 200992172 176464692
58171 176464692 154312393 134639261 117368863 102355733 89421306 78338126 68854220
58164 68854220 60746314 53827478 47918453 42849376 38487651 34734953 31497920 28685273
58156 28685273 26229049 24082578 22197118 20520956 19019507 17675099 16466479 15366454
58148 15366454 14358881 13439867 12601366 11829242 11117278 10467427 9875445 9330115 8826623
58139 8826623 8366970 7946865 7555315 7187649 6846493 6529528 6228546 5941367 5673083
58130 5673083 5424484 5190067 4968235 4762758 4573115 4393546 4222765 4064931 3919928
58121 3919928 3781971 3648920 3524099 3407978 3296750 3190000 3091198 2999615 2910152 2822092
58111 2822092 2739886 2664297 2591005 2519071 2452545 2392204 2333514 2274536 2218379 2166094 2114436
58100 2114436 2062566 2014028 1970013 1927178 1884109 1843676 1807119 1771829 1736852 1704700 1675914
58089 1675914 1647503 1618593 1592099 1569035 1546458 1522771 1499868 1478449 1456362 1433155 1411175
58078 1411175 1390578 1368260 1343394 1319141 1297309 1276127 1254912 1235952 1219943 1204212 1187455
58067 1187455 1171883 1158848 1146611 1134234 1123449 1114842 1106194 1096482 1087670 1080782 1073835 1065335 1056307
58054 1056307 1047423 1037654 1027170 1018071 1010963 1004153 997225 991750 987492 981727 973525 964951 957018 948332
58040 948332 938755 930222 922573 912852 900390 888484 879242 870806 861604 853253 846923 840562 832304 823368
58026 823368 815201 806915 797903 789993 784570 780233 775471 771074 767890 764808 760992 757590 755280 752584
58012 752584 748502 744375 741304 738188 734148 730461 728205 726294 723655 721065 719090 716497 712501 708386
57998 708386 705230 702177 698585 695599 693956 692579 691080 691291 694405 698716 702107 704779 707726 710475
57984 710475 712240 713542 714910 715617 715163 714352 713553 711768 708709 705769 703578 700755 696531 692378 689365
57969 689365 686122 681304 676084 672264 669732 667642 666359 666309 666515 666145 666116 667480 669538 671031 671819 672042
57953 672042 671173 669185 667100 665137 662073 657554 653134 649724 646137 641558 637291 634362 631622 628115
57939 628115 625204 624178 623769 622364 620992 621678 624233 627011 629667 632940 636720 640359 643964 647509 649683
57924 649683 649428 647582 645377 642488 638243 633484 629337 625305 620486 615495 611205 606761 601006 594968
57910 594968 590726 588415 586425 584004 581745 579915 578176 576701 575894 575209 573611 570896 567339 562581 556207
57895 556207 549012 542466 537335 533769 532000 531820 532044 531677 531061 530969 531365 531972 533093 534795 536246 536929
57879 536929 537517 538449 538836 537982 536785 536223 535585 533694 530853 528011 524919 520690 515407 509694 503468 496577
57863 496577 489945 484717 480905 478015 476136 475180 474144 472548 471525 472086 473400 474394 475864 479154 483732
57848 483732 488074 492185 497256 503351 509337 514720 519772 524277 527862 531171 534966 538395 539831 539127
57834 539127 537444 535173 531770 527479 523506 520326 517214 513507 509204 504441 499569 495503 492842 490812
57820 490812 488132 484609 480940 477560 474886 474008 475636 478734 481592 483793 485757 486828 485505 481357
57806 481357 475211 467578 458461 448721 440085 433385 427810 422172 416121 410069 404612 399974 395595 390627
57792 390627 385173 380308 376409 372570 368376 364889 362716 360576 357406 354636 354387 356273 358061 358871 359804
57777 359804 361807 364885 369104 374419 379702 383715 386918 390671 394928 398511 401306 404200 406963 408314
57763 408314 408240 408229 408835 408852 407353 404856 402020 398766 395228 392131 389697 387468 385605 385063 386006 387279
57747 387279 387850 387679 386909 385391 383314 381213 379086 376571 374080 372564 371984 371253 369815 368051 366031
57732 366031 363398 360728 359476 359987 360857 360877 360425 360375 360734 360970 360784 360000 358611 357338 357210 358121 358648 357767
57714 357767 356004 354570 354151 354769 355968 356781 356340 354927 353767 353569 353924 354244 354497 354870 355480 356480 357786
57697 357786 358723 358753 358378 358403 358439 357279 354683 351637 348837 346162 343761 342344 342070 342346 343074 345017 348619
57680 348619 353563 359848 368267 379513 393846 411936 434936 463334 496868 535904 581648 634248
57668 634248 691517 749855 805267 852849 886628 901485 895541 870639 831190 782680 730253 677646
57656 677646 627285 581063 540329 505171 474666 448038 424957 404869 387117 371870 359905
57645 359905 351202 344630 339163 334459 330133 325672 321390 318350 316886 316169 315550 315225 315127 314338 312349 309973
57629 309973 308270 307217 306042 304318 302191 300107 298626 297944 297399 296126 294325 293006 292282 290937 288103
57614 288103 284462 281315 279270 278284 278109 278159 277671 276563 275574 275232 275263 275248 275140 274904 274433 274055 274372 275321
57596 275321 276177 276647 277081 277406 276842 275025 272476 269654 266541 263485 261401 260638 260512 260383 260272 260071 259188
57579 259188 257558 256003 254986 253868 251995 249735 247850 246581 245865 245725 245923 245887 245366 244561 243422 241725
57563 241725 239994 239293 239768 240447 240760 241157 241809 242006 241423 240804 240770 241098 241768 243377 245744 247434 247666 247536
57545 247536 248246 249241 249325 248682 248514 249361 250967 253118 255439 256884 256676 255489 254712 254790 255127 255241 255181 255031
57527 255031 254695 254057 252958 251357 249778 248992 249002 249070 249064 249787 251449 252943 253351 253236 253578 254375 255152 255982
57509 255982 257001 257710 257794 258033 259381 261702 264250 266754 269162 271006 271955 272422 272742 272405 270933 268884
57493 268884 267076 265496 263852 262492 261762 261130 259936 258394 256979 255528 253868 252499 251585 250176 247699
57478 247699 245357 244644 245145 245288 244678 244077 243585 242576 241291 240767 241092 241132 240218 238881 237786 237088 236975
57461 236975 237727 238989 239965 240552 241481 243280 245761 248466 250872 252351 252805 253116 254053 254994 254706 253236
57445 253236 251966 251894 252917 254727 257246 259997 262034 262793 262349 260921 258840 256916 255975 256023 256592 257655
57429 257655 259371 261177 262181 262344 262331 262290 261803 260944 260300 259976 259600 259299 259659 260670 261820 263195 265371
57412 265371 268063 270053 270691 270469 269907 268991 267986 267652 268154 268690 268712 268728 269444 270810 272331 273650 274477
57395 274477 274598 274345 274476 275293 276358 277281 278224 279448 280959 282704 284579 286110 286786 286831 287039 287836 289102
57378 289102 290868 293325 296055 298130 299224 299922 300706 301392 301789 302178 302838 303769 305107 307178 309844 312394
57362 312394 314295 315575 316401 316913 317540 318762 320416 321885 323066 324433 326081 327542 328648 329685 330532
57347 330532 330615 330072 330052 331373 333607 335902 337939 339685 341031 342252 344141 347034 350165 352507 353819
57332 353819 354506 354949 355386 355985 356571 356754 356684 357222 358950 361424 363854 366106 368592 371486 374495 377288
57316 377288 379839 382435 385460 389005 392654 395885 398640 401230 403824 406473 409458 413088 417168 421210
57302 421210 425101 429006 432823 436440 440352 445152 450428 455146 459212 463613 468762 473773 477860 481525
57288 481525 485742 490628 495559 500067 504097 507812 511529 515414 519030 521804 524158 527380 531920 536569
57274 536569 539986 542478 545544 550040 555444 560763 565570 570142 574921 579997 585126 590302 595980 602372
57260 602372 608821 614506 619527 624591 629821 634836 639891 645773 652365 658523 663799 669192 675595 682490
57246 682490 688952 695130 701877 709538 717845 726552 735487 744372 753138 762085 771313 780445 789264 798116
57232 798116 807275 816575 826095 836553 848410 861158 874055 887077 900646 914991 930374 947384
57220 947384 966335 986790 1008256 1030990 1055555 1082013 1110013 1139154 1168608 1196784 1222136
57209 1222136 1244242 1263799 1281813 1299036 1315758 1331771 1346875 1361567 1376727 1392519 1408445
57198 1408445 1424799 1443146 1464797 1489584 1516644 1545622 1576402 1608506 1641540 1675595 1710491
57187 1710491 1745305 1779375 1812936 1846000 1877510 1906678 1934367 1961866 1988876 2014032 2037049
57176 2037049 2059059 2081068 2103407 2126599 2151411 2177744 2204474 2230712 2256593 2282770 2309834
57165 2309834 2338242 2368018 2398392 2428285 2457200 2485210 2512329 2538542 2564208 2589731 2614992
57154 2614992 2639782 2664536 2689927 2715965 2742261 2768929 2796316 2824015 2851091 2877214 2902729
57143 2902729 2927635 2951394 2973747 2994895 3014847 3033414 3050917 3068151 3085683 3103860 3123357
57132 3123357 3144730 3167445 3190297 3212974 3236404 3261471 3288219 3316351 3345595 3375438 3405435
57121 3405435 3436036 3468449 3503668 3542401 3585846 3635434 3691663 3754162 3823071 3899251 3983076
57110 3983076 4074338 4173863 4284218 4408570 4550214 4713866 4906339 5135444 5409470 5738468
57100 5738468 6134974 6612983 7187616 7876445 8699373 9675893 10823636 12160271 13704285
57091 13704285 15471051 17467735 19690358 22119959 24717492 27426700 30187523 32940175
57083 32940175 35600111 38023821 40016830 41403321 42107328 42174313 41719881 40859982 39677821
57074 39677821 38230343 36562933 34714148 32716688 30602188 28405944 26167018 23926257
57066 23926257 21725094 19603095 17593169 15718260 13992347 12422990 11012053 9755705
57058 9755705 8646234 7674557 6830968 6104497 5483019 4954109 4505294 4123908 3797808
57049 3797808 3516579 3271840 3056594 2864870 2691923 2534273 2389375 2255329 2130677
57040 2130677 2014022 1903800 1798503 1696971 1598295 1501728 1406952 1314279 1224435 1138410
57030 1138410 1057712 984434 920714 868086 827286 798343 780840 774327 778053 789123 800580 802494
57018 802494 786447 749554 694684 627854 555719 484074 416773 355484 300750 252990 212143
57007 212143 176986 145858 118038 93858 73625 57052 43561 32488 23031 14579 7089 792
56994 -4358 -8592 -11936 -14360 -15973 -16579 -15383 -11688 -5619 2296 11892 22988 34671 45672 55249
56980 55249 63032 68247 69986 68143 63383 56274 47213 37104 27299 18679 11294 4883 -775 -5850
56966 -5850 -10077 -12422 -11746 -7704 -571 9571 22678 38092 54921 72920 92069 111243 128199
56953 128199 141020 148888 151537 149040 142398 133518 124153 115322 107717 101887 97804 95028 93538 93835
56939 93835 96117 100117 105974 114550 126613 142270 161341 183427 207315 231013 252678 270967
56927 270967 284268 290469 288146 277615 260535 238970 215084 191066 168669 148825 131733 116977
56915 116977 103646 91027 79340 69342 61151 54097 47813 42659 38845 35915 33471 31667 30593
56902 30593 29821 29100 29025 30466 33630 38049 43150 48598 54433 61196 69667 80385 93649 109848 129097
56887 129097 150479 172319 193345 212945 230141 243172 250609 252384 249400 242695 233327 222508
56875 222508 211371 200874 192060 185928 182874 182797 185871 192656 203387 217977 236974 261695 292913
56862 292913 330009 371773 417258 465215 513039 556740 591805 614324 622293 616467 599582 574564
56850 574564 543919 510643 478374 449924 426398 408197 396160 391152 393344 402685 419640 444986
56838 444986 479428 523786 578728 643655 716285 793569 871960 946099 1008288 1050706 1068367
56827 1068367 1060098 1027957 976861 913826 845823 777827 713069 654327 603819 562175 528739
56816 528739 503147 486009 478080 479529 490240 510404 540482 580497 629148 683497 739601 793121
56804 793121 838867 870447 882256 872800 845446 805436 756920 703033 647172 592639 541593 495395
56792 495395 455430 422632 396740 377029 363395 355951 354257 358008 367956 384935 408207 435666
56780 435666 465093 494058 518929 535541 541150 535172 518330 492251 459831 424721 389834 356569
56768 356569 325282 295845 267943 241597 217470 196230 177887 162204 149265 138983 130567 123263
56756 123263 117090 111977 106799 100406 93247 86847 81923 78032 74731 71884 69105 66097 63364 61488
56742 61488 59996 58155 56489 56009 56176 55350 53333 51713 51403 51536 51379 51662 53112 55071 56552 57574
56726 57574 58500 59038 58937 58856 59530 60635 61436 62031 63051 64468 65633 66363 67208 68609 70243 71333 71455
56709 71455 71047 71111 72183 73642 74423 74290 73954 74016 74422 74958 75511 75816 75673 75608 76499 78299 79888 80569 80983
56690 80983 82149 84189 86425 88180 89102 89200 88910 88734 88541 87773 86497 85607 85675 86218 86493 86407 86211 85928
56672 85928 85618 85719 86580 87949 89306 90398 91181 91600 91759 91941 92199 92307 92317 92727 93756 94938 95719 96067
56654 96067 96254 96454 96856 97741 99083 100459 101602 102681 103815 104758 105324 105722 106158 106563 106955 107663 108859
56637 108859 110219 111320 112064 112568 113008 113747 115075 116521 116965 115881 114168 113321 113922 115176 115775 115071
56621 115071 113562 112346 111954 111858 111312 110413 109866 109956 110425 111156 112219 113241 113563 113189 112873 113136 113846 114799
56603 114799 115966 117048 117625 117926 118646 119821 120759 121324 122303 124096 125941 127022 127572 128332 129532 130938
56587 130938 132268 133148 133234 132827 132790 133506 134515 135429 136461 137716 138885 140071 142039 144998 147989 150121
56571 150121 151643 153125 154411 155288 156468 158915 162533 166398 170016 173691 177862 182598 187532 191942
56557 191942 195286 197892 200592 203446 205562 206498 206972 207677 208315 208416 208199 207835 206800 204865 202899 201658
56541 201658 200545 198675 196498 195138 194615 193942 192707 191406 190421 189709 189325 189267 188971 187928 186579 185690
56525 185690 185036 183736 181718 179846 178576 177520 176389 175439 174760 173999 172937 171727 170431 168988 167685
56510 167685 167042 167047 167061 166572 165638 164602 163827 163612 163882 164033 163525 162501 161436 160446 159453 158676 158328 158121 157751
56491 157751 157596 158183 159215 159960 160472 161490 163127 164495 164862 164498 164210 164599 165865 167782 169725 171167
56475 171167 172245 173488 175037 176577 177936 179199 180213 180535 180014 179095 178482 178666 179594 180564 180707 179916
56459 179916 179020 178717 178730 178475 178123 178366 179444 181044 182875 184708 186142 187019 187893 189376 191191 192557
56443 192557 193346 194189 195493 197005 198348 199404 200161 200668 201135 201692 202165 202398 202545 202703 202675 202547 203008 204441
56425 204441 206124 207057 207234 207383 207748 207983 207989 208066 208292 208449 208448 208250 207615 206552 205718 205692 206135 206410 206685 207564
56405 207564 208910 209887 210067 209691 209011 208211 207862 208574 210169 211846 213075 213774 213897 213546 213219 213221 213119 212559
56387 212559 212190 212847 214119 214795 214599 214492 215365 217306 220037 223078 225601 227084 228101 229629 231681 233453
56371 233453 234633 235577 236385 236841 237256 238255 239675 240624 240725 240453 240244 240155 240388 241230 242438 243486 244374 245389
56353 245389 246272 246520 246377 246525 246997 247397 247941 249167 250787 252029 253025 254632 256841 258646 259589 260278 261239
56336 261239 262407 263871 266002 268666 271287 273805 276484 278876 280161 280544 281083 282035 282697 283008 283964 286061
56320 286061 288524 290448 291662 292233 292237 292311 293371 295482 297841 299922 301680 302814 303050 303067 303837 305145 306173
56303 306173 307402 310215 314549 318741 321978 325121 328651 331677 333695 335666 338431 341454 343970 346119
56289 346119 348163 349789 350952 352312 354224 356283 358321 360705 363351 365760 368334 372261 377683 383508
56275 383508 389380 396117 403664 410444 415625 420358 425862 431876 437924 444463 451679 458692 465032 471495
56261 471495 478529 485301 491538 498724 508104 518915 529985 541834 555741 571849 589671 609575
56249 609575 632336 657929 685906 716181 748555 782372 817610 855299 895848 937913 979847
56238 979847 1021043 1060847 1097404 1128903 1155039 1176078 1191482 1200566 1203518 1200596 1191279 1175326
56226 1175326 1153794 1128027 1098607 1066219 1032340 997956 962755 926732 891461 858538 827847
56215 827847 798544 770650 744471 719647 696164 675210 657652 642575 628550 615340 603281
56204 603281 592168 582041 573819 567684 562016 555441 548839 543839 540416 537568 535229 533787 532652 531112
56190 531112 529879 530038 531087 531589 531245 530870 530930 531408 532509 534182 535583 536222 536959 538748 541222 543621
56174 543621 546132 549124 552108 554693 557544 561073 564289 566272 567701 569620 571870 574140 577262 581904
56160 581904 587161 592066 597418 604495 613118 622524 632978 644840 657147 668827 680274 692247 704345
56147 704345 716064 728063 740903 754057 767852 784708 806528 832352 860548 891707 927288
56136 927288 967104 1010649 1059506 1115934 1180226 1251694 1330830 1417895 1510458 1604712 1698058
56125 1698058 1788292 1871997 1946592 2012732 2072043 2123790 2166387 2200510 2227499 2246035 2253813
56114 2253813 2251515 2241896 2225955 2203434 2176163 2147130 2116355 2080789 2037972 1986948 1926521 1856236
56102 1856236 1779055 1699978 1622019 1546105 1474126 1408804 1350961 1299970 1256427 1221241 1192658
56091 1192658 1167545 1145364 1127766 1114726 1104342 1096034 1090543 1087135 1084205 1082394 1083761 1088187 1093891
56078 1093891 1101028 1111182 1123686 1136107 1148145 1161308 1174978 1186647 1196097 1205609 1216035 1226388
56066 1226388 1237284 1250875 1267116 1283796 1300393 1318323 1337462 1356237 1375127 1396116 1418560
56055 1418560 1439549 1458492 1477432 1496838 1515200 1532827 1551882 1572396 1592383 1611931 1633027
56044 1633027 1655313 1676468 1696860 1719339 1744339 1769798 1795937 1825236 1857509 1890020 1922806
56033 1922806 1958767 1998102 2037852 2077440 2119369 2163842 2208089 2251746 2297504 2345710 2393852
56022 2393852 2442153 2494014 2549937 2606752 2663774 2724029 2788385 2854345 2921651 2993119 3068952
56011 3068952 3146326 3225570 3310398 3401041 3493719 3587985 3687950 3795124 3906958 4023496 4148254
56000 4148254 4281416 4419602 4563443 4717570 4882083 5052300 5228128 5414925 5613868
55991 5613868 5820843 6036528 6267787 6517122 6780886 7060075 7362327 7690797 8042105
55982 8042105 8417989 8827492 9274632 9755976 10273758 10838934 11457909 12129672 12859990
55973 12859990 13664657 14554956 15535225 16619535 17835256 19206029 20749237 22496326
55965 22496326 24498043 26805618 29469665 32566315 36203414 40494761 45554612 51528075
55957 51528075 58602903 66989696 76934795 88778124 102972859 120035311 140488761
55950 140488761 164783069 193062478 224825815 258780112 293029292 325299866 352927728
55943 352927728 372914970 382584713 380667332 367914306 346658155 319765320 289847570
55936 289847570 259029847 228954667 200755918 175069211 152160555 132068800 114669443
55929 114669443 99717491 86924661 76017421 66735307 58823186 52057537 46263999
55922 46263999 41295868 37015888 33310509 30099288 27314136 24883903 22748399 20869079
55914 20869079 19213394 17742532 16423913 15240940 14179974 13220007 12343698 11545803
55906 11545803 10821546 10157666 9542890 8976243 8456953 7976240 7526505 7108763 6723535
55897 6723535 6363576 6022858 5704132 5410700 5138694 4883834 4647847 4431833 4230865
55888 4230865 4041343 3866509 3708835 3563961 3427870 3303045 3191734 3089760 2992720 2901855
55878 2901855 2818031 2736084 2651146 2565097 2481359 2398718 2315628 2235236 2160469 2088851 2017357
55867 2017357 1947902 1883166 1821582 1761257 1704427 1653187 1605097 1557691 1513123 1473731 1437188
55856 1437188 1400825 1366767 1337946 1312547 1287169 1262121 1239049 1216437 1191934 1166405 1141552
55845 1141552 1116297 1089372 1062671 1038305 1015063 991376 968896 949517 931698 913418 896043
55834 896043 881706 869450 857506 846772 838499 831001 822133 812759 804523 796511 787174 777138 767092
55821 767092 755466 741354 727193 715302 704177 691394 677788 665586 654832 644871 637033 632451
55809 632451 629344 625705 622572 621579 621493 620493 619764 621436 624835 628110 631757 637232 643643 648932 652825
55794 652825 655768 656605 654254 649993 645276 639051 630118 620198 611576 603544 594415 585277 578207 572173
55780 572173 564244 553850 542678 531317 519218 507175 496769 487870 479254 471055 464298 458985 454852
55767 454852 452724 452627 451915 447963 441584 435178 428870 421303 413067 406211 401057 396370 392057 389043 387047
55752 387047 385061 383448 383123 383243 382056 379453 376485 373107 368653 363770 359546 355411 350164 344407 339779
55737 339779 336464 333601 331344 330281 329589 327978 325795 324131 322691 320583 318230 316310 313835 309630
55723 309630 304741 300995 298064 294402 290200 286828 284128 280863 277239 274492 272549 270585 269284 270027
55709 270027 272345 274633 276834 279913 283233 285138 285762 286594 287437 286442 283121 278863 274444 269346 263580
55694 263580 257989 252642 246998 241529 237268 233982 230789 228195 227377 227855 228132 228295 229650 232077 234220
55679 234220 236140 239260 243633 247617 250352 252294 253274 252474 250536 249417 249752 250441 250984 252100 253875
55664 253875 255475 256947 259145 261664 262979 262944 263038 263863 264544 264942 266216 268689 271232 273405 276204 280020
55648 280020 283703 286307 288107 289259 289089 287275 284261 280142 274664 268575 263235 258502 252762 245534
55634 245534 238452 233138 229597 227073 224988 222684 219699 216687 214709 213550 212216 211017 211354 213293
55620 213293 215280 216586 218196 220781 223516 225392 226132 225435 222979 219547 216571 214212 211428 208058 205020
55605 205020 202277 198653 194100 190117 187402 185048 182689 181356 181369 181361 180353 179014 177894 176269 173834
55590 173834 171848 171295 171326 170738 169730 169095 168861 168814 169251 170190 170856 170871 170963 171708 172651 173539 175281 178674 183032
55571 183032 187048 190304 193183 195957 198676 201401 204004 206179 207833 208875 208775 207249 205217 203872
55557 203872 202840 200633 196928 192866 189067 185058 180985 178012 176401 174856 172534 170185 168561 167210
55543 167210 165656 164340 163474 162325 160485 158724 157760 157361 157307 157984 159289 160211 160219 159891 159535 158576 157030
55526 157030 156111 156451 157046 156971 156841 157501 158409 158471 157591 156411 155303 154415 153861 153263 151930 150007 148393 147217
55508 147217 145707 144004 143485 144565 145774 145980 145936 146569 147255 147079 146465 146225 146148 145857 145985 147125 148525
55491 148525 149063 148667 147744 146216 144239 142884 142892 143585 144032 144314 144622 144324 143157 142229 142481 143195 143403 143689
55473 143689 144977 146437 146405 144832 143198 142397 142184 142331 142886 143482 143674 143841 144666 145991 147136 147985 148794
55456 148794 149415 149685 150071 150851 151169 150020 147719 145303 143027 140644 138664 137924 138115 138110 137671 137679 138657 140098
55438 140098 141360 142342 143158 143864 144511 144986 144969 144547 144489 145348 146672 147690 148258 148504 148174 147149 146096 145782
55420 145782 146221 147185 148926 151476 153863 155072 155377 155745 156338 156637 156605 156659 156735 156387 155636 154875 154126 153221
55402 153221 152442 152152 151998 151235 149670 147641 145434 143387 142177 142177 142851 143437 143774 143872 143322 142092 141277 141938
55384 141938 143524 144498 144247 143458 142894 142779 143167 143984 144782 145160 145243 145206 144746 143743 142858 142675 142796 142698 142828
55365 142828 143761 144820 144794 143693 142572 141909 141341 140798 140566 140280 139085 136979 135026 134110 134341 135559 137404
55348 137404 138894 139022 137989 137051 137046 137821 139029 140549 141976 142629 142379 141850 141599 141634 141731 141691 141338 140812 140758
55329 140758 141654 143079 144178 144699 145003 145291 145504 145695 145803 145247 143536 141177 139262 138263 137843 137594 137321
55312 137321 136833 136238 136243 137400 139208 140631 141288 141478 141369 140955 140574 140595 140770 140599 140144 139790 139547 139331 139524
55293 139524 140367 141173 141180 140853 141318 142700 144081 144926 145464 145766 145586 145078 144653 144088 142785 140998 139786 139606
55275 139606 139854 139888 139678 139330 138832 138401 138318 138379 138237 138264 139258 141307 143746 146123 148301 149702 149540 148029
55257 148029 146450 145756 145805 146046 146209 146188 145948 145679 145492 145091 144424 144352 145743 148016 149586 149735 149108 148398
55239 148398 147607 146663 145793 145025 144174 143440 143254 143505 143744 144032 144616 144928 144082 142443 141413 141446 141524 140919 140237
55220 140237 140166 140283 139862 139026 138453 138562 139430 140901 142450 143544 144395 145660 147226 148139 148041 147773 148084 148596
55202 148596 148573 148051 147594 147529 147914 148806 150100 151391 152292 152604 152170 151085 150037 149783 150165 150287 149721 148858
55184 148858 148068 147362 146987 147441 148630 149812 150631 151425 152313 152839 152842 152859 153257 153677 153702 153403 152987 152586 152643 153666
55164 153666 155369 156826 157764 158834 160358 161760 162607 163233 163842 164000 163593 163381 163872 164449 164382 163964 163877 164026
55146 164026 163839 163255 162647 162157 161773 161653 161727 161371 160133 158460 157097 156065 154937 153882 153688 154689 156166
55129 156166 156947 156415 154919 153412 152612 152450 152305 151700 150606 149272 148135 147701 148012 148376 148136 147599 147596 148252
55111 148252 148946 149406 149970 150664 150906 150445 149849 149776 150364 151538 153222 155038 156429 157303 157975 158357 158017 157125
55093 157125 156477 156339 156131 155582 155325 155945 157191 158522 159668 160290 159916 158663 157367 156571 156076 155778 156084
55076 156084 157081 158081 158484 158353 157807 156744 155601 155387 156327 157397 157900 158569 160268 162474 164054 164893
55060 164893 165694 166566 166881 166370 165587 165332 166060 167626 169213 169854 169390 168587 168056 167654 167250 167275 167959 168751
55042 168751 169174 169648 170689 171823 172050 171122 169726 168697 168547 169344 170502 171104 170922 170710 171004 171234 170612
55025 170612 169403 168577 168497 168637 168405 167717 166906 166444 166559 166922 166983 166734 166659 166899 167102 167210 167534 167902 167689
55006 167689 167102 167301 168693 170155 170703 170853 171408 171890 171384 170228 169620 169978 170763 171595 172521 173422 174073 174627
54988 174627 175319 175957 176354 176880 177849 178707 178624 177559 176095 174555 172978 171636 170886 170810 171438 172836 174456
54971 174456 175140 174536 173797 174056 174829 174883 174039 173047 172267 171628 171527 172565 174562 176815 179038 181137 182495
54954 182495 182634 182329 182831 184108 184981 184927 184636 184801 185425 186388 187711 189090 190020 190458 190673 190506 189628 188352
54936 188352 187364 186768 186249 185983 186399 187260 188085 189321 191857 195393 198607 201108 203929 207759 211976 215988
54920 215988 220334 225697 231704 237493 242752 247459 251132 253062 252936 250735 246437 240422 233891 228242
54906 228242 224021 220741 217665 214527 211581 209104 206960 204703 202143 199581 197345 195384 193605 192281
54892 192281 191724 191787 192133 192787 193937 195441 196976 198507 200157 201874 203676 205935 208906 212301 215883
54877 215883 220039 225104 230528 235547 240393 245808 251506 256096 258556 258979 257753 254892 250380 244596
54863 244596 238138 231618 225587 220185 215036 210002 205767 203110 201847 201163 200634 200113 199004 196712 193684
54848 193684 191031 189137 187550 186065 184962 184248 183773 183992 185482 187624 188964 189033 188693 188535 188223 187684
54832 187684 187614 188228 188704 188567 188630 189773 191652 193343 194465 194985 194631 193367 191930 191113 190849 190517 189780
54815 189780 188667 187263 185785 184627 183935 183507 183349 183818 184894 185867 186190 186147 186356 187039 188136 189579 191037
54798 191037 191906 191980 191793 191896 192220 192410 192310 191837 190919 189873 189332 189441 189661 189688 189982 190950 192221 193284
54780 193284 194343 195928 198055 200344 202642 204976 207147 208925 210505 212398 215078 218980 224492 231529
54766 231529 239328 247027 254257 260951 266956 272148 276594 280209 282531 283208 282431 280590 277742 273768 268793
54751 268793 263130 257055 250899 245095 239756 234435 228668 222647 217123 212840 210205 209229 209425 209930 210111
54736 210111 210062 210358 211318 212600 213535 213869 214186 215370 217496 219615 220977 222145 224342 227994 232659 238149
54720 238149 244716 252003 258795 264147 268024 270467 271006 269406 266312 262501 258033 252714 246901 241200
54706 241200 235745 230414 225463 221365 218201 215708 213793 212501 211540 210323 208512 206290 204081 202130
54692 202130 200307 198303 196196 194747 194702 195743 196539 196084 194620 193156 192521 193098 194901 197398 199558 200549
54676 200549 200376 199664 198954 198338 197541 196272 194670 193434 193180 193687 194196 194477 195042 196216 197547 198401 198624
54659 198624 198423 198067 197973 198549 199571 200183 199868 199036 198345 197904 197557 197541 198349 200099 202362 204501 205972 206517
54641 206517 206298 205725 205062 204364 203665 202848 201479 199363 197271 196454 197269 198869 200351 201518 202378 202703 202494
54624 202494 202217 202092 201739 200954 200229 199995 199898 199412 198724 198450 198845 199796 201226 202957 204469 205310 205662 206111
54606 206111 206975 208065 208864 208802 207701 206126 204922 204185 203168 201426 199575 198564 198601 199120 199452 199232 198498
54589 198498 197683 197235 197093 196843 196383 195970 195638 195216 194983 195484 196550 197253 197136 196696 196406 196114 195799 196007
54571 196007 196947 197937 198337 198345 198377 198390 198349 198640 199411 200262 201083 202378 204121 205255 205145 204679 204956 205644 205663 204818
54551 204818 203685 202445 201008 199902 199835 200534 201001 200785 200202 199523 198832 198486 198817 199422 199485 198790 197905 197517
54533 197517 198068 199688 201925 203867 205036 205772 206328 206309 205626 205234 205980 207386 208467 209077 209434 209061 207594
54516 207594 206078 205956 206968 207467 206720 205646 205242 205589 206463 207648 208446 208074 206885 206163 206452 207016 207165
54499 207165 207131 207346 207753 208179 208612 208830 208506 207831 207348 207032 206342 205322 204783 205183 206094 206990 207763 208281 208288
54480 208288 208020 208164 208912 209752 210444 211402 212790 213958 214197 213525 212495 211716 211641 212233 212749 212492 211836 211750
54462 211750 212324 212659 212309 211801 211489 210950 209988 209224 209086 209080 208707 208327 208393 208554 208342 208176 208791 210029 211018
54443 211018 211340 211284 211023 210268 208877 207353 206525 206866 208150 209656 210741 211253 211410 211478 211740 212517 213778
54426 213778 214866 215114 214684 214257 213971 213333 212277 211598 212050 213489 215181 216527 217256 217302 216804 216023 215190
54409 215190 214576 214484 214786 214707 213723 212504 212238 213115 214271 215184 216140 217199 217790 217716 217676 218248 219102 219747 220356
54390 220356 221297 222394 223242 223779 224086 224046 223628 223074 222478 221598 220402 219320 218665 218379 218554 219481 220816 221547
54372 221547 221340 221139 221817 222993 223970 225006 226617 228222 228738 228270 228042 228677 229571 230091 230379 230683 230824
54355 230824 230730 230825 231318 231624 231051 229741 228434 227521 226840 226309 226188 226576 227043 227091 226745 226354 226003 225530 225076
54336 225076 225037 225302 225104 224028 222718 222057 222039 222120 222355 223344 225074 226666 227445 227580 227453 227119 226684 226574
54318 226574 226961 227385 227349 226902 226373 225973 226009 227006 229087 231508 233254 234002 234181 234312 234567 234844 234989 234962 234863
54299 234863 234752 234535 234302 234614 236019 238253 240423 241990 243037 243571 243227 241903 240068 238134 236051 233834
54283 233834 231982 231014 231021 231956 233774 235961 237451 237556 236666 235649 234959 234613 234539 234479 234026 233276 233051 233912
54265 233912 235269 236000 235708 234884 234106 233639 233595 233868 233934 233243 231906 230677 230222 230583 231251 231562 231149 230217
54247 230217 229328 228842 228734 228962 229655 230750 231813 232406 232365 231650 230395 229330 229542 231385 233937 235919 236871
54230 236871 237182 237387 237836 238600 239244 239017 237726 236230 235628 236164 237180 237903 237989 237625 237504 238384 240284 242339
54212 242339 243702 244231 244072 243166 241690 240453 240194 240717 241351 241949 242758 243527 243544 242635 241516 240966 241029 241165
54194 241165 240915 240333 239908 240040 240517 240657 240075 239048 238031 237237 236884 237367 238699 240180 241094 241489 241867
54177 241867 242416 242981 243518 244035 244341 244388 244687 245864 247887 250142 252183 254051 256030 258467 261611 265201
54161 265201 268384 270401 271196 271045 269966 267967 265562 263381 261418 259222 256690 254175 251945 250096 248852
54146 248852 248378 248356 248231 247830 247238 246216 244378 241937 239682 238062 236805 235550 234437 233922 234279 235387
54130 235387 236783 237973 238895 239938 241280 242523 243336 244140 245569 247461 249015 249781 249874 249342 248121 246695
54114 246695 246006 246421 247404 248462 249806 251688 253615 254791 255108 255282 256077 257662 259608 261333 262554 263434
54098 263434 264216 264786 264784 264167 263381 262863 262605 262355 262067 261952 262141 262442 262459 261954 261101 260336 259926 259710 259308 258513
54078 258513 257497 256739 256725 257471 258263 258130 256784 254947 253644 253280 253444 253377 252580 251224 250053 249628 249638 249333
54060 249333 248607 248149 248377 248874 249139 249253 249306 248839 247531 246023 245354 245835 247069 248801 251051 253614 256155
54043 256155 258722 261579 264544 267106 269227 271463 274242 277493 281029 284862 289045 293587 298542 303818
54029 303818 308888 313083 316301 319129 322222 325742 329369 332644 335321 337540 339579 341396 342628 343088
54015 343088 342815 341522 338625 334186 329215 324498 319698 314337 309079 305082 302402 300013 297321 294706
54001 294706 292528 290554 288631 287120 286268 285703 284938 283984 283153 282535 281899 280961 279679 278356 277329 276434
53985 276434 275062 273003 270866 269261 267980 266562 265236 264560 264390 264043 263421 263124 263433 263909 264137 264208 264314
53968 264314 264434 264502 264395 263761 262408 260868 259932 259634 259297 258646 258229 258604 259696 261098 262500 263725 264779
53951 264779 265918 267302 268675 269815 271085 272949 275172 277180 279006 281076 283286 285201 287039 289430
53937 289430 292246 294744 296945 299662 302914 305596 307223 308906 311903 316163 320935 325896 330873 335239
53923 335239 338528 341195 344022 347140 350254 353370 356640 359824 362564 364988 367617 370824 374674 378946
53909 378946 383070 386443 389074 391417 393380 394172 393532 392413 391876 391877 391727 391147 390169 388491 385814 382542
53893 382542 379389 376403 373029 369034 364805 360758 356902 352988 348819 344516 340658 337823 335740 333296
53879 333296 329798 325860 322577 320210 318240 316355 314679 313185 311532 309567 307479 305394 303198 300831
53865 300831 298456 296318 294654 293698 293504 293759 293914 293538 292516 291094 289746 288761 287923 286873 285753 285032
53849 285032 284664 283995 282783 281728 281578 282198 282926 283418 283680 283711 283672 284096 285368 287168 288843 290022 290456
53832 290456 289643 287298 284051 281128 279375 278969 279815 281601 283520 284648 284806 284728 285185 286144 286830 286489 285112
53815 285112 283554 282848 283272 284253 285228 286289 287835 289950 292501 295454 298650 301556 303780 305763 308466
53800 308466 312307 316718 320754 323904 326316 328490 330807 333265 335656 337914 340055 341827 342854 343268
53786 343268 343735 344671 345828 346862 347811 348652 348931 348335 347203 345918 344124 341205 337377 333712 331118 329701
53770 329701 328973 328227 326858 324849 322919 321778 321269 320664 319707 318873 318580 318566 318160 316910 314915 312772 311222
53753 311222 310629 310808 311412 312330 313566 314954 316201 317014 317067 316258 315287 315498 317636 320981 324179 326682 328955
53736 328955 331509 334412 337675 341568 346392 352252 359054 366498 374250 382406 391606 402400 414747 428575
53722 428575 444586 463933 487306 514923 547294 585172 628359 674871 721389 764267 800105
53711 800105 825950 839542 839708 826935 803705 773865 740955 707026 673171 640767 611459 585984
53699 585984 563790 544086 526837 512463 500953 491636 483692 476636 470399 465085 460697 457098 454199
53686 454199 451945 450028 447872 445141 442046 438948 435896 432919 430386 428609 427170 425228 422469 419326
53672 419326 416307 413590 411291 409550 408161 406554 404446 402207 400361 398922 397444 395545 393247 390951
53658 390951 389189 388265 388000 387888 387632 387393 387467 387830 388130 388086 387830 387807 388388 389598 391191 392818 394118 394885
53640 394885 395396 396378 398273 400577 402299 403095 403620 404729 406785 409721 413245 416801 419829 422333 424791
53625 424791 427380 429795 432033 434642 437844 441067 443918 447053 451404 456920 462638 467683 471680 474637
53611 474637 477093 480063 484135 488748 492903 496359 499578 502877 506293 509978 513968 517736 520714 523074
53597 523074 525294 527156 528068 528280 528814 530032 531171 531556 531565 531956 532813 533534 533491 532444 530601 528448 526292
53580 526292 523925 520988 517616 514337 511429 508770 506176 503446 500247 496562 493172 490998 489910 488843
53566 488843 487090 484823 482302 479400 476240 473572 472009 471350 471037 470903 471096 471595 472147 472488 472419 471899 471247
53549 471247 470982 471312 471996 472864 474150 476108 478524 480862 482824 484696 487198 490984 496150 502216 508601
53534 508601 514993 521306 527752 535076 544186 555060 566519 577631 588899 601420 615273 629603
53522 629603 644008 658842 674261 689964 706054 723242 741926 761807 782610 804529 827729
53511 827729 852113 877799 905128 933908 963262 992480 1021499 1050367 1078976 1107588 1136982
53500 1136982 1167663 1199498 1232455 1267196 1304707 1345811 1391167 1440992 1494411 1549544 1604406
53489 1604406 1656935 1703918 1741072 1765284 1776660 1777992 1772696 1763580 1752743 1741553 1730648 1720433
53477 1720433 1711441 1704028 1698049 1693231 1689476 1686426 1683142 1678750 1673160 1666731 1659447 1650818 1640378 1627983
53463 1627983 1613848 1598506 1582460 1565660 1547648 1528341 1508186 1487327 1465288 1441919 1418082
53452 1418082 1394810 1372131 1349261 1325656 1301432 1277052 1253108 1230202 1208653 1188502 1169970
53441 1169970 1153448 1138688 1124640 1110655 1097374 1085804 1075996 1067320 1059708 1053727 1049600 1046990
53429 1046990 1045781 1046400 1049177 1053904 1060161 1067790 1076995 1088218 1101761 1117284 1133909 1151198 1169759
53416 1169759 1190458 1213271 1237460 1262601 1288811 1316151 1344592 1374664 1407375 1443113 1481028
53405 1481028 1519827 1558974 1599013 1640945 1685407 1732314 1781203 1831937 1884856 1940121 1997239
53394 1997239 2055526 2114708 2174626 2234712 2294411 2354005 2414256 2475158 2535629 2594572 2651591
53383 2651591 2706477 2758641 2807479 2852800 2894419 2931642 2963692 2990498 3012663 3030762 3044969
53372 3044969 3055234 3061381 3063030 3059796 3051692 3039039 3021883 2999857 2972729 2940799 2904469 2863715
53360 2863715 2818333 2768473 2714535 2656756 2595648 2532788 2470335 2409328 2349121 2289037 2229916
53349 2229916 2173263 2119354 2067166 2015982 1965948 1916952 1868100 1818876 1770062 1722903 1677846
53338 1677846 1634626 1593153 1553760 1516839 1482744 1451863 1424334 1399778 1377559 1357221 1338484
53327 1338484 1321093 1304970 1290366 1277651 1267061 1258714 1252554 1248209 1245297 1244061 1245256 1249058 1254373
53314 1254373 1259556 1263483 1265734 1266241 1265313 1263737 1262337 1261397 1260806 1260601 1261130 1262876 1266398 1272290 1280936
53299 1280936 1292361 1306373 1322695 1340975 1361110 1383654 1409363 1438048 1468335 1498860 1529237
53288 1529237 1559515 1589228 1617607 1644393 1669817 1693894 1716183 1736175 1753562 1768236 1780255
53277 1780255 1789629 1796003 1798897 1798401 1795193 1789654 1781546 1770897 1758558 1745272 1730751 1714319 1695990
53264 1695990 1676199 1654900 1631741 1606817 1580400 1552149 1521451 1488518 1454376 1419819 1385037
53253 1385037 1350226 1315758 1281664 1247593 1213456 1179555 1146052 1112973 1080801 1050381 1021960
53242 1021960 994840 968249 942086 916676 892282 869168 847694 827915 809244 790821 772229
53231 772229 753822 736434 720697 706578 693648 681812 671403 662355 653762 644721 635258 625894
53219 625894 616591 606871 596790 586984 577693 568444 558888 549367 540470 532497 525564 519721 514716 509986
53205 509986 505127 500191 495460 491141 487294 483788 480365 477027 474188 472096 470295 468222 466227 465387
53191 465387 466281 468524 471528 475100 479047 482816 485860 488014 489238 489306 487947 485097 480900 475722 470120
53176 470120 464433 458372 451426 443716 436093 429364 423806 419398 415954 412952 409739 406088 402200 398218
53162 398218 394326 391317 390201 390863 391776 391529 390172 388670 387586 386864 386453 386367 386252 385481 383851 381842
53146 381842 380172 379208 378704 377904 376093 373331 370555 368760 368181 368433 369185 370294 371425 371998 371737 370998
53130 370998 370383 370160 370242 370626 371536 372973 374337 374873 374528 374092 374329 375211 376152 376685 376698 376275 375715 375551 376137
53111 376137 377244 378310 379013 379329 379163 378366 377103 375930 375465 376096 377833 380141 382179 383589 384923 386914
53095 386914 389558 392283 394787 397113 399121 400658 402164 404385 407297 409987 411765 412882 413926 415148
53081 415148 416584 418270 419952 421065 421367 421238 421042 420580 419497 417849 415894 413570 410597 406982 403160
53066 403160 399714 397033 395032 393096 390476 386983 383176 379847 377471 376104 375468 375052 374402 373414 372221
53051 372221 370864 369338 367854 366666 365686 364670 363729 363258 363404 364049 365165 366651 367897 368239 367898 367791
53035 367791 368254 368656 368424 367681 366674 365401 364161 363614 363737 363454 361992 359972 358489 357705 357145 356860 357323
53018 357323 358394 359335 359874 360557 361972 364173 366857 369562 371662 372761 373235 373876 374881 375606 375502 374877
53002 374877 374482 374558 374630 374166 373240 372473 372349 372709 372999 373000 373100 373818 375276 377294 379756 382635 385689 388371
52984 388371 390135 390919 391355 392347 394223 396379 398051 399265 400613 402197 403430 404022 404514 405486 406728 407610
52968 407610 407888 407774 407523 407285 407042 406383 404749 402319 400188 399177 398802 397961 396326 394397 392462 390289
52952 390289 387867 385701 384105 382732 381107 379289 377793 377033 376945 376962 376327 374690 372521 370655 369446 368576
52936 368576 367735 367077 366823 366778 366618 366534 367117 368445 369597 369422 367719 365349 363247 361678 360619 360341 361121
52919 361121 362531 363607 363820 363524 363423 363925 365007 366280 367105 367104 366706 366829 367895 369534 371263 372871 373949
52902 373949 373802 372320 370487 369454 369380 369657 369903 370177 370480 370684 370883 371251 371574 371397 370688 369918 369409 368980
52884 368980 368304 367315 366128 364816 363414 362003 360702 359655 358986 358617 358203 357470 356597 356074 356093 356221 355833
52867 355833 354868 354044 354156 355180 356292 356920 357418 358364 359547 360220 360266 360355 360844 361287 361341 361394 361774 361974 361396
52848 361396 360425 359960 360044 359734 358362 356334 354562 353591 353432 353838 354542 355370 356246 356993 357300 357122 357031 357812
52830 357812 359684 362159 364695 367195 369794 372376 374495 375745 376132 376045 375838 375535 375069 374687 374764 375203 375401
52813 375401 375063 374802 375646 378092 381848 386398 391619 397841 405259 413138 419658 422918 422258 418506 412989
52798 412989 406640 399921 393045 386048 379044 372553 367137 362624 358279 353899 350118 347300 344828 342034
52784 342034 339240 337295 336489 336519 337146 338247 339508 340609 341556 342307 342424 341689 340764 340593 341271 342095 342531
52767 342531 342543 342119 341142 339753 338336 337135 336316 336214 336993 338195 339190 339987 341074 342548 343962 344913 345229
52750 345229 344685 343260 341705 341152 341932 343338 344662 345892 347201 348341 348915 348904 348643 348529 348863 349675 350545
52733 350545 350906 350705 350540 350993 352042 353190 353961 354186 354000 353672 353405 353301 353512 354147 354859 354852 353633 351626
52715 351626 349705 348330 347392 346630 345783 344623 343277 342281 341838 341349 340282 339256 339457 341073 343036 344333
52699 344333 344830 344755 344223 343544 343299 343631 343923 343558 342721 342226 342801 344644 347271 349694 351120 351660 352014 352487
52681 352487 352822 353075 353957 355895 358245 359925 360603 360919 361727 363413 365784 368334 370708 373057 375824 379093
52665 379093 382300 384706 386070 386787 387484 388452 389316 389324 388217 386748 386101 386754 388117 389221 389489 388919 387901
52648 387901 386943 386318 385940 385668 385565 385604 385394 384633 383678 383168 383123 382987 382525 382204 382529 383460 384611 385719 386866
52629 386866 388506 391169 394763 398295 400772 402247 403459 404548 404904 404265 403148 401956 400453 398533 396855
52614 396855 396128 396136 395962 394997 393459 392122 391673 392102 392562 392166 391009 390009 389714 389753 389636 389532 389919 390922
52596 390922 392325 393880 395260 396036 396107 395897 395844 395917 395877 395748 395787 396174 396944 398054 399376 400827 402524 404496
52578 404496 406288 407372 408026 409218 411314 413499 414874 415630 416595 417974 419145 419543 419260 418805 418594 418642
52562 418642 418486 417556 415899 414433 414179 415243 416770 417805 418017 417672 417202 416911 416969 417464 418335 419251 419812
52545 419812 420020 420296 420823 421138 420790 420112 419817 419987 420157 420343 421213 422993 424896 426085 426672 427310 428158 428736
52527 428736 428660 428166 427961 428648 430174 431836 433037 433989 435372 437488 440204 443622 448014 453008 457588 461239
52511 461239 464524 468235 472492 476914 481006 484041 485237 484541 482714 480246 476814 472256 467326 462752
52497 462752 458181 452999 447768 443862 441820 440957 440539 440470 440680 440664 440093 439363 439137 439559 440255 440960 441885 443387
52479 443387 445286 446713 446854 445926 445071 445147 445908 446618 447162 448142 450114 453120 456904 461176 465651 470122
52463 470122 474560 478978 483179 486785 489460 490967 491055 489434 485954 480870 474936 469108 463974 459522 455573
52448 455573 452174 449308 446479 443166 439587 436476 434137 432319 431034 430744 431472 432386 432615 432032 431007
52433 431007 429931 429228 429252 429788 430117 429899 429470 429072 428454 427635 427315 427937 428909 429351 429152 428748 428391 428315 429109
52414 429109 431164 434053 437142 440466 444383 448799 453558 459327 467197 477469 489527 502714 516463
52401 516463 529559 540222 547282 550734 550964 547990 541765 532856 522521 512222 503065 495449 489146
52388 489146 483823 479362 475624 472305 469369 467324 466564 466625 466666 466569 467069 468790 471615 475055 478805 482758
52372 482758 486817 490906 495071 499476 504161 508681 512041 513320 512520 510501 508055 505458 502963 501111
52358 501111 500112 499416 498293 496533 494372 492267 491029 491426 493122 494613 494937 494821 495490 496955 498444 499962
52342 499962 502276 505570 509151 512519 515795 519095 522370 525921 530304 535652 541844 549294 558679 569751
52328 569751 581295 592547 603951 616280 629660 643693 657807 671119 682669 692314 701004 709797
52316 709797 718904 727949 736787 745721 755122 765119 775583 786384 797742 810193 823938 838399 852867
52303 852867 867400 882615 898609 914637 929808 943593 955670 965866 974283 980979 985475 987187
52291 987187 986484 984708 982870 980743 977508 972948 967728 962732 958341 954211 949774 945045 940762 937532
52277 937532 935149 933135 931629 931156 931707 932714 933820 935089 936571 938313 940762 944450 949334 955109 962075
52262 962075 970876 981310 992338 1003468 1015306 1028430 1042517 1056969 1071674 1086670 1101605 1115896
52250 1115896 1128912 1139733 1147364 1151661 1153579 1154209 1154080 1153612 1153433 1153647 1153416 1152030 1150035 1148677 1148489
52235 1148489 1149016 1149662 1150198 1150520 1150469 1149976 1149066 1147781 1146261 1144776 1143401 1141850 1139917 1137916 1136359 1135357
52219 1135357 1134697 1134410 1134868 1136212 1138010 1139721 1141408 1143820 1147691 1153092 1159567 1166780 1174697 1183057 1191130
52204 1191130 1198261 1204456 1210154 1215675 1221199 1226998 1233289 1240114 1247724 1256760 1267442 1278830 1289450
52191 1289450 1298591 1306520 1313652 1320110 1325886 1330741 1334039 1335328 1334898 1333079 1329291 1322747 1313980 1304576
52177 1304576 1295361 1285900 1275978 1266363 1257701 1249677 1241885 1234639 1228367 1223041 1218840 1216602 1216925 1219436
52163 1219436 1223520 1229138 1236214 1243844 1250927 1257236 1263165 1268698 1273212 1276131 1277340 1277219 1276578 1276249 1276425
52148 1276425 1276829 1277631 1279529 1282629 1286030 1289045 1291982 1294961 1296766 1295901 1292398 1287627 1282669 1277735 1272887
52133 1272887 1268308 1263866 1259261 1254723 1250982 1248596 1247859 1249216 1253095 1259329 1267408 1277343 1289750 1304972
52119 1304972 1322628 1342042 1362675 1384107 1406019 1428267 1450648 1472648 1493756 1513900 1533175
52108 1533175 1551357 1568268 1584585 1601641 1620240 1640093 1660557 1681451 1702889 1724716 1746529
52097 1746529 1768108 1789471 1810320 1829549 1845521 1856983 1863679 1865935 1863914 1857685 1847918 1835941
52085 1835941 1822951 1809712 1797230 1787069 1780403 1777021 1775655 1775046 1774433 1773531 1772583 1772200 1772642 1773520 1774624
52070 1774624 1776666 1780603 1786430 1793228 1800287 1807567 1815153 1822921 1830840 1839098 1847691 1856231 1864272 1871713
52056 1871713 1878838 1886084 1893646 1901079 1907480 1912232 1915438 1917446 1918232 1917514 1915190 1911288 1905765 1898752
52042 1898752 1890869 1882942 1875586 1869261 1864382 1860983 1858582 1856807 1855799 1855563 1855262 1853860 1851188 1847724
52028 1847724 1843495 1837967 1830934 1822754 1813583 1803124 1791368 1779090 1767338 1756771 1747583 1739641 1732500
52015 1732500 1725701 1719298 1713880 1709967 1707604 1706568 1706619 1707406 1708322 1708554 1707176 1703209 1695806 1684450 1668941
52000 1668941 1649440 1626688 1601953 1576515 1551389 1527706 1506792 1489273 1474376 1460744 1447792
51989 1447792 1435627 1423837 1411267 1397255 1382428 1367933 1354358 1341587 1329164 1316440 1302744
51978 1302744 1287816 1271814 1254737 1236239 1216425 1196433 1177685 1160693 1145151 1131198 1120013
51967 1120013 1112824 1109698 1109737 1112283 1117381 1124990 1134306 1144247 1154155 1163447 1170781 1174327 1173027 1167055
51953 1167055 1156936 1142811 1124971 1104604 1083588 1063688 1046091 1031268 1018956 1008657 1000508
51942 1000508 995319 993518 994523 997411 1001645 1006629 1011177 1014167 1015403 1015158 1013187 1008894 1002244 993738
51928 993738 983633 971845 958511 943973 928334 911767 895174 879764 865896 853023 840819
51917 840819 829640 819762 811013 803452 797680 794086 792298 791847 792946 796222 801991 810190 820768 833809
51903 833809 849449 867950 889599 914096 939897 964384 984868 999592 1007948 1009908 1005386 994324
51891 994324 977304 955728 931352 905928 881334 859411 841150 826410 814840 806810 803038 803743
51879 803743 808754 818083 831740 849315 870503 895706 924937 956086 985341 1009753 1028643 1042121
51867 1042121 1049123 1047753 1037289 1019247 996518 971814 946807 922370 899346 878878 861923 848665
51855 848665 838738 831912 828239 827605 829494 833132 837536 841541 844220 845268 844755 842705 839312 835270 831197
51840 831197 826795 821176 814080 806268 798786 792460 788038 786069 786430 788524 792084 797172 803264 808934
51826 808934 812686 813670 811555 806432 799100 790875 782758 775164 768527 763551 760655 759763 760885 764269 769663
51811 769663 776048 782506 788731 794209 797446 796767 791673 783041 772284 760712 749344 738691 728677
51798 728677 719113 710207 702458 696225 691557 688239 685863 684076 682934 682804 683802 685696 688372 691989 696439
51783 696439 701118 705497 709560 713369 716594 718864 720318 721427 722550 724068 726789 731731 739483 750052
51769 750052 763382 779818 799965 823969 850853 878556 904703 927263 944417 954352 955873 949293
51757 949293 936152 918029 896082 871664 846571 822280 799380 778051 758640 741489 726661
51746 726661 714207 704337 697002 691713 688151 686707 688041 692337 699228 708211 718829 730647 743308
51733 743308 756429 769282 780749 789711 795346 797209 795467 791065 785109 777995 769662 760724 752503
51720 752503 745565 738983 731722 724275 718242 714573 712851 712189 712320 713793 717393 723347 731083 740058 750861
51705 750861 764978 783233 804971 829031 854752 881324 906700 928195 944267 955197 962157 966311
51693 966311 968850 971197 974659 979890 986621 993582 998582 999078 993213 980748 963226 943152 922718
51680 922718 903089 884836 868737 855744 846216 839626 835040 831463 827708 822593 815636 807276 798280
51667 798280 789347 781340 775181 771019 767952 765092 762583 761205 761260 762311 763802 765536 767713 770886 775853
51652 775853 783375 793945 807677 824049 841733 859054 874639 887249 895196 896785 891640 880935
51640 880935 866130 848190 828279 808179 789272 771672 754955 739228 724918 712159 701056
51629 701056 691984 684924 679030 673579 668883 665578 663502 662102 661389 661620 662397 663111 663975 665574 667581
51614 667581 668961 669405 669552 669754 669631 668988 668220 667490 666335 664462 662279 660254 658293 656082 653604 651119
51598 651119 649103 648469 650383 655512 663602 673881 685565 697981 710546 722763 733975 743257 750033
51585 750033 754843 759067 763897 769936 777714 787984 801453 818785 841026 869429 904636 946449
51573 946449 994487 1048439 1107432 1169871 1234571 1301791 1372592 1447281 1524900 1604134 1684380
51562 1684380 1765985 1850042 1938333 2033166 2136402 2247843 2364305 2480367 2589935 2686819
51552 2686819 2764215 2815048 2834116 2820080 2775066 2702589 2606404 2490877 2361221 2222635 2079556
51541 2079556 1935941 1795836 1663142 1540794 1430344 1332250 1246413 1172490 1109805 1057136
51531 1057136 1012854 975451 943874 917383 895395 877623 864089 854584 848239 843892 840782 838695
51519 838695 837637 837637 838696 840590 842785 844727 846068 846397 845021 841313 835117 826582 815934 803641 790438
51504 790438 776755 762404 747241 731825 717055 703470 691372 681200 673187 666902 661764 657751
51492 657751 655080 653514 652702 652897 654514 657177 659999 662676 665342 667442 667809 666106 663311 660405 657363
51477 657363 653798 649821 645775 641649 637337 633064 629138 625555 622119 618710 615215 611538 607897 604776
51463 604776 602361 600375 598673 597685 597959 599541 601986 604767 607564 610411 613775 618305 624374 632007 641187
51448 641187 652033 664810 680145 699185 723020 751798 784709 820742 858877 897286 932853
51437 932853 962053 982599 994541 1000179 1002767 1004723 1006576 1007378 1005722 1000204 989626 973744 953960
51424 953960 932728 912211 893862 878881 868117 861356 857539 855972 856719 859599 863573 867644 871848
51411 871848 876820 882627 888369 892797 895132 895465 894420 892277 888603 883156 876975 871977 869403 869237 871128
51396 871128 875203 881816 891132 903267 918395 936618 958258 984363 1016342 1055018 1100710 1154339
51384 1154339 1217692 1292375 1379323 1479614 1594753 1725465 1870661 2027901 2194130 2365318
51374 2365318 2536049 2699998 2850410 2979882 3080943 3148238 3180150 3177768 3142730 3076739
51364 3076739 2982609 2864739 2728448 2579404 2423321 2265271 2109141 1958201 1815905 1685366
51354 1685366 1567995 1463350 1370543 1289241 1219205 1159373 1107744 1062017 1020283 981545 945806
51343 945806 913585 885165 860237 838125 818156 799873 783058 767689 753893 741935 732046 724031
51331 724031 717205 711009 705564 701146 697295 693098 688467 684411 681715 680043 678762 678050 678613 680693 683925
51316 683925 687840 692030 696146 700252 704827 709933 714713 718306 720973 723668 726734 729693 732211 734509
51302 734509 736724 738483 739259 738749 736667 732558 726007 716976 705994 694212 683051 673441 665388 658541
51288 658541 653001 649205 647213 646681 647561 650307 655179 661717 669164 677122 685508 693977 701747 708148 713212
51273 713212 717509 721340 724404 726515 728365 731071 734945 739288 743537 747980 752967 757934 761826 764114
51259 764114 764798 763626 759983 753656 745317 736155 727340 719766 713815 709155 705015 700839 696628 692691
51245 692691 689274 686513 684525 683373 682867 682508 681812 680775 679839 679194 678399 677114 676038 676536 679258 683759
51229 683759 689629 697339 707528 719952 733596 747489 760931 773237 783780 792147 797920 800411
51217 800411 798979 793592 784925 774117 762458 750938 739841 729066 718951 710338 703621 698303 693882
51204 693882 690659 689238 689655 691528 694555 698311 701962 704865 707208 709473 711622 713388 715109 717510
51190 717510 720844 724880 729604 735315 742095 749755 758193 767306 776643 785676 794170 801745 807375 810107
51176 810107 810171 808643 806085 802231 796920 790494 783284 775547 768081 762013 757640 754163 750875 747926 745664
51161 745664 743951 742587 741697 741059 739520 735858 730007 722916 715342 707356 698921 690348 681973 673806 665847
51146 665847 658577 652695 648303 644565 640502 635985 631681 628154 625479 623780 623453 624436 625820 626834 627926
51131 627926 630281 634497 640295 647299 655350 664086 672921 681619 690295 698711 706017 711368 714465 715503
51117 715503 715032 713837 712406 710380 706978 702032 696187 690094 684002 678182 673104 668932 665358 662170
51103 662170 659527 657542 656104 655332 655618 656976 658870 660967 663579 667048 671279 676166 681871 688117 693855
51088 693855 698318 702009 705865 709714 712326 712966 712164 710981 710135 709995 710763 712249 713867 715181 716372
51073 716372 718042 720843 725350 731965 740551 750365 760558 770634 780224 788669 795261 799868 802946 804876
51059 804876 805612 805079 803490 801017 797439 792518 786587 780465 774935 770601 767933 766883 766548 765885 764867
51044 764867 764424 765185 766900 769273 772618 777361 783546 791350 801458 814268 829133 844989 861268
51031 861268 877569 892854 905758 915446 921477 923238 920432 913923 905101 894440 881680 867470 853707
51018 853707 841951 832426 825058 820466 819145 820396 823005 826805 832835 842062 854449 869210 885415
51005 885415 902274 919193 935821 951959 967332 981433 993580 1003130 1009771 1013546 1014621 1013127
50993 1013127 1009322 1003687 996652 988462 979544 970720 962725 955757 949937 945948 944674 946485 951476 960290
50979 960290 973866 992352 1014914 1040683 1069191 1099750 1131222 1162814 1194519 1226407 1257874
50968 1257874 1287895 1315713 1341213 1365186 1389359 1415485 1444014 1474093 1505010 1536995 1570379
50957 1570379 1604716 1639264 1673697 1707659 1740072 1769596 1795622 1818359 1838221 1855554 1870771
50946 1870771 1884379 1897011 1909663 1923485 1938933 1955264 1971047 1984760 1994650 1998670 1995289 1984304
50934 1984304 1966615 1943504 1916373 1886538 1854696 1820869 1785307 1748987 1712695 1676135 1638613
50923 1638613 1600177 1561288 1521799 1481224 1439882 1398827 1358661 1319361 1281335 1245663 1212912
50912 1212912 1182564 1154044 1127696 1104225 1083713 1065671 1049678 1035446 1022578 1010762 1000087
50901 1000087 990900 983467 977909 974075 971168 967963 963955 960114 957867 957393 957403 956702 955457 954733 955201
50886 955201 956662 958584 960700 963101 966007 969534 973590 977986 982649 987631 992876 998098 1003046 1007767
50872 1007767 1012496 1017432 1022794 1028934 1036111 1044265 1053313 1063516 1075113 1087702 1100559 1113755 1128362
50859 1128362 1145312 1164604 1186069 1210365 1238585 1271144 1307766 1348446 1393795 1444403 1500381
50848 1500381 1561625 1628115 1699888 1777009 1859544 1947135 2038707 2132986 2229210 2326813 2424371
50837 2424371 2519375 2609127 2691431 2764489 2826842 2877737 2917130 2945206 2962350 2969711 2969199 2962609
50825 2962609 2951161 2936177 2919673 2903794 2889916 2878554 2869778 2863340 2858561 2854409 2849577 2842392
50813 2842392 2830944 2813572 2789113 2756743 2716034 2667304 2611407 2548943 2480092 2405533 2327156
50802 2327156 2247531 2168995 2093461 2022562 1957379 1898150 1844693 1797121 1756081 1722473 1697016
50791 1697016 1679672 1669355 1664571 1664532 1669218 1678257 1690432 1704629 1720505 1737598 1754392 1769030
50779 1769030 1780640 1789234 1794672 1796591 1795281 1791696 1786407 1779054 1768973 1755870 1739748 1720686 1698924
50766 1698924 1674859 1648736 1620500 1590081 1557782 1524385 1490920 1458177 1426423 1395830 1367149
50755 1367149 1341444 1318889 1298478 1279448 1262456 1248648 1237994 1229454 1222641 1218261 1216824 1217932
50743 1217932 1221237 1227280 1236765 1249585 1265178 1283449 1304690 1328889 1355900 1386289 1421298 1461624
50731 1461624 1506611 1554953 1605944 1659660 1716025 1774096 1832451 1890065 1946665 2002312 2056736
50720 2056736 2108914 2157135 2199615 2235270 2263919 2285630 2300108 2307028 2306875 2301126 2291682 2280485
50708 2280485 2269543 2260641 2254617 2251234 2250029 2251068 2254641 2260428 2267262 2273636 2278293 2280373 2279020 2272830
50694 2272830 2259920 2238913 2209848 2173906 2132455 2086863 2038970 1990830 1943706 1897984 1854375
50683 1854375 1814571 1780346 1752669 1732100 1719370 1714932 1718459 1729522 1748406 1775634 1810996 1853684
50671 1853684 1903108 1958797 2019557 2083291 2147651 2210443 2269657 2323801 2372390 2415759 2454371
50660 2454371 2488479 2518266 2543912 2565630 2583932 2599575 2612914 2623529 2630872 2635046 2636574 2635778
50648 2635778 2632923 2628735 2624287 2620556 2618599 2619804 2625342 2635576 2650609 2671152 2698128 2731584 2770692
50635 2770692 2814679 2862917 2914296 2967612 3022788 3080657 3140945 3200999 3256828 3304590 3340499
50624 3340499 3360133 3359265 3335985 3291961 3231767 3161293 3086513 3012888 2944897 2885581 2836405 2797696
50612 2797696 2769181 2749983 2738383 2732214 2729849 2730436 2732911 2735129 2734382 2728449 2715821 2695290 2665940
50599 2665940 2627465 2580164 2524809 2462841 2396258 2326739 2255147 2182384 2110292 2040856 1974694
50588 1974694 1911219 1850323 1793098 1740789 1693777 1651824 1614614 1581692 1552427 1526421 1503758
50577 1503758 1484608 1468893 1456489 1447543 1442476 1441737 1445400 1452799 1462763 1474557 1488348 1504462 1522597
50564 1522597 1542315 1563938 1588244 1615609 1646300 1681422 1722448 1769665 1821876 1877800 1936855
50553 1936855 1998305 2060547 2121747 2180642 2236313 2287724 2333907 2374298 2408729 2437549 2461899
50542 2461899 2483374 2503244 2522426 2542209 2564230 2589586 2618650 2652005 2690735 2735441 2785685
50531 2785685 2840914 2901378 2967771 3040611 3120497 3208319 3304489 3408276 3518365 3633635 3752797
50520 3752797 3873610 3993099 4108440 4217214 4316989 4405130 4478974 4536028 4574233 4592309
50510 4592309 4589719 4566243 4522031 4458281 4377398 4282200 4175324 4059731 3939379 3818995 3703357
50499 3703357 3596880 3503314 3425324 3364578 3322466 3300232 3298043 3314307 3346272 3390747 3443675
50488 3443675 3499457 3551527 3593653 3620480 3627421 3611179 3570824 3508052 3426136 3328642 3218943
50477 3218943 3100484 2977062 2852609 2730499 2613099 2502042 2398702 2304004 2217944 2139911
50467 2139911 2069582 2006979 1951712 1902988 1860570 1824885 1795771 1771879 1751853 1735338 1722016
50456 1722016 1710281 1697787 1683065 1665849 1646136 1623854 1599436 1573895 1548156 1522773 1498261
50445 1498261 1475215 1454009 1434851 1418117 1404278 1393478 1385497 1380056 1376837 1375357 1375215 1376420 1379198
50432 1379198 1383626 1389758 1397860 1408084 1420087 1433405 1448147 1464874 1483917 1505174 1528412 1553365
50420 1553365 1579717 1607493 1637448 1670709 1708155 1750390 1797928 1850794 1908172 1969145 2033680
50409 2033680 2102240 2174512 2249175 2324874 2400633 2475315 2547576 2616658 2682392 2743957 2799312
50398 2799312 2846367 2884112 2911972 2928667 2932625 2923363 2901646 2868241 2823349 2767590 2702996 2632564
50386 2632564 2559150 2485255 2413653 2347554 2289877 2242628 2207124 2184343 2174565 2176773 2188941 2209005
50374 2209005 2235182 2265166 2295503 2322258 2342268 2353514 2354571 2344288 2322179 2288768 2245220
50363 2245220 2192703 2132335 2065741 1995353 1923768 1852689 1782650 1713906 1647392 1584506 1526112
50352 1526112 1472163 1422228 1375963 1332988 1292897 1255698 1221948 1192088 1165851 1142564 1121805
50341 1121805 1103444 1087277 1073042 1060742 1050597 1042612 1036387 1031450 1027689 1025417 1025040 1026584 1029641
50328 1029641 1033866 1039341 1046152 1053713 1061048 1067809 1074485 1081319 1087542 1092111 1094904 1096784 1098660 1100748
50314 1100748 1102619 1103773 1104415 1105765 1109186 1114728 1120964 1126547 1131443 1136284 1141151 1145731 1150147 1154782
50300 1154782 1159471 1163763 1167895 1172623 1177964 1182992 1187116 1190793 1194467 1197381 1198000 1195304 1189318 1180677
50286 1180677 1170201 1158759 1147071 1135502 1124166 1113203 1102849 1093338 1084941 1078093 1073314 1070933
50274 1070933 1070902 1072874 1076493 1081663 1088583 1097593 1108913 1122367 1137192 1152097 1165778 1177517 1187259
50261 1187259 1195065 1200684 1203822 1204705 1204217 1203431 1202983 1202728 1201883 1199559 1195266 1189010 1181122 1172098 1162399
50246 1162399 1152058 1140636 1127986 1115018 1103190 1093130 1084237 1075781 1067928 1061420 1056731 1053886
50234 1053886 1052682 1052709 1053514 1055220 1058708 1064740 1073090 1082924 1093848 1106125 1119949 1134885 1149986
50221 1149986 1164147 1176459 1186532 1194479 1200355 1203723 1203992 1201084 1195541 1188027 1178861 1167913 1154899
50208 1154899 1139905 1123632 1106887 1089847 1072197 1053997 1035938 1018616 1002116 986497 972103
50197 972103 959122 947449 937339 929510 924079 920006 916220 912773 910277 908773 907990 908286 910405 914386
50183 914386 919458 924979 930914 937585 945437 954857 965644 976915 988059 999483 1011843 1024922 1037979
50170 1037979 1050767 1063337 1075226 1085843 1095500 1105073 1114736 1124016 1133044 1142602 1152770 1162597 1171472
50157 1171472 1179947 1188889 1198597 1209220 1221299 1235290 1250917 1267274 1283254 1297772 1310015 1319643
50145 1319643 1326431 1329865 1329613 1326116 1319882 1310283 1296045 1277070 1254932 1231417 1207584 1184516 1163912
50132 1163912 1147177 1134576 1125656 1119739 1115495 1110924 1104736 1097383 1090139 1083522 1077116 1070521 1063800
50119 1063800 1057175 1050829 1044924 1039513 1034571 1030251 1026938 1024966 1024627 1026321 1030035 1034622 1038434 1041021
50105 1041021 1043437 1046542 1049770 1052064 1053244 1053781 1053959 1054033 1054603 1055910 1057183 1057609 1057662 1058614 1060952 1064178
50089 1064178 1068114 1073498 1081082 1090846 1102324 1115199 1129287 1144332 1160008 1175994 1192089 1208536
50077 1208536 1226298 1246758 1271053 1299761 1333099 1371171 1414022 1461539 1513266 1568338 1625749
50066 1625749 1684580 1743619 1800975 1854937 1905602 1954984 2005047 2056096 2107504 2159228 2211691
50055 2211691 2264545 2316401 2365494 2409636 2445544 2469300 2477950 2470413 2446950 2408597 2357353 2296271
50043 2296271 2228880 2158652 2088918 2022585 1961506 1906434 1857798 1816190 1781958 1754875 1734626
50032 1734626 1721247 1714608 1713678 1716779 1722606 1730713 1740982 1752880 1765330 1777187 1787792 1797090 1805106
50019 1805106 1811203 1813923 1811585 1802984 1787531 1765188 1736807 1704465 1670885 1638133 1607014 1577794
50007 1577794 1551021 1527217 1506154 1487308 1471140 1459240 1452901 1452188 1456881 1467727 1485857 1510998
49995 1510998 1540854 1572227 1602318 1629190 1651925 1670720 1686359 1699303 1709500 1716917 1721579 1722942
49983 1722942 1720033 1712716 1702360 1690833 1679243 1668033 1657792 1649322 1643210 1639917 1640048 1643944 1651225
49970 1651225 1661384 1674758 1692152 1713438 1737318 1762911 1791143 1823991 1862622 1906748 1955846
49959 1955846 2010544 2072652 2144044 2225744 2317820 2419676 2530214 2647968 2771422 2899107
49949 2899107 3029104 3158459 3283547 3401444 3511159 3613634 3710639 3803586 3893058 3979038
49939 3979038 4061111 4137958 4206555 4262250 4300197 4316883 4310339 4279500 4224173 4145751 4047331
49928 4047331 3932684 3805211 3667867 3523590 3375490 3226685 3080016 2937666 2800934
49919 2800934 2670545 2547262 2431967 2325222 2227153 2137914 2057932 1987568 1926793 1875313
49909 1875313 1832807 1799033 1774000 1758057 1751474 1753820 1764053 1781172 1804285 1831984 1862179 1892737
49897 1892737 1921828 1947494 1967495 1980045 1984373 1980278 1967601 1946563 1918244 1884111 1845118 1801620
49885 1801620 1754108 1703705 1651983 1600440 1550106 1501408 1454443 1409373 1366451 1325737 1287168
49874 1287168 1251055 1218249 1189601 1165373 1145216 1128577 1115187 1105347 1099688 1098348 1100511 1105088
49862 1105088 1111750 1120955 1133268 1149239 1169713 1195398 1226067 1260893 1299568 1342205 1388003 1434856
49850 1434856 1480571 1523653 1562694 1596090 1623097 1644492 1661579 1675030 1684944 1691173 1693167 1690392
49838 1690392 1683679 1675499 1668342 1663590 1662542 1667439 1680344 1701589 1730275 1765696 1807287 1853846
49826 1853846 1904119 1957915 2015637 2077060 2141711 2210266 2284459 2365544 2453628 2548084 2647385
49815 2647385 2748338 2846414 2936914 3015080 3075469 3112798 3124151 3109829 3071960 3013101 2936329
49804 2936329 2845566 2744930 2637952 2527500 2415976 2305381 2197543 2094426 1997858 1908975
49794 1908975 1828223 1755607 1690392 1630971 1576032 1525888 1481815 1444042 1411272 1382324 1357297
49783 1357297 1336712 1320201 1306495 1294210 1282384 1270774 1259954 1250805 1243850 1239447 1238482 1242100
49771 1242100 1250642 1263438 1279652 1298532 1318768 1338565 1356733 1372966 1386765 1397002 1403051 1405538
49759 1405538 1405301 1402259 1395897 1386105 1372716 1354755 1331129 1301898 1268236 1231427 1192734 1154036
49747 1154036 1117510 1084310 1054128 1026306 1000904 978449 959211 943226 930691 921681 915435 910539
49735 910539 906159 902789 901420 902217 904527 908002 912983 919598 927228 935373 944561 955898 970072 987329
49721 987329 1007943 1031943 1058525 1086437 1114800 1142880 1169220 1191896 1209799 1223062 1232119 1237007
49709 1237007 1237698 1234408 1227225 1215936 1200514 1181427 1159365 1135094 1109635 1084051 1058913 1034481
49697 1034481 1011516 991316 974667 961224 950252 941495 935084 931027 929190 929506 931924 936377 942871
49684 942871 951311 961167 971707 982779 995018 1009174 1025483 1043764 1063791 1085441 1108732 1133675
49672 1133675 1159792 1185944 1211027 1234578 1256096 1274141 1287123 1295073 1299689 1302391 1303127 1301253
49660 1301253 1296540 1288751 1277088 1260767 1239706 1214235 1184775 1152342 1118692 1085375 1053072 1022267
49648 1022267 993798 968065 944361 921925 901280 883678 869455 857743 847712 839308 832709 827701
49636 827701 823696 820029 816182 812065 808038 804367 800776 796851 792672 788625 784707 780449 775563 770374
49622 770374 765557 761668 758840 756764 755025 753589 752854 753073 753956 754981 755854 756486 756837 757081 757805 759677
49606 759677 762854 766725 770127 771947 771928 770975 770370 770661 771568 772781 774144 775091 774790 773234 771425 770000
49590 770000 768367 765869 763145 761494 761228 761481 761490 761273 761062 760742 760133 759499 759628 761421 765233 770472 776158
49573 776158 782063 789012 797889 808854 821836 837155 855044 875006 896293 918583 941445 963379
49561 963379 982234 996599 1006258 1011522 1012811 1010787 1006071 998822 989316 978935 969742 962757 957320
49548 957320 952431 948078 944760 942327 939962 937142 934054 931078 928244 925234 921658 917264 912175 907156
49534 907156 903542 902590 904660 909097 914958 921752 929320 937261 945034 952637 960750 969955 980210 991269
49520 991269 1003150 1015797 1028549 1040303 1050016 1056867 1060414 1061169 1060836 1061404 1063836 1067735 1072082 1076011
49506 1076011 1079060 1081116 1082104 1081571 1078711 1073002 1064670 1054446 1043232 1032130 1022263 1013931 1006333 998641
49492 998641 991151 984778 979628 974783 969531 964159 959346 955243 951400 947325 942919 938518 934590 931267
49478 931267 928238 925171 922102 919223 916610 914437 913160 913051 913715 914599 915932 918736 923909 931607 941460
49463 941460 952933 965477 978719 992575 1006949 1021386 1035319 1048594 1061406 1073785 1085348
49452 1085348 1095458 1103304 1108049 1109353 1107667 1103594 1097114 1087907 1076267 1062999 1048501 1032674 1015957
49439 1015957 999723 985250 972741 961755 952193 944472 938984 935875 935221 937105 941503 948345 957619
49426 957619 969308 983378 999993 1019530 1042036 1066626 1091730 1115902 1137978 1156199 1167630
49415 1167630 1169309 1160473 1143562 1122897 1102481 1084975 1071948 1064124 1061353 1063075 1069149 1079835
49403 1079835 1094874 1113111 1133344 1155138 1178519 1203236 1228640 1253961 1278402 1301280 1322384
49392 1322384 1341817 1359148 1372992 1381788 1384831 1382428 1375451 1364974 1351799 1335962 1317144 1295980
49380 1295980 1274376 1253999 1235033 1217143 1201138 1188677 1180560 1176244 1175005 1176698 1181178 1187734
49368 1187734 1195403 1203300 1210428 1215632 1218051 1217422 1213902 1207814 1199557 1189519 1178052 1165686 1153134
49355 1153134 1140820 1128679 1116734 1105504 1095341 1085708 1075820 1065785 1056491 1048449 1041399 1034933
49343 1034933 1028864 1022983 1017121 1011507 1006602 1002524 999086 996225 993854 991419 988333 984861 981991 980412
49329 980412 980181 981314 983995 988124 993343 999606 1007172 1015994 1025659 1035970 1046976 1058440 1069911
49316 1069911 1081345 1093031 1104915 1116682 1128502 1140928 1154090 1167705 1181790 1196356 1210341
49305 1210341 1222047 1230957 1238095 1244145 1248357 1249972 1249767 1249304 1249354 1249853 1250820 1252377 1254238 1255929 1257294
49290 1257294 1258236 1258232 1256671 1253373 1248366 1241576 1233179 1223855 1214184 1204204 1194088 1184781 1177288 1171721 1167756
49275 1167756 1165683 1166208 1169332 1174231 1180306 1187793 1197288 1209142 1223334 1239432 1256550 1273572 1289475
49262 1289475 1303217 1313530 1319321 1320404 1317674 1312584 1306589 1301001 1297097 1296165 1299174 1306053 1315424 1325567
49248 1325567 1335707 1345752 1354729 1360511 1361747 1359321 1355089 1349748 1342922 1334845 1326672 1319011 1311325
49235 1311325 1303254 1295734 1290290 1287792 1288397 1292241 1299448 1309640 1322065 1336401 1352988 1372006 1392660
49222 1392660 1413570 1433922 1453836 1473402 1491782 1507756 1520928 1531759 1540447 1546486 1549689 1551022
49210 1551022 1552000 1553637 1556391 1560776 1567418 1576708 1588797 1603691 1620950 1639487 1658092 1676032 1692815
49197 1692815 1707653 1719721 1728759 1734878 1737841 1737146 1732872 1725882 1717067 1706772 1695088 1682316 1668968
49184 1668968 1655641 1643057 1631960 1622762 1615467 1610052 1606774 1606126 1608719 1615281 1626478 1642538 1663126
49171 1663126 1687632 1715417 1745625 1776795 1806682 1832540 1851970 1864064 1870054 1872825 1875514 1880296
49159 1880296 1888010 1898538 1911382 1926045 1942094 1959036 1976334 1993682 2011245 2029576 2049191
49148 2049191 2070079 2091481 2112242 2131641 2149926 2167820 2185533 2202475 2217877 2231314 2242541
49137 2242541 2251356 2257992 2263293 2268057 2272257 2275074 2275478 2272626 2266176 2256711 2245627 2234171 2222681
49124 2222681 2211192 2200527 2192133 2186856 2184544 2185106 2189423 2198755 2213534 2233188 2257103 2285353 2318362
49111 2318362 2356135 2398197 2444275 2494572 2548978 2606183 2664237 2722139 2780249 2838582 2895165
49100 2895165 2946918 2992168 3031312 3064317 3087912 3096196 3084757 3054470 3011184 2961577 2909099
49089 2909099 2853567 2794004 2731239 2667938 2607068 2550983 2501481 2459746 2425950 2399318 2378836
49078 2378836 2363667 2352875 2345149 2339120 2333750 2328242 2321826 2314072 2305480 2297440 2291293 2287417 2285303
49065 2285303 2284431 2284857 2286854 2290245 2294366 2298592 2302632 2306305 2309369 2311750 2313707 2315578 2317459 2319226
49051 2319226 2320738 2321965 2323040 2324237 2325691 2327087 2327925 2328274 2329087 2331568 2336425 2343928 2354442 2368575
49037 2368575 2386857 2409617 2437164 2469826 2507648 2550116 2596236 2644930 2695335 2746671 2797605
49026 2797605 2845748 2887981 2921421 2944080 2954904 2953824 2942079 2922114 2896647 2867863 2837609
49015 2837609 2807942 2780745 2756690 2735038 2714839 2696267 2680619 2669070 2661580 2657092 2654710 2654480
49003 2654480 2656926 2661980 2668655 2675804 2682863 2689722 2696097 2701347 2704821 2706183 2705378 2702471 2697652 2691455
48989 2691455 2684833 2678846 2674100 2670516 2667653 2665114 2662554 2659648 2656346 2652867 2649026 2643844 2636471 2627420
48975 2627420 2618192 2609625 2601305 2592814 2584782 2578195 2573230 2569446 2566816 2565968 2567464 2571316 2577159 2584609
48961 2584609 2593431 2603585 2615064 2627550 2640422 2653210 2665917 2678760 2691847 2705304 2719454
48950 2719454 2734584 2750621 2767116 2783473 2799260 2814606 2830308 2847159 2865269 2884481 2905414
48939 2905414 2929288 2956556 2986542 3018900 3054536 3094373 3137902 3183906 3232169 3283360 3337272
48928 3337272 3392210 3446454 3499829 3553763 3610364 3671531 3738268 3810350 3886689 3966015 4046892
48917 4046892 4126976 4202659 4270029 4326648 4372876 4411617 4446533 4480077 4513042 4545616 4578152
48906 4578152 4610697 4642503 4672737 4701495 4729587 4757532 4785271 4812686 4839770 4866281 4891732
48895 4891732 4915821 4938495 4959619 4978942 4996453 5012492 5027497 5041888 5056041 5070056 5083572
48884 5083572 5096187 5108071 5119886 5132143 5144888 5158030 5171588 5185322 5197973 5206791 5207864 5197254
48872 5197254 5172120 5131067 5073991 5002279 4919093 4828623 4734605 4639726 4546308 4456599 4372016
48861 4372016 4292847 4219260 4151990 4091530 4037256 3987984 3942888 3901338 3862556 3826234 3792910
48850 3792910 3762941 3735684 3710554 3688248 3669857 3655291 3643817 3635738 3632038 3632417 3634984 3638020
48838 3638020 3640733 3642120 3640547 3635176 3626928 3617536 3608369 3600530 3595069 3592450 3592468 3595198 3601347 3611273
48824 3611273 3624404 3640196 3658926 3680898 3705507 3731830 3759692 3789325 3820280 3851490 3882415
48813 3882415 3913544 3945640 3978932 4013153 4048178 4084522 4123304 4165627 4211869 4261607 4314199
48802 4314199 4369375 4427281 4488041 4551119 4614883 4676847 4734553 4786258 4830915 4868076 4898283
48791 4898283 4923229 4945009 4965274 4985218 5005714 5026749 5047086 5065138 5079800 5089753 5092682 5086491
48779 5086491 5071219 5048623 5019960 4985413 4945708 4902747 4857985 4811317 4762204 4710978 4658311
$$ [...]
##END NTUPLES=NMR SPECTRUM
##END=
