##TITLE=AC1513_ROEFFECT0002_8201801_gEHQsjbkxO
##JCAMPDX= 6.0         $$ Bruker NMR JCAMP-DX V2.0
##DATA TYPE= NMR SPECTRUM
##DATA CLASS= NTUPLES
##ORIGIN= BRUKER
##OWNER= Administrator
$$ 1.72 TOPSPIN		Version 2.1
$$ 2013-09-26 18:49:04.643 -0700  Administrator@X
$$ Compression mode = diff/dup
##.OBSERVE FREQUENCY= 400.02188249412
##.OBSERVE NUCLEUS= ^1H
##.ACQUISITION MODE= SIMULTANEOUS (DQD)
##.ACQUISITION SCHEME= undefined
##.AVERAGES= 8
##.DIGITISER RES= 22
##SPECTROMETER/DATA SYSTEM= spect
##.PULSE SEQUENCE= zg30
##.SOLVENT NAME= COFFEE_meoh
##.SHIFT REFERENCE= INTERNAL, COFFEE_meoh, 1, 14.98509
##AUDIT TRAIL= $$ (NUMBER, WHEN, WHO, WHERE, PROCESS, VERSION, WHAT)
$$ ##TITLE= Audit trail, TOPSPIN		Version 2.1
$$ ##JCAMPDX= 5.01
$$ ##ORIGIN= Bruker BioSpin GmbH
$$ ##OWNER= Administrator
$$ $$ E:\/data/COFFEE/nmr/AC1513_ROEFFECT0002_8201801_gEHQsjbkxO/10/pdata/1/auditp.txt
$$ ##AUDIT TRAIL=  $$ (NUMBER, WHEN, WHO, WHERE, PROCESS, VERSION, WHAT)
(   1,<2013-09-26 18:48:57.721 -0700>,<Administrator>,<X>,<go>,<TOPSPIN 2.1>,
      <created by zg
	started at 2013-09-26 18:47:51.627 -0700,
	POWCHK enabled, PULCHK disabled,
       configuration hash MD5:
       C8 4E 4E 5D D3 5C D8 9E 9F 52 82 E0 59 8A DE 15
       data hash MD5: 64K
       C9 74 AB 59 56 A9 A6 A9 36 6D E7 FC 8B FE 48 68>)
(   2,<2013-09-26 18:49:00.643 -0700>,<Administrator>,<X>,<proc1d>,<TOPSPIN 2.1>,
      <Start of raw data processing
       efp LB = 0 FT_mod = 6 PKNL = 1 PHC0 = 0 PHC1 = 0 SI = 32K 
       data hash MD5: 32K
       D4 5F BC 24 28 23 07 95 20 AC 70 D9 62 63 2A 0E>)
(   3,<2013-09-26 18:49:01.096 -0700>,<Administrator>,<X>,<proc1d>,<TOPSPIN 2.1>,
      <pk PHC0 = 91.37329 PHC1 = 0 
       data hash MD5: 32K
       E7 E3 71 D6 78 B8 B8 4E F2 E7 1A C8 37 D7 B2 F4>)
(   4,<2013-09-26 18:49:01.221 -0700>,<Administrator>,<X>,<proc1d>,<TOPSPIN 2.1>,
      <abs ABSG = 1 
       data hash MD5: 32K
       A9 E6 A7 D1 00 4E 55 6F 03 8A 4B 7D 5A DC 60 4D>)
(   5,<2013-09-26 18:49:01.283 -0700>,<Administrator>,<X>,<proc1d>,<TOPSPIN 2.1>,
      <abs ABSG = 2 
       data hash MD5: 32K
       6D 1F 30 73 DE 22 A0 DD 31 B6 43 7D B8 19 46 AE>)
(   6,<2013-09-26 18:49:01.330 -0700>,<Administrator>,<X>,<proc1d>,<TOPSPIN 2.1>,
      <abs ABSG = 3 
       data hash MD5: 32K
       63 F4 81 1F BA BF 11 99 4D 1F C5 98 F6 EB BA 6D>)
(   7,<2013-09-26 18:49:01.424 -0700>,<Administrator>,<X>,<proc1d>,<TOPSPIN 2.1>,
      <abs ABSG = 4 
       data hash MD5: 32K
       9C 41 A1 1A D2 4C 95 8D F2 D6 4C F1 E6 24 77 8B>)
(   8,<2013-09-26 18:49:01.471 -0700>,<Administrator>,<X>,<proc1d>,<TOPSPIN 2.1>,
      <abs ABSG = 5 
       data hash MD5: 32K
       5E 7B B6 25 F6 AD 31 86 8A 92 27 45 B2 E4 1B 29>)
$$ ##END=
$$ 
$$ $$ hash MD5
$$ $$ F9 BD 13 FB C1 FD 7A 99 D0 E1 E9 B5 94 33 75 09
##$RELAX= 
##$RELAX= 
##$RELAX= 
##$RELAX= 
##$RELAX= 
##$RELAX= 
##$RELAX= 
$$ Bruker specific parameters
$$ --------------------------
##$DU= <E:\>
##$EXPNO= 10
$$ [...]
150 150 150 150 150 150 150 150
##$TP07= 0
##$TPNAME0= <>
##$TPNAME1= <>
##$TPNAME2= <>
##$TPNAME3= <>
##$TPNAME4= <>
##$TPNAME5= <>
##$TPNAME6= <>
##$TPNAME7= <>
##$TPOAL= (0..7)
0.5 0.5 0.5 0.5 0.5 0.5 0.5 0.5
##$TPOFFS= (0..7)
0 0 0 0 0 0 0 0
##$TUNHIN= 0
##$TUNHOUT= 0
##$TUNXOUT= 0
##$USERA1= <user>
##$USERA2= <user>
##$USERA3= <user>
##$USERA4= <user>
##$USERA5= <user>
##$V9= 5
##$VALIST= <valist>
##$VCLIST= <CCCCCCCCCCCCCCC>
##$VD= 0
##$VDLIST= <DDDDDDDDDDDDDDD>
##$VPLIST= <PPPPPPPPPPPPPPP>
##$VTLIST= <TTTTTTTTTTTTTTT>
##$WBST= 1024
##$WBSW= 4
##$XGAIN= (0..3)
0 0 0 0
##$XL= 0
##$YL= 0
##$YMAX_a= 647619
##$YMIN_a= -555990
##$ZGOPTNS= <>
##$ZL1= 120
##$ZL2= 120
##$ZL3= 120
##$ZL4= 120
##$ABSF1= 14.98509
##$ABSF2= -5.573092
##$ABSG= 5
##$ABSL= 3
##$ALPHA= 0
##$AQORDER= 0
##$ASSFAC= 0
##$ASSFACI= 0
##$ASSFACX= 0
##$ASSWID= 0
##$AUNMP= <proc_prof1d_extract_pilot.lims>
##$AXLEFT= 0
##$AXNAME= <>
##$AXNUC= <1H>
##$AXRIGHT= 0
##$AXTYPE= 0
##$AXUNIT= <>
##$AZFE= 0.1
##$AZFW= 0.1
##$BCFW= 0
##$BC_mod= 0
##$BYTORDP= 0
##$COROFFS= 0
##$CY= 15
##$DATMOD= 1
##$DC= 0
##$DFILT= <>
##$DTYPP= 0
##$F1P= 0
##$F2P= 0
##$FCOR= 0.5
##$FTSIZE= 32768
##$FT_mod= 6
##$GAMMA= 0
##$GB= 0
##$INTBC= 1
##$INTSCL= 1
##$ISEN= 128
##$LB= 0
##$LEV0= 0
##$LPBIN= 0
##$MAXI= 10000
##$MC2= 0
##$MEAN= 0
##$ME_mod= 0
##$MI= 0
##$NCOEF= 0
##$NC_proc= -8
##$NLEV= 6
##$NOISF1= 0
##$NOISF2= 0
##$NSP= 0
##$NTH_PI= 0
##$NZP= 0
##$OFFSET= 14.98509
##$PC= 1
##$PHC0= 91.37329
##$PHC1= 0
##$PH_mod= 1
##$PKNL= yes
##$PPARMOD= 0
##$PPDIAG= 0
##$PPIPTYP= 0
##$PPMPNUM= 2147483647
##$PPRESOL= 1
##$PSCAL= 4
##$PSIGN= 0
##$PYNMP= <proc.py>
##$REVERSE= no
##$SF= 400.02
##$SI= 32768
##$SIGF1= 0
##$SIGF2= 0
##$SINO= 400
##$SIOLD= 32768
##$SPECTYP= <>
##$SREGLST= <1H.CDCl3>
##$SSB= 0
##$STSI= 32768
##$STSR= 0
##$SW_p= 8223.68421052631
##$SYMM= 0
##$S_DEV= 0
##$TDeff= 65536
##$TDoff= 0
##$TI= <>
##$TILT= no
##$TM1= 0
##$TM2= 0
##$TOPLEV= 0
##$USERP1= <user>
##$USERP2= <user>
##$USERP3= <user>
##$USERP4= <user>
##$USERP5= <user>
##$WDW= 1
##$XDIM= 32768
##$YMAX_p= 488378368
##$YMIN_p= -762478
##$CURPLOT= <Network HP LaserJet P1505>
##$CURPRIN= <$Network HP LaserJet P1505>
##$DFORMAT= <normdp>
##$LAYOUT= <+/1D_H.xwp>
##$LFORMAT= <normlp>
##$PFORMAT= <normpl>
##$SURQMSG= 1
$$ End of Bruker specific parameters
$$ ---------------------------------
##NTUPLES= NMR SPECTRUM
##VAR_NAME=  FREQUENCY,     SPECTRUM/REAL,   SPECTRUM/IMAG
##SYMBOL=    X,             R,               I
##VAR_TYPE=  INDEPENDENT,   DEPENDENT,       DEPENDENT
##VAR_FORM=  AFFN,          ASDF,            ASDF
##VAR_DIM=   32768,         32768,           32768
##UNITS=     HZ,            ARBITRARY UNITS, ARBITRARY UNITS
##FACTOR=    0.250966925370066, 1,           1
##FIRST=     8223.43324360094, -34654,       -144476
##LAST=      0,             -127404,         -102095
##MIN=       0,             -762478,         0
##MAX=       8223.43324360094, 488378368,    0
$$ Real data points
##PAGE= N=1
##DATA TABLE= (X++(R..R)), XYDATA
$$ [...]
19533c08795h928j99565k2463c1771C8738e6386A12997D5101L20139c8687A59144
$$ -308795 -8928 -208493 -230956 -31771 38738 -56386 112997 45101 365240 -38687 159144
19521A54109b36789A01618N5802a54088d2951q6892J85C0285d7484a2917k79219
$$ 154109 -236789 101618 157420 -154088 -42951 -129843 -129658 30285 -47484 -12917 -292136
19510b92136J3011J06566k8894a7871p4885E6017j5604b41592g5046j99464G112
$$ -292136 -279125 -172559 -201453 -17871 -92756 56017 40413 -241592 -75046 -274510 7112
19498A2580g8371A16509a33718c8001j15409b8609D8945a17259j72721B27258
$$ 12580 -78371 116509 -133718 -38001 -153410 -28609 48945 -117259 -289980 227258
19487B61035f7112A194b5007j85737B15613D2776J32131E4760a96415j7376r2976
$$ 261035 -67112 1194 -25007 -210744 215613 42776 174907 54760 -196415 -213791 -306767
19476c06767a48498l5978n1870B78676a48451j92765a3118k13883Q5155F3286
$$ -306767 -148498 -184476 -236346 278676 -148451 -341216 -13118 -227001 -141846 63286
19465C0927b29245J6769L4624B16726b26313B66134a36263B38710C4660K56309
$$ 30927 -229245 -212476 -177852 216726 -226313 266134 -136263 238710 34660 290969
19455B90969b5221A7317J42542M963h9171k01368J16701o8775H6059c1378B50832
$$ 290969 -25221 17317 159859 164822 -89171 -290539 -173838 -242613 86059 -31378 250832
19443A68929a91390P7487R64a4864F3901a0844D9998a80721h6656O042j35911
$$ 168929 -191390 -113903 -112939 -14864 63901 -10844 49998 -180721 -86656 -80614 -216525
19432b16525l9573F3914c67130a80930K1683J4J4826l68071a03337F3956a41807
$$ -216525 -256098 63914 -367130 -180930 -159247 -159233 -144407 -512478 -103337 63956 -141807
19420a33769A19709i9257l683F7603K4929J80072H049b31860P2991n6541a137
$$ -133769 119709 -99257 -102940 67603 92532 272604 8049 -231860 -158869 -215410 -1137
19408H6117A59K01485a24260Q185j46116k5904a17685b1078o5638j6268l1883
$$ 86117 159 201644 -124260 -116075 -262191 -288095 -117685 -21078 -86716 -102984 -134867
19397a34867A5931J99574j0067q9571b05140d0062o9942H7262c85302e47A000
$$ -134867 15931 215505 205438 115867 -205140 -40062 -110004 87262 -385302 -547 1000
19385E2119c62673c8085A12565g9739G6556e3903l32372a71612M6614A38424B3077
$$ 52119 -362673 -38085 112565 -79739 76556 -53903 -386275 -171612 -124998 138424 23077
19373g60p710A67174m9290a69993b4524C61650D9598b64840e8235r3643D5230
$$ -760 -8470 167174 117884 -169993 -24524 361650 49598 -264840 -58235 -151878 45230
19361B494h9512D3182b31295r5363g4759F2167a02985M9183F1203L9089a34483
$$ 2494 -89512 43182 -231295 -326658 -74759 62167 -102985 -53802 61203 100292 -134483
19349b17883g8234l1815C16314A87b62164d8319b322q7514j0685j40169d5583
$$ -217883 -78234 -110049 316314 187 -262164 -48319 -2322 -89836 -100521 -240690 -45583
19337C4419J37922i2106p7164g3401j53899P2044o8451I2832a26448m648I446
$$ 34419 172341 -92106 -169270 -73401 -227300 -155256 -223707 92832 -126448 -131096 9446
19325c07408J2824A25215b8934j45721D8932b41443i7655m7744C58972a82470
$$ -307408 -294584 125215 -28934 -174655 48932 -241443 -97655 -145399 358972 -182470
19314b62555J3173Q8196A3683b85627C8231e8414a2024m35808I8055h8295j36130
$$ -262555 -249382 -161186 13683 -285627 38231 -58414 -12024 -447832 98055 -88295 -224425
19303b24425A34316b19325j49086H7516b22524J6897j4536C3729d6595j80017
$$ -224425 134316 -219325 -368411 87516 -222524 -205627 -220163 33729 -46595 -226612
19293b26612A03132C2454A6206d21195a73801g6127F4300N567k4306i0479C33721
$$ -226612 103132 32454 16206 -421195 -173801 -76127 64300 69867 45561 -90479 333721
19281i9834E0299a37826L903K7884B77052b01033A9526a9697A76022c1326l90825
$$ -99834 50299 -137826 -133923 -106039 277052 -201033 19526 -19697 176022 -31326 -422151
19270d22151c6580A78531a4819j49845D5866b0308j12215f1725f874o4297o7800
$$ -422151 -36580 178531 -14819 -164664 45866 -20308 -132523 -61725 -6874 -71171 -138971
19259a38971C983a14467B06770M6528a61459G7206M0815a14786L4923D8189K5263
$$ -138971 3983 -114467 206770 253298 -161459 77206 118021 -114786 -79863 48189 73452
19248G3452b7137k84747N8124J17567A90761I5093Q8765a16896k62755F5104b26483
$$ 73452 -27137 -311884 -253760 -136193 190761 95093 183858 -116896 -379651 65104 -226483
19236E8892J51144r4667c43171D4689c13671E0807a01619A06289a42062j50995
$$ 58892 210036 115369 -343171 44689 -313671 50807 -101619 106289 -142062 -293057
19226b93057a38036j03483A30894a84426C4396a25480j0780D4325J10204g4667
$$ -293057 -138036 -241519 130894 -184426 34396 -125480 -136260 44325 154529 -74667
19215a15227i282k61600a13817B64660b91068J38152m1706C49914b4737j89026
$$ -115227 -9282 -270882 -113817 264660 -291068 -152916 -194622 349914 -24737 -213763
19205b13763N4219d1383k02196A10832b50740q807o4042m0916h6014L0634H6861
$$ -213763 -159544 -41383 -243579 110832 -250740 -259547 -323589 -364505 -86014 -55380 86861
19193D8297h2827m444A23805d86875E8334g01269L17148g1729A72737a45814L7825
$$ 48297 -82827 -87271 123805 -486875 58334 -701269 -384121 -71729 172737 -145814 -107989
19182a07989A91244f0077B09669i2957m7563B2992L7845k1698a99616N0597n2841
$$ -107989 191244 -60077 209669 -92957 -140520 22992 60837 39139 -199616 -149019 -201860
19171b01860A04213f2013l26991e3855l5269o7361r9894A1026i9736B62732G2921
$$ -201860 104213 -62013 -389004 -53855 -89124 -156485 -256379 11026 -99736 262732 72921
19159b12513j58413d2189k0210C21276h5620b4879A73456m8061M377b54145C2241
$$ -212513 -370926 -42189 -62399 321276 -85620 -24879 173456 125395 129772 -254145 32241
19147d0228k19326B3248a8087k11762B34332e7213i133l64216A16496a1599I1552
$$ -40228 -259554 23248 -18087 -229849 234332 -57213 -9133 -373349 116496 -11599 91552
19135A59554b6342A08669h6969b2556j96468j50409M2644a17371o2129A22636
$$ 159554 -26342 108669 -86969 -22556 -219024 -369433 -326789 -117371 -179500 122636
19124b2046q3670L9604j12805c4075j11651l38776e8689b0130j43459L9939j10129
$$ -22046 -105716 -66112 -178917 -34075 -145726 -484502 -58689 -20130 -163589 -123650 -233779
19113b33779M8399A47437b1231o0342k11958a2988k0286j45629j02248l46a10657
$$ -233779 -185380 147437 -21231 -81573 -293531 -12988 -33274 -178903 -281151 -281497 -110657
19101c21010A97453c19958J56139b5542C12612l7725d6777p791Q252e37j56931
$$ -321010 197453 -319958 -163819 -25542 312612 274887 -46777 -54568 -46316 -537 -157468
19090a57468C0589c2255B3184c69967H0501L6189R321a14548A86632a95699N9771
$$ -157468 30589 -32255 23184 -369967 80501 116690 126011 -114548 186632 -195699 -135928
19079a35928k13475a52807G9111a52369d5938j6716J0792j6510B75896g9657B55680
$$ -135928 -349403 -152807 79111 -152369 -45938 -62654 -51862 -68372 275896 -79657 255680
19067a20641k7793q6189A57219a72276q7337R0901m6571H1322a84878M2173c8949
$$ -120641 -148434 -234623 157219 -172276 -259613 -168712 -215283 81322 -184878 -142705 -38949
19055c59683h2359j34299D4955a37987A65586c6917A02218J37155F9156c24978
$$ -359683 -82359 -216658 44955 -137987 165586 -36917 102218 239373 69156 -324978
19044e3292B17609Q9661A24602h8269a7472A24898C9680h7465m7821d7574A4882
$$ -53292 217609 307270 124602 -88269 -17472 124898 39680 -87465 -135286 -47574 14882
19032B40276c9759C61581b76852A43070L9509B1733K55828h1532j4344C85645
$$ 240276 -39759 361581 -276852 143070 182579 21733 277561 -81532 -95876 385645
19021A78811a60432l3627C66969b05899H4611a46294J5768j80706B26902h7369
$$ 178811 -160432 -194059 366969 -205899 84611 -146294 -130526 -311232 226902 -87369
19010a56130F2675J60062g370m9776J8082j02405j33835o060F3092a20231D4464
$$ -156130 62675 222737 -7370 -57146 -39064 -141469 -275304 -281364 63092 -120231 44464
18998a71351A31028E2173b74534f3579k30636a6146k14170e1591D386a54121l4789
$$ -171351 131028 52173 -274534 -63579 -294215 -16146 -230316 -51591 4386 -154121 -188910
18987a88910f8457E5147K16946K5196b03069d253l36612d2246F5440l0233c38243
$$ -188910 -68457 55147 272093 297289 -203069 -4253 -340865 -42246 65440 35207 -338243
18975B15676a46678k3637k73014J60619a16003k85988B71635l6685g6224G648
$$ 215676 -146678 -170315 -443329 -282710 -116003 -401991 271635 234950 -76224 7648
18964D2294a75867a5958k53952A58538a00847I9059c9894B9448b69683K8318d1941
$$ 42294 -175867 -15958 -269910 158538 -100847 99059 -39894 29448 -269683 -241365 -41941
18952b24401A8303I099J81005a73826i728l53269a76734a0706H8309a14984j29631
$$ -224401 18303 9099 190104 -173826 -9728 -362997 -176734 -10706 88309 -114984 -244615
18941b44615C50299j33499J03289j36915h9000F7445b45440A31950L9494d3426
$$ -244615 350299 216800 320089 183174 -89000 67445 -245440 131950 171444 -43426
18930A2579h5k26365g6417j03690k5592p5635K9358A57166b72023B07609d08493
$$ 12579 -85 -226450 -76417 -180107 -205699 -281334 -251976 157166 -272023 207609 -408493
18918A10271a25423C696d33248A42000c44119B80394i4562P46p302a0911k88751
$$ 110271 -125423 3696 -433248 142000 -344119 280394 -94562 -93816 -101118 -10911 -299662
18907b99662F791J25069c01834j26328B68798p2026b08533A0796K09151b68234
$$ -299662 6791 131860 -301834 -428162 268798 196772 -208533 10796 219947 -268234
18896g0858A19743a88030k8107B23001C0310f4672d714B91391a91281O1702l1944
$$ -70858 119743 -188030 -216137 223001 30310 -64672 -4714 291391 -191281 -129579 -161523
18885a61523E7570a19132j9026b3869A35756a6735k2477l5002j19906C12408h2198
$$ -161523 57570 -119132 -138158 -23869 135756 -16735 -39212 -74214 -194120 312408 -82198
18873A67425a1087F0331k0835b53154g3151B0587K15270A4068b33220E1015K77626
$$ 167425 -11087 60331 39496 -253154 -73151 20587 235857 14068 -233220 51015 328641
18862C28641B2723d91323i187A16671d8070k53293k0705e8367r0664C7365c48972
$$ 328641 22723 -491323 -9187 116671 -48070 -301363 -322068 -58367 -149031 37365 -348972
18850A71467a22551B05876A3912K90487a67908G2246a93966A80670D2705c2401
$$ 171467 -122551 205876 13912 304399 -167908 72246 -193966 180670 42705 -32401
18839G0487O7078i7820o5014A31306N6204B4595c3918B55016e241j18850j07152
$$ 70487 137565 -97820 -162834 131306 187510 24595 -33918 255016 -5241 -124091 -231243
18828b31243g6437j73439d0488j42005B03250b91779k6412H364a6552D4266J4678
$$ -231243 -76437 -249876 -40488 -182493 203250 -291779 -318191 8364 -16552 44266 58944
18817E8944B3354M20147g190l25442J55537A70544b30578C182R1184M8392k5822
$$ 58944 23354 443501 -7190 -332632 -177095 170544 -230578 3182 94366 142758 116936
18806A16936D8919c39337G2669a5021A72119b06638r2969J45614P1818A41740
$$ 116936 48919 -339337 72669 -15021 172119 -206638 -299607 -153993 -82175 141740
18795A976e4278k89812a3274o8510b1978j24306A53395e534A03362O5205p0995
$$ 1976 -54278 -344090 -13274 -81784 -21978 -146284 153395 -5534 103362 168567 97572
18784I7572J67137g5486J6492D4150N4633K89226d8770k28117i2028B08988q1334
$$ 97572 264709 -75486 -58994 44150 98783 388009 -48770 -276887 -92028 208988 127654
18773A27654a0833M278D03336F9883b93591E6333B5606e6196n2026j51452f3858
$$ 127654 -10833 -6555 403336 69883 -293591 56333 25606 -56196 -108222 -259674 -63858
18761b13649O740A9459J3548m606Q2915a66784D541g1363r1971B08297l3319b57233
$$ -213649 -206909 19459 33007 28401 111316 -166784 4541 -71363 -163334 208297 174978 -257233
18748C8532L02498c42375A35481b38076A1177a51408N1450j7245b2155l31703
$$ 38532 341030 -342375 135481 -238076 11177 -151408 -99958 -117203 -22155 -353858
18738c53858a57296j25867j39260Q9363h1237k16133C90728a10374A42538b76024
$$ -353858 -157296 -283163 -422423 -333060 -81237 -297370 390728 -110374 142538 -276024
18727I8919I648c02107D3574a61016r0213a46r4648A62420b5825l03158J35624
$$ 98919 9648 -302107 43574 -161016 -251229 -146 -94794 162420 -25825 -328983 -193359
18716a93359A70210b58640I4802b37376e4833A75848E1651a58569q0668M2249
$$ -193359 170210 -258640 94802 -237376 -54833 175848 51651 -158569 -239237 -196988
18706a96988B57334b2146j31969k45608J02023A0731c16584f7034k99050a51074
$$ -196988 257334 -22146 -154115 -399723 -297700 10731 -316584 -67034 -366084 -151074
18695a49382p5503R8872B02217a79027d8495B67261b13757d003j64431r8043C16848
$$ -149382 -224885 -126013 202217 -179027 -48495 267261 -213757 -4003 -168434 -266477 316848
18683b92126i1082m6144A05723a42290A58100b67524A50679c46107A29609J95382
$$ -292126 -91082 -137226 105723 -142290 158100 -267524 150679 -346107 129609 324991
18673C24991A17847A324i7643m959f692D2314a80982A62194J14223b71918a02386
$$ 324991 117847 1324 -97643 -102602 -6692 42314 -180982 162194 276417 -271918 -102386
18661a3453j98273A09347K04470a8762m50163a14526L7585l7358k417A58058a26208
$$ -13453 -211726 109347 313817 -18762 -468925 -114526 -76941 -114299 -116716 158058 -126208
18649a40870o3204D63598a44826m60518a99906A03124J36089I1622k4525M3499
$$ -140870 -204074 463598 -144826 -605344 -199906 103124 239213 91622 67097 110596
18639A10596d5941k38652A22571d2065j17077j97684l6349J91462q760j34856
$$ 110596 -45941 -284593 122571 -42065 -159142 -356826 -393175 -201713 -210473 -345329
18629c45329a64997I222e7857A63537a24072o8161j45995j802C71346F8458i7853
$$ -345329 -164997 9222 -57857 163537 -124072 -192233 -338228 -340030 371346 68458 -97853
18617A41807a64272A47426a31829c2898k76429C3194a63308k1907p683H1889b8940
$$ 141807 -164272 147426 -131829 -32898 -309327 33194 -163308 -185215 -192898 81889 -28940
18605e0484j17592M4569k58874A90435b59678D6562g813D3268a47414j2536H2798
$$ -50484 -168076 -123507 -382381 190435 -259678 46562 -7813 43268 -147414 -159950 82798
18593A47948B1782a58797c1946j43721o9178A97541a12742d0451A6117b08814
$$ 147948 21782 -158797 -31946 -175667 -244845 197541 -112742 -40451 16117 -208814
18582g0399n4082p5351A8909a41837F7268K4965i950A29493b75947A8171a37976
$$ -70399 -124481 -199832 18909 -141837 67268 92233 -9950 129493 -275947 18171 -137976
18570A46169b32713O4549j07055O1654f0434k88002a62921B53803a38133N9414
$$ 146169 -232713 -168164 -275219 -213565 -60434 -348436 -162921 253803 -138133 -78719
18560g8719F8812h683A62985a584k18251A363L323h8163n8987j03873B06114a15327
$$ -78719 68812 -8683 162985 -1584 -219835 1363 4686 -88163 -147150 -251023 206114 -115327
18547a0959n03908d0644A02963a28506c1318P386r5901M3714B16291b64077c1254
$$ -10959 -514867 -40644 102963 -128506 -31318 -23932 -119833 -76119 216291 -264077 -31254
18535i8443B09132b19354a6739E5506b30797N1559g0057j99182D18479A26488
$$ -98443 209132 -219354 -16739 55506 -230797 -179238 -70057 -269239 418479 126488
18524e7676j76250Q2477J8485C2122J3427j5994g4372l3819L0240I1957h6108
$$ -57676 -233926 -151449 -132964 32122 45549 29555 -74372 -108191 -77951 91957 -86108
18512A29555a97631g1387G5b97295a08768p0515J1582C36315c18767F3568d74100
$$ 129555 -197631 -71387 75 -297295 -108768 -179283 -167701 336315 -318767 63568 -474100
18500b59018B56152D7194K5034a1062r3716B31052c98316J66680j51391H0824
$$ -259018 256152 47194 72228 -11062 -104778 231052 -398316 -231636 -383027 80824
18489b21797f9992j05145m7220l8053J08929j5290k33995H625M4284b84987g7884
$$ -221797 -69992 -175137 -222357 -260410 -151481 -166771 -400766 8625 52909 -284987 -77884
18477D9607a23256l50803J70708a47259C10221a26j4449r7127N2666j46658B5984
$$ 49607 -123256 -474059 -303351 -147259 310221 -126 -14575 -111702 -59036 -205694 25984
18465c79955a60332A31604c42024Q8346R4460m9314C45231a48267e6126j7040
$$ -379955 -160332 131604 -342024 -253678 -159218 -208532 345231 -148267 -56126 -73166
18455g3166m5777B479f5350k90371J41380A51609c28453a45197A83581a12073
$$ -73166 -118943 2479 -65350 -355721 -214341 151609 -328453 -145197 183581 -112073
18444a36060O6021H5281J61614a97079A26257a53202k597A72655C7824Q9176i5995
$$ -136060 -70039 85281 246895 -197079 126257 -153202 -155799 172655 37824 127000 -95995
18432C8684a63059j39621B48307i1396j50288c0026I2416a24201C92210d8241
$$ 38684 -163059 -302680 248307 -91396 -241684 -30026 92416 -124201 392210 -48241
18421c9790H7158a66208H232i686k56432b1375A11548a23853H8202B8439L8719
$$ -39790 87158 -166208 8232 -9686 -266118 -21375 111548 -123853 88202 28439 67158
18410F7158g4359A12228a67423A02026K870k1791B8230f47422e1621A61778c57001
$$ 67158 -74359 112228 -167423 102026 104896 83105 28230 -647422 -51621 161778 -357001
18398b9690j05193K1270B21828a88760b2007B79347e0979E698J24665J69577a26807
$$ -29690 -134883 -113613 221828 -188760 -22007 279347 -50979 5698 130363 299940 -126807
18386A09628d2425n8478G1931d4240A35854b79610g3763A23704L92b11819j35451
$$ 109628 -42425 -100903 71931 -44240 135854 -279610 -73763 123704 124096 -211819 -347270
18375c47270D5175P546a7810j71532g9979B07688i9915B3411a14842I7654h4224
$$ -347270 45175 52721 -17810 -189342 -79979 207688 -99915 23411 -114842 97654 -84224
18363d69945I5332a05499b0928B9041j0641b41050R0239A0348N7223a87855B55215
$$ -469945 95332 -105499 -20928 29041 18400 -241050 -150811 10348 67571 -187855 255215
18351E5081B4502a87550O7557C22284a23528C0036c73901E8255a21780k66025
$$ 55081 24502 -187550 -119993 322284 -123528 30036 -373901 58255 -121780 -387805
18341c87805i9218B55933a04729E5491h747j10994K7239k09602g8798o5527j4133
$$ -387805 -99218 255933 -104729 55491 -8747 -119741 -92502 -302104 -78798 -144325 -158458
18330a58458N0261B34740A15110R9832f8263a655k37917Q3927K5931d7464C0185
$$ -158458 -108197 234740 115110 214942 -68263 -1655 -239572 -155645 -129714 -47464 30185
18318A66179i5165j27385p0726k6123F5661a14184M0991E1980J06372k7843h9713
$$ 166179 -95165 -222550 -293276 -319399 65661 -114184 -73193 51980 158352 130509 -89713
18306F3442c7456c394A97679E3651N0419c82958A46249b51592B75063c68836J15686
$$ 63442 -37456 -3394 197679 53651 104070 -382958 146249 -251592 275063 -368836 -253150
18295b53150b1235m2654A04243m7599b78925A08159i8157L6124A47221m5466m2757
$$ -253150 -21235 -63889 104243 56644 -278925 108159 -98157 -62033 147221 101755 58998
18284E8998J68916i3981k50975K0008H9774K29420A29472c54742a47205e5846
$$ 58998 227914 -93981 -344956 -324948 89774 319194 129472 -354742 -147205 -55846
18273A7354d6215k43447C92386d46284G5465c1246A31338P7676c50921a03074
$$ 17354 -46215 -289662 392386 -446284 75465 -31246 131338 209014 -350921 -103074
18262b6372k87986R7482b0482k32921h4130a6039p1182k04056A60243C025K14059
$$ -26372 -314358 -216876 -20482 -253403 -84130 -16039 -87221 -291277 160243 3025 217084
18251B17084a63072O9930b7379N639j20718d4819l68187b4010k9149I400c4384
$$ 217084 -163072 -93142 -27379 -21740 -142458 -44819 -413006 -24010 -53159 9400 -34384
18239E7989a07665O118j15741K7207A87040b46438A29037H592g7022j7533j951
$$ 57989 -107665 -101547 -217288 -190081 187040 -246438 129037 8592 -77022 -94555 -96506
18228i6506H5266H333J41207Q813a26583E8635a14649E8820K08705l4539a38726
$$ -96506 85266 8333 149540 158353 -126583 58635 -114649 58820 267525 232986 -138726
18216H0714R7934a14296d0526j2877C77429c6316k15197B29830J66546a25218
$$ 80714 178648 -114296 -40526 -53403 377429 -36316 -251513 229830 396376 -125218
18205b98521i3435q0829A14131Q2922i8165K1811A49769a98865f1917A25738b02124
$$ -298521 -93435 -174264 114131 197053 -98165 -76354 149769 -198865 -61917 125738 -202124
18193C22785I2916e462F0844M821O1815d4830k78434F5575b95690a18440q2928
$$ 322785 92916 -5462 60844 65665 127480 -44830 -323264 65575 -295690 -118440 -201368
18182b01368L7239j60770D0903J73006a46191r0310d7313j44379f0923R290F4759
$$ -201368 -164129 -324899 40903 213909 -146191 -236501 -47313 -191692 -60923 -51633 64759
18170a42490B07153b86139j62261a47060D25736I4551a63222J078k77469J26393
$$ -142490 207153 -286139 -448400 -147060 425736 94551 -163222 -162144 -439613 -313220
18160c13220B0607c32415a14510E43L93959a36289j85431C39039C4906J70815
$$ -313220 20607 -332415 -114510 543 394502 -136289 -321720 339039 34906 205721
18150B05721J85963i4536k3783C8985a09981N1486E679c58099C95654a279j76840
$$ 205721 391684 -94536 -118319 38985 -109981 -58495 5679 -358099 395654 -1279 -178119
18139a78119J025g7354b4508l41293i3277k11607a6965C94897c50652g8389q3106
$$ -178119 -177094 -77354 -24508 -365801 -93277 -304884 -16965 394897 -350652 -78389 -161495
18128a61495B43027j05059b5497k5359L893B70166a47142M9276j54371A891a37856
$$ -161495 243027 137968 -25497 -50856 -46963 270166 -147142 -97866 -252237 1891 -137856
18116b936j57663J3628k418q3624B2600Q1118O7237G7523A4333a31506m7116M5659
$$ -2936 -160599 -146971 -149389 -233013 22600 103718 170955 77523 14333 -131506 -178622 -132963
18104a32963o5249A13072a35959N4006I7127a30416k50409A45224n2722K51858
$$ -132963 -198212 113072 -135959 -81953 97127 -130416 -380825 145224 92502 344360
18094C44360b76108E6265a38679B73924c28582C06477b84458A85536A779K26151
$$ 344360 -276108 56265 -138679 273924 -328582 306477 -284458 185536 1779 227930
18084B27930K6714d7245C09957a77509B64073j20930j062a66888A82830c26333
$$ 227930 254644 -47245 309957 -177509 264073 143143 142081 -166888 182830 -326333
18073b53462A0554a48134b6677m8920q4507b4451m1944K5150k69646B33109L0784
$$ -253462 10554 -148134 -26677 -75597 -160104 -24451 -66395 -41245 -310891 233109 263893
18062B63893b7938P608j59861A3257N3617J7446h3337G4446j4726a84481B4488
$$ 263893 -27938 -20330 -180191 13257 66874 84320 -83337 74446 59720 -184481 24488
18050F8460b38945j6819d5805H1429i2846F1664J88397d3900k48464g2364a3547
$$ 68460 -238945 -255764 -45805 81429 -92846 61664 250061 -43900 -292364 -72364 -13547
18038a85948A56264k061b73244c6839k59771B621b47745B0468K3509b43828n1798
$$ -185948 156264 154203 -273244 -36839 -296610 2621 -247745 20468 43977 -243828 -295626
18027b95626D7690h4631m05517b18019C13136m9483a07060a8894H3548k4525a41788
$$ -295626 47690 -84631 -490148 -218019 313136 263653 -107060 -18894 83548 59023 -141788
18015E954K29050c8124A0487a22197J0011E2893M4134b03261b3005A24329b2123
$$ 5954 235004 -38124 10487 -122197 -112186 52893 97027 -203261 -23005 124329 -22123
18003g2574I5900c94980a48181C51985A60167b58035C5841N31981d08799i7058
$$ -72574 95900 -394980 -148181 351985 160167 -258035 35841 567822 -408799 -97058
17992E4323e4648k01661J02463B23051h1270A3679b5695p3445A16903d20525c8246
$$ 54323 -54648 -256309 -153846 223051 -81270 13679 -25695 -99140 116903 -420525 -38246
17980f2540k1519c2237B01236I0413J85157j09343J12817E0231a57174J1446K688
$$ -62540 -84059 -32237 201236 90413 275570 166227 279044 50231 -157174 -145728 -143040
17969a43040A40573L5825a23313B1340L47610A14519a34080A19508n124b66468
$$ -143040 140573 176398 -123313 21340 368950 114519 -134080 119508 114384 -266468
17958c69384a31553l14271H268R4097a14553p8419A25685h7325o5589l8384b1627
$$ -369384 -131553 -445824 8268 102365 -114553 -192972 125685 -87325 -152914 -191298 -21627
17946c6774q0361E4097i9774j07415e3365l368E7235M45039a15104j34722A43254
$$ -36774 -117135 54097 -99774 -207189 -53365 -56733 57235 502274 -115104 -249826 143254
17934c45121H9398a60452L1598F3079b01109B9261J84995c21624A57902b43053
$$ -345121 89398 -160452 -128854 63079 -201109 29261 214256 -321624 157902 -243053
17923A30259a40515f6070l0275B78095E0159M4457c48439I7515c20059O1485A27572
$$ 130259 -140515 -66070 -96345 278095 50159 94616 -348439 97515 -320059 -258574 127572
17911b02351B88342b33071N8284q0014a0668r9597j21740A23389J14634n2598
$$ -202351 288342 -233071 -174787 -254801 -10668 -110265 -232005 123389 238023 185425
17901A85425a68996c3302G2051R4158q1836C8589e6231k54930B0687h6145C7009
$$ 185425 -168996 -33302 72051 166209 84373 38589 -56231 -311161 20687 -86145 37009
17889B10029a86834G3697l6357b08349C65271a70575N6017j15309h5168j25899
$$ 210029 -186834 73697 37340 -208349 365271 -170575 -114558 -229867 -85168 -211067
17879b11067A01679N4K2305K4610P555c34724b5966B1669f3860p9022B321d56872
$$ -211067 101679 101733 124038 148648 156203 -334724 -25966 21669 -63860 -142882 2321 -456872
17866h5552A32752b50774F1435d5653j92884g5936A26425b26822d0980o9696A4569
$$ -85552 132752 -250774 61435 -45653 -238537 -75936 126425 -226822 -40980 -110676 14569
17854c83047H404f4736B35350f7672j02794a4945j60046A05750J40289J09911
$$ -383047 8404 -64736 235350 -67672 -170466 -14945 -174991 105750 246039 355950
17844C55950F3187b14751F366B773Q2788O9229d47068C1154f8615C8371i1508
$$ 355950 63187 -214751 6366 2773 85561 154790 -447068 31154 -68615 38371 -91508
17832b09936H9328K58810a25629D2657d0746k3500a0476j3483j05560A27326f4583
$$ -209936 89328 348138 -125629 42657 -40746 -64246 -10476 -23959 -129519 127326 -64583
17820C01286a57960B42547A16276b06611Q5135D26P4177J90895c74923J73077
$$ 301286 -157960 242547 116276 -206611 -121476 426 74603 265498 -374923 -201846
17810b01846e277j30212j10865a6057k18630a9167j64218J4917A41649h0512p2623
$$ -201846 -5277 -135489 -246354 -16057 -234687 -19167 -183385 -168468 141649 -80512 -153135
17799a53135f407A31894b44074a7090G7142g3003a5379A45852F8547a93855h381
$$ -153135 -6407 131894 -244074 -17090 77142 -73003 -15379 145852 68547 -193855 -8381
17787A08153i8999c9628l92466e2864l5084c382F8017a1818B5464a66523j16792
$$ 108153 -98999 -39628 -432094 -52864 -87948 -3382 68017 -11818 25464 -166523 -283315
17776b83315F5025A7775f0036D13910f6538A58918C0544R0166J54770b62792k16864
$$ -283315 65025 17775 -60036 413910 -66538 158918 30544 120710 275480 -262792 -479656
17765d79656I6583K39628H2449a48592A38900A1814a82056Q999d8711j4197F6080
$$ -479656 96583 336211 82449 -148592 138900 11814 -182056 -173057 -48711 -62908 66080
17753B5634b43249d3106o8025b1159m9263B66926b63444C52274e439j07804a8527
$$ 25634 -243249 -43106 -111131 -21159 -70422 266926 -263444 352274 -5439 -113243 -18527
17741a9551E6786k0557d21498B9062a18562L4302q459p947K043j84262K980B18475
$$ -19551 56786 36229 -421498 29062 -118562 -84260 -92719 -100666 -98623 -282885 -279905 218475
17728B82127E6005J06739c4638l46241B8983f8894A69206a12985C46523C5558
$$ 282127 56005 162744 -34638 -380879 28983 -68894 169206 -112985 346523 35558
17717c42597j84419A6971e7606B8989J90392b47878R4458H9355l7659a48957j11419
$$ -342597 -527016 16971 -57606 28989 219381 -247878 -153420 89355 51696 -148957 -260376
17706b60376g2516C09476a67701M1441A29653Q2467b18859A0816a02542o6496
$$ -260376 -72516 309476 -167701 -126260 129653 212120 -218859 10816 -102542 -169038
17696a69038A22476J19234A13620c83669A05405E2309M026b8887l5180E7669a58034
$$ -169038 122476 241710 113620 -383669 105405 52309 56335 -28887 -64067 57669 -158034
17684A83237g8222A08086O7422G7151k5580O6672a00762H6334b11779d9265q3046
$$ 183237 -78222 108086 175508 77151 51571 118243 -100762 86334 -211779 -49265 -132311
17673a32311C722b7549G7832b37882N0260D4680e7992b2786A29367L7701m7332
$$ -132311 3722 -27549 77832 -237882 -187622 44680 -57992 -22786 129367 167068 119736
17662A19736b80695k41382h1150j86666h4795j10277A66679D6173P2298J33095
$$ 119736 -280695 -522077 -81150 -267816 -84795 -195072 166679 46173 118471 251566
17652B51566C0267a29214A48803q245o7141c73655a8115B75147F7766a29082E8863
$$ 251566 30267 -129214 148803 140558 73417 -373655 -18115 275147 67766 -129082 58863
17640a62371g7677C208a9198m3821A99614b56369B53450G4049R8157g722k2283
$$ -162371 -77677 3208 -19198 -63019 199614 -256369 253450 74049 172206 -7722 -30005
17629c0005j82848A37774K7611N4859b1771D11645A05668M30640A24310K17092
$$ -30005 -212853 137774 165385 220244 -21771 411645 105668 536308 124310 341402
17619C41402a31519d0621A25767J44346b63036b8583E8945j9657b32409M2166
$$ 341402 -131519 -40621 125767 270113 -263036 -28583 58945 39288 -232409 -190243
17609a90243c6301o3184A40412l9199K59888c1358K923J1971A81039k3978a19681
$$ -190243 -36301 -99485 140412 101213 361101 -31358 -28435 -16464 181039 157061 -119681
17597a7445E24826B22239C9703e9237j871l16336g7153A1128a12712J7392j00608
$$ -17445 524826 222239 39703 -59237 -61108 -377444 -77153 11128 -112712 -95320 -195928
17586a95928I6882J8050K718c44486B46506B2454K55524b82046c5817E9843A484
$$ -195928 96882 114932 117650 -344486 246506 22454 277978 -282046 -35817 59843 1484
17574f8907B86605I872O9401b02885A77137j5196R4080g6909c4888j25418A50467
$$ -68907 286605 9872 79273 -202885 177137 161941 256021 -76909 -34888 -160306 150467
17562B63857h3112B53989r2758h7181k7813a4745B8191K52235G5579J15399H1453
$$ 263857 -83112 253989 161231 -87181 -114994 -14745 28191 280426 75579 190978 81453
17550A9806J72698N235a99779C56506B174b2175C690d8756B41348Q2305H4871
$$ 19806 192504 197739 -199779 356506 2174 -22175 3690 -48756 241348 323653 84871
17538A81690F0499B3756d1816A94761a76911a4396C43663K429q1058n8304k9840
$$ 181690 60499 23756 -41816 194761 -176911 -14396 343663 346092 265034 206730 176890
17527A76890M47155I6558J96615A12130J15209j01668a27379O2773B80520c15567
$$ 176890 624045 96558 293173 112130 227339 125671 -127379 -64606 280520 -315567
17516a16414C92503E322k163L75365G2365d5207I1394k9588k5748j1230J24443
$$ -116414 392503 5322 3159 378524 72365 -45207 91394 61806 36058 24828 149271
17505A49271k9413b023A05684k2364K2595K04003a84331F8024K02844K00939B9754
$$ 149271 119858 -2023 105684 83320 105915 309918 -184331 68024 270868 471807 29754
17493g1883A51405L25301i2484B05481M4071b36630C7539P3297P2580b42233a14027
$$ -71883 151405 476706 -92484 205481 249552 -236630 37539 110836 183416 -242233 -114027
17481b35673A46398L7219a45571a848j25436B28730b7095B16249b3783j8044k31592
$$ -235673 146398 183617 -145571 -1848 -127284 228730 -27095 216249 -23783 -41827 -273419
17470b73419J35767A04861f1964C12416l3339B9788A3186L3812b35768g4044A04979
$$ -273419 -137652 104861 -61964 312416 279077 29788 13186 46998 -235768 -74044 104979
17458a14334A69916a28749A48860a59295A98953J09035h04I4106N003D5901K16976
$$ -114334 169916 -128749 148860 -159295 198953 307988 -804 94106 99109 45901 262877
17447B62877j9098J63740q3927n8567A04194c7116B13812r1316c8452A3244a02249
$$ 262877 243779 407519 323592 265025 104194 -37116 213812 122496 -38452 13244 -102249
17435D57785B21182J55586a13466B81939P6744A00977J84372C4131b63987A96858
$$ 457785 221182 376768 -113466 281939 358683 100977 285349 34131 -263987 196858
17424E0136c0990m8861C75567G8450K53765a08832A64379M00892B08102a25813
$$ 50136 -30990 -79851 375567 78450 332215 -108832 164379 565271 208102 -125813
17413D52363C1697J5584K27738K99234A83644f783L321E26318j80330j38418a31665
$$ 452363 31697 47281 275019 574253 183644 -6783 -3462 526318 345988 207570 -131665
17401i9939C67342G4656J44899G8557J37216m5733K8341R261O7097a4025A01149
$$ -99939 367342 74656 219555 78557 215773 170040 198381 207642 274739 -14025 101149
17389A71623J15179J17984j32409j19189l6011K77852B8590K49098I3411J47098
$$ 171623 286802 404786 272377 153188 117177 395029 28590 277688 93411 240509
17379B40509R4181r3987h3862G6598L40619A87482I0820L2087J03222Q5742q2286
$$ 240509 334690 240703 -83862 76598 417217 187482 90820 122907 226129 311871 229585
17368B29585p1329J3969K8448A2127J0524K05517n6835J01103R1195d0540C48867
$$ 229585 158256 172225 200673 12127 22651 228168 171333 272436 363631 -40540 348867
17356A11188b1538A63869g8558C59768o9517c07079I305J35587J0173J56071b27982
$$ 111188 -21538 163869 -78558 359768 290251 -307079 9305 144892 155065 311136 -227982
17344a28841j06440D7824d5494B01880A2795L55233K9669d53635E7701a27561
$$ -128841 -235281 47824 -45494 201880 12795 368028 397697 -453635 57701 -127561
17333a12250D52823A71647K34189j41587J57532j89471j7269N7692E2494a03769
$$ -112250 452823 171647 405836 264249 421781 232310 215041 272733 52494 -103769
17322A90569e2785C23649A17277j0676B9392M2302g7666A87143B2340K41235a09362
$$ 190569 -52785 323649 117277 106601 29392 71694 -77666 187143 22340 263575 -109362
17310b35726N1133D02209A78165a72759I9301L7287b62850F4103K67174A36470
$$ -235726 -184593 402209 178165 -172759 99301 136588 -262850 64103 331277 136470
17299A3547h6283D0435b10524B75239q0872K7393H0960J20393j865p1351B6553
$$ 13547 -86283 40435 -210524 275239 194367 221760 80960 201353 199488 128137 26553
17287a63096B59973c5250B78073K1419m1561b9573C387J74871G2224K8499d2792
$$ -163096 259973 -35250 278073 299492 257931 -29573 3387 178258 72224 100723 -42792
17275B07417f9493g962B25567D9463j2664N02911D7218K56223M8180b4365C07347
$$ 207417 -69493 -7962 225567 49463 36799 539710 47218 303441 351621 -24365 307347
17263B1820J40562l5811K80878a448C1805J33360D6832K58903J75478B07422M3888
$$ 21820 162382 126571 407449 -1448 31805 165165 46832 305735 481213 207422 251310
17252B51310A03918A9313K94261A9671K14138r405e5393a4798q8866C60604A54837
$$ 251310 103918 19313 313574 19671 233809 224404 -55393 -14798 -103664 360604 154837
17240A98391K13785i1431C18377C2965L04371a86781E414Q9595K43496N6931A69585
$$ 198391 412176 -91431 318377 32965 337336 -186781 5414 95009 338505 395436 169585
17228C44814j16921J45312A45014P1648m9954k9255f841B21814L20607A18034
$$ 344814 227893 373205 145014 216662 166708 137453 -6841 221814 542421 118034
17217A34583k9948K80308n2409J47260A93743J63199A74241j8083L70590c5511
$$ 134583 104635 384943 332534 479794 193743 356942 174241 156158 526748 -35511
17206a15102C33673G4972K93635F2964L8855k4378J01970l6458E703J11504a03714
$$ -115102 333673 74972 368607 62964 101819 77441 179411 142953 5703 117207 -103714
17194H2855M97786B66227O6058A41116J22603b00567F925J42733e7640C54973
$$ 82855 580641 266227 332285 141116 263719 -200567 6925 149658 -57640 354973
17183B96182P1873J56819k49776q5354I3572A3009M33685k18760L4257r2470L058
$$ 296182 368055 524874 275098 189744 93572 13009 446694 227934 262191 169721 172779
17172A72779J6714J67423k8515C1467O5641K14719A19283k1612L18988J85570
$$ 172779 189493 356916 328401 31467 97108 311827 119283 97671 416659 602229
17162F02229k47178a23809A64573R9477a11128D49936A95723J7646P7720L31025
$$ 602229 355051 -123809 164573 264050 -111128 449936 195723 213369 291089 622114
17152F22114k11038j97081K03994j74501L0155I883O0248O5621L72897B24529
$$ 622114 411076 213995 417989 243488 273643 9883 70131 135752 508649 224529
17141C79681Q4832j90084r0714L00874j36900A53403J75139j44518J20259j28170
$$ 379681 464513 274429 183715 484589 347689 153403 328542 184024 304283 176113
17131A76113L41279j71629F9260L92432J041j88616j32756K28491H1092J59760
$$ 176113 517392 345763 69260 461692 462733 274117 141361 369852 81092 240852
17121B40852E6423K82789K71112d88D59785b57116H5068L52765p5092E7007c4155
$$ 240852 56423 339212 610324 -488 459785 -257116 85068 437833 362741 57007 -34155
17109B90839L61456C6369P7393M50787k8414a84178E05680D1966N59118G9709
$$ 290839 652295 36369 113762 564549 536135 -184178 505680 41966 601084 79709
17098B21241K03482j87966K86698j25081i3096D65060k18099j20923J09813J90767
$$ 221241 424723 236757 523455 398374 -93096 465060 246961 126038 235851 426618
17088D26618j66361J87584Q4543k21586K97604j40467k2687k20959M17855H5519
$$ 426618 260257 447841 532384 310798 608402 467935 445248 224289 642144 85519
17077D58003Q3661n1833A17624L48846k9358M93441D22881J81301k25994M10058
$$ 458003 541664 489831 117624 466470 437112 930553 422881 604182 378188 788246
17067G88246j90998A09934N15794K3630k35877r7325L13434B69702L9556R4868
$$ 788246 597248 109934 625728 649358 413481 316156 629590 269702 309258 404126
17057D04126M9898A20130K55500j29109J15571Q1024j60687K80652B30768M70375
$$ 404126 454024 120130 375630 246521 362092 443116 282429 563081 230768 701143
17047G01143B99214K78582B83839L04923p2915O7027B12332K77774K06205j91245
$$ 701143 299214 577796 283839 588762 515847 582874 212332 490106 696311 505066
17037E05066j67729J53766j47395I2074L74169j42392J29578j85218L17265R6716
$$ 505066 337337 491103 343708 92074 466243 323851 453429 268211 585476 682192
17027F82192k5223j6922k22092L20998l44431J30933j061K1981p5924J32117j78853
$$ 682192 656969 640047 417955 738953 394522 525455 524394 546375 470451 602568 423715
17016D23715R3483M55468l39298M8624B74838K20935K70208k54197M42647m64201
$$ 423715 517198 972666 633368 681992 274838 495773 765981 511784 954431 490230
17006D90230J24612k75095J33668m9360P3642K87688L2289M21459n49037J38193
$$ 490230 614842 339747 473415 424055 497697 785385 817674 1239133 690096 828289
16996H28289p1558k1748j77525p4131Q3742P7368K23713l42576L57790j76206
$$ 828289 756731 734983 557458 483327 567069 644437 868150 525574 883364 707158
16986G07158C31545M29921r4643O1930J03755J61942D23947n8781K05847k05658
$$ 707158 331545 761466 666823 728753 832508 994450 423947 365166 571013 365355
16976C65355L39470k52324L70085O9636O0795J04767E22267M35101q6227Q8433
$$ 365355 704825 452501 822586 892222 953017 1057784 522267 957368 871141 959574
16966I59574j84152k83386M72176K4373l7183J66128m84544K62104j09063K81665
$$ 959574 775422 492036 964212 988585 951402 1117530 632986 895090 786027 1067692
16956A067692m11685K53889L68276k18672j92399J83524j48585K1165k25590M8523
$$ 1067692 656007 909896 1278172 1059500 867101 1050625 902040 923205 697615 746138
16946G46138k7591N20431m17756L09311p7973r8369K6012K23040j64092K04163
$$ 746138 718547 1238978 821222 1130533 1052560 954191 980203 1203243 1039151 1243314
16936A243314k12140Q9968J28978q4091n6829L52607k74410p4972l7961L2748
$$ 1243314 1031174 1121142 1250120 1166029 1109200 1461807 1187397 1112425 1074464 1107212
16926A107212p7850K56948J82700k83190j55267P7643L30086J25567p0453j86085
$$ 1107212 1029362 1286310 1469010 1185820 1030553 1108196 1438282 1563849 1493396 1307311
16916A307311R992M5825P3530M39923k73156r8452j11139j7374L37493j22999
$$ 1307311 1317303 1363128 1436658 1876581 1603425 1504973 1393834 1376460 1713953 1590954
16906A590954j75101J45001M57119n94986L8615k67048L54453K41515k53708j69939
$$ 1590954 1415853 1560854 2017973 1422987 1461602 1194554 1549007 1790522 1536814 1366875
16896A366875K31418J10912K78836l48866J31774Q2093j59938M39334m02440K82427
$$ 1366875 1598293 1709205 1988041 1639175 1770949 1853042 1693104 2132438 1729998 2012425
16886B012425J03495k01203J03654m4241O7472J49534j1194R8732R1418l55651
$$ 2012425 2115920 1914717 2018371 1974130 2041602 2191136 2179942 2278674 2370092 2014441
16876B014441J41947K79420n764j54501j53525J76722K42974j76392P6095J87562
$$ 2014441 2156388 2435808 2430044 2275543 2122018 2298740 2541714 2365322 2441417 2628979
16866B628979q6253r0809m6357N09870l05799N702K07277k73767K3581K68636
$$ 2628979 2542726 2451917 2405560 2915430 2609631 2615333 2822610 2548843 2572424 2841060
16856B841060J24415K2176k88705K99669k27253L70814k63282l8665R4797J66194
$$ 2841060 2965475 2987651 2698946 2998615 2771362 3142176 2878894 2840229 2935026 3101220
16846C101220j93856L07135r3756j00514K56723M06473l26503L0478k8217N15586
$$ 3101220 2907364 3214499 3120743 3020229 3276952 3683425 3356922 3387400 3359183 3874769
16836C874769k48683N76339m11133M19975n1189o8344L45712K95915l17535j29329
$$ 3874769 3626086 4202425 3791292 4211267 4160078 4091734 4437446 4733361 4415826 4286497
16826D286497l7731M80194j20800J4973J33169L66603M8877l61669L59113K27391
$$ 4286497 4248766 4728960 4608160 4623133 4756302 5122905 5171782 4810113 5169226 5396617
16816E396617P3320l47603P99933m58277N33065L29005j57329L63775k87366K03082
$$ 5396617 5469937 5122334 5922267 5463990 5997055 6326060 6168731 6532506 6245140 6448222
16806F448222M43276J7814K24919J5390K84501o1721M76159R6210l6793J25442
$$ 6448222 6891498 6909312 7134231 7149621 7434122 7372401 7848560 7944770 7907977 8033419
16796H033419O01234J98538p0733K93971N00145K75507j34913P26243j31224K13774
$$ 8033419 8634653 8833191 8762458 9056429 9556574 9832081 9697168 10423411 10292187 10505961
16786A0505961M62963M13007j04483O59699J01880K51254N01624O16162M26512
$$ 10505961 10968924 11381931 11277448 11937147 12039027 12290281 12791905 13408067 13834579
16777A3834579P2590Q30323N43704K91086M51470Q10427O28879L98505Q09095
$$ 13834579 13907169 14737492 15281196 15572282 16023752 16834179 17463058 17861563 18670658
16768A8670658P95270Q16107P74666N60339R25421R67269K19825J613769J160786
$$ 18670658 19465928 20282035 21056701 21617040 22542461 23509730 23729555 25343324 26504110
16759B6504110J051948J459097J359956J279996J262504J382235J596769J578509
$$ 26504110 27556058 29015155 30375111 31655107 32917611 34299846 35896615 37475124
16751C7475124J996648K006256K075293K181839K733535K426554K742855L089931
$$ 37475124 39471772 41478028 43553321 45735160 48468695 50895249 53638104 56728035
16743E6728035K941558L265996L776579L905722M269906M496915M476816N532971
$$ 56728035 59669593 62935589 66712168 70617890 74887796 79384711 83861527 89394498
16735H9394498N611840N500099O514509P010931O908952P253648P803929Q040543
$$ 89394498 95006338 100506437 107020946 114031877 120940829 128194477 135998406 144038949
16727A44038949P832734Q472403P893684P633641O750927O607806N677942L994841
$$ 144038949 151871683 160344086 168237770 175871411 182622338 189230144 194908086 198902927
16719A98902927L397239J548955M40547j421564k715529m057694n104577o355786
$$ 198902927 202300166 203849121 204289668 202868104 200152575 196094881 190990304 184634518
16711A84634518o714756q064485p674956p886907q384321q237867q047920p562650
$$ 184634518 177919762 169855277 162180321 154293414 145909093 137671226 129623306 122060656
16703A22060656p042207p070191o615589o342195o069736n475896m506647m832891
$$ 122060656 115018449 107948258 101332669 94990474 88920738 83444842 78938195 74105304
16695G4105304m256535m310318l313913l954808l021559l012175l223676k278498
$$ 74105304 69848769 65538451 62224538 58269730 55248171 52235996 49012320 46733822
16687D6733822k495615k266700k325128j635736j619688j844217j657612j381811
$$ 46733822 44238207 41971507 39646379 38010643 36390955 34546738 32889126 31507315
16679C1507315j497360j226957j467360j344191r81810p05946j167688n75167
$$ 31507315 30009955 28782998 27315638 25971447 24989637 24283691 23116003 22540836
16671B2540836j242971o93295o83665q09795p62094n64595p18696n29704k88062
$$ 22540836 21297865 20604570 19920905 19111110 18349016 17784421 17065725 16536021 16247959
16662A6247959q89128k84515o36519l29376m89669k21211j84200m94730n82179
$$ 16247959 15358831 15074316 14437797 14108421 13618752 13397541 13213341 12718611 12136432
16653A2136432m72789m10665N2530n46755l23350j17761l68377m91922o8745l06912
$$ 12136432 11663643 11252978 11305508 10758753 10435403 10317642 9949265 9457343 9388598 9081686
16643I081686J66228m26901o59189L759j27698l53094L409j19009n08999O2033
$$ 9081686 9247914 8821013 8161824 8165583 8037885 7684791 7688200 7569191 7060192 7122225
16633G122225l60961P3503p1171k33665N9938o09749l8664n7926M03002p16218
$$ 7122225 6761264 6834767 6763596 6529931 6589869 5980120 5941456 5883530 6286532 5570314
16623E570314q9222R069j50230q6690j72258j78022P1501j47559J4285l80573
$$ 5570314 5481092 5490161 5339931 5253241 5080983 4902961 4974462 4826903 4841188 4460615
16613D460615R6161k93090M975k68989J14279k5883k22598j74624K96850J6482
$$ 4460615 4556776 4263686 4268661 3999672 4113951 4088068 3865470 3690846 3987696 4004178
16603D004178k24326l80348O07842m24748j44781M16249p00465M82821k86570
$$ 4004178 3779852 3399504 4007346 3582598 3437817 3854066 3153601 3636422 3349852
16594C349852k62050j4873j79130J45602k67535J94163j36587K64966k19597o1865
$$ 3349852 3087802 3072929 2893799 3039401 2771866 2966029 2829442 3094408 2874811 2812946
16584B812946j13044R0251R4266l53757l32909Q6260O4018K31153j9849o93380
$$ 2812946 2699902 2790153 2884419 2530662 2197753 2284013 2348031 2579184 2559335 1865955
16574A865955P17681o29608L02048m3498q43j34061Q3824O215j34015k66334M19194
$$ 1865955 2583636 1954028 2256076 2212578 2211735 2077674 2161498 2167713 2033698 1767364 2186558
16563B186558M9697m65437J47215n3145J34532l6336J89407m01978K01488l28840
$$ 2186558 2236255 1770818 1918033 1864888 1999420 1963084 2152491 1750513 1952001 1623161
16553A623161N63362l71699r2811R6053j27257k80494J83505m7342J54111n5433
$$ 1623161 2186523 1814824 1722013 1818066 1690809 1410315 1593820 1546478 1700589 1645156
16543A645156K37263m69269J27558L18723l14815Q422q0301J82050j36840l09620
$$ 1645156 1882419 1413150 1540708 1859431 1544616 1553038 1472737 1654787 1517947 1208327
16533A208327N57897j64321j95570J12317l248l83054L14109J24272k11770j44810
$$ 1208327 1766224 1601903 1406333 1518650 1515402 1132348 1446457 1570729 1358959 1214149
16523A214149N2591J18984k25557K64042J86028j82404k05796L9034p1311q9215
$$ 1214149 1266740 1385724 1160167 1424209 1610237 1427833 1222037 1261071 1189760 1100545
16513A100545N7725Q3903k65938M9179j54620L42932j91923J63629l33157K21954
$$ 1100545 1158270 1242173 976235 1025414 870794 1213726 1021803 1185432 852275 1074229
16503A074229L5065K08065k48225O2357j49283j52776P6502K42700l9809K02175
$$ 1074229 1109294 1317359 1069134 1131491 982208 829432 905934 1148634 1108825 1311000
16493A311000m91749n5566N75751j8155n68450J40814J44938m9486j07936L36256
$$ 1311000 819251 763685 1339436 1321281 752831 893645 1038583 989097 881161 1217417
16483A217417n59383M01272k61765R1737K05826j32245q4081j9638k09095n0928
$$ 1217417 658034 1059306 797541 889278 1095104 962859 878778 859140 650045 599117
16473E99117J91351J5118j50561M03247l74364K54185k77648N1670j4986J92796
$$ 599117 790468 805586 655025 1058272 683908 938093 660445 712115 697129 889925
16463H89925k69177K02066q2589O331Q9717N0729l26938L62672k02547J98360
$$ 889925 620748 822814 740225 746556 836273 887002 560064 922736 720189 918549
16453I18549m19155K17245k12475J92838j17074j61879M87067j69401B94431M85189
$$ 918549 499394 716639 504164 697002 579928 418049 905116 735715 294431 779620
16443G79620K1615o8797M5746j05369B76823N71167j40300J3870k4779m4460K21298
$$ 779620 801235 732438 778184 672815 276823 847990 707690 721560 696781 652321 873619
16432H73619j61763B94475N90961q2944j81302J91960r566k92839n3742o0440
$$ 873619 711856 294475 885436 802492 621190 813150 803584 510745 457003 396563
16422C96563J96634n3431j32787M12033j61571P7589l04831M9881p2513N65688
$$ 396563 593197 539766 406979 819012 657441 735030 430199 480080 407567 973255
16412I73255l87867J87626j75700j80828N5930p5149K64392j22523L83970j89502
$$ 973255 585388 773014 597314 416486 472416 397267 661659 539136 923106 733604
16402G33604B25685J3589j1156N15437j46443L66372D18436K0762K38521B27887
$$ 733604 225685 239274 228118 743555 597112 963484 418436 439198 677719 227887
16391D98548L38526l47463O6165k48203N0673J10670J63788B43780J36523K18896
$$ 498548 837074 489611 555776 307573 358246 468916 632704 243780 380303 599199
16381E99199B74965J20077R413K61074i1564F1943M41771j36489J348A54796J64538
$$ 599199 274965 395042 404455 665529 -91564 61943 503714 367225 368573 154796 319334
16370C19334m7022N00232l28035j65657J07936E2311L38739J75266j08812P5309
$$ 319334 272312 772544 444509 278852 386788 52311 391050 566316 457504 532813
16360E32813K68183j0072l45585k9441j59182K6587L19211j71472L7289j65183
$$ 532813 800996 790924 445339 415898 256716 283303 602514 431042 468331 303148
16350C03148J91288A66047R8863o956K16781E6617J70862G5759M74122k09511
$$ 303148 494436 166047 264910 257954 474735 56617 227479 75759 549881 340370
16340C40370A39460L45687I4519M43532A17147J90290O976q33j7454d6702B93809
$$ 340370 139460 485147 94519 538051 117147 307437 314413 313580 296126 -46702 293809
16328A34271L13981r191B5136L39635O9994b5841B59929K05348l6442N9708j46156
$$ 134271 448252 439061 25136 364771 434765 -25841 259929 465277 428835 488543 342387
16317C42387N15888A68252L3307q7959P5265J32913M2309L7182c816F4719K30040
$$ 342387 858275 168252 201559 113600 188865 321778 364087 401269 -3816 64719 294759
16306B94759M97o0550j03714a21907B10938L5876I4848K55147j71385N58209A48102
$$ 294759 295256 234706 130992 -121907 210938 246814 94848 349995 178610 736819 148102
16294B47513o3904K7830j0933d7922B46703K08641k16464p1826J20395I1931r005
$$ 247513 183609 211439 200506 -47922 246703 455344 238880 167054 287449 91931 82926
16283H2926K67743o8317n957P7656P2510Q9605A5024N99977B14412L1152K86846
$$ 82926 350669 282352 276395 354051 426561 516166 15024 615001 214412 245564 532410
16272E32410B62776J31419g0008A35034c0015D3795a3216E17549E730O41719k31961
$$ 532410 262776 394195 -70008 135034 -30015 43795 -13216 517549 5730 647449 415488
16261D15488l9882r4801J43220j80147L07150k12798C8305J41387q8911R7886
$$ 415488 375606 280805 424025 243878 551028 338230 38305 179692 90781 188667
16251A88667A0203J29202o852K31196q4268o2505K20569j81861m5020J51084G2884
$$ 188667 10203 139405 132553 363749 279481 216976 437545 255684 210664 361748 72884
16239A37466N6955a57552B55961j12020a7983C40377j04444O6396A40717j8043
$$ 137466 194421 -157552 255961 143941 -17983 340377 235933 302329 140717 122674
16229A22674d3363B35293j01790B0953J36211o5714L25028A32910b21959e4648
$$ 122674 -43363 235293 133503 20953 157164 91450 416478 132910 -221959 -54648
16218b04530A25366D4717J84494O8733J53936A73266J80966B9811J79451f7904
$$ -204530 125366 44717 229211 297944 451880 173266 354232 29811 209262 -67904
16207d3646c996D01135c13972A73826q0260L60950B4029N2557g0881B45112a8067
$$ -43646 -3996 401135 -313972 173826 93566 454516 24029 76586 -70881 245112 -18067
16195b0060B8866a70223E5258P5672d1000A52732O855n9299Q8039k6231i3904
$$ -20060 28866 -170223 55258 130930 -41000 152732 159587 100288 188327 162096 -93904
16183C86474E8258K00027E9258K43181n6943K13686B886J01589K90210J0338A22563
$$ 386474 58258 258285 59258 302439 245496 459182 2886 104475 394685 405023 122563
16171C0981J42963j8118J41388r7733a68515A93701J61400A1044J22271K8297
$$ 30981 173944 155826 297214 199481 -168515 193701 355101 11044 133315 161612
16161A61612C4587f685F7026L2040a49588A91014d9580A72752E8519c07327A71022
$$ 161612 34587 -6685 67026 99066 -149588 191014 -49580 172752 58519 -307327 171022
16149D67230E1676K15905A2268L62422A62937J25239j02385M9254C6330J12566
$$ 467230 51676 267581 12268 374690 162937 288176 185791 235045 36330 148896
16139A48896k8204L1316g6248Q131B41590J59740K187A67413H0292L00894A4263
$$ 148896 120692 152008 -76248 -68117 241590 401330 403517 167413 80292 381186 14263
16127a12386C28433j02635m2541b3731j37507A85691P2293c7404j12744B15156
$$ -112386 328433 225798 183257 -23731 -161238 185691 257984 -37404 -150148 215156
16116E3237R8973m1994J06392K7174J80304c79281F7357a11372A40740J90689
$$ 53237 152210 110216 216608 243782 424086 -379281 67357 -111372 140740 331429
16106C31429b2594o5462B78965Q6147j01729J1371q4705K37454M3804b7769j69230
$$ 331429 -22594 -88056 278965 365112 263383 274754 190049 427503 471307 -27769 -196999
16095a96999r3982a15360a0055A09311a37309j2892C67505a20464F5202Q593k2793
$$ -196999 -290981 -115360 -10055 109311 -137309 -150201 367505 -120464 65202 73795 51002
16084E1002k4228b51587f4371D5257d2616C33605A14418a10021j02839l51580
$$ 51002 26774 -251587 -64371 45257 -42616 333605 114418 -110021 -212860 -564440
16074e64440B16011a02400J0435I1132J46981E8716a50097D00349j76390e3655
$$ -564440 216011 -102400 -91965 91132 238113 58716 -150097 400349 223959 -53655
16063B4744K11959a59923C4949h2629j48646O4880r2492J23952O4591A36279d8065
$$ 24744 236703 -159923 34949 -82629 -231275 -166395 -258887 -134935 -70344 136279 -48065
16051A24706a75526F0293R4115N2655d0436k0813j19018A21465E4264J35997a90926
$$ 124706 -175526 60293 154408 207063 -40436 -61249 -180267 121465 54264 190261 -190926
16039B18210k2448c4403j44374g3782B47776h774A50064M280h6677E6917N9827
$$ 218210 195762 -34403 -178777 -73782 247776 -8774 150064 154344 -86677 56917 116744
16028A16744J48381b2941C7099J38115d49443i4736G7797c8659P038A155b1518
$$ 116744 265125 -22941 37099 175214 -449443 -94736 77797 -38659 -31621 1155 -21518
16016h4735Q956n8683F4778J17092b1362e504j85169d8303j73933C0409L6486
$$ -84735 -75779 -134462 64778 181870 -21362 -5504 -190673 -48303 -222236 30409 66895
16005F6895a93331B2608J55645o5211a59838G6185a41385e976j74430A39928j8001
$$ 66895 -193331 22608 178253 113042 -159838 76185 -141385 -5976 -180406 139928 121927
15994A21927b50046Q1907D6243J48790e17701i63B82007g221A7373J21728a71133
$$ 121927 -250046 -168139 46243 195033 -517701 -963 282007 -7221 17373 139101 -171133
15982b85404A30603C3085K92296H7607J44895j1078C6475P9746a17237C98380
$$ -285404 130603 33085 325381 87607 232502 221424 36475 116221 -117237 398380
15971b30723A46916B244N771J8291K7231d6201H1099c2292j47233D3870d6794
$$ -230723 146916 2244 8015 26306 53537 -46201 81099 -32292 -179525 43870 -46794
15959B71547b73252i0940M0498B11721b53701q4337c0842A2559a7871j10447C02673
$$ 271547 -273252 -90940 -50442 211721 -253701 -338038 -30842 12559 -17871 -128318 302673
15947b30278N540o4057R7254B97776j38840a85567j05902R8889k62053a91903
$$ -230278 -224738 -288795 -191541 297776 158936 -185567 -291469 -192580 -454633 -191903
15936D5540a1830j95696j46425L5371D00250L5364g2104j77135B2807f1623A6758
$$ 45540 -11830 -207526 -353951 -318580 400250 435614 -72104 -249239 22807 -61623 16758
15924a83316D4590c65601b1302j05484A87677B1398d03908C03914F0990h7175
$$ -183316 44590 -365601 -21302 -126786 187677 21398 -403908 303914 60990 -87175
15913b30356J1194c1477m3063D2725f7835B5060A404i9468c7847A65524G3804
$$ -230356 -219162 -31477 -74540 42725 -67835 25060 1404 -99468 -37847 165524 73804
15901A05834b66685H2518a71981G3270b06661j01626A78182a2920n2150j48054
$$ 105834 -266685 82518 -171981 73270 -206661 -308287 178182 -12920 -65070 -213124
15891b13124a1385k12206J04929C8502J66455c2433A80909E3762c59212g5129
$$ -213124 -11385 -223591 -118662 38502 204957 -32433 180909 53762 -359212 -75129
15880d3388B25172p6678m1291b2622j95336a0633k32821O3254L1986f7188j54124
$$ -43388 225172 148494 107203 -22622 -217958 -10633 -243454 -180200 -148214 -67188 -221312
15869b21312b5596k06635R3577A67496g926C9025L03789a43389A78713J9684a47414
$$ -221312 -25596 -232231 -138654 167496 -7926 39025 342814 -143389 178713 198397 -147414
15857A12223i1633k3454J7296A04718d80547A26499f3596o5352k37772O7923A52891
$$ 112223 -91633 -115087 -97791 104718 -480547 126499 -63596 -128948 -366720 -298797 152891
15845f2459k1610j44696r2772d2591B16145b25029c4171A41923F7477j8067i6313
$$ -62459 -84069 -228765 -321537 -42591 216145 -225029 -34171 141923 67477 49410 -96313
15833B84884G7505A775b8349j88900P1705A97349p3427a28720A60061a6425k65578
$$ 284884 77505 1775 -28349 -217249 -145544 197349 123922 -128720 160061 -16425 -282003
15822b82003A23530a50496A08518a7864j60366f8103G9218f6610I2440a26053
$$ -282003 123530 -150496 108518 -17864 -178230 -68103 79218 -66610 92440 -126053
15811a15309K6359j10829P7769d9931j34086B50024a08219k98546B95489f4850
$$ -115309 -88950 -199779 -122010 -49931 -184017 250024 -108219 -406765 295489 -64850
15800b16147I6194a59714L5988O1232A29273c96940C57741a96111j17693f4385
$$ -216147 96194 -159714 -123726 -62494 129273 -396940 357741 -196111 -313804 -64385
15789A34957a88024A34511h8053C215g7693o3443L0761A21521b71489B76248q0383
$$ 134957 -188024 134511 -88053 3215 -77693 -141136 -110375 121521 -271489 276248 195865
15778A95865a88665j0200J2113a0946j7054G1508b52082B91868d2587C13082n7224
$$ 195865 -188665 -198865 -186752 -10946 -28000 71508 -252082 291868 -42587 313082 255858
15767B55858k0169o7702G8572b34609I9298b46540g526j98693f1392A61014b45282
$$ 255858 235689 167987 78572 -234609 99298 -246540 -7526 -206219 -61392 161014 -245282
15755c47915I6089J06806a47589k78109F7615L35148r0755c13421B73083k4657
$$ -347915 96089 202895 -147589 -425698 67615 402763 312008 -313421 273083 248426
15745B48426c31942a57894r3600A6829a37028H6738K58986d9241k75255A3980
$$ 248426 -331942 -157894 -251494 16829 -137028 86738 345724 -49241 -324496 13980
15734C7198b79062C66853a04451c395A17347d24072C32804c5458n214j04806b3394
$$ 37198 -279062 366853 -104451 -3395 117347 -424072 332804 -35458 -40672 -145478 -23394
15722c11199A60424b4958k45484H3871J57666p6560b569o1546l09195g7049m7418
$$ -311199 160424 -24958 -270442 83871 241537 164977 -2569 -64115 -373310 -77049 -124467
15711a24467B24827J45521A06918i4095A80810a51255o7830A80852h8647n5987
$$ -124467 224827 370348 106918 -94095 180810 -151255 -219085 180852 -88647 -144634
15701a44634E5395L3470a60992d2421k86899J27113e3380A60515d03437c2765
$$ -144634 55395 88865 -160992 -42421 -329320 -202207 -53380 160515 -403437 -32765
15690b48891A87154l6102b15300O786b1199o2589L5662G9045a19088B06397c96503
$$ -248891 187154 151052 -215300 -208514 -21199 -83788 -48126 79045 -119088 206397 -396503
15678b58201G1016b42830f0243J2009I1436a36410j46916C0084b33096k68016
$$ -258201 71016 -242830 -60243 -48234 91436 -136410 -283326 30084 -233096 -501112
15668e01112D33742A41688A0351e3902k20873a13245J435C34588B2300a11033
$$ -501112 433742 141688 10351 -53902 -274775 -113245 -111810 334588 22300 -111033
15657C49148c3882k17372H1382b8042j2484k22265j53625E443g6862n7898n2623
$$ 349148 -33882 -251254 81382 -28042 -40526 -262791 -416416 5443 -76862 -134760 -187383
15646a87383r0860A99942d4208e878k11981k3502B91280a28564e6867j02044j87524
$$ -187383 -278243 199942 -44208 -5878 -217859 -241361 291280 -128564 -56867 -158911 -346435
15635c46435A93397b92930N6978E6996J05734J48192j14150a33280j29844A74556
$$ -346435 193397 -292930 -235952 56996 162730 310922 196772 -133280 -263124 174556
15624a02447J3137l2813E6154O9088o2094B6757Q9247i9707C46820E028b56949
$$ -102447 -89310 -122123 56154 125242 63148 26757 116004 -99707 346820 5028 -256949
15612H7602Q8694b22642m4583A0389J33045b29299k73078K15126E4390c40819
$$ 87602 176296 -222642 -267225 10389 143434 -229299 -502377 -287251 54390 -340819
15601h8223l623K1164B38714a042j8346j62306l5343N9019p2999j59197J46486
$$ -88223 -91846 -70682 238714 -1042 -19388 -181694 -217037 -158018 -231017 -390214 -243728
15590b43728R3860B91509a60165a5612A84478C0536O7401a39431B29029A4822
$$ -243728 -149868 291509 -160165 -15612 184478 30536 97937 -139431 229029 14822
15579a24762A22091b57587P1595j17115k8983J46550P4505b3851H6514a32554
$$ -124762 122091 -257587 -185992 -303107 -332090 -185540 -111035 -23851 86514 -132554
15568f8228m2776D39060a63770g4760a0765G6191j006J53412C9504P4526a45013
$$ -68228 -111004 439060 -163770 -74760 -10765 76191 75185 228597 39504 114030 -145013
15556B22878p9045o2991d3400k89618A72365a29626A88201d01340A19682P4343
$$ 222878 143833 80842 -43400 -333018 172365 -129626 188201 -401340 119682 194025
15546A94025f3404B89298A43542b80832H5916a45138g0793B4354b56153A09572
$$ 194025 -63404 289298 143542 -280832 85916 -145138 -70793 24354 -256153 109572
15535C9222a31782A81483h7526c23H2595l6242O1095b97939A24391J82175c09449
$$ 39222 -131782 181483 -87526 -323 82595 46353 107448 -297939 124391 306566 -309449
15523b19363b7754j15097A31010a53154A67342R596P5571q9683L38449A07663
$$ -219363 -27754 -142851 131010 -153154 167342 176938 252509 162826 501275 107663
15512a95012B75359A25512F721d0785p223J7553k64458L1942c5471p4338J3968
$$ -195012 275359 125512 6721 -40785 -48008 -30455 -294913 -262971 -35471 -109809 -95841
15501i5841A97947c8571F8983a91567g0624G3045b8184B29634a82420I2638a67435
$$ -95841 197947 -38571 68983 -191567 -70624 73045 -28184 229634 -182420 92638 -167435
15489d54916F5527h6516E921J70219h7976j42180a10834B5945f9710A75126a28712
$$ -454916 65527 -86516 5921 176140 -87976 -230156 -110834 25945 -69710 175126 -128712
15477a8627A46810m3998J4757a690C4148b14817n0383a11103k13936g7541h050
$$ -18627 146810 102812 117569 -1690 34148 -214817 -265200 -111103 -325039 -77541 -8050
15465c7676n5006k49321e5031D1951j8653f7254j67756J14177F5830c0220A84292
$$ -37676 -92682 -342003 -55031 41951 23298 -67254 -235010 -120833 65830 -30220 184292
15453E2043b1495k51168f2592C7338b24878A79452J00970c32277A32352E8261
$$ 52043 -21495 -272663 -62592 37338 -224878 179452 280422 -332277 132352 58261
15442g8027A33897b93664A96047f9000F3308J41693b88853G5300O049j0817b04119
$$ -78027 133897 -293664 196047 -69000 63308 205001 -288853 75300 81349 70532 -204119
15430B23834a20584N0456B46430j03438D8888J05621C6071N5564J23904a29686
$$ 223834 -120584 -70128 246430 142992 48888 154509 36071 91635 215539 -129686
15419G308L1565b58433C12099G6437f5361a9853B2173J81627a49366A49780L50341
$$ 7308 38873 -258433 312099 76437 -65361 -19853 22173 203800 -149366 149780 500121
15408E00121a64251F5062k7958b61407A41949k1110J50404a31434k83442b9548
$$ 500121 -164251 65062 37104 -261407 141949 120839 271243 -131434 -414876 -29548
15397A11033K6543i2808G6332N087J05975A9360L6565R7498e4764Q517D1937a59213
$$ 111033 137576 -92808 76332 81419 187394 19360 55925 153423 -54764 -46247 41937 -159213
15384b46319J06849B88015l420F600J03608K49886b81151G8314J48896c43420
$$ -246319 -139470 288015 284595 6600 110208 360094 -281151 78314 227210 -343420
15373c0550j44970e3312F7674a91936f9288k2165B35081h9105a4962k06493B95899
$$ -30550 -175520 -53312 67674 -191936 -69288 -91453 235081 -89105 -14962 -221455 295899
15361e139A57946A3264c0827A49173o058e1099E39564C6303a95337h590B19019
$$ -5139 157946 13264 -30827 149173 143115 -51099 539564 36303 -195337 -8590 219019
15349b76140C18045A49114a39203A48097C2594M714M23697A93795b38344g131
$$ -276140 318045 149114 -139203 148097 32594 37308 461005 193795 -238344 -7131
15338b34195O5113A5647L19816b46846A75580b30676c6951C87640p659a58868
$$ -234195 -169082 15647 335463 -246846 175580 -230676 -36951 387640 379981 -158868
15327B34266i0569R827k33203C52701b53363C46859q9213b06037k7692K9465A31529
$$ 234266 -90569 -80742 -313945 352701 -253363 346859 257646 -206037 -233729 -204264 131529
15315A31514o578m5118j1304O5914D5210a03161m9159j4574D4353h392m9975j14681
$$ 131514 124936 79818 68514 134428 45210 -103161 -152320 -166894 44353 -8392 -58367 -173048
15303a73048A48222E4263h3442j16613c3978A31274c9647G2185L359R1781D0991
$$ -173048 148222 54263 -83442 -200055 -33978 131274 -39647 72185 75544 167325 40991
15291b47952F0935J18829o9776a42105a665k23110I4134g6830j61436A88782G272
$$ -247952 60935 179764 109988 -142105 -1665 -224775 94134 -76830 -238266 188782 7272
15279d5002B7332a4735E7771a58260A69702j1925E5163J09250P0732i8621A15461
$$ -45002 27332 -14735 57771 -158260 169702 157777 55163 164413 235145 -98621 115461
15267c3001A64300J11664a94180b583A49664j4798a53506P0954j30863A02782
$$ -33001 164300 275964 -194180 -2583 149664 134866 -153506 -82552 -213415 102782
15256I125b85372j47825A46368K54805i1135D0731a07019E48050M43300P11810
$$ 9125 -285372 -433197 146368 401173 -91135 40731 -107019 548050 991350 1703160
15246A703160o86296o6364L54945E83200E5967K29027G2919J93873G186J25389
$$ 1703160 1016864 950500 1305445 583200 55967 284994 72919 266792 7186 132575
15236A32575L71840A84000a52979C33059A38156e3297K4964B16781P2537a86500
$$ 132575 504415 184000 -152979 333059 138156 -53297 -28333 216781 289318 -186500
15225E6443I917b1336M589m7848F2184c97126A56756e7746j77916A14252a35684
$$ 56443 9917 -21336 -16747 -64595 62184 -397126 156756 -57746 -235662 114252 -135684
15213a92359a8736j79486A1010P5822B1611a73434E2410A6839J24426d9474J0712
$$ -192359 -18736 -198222 11010 86832 21611 -173434 52410 16839 141265 -49474 -38762
15202c8762k0820B66573b21546A63756R1054a56974j47444A32502C7515K42991
$$ -38762 -59582 266573 -221546 163756 254810 -156974 -304418 132502 37515 280506
15192B80506j06659d0129c365F5370F17b08698H8913K55481C2622i7397B2559
$$ 280506 173847 -40129 -3365 65370 617 -208698 88913 344394 32622 -97397 22559
15180A23110a12553b4363o2789A34777L41571g6323B03044q0181A055O2150a20122
$$ 123110 -112553 -24363 -87152 134777 476348 -76323 203044 122863 1055 63205 -120122
15168E59990A72006e4038D32J77973f1099q1068B66950j1376k3320p8763P5737
$$ 559990 172006 -54038 432 178405 -61099 -142167 266950 255574 232254 153491 229228
15157B29228n1916a25518B9954a7814B23842F5311a63443G7957K75469A18237
$$ 229228 177312 -125518 29954 -17814 223842 65311 -163443 77957 353426 118237
15146F8230a38097j56101a8003A42342J3835b2522B13777A9112J23846l3821K31970
$$ 68230 -138097 -294198 -18003 142342 156177 -22522 213777 19112 142958 109137 341107
15135C41107o9832b94395G2172J77390A19405J60054g9025C79536j89283H2398
$$ 341107 271275 -294395 72172 249562 119405 279459 -79025 379536 190253 82398
15124a91548I3629P0227B3448P5303c3048g783A15289F49K4374L52456A53977
$$ -191548 93629 163856 23448 98751 -33048 -7783 115289 649 25023 377479 153977
15112A72807K45603l1973C7177a1762C26943g0917A38499j1030L71859j19186
$$ 172807 418410 386437 37177 -11762 326943 -70917 138499 127469 499328 380142
15102C80142D2781K9334J2023J6784K00967e7834j02901C04116n4833A11644A5084
$$ 380142 42781 72115 84138 100922 301889 -57834 -160735 304116 249283 111644 15084
15090B44833Q6254j08957a21354A5931n515K39856D2786b5211I9000j4541K756
$$ 244833 331087 222130 -121354 15931 10416 250272 42786 -25211 99000 84459 87215
15079H7215C8065L50444a1499k98267C46490c9529q534C29042A36072K6503M0806
$$ 87215 38065 388509 -11499 -309766 346490 -39529 -48063 329042 136072 162575 203381
15068B03381n6680m667J30129A17706C8533J30532P9448K0520a08796k9362M0503
$$ 203381 146701 142034 272163 117706 38533 169065 248513 269033 -108796 -138158 -97655
15057i7655B68121a1853B46629o5036a101B13893D6182a66965e7717k3315A64305
$$ -97655 268121 -11853 246629 181593 -1101 213893 46182 -166965 -57717 -81032 164305
15045b5293k04362A87833o8733J54142o8186c0625D94299E7376j7578g5135C51234
$$ -25293 -229655 187833 119100 273242 205056 -30625 494299 57376 39798 -75135 351234
15033A7042j944N0834L27534D5662L32760r0677j42603a00985A56357p0693A6640
$$ 17042 15098 65932 393466 45662 378422 287745 145142 -100985 156357 85664 16640
15021A16276J55048N6076a3526B62370j22064d8928B67154l8699k9305j9656J14687
$$ 116276 271324 327400 -13526 262370 140306 -48928 267154 228455 199150 179494 294181
15010B94181m6079j6095p9743J6815e0840F6865K22406M7776D9781M4054D2060
$$ 294181 248102 232007 152264 169079 -50840 66865 289271 337047 49781 93835 42060
14998B12608n1864J66980I555J81108E5794j0799A3025K12331a22512B01302R7409
$$ 212608 160744 327724 9555 190663 55794 44995 13025 225356 -122512 201302 298711
14987B98711g7902C44686k2664H7072k1911L75340j32503C9078K40109j28616
$$ 298711 -77902 344686 322022 87072 65161 440501 307998 39078 279187 150571
14977A50571J79459j42663a7575B77330K1166j0859J65396C1544O2361J06674
$$ 150571 330030 187367 -17575 277330 298496 287637 453033 31544 93905 200579
14967B00579I0163J56089q7424J53345k1608A32957J05014a1788E6357R8291K41251
$$ 200579 90163 246252 158828 312173 290565 132957 237971 -11788 56357 154648 395899
14956C95899A34511B3800Q6593m5010J84342o0556J5678K38179A3418N4404K87230
$$ 395899 134511 23800 110393 65383 249725 189169 204847 443026 13418 67822 355052
14945C55052g4182C64578j62195L22994q8802p9526j15557a1692B62684m1384
$$ 355052 -74182 364578 202383 525377 436575 357049 241492 -11692 262684 221300
14935B21300K69904A82818q2518L45108j88777L0617g3447A75886l9387Q1878
$$ 221300 491204 182818 100300 445408 256631 287248 -73447 175886 136499 218377
14925B18377b50601A64355J66562j59419L43816i1654A09433K82640j7493j46942
$$ 218377 -250601 164355 330917 171498 515314 -91654 109433 392073 374580 227638
14915B27638I3957K83800n6033f8837D22474K36712A05503O2664K79772j27972
$$ 227638 93957 377757 321724 -68837 422474 659186 105503 168167 447939 319967
14905C19967M9398f727C06703f6762D23033r9252p740A01396K67153L3964j52462
$$ 319967 369365 -6727 306703 -66762 423033 323781 316041 101396 368549 402513 250051
14894B50051J24901N0126J6837j82521J0184H8310L13166i4454C84011A22524
$$ 250051 374952 425078 441915 259394 269578 88310 401476 -94454 384011 122524
14883G2967L78479B00292b9024A85733Q6362J82147j03758N3479K881Q0069r8265
$$ 72967 451446 200292 -29024 185733 272095 454242 350484 403963 406844 486913 388648
14872C88648J8922m3913l3377K50862B78000j35810L24420e4419A74043J79237
$$ 388648 407570 363657 330280 581142 278000 142190 466610 -54419 174043 353280
14862C53280J64870A17361M24782K9276j74821o8910A53883M04101a3434D77659
$$ 353280 518150 117361 542143 571419 396598 327688 153883 557984 -13434 477659
14851C93884J80776o4103d7218A31197K11988O7743j73560K1890K45656O0528
$$ 393884 574660 510557 -47218 131197 343185 410928 237368 259258 504914 565442
14841E65442j06005L9938B14712L57932j20123J4723J00376K21526l13951J23429
$$ 565442 459437 499375 214712 572644 452521 467244 567620 789146 475195 598624
14831E98624n6844j60837A75238K04519E2297K57577L35807j78985q476j42015
$$ 598624 541780 380943 175238 379757 52297 309874 645681 466696 458220 316205
14821C16205J92564R250k2787R3650k86411J77664l2858M3309j88782J73047n1839
$$ 316205 508769 518019 495232 588882 302471 480135 447277 490586 301804 474851 423012
14810D23012J18722o9837j04340J52315k47261L77143r7611B27556K91398j82566
$$ 423012 541734 471897 367557 519872 272611 649754 552143 227556 518954 336388
14800C36388J77487l2691J52948M2817l5355j41989K10285j36429p1199k48821
$$ 336388 513875 481184 634132 676949 641594 499605 709890 573461 502262 253441
14790B53441k811L89449j36710J48716k4243o958N0798k07311j07095J72389K10852
$$ 253441 250630 640079 503369 652085 627842 620884 671682 464371 357276 529665 740517
14779G40517C49822K81734K88100B03231M35104r7469j81726K59512I2117P98892
$$ 740517 349822 631556 919656 203231 638335 540866 359140 618652 92117 891009
14769H91009C79460J44789L48378l06577l4451l7036K2917L0113n9988K92439
$$ 891009 379460 524249 872627 566050 531599 494563 517480 547593 487605 780044
14759G80044k98536j9796J85758l3573k18658J00800K48439m3166k27736J96205
$$ 780044 481508 461712 647470 613897 395239 496039 744478 701312 473576 669781
14749F69781k78165M32371k99430M94149m52067j91840k5340L13388l05053M67272
$$ 669781 391616 823987 524557 1018706 566639 374799 349459 662847 357794 825066
14739H25066J25308J03234D68854J14088J32812j1903J16208K24932n04883r697
$$ 825066 950374 1053608 468854 582942 715754 703851 820059 1044991 540108 530411
14729E30411O6094J97933L20394B29817O36260J18871k28586k14428o1540P52929
$$ 530411 596505 794438 1114832 229817 866077 984948 756362 541934 480394 1233323
14719A233323m20485j21371O5340l0894K5254J33938j52019O4100j24442J89479
$$ 1233323 812838 691467 756807 725913 751167 885105 733086 797186 672744 862223
14709H62223l66294L43731J67217q3979R2808m88296q217K18520j12472J69424
$$ 862223 495929 839660 1006877 922898 1015706 527410 519193 737713 625241 794665
14699G94665j36705J91624j86664K11314k62913K53467k64997K46840J30377r4857
$$ 794665 657960 849584 662920 874234 611321 864788 599791 846631 977008 882151
14689H82151J04544J00433N1982j08969j26375l27036K73555Q5042J71144m0674
$$ 882151 986695 1087128 1139110 1030141 903766 576730 850285 935327 1106471 1065797
14679A065797k17197L5777r8318N44165j13449k01558l41383L63431k89006K53260
$$ 1065797 848600 884377 786059 1330224 1216775 1015217 673834 1037265 748259 1001519
14669A001519L53627l04305k16673j34936K37251P5062l30741M8823L01023k79838
$$ 1001519 1355146 1050841 834168 699232 936483 1011545 680804 729627 1030650 750812
14659G50812K26461k68315L02046j46489Q8224n9450J44545j15772M14874E81487
$$ 750812 977273 708958 1011004 864515 952739 893289 1037834 922062 1336936 581487
14648A292921k89518L21927J01060R0880m40571J55395J86704m72978N8067R9537
$$ 1292921 1003403 1325330 1426390 1517270 1076699 1232094 1418798 945820 1003887 1103424
14638A103424J67451O0792l96707M62973m6736J38520j31217K47411j58318m09726
$$ 1103424 1270875 1331667 934960 1397933 1351197 1489717 1358500 1605911 1447593 1037867
14628A037867L21432K64320j81228j65240J01657m7229O8230Q4386N9449K62137
$$ 1037867 1359299 1623619 1442391 1277151 1378808 1331579 1399809 1484195 1543644 1805781
14618A805781k20037j62932K3348m28869O98162j74560K02536L5060j50852K1118
$$ 1805781 1585744 1422812 1446160 1017291 1715453 1540893 1743429 1778489 1627637 1648755
14608A648755k47253K7563o6914k29640J04701N8164L5490K90866K6135k7501
$$ 1648755 1401502 1429065 1362151 1132511 1237212 1295376 1330866 1621732 1647867 1620366
14598A620366R0545p6008j58808R5427j67244M75554o7800p4248o3044j26116
$$ 1620366 1710911 1634903 1476095 1571522 1404278 1879832 1812032 1737784 1674740 1548624
14588A548624L23926j61989K14783j20488k25258J81404J99813k13591L90172
$$ 1548624 1872550 1710561 1925344 1804856 1579598 1761002 1960815 1747224 2137396
14579B137396J7147L39q5439N6650O2717l57465L17559k90713Q5239Q0866K63272
$$ 2137396 2154543 2154882 2069443 2126093 2188810 1831345 2148904 1858191 1943430 2024296 2287568
14568B287568k61025L53847n51q4009J04945r2458O8553K5738K29226k43856O57972
$$ 2287568 2026543 2380390 2379839 2295830 2400775 2308317 2376870 2402608 2631834 2387978 3045950
14557C045950l53904M87206n5881P9476N92977N42170N94189J202780K175651
$$ 3045950 2692046 3179252 3123371 3202847 3795824 4337994 4932183 6134963 8310614
14548H310614L742902Q759637J7604641N600515k1748386j0508026E878318k259077
$$ 8310614 12053516 20813153 38417794 44018309 22269923 11761897 5878318 3619241
14540C619241j191155j48843o1899J18345j27927k23065J46012k56419k0341L65809
$$ 3619241 2428086 2279243 2217344 2335689 2207762 1984697 2130709 1874290 1853949 2219758
14530B219758l97646K49961n9695L97589k55961R5082L25957m2158k94334K8276
$$ 2219758 1822112 2072073 2012378 2409967 2154006 2249088 2575045 2532887 2238553 2266829
14520B266829O3705J77650L7148l81536K13630J26437j52534R8545J53228K2983
$$ 2266829 2330534 2508184 2545332 2163796 2377426 2503863 2351329 2449874 2603102 2626085
14510B626085J45378j28636M0208p5287n0069L68231l40505K30696j02788J74560
$$ 2626085 2771463 2642827 2683035 2607748 2557679 2925910 2585405 2816101 2713313 2887873
14500B887873K54787o04928M80943J92209l92795L37978j47385K54699L24138
$$ 2887873 3142660 2537732 3018675 3210884 2818089 3156067 3008682 3263381 3587519
14491C587519l93035K12045k13972Q4732J05233J77898n1476N5313J46802r4564
$$ 3587519 3194484 3406529 3192557 3277289 3382522 3560420 3508944 3564257 3711059 3616495
14481C616495K29704J28844J34082j18055O4979k32694K28737k63685K86807j09109
$$ 3616495 3846199 3975043 4109125 3991070 4056049 3823355 4052092 3788407 4075214 3966105
14471C966105J75135J23995M6811j2880k76203N86796k98371L27318J42594n49858
$$ 3966105 4141240 4265235 4312046 4299166 4022963 4609759 4311388 4638706 4781300 4231442
14461D231442N22470j7896N07712k35524j68319J79854j53450J26711J0523K24355
$$ 4231442 4753912 4736016 5243728 5008204 4839885 5019739 4866289 4993000 5003523 5227878
14451E227878K21203o7176M87219K16105m53602k99432M15101o5120K07410k16630
$$ 5227878 5449081 5381905 5869124 6085229 5631627 5332195 5747296 5682176 5889586 5672956
14441E672956K58747j87236J59R4347O38131O4864q0717J8533K60300N4188k0612
$$ 5672956 5931703 5744467 5744626 5838973 6477104 6541968 6461251 6479784 6740084 6794272 6773660
14430F773660J23711k5803r899r9812M73592P8869N081K48409m9369J62757N06723
$$ 6773660 6897371 6871568 6861669 6761857 7235449 7314318 7319399 7567808 7518439 7681196 8187919
14419H187919l04935K10006L41431R2715J89400O8762j89400K95140J54913O947
$$ 8187919 7882984 8092990 8434421 8527136 8716536 8785298 8595898 8891038 9045951 9052898
14409I052898M0734K95810M1604L88095K40142m0893K01755j88518P3860L97350
$$ 9052898 9093632 9389442 9431046 9819141 10059283 10018390 10220145 10031627 10105487 10502837
14399A0502837L62656k09004M67765K74276p4590R8585L92397J43439L72406J35818
$$ 10502837 10865493 10656489 11124254 11398530 11323940 11422525 11814922 11958361 12330767 12466585
14389A2466585K47862j00894L68271M21517M35530L4667P4565l13915R55930J7715
$$ 12466585 12714447 12613553 12981824 13403341 13838871 13873538 13948103 13634188 14590118 14607833
14379A4607833L11590K30013M53103N77591k26057P52866n8437L68294M08208
$$ 14607833 14919423 15149436 15602539 16180130 15954073 16706939 16648502 17016796 17425004
14370A7425004P69533l2749M30407N64323K1473O95291J87668K99815L95154R81400
$$ 17425004 18194537 18161788 18592195 19156518 19177991 19873282 20060950 20360765 20755919 21737319
14360B1737319J1731K30699R65852O72873N44477O64232L30558M79128R20337
$$ 21737319 21749050 21979749 22945601 23618474 24162951 24827183 25157741 25636869 26557206
14351B6557206M73627O66895N80930R19270J096917L75245Q59792N80911J095064
$$ 26557206 27030833 27697728 28278658 29197928 30294845 30670090 31529882 32110793 33205857
14342C3205857P90730Q27998J209081R55264J154462R58970R87097J165652J415196
$$ 33205857 33996587 34824585 36033666 36988930 38143392 39102362 40089459 41255111 42670307
14333D2670307J471771R29368J783654J672139J525204J503018J643483J979398
$$ 42670307 44142078 45071446 46855100 48527239 50052443 51555461 53198944 55178342
14325E5178342J795523K045882J788899K377839K638563J968372L023387K474334
$$ 55178342 56973865 59019747 60808646 63186485 65825048 67793420 70816807 73291141
14317G3291141K974388K671214L094975L369813L692455L454474L625115M718933
$$ 73291141 76265529 78936743 82031718 85401531 89093986 92548460 96173575 100892508
14309A00892508M144863M726966M716736N422051N134562N926318N915727O799926
$$ 100892508 105037371 109764337 114481073 119903124 125037686 130964004 136879731 143679657
14301A43679657P163120P349529P477352Q745985R044256R441434R792066J0390633
$$ 143679657 150842777 158192306 165669658 174415643 183459899 192901333 202693399 213084032
14293B13084032J1026715J1842870J2217850J3088700J3901996J4170337J4686456
$$ 213084032 224110747 235953617 248171467 261260167 275162163 289332500 304018956
14286C04018956J5600442J5779418J6237032J6334400J6188437J6278017J5999693
$$ 304018956 319619398 335398816 351635848 367970248 384158685 400436702 416436395
14279D16436395J4798772J4762316J3056287J1456100R677130N921348K270020
$$ 416436395 431235167 445997483 459053770 470509870 480187000 486108348 488378368
14272D88378368l68242j689439l289993l222570o527399q357619q889796j0554580
$$ 488378368 488010126 486320687 483030694 479808124 473280725 464923106 456033310 445478730
14264D45478730j3033654j4426383j5444990j6410854j7154633j7303735j7107293
$$ 445478730 432445076 418018693 402573703 386162849 369008216 351704481 334597188
14257C34597188j6687131j6308757j5348882j3959439j4111576j3263545j3022512
$$ 334597188 317910057 301601300 286252418 272292979 258181403 244917858 231895346
14250B31895346j2012215j1169752j0518252j0273913r126735r010221q016398
$$ 231895346 219883131 208713379 198195127 187921214 178794479 169784258 161767860
14243A61767860p691284p416264o923783o558366n883948n512880n286586n071457
$$ 161767860 154076576 146660312 139736529 133178163 127294215 121781335 116494749 111423292
14235A11423292n106940m270857m342246l905277l378219l369795l715437l491582
$$ 111423292 106316352 102045495 97703249 93797972 90419753 87049958 83334521 79842939
14227G9842939k699673l419279j991569l176351k168508k288916k054465j889781
$$ 79842939 77143266 73723987 71732418 68556067 66387559 64098643 62044178 60154397
14219F0154397k527213j575014j663520j912979j327145j782972j056982j597758
$$ 60154397 57627184 56052170 54388650 52475671 51148526 49365554 48308572 46710814
14211D6710814j424889j340523j140418j339508n40378j159776j488302j126917
$$ 46710814 45285925 43945402 42804984 41465476 40925098 39765322 38277020 37150103
14203C7150103j150535n16760j047483o73073j122478r14868q55444p93901q12606
$$ 37150103 35999568 35482808 34435325 33762252 32639774 31724906 30869462 30075561 29262955
14194B9262955o15008l44088r49104p33619n78438n58737m78568q97978k38856
$$ 29262955 28647947 28303859 27354755 26621136 26042698 25483961 25005393 24107415 23868559
14185B3868559l91366q98277n92341k27995l11424o34618k83370n85351n66622
$$ 23868559 23477193 22578916 21986575 21758580 21447156 20812538 20529168 19943817 19377195
14176A9377195j03703n20251l47836l73106k23047n79411n20427j11567l99944
$$ 19377195 19273492 18753241 18405405 18032299 17809252 17229841 16709414 16597847 16197903
14167A6197903o6451n10368k24254l71760k61594k12887k57706m21246k87077
$$ 16197903 16131452 15621084 15396830 15025070 14763476 14550589 14292883 13871637 13584560
14158A3584560l72190O4870J87845l96274l34746m34742K2976m03118j20675k49517
$$ 13584560 13212370 13277240 13465085 13068811 12734065 12299323 12322299 11919181 11798506 11548989
14148A1548989j44848k19551k7350j77053j11960j21759k02201k70028o2662j18456
$$ 11548989 11404141 11184590 11157240 10980187 10868227 10746468 10544267 10274239 10211577 10093121
14138A0093121l36418k38402R6759j31074p873k97997j08421k16193m32587L34852
$$ 10093121 9756703 9518301 9615060 9483986 9476113 9178116 9069695 8853502 8420915 8755767
14128H755767m48122R1582j940l63143l2825k55975j08653J47390j01011l04234
$$ 8755767 8307645 8399227 8397287 8034144 8001319 7745344 7636691 7784081 7683070 7378836
14118G378836J19152J16934o75436l56338N38478l51203k3663k7503P0590K0767
$$ 7378836 7497988 7614922 6939486 6583148 7121626 6770423 6746760 6719257 6789847 6810614
14108F810614k74981M317j80211q2370j28964r0786L282J96969j26218k32432
$$ 6810614 6535633 6539950 6359739 6277369 6148405 6057619 6060901 6257870 6131652 5899220
14098E899220j05968j74301J80230m07826K49957j61460j49538k91940M72444
$$ 5899220 5793252 5618951 5799181 5391355 5641312 5479852 5330314 5038374 5510818
14089E510818l01835P4677K19530o58352J18740J27819o58047L56363R0478j25579
$$ 5510818 5208983 5283660 5503190 4844838 4963578 5091397 4433350 4789713 4880191 4754612
14079D754612O1826N6460j534k99671L16962l37990l27545K94930L08843o12086
$$ 4754612 4816438 4872898 4871364 4571693 4888655 4550665 4223120 4518050 4826893 4214807
14069D214807O3584k68514N6360Q7063o7298n165l56009J53841K83567M3598J7588
$$ 4214807 4278391 4009877 4066237 4153300 4086002 4080837 3724828 3878669 4162236 4205834 4223422
14058D223422l48971J93733j65689k01325K39443m13802M29912l41685n0315O431
$$ 4223422 3874451 4068184 3902495 3701170 3940613 3526811 3956723 3615038 3564723 3571154
14048C571154l83563L50014N7227q3392k21204N7607J13322o0557n5421J09858
$$ 3571154 3187591 3537605 3594832 3511440 3290236 3347843 3461165 3400608 3345187 3455045
14038C455045l83371K24502m10342K89299K78959q20988O42741l15475m423K0767
$$ 3455045 3071674 3296176 2885834 3175133 3454092 2633104 3275845 2960370 2955947 2976714
14028B976714j01390K18683k46910J57938l97500L56436j48877o0155j51501J79998
$$ 2976714 2875324 3094007 2847097 3005035 2607535 2963971 2815094 2754939 2603438 2783436
14018B783436M0583k75828J12232n0095Q0034j32461j63842j89595l2937K90700
$$ 2783436 2824019 2548191 2660423 2610328 2690362 2557901 2394059 2204464 2171527 2462227
14008B462227L62561o40916L18450k39801r8508j01684M14271q4007m16264M02955
$$ 2462227 2824788 2183872 2502322 2262521 2164013 2062329 2476600 2392593 1976329 2379284
13998B379284J40129k91379r2704L53490l30325j06022K05660K51514L62261J548550
$$ 2379284 2519413 2228034 2135330 2488820 2158495 2052473 2258133 2509647 2871908 4420458
13988D420458K670229P008391J8193806J2391066j8926548j1550182n331943k468184
$$ 4420458 7090687 14099078 32292884 44683950 25757402 14207220 8875277 6407093
13980F407093j321008o93069q42464J11451m36702j07569n03214K49103k55881
$$ 6407093 5086085 4393016 3550552 3662003 3225301 3117732 2614518 2863621 2607740
13971B607740P5101J71532k25792n3444m36420K75047j27167K97198l90679k47133
$$ 2607740 2682841 2854373 2628581 2575137 2138717 2413764 2286597 2583795 2193116 1945983
13961A945983J34811K90527k37535n943j77100L6369J71413k54622j01532J45653
$$ 1945983 2080794 2371321 2133786 2127843 1950743 1987112 2158525 1903903 1802371 1948024
13951A948024K37445j34628K127k55458J80267O8473j22754q6870l86121K52872
$$ 1948024 2185469 2050841 2052968 1797510 1977777 2046250 1923496 1836626 1450505 1703377
13941A703377P9268O0575j7268j86966J12654L8935L138k76719L59594n44286
$$ 1703377 1782645 1843220 1825952 1638986 1751640 1790575 1793713 1516994 1876588 1332302
13931A332302Q64327l80895l57447J41340k46508L50837l02476J16606J41388
$$ 1332302 2196629 1815734 1458287 1599627 1353119 1703956 1401480 1518086 1659474
13922A659474q9257Q32l1243n8163N2460q3519K07924r221k95144r7567R025L37910
$$ 1659474 1570217 1571049 1539806 1481643 1534103 1450584 1658508 1649287 1354143 1256576 1265601 1603511
13910A603511r3872o7680K31330l78219J46890l59853K97865K07264l90210l983
$$ 1603511 1509639 1441959 1673289 1295070 1441960 1082107 1379972 1587236 1197026 1193043
13900A193043R8376K00519j31168l83030k5301K22401p882r9954L5872j8132l7118
$$ 1193043 1291419 1491938 1360770 977740 952439 1174840 1166958 1067004 1102876 1084744 1047626
13889A047626K26081q0642J69558m6940l62583J47996K48589O8065J2489J8689
$$ 1047626 1273707 1193065 1362623 1315683 953100 1101096 1349685 1417750 1430239 1448928
13879A448928k80277J07081j3052j7493l89453L28999j46125J14589p6985O3367
$$ 1448928 1168651 1275732 1262680 1245187 855734 1184733 1038608 1153197 1076212 1139579
13869A139579J13526l54636K50008n4716j14556K35673j00367J77099n9918j18928
$$ 1139579 1253105 898469 1148477 1093761 979205 1214878 1114511 1291610 1231692 1112764
13859A112764O9951j23546K6143j48053J55499L3647l00562M83318j70185l30252
$$ 1112764 1182715 1059169 1085312 937259 1092758 1126405 825843 1309161 1138976 808724
13849H08724M57226n84507K46588M69831n67123r548O9987Q2617j69646M2326
$$ 808724 1265950 681443 928031 1397862 830739 821191 891178 973795 804149 846475
13839H46475o2175J27952j25507K93520j88553p5926J34161m243L932K75964n09729
$$ 846475 784300 912252 786745 1080265 891712 815786 949947 945704 949636 1225600 715871
13828G15871J8764M56596j42585j1533o3783o3698J18909o7098k48366m5809M19366
$$ 715871 734635 1191231 1048646 1037113 973330 909632 1028541 961443 713077 667268 1086634
13817A086634j64985P4868m39250N04197N6328j17660j68647n9298M18416m65637
$$ 1086634 921649 996517 557267 1061464 1117792 1000132 831485 772187 1190603 724966
13807G24966r228J84443j18009J26256K00201k23892j9165J13494m29308M10962
$$ 724966 715738 900181 782172 908428 1108629 884737 865572 979066 549758 960720
13797I60720q9815j35829M8719J84802J02275k54426N626r1351j65234L75691
$$ 960720 870905 735076 783795 968597 1070872 816446 822072 730721 565487 941178
13787I41178r4797J72463l74956M4175p6558Q0274k2952K6821k84211M55247J56090
$$ 941178 846381 1018844 643888 688063 611505 691779 668827 695648 411437 866684 1022774
13776A022774k16862C80123N7341K73681n7074j25026M7143J44410q9008k5001
$$ 1022774 805912 380123 437464 711145 654071 529045 576188 720598 631590 606589
13766F06589J3708J66625j78491L68887n3282m21567M96328l85993K94131k93785
$$ 606589 620297 786922 608431 977318 924036 502469 998797 612804 906935 613150
13756F13150K35591j84368B50291P01345D48362J55423J31502C22920K45742B66519
$$ 613150 848741 664373 250291 951636 448362 603785 735287 322920 568662 266519
13745H40424Q9381k89061j08184P3402K16337k21533r6897m0081K14178j53628
$$ 840424 929805 640744 532560 605962 822299 600766 503869 463788 677966 524338
13735E24338L05052B54013N29161j41434K47494m13188K1314K42633k27803K78501
$$ 524338 829390 254013 783174 641740 889234 476046 497360 739993 512190 790691
13725G90691j756j06612l00317K99779j68062J25416O1711r6945m0942K02951
$$ 790691 788935 682323 382006 681785 513723 639139 700850 603905 562963 765914
13715G65914L0091k58023j60973L44384J27511j80611C24845L81114k03889J85869
$$ 765914 796005 537982 377009 721393 848904 668293 324845 705959 502070 687939
13705F87939j27064P7910J04953l52348P8176J93501j40205K59519k12624J9740
$$ 687939 560875 638785 743738 391390 469566 663067 522862 782381 569757 589497
13695E89497k32820M11443R7280q5636j20790B19044M37973N2539k5813k3032
$$ 589497 356677 768120 865400 779764 658974 219044 657017 709556 683743 660711
13685F60711l09140K70283k75249M35804j01237q228j64895k14941p4112k7815
$$ 660711 351571 621854 346605 782409 681172 672944 508049 293108 218996 191181
13675A91181L46433J48511k51497R3337K73659k35835k67636M2794O5557j33233
$$ 191181 537614 686125 434628 527965 801624 565789 298153 340947 406504 273271
13665B73271P3339L47135K4038C16254O6873j05076K65896J82911k61509j12021
$$ 273271 346610 693745 717783 316254 383127 278051 543947 726858 465349 353328
13655C53328K05543Q6251k23458J099N373j13855A50872K69708l6126N0680Q817
$$ 353328 558871 645122 421664 422763 428136 314281 150872 420580 384454 435134 443951
13644D43951K59531A58386m1260J90505K17289P8830J64148k29838J20519P2125
$$ 443951 703482 158386 117126 307631 524920 603750 767898 538060 658579 730704
13634G30704B08956J45332l3829q8622L14745k15772H3558M42912K3976q1126
$$ 730704 208956 354288 320459 231837 546582 330810 83558 526470 550446 469320
13624D69320J74565j92325K9069j88417H4787J47042K57099B23174K38625K27683
$$ 469320 643885 451560 480629 292212 84787 231829 488928 223174 461799 689482
13614F89482k99256P4174M4576p3846A03917L16688Q2228q0050j57055K16225
$$ 689482 390226 464400 508976 435130 103917 420605 502833 422783 265728 481953
13604D81953A06628O44723k60662B27034K63699o4487r3238A12720L9839K58871
$$ 481953 106628 751351 490689 227034 490733 426246 333008 112720 152559 411430
13594D11430L0569j45122K38762j08631J01470L1405A38362n3739K17104R9132
$$ 411430 441999 296877 535639 427008 528478 559883 138362 84623 301727 400859
13584D00859A97912K85103L38493f0310A79024K55266m5251J37850B25624N6356
$$ 400859 197912 483015 821508 -60310 179024 434290 389039 526889 225624 281980
13574B81980R1799j56036L86657k29783j13917p3797J57675L89445C39520J8522
$$ 281980 373779 217743 604400 374617 260700 186903 344578 734023 339520 358042
13564C58042J08371C0046a11487B25419J28999j66103L13896K60694l69528j93782
$$ 358042 466413 30046 -111487 225419 354418 188315 502211 762905 393377 199595
13554A99595J30783j08893K41394B6406K99590A36342J27792K47600B05396O2217
$$ 199595 330378 221485 462879 26406 325996 136342 264134 511734 205396 267613
13544B67613n9872K05715j4798A18294L10070I6912K98524A32202K6951B3759
$$ 267613 207741 413456 398658 118294 428364 96912 395436 132202 159153 23759
13533C37122A44871R1951P9104A27361M1145M9663A5806J46197a38541F9045K33935
$$ 337122 144871 236822 315926 127361 168506 218169 15806 162003 -138541 69045 302980
13522C02980H9089L19609j07047O5695I9639O8457J33990m1111q0857i5641A67334
$$ 302980 89089 408698 301651 367346 99639 168096 302086 260975 180118 -95641 167334
13510E13124j64559J451q9288J19823l3463o6016J30745g0836D50598k02762K86691
$$ 513124 348565 350016 260728 380551 347088 281072 411817 -70836 450598 247836 534527
13499E34527a30021G7469P3031K89802j57604K24071A63280J24913M14982A46493
$$ 534527 -130021 77469 150500 440302 282698 506769 163280 288193 703175 146493
13488A29825J33207K40787B18657M14744k82106j34417O4366J683o1996R593P6088
$$ 129825 263032 503819 218657 633401 351295 216878 281244 282927 220931 230524 306612
13477C06612A36281a80612B07215F0983J11333J97707N289e6109A94603O1656
$$ 306612 136281 -180612 207215 60983 172316 370023 375312 -56109 194603 256259
13467B56259q1455J57647M0273A02184K20039r4385k3667J11910j11924F2825
$$ 256259 174804 332451 372724 102184 322223 227838 204171 316081 204157 62825
13456A84718j1204O1397A14313j522J98007j52628L4158J0879J5447n6459o887
$$ 184718 173514 234911 114313 112791 310798 158170 192328 203207 218654 162195 155308
13445A55308J41813A17471K75371A73713L30442A10086N2394o5353L74266k12157
$$ 155308 297121 117471 392842 173713 504155 110086 162480 97127 471393 259236
13435B59236O5095j40170H7191R5206J2326h9628B90643p5209K42382K5563j6633
$$ 259236 324331 184161 87191 182397 194723 -89628 290643 215434 457816 483379 466746
13424D66746n7702f9439A94263K3263j3629I9896J96579J64828G8655J91068a62092
$$ 466746 409044 -69439 194263 217526 203897 99896 296475 461303 78655 269723 -162092
13412B59031J72709b3583B34117K36992j71312J94916B12966A1154J30396J47219
$$ 259031 431740 -23583 234117 471109 299797 494713 212966 11154 141550 288769
13402B88769K6631J7936j6795C2861a10841A19042P6107a73656H4377L22373F1526
$$ 288769 315400 333336 316541 32861 -110841 119042 195149 -173656 84377 406750 61526
13390E1800I89M41897A76972R337b97048C1844i2769A38999M8148J3813O3352
$$ 51800 989 442886 176972 186309 -297048 31844 -92769 138999 187147 200960 264312
13379B64312P7301q9326j3752J37472m3108j45286A0720K54967R490J6307J64195
$$ 264312 341613 252287 238535 376007 332899 187613 10720 265687 275177 291484 455679
13368D55679E3947M12584A53075J20340O9528A51981J56917n3446A11384K4773
$$ 455679 53947 466531 153075 273415 342943 151981 308898 255452 111384 136157
13358A36157c3113A52292l8710k8306L22170j13883p2599j01093E1556J60865
$$ 136157 -33113 152292 113582 85276 407446 293563 220964 119871 51556 212421
13348B12421K61604B1957K43005J54022a31230A4572O7713K27374H7083L729J51061
$$ 212421 474025 21957 264962 418984 -131230 14572 82285 309659 87083 90812 241873
13337B41873Q9709A26217K16049n6508A25047b33958a3820B62088Q6474A12435
$$ 241873 331582 126217 342266 285758 125047 -233958 -13820 262088 348562 112435
13326B65652m2981C1409b88949B02562M518p3235K31203A62596L7912K28783F7724
$$ 265652 222671 31409 -288949 202562 207080 133845 365048 162596 200508 429291 67724
13314B29752K15057j45819J00701P5564M7116I5718J46886j14706J39065O754
$$ 229752 444809 298990 399691 475255 522371 95718 242604 127898 266963 273717
13304B73717j7998j02327J80375j30815O5173K0212A32667L9833a48764A22123
$$ 273717 255719 153392 333767 202952 268125 288337 132667 172500 -148764 122123
13293A18519K10518j40233J72843F13K7594J44310e6249A87084n9218M9353L1924
$$ 118519 329037 188804 361647 613 28207 172517 -56249 187084 127866 177219 209143
13282B09143F1724L04999j59221K78273j60308l4694J77911B29146K6214G6952
$$ 209143 61724 366723 207502 485775 325467 290773 468684 229146 255360 76952
13271G9282d5200A4493L52243A29816h3317A18395E6891Q2415P533J48199o2908
$$ 79282 -45200 14493 366736 129816 -83317 118395 56891 139306 146839 295038 232130
13260B32130b37063E5915A1491J87197B4722R1394M6170C4651L30254A16643K9310
$$ 232130 -237063 55915 11491 198688 24722 116116 162286 34651 364905 116643 145953
13249A45953P8313c7203G2923e56511A48203M8260J2218J29710K09851I7418K68225
$$ 145953 224266 -37203 72923 -556511 148203 196463 208681 338391 548242 97418 365643
13238C65643F6047h5496F1435J76771A7772d5759C42781j3725A32287J32773a13013
$$ 365643 66047 -85496 61435 238206 17772 -45759 342781 329056 132287 265060 -113013
13226B43173a95774A59776J08718b69510A68083K3093F8326J41305n7251J4548
$$ 243173 -195774 159776 268494 -269510 168083 191176 68326 209631 152380 166928
13216A66928j818K3807C0893j0646g0684D2187N33826i8141a2410A32589a4628
$$ 166928 165110 188917 30893 20247 -70684 42187 576013 -98141 -12410 132589 -14628
13204b8482J2920E4286Q6604l7910a58303A41546J2427O5268a68472A98181b50370
$$ -28482 -15562 54286 140890 102980 -158303 141546 153973 219241 -168472 198181 -250370
13192a60450C84202q2040b1970B9114P3190K10565q2158F1737K18583Q622d3029
$$ -160450 384202 302162 -21970 29114 102304 312869 230711 61737 280320 288942 -43029
13180c3373B42432G2K4018a2315C83142I9912K61790n1151n6852I28a061I9621
$$ -33373 242432 72 24090 -12315 383142 99912 361702 310551 253699 928 -1061 99621
13167B48299j03523a66547F1941k2241d71824D3556j2416K39049j28136R9062
$$ 248299 144776 -166547 61941 39700 -471824 43556 31140 270189 142053 241115
13157B41115J77514e00782A80098J33863j56133b9245D51579c0643o4109d3491
$$ 241115 418629 -500782 180098 313961 157828 -29245 451579 -30643 -94752 -43491
13146d2903m9283A99634q4429I282e2249k45030L0110H3993k5443d0953k25116
$$ -42903 -92186 199634 115205 9282 -52249 -297279 -267169 83993 58550 -40953 -266069
13135b66069J25536A4845B021L7526b43506B41693d0955A25855B6678J89583Q1117
$$ -266069 -140533 14845 2021 39547 -243506 241693 -40955 125855 26678 216261 297378
13124B97378g8187j11191D9637K81818b8895B50698b70932d753B45558P4760B901
$$ 297378 -78187 -189378 49637 331455 -28895 250698 -270932 -4753 245558 320318 2901
13112G570J58162N7714C5444J33194j8194f6066C94844f3212A47512a28833C81325
$$ 7570 165732 223446 35444 168638 150444 -66066 394844 -63212 147512 -128833 381325
13100a37487L8954C36987j25593m3658J74900a96517h8449K6262A21918Q659A0684
$$ -137487 -98533 336987 211394 167736 342636 -196517 -88449 -62187 121918 130577 10684
13088a72459k9971B85951d692B26710L4017A23523a43120B22067o6483C8305a10060
$$ -172459 -202430 285951 -4692 226710 260727 123523 -143120 222067 155584 38305 -110060
13076G4096L07668F388K08450B5652A1087h7962B0799a4714m0224G7972O7481
$$ 74096 381764 6388 214838 25652 11087 -87962 20799 -14714 -54938 77972 145453
13065A45453J17069j21990L12418j79903m7022F8529N5055E3198J43316F6967
$$ 145453 262522 140532 452950 273047 226025 68529 123584 53198 196514 66967
13054G5484L30615j03239A05814J41302L2585i7020l4740B54826a52644A48896
$$ 75484 406099 302860 105814 247116 279701 -97020 -131760 254826 -152644 148896
13043C8755J09752K23263b02463D05494A03973N5999a1932B75190b86861p4725
$$ 38755 148507 371770 -202463 405494 103973 159972 -11932 275190 -286861 -361586
13033c61586B64562o5193c717p5687A5701L19318o157b58996I8591K8883P7867
$$ -361586 264562 199369 -3717 -79404 15701 335019 328862 -258996 98591 127474 205341
13022B05341a48298C15567p3460a0247m4403I9451C9107L7268b32334B35675K0856
$$ 205341 -148298 315567 242107 -10247 -54650 99451 39107 76375 -232334 235675 256531
13011B56531r839a04306A28726h7388A29187f4937A63754e5594A38746q568J482
$$ 256531 246692 -104306 128726 -87388 129187 -64937 163754 -55594 138746 130178 131660
13000A31660K75230A53087B1248R7410J26242a02526I8417Q5620p6273J97264
$$ 131660 406890 153087 21248 118658 244900 -102526 98417 184037 107764 305028
12990C05028b62610j2379H7317J3356J72635D2569a66760B69247a380j13287B07495
$$ 305028 -262610 -274989 87317 100673 273308 42569 -166760 269247 -1380 -114667 207495
12978E12273a8763B47506p4123M3505j1836G5845K35042r8053p261a64846b8576
$$ 512273 -18763 247506 173383 216888 205052 75845 310887 212834 205573 -164846 -28576
12966D2230K53112f051D68240f649A9085J17127J34816N5763h5345C02338A40706
$$ 42230 295342 -6051 468240 -6649 19085 136212 271028 326791 -85345 302338 140706
12954c9080B75288B5963R7968b37975A14916C6608K4828J73679a283j58083C04763
$$ -39080 275288 25963 123931 -237975 114916 36608 61436 235115 -1283 -159366 304763
12942G2447L8637a6166D5823j6435J04665J52370A04340a67145p6180A66971G8263
$$ 72447 111084 -16166 45823 29388 134053 286423 104340 -167145 -243325 166971 78263
12930a94798D08723F4690a3283j78327D08576i0297D36753A86239B8289J83965
$$ -194798 408723 64690 -13283 -191610 408576 -90297 436753 186239 28289 212254
12920B12254q6269J59999c70958i8010q7826e6374C12958j33702m8879l1948j3224
$$ 212254 125985 285984 -370958 -98010 -185836 -56374 312958 179256 130377 98429 85205
12909H5205k1772J62497a29308d7368B4365M14173A07003J19293a02870j39317
$$ 85205 63433 225930 -129308 -47368 24365 438538 107003 226296 -102870 -242187
12899b42187A22430A2520a04216G0153L71617A23516a8097j08207B8005J75793
$$ -242187 122430 12520 -104216 70153 441770 123516 -18097 -126304 28005 203798
12889B03798A00915L0896c15023E4998M6599d280B64573b90668H4203K08895j03029
$$ 203798 100915 131811 -315023 54998 101597 -4280 264573 -290668 84203 293098 190069
12878A90069a1049l3383A20141b12273Q9017A48145J1496a14658k2870M8022b505
$$ 190069 -11049 -44432 120141 -212273 -123256 148145 159641 -114658 -137528 -89506 -2505
12866C9484J8163M40904m1354G7589O8589i3447f45A77812Q9723J91150j90589
$$ 39484 57647 498551 457197 77589 146178 -93447 -645 177812 267535 458685 268096
12855B68096q8159K184F8391L08846a03662k22349b1552j70355B26159r4622J54572
$$ 268096 179937 182121 68391 377237 -103662 -326011 -21552 -191907 226159 131537 286109
12844B86109o7356a8081A76434a31409H4743A6723J99169b46654P8216n9242P2952
$$ 286109 218753 -18081 176434 -131409 84743 16723 215892 -246654 -168438 -227680 -154728
12833a54728A9959Q569a10892b462C7744i4399A54195a39990A24112b4899B65512
$$ -154728 19959 28528 -110892 -2462 37744 -94399 154195 -139990 124112 -24899 265512
12821B0421N1435M52662E6485b27839B6347g333A17860b0775C04045E6953b14537
$$ 20421 71856 524518 56485 -227839 26347 -7333 117860 -20775 304045 56953 -214537
12809A91656o218n9687c09442A36406a16566k97838a3220o0195F9544Q349i7336
$$ 191656 185438 125751 -309442 136406 -116566 -414404 -13220 -73415 69544 77893 -97336
12797a50295F1454j9718a56320o7739c8639E02J49597E9014c59033H4138b58925
$$ -150295 61454 41736 -156320 -224059 -38639 502 150099 59014 -359033 84138 -258925
12785A32889J45902G3361J25330I1677l4222a15572H8287c9107A29409a01167
$$ 132889 278791 73361 198691 91677 57455 -115572 88287 -39107 129409 -101167
12774D28309J1007F7875b4421A66231c3745A7091K87992B9480f8424B11288b35535
$$ 428309 439316 67875 -24421 166231 -33745 17091 305083 29480 -68424 211288 -235535
12762H4018a07655F9239a89432G2906a16098b5248i63r5899C28576E9667f5324
$$ 84018 -107655 69239 -189432 72906 -116098 -25248 -963 -96862 328576 59667 -65324
12750d8493b0080E8382c6716J6803A82692M9903E7899f2074C85765G5669b00876
$$ -48493 -20080 58382 -36716 -19913 182692 232595 57899 -62074 385765 75669 -200876
12738H1040L8966a88993B66770A9253L20055E0328P152K7740L2938b2361A07624
$$ 81040 120006 -188993 266770 19253 339308 50328 57480 85220 118158 -22361 107624
12726a68268A01886e4523r1027A00505D1290d8177B06035N9557a50453M0971C6638
$$ -168268 101886 -54523 -145550 100505 41290 -48177 206035 265592 -150453 -109482 36638
12714b89827a5650A82166b21493H9882Q2944M2942J25983F2068Q2924M1455l9729
$$ -289827 -15650 182166 -221493 89882 172826 215768 341751 62068 144992 186447 146718
12703A46718R9793r2454b23703g5136C88354j02808d5010J1764A9137L81516q4610
$$ 146718 246511 154057 -223703 -75136 388354 285546 -45010 -33246 19137 400653 316043
12692C16043D1853d425B4281J94600r3700J43724E4055J76383P8664a38800A86262
$$ 316043 41853 -4425 24281 218881 125181 268905 54055 230438 309102 -138800 186262
12680D575J59910M6026A7169J92136J00237A50398a58666B71797b04681A23904
$$ 4575 164485 210511 17169 209305 309542 150398 -158666 271797 -204681 123904
12669B01100g9785A37235R6461f8132B18873a28494H3941K30826K9939I0339K05783
$$ 201100 -79785 137235 233696 -68132 218873 -128494 83941 314767 344706 90339 296122
12658B96122J70428B17055E4016c7171D06943I5041K18364h7141c5374F0517J190
$$ 296122 466550 217055 54016 -37171 406943 95041 313405 -87141 -35374 60517 61707
12647F1707J48370J5333E2157L60456A19670g2600j45336d2684B39310r6473o4933
$$ 61707 210077 225410 52157 412613 119670 -72600 -217936 -42684 239310 142837 77904
12636G7904J13064Q100E0404K27501k4233A12952L42J08920k9870J10946a29346
$$ 77904 190968 199068 50404 277905 253672 112952 113294 222214 192344 303290 -129346
12624C65196a4081C51195a89236A66467J7727K34780m2838h2998p1726N9860K5259
$$ 365196 -14081 351195 -189236 166467 184194 418974 376136 -82998 -154724 -94864 -69605
12613f9605A73883P8528J19014a30809A20270k8932J79258g9128C21290I8704
$$ -69605 173883 252411 371425 -130809 120270 91338 270596 -79128 321290 98704
12602c6198A66390p0085D153J66293n4533a55073P0164k156I2060B5317Q9305
$$ -36198 166390 96305 4153 170446 115913 -155073 -84909 -87065 92060 25317 114622
12591A14622a58759j28993A43642e1191b929j96097i0539c5572j46526I4562h0396
$$ 114622 -158759 -287752 143642 -51191 -2929 -199026 -90539 -35572 -182098 94562 -80396
12579h3045b7266k13222l0375L8082B0398R4692K8110e4547A71045b11278B038
$$ -83045 -27266 -240488 -270863 -232781 20398 115090 143200 -54547 171045 -211278 2038
12567A23812K7762a94119j78945I9902c22153b0506E7968J3218J67889A16655
$$ 123812 151574 -194119 -373064 99902 -322153 -20506 57968 71186 239075 116655
12556C12379C1134K36067n9925J08988l7129l2913b24936f5264A89995e264C65541
$$ 312379 31134 267201 207276 316264 279135 246222 -224936 -65264 189995 -5264 365541
12544a13224M8772B6477K72252n9489A17703O0895E1578a16276c5311A40902l3721
$$ -113224 -64452 26477 298729 239240 117703 178598 51578 -116276 -35311 140902 107181
12533A07181b51437A91804K7911D0408N498a45461I511a3713B34256h0127m7530
$$ 107181 -251437 191804 219715 40408 45906 -145461 9511 -13713 234256 -80127 -127657
12522a27657l8370A79811G3642L3871K08566A20886h9339j32800O6191B24485
$$ -127657 -166027 179811 73642 107513 316079 120886 -89339 -222139 -155948 224485
12511G3105b26664A6440i7371K9741H3938a25436j76290A91989b4718B75724j03809
$$ 73105 -226664 16440 -97371 -67630 83938 -125436 -301726 191989 -24718 275724 171915
12500A71915O3737J44333G0941a59195A19659m8992C0654d5460A31963F1088K05139
$$ 171915 235652 379985 70941 -159195 119659 70667 30654 -45460 131963 61088 266227
12489B66227c27087a00524C05142A30074N5053G772Q3292K16973p7693n2531a47358
$$ 266227 -327087 -100524 305142 130074 185127 7772 91064 308037 230344 177813 -147358
12477B8214J63439n6097c26904C7701J46371E4542L483b02830k13036h8757c1353
$$ 28214 191653 135556 -326904 37701 184072 54542 58025 -202830 -415866 -88757 -31353
12465b0348A62209p936J75206J45293C1055r87L26562A36060F5928L02262b2689
$$ -20348 162209 154273 329479 474772 31055 30068 356630 136060 65928 368190 -22689
12453A31441F4336K41801B3389J79682r1017R9453m8703n3828b29303E1179j8019
$$ 131441 64336 306137 23389 203071 112054 211507 162804 108976 -229303 51179 33160
12442C3160J50171J0653a15830I9056d986k713F9574a38414r5087B4130K00116
$$ 33160 183331 193984 -115830 99056 -4986 -7699 69574 -138414 -233501 24130 224246
12431B24246h432l63917b3053j31816A32153a94723B43212F6904j2506K21036
$$ 224246 -8432 -372349 -23053 -154869 132153 -194723 243212 66904 54398 275434
12421B75434a22070A54854J29394a30232A09566l9414J72961g9977q8338A86175
$$ 275434 -122070 154854 284248 -130232 109566 70152 243113 -79977 -168315 186175
12410A19456c99975J63754e4499a5447m40517A39398O1529J11153p2159G585J9734
$$ 119456 -399975 -236221 -54499 -15447 -455964 139398 200927 312080 239921 7585 27319
12399B7319J5981d9281j09600K9381D1546d9622C09475B9481J19122J87600a26836
$$ 27319 43300 -49281 -158881 -129500 41546 -49622 309475 29481 148603 336203 -126836
12387E7386Q8931d6948B51639m4749I2969a29878b9238C12093A46348E0235a19629
$$ 57386 146317 -46948 251639 206890 92969 -129878 -29238 312093 146348 50235 -119629
12375E0568A4432J68734D9864c74524a70931A59156h4123A33725J11543B3206
$$ 50568 14432 183166 49864 -374524 -170931 159156 -84123 133725 245268 23206
12364f5244F8248a55011b6098A75669L9860K5242a90688I6189H405e6995j00347
$$ -65244 68248 -155011 -26098 175669 215529 240771 -190688 96189 8405 -56995 -157342
12353a57342F5281b66277g3853p6461A80739a76044A30582d9244j6824m1434B70782
$$ -157342 65281 -266277 -73853 -150314 180739 -176044 130582 -49244 -66068 -107502 270782
12341D6783c59424J28175Q8061j24225A70989G8191d207j37505F1793K55212b2792
$$ 46783 -359424 -231249 -143188 -267413 170989 78191 -4207 -141712 61793 317005 -22792
12329C05236a27503q5351B7872Q5625a40039j75016g5611m573D3671a54578G5440
$$ 305236 -127503 -212854 27872 113497 -140039 -315055 -75611 -80184 43671 -154578 75440
12317A07454j3745k5234C3289K6260A3789f7929k01655g4335C4914O6118o227
$$ 107454 93709 68475 33289 59549 13789 -67929 -269584 -74335 34914 101032 94805
12306I4805C3152R996g3757A21698b38352D6005P0237b905k30092e5153B16139
$$ 94805 33152 43148 -73757 121698 -238352 46005 116242 -2905 -232997 -55153 216139
12294I0958c9014o267n1210C39365b0945o387A47698d0612A70791J10358J49843
$$ 90958 -39014 -45281 -96491 339365 -20945 -27332 147698 -40612 170791 281149 430992
12283D30992J9570b61554j1668J06532B15338J17766H9113A3991L9546M144k3781
$$ 430992 450562 -261554 -273222 -166690 215338 333104 89113 13991 53537 57681 33900
12272C3900L13555c45281A32681r560o588a18812A96384B1947L35297a54490a8904
$$ 33900 347455 -345281 132681 123121 116533 -118812 196384 21947 357244 -154490 -18904
12260A32134a03301B21173A10435b17507E8946K4783J43691m6938K30673a80961
$$ 132134 -103301 221173 110435 -217507 58946 83729 227420 180482 411155 -180961
12249h2748B33563R2607R981A21266P3416b47596B01004J10320a39039f0057A16565
$$ -82748 233563 326170 336151 121266 194682 -247596 201004 311324 -139039 -60057 116565
12237G6686M67172c04515B43098A04749j5341a15212A08357R2854c3478A93993
$$ 76686 543858 -304515 243098 104749 89408 -115212 108357 201211 -33478 193993
12226H2548J61208c2497r9365B98908N1260A28557N0874j7050K68772G6352J74622
$$ 82548 243756 -32497 -131862 298908 350168 128557 179431 162381 431153 76352 250974
12215B50974N3739G9806k0722A7740b5574B33660k1733c0618j095r4978B50543
$$ 250974 304713 79806 59084 17740 -25574 233660 211927 -30618 -31713 -126691 250543
12203B30098E2743L49640j45300I7080K06010k5384p8990J50770K37119j90385
$$ 230098 52743 402383 257083 97080 303090 277706 198716 349486 586605 396220
12193C96220g0147A91860K99375A97348M534L4040B1428N4643A3916a923B2803
$$ 396220 -70147 191860 491235 197348 201882 235922 21428 76071 13916 -1923 22803
12181b37972A54262g4405F9383J58989F9161D526N4728K69842j32288N9298j23141
$$ -237972 154262 -74405 69383 228372 69161 4526 59254 329096 196808 256106 132965
12170A32965g2950C23541l3518e9192B93319B7843R890K11761F2273L9817D355
$$ 132965 -72950 323541 290023 -59192 293319 27843 37733 249494 62273 102090 4355
12158A75483a13133b7331C2083a36935M2435E0680a2743F9745l3256K52666A16233
$$ 175483 -113133 -27331 32083 -136935 -94500 50680 -12743 69745 36489 289155 116233
12146f296k26155A32542L8973B0676g4321D9295c2929B09624d1901p8050b2916
$$ -6296 -232451 132542 171515 20676 -74321 49295 -32929 209624 -41901 -119951 -22916
12134A4886c9642A00076m8382a12528I1384a79656H3560K41398o837C9789a44689
$$ 14886 -39642 100076 51694 -112528 91384 -179656 83560 324958 318121 39789 -144689
12122B33710J18303b38268A37821a4442A22728n2295h0892b6071C9516A4176i6228
$$ 233710 352013 -238268 137821 -14442 122728 70433 -80892 -26071 39516 14176 -96228
12110d679j75837p3902D0064a28198H4317c24224D22131a33968A85294K4081b65730
$$ -4679 -180516 -254418 40064 -128198 84317 -324224 422131 -133968 185294 209375 -265730
12098B03712b45578E6166d0174H1188L08966b2086B61104N2867A52700e9964j17083
$$ 203712 -245578 56166 -40174 81188 390154 -22086 261104 313971 152700 -59964 -177047
12087a77047k6997B60014M6230J88023a19063B29311h604E8582K0673k9630K42241
$$ -177047 -204044 260014 306244 494267 -119063 229311 -8604 58582 79255 49625 291866
12076B91866a04419L5642I5328R4920b24771H7211e5079o2913o7563E0959B5363
$$ 291866 -104419 -68777 95328 190248 -224771 87211 -55079 -117992 -185555 50959 25363
12064G7024M5339a60203A43129J42526i3449C0690N6814A8562a80279p6165f2816
$$ 77024 122363 -160203 143129 285655 -93449 30690 87504 18562 -180279 -256444 -62816
12052g9966j5244C95401D6407J87898h7830D1160K32153J1018k2367f1588k06447
$$ -79966 -95210 395401 46407 234305 -87830 41160 273313 284331 261964 -61588 -268035
12041b68035A17569K4759g3390H6096a48079l2523f6406K9238q5394r5721A88940
$$ -268035 117569 142328 -73390 86096 -148079 -180602 -66406 -37168 -122562 -218283 188940
12029F8549J19566b78242C61528o6505O42740K07633D08733j61274N2570o5176
$$ 68549 188115 -278242 361528 295023 937763 1145396 408733 247459 300029 234853
12019B34853B375a7032A28677P004E0503N1192N6714a79414A07464K41026j54405
$$ 234853 2375 -17032 128677 135681 50503 101695 158409 -179414 107464 348490 194085
12008A94085a94879j22650J6230i7493E5120A591J6736K18617J99175j89406a04591
$$ 194085 -194879 -317529 -301299 -97493 55120 1591 18327 236944 436119 246713 -104591
11996b8942q4949r4711M9032L5400b4499A00415a66678C25686j55399c60988R6385
$$ -28942 -113891 -208602 -159570 -124170 -24499 100415 -166678 325686 170287 -360988 -264603
11985b64603a4041A21614J02795a33259r0548n8212A27443c19339A74290b87876
$$ -264603 -14041 121614 224409 -133259 -223807 -282019 127443 -319339 174290 -287876
11974D7678L4465Q4738a6647H8588b90469b4322B5864J35782J43197c99904A26537
$$ 47678 82143 166881 -16647 88588 -290469 -24322 25864 161646 304843 -399904 126537
11962A52813h9469l18823i7740C2568R3213J02989h6016j96454A1655R5315g8675
$$ 152813 -89469 -408292 -97740 32568 125781 228770 -86016 -282470 11655 106970 -78675
11950a05986D01211A1675Q6008a24984A21868j6320J75862b15585j22308i6778
$$ -105986 401211 11675 97683 -124984 121868 105548 281410 -215585 -337893 -96778
11939b2983j99003B47676e9553D3956M1171k6166k6202b60199J27092L2513p091
$$ -22983 -221986 247676 -59553 43956 85127 58961 32759 -260199 -133107 -100594 -107685
11928a07685a0497l41177K8377E5673i9513q2932A14019m3455g9273m3110A38627
$$ -107685 -10497 -351674 -323297 55673 -99513 -182445 114019 70564 -79273 -122383 138627
11916A29811Q627d3335H8812a80699A69791b90063f3079D9529K8567e00756B29267
$$ 129811 138438 -43335 88812 -180699 169791 -290063 -63079 49529 78096 -500756 229267
11904B79668A39612J77319N5145c425E955f6773l9087G5509a6983j43117H5387
$$ 279668 139612 316931 372076 -3425 5955 -66773 -105860 75509 -16983 -160100 85387
11892c22307d7038O322B6498b77151A6450P5981a45810c2656L846B13554j4352
$$ -322307 -47038 -40716 26498 -277151 16450 92431 -145810 -32656 -28810 213554 199202
11881A99202f2258a1733D4235b30829A64369E8777K75621A41041b85972B13331
$$ 199202 -62258 -11733 44235 -230829 164369 58777 334398 141041 -285972 213331
11870f1686l3045M6957J7761K087B01439p5518j673K20498E9622P1676D7507L0994
$$ -61686 -94731 -47774 -30013 -27926 201439 125921 124248 344746 59622 131298 47507 78501
11858G8501J14962P8729j8845A15999H087M2887a02503J3478B5858o881a97379
$$ 78501 193463 272192 253347 115999 8087 50974 -102503 -89025 25858 18977 -197379
11846e0817k1970b8553k49731A17074e02778a8740j4514l00452A50775e0687k17454
$$ -50817 -72787 -28553 -278284 117074 -502778 -18740 -33254 -333706 150775 -50687 -268141
11835b68141B1553b3105A89388d04753f917A8061J06117a50981R069l6139H3603
$$ -268141 21553 -23105 189388 -404753 -6917 18061 124178 -150981 -141912 -178051 83603
11823c7335m286k1985E1258K61553a00336a7909B89521I0896K8093A3646K20343
$$ -37335 -41621 -63606 51258 312811 -100336 -17909 289521 90896 118989 13646 233989
11812B33989A04377A4247K81103j3677j24102b5697q4713H0531a61795A39577
$$ 233989 104377 14247 295350 281673 157571 -25697 -110410 80531 -161795 139577
11801b35668e3605A2542b24376a9504A25946M7785O6486a53021A16185b0396C80353
$$ -235668 -53605 12542 -224376 -19504 125946 173731 240217 -153021 116185 -20396 380353
11789A7882N2853K7091a73448N6775j12634h4425a7835B29472b8602A42079b48143
$$ 17882 70735 97826 -173448 -116673 -229307 -84425 -17835 229472 -28602 142079 -248143
11777D4419K29900b67946H4260a92641d4212C89626j68867b30400M4193I9982
$$ 44419 274319 -267946 84260 -192641 -44212 389626 220759 -230400 -186207 99982
11766C43965b4267A94012a98084E7465J9794N4286d31521C5359i3454L1888a0452
$$ 343965 -24267 194012 -198084 57465 77259 131545 -431521 35359 -93454 -61566 -10452
11754a43295k60213J82490A96047c8711H4312N4694b50858C7310K4069P1935j0804
$$ -143295 -403508 -221018 196047 -38711 84312 139006 -250858 37310 61379 133314 122510
11743A22510L3421j7186l8033l2364j6132N1017E0949c46630a21274B56401M8175
$$ 122510 155931 138745 100712 68348 52216 103233 50949 -346630 -121274 256401 304576
11732C04576b71335F60J40439b77751Q0663B23293K64928b44647A5791Q8544a38227
$$ 304576 -271335 660 141099 -277751 -197088 223293 488221 -244647 15791 104335 -138227
11720A91599o3176b17366a1591A39439c80567c076B65959A00855J80024b41314
$$ 191599 128423 -217366 -11591 139439 -380567 -3076 265959 100855 280879 -241314
11709b82137J31711A54062D7616K6113a95817D4964J01942J41724H4247J47282
$$ -282137 -150426 154062 47616 73729 -195817 44964 146906 288630 84247 231529
11699B31529a69480c4794A42288a4774F9715e8221G0719A5142c9245r1429N8110
$$ 231529 -169480 -34794 142288 -14774 69715 -58221 70719 15142 -39245 -130674 -72564
11688g2564C8856a620B18497a84631E7942g9999A92819J90986G9185M7988e7027
$$ -72564 38856 -1620 218497 -184631 57942 -79999 192819 383805 79185 127173 -57027
11676a00230A69116k7351a46754l1134b3759n979l0922k0294A7094a61476B43150
$$ -100230 169116 141765 -146754 -177888 -23759 -29738 -60660 -80954 17094 -161476 243150
11664c37290F596O0573K0706c2013j82720f4557A10867m3350J16322c6344p9146
$$ -337290 6596 67169 87875 -32013 -214733 -64557 110867 67517 183839 -36344 -115490
11653a15490l8139J8125k5587D3196b07711L1796D66916A30077J58190J72694
$$ -115490 -153629 -135504 -161091 43196 -207711 -175915 466916 130077 288267 460961
11643D60961k25264B295L76156C8193h7010b4160A32986K4698a12881L0050o1067
$$ 460961 235697 2295 378451 38193 -87010 -24160 132986 157684 -112881 -82831 -143898
11632a43898A95L45985h6673a6835G095a97005b9735G1190c5474j71496N8651
$$ -143898 195 346180 -86673 -16835 7095 -197005 -29735 71190 -35474 -206970 -148319
11621a48319f0217C55744e9139j00200l8281e3129b3272j37125o1548G6719A1527
$$ -148319 -60217 355744 -59139 -159339 -197620 -53129 -23272 -160397 -221945 76719 11527
11609A30198B7535J02910b50554A67025C2821b85599m33i1348A04975P811a10281
$$ 130198 27535 130445 -250554 167025 32821 -285599 -286032 -91348 104975 112786 -110281
11597c35955H7102f4979C05727j15366k5714F7716d8249A59225b15381A61231
$$ -335955 87102 -64979 305727 190361 164647 67716 -48249 159225 -215381 161231
11586b18621a769n9208B10346a41799A31322R0966b4395B28295J57313g9373B10367
$$ -218621 -1769 -60977 210346 -141799 131322 222288 -24395 228295 385608 -79373 210367
11574a16675J2935A90261a34467D7308J04351o3605a00891l81832C3593c266E0292
$$ -116675 -103740 190261 -134467 47308 151659 88054 -100891 -482723 33593 -3266 50292
11562C66628b38074A1635K20290c1224C8439J74233a37301H4717K7303J04697
$$ 366628 -238074 11635 231925 -31224 38439 212672 -137301 84717 112020 216717
11552B16717r058j4737b56204B78158B8813P8773J23417l9780a89082C04476J96447
$$ 216717 207659 192922 -256204 278158 28813 107586 231003 191223 -189082 304476 500923
11541E00923b74416B26086A0129P3827E756h1418l0855B10595k2872L93792A54114
$$ 500923 -274416 226086 10129 83956 5756 -81418 -112273 210595 187723 581515 154114
11529b2088k55036a00455B36064b7827A79783a7342G577N9084N898C5113K77871
$$ -22088 -277124 -100455 236064 -27827 179783 -17342 7577 66661 72559 35113 312984
11518C12984A2397J79448f2278D8411L90149B4327b7157A75369O4773g3667B20494
$$ 312984 12397 191845 -62278 48411 438560 24327 -27157 175369 240142 -73667 220494
11506g4842E1455N3017Q993a25758D70316C3512L61899A27264g0116A06173K9023
$$ -74842 51455 104472 113465 -125758 470316 33512 395411 127264 -70116 106173 135196
11495A35196O1412d7329e522B1336e8896B76498b14370A56039J53831B7880O4709
$$ 135196 196608 -47329 -5522 21336 -58896 276498 -214370 156039 309870 27880 92589
11484I2589J77430j8849A12279K3663f0621I8144N2797b2010Q160A42382C5642
$$ 92589 270019 251170 112279 135942 -60621 98144 150941 -22010 -13850 142382 35642
11472A36908J60324C4894J83955f116F3207J50514K1465k0017p4428K41165j44143
$$ 136908 297232 34894 218849 -6116 63207 213721 235186 215169 140741 381906 237763
11461B37763E3008P7585e0849D1900M59022A42822K93944j92401J61381j82340
$$ 237763 53008 130593 -50849 41900 500922 142822 436766 244365 405746 223406
11451B23406A9653J51695K07149j76485b6338B00261I8680L29485o5567N206H8760
$$ 223406 19653 171348 378497 202012 -26338 200261 98680 428165 362598 367804 88760
11439g7181A45681J0716k8783L86453a49816M8529d9320A03591P4103Q9242a74457
$$ -77181 145681 156397 127614 514067 -149816 -101287 -49320 103591 177694 266936 -174457
11427F1827P4244b95345O3503A53804O2603M8279a54380P1668E4397N7111g5098
$$ 61827 136071 -295345 -231842 153804 216407 264686 -154380 -82712 54397 111508 -75098
11415b08298g0723k41465A88883f5191m9163B10219c3362l485r4638A5782c1808
$$ -208298 -70723 -312188 188883 -65191 -114354 210219 -33362 -36847 -131485 15782 -31808
11403A64710K6572a53934B53208A21325M4797c2071j63594M9525B99786D2472
$$ 164710 191282 -153934 253208 121325 166122 -32071 -195665 -146140 299786 42472
11392a95916A50969n3535e9737E1871J32357a98520J4309B5917a75717A99821
$$ -195916 150969 97434 -59737 51871 184228 -198520 -184211 25917 -175717 199821
11381B2605d5169A65279J51972h4236A47774D2408R5102k6065a2897j05788P288
$$ 22605 -45169 165279 317251 -84236 147774 42408 137510 111445 -12897 -118685 -111397
11370a11397j6374A21844A4321b13105A3386J57123a17570c6675E6510J75280
$$ -111397 -127771 121844 14321 -213105 13386 170509 -117570 -36675 56510 231790
11360B31790a37306d8453A19310K9328o676m2272a57147A80329f1446j07860j07175
$$ 231790 -137306 -48453 119310 148638 141962 99690 -157147 180329 -61446 -169306 -276481
11349b76481A52786b58054B2342c8481J8231C18726a03259B11722i8095C8019
$$ -276481 152786 -258054 22342 -38481 -20250 318726 -103259 211722 -98095 38019
11338F8828h8131o0692C91462c23263a52353d6601B49381D5004d9535l85481f6726
$$ 68828 -88131 -148823 391462 -323263 -152353 -46601 249381 45004 -49535 -435016 -66726
11326a18651J6181A9736B805d06564A31303l3511e5112E2861B04a93155B34082
$$ -118651 -102470 19736 2805 -406564 131303 97792 -55112 52861 204 -193155 234082
11314c36383a14231B30553A7568J95141e3640j64129A90752a31887A3286P0680
$$ -336383 -114231 230553 17568 212709 -53640 -217769 190752 -131887 13286 83966
11304H3966C6547f5415l30157c3229A17293b00223C2027d58369A5872P4803a52068
$$ 83966 36547 -65415 -395572 -33229 117293 -200223 32027 -458369 15872 90675 -152068
11292d2179A89256q9527N9993n7122h2697F657a19934B50171c51781J37342C7898
$$ -42179 189256 99729 159722 102600 -82697 6657 -119934 250171 -351781 -214439 37898
11280b03257F5210Q9892a7600B40680e0792A51920b97448B04203M0376Q2085a06680
$$ -203257 65210 155102 -17600 240680 -50792 151920 -297448 204203 244579 326664 -106680
11268A56205c75666D70375A1601K03180m5769c22206f8795C8833a23950I3415
$$ 156205 -375666 470375 11601 214781 169012 -322206 -68795 38833 -123950 93415
11257a35228H5886j3204J01843a65512A47877a1032A32582A5432B301b86856B5349
$$ -135228 85886 72682 174525 -165512 147877 -11032 132582 15432 2301 -286856 25349
11245A18983A836O4128A3087c22966g8643j84835H0009a27498A74141b14415h1022
$$ 118983 1836 65964 13087 -322966 -78643 -263478 80009 -127498 174141 -214415 -81022
11233b7461n43151g3538k03994d0284n8782I6858F869O7977b37113f2202A73979
$$ -27461 -570612 -73538 -277532 -40284 -99066 96858 6869 74846 -237113 -62202 173979
11221b9090A34089n4841c0723l2526B9985K5012J56953f7782L3838D7740J53054
$$ -29090 134089 79248 -30723 -63249 29985 54997 211950 -67782 -33944 47740 200794
11210B00794A00081a64396k36100E2138f31F3388a236A65479G8026b96445C17355
$$ 200794 100081 -164396 -400496 52138 -631 63388 -1236 165479 78026 -296445 317355
11198a29724j0066j20611H3952c7846r0969A68418a67942B0646n164L2514Q027
$$ -129724 -139790 -260401 83952 -37846 -128815 168418 -167942 20646 15482 47996 56023
11187E6023a08356l8439P2288o6352g0171A38252A7124F860a38313M8008J9582
$$ 56023 -108356 -146795 -74507 -140859 -70171 138252 17124 6860 -138313 -90305 -70723
11176g0723C753M1055A1770K73468d24183A24588b24395J03619q9806b9186A60225
$$ -70723 3753 44808 11770 285238 -424183 124588 -224395 -120776 -210582 -29186 160225
11164A53465N3166L8650e6533c515q6117a3901B99843a4270I1883J8010O0001
$$ 153465 206631 245281 -56533 -3515 -89632 -13901 299843 -14270 91883 109893 169894
11153A69894h2252j6347A86219g1911j28999C5480a88902R4251L9138j09773H1940
$$ 169894 -82252 -98599 186219 -71911 -200910 35480 -188902 -94651 -55513 -165286 81940
11141a46914j77342g1770A37503J28263a85705K8337b0634r978B55833J53449
$$ -146914 -324256 -71770 137503 265766 -185705 -157368 -20634 -30612 255833 409282
11131D09282f9688A43551h911E9573b20562L7702H4931f5774B63721e5127B70549
$$ 409282 -69688 143551 -8911 59573 -220562 -182860 84931 -65774 263721 -55127 270549
11119a69850L2456L4382L9694b527r3804n2807k7643G2850g4917F9628J1952H042
$$ -169850 -137394 -103012 -63318 -2527 -96331 -149138 -176781 72850 -74917 69628 81580 8042
11106B8819a22627B08415l4401K64340E1702K59937N7860n1921m7525A6104h5341
$$ 28819 -122627 208415 174014 438354 51702 311639 369499 317578 270053 16104 -85341
11094G6789Q8860c27124B85335A30018J45377o0372f7853D28779j07884n6592
$$ 76789 165649 -327124 285335 130018 275395 215023 -67853 428779 320895 264303
11084B64303E0412L29733l2568n0271L59123E5336L35875D9928K41691j8627J06827
$$ 264303 50412 380145 347577 297306 656429 55336 391211 49928 291619 272992 379819
11073C79819K11706k89611L01728H8521p90l3800P07080I9440K54755q8072J4473
$$ 379819 591525 301914 603642 88521 87731 53931 761011 99440 354195 266123 280596
11062B80596R2107J09661j8758j98692J46388J7234K63167j77058k6267j7660
$$ 280596 372703 482364 463606 264914 411302 428536 691703 514645 488378 470718
11052D70718K44477J80144l23493R8990j02072R3426p6991l2242Q2987K08645
$$ 470718 715195 895339 571846 670836 568764 662190 585199 552957 635944 844589
11042H44589K2629P1075o8789N3579o0570j12805J05830j84674l8671J01690K07116
$$ 844589 867218 938293 869504 923083 862513 749708 855538 670864 632193 733883 940999
11031I40999k86731K43279j01697J32882k01282j04424R3805M30615k86552J64566
$$ 940999 654268 897547 795850 928732 727450 623026 716831 1147446 860894 1025460
11021A025460j57855k43024M9559k32549l3794L23982m4450B76482M48874k50308
$$ 1025460 867605 624581 674140 441591 407797 731779 687329 276482 725356 475048
11011D75048M0232K46708M4500J39626l89392p7397J87086k20436L78998k94640
$$ 475048 515280 761988 806488 946114 556722 479325 666411 445975 824973 530333
11001E30333M74657k15489l16763K97812j3150j96194K71683B51270L61994K00367
$$ 530333 1004990 789501 472738 770550 757400 561206 832889 251270 613264 813631
10991H13631L7882r5398k82024L42317o9172k1556j29827O24300J31165j44830
$$ 813631 851513 756115 474091 816408 747236 725680 595853 1220153 1351318 1206488
10981A206488l20896P27372n95116M29129J18103K00214M64932R2271L26575L38971
$$ 1206488 885592 1612964 1017848 1446977 1565080 1765294 2230226 2322497 2649072 2988043
10971B988043L28181l8217k41423K3311L5129j64156p20197k50463n5172n15597
$$ 2988043 3316224 3278007 3036584 3059895 3095024 2930868 2210671 1960208 1905036 1389439
10961A389439J450J68503m46021L56001l0940J52128k10563o33757J72459j96327
$$ 1389439 1390889 1559392 1113371 1469372 1438432 1590560 1379997 746240 918699 722372
10951G22372J24546j84041j30666j5337F1238J94317K31693E9986L82405g5164
$$ 722372 846918 662877 532211 516874 61238 255555 487248 59986 442391 -75164
10940C11725j26773a44662c913O39C09019I9643P160P1761N8983E3501d0427A06039
$$ 311725 184952 -144662 -3913 -3274 309019 99643 106803 178564 237547 53501 -40427 106039
10927B11158l0954o922Q9727A2509a77632A15928i9426p8211B88068I8013a20474
$$ 211158 180204 173282 263009 12509 -177632 115928 -99426 -177637 288068 98013 -120474
10915B90146A30037C8801J53648n359a43562A03990Q6765G1278k2644J80966h460
$$ 290146 130037 38801 192449 187090 -143562 103990 190755 71278 48634 229600 -8460
10903A04022b2633A63561l091a70740A95393a25505j15716h9763n5524F4429c1539
$$ 104022 -22633 163561 160470 -170740 195393 -125505 -241221 -89763 -145287 64429 -31539
10891g3879C5765f8041i299A03617J76207b75228A75571b54563A49988D5093K43369
$$ -73879 35765 -68041 -9299 103617 279824 -275228 175571 -254563 149988 45093 288462
10880B88462I2432b02239L8172l0584C09391E0165a15104o9366F3247J14667q2990
$$ 288462 92432 -202239 -164067 -194651 309391 50165 -115104 -184470 63247 177914 94924
10869I4924b70490a31974f1949B96573i0404l62561A90194a42867j2909L7096
$$ 94924 -270490 -131974 -61949 296573 -90404 -452965 190194 -142867 -155776 -118680
10859a18680d122D5708j4772Q1227K28481J3122E3106M37353e5907B66622C4631
$$ -118680 -4122 45708 30936 112163 340644 353766 53106 490459 -55907 266622 34631
10847b35573K5649i0367k26162a58078d6570J213l55597A49592f1258l09637d4302
$$ -235573 -209924 -90367 -316529 -158078 -46570 -45357 -400954 149592 -61258 -370895 -44302
10835D2453d9248j70169l423N3112k29310a32823j04637J8038A74474a60274A7988
$$ 42453 -49248 -219417 -222840 -169728 -399038 -132823 -237460 -219422 174474 -160274 17988
10823i3693p2763c4070j70779F6522d7454A87736r525a61235r367J5544c4134
$$ -93693 -166456 -34070 -204849 66522 -47454 187736 178211 -161235 -170602 -155058 -34134
10811A78199D8862d2128B17742b26369E1690R6096d1813a8873H3859a4625o6060
$$ 178199 48862 -42128 217742 -226369 51690 147786 -41813 -18873 83859 -14625 -80685
10800h0685a6505A79625L3855c8640A70114H1735B3007d47349a43847B895P6263
$$ -80685 -16505 179625 213480 -38640 170114 81735 23007 -447349 -143847 2895 79158
10789G9158a03850j36467e9114C6475K81971A11679a10203A7543M5644g360I2948
$$ 79158 -103850 -240317 -59114 36475 318446 111679 -110203 17543 63187 -7360 92948
10777a64380B85838a13314B3746b18620d7471o3904N1155C35a93459Q4405F7273
$$ -164380 285838 -113314 23746 -218620 -47471 -111375 -60220 335 -193459 -109054 67273
10765a70713N2558m7732G329P6082K0235a42393A06681D1425e1776C7984c91764
$$ -170713 -118155 -165887 7329 83411 103646 -142393 106681 41425 -51776 37984 -391764
10753a43430N2304j1238B56238A27117m5942b74978C7511Q0490i8759m6990b4076
$$ -143430 -91126 -102364 256238 127117 81175 -274978 37511 118001 -98759 -145749 -24076
10741A37184D2842d63256K19188A1851c27248a15472b7990A14249f4229j95149
$$ 137184 42842 -463256 -244068 11851 -327248 -115472 -27990 114249 -64229 -259378
10731b59378C67709a81789H9845d1885k9354B50021l0580b916j48451r0470A40986
$$ -259378 367709 -181789 89845 -41885 -71239 250021 219441 -2916 -151367 -241837 140986
10719B6862a65513q7827A36525a01162C08022g7867n2222M3C7591a70074P652
$$ 26862 -165513 -253340 136525 -101162 308022 -77867 -130089 -130046 37591 -170074 -162422
10708a62422A3965d325m7180j98491J06675L430J8898A74178h1882j60389a194
$$ -162422 13965 -4325 -51505 -249996 -143321 -139891 -120993 174178 -81882 -242271 -1194
10696G9095b7272k2414p4009F8082l0352b89942H7942I235M1789a64170j22598
$$ 79095 -27272 -49686 -123695 68082 37730 -289942 87942 9235 51024 -164170 -286768
10685b86768f0016j2147E4631K41151h3337A40202M4393b8742o8416F6632a53601
$$ -286768 -60016 -72163 54631 295782 -83337 140202 184595 -28742 -97158 66632 -153601
10673b5494o0475I7501a85218Q305A75255b19173f3194G7714J6601h9419m2606
$$ -25494 -85969 97501 -185218 -176913 175255 -219173 -63194 77714 94315 -89419 -132025
10662a32025j32352I3741c8458J8161C6017a80283A82671i8954F1038h5482A62139
$$ -132025 -264377 93741 -38458 -20297 36017 -180283 182671 -98954 61038 -85482 162139
10650a11140A60326B6995g2243k04509K4231d5143m1956L7061C865a10789o469
$$ -111140 160326 26995 -72243 -276752 -252521 -45143 -87099 -50038 3865 -110789 -117258
10639a17258i622C00462a89325j66052J21195N7794Q5158k4377j32275O3956d3966
$$ -117258 -9622 300462 -189325 -355377 -234182 -176388 -91230 -115607 -247882 -183926 -43966
10627a24885C29190F3047b39777f1817b3354k94340C5173f2388b8952j20732G3138
$$ -124885 329190 63047 -239777 -61817 -23354 -317694 35173 -62388 -28952 -149684 73138
10615B14732a03592r4043N2757A8674b16148H0498a46844B90821G8814i544A42487
$$ 214732 -103592 -197635 -144878 18674 -216148 80498 -146844 290821 78814 -9544 142487
10603A76744g908j75261M8470A54114a17322d8478k34386a6260E8590a54901A49720
$$ 176744 -7908 -183169 -134699 154114 -117322 -48478 -282864 -16260 58590 -154901 149720
10591a6336j42706H0945J1447b95727A417a88233r0873A4552J98716K5620a76412
$$ -16336 -159042 80945 92392 -295727 1417 -188233 -279106 14552 213268 238888 -176412
10579B99784A6232b71820D7095a58922k85714B38596E5740A4139b05120h6022
$$ 299784 16232 -271820 47095 -158922 -444636 238596 55740 14139 -205120 -86022
10568B07567a12939B86963E2424Q721b27805P457e3500D808f4966j20310I6863
$$ 207567 -112939 286963 52424 61145 -227805 -220348 -53500 4808 -64966 -185276 96863
10556a63963A34253b4729G8797b76679J15609G6360a50022d6873B624K5126K47210
$$ -163963 134253 -24729 78797 -276679 -161070 76360 -150022 -46873 2624 27750 274960
10545B74960D6017J8716h3808A52288a6664j09944F3508a38133j65548h3106m4586
$$ 274960 46017 64733 -83808 152288 -16664 -126608 63508 -138133 -303681 -83106 -127692
10534a27692D6225g7936j79726A80239b6292A24358J44493c63173a9422B2612
$$ -127692 46225 -77936 -257662 180239 -26292 124358 268851 -363173 -19422 22612
10523D5643Q1893c06102E4934a93932B98279B7845H212a71823H2463l3475M9192
$$ 45643 127536 -306102 54934 -193932 298279 27845 8212 -171823 82463 48988 98180
10512I8180b00781b7362D6032J28682A3352J00198M8571p1894K25042q2371o0012
$$ 98180 -200781 -27362 46032 174714 13352 113550 162121 90227 315269 232898 172886
10501A72886a41018A52586b27152f045l49408g1307A30610a97870P6144E9449
$$ 172886 -141018 152586 -227152 -6045 -355453 -71307 130610 -197870 -121726 59449
10490f2388j54588A54999b8982l4644B5353K73538D4423K87218I6012K08766J33735
$$ -62388 -216976 154999 -28982 -63626 25353 298891 44423 331641 96012 304778 438513
10479D38513A21850m9738k3221R4544g2685n4130d1284H4349b56210i7859n0556
$$ 438513 121850 72112 48891 143435 -72685 -126815 -41284 84349 -256210 -97859 -148415
10468a48415B29363m5825i5815D8904c8935j53287Q1128A68725D654L31855l0885
$$ -148415 229363 183538 -95815 48904 -38935 -192222 -111094 168725 4654 336509 305624
10457C05624A8131b36864J12017A6553b5589B48988a62967g7418I0867J08406
$$ 305624 18131 -236864 -124847 16553 -25589 248988 -162967 -77418 90867 199273
10447A99273b56290d4049B68297O2496A53501A0477K67966j24122L6115c2329
$$ 199273 -256290 -44049 268297 330793 153501 10477 278443 154321 190436 -32329
10436A02840c79774A77748a25310A54486i020k8186a5595E87546E1553M38001
$$ 102840 -379774 177748 -125310 154486 -9020 -37206 -15595 587546 51553 489554
10426D89554a572j08598k12969G7718f7245B44202m6164P0714A28903a64814C6031
$$ 489554 -1572 -110170 -323139 77718 -67245 244202 198038 268752 128903 -164814 36031
10414a30078B80575e9192j64050A33409m4458d71747A08095F051a14364C0404
$$ -130078 280575 -59192 -223242 133409 88951 -471747 108095 6051 -114364 30404
10403E8977d7192A5621A473R271J89119b15629C03864D112N187b4155m4569e623
$$ 58977 -47192 15621 1473 10744 199863 -215629 303864 4112 9299 -24155 -68724 -5623
10390B2046J91892J8610j3907F5982A2715P2230B7249a7804m4375K5729B51854
$$ 22046 213938 232548 218641 65982 12715 84945 27249 -17804 -62179 -36450 251854
10378B73847G9843J36200J24996j37228J91512M6215a17610F42909k28466o0623
$$ 273847 79843 216043 341039 203811 395323 441538 -117610 642909 414443 353820
10368C53820A0622M26351M43616B85413A31347K45275M82170B38522G0221J73764
$$ 353820 10622 436973 880589 285413 131347 376622 858792 238522 70221 243985
10358B43985m1039b09626B63366K09838A28308k7467L94673j47159M81282C25702
$$ 243985 202946 -209626 263366 473204 128308 100841 495514 348355 829637 325702
10347E44223L01985B79663n5328M2029A04370J42415l5981l5671C24a3906B23324
$$ 544223 846208 279663 224335 266364 104370 246785 210804 175133 324 -13906 223324
10335B16689I4119L14395f158j28433J2388N168o7146L8877C38900B4411K23716
$$ 216689 94119 408514 -6158 -134591 -122203 -117035 -184181 -145304 338900 24411 248127
10324B48127J56939j62099L1654p6394a22357A61200l7075C7873j6656a47029
$$ 248127 405066 242967 274621 198227 -122357 161200 124125 37873 21217 -147029
10313A03783E1764M1437b20264b151F1204L7534N8810b66541c0216A47837E1530
$$ 103783 51764 93201 -220264 -2151 61204 98738 157548 -266541 -30216 147837 51530
10301a80067k06730g8755j8757C27367j00903j1662Q9300B5268b73792B84357
$$ -180067 -386797 -78755 -97512 327367 226464 214802 304102 25268 -273792 284357
10290A88007K18121j91757E970b93167k48461a80308c5968H3701a66480c9260
$$ 188007 406128 214371 5970 -293167 -541628 -180308 -35968 83701 -166480 -39260
10279I0981b76759e4806B64103c3137p2470M9395h308B22206b0185A81786J47238
$$ 90981 -276759 -54806 264103 -33137 -105607 -56212 -8308 222206 -20185 181786 329024
10268C29024g6771C6902g9732j62243A8986P6095K49424J2813A70943J0299Q9773
$$ 329024 -76771 36902 -79732 -241975 18986 95081 344505 357318 170943 181242 271015
10257B71015I3768k2002i2497n1893A44447a46357A20622m7036g8515k17147j24466
$$ 271015 93768 71766 -92497 -144390 144447 -146357 120622 73586 -78515 -295662 -420128
10246d20128a03235o596k44569I3012P0737E1883B4454b28979A32957F3162J34161
$$ -420128 -103235 -109831 -354400 93012 163749 51883 24454 -228979 132957 63162 197323
10235A97323a34492o0637D23552b01549g4788j84120d6227D895J9567L01040j26563
$$ 197323 -134492 -195129 423552 -201549 -74788 -258908 -46227 4895 24462 325502 198939
10224A98939b20084j86636I1022j1491a23853m370p3975n4485h7436k77504A13211
$$ 198939 -220084 -406720 91022 79531 -123853 -128223 -202198 -256683 -87436 -364940 113211
10212a62173o2524A11937h5915A90381d7213o8212A39357b39132D3248g015o2503
$$ -162173 -224697 111937 -85915 190381 -47213 -115425 139357 -239132 43248 -7015 -69518
10201f9518I3159b61059A34037n7584k7914g5750b0113B86874A1604c12677A87336
$$ -69518 93159 -261059 134037 76453 48539 -75750 -20113 286874 11604 -312677 187336
10189A8935K76351a06943a5206j83996O7065F49J48560g6974D7364a6054j54836
$$ 18935 295286 -106943 -15206 -199202 -132137 649 149209 -76974 47364 -16054 -170890
10178a70890j83553c554l39745A44395C9138J09010G2067k0874K19390a72043
$$ -170890 -354443 -3554 -343299 144395 39138 148148 72067 51193 270583 -172043
10167a67578m4552j19104A75360o1192b17162c6384l45133j60580a56481B19562
$$ -167578 -212130 -331234 175360 114168 -217162 -36384 -381517 -542097 -156481 219562
10156G9593c63735A57995B2248b21963a02097A259b70776B4327a20892k6410C8258
$$ 79593 -363735 157995 22248 -221963 -102097 1259 -270776 24327 -120892 -147302 38258
10144a03398A45883A620e13A41427c88264C55131a54094J5659p4519Q8036J8235
$$ -103398 145883 1620 -513 141427 -388264 355131 -154094 -138435 -212954 -124918 -106683
10133a06683L7207E8530f866l0376n0652m24734A91981l9044a52583d4001B35846
$$ -106683 -69476 58530 -6866 -37242 -87894 -512628 191981 152937 -152583 -44001 235846
10121a88077I3436b79000D460c1158k40067B43043a78104Q047A53452c00619B31777
$$ -188077 93436 -279000 4460 -31158 -271225 243043 -178104 -170057 153452 -300619 231777
10109A47203K01241a25584l38475C4096k000J23144f8063l4928M0017k1558d1411
$$ 147203 348444 -125584 -464059 34096 32096 155240 -68063 -102991 -62974 -84532 -41411
10097A22376a73984P5185m31601A79583a56667b9333I2757b7934A10642b54590
$$ 122376 -173984 -98799 -530400 179583 -156667 -29333 92757 -27934 110642 -254590
10086A39140a67745A46261b17221l46014a19808A35434b44774D146b48915E9600
$$ 139140 -167745 146261 -217221 -563235 -119808 135434 -244774 4146 -248915 59600
10075C93502D1072d04099K929i0943j18375h0099A16846b43275a18081c8949o4653
$$ 393502 41072 -404099 -401170 -90943 -209318 -80099 116846 -243275 -118081 -38949 -103602
10064a03602F9387k3127a87214A09448A8393R00J04418d53431A9914i8243r6886
$$ -103602 69387 46260 -187214 109448 18393 19293 123711 -453431 19914 -98243 -195129
10053a95129q9673B03641f3633B4876J28328c23557O5193c9101K164r4959k28170
$$ -195129 -284802 203641 -63633 24876 153204 -323557 -258364 -39101 -36937 -131896 -360066
10042c60066j6813A7171b51830d7249n2304A10880L4409b38731C5570d2742k03505
$$ -360066 -376879 17171 -251830 -47249 -99553 110880 145289 -238731 35570 -42742 -246247
10031b46247B42358a03371c5668k83213i7655A01348J5995b01057Q5094A15792
$$ -246247 242358 -103371 -35668 -318881 -97655 101348 117343 -201057 -115963 115792
10020A4749b11129D2354d4181j56005A81956c3335k64922m8746D0043L00557a78664
$$ 14749 -211129 42354 -44181 -200186 181956 -33335 -298257 -347003 40043 340600 -178664
10008b97337Q8967R2918E4933Q2927c77386f5170k210k52059J29095B075b74700
$$ -297337 -208370 -115452 54933 137860 -377386 -65170 -67380 -319439 -190344 2075 -274700
9996f7131j69659H9358L06759a61486A02089c9821d334j85787P6695N495k707
$$ -67131 -236790 89358 396117 -161486 102089 -39821 -4334 -190121 -113426 -107931 -110638
9985a10638l75856a12440A02174b03913a3105q7778k0699k2446B0142b95223J25947
$$ -110638 -486494 -112440 102174 -203913 -13105 -100883 -121582 -144028 20142 -295223 -169276
9974a69276A94a10681j49769B19901c63669i9379j10592o729O3770m2993A77425
$$ -169276 194 -110681 -260450 219901 -363669 -99379 -209971 -216700 -152930 -195923 177425
9962a60136H9442c8752j09079A68489a39641A42816b28842a1282k14204Q3772
$$ -160136 89442 -38752 -147831 168489 -139641 142816 -228842 -11282 -225486 -141714
9952a41714G2008a20680I1924c0341o31D1538b4742A80034c23605j75805a72291
$$ -141714 72008 -120680 91924 -30341 -30972 41538 -24742 180034 -323605 -499410 -172291
9940A26109d594k02851A25650b84874a19898k4846K3966M4662j0992B22596B643
$$ 126109 -4594 -207445 125650 -284874 -119898 -144744 -120778 -76116 -87108 222596 2643
9928C46076b05485A58574a09810A46647b5000m36233G2908a44010J6397A15087
$$ 346076 -205485 158574 -109810 146647 -25000 -461233 72908 -144010 -127613 115087
9917c19692i3639c7995r1482g080k27119d6378i413B82770b2789I897J11341N3558
$$ -319692 -93639 -37995 -129477 -7080 -234199 -46378 -9413 282770 -22789 9897 121238 174796
9905A74796a99940f4637m3060G8914b34394B29458b92733j54735b08942o2859
$$ 174796 -199940 -64637 -107697 78914 -234394 229458 -292733 -447468 -208942 -271801
9895b71801B6463g62478A65745A1678b9088M394o7109j70868K5324A5637b24489
$$ -271801 26463 -762478 165745 11678 -29088 -24694 -91803 -262671 -237347 15637 -224489
9883c4331l188C18456D3120M47390g4407A7670b53358A87321m2023a65462L4031
$$ -34331 -37519 318456 43120 490510 -74407 17670 -253358 187321 145298 -165462 -131431
9872a31431d7683r6193L5403A10384d2369K0878k26748A06376f5528K7617q5273
$$ -131431 -47683 -143876 -108473 110384 -42369 -21491 -248239 106376 -65528 -37911 -123184
9861a23184N0709k12423c3725k3654A67938a68331C29965i1320J479r0904I8078
$$ -123184 -72475 -284898 -33725 -57379 167938 -168331 329965 -91320 -89841 -180745 98078
9849d70325M7003d3347B44375b20416A9834L1208a6407o9701R699H2657J71132
$$ -470325 -423322 -43347 244375 -220416 19834 51042 -16407 -86108 -76409 82657 253789
9838B53789D9007a01761q1230d4472A68193F1066J08933J7945d6074D3441L65060
$$ 253789 49007 -101761 -182991 -44472 168193 61066 169999 187944 -46074 43441 408501
9827D08501b49507I7570c63318a30617j08864G7900L00625c03552c7048m2542
$$ 408501 -249507 97570 -363318 -130617 -239481 77900 378525 -303552 -37048 -79590
9817g9590k34838a10300B06151b5168l57615a2114j26275A80857e1085k72189
$$ -79590 -314428 -110300 206151 -25168 -382783 -12114 -138389 180857 -51085 -323274
9807c23274n3804a18595j51808F6815a65576j5334m252A9244c11859Q2816f985
$$ -323274 -377078 -118595 -270403 66815 -165576 -180910 -185162 19244 -311859 -229043 -6985
9795A96417a00902A29171j5564J4239C2844N8891b62369A15612a6972B27340H4045
$$ 196417 -100902 129171 113607 127846 32844 91735 -262369 115612 -16972 227340 84045
9783a35972I2355i0699O311j54598A35001a47856K4911b5967j84693i4407i465
$$ -135972 92355 -90699 -84388 -238986 135001 -147856 -122945 -25967 -210660 -94407 -9465
9771H6762a68408C47063b0180k24944d5141j86654g9157a2043r1938I7098a83168
$$ 86762 -168408 347063 -20180 -245124 -45141 -231795 -79157 -12043 -103981 97098 -183168
9759a97696P2789l6499C5460a58469b6409m6246k47844A82675a81955O6322q1668
$$ -197696 -124907 -161406 35460 -158469 -26409 -72655 -320499 182675 -181955 -115633 -197301
9748a97301P7339E2796N3082a38418B0350a19758j02257N8735A09771c515k306
$$ -197301 -119962 52796 105878 -138418 20350 -119758 -222015 -163280 109771 -3515 -5821
9737e821F3741M5720h1410j76298A16813c02200a4223m4707k5830A06939J82955
$$ -5821 63741 109461 -81410 -257708 116813 -302200 -14223 -58930 -84760 106939 289894
9726B89894a14771r5476g0167j88075K3763A8176c2158j28225D3767a49175B09775
$$ 289894 -114771 -210247 -70167 -258242 -234479 18176 -32158 -160383 43767 -149175 209775
9714g3076l23209a62615D76920b76987H7663g9693H9496Q2317n1190K01497a25470
$$ -73076 -396285 -162615 476920 -276987 87663 -79693 89496 171813 120623 322120 -125470
9702c70943I7363M0711a44100j82254H6467b98034d1852j02058K8355p1399r834
$$ -370943 97363 138074 -144100 -326354 86467 -298034 -41852 -143910 -115555 -186954 -196788
9691a96788Q9012k1823K3091H9888a23382A2319a42724A31033l5306e5379l7568
$$ -196788 -107776 -129599 -106508 89888 -123382 12319 -142724 131033 95727 -55379 -92947
9680i2947G2299b06191Q6713r7587f940l49053a2590A43136b49227O4521P3648
$$ -92947 72299 -206191 -119478 -217065 -6940 -355993 -12590 143136 -249227 -184706 -111058
9669a11058I3475a64118M0042l33433a1839k43405A68260a34245m2504o100F2783
$$ -111058 93475 -164118 -124076 -457509 -11839 -255244 168260 -134245 -176749 -182849 62783
9657b07572E8308b00005A72001b14578d6013B5043c46621f6525B50624C1374c3956
$$ -207572 58308 -200005 172001 -214578 -46013 25043 -346621 -66525 250624 31374 -33956
9645a37419j45764i5837A02701A7674a75965C776b26790j8485J08555A03439a67717
$$ -137419 -283183 -95837 102701 17674 -175965 3776 -226790 -245275 -136720 103439 -167717
9633c038q1210I5702J12097J6241b75332e4744B10701b53300h596l5828J3517
$$ -3038 -84248 95702 207799 224040 -275332 -54744 210701 -253300 -8596 -44424 -30907
9622c0907C3330c77605i4933A71060B7088K25393E2434a67332d0736k02083d8955
$$ -30907 33330 -377605 -94933 171060 27088 252481 52434 -167332 -40736 -242819 -48955
9610a85056J7506A27947b29876K9162j89097A42863b44226a06343F34535a02594
$$ -185056 -167550 127947 -229876 -200714 -389811 142863 -244226 -106343 634535 -102594
9599d848l28293j3738H2443g9789j75116j24839D0978I147e7783j01709j48001
$$ -4848 -333141 -346879 82443 -79789 -254905 -379744 40978 9147 -57783 -159492 -307493
9588c07493J50964A07147a49244l0578k557h5294E7404p64m161c70429a61102
$$ -307493 -156529 107147 -149244 -179822 -182379 -85294 57404 56640 52479 -370429 -161102
9576I4620a60423f8626q8863A28368b52586b7848l55197h0057A5997a9351I9547
$$ 94620 -160423 -68626 -157489 128368 -252586 -27848 -383045 -80057 15997 -19351 99547
9564a13452A39579a68292H1886K53109f8659j21075Q9341i669c837m4033k04098
$$ -113452 139579 -168292 81886 334995 -68659 -189734 -100393 -9669 -3837 -47870 -251968
9553b51968O5033o8349F6655O3090c6484m0149r5048B47196a36359e325o50123
$$ -251968 -186935 -255284 66655 129745 -36484 -76633 -171681 247196 -136359 -5325 -655448
9542f55448b84797a16729d6245D8848b2930B5867b34688q2792i2740C1290g7262
$$ -655448 -284797 -116729 -46245 48848 -22930 25867 -234688 -317480 -92740 31290 -77262
9530a60967J2629A4685b70137P4917f1269G7936A8719b49658M9064i7239l5620
$$ -160967 -148338 14685 -270137 -195220 -61269 77936 18719 -249658 -200594 -97239 -132859
9519a32859A64346b96311J27111A43001a42367d0862j30528q4712B3024d8333
$$ -132859 164346 -296311 -169200 143001 -142367 -40862 -171390 -256102 23024 -48333
9508a00356j47313O9560K1265A65140D0548K4767b69607B1747b54591E3708c80955
$$ -100356 -247669 -178109 -156844 165140 40548 65315 -269607 21747 -254591 53708 -380955
9496B28385A08527a13151N6164B37642I9261f0199d444k50799A39754c84116F7158
$$ 228385 108527 -113151 -56987 237642 99261 -60199 -4444 -255243 139754 -384116 67158
9484H0905A4612J94204B1051a42669p2899j11315A38823g1544m2335j22212a9515
$$ 80905 14612 208816 21051 -142669 -215568 -326883 138823 -71544 -113879 -236091 -19515
9472a2336l566k1795H7632J67274j22717h3368H4779a72481A48201L7141a34039
$$ -12336 -15902 -37697 87632 254906 132189 -83368 84779 -172481 148201 185342 -134039
9460b47625R7495j25543d9980j22978r1291a29709a5480A93895J9462E479K74398
$$ -247625 -150130 -275673 -49980 -172958 -264249 -129709 -15480 193895 213357 5479 279877
9449B79877B8997f4108m0730A23528a60151k4927h1548b8107D41571a24602L3258
$$ 279877 28997 -64108 -104838 123528 -160151 -185078 -81548 -28107 441571 -124602 -91344
9438i1344C7974c4977k21415a10284C0427M9860a22910j34744b8128o1928j69177
$$ -91344 37974 -34977 -256392 -110284 30427 80287 -122910 -257654 -28128 -90056 -259233
9427b59233P3001C3011N7147c49817g1567B770a80100A6963g4131A95650D5476
$$ -259233 -186232 33011 90158 -349817 -71567 2770 -180100 16963 -74131 195650 45476
9415F804a32196j54617B24361E0651a34946A5711d8008l13200a6057j02721b3929
$$ 6804 -132196 -286813 224361 50651 -134946 15711 -48008 -361208 -16057 -118778 -23929
9403e5409o0901K3092A88326D0116a39106c5373e981k4354j20762b2931B22449
$$ -55409 -116310 -93218 188326 40116 -139106 -35373 -5981 -30335 -151097 -22931 222449
9391a55301j46385N8670F4579b51616J22836a4710G1650d23961a13985A94379
$$ -155301 -301686 -243016 64579 -251616 -128780 -14710 71650 -423961 -113985 194379
9380a33044b7038H8030a23852K7012C4604e2348L34B24330a1615k5360B63329
$$ -133044 -27038 88030 -123852 -96840 34604 -52348 -52014 224330 -11615 -36975 263329
9368c43927J29189O6752I337M03483E0748b84908j44017B13129b84239B60068
$$ -343927 -214738 -147986 9337 412820 50748 -284908 -428925 213129 -284239 260068
9357e19685a83608a1636j01951l0013q6947B0101c82757A41302a52054j01667
$$ -519685 -183608 -11636 -113587 -143600 -230547 20101 -382757 141302 -152054 -253721
9347b53721a24677A65260a31138A00210m2449b68942n6057a24487j58175a30069
$$ -253721 -124677 165260 -131138 100210 57761 -268942 -324999 -124487 -282662 -130069
9336a62007N6182B26510c9085j10893B16280a91487B5782b89039F9718g725k51622
$$ -162007 -105825 226510 -39085 -149978 216280 -191487 25782 -289039 69718 -7725 -259347
9325b59347q9735F5965a93376d191k0749F2670d24146h0188j04402O1316B26269
$$ -259347 -349082 65965 -193376 -4191 -24940 62670 -424146 -80188 -184590 -123274 226269
9313i463G8198b8129k64185R0974F9516K9969e0624m3307c2985l00666a02245
$$ -9463 78198 -28129 -292314 -201340 69516 99485 -50624 -93931 -32985 -333651 -102245
9301a38420B3798L8011a02709C5320a07047M8427f849B7458M9314j0810a00775
$$ -138420 23798 61809 -102709 35320 -107047 -58620 -6849 27458 76772 65962 -100775
9289A0652h5189A31720c01240J6144g9702l65934a22689e5741I6803a16411J5778
$$ 10652 -85189 131720 -301240 -285096 -79702 -445636 -122689 -55741 96803 -116411 -100633
9278a00633l4096A1390e4933G5901l64l5870b76824C2238J664a73783C1500c23594
$$ -100633 -134729 11390 -54933 75901 75537 39667 -276824 32238 33902 -173783 31500 -323594
9265a86441K437k04056e2333J4626a4674j8039p4153A05204J10231G6393D53J27159
$$ -186441 -184004 -388060 -52333 -37707 -14674 -32713 -106866 105204 215435 76393 453 127612
9253A27612e1646n7578j1328j4411e9775a8388o1047j16099A91589G4454d331
$$ 127612 -51646 -109224 -120552 -134963 -59775 -18388 -79435 -195534 191589 74454 -4331
9241A60270a96850L7032A78546a41367j26343a5887c058j09295k43745b7981E4792
$$ 160270 -196850 -159818 178546 -141367 -267710 -15887 -3058 -112353 -356098 -27981 54792
9229b26770l50903E0926a36647j20409f4182a2491l22327R5216L1281k8855A62367
$$ -226770 -577673 50926 -136647 -257056 -64182 -12491 -334818 -239602 -208321 -237176 162367
9217A68672b74311M2492H5305e2292o6972N6449k69666J06733P9249A3922a48003
$$ 168672 -274311 -231819 85305 -52292 -119264 -62815 -332481 -225748 -146499 13922 -148003
9205i0385I1802J57019A14666P4090b55049b4783H6080d04094A73603O000c7684
$$ -90385 91802 248821 114666 188756 -255049 -24783 86080 -404094 173603 179603 -37684
9193b0030D0221a59917A62105b47827d6279l12496g8271F6578P0261c3700H5944
$$ -20030 40221 -159917 162105 -247827 -46279 -358775 -78271 66578 136839 -33700 85944
9181A57647a35930K8272p8564i0995j06730A79453a10910I6062b36456a8406n00687
$$ 157647 -135930 -107658 -186222 -90995 -197725 179453 -110910 96062 -236456 -18406 -519093
9170e19093b0121C10863b72588J9350R7404n2504A66807p1847N7035a39801K6685
$$ -519093 -20121 310863 -272588 -253238 -155834 -208338 166807 94960 151995 -139801 -113116
9159a13116l0132q8856O4050P2485j51344f0948H5785M0780i2456G0961c65419
$$ -113116 -143248 -232104 -168054 -95569 -246913 -60948 85785 126565 -92456 70961 -365419
9147b09134D563K37479a02636j29406H4037a25694j0814j49189E3934J4525c75010
$$ -209134 4563 242042 -102636 -232042 84037 -125694 -136508 -285697 53934 68459 -375010
9135f951I5150j6643J07605d61549g1563k47639P1784F1844a6968m44684g2613
$$ -6951 95150 78507 186112 -461549 -71563 -319202 -247418 61844 -16968 -461652 -72613
9123E5566b00604a1704j07195k58593g7380D8756g5399j7462d4282m6612D74394
$$ 55566 -200604 -11704 -118899 -377492 -77380 48756 -75399 -92861 -44282 -90894 474394
9111A22061P8578d4467F7626c0162A11487K7492a63223m3215A07579a29512n142
$$ 122061 200639 -44467 67626 -30162 111487 138979 -163223 -206438 107579 -129512 -134654
9100a34654A02708j1262D2042a00120k27733J46320E2246c86539B46899e21709
$$ -134654 102708 91446 42042 -100120 -327853 -181533 52246 -386539 246899 -521709
9089c07868G5382a58695m4813a2866D1004e2249B71868j7771b53607A77358a29300
$$ -307868 75382 -158695 -203508 -12866 41004 -52249 271868 254097 -253607 177358 -129300
9077b45577D5754K71770a65684C77632a19591B2274L5465N4681b07994k13532
$$ -245577 45754 317524 -165684 377632 -119591 22274 57739 112420 -207994 -421526
9067d21526H9075a56616j6472A40147b09030A5015J00938J407b7150q1850a1770
$$ -421526 89075 -156616 -173088 140147 -209030 15015 115953 117360 -27150 -109000 -11770
9055e6134F1690d66299F9446k0671M528c16994J28492f6414A44599n2439K12768
$$ -56134 61690 -466299 69446 48775 53303 -316994 -188502 -66414 144599 92160 304928
9044C04928c8576B5940J05446n1093a83729L9004k1997m2299C89145b628C8495
$$ 304928 -38576 25940 131386 80293 -183729 -144725 -166722 -209021 389145 -2628 38495
9032B7509J67641b52444R2646e8014k50610J29837A05727N2541F2906J584e2139
$$ 27509 195150 -252444 -159798 -58014 -308624 -178787 105727 158268 62906 64490 -52139
9020B4785d55847C1889a48886H485J14988n5485a27583A81555a78215d4387A47932
$$ 24785 -455847 31889 -148886 8485 123473 67988 -127583 181555 -178215 -44387 147932
9008b70659C11936a57530f9207j71231f6047j04665j86041a8742F5595P4164a79140
$$ -270659 311936 -157530 -69207 -240438 -66047 -170712 -356753 -18742 65595 139759 -179140
8996G5092d6135o4874j54038I6401M3196D7267J2147a95724B23679e1015C5134
$$ 75092 -46135 -111009 -265047 96401 139597 47267 59414 -195724 223679 -51015 35134
8984a43664L2450A33139o3777J89738A07070b7167B91967G8066a7047l26274N5083
$$ -143664 -111214 133139 69362 259100 107070 -27167 291967 78066 -17047 -343321 -288238
8973b88238C3479b87874C20067a27222H880a33643G5038a35542C6405f7979A30329
$$ -288238 33479 -287874 320067 -127222 8880 -133643 75038 -135542 36405 -67979 130329
8961a65076e0070K0793E2420b79836D1247c45006a37147N2403a2717E1558a50252
$$ -165076 -50070 -29277 52420 -279836 41247 -345006 -137147 -84744 -12717 51558 -150252
8949b6093B6334L73877d049l89364J84313D1377a69724B83138a68875a4052o255
$$ -26093 26334 400211 -4049 -393413 -209100 41377 -169724 283138 -168875 -14052 -20307
8938b0307B14985K23256H0496P38002A96392L5333D1390J70076q0433m9181j9371
$$ -20307 214985 438241 80496 818498 196392 231725 41390 211466 131033 81852 62481
8927F2481M90223O9653O48722J050786M912522J3810882I578437C204251A445769
$$ 62481 552704 622357 1271079 2321865 7234387 21045269 9578437 3204251 1445769
8917E49679R2995c4952k14708I7900J31029b91380H522a40808E18670L17093G4108
$$ 549679 642674 -34952 -249660 97900 228929 -291380 8522 -140808 518670 835763 74108
8905C78777a9180l59733a25259G2623a49756a8408H3690Q6933a93515o1145h0962
$$ 378777 -19180 -378913 -125259 72623 -149756 -18408 83690 170623 -193515 -254660 -80962
8893d3685k98716J62466k03883e1922j2705i960k06900b776j54809N9649n1626
$$ -43685 -342401 -179935 -383818 -51922 -64627 -9960 -216860 -2776 -157585 -97936 -149562
8882a49562A49621b46096d7226C77203a91028p0288M1517i8293c059G5134l6013
$$ -149562 149621 -246096 -47226 377203 -191028 -261316 -219799 -98293 -3059 75134 39121
$$ [...]
##END NTUPLES=NMR SPECTRUM
##END=
