##TITLE=AC1513_ROEFFECT0002_8201801_gEHQsjbkxO
##JCAMPDX= 6.0         $$ Bruker NMR JCAMP-DX V2.0
##DATA TYPE= NMR SPECTRUM
##DATA CLASS= NTUPLES
##ORIGIN= BRUKER
##OWNER= Administrator
$$ 1.72 TOPSPIN		Version 2.1
$$ 2013-09-26 19:02:06.130 -0700  Administrator@X
$$ Compression mode = diff/dup
##.OBSERVE FREQUENCY= 400.02188249412
##.OBSERVE NUCLEUS= ^1H
##.ACQUISITION MODE= SIMULTANEOUS (DQD)
##.ACQUISITION SCHEME= undefined
##.AVERAGES= 64
##.DIGITISER RES= 22
##SPECTROMETER/DATA SYSTEM= spect
##.PULSE SEQUENCE= noesygpps1d.comp
##.SOLVENT NAME= COFFEE_meoh
##.SHIFT REFERENCE= INTERNAL, COFFEE_meoh, 1, 14.96064
##AUDIT TRAIL= $$ (NUMBER, WHEN, WHO, WHERE, PROCESS, VERSION, WHAT)
$$ ##TITLE= Audit trail, TOPSPIN		Version 2.1
$$ ##JCAMPDX= 5.01
$$ ##ORIGIN= Bruker BioSpin GmbH
$$ ##OWNER= Administrator
$$ $$ E:\/data/COFFEE/nmr/AC1513_ROEFFECT0002_8201801_gEHQsjbkxO/12/pdata/1/auditp.txt
$$ ##AUDIT TRAIL=  $$ (NUMBER, WHEN, WHO, WHERE, PROCESS, VERSION, WHAT)
(   1,<2013-09-26 19:02:00.319 -0700>,<Administrator>,<X>,<go>,<TOPSPIN 2.1>,
      <created by zg
	started at 2013-09-26 18:50:30.017 -0700,
	POWCHK enabled, PULCHK disabled,
       configuration hash MD5:
       C8 4E 4E 5D D3 5C D8 9E 9F 52 82 E0 59 8A DE 15
       data hash MD5: 64K
       20 F5 5B 49 59 43 A3 FD 37 B4 0A B4 72 CB 56 3B>)
(   2,<2013-09-26 19:02:03.604 -0700>,<Administrator>,<X>,<proc1d>,<TOPSPIN 2.1>,
      <Start of raw data processing
       efp LB = 0.3 FT_mod = 6 PKNL = 1 PHC0 = 0 PHC1 = 0 SI = 128K 
       data hash MD5: 128K
       CB 4B C8 D6 51 DE 65 7F EE BC 16 E6 30 7B F7 DC>)
(   3,<2013-09-26 19:02:04.766 -0700>,<Administrator>,<X>,<proc1d>,<TOPSPIN 2.1>,
      <pk PHC0 = -86.20972 PHC1 = 0 
       data hash MD5: 128K
       28 4D 43 BE 4E 25 C0 F6 62 4C 54 A3 3E 4F AC 20>)
(   4,<2013-09-26 19:02:05.406 -0700>,<Administrator>,<X>,<proc1d>,<TOPSPIN 2.1>,
      <abs ABSG = 1 
       data hash MD5: 128K
       6E 72 5B 25 86 60 B4 C0 98 B4 BD 15 0C E4 E0 40>)
(   5,<2013-09-26 19:02:05.507 -0700>,<Administrator>,<X>,<proc1d>,<TOPSPIN 2.1>,
      <abs ABSG = 2 
       data hash MD5: 128K
       12 62 CF 52 7A 0C BD C9 70 57 33 80 B3 A0 C0 DB>)
(   6,<2013-09-26 19:02:05.659 -0700>,<Administrator>,<X>,<proc1d>,<TOPSPIN 2.1>,
      <abs ABSG = 3 
       data hash MD5: 128K
       97 16 4A 50 EC 17 42 08 7A 5E FD 7C 27 6B C8 4E>)
(   7,<2013-09-26 19:02:05.743 -0700>,<Administrator>,<X>,<proc1d>,<TOPSPIN 2.1>,
      <abs ABSG = 4 
       data hash MD5: 128K
       58 A9 6A 72 A2 5A 84 3E F6 C1 0E 9C A1 51 E9 82>)
(   8,<2013-09-26 19:02:05.895 -0700>,<Administrator>,<X>,<proc1d>,<TOPSPIN 2.1>,
      <abs ABSG = 5 
       data hash MD5: 128K
       63 10 1E 98 27 AF 76 26 28 84 B9 B1 EA 44 5B 42>)
$$ ##END=
$$ 
$$ $$ hash MD5
$$ $$ 10 8B B2 38 59 7B 11 D6 11 66 4C CF C4 07 FE 02
##$RELAX= 
##$RELAX= 
##$RELAX= 
##$RELAX= 
##$RELAX= 
##$RELAX= 
##$RELAX= 
##$RELAX= 
$$ Bruker specific parameters
$$ --------------------------
##$DU= <E:\>
##$EXPNO= 12
$$ [...]
##$TP07= 0
##$TPNAME0= <>
##$TPNAME1= <>
##$TPNAME2= <>
##$TPNAME3= <>
##$TPNAME4= <>
##$TPNAME5= <>
##$TPNAME6= <>
##$TPNAME7= <>
##$TPOAL= (0..7)
0.5 0.5 0.5 0.5 0.5 0.5 0.5 0.5
##$TPOFFS= (0..7)
0 0 0 0 0 0 0 0
##$TUNHIN= 0
##$TUNHOUT= 0
##$TUNXOUT= 0
##$USERA1= <user>
##$USERA2= <user>
##$USERA3= <user>
##$USERA4= <user>
##$USERA5= <user>
##$V9= 5
##$VALIST= <valist>
##$VCLIST= <CCCCCCCCCCCCCCC>
##$VD= 0
##$VDLIST= <DDDDDDDDDDDDDDD>
##$VPLIST= <PPPPPPPPPPPPPPP>
##$VTLIST= <TTTTTTTTTTTTTTT>
##$WBST= 1024
##$WBSW= 4
##$XGAIN= (0..3)
0 0 0 0
##$XL= 0
##$YL= 0
##$YMAX_a= 6926234
##$YMIN_a= -13136265
##$ZGOPTNS= <>
##$ZL1= 120
##$ZL2= 120
##$ZL3= 120
##$ZL4= 120
##$ABSF1= 14.96064
##$ABSF2= -5.597542
##$ABSG= 5
##$ABSL= 3
##$ALPHA= 0
##$AQORDER= 0
##$ASSFAC= 0
##$ASSFACI= 0
##$ASSFACX= 0
##$ASSWID= 0
##$AUNMP= <proc_prof1d_extract.lims>
##$AXLEFT= 0
##$AXNAME= <>
##$AXNUC= <1H>
##$AXRIGHT= 0
##$AXTYPE= 0
##$AXUNIT= <>
##$AZFE= 0.1
##$AZFW= 0.1
##$BCFW= 0
##$BC_mod= 0
##$BYTORDP= 0
##$COROFFS= 0
##$CY= 15
##$DATMOD= 1
##$DC= 0
##$DFILT= <>
##$DTYPP= 0
##$F1P= 0
##$F2P= 0
##$FCOR= 0.5
##$FTSIZE= 131072
##$FT_mod= 6
##$GAMMA= 0
##$GB= 0
##$INTBC= 1
##$INTSCL= 1
##$ISEN= 128
##$LB= 0.3
##$LEV0= 0
##$LPBIN= 0
##$MAXI= 10000
##$MC2= 0
##$MEAN= 0
##$ME_mod= 0
##$MI= 0
##$NCOEF= 0
##$NC_proc= -2
##$NLEV= 6
##$NOISF1= 0
##$NOISF2= 0
##$NSP= 0
##$NTH_PI= 0
##$NZP= 0
##$OFFSET= 14.96064
##$PC= 1
##$PHC0= -86.20972
##$PHC1= 0
##$PH_mod= 1
##$PKNL= yes
##$PPARMOD= 0
##$PPDIAG= 0
##$PPIPTYP= 0
##$PPMPNUM= 2147483647
##$PPRESOL= 1
##$PSCAL= 4
##$PSIGN= 0
##$PYNMP= <proc.py>
##$REVERSE= no
##$SF= 400.020009782314
##$SI= 131072
##$SIGF1= 0
##$SIGF2= 0
##$SINO= 400
##$SIOLD= 131072
##$SPECTYP= <>
##$SREGLST= <1H.CDCl3>
##$SSB= 0
##$STSI= 131072
##$STSR= 0
##$SW_p= 8223.68421052631
##$SYMM= 0
##$S_DEV= 0
##$TDeff= 65536
##$TDoff= 0
##$TI= <>
##$TILT= no
##$TM1= 0
##$TM2= 0
##$TOPLEV= 0
##$USERP1= <user>
##$USERP2= <user>
##$USERP3= <user>
##$USERP4= <user>
##$USERP5= <user>
##$WDW= 1
##$XDIM= 131072
##$YMAX_p= 420938124
##$YMIN_p= -13116
##$CURPLOT= <Network HP LaserJet P1505>
##$CURPRIN= <$Network HP LaserJet P1505>
##$DFORMAT= <normdp>
##$LAYOUT= <+/1D_H.xwp>
##$LFORMAT= <normlp>
##$PFORMAT= <normpl>
##$SURQMSG= 1
$$ End of Bruker specific parameters
$$ ---------------------------------
##NTUPLES= NMR SPECTRUM
##VAR_NAME=  FREQUENCY,     SPECTRUM/REAL,   SPECTRUM/IMAG
##SYMBOL=    X,             R,               I
##VAR_TYPE=  INDEPENDENT,   DEPENDENT,       DEPENDENT
##VAR_FORM=  AFFN,          ASDF,            ASDF
##VAR_DIM=   131072,        131072,          131072
##UNITS=     HZ,            ARBITRARY UNITS, ARBITRARY UNITS
##FACTOR=    0.0627417313425164, 1,          1
##FIRST=     8223.62146879497, 3750,         -65977
##LAST=      0,             5221,            -65653
##MIN=       0,             -13116,          0
##MAX=       8223.62146879497, 420938124,    0
$$ Real data points
##PAGE= N=1
##DATA TABLE= (X++(R..R)), XYDATA
$$ [...]
67540 71904 70369 69420 69482 70213 71222 72170 72461 71672 70284 69292 69054 69080 68952 68759 68602 68367 68197 68522 69328
67521 69328 70004 70157 70057 69952 69598 68853 68141 67782 67403 66691 66317 67268 69435 71565 72575 72355 71395 70362
67503 70362 70004 70725 72021 72899 73061 73101 73338 73144 71914 70173 69115 69307 70384 71822 73378 74747 75358
67486 75358 74797 73293 71653 70731 70900 71815 72723 73079 72830 72103 70950 69660 69001 69574 70933 71835 71541
67469 71541 70470 69475 68871 68445 68112 68134 68749 69836 70939 71550 71455 70891 70279 69819 69520 69547 70056 70570 70155
67450 70155 68670 67352 67476 68747 69787 70058 70360 71310 72352 72785 72947 73507 74136 73859 72588 71337 70748
67433 70748 70236 69012 67330 66104 65630 65349 64839 64467 64803 65730 66462 66393 65714 65131 65139 65666 66316 66835 67256
67414 67256 67745 68368 68990 69314 69011 67887 66064 64034 62491 61917 62257 63036 63853 64660 65485 66115 66298 66195
67396 66195 66270 66652 66925 66720 66303 66298 66969 67900 68365 67874 66524 64917 63678 62942 62433 62029 61948 62249 62539
67377 62539 62554 62786 64055 66429 68966 70579 70924 70446 69882 69766 70186 70878 71640 72580 73754 74676 74604 73431
67359 73431 71967 71109 70940 70829 70278 69434 68812 68714 69001 69325 69411 69078 68175 66817 65654 65511 66476 67633
67341 67633 68049 67808 67701 68067 68425 68223 67478 66601 65991 65902 66269 66574 66274 65545 65191 65591 66172 66210 65776 65467
67321 65467 65456 65308 64696 63900 63504 63760 64350 64720 64690 64639 64926 65207 64737 63480 62488 62831 64461 66495 68358
67302 68358 70131 71875 73179 73644 73499 73423 73800 74314 74353 73764 73048 72738 72796 72821 72707 72695 72859 72992 73116 73546
67282 73546 74239 74607 74394 74299 75208 77008 78693 79397 78972 77765 76422 75700 75902 76421 76330 75416 74228 73312
67264 73312 72922 73393 74955 77023 78451 78880 79221 80330 81711 82139 81225 79695 78309 77197 76280 75708
67248 75708 75554 75503 75234 74961 75210 76061 76907 77101 76673 76203 76109 76333 76746 77493 78693 80049 81130 81918 82753
67229 82753 83747 84609 85076 85160 84890 84128 82820 81196 79590 78292 77606 77712 78286 78642 78533 78526 79223 80392
67211 80392 81241 81382 81078 80690 80368 80230 80316 80293 79756 78950 78679 79218 79849 79872 79579 79639 79947 79862 79417 79401 80116
67190 80116 80919 81305 81701 82639 83829 84681 85272 85969 86495 86310 85754 85830 86701 87370 87141 86541 86356 86521 86599
67171 86599 86687 87088 87552 87597 87315 87124 86996 86653 86391 86869 88078 89201 89645 89584 89375 89106 88909 89093 89618
67152 89618 89898 89455 88467 87452 86806 86796 87558 88815 90007 91004 92257 93942 95417 95972 95773 95548 95642 95916
67134 95916 96341 97039 97797 98140 98073 98239 99143 100568 101955 103100 104185 105298 106232 106765 107018 107395 108203 109328
67116 109328 110326 110842 110896 110747 110616 110610 110831 111343 112051 112747 113375 114197 115578 117530 119468 120544 120355 119281
67098 119281 118123 117556 118063 120041 123422 127142 129596 130024 129197 128432 128202 128053 127620 127131 126894 126828 126823 127221
67080 127221 128506 130522 132337 133078 132806 132358 132400 132927 133744 135045 137041 139243 140741 141311 141684 142454 143319
67063 143319 143873 144657 146573 149430 151891 153076 153519 154211 155278 156170 156761 157583 159038 160914 162754 164231
67047 164231 165099 165290 165368 166422 169002 172364 175254 177271 178935 180474 181330 181176 180797 181363 183110 185264
67031 185264 187063 188313 189103 189627 190381 191980 194535 197572 200688 203887 207142 210090 212489 214655 217101
67016 217101 219952 222930 225742 228264 230559 232896 235510 238164 240238 241510 242578 244241 246743 249953
67002 249953 253937 258783 264013 268787 272795 276513 280430 284426 288117 291494 294914 298578 302294 305781
66988 305781 309006 312168 315467 319003 322848 327013 331304 335409 339323 343492 348309 353586 358891 364231
66974 364231 369965 376063 381956 387271 392220 397156 402199 407489 413297 419601 426046 432612 439801 447749
66960 447749 455709 462924 469586 476381 483569 491116 499261 508216 517629 527089 536868 547322 557891 567646
66946 567646 576730 586199 596386 606483 615994 625645 636430 648495 661385 674691 688027 701058
66934 701058 714012 727659 742291 757228 771727 785883 800258 815191 830926 847784 865637
66923 865637 883713 901592 919985 939853 961101 982811 1004463 1026244 1048396 1071056 1094572
66912 1094572 1119194 1144388 1169194 1193495 1218425 1245284 1274387 1305003 1336029 1366702 1397093
66901 1397093 1428111 1460698 1494868 1529751 1564572 1599318 1634476 1670434 1707208 1744456 1781704
66890 1781704 1818815 1856158 1894037 1932078 1969590 2006429 2042924 2078982 2113983 2147789 2181176
66879 2181176 2214754 2247928 2279499 2308973 2336686 2362796 2386854 2408479 2427921 2445661 2461684
66868 2461684 2475464 2486550 2494940 2500844 2504230 2504781 2502335 2497252 2490120 2481112 2469875 2456162 2440223
66855 2440223 2422253 2401753 2378006 2351242 2322781 2293712 2263849 2232393 2199320 2165511 2131573
66844 2131573 2097129 2061490 2024550 1986697 1948218 1909240 1870065 1831117 1792599 1754502 1716831
66833 1716831 1679472 1641970 1603952 1565833 1528611 1492847 1458240 1424388 1391476 1359922 1329668
66822 1329668 1300266 1271368 1242820 1214491 1186371 1158714 1131790 1105656 1080415 1056372 1033516
66811 1033516 1011078 988198 964958 942267 920755 900321 880785 862317 844889 827813 810287
66800 810287 792241 774359 757398 741682 727020 712877 698757 684598 670716 657269 644016
66789 644016 630806 618044 606303 595548 585080 574327 563437 552982 543212 533748 523996 513729
66777 513729 503244 493012 483325 474318 466113 458738 451939 445307 438588 431703 424542 417051 409554 402595
66763 402595 396326 390333 384292 378457 373200 368352 363405 358240 353228 348603 344102 339328 334228 329153
66749 329153 324602 320845 317571 313965 309421 304240 299321 295165 291538 288147 285138 282623 280130 277006
66735 277006 273226 269400 266042 263184 260649 258310 256043 253762 251597 249712 247834 245288 241674 237352
66721 237352 233130 229633 227075 225271 223605 221267 217937 214207 211026 208786 207159 205714 204336 203065
66707 203065 201862 200636 199228 197372 194908 192098 189423 187028 184683 182391 180615 179658 179105 178271 176972
66692 176972 175501 174072 172652 171306 170245 169487 168733 167644 166062 164018 161816 160074 159290 159261 159206 158555
66676 158555 157375 155945 154351 152740 151545 150944 150320 148831 146569 144605 143656 143154 142034 140158 138446
66661 138446 137637 137429 137033 136181 135173 134168 132888 131152 129357 128208 128007 128313 128274 127325 125676 124119
66645 124119 123260 122938 122570 122012 121793 122371 123431 124133 123883 122652 120712 118357 115868 113475 111347 109746
66629 109746 109062 109447 110438 111228 111342 110882 110151 109373 108810 108796 109373 110064 110217 109554 108334 107051 106057 105357
66611 105357 104691 103871 103070 102661 102762 103065 103149 102827 102167 101384 100772 100460 100088 98969 96814 94238 92319 91722
66593 91722 92366 93772 95421 96794 97394 96971 95715 94143 92837 92180 92222 92709 93311 93836 94263 94646 95026
66576 95026 95371 95498 95151 94246 93022 91860 90990 90482 90415 90832 91528 92079 92181 91862 91342 90828 90527 90670 91321
66557 91321 92169 92734 92828 92775 93046 93719 94338 94325 93469 92059 90584 89409 88680 88364 88311 88313 88204 87904 87393 86696
66537 86696 85957 85359 84878 84238 83298 82458 82414 83369 84654 85308 85011 84357 84229 85006 86354 87634 88449 88798
66519 88798 88807 88429 87509 86152 84845 84155 84312 85145 86230 86962 86727 85396 83722 82843 83174 83975 84257 83902
66501 83902 83587 83743 84028 83912 83391 82860 82556 82426 82488 82935 83774 84541 84616 83873 82899 82491 82899 83645 84060 83880
66481 83880 83285 82573 82001 81732 81661 81343 80495 79587 79507 80441 81459 81517 80637 79764 79658 80323 81401 82657 83959
66462 83959 85070 85633 85275 83786 81375 78757 76767 75818 75819 76487 77498 78424 78881 78843 78591 78360 78273 78559
66444 78559 79394 80429 80891 80486 79929 80270 81811 83926 85782 86934 87317 87032 86306 85546 85270 85859 87199
66427 87199 88524 88827 87620 85295 82740 80725 79654 79573 80128 80700 80919 81044 81603 82676 83719 84099 83629
66410 83629 82557 81289 80213 79629 79693 80401 81607 82992 84053 84362 83918 83174 82566 82066 81317 80258 79489
66393 79489 79744 80983 82229 82552 82049 81555 81446 81241 80533 79807 79932 81116 82822 84512 85881 86422 85435
66376 85435 82872 79810 77669 77035 77465 78308 79368 80729 82264 83547 84288 84703 85306 86296 87287 87784 87780
66359 87780 87695 87828 88218 89048 90685 93031 95154 96048 95629 94640 93609 92420 90968 89711 89212 89440 89932
66342 89932 90475 91156 91797 91859 91111 90018 89193 88710 88315 88120 88597 89784 90911 91156 90674 90544 91597 93451
66324 93451 94835 94865 93859 92856 92476 92440 92149 91389 90348 89230 88211 87668 88033 89293 90799 91731 91682
66307 91682 90821 89703 88945 88921 89583 90598 91646 92547 93223 93744 94367 95259 96219 96938 97519 98311 99172 99378
66289 99378 98546 97263 96456 96401 96718 97073 97391 97514 97194 96541 96121 96460 97560 98882 99614 99102 97385 95309
66271 95309 93846 93253 93129 93176 93465 93950 94230 94086 93850 93923 94157 94130 93868 93863 94332 94774 94511 93527 92588 92491 93312
66250 93312 94453 95319 95741 95827 95730 95771 96490 98136 100184 101756 102549 102981 103347 103292 102397 100991 99906 99596
66232 99596 99847 100340 101088 102177 103349 104096 104119 103526 102602 101537 100393 99162 97782 96233 94817 94207 94893
66215 94893 96525 98107 98993 99387 99691 99740 99107 97951 97012 96778 97085 97571 98090 98608 99085 99599 100201 100583
66197 100583 100332 99700 99635 100698 102347 103638 104292 104704 105240 105969 106842 107589 107675 106881 105850 105523 106012 106575
66179 106575 106711 106724 107090 107818 108752 110033 111806 113703 115055 115571 115542 115413 115422 115664 116244 117198 118301 119105
66161 119105 119267 118849 118220 117638 117022 116188 115152 114084 113143 112506 112327 112382 111993 110729 109113 108196 108386 109164
66143 109164 109969 110760 111530 111906 111765 111790 112742 114308 115292 114996 113947 113166 113087 113348 113396 113099 112848 113142 114030
66124 114030 115042 115792 116444 117378 118507 119309 119489 119282 119036 118865 118781 118783 118616 117801 116236 114592 113787 114139
66106 114139 115251 116661 118305 120312 122533 124450 125547 125743 125421 124985 124488 123867 123404 123589 124394 125039
66090 125039 124805 123879 123061 122748 122617 122320 122057 122254 122918 123611 123943 123839 123383 122621 121652 120675 119754 118646
66072 118646 117134 115603 114898 115384 116344 116704 116247 115748 115929 116738 117735 118700 119624 120500 121427 122608 123983
66055 123983 125184 126160 127334 128755 129617 129280 128372 127981 128044 127445 125744 123775 122346 121344 120516 120240 120863
66038 120863 121950 122839 123425 123815 123745 123062 122347 122311 122912 123746 124918 126645 128252 128551 127310 125561 124348
66021 124348 123867 123924 124451 125345 126388 127541 128780 129582 129257 127932 126471 125246 123820 122262 121779 123307
66005 123307 126062 128380 129536 129988 130265 130596 131454 133424 136291 138981 140710 141651 142343 143023 143832 145095
65989 145095 146937 148967 150836 152859 155629 159010 161992 163658 164090 164109 164292 164482 164271 163677 163079 162629
65973 162629 162045 161055 159711 158156 156386 154459 152654 151153 149800 148521 147736 147886 148675 149315 149513 149683
65957 149683 150092 150429 150517 150946 152448 154880 157336 159231 160865 162884 165560 168725 172187 175998 180355
65942 180355 185333 190704 196033 200959 205326 208985 211613 212963 213236 213016 212776 212668 212820 213539 214935 216539
65926 216539 217665 218194 218711 219711 220917 221611 221543 221307 221838 223677 226676 230230 233729 236910 239863 242727
65910 242727 245458 247957 250219 252169 253499 253996 254009 254191 254769 255454 256138 257192 258818 260610 262096 263308
65894 263308 264258 264246 262440 259064 255283 251847 248565 245236 242370 240495 239306 238092 236654 235259 233918
65879 233918 232315 230340 228209 226063 223965 222279 221526 221736 222403 223245 224554 226580 229036 231578 234253
65864 234253 236940 238685 238366 236057 233089 230604 228548 226240 223346 219884 215775 211062 206428 202857
65850 202857 200720 199563 198840 198416 198222 197857 196894 195460 194244 193900 194475 195306 195453 194488 192983 192085 192453
65833 192453 193686 194875 195501 195682 195768 196010 196614 197845 199894 202617 205499 208021 210136 212282 214777 217376
65817 217376 219718 222017 224826 228063 230844 232514 233326 233819 234090 234176 234707 236461 239520 243482 248295 254144
65801 254144 260574 266561 271652 276316 280860 284648 286839 287457 287225 286610 285494 283648 281234 278911 277612
65786 277612 277946 279635 281758 283783 286064 289124 292889 297026 301690 307343 314026 321342 329115 337480
65772 337480 346322 355061 363122 370192 375888 379602 380987 380384 378556 376109 373301 370256 367313 365260
65758 365260 365242 368159 374055 382353 392806 405976 422622 442930 466658 493902 525313 561441 602081
65745 602081 646428 693737 743611 795403 847375 896730 940738 977739 1006864 1027083 1037170
65734 1037170 1036691 1026403 1007341 980107 945551 905629 862746 818354 773010 727745 684447 644479
65722 644479 607660 573130 540678 510649 483073 457745 434945 415222 398359 383228 368936
65711 368936 355613 343866 333891 325435 318197 311924 306290 301041 296187 291921 288458 286019 284644 283865
65697 283865 282935 281658 280673 280602 281225 281871 282325 282782 283169 283263 283582 285377 289321 294591 299760 304434 309624
65680 309624 316605 325787 336750 349072 362892 378766 397255 418824 444063 473720 508365 548126
65668 548126 592910 642704 697265 755398 814817 872950 927946 978953 1025569 1067136 1102567
65657 1102567 1130766 1151231 1164325 1171167 1173457 1173196 1171994 1170356 1168032 1165473 1164574 1167288 1173503 1180793
65643 1180793 1186331 1188502 1186593 1179686 1166554 1146438 1119325 1085395 1044580 997003 943882 887827
65631 887827 831851 777769 725712 675438 627814 584420 545789 510859 478442 448569 421930
65620 421930 398620 378151 360352 345421 333117 322560 313052 304605 297467 291453 286026 280878 276206
65607 276206 272391 269468 266971 264414 261873 259847 258531 257585 256798 256531 257141 258232 258976 259025 258706 258530
65591 258530 259005 260784 264304 269138 274229 278925 283437 288204 293445 299637 307898 319348 334294 352477
65577 352477 373976 399463 429568 464326 503324 546194 592802 643043 696450 751861 807298
65566 807298 860106 907426 946941 977555 999326 1012444 1016269 1009591 991914 964227 928451 886453
65554 886453 839804 790103 739036 688042 638194 590427 545602 504254 466468 432197 401611
65543 401611 375050 352670 334278 319437 307553 297814 289294 281396 274188 268170 263757 261084 260131
65530 260131 260600 261638 262165 261769 260920 260029 258635 256002 252270 248395 244982 241787 238458 235247 232676
65515 232676 230936 229939 229704 230328 231722 233671 236038 238704 241354 243560 245087 246042 246701 247200 247301 246520
65499 246520 244623 241968 239220 236804 234898 233838 234019 235334 237210 239513 243000 248486 255893 264443
65485 264443 273488 282608 291158 298374 303975 308203 311151 312479 311940 309805 306562 302452 297480 291737
65471 291737 285485 279022 272534 265994 259256 252448 246248 241374 237714 234336 230615 227030 224446 222824
65457 222824 221226 219057 216756 215046 213996 213301 213147 214126 216225 218535 220310 221968 224596 228650 233591
65442 233591 238684 243621 248223 252076 254923 257203 259732 262769 265666 267633 268748 270014 272306 275298
65428 275298 277615 278207 277416 276446 275908 275363 274377 273482 273568 274675 276030 277277 279067 282129 286067 289455
65412 289455 291027 290604 288937 286886 284754 282249 278998 275108 271211 267897 265112 262238 258837 255286
65398 255286 252587 251602 252607 255529 260312 266761 274173 281467 287793 292780 296214 297845 297713 296364 294388
65383 294388 291766 287943 282560 275992 269199 263137 258214 254184 250563 247275 244824 243783 244200 245561
65369 245561 247149 248366 249018 249548 250766 253018 255788 258414 261063 264550 269359 275342 282361 290685 300565
65354 300565 311953 324889 339683 356281 373747 390774 406531 420660 432763 442452 449861 455491
65342 455491 459332 460539 458341 453058 445936 437989 429282 419335 408029 395970 384038 372743 362072
65329 362072 351879 342361 334140 327883 323788 321437 320212 319787 320039 320484 320148 318326 315257 311657 307707
65314 307707 302964 297306 291301 285340 278945 271495 263361 255670 248963 242712 236341 230202 225190 221710
65300 221710 219475 218216 218165 219688 222686 226570 230762 235039 239306 243192 246081 247561 247682 246731 244972
65285 244972 242752 240660 239259 238673 238663 239063 239860 240903 241929 243040 244756 247334 250320 253080 255545
65270 255545 258035 260631 263217 266079 269774 274241 278607 282311 286055 291180 298240 306576 315152 323418
65256 323418 331437 339526 347730 355191 360010 360294 355706 347821 338759 329626 320306 310331 299613 288629
65242 288629 278284 269519 262671 257289 252819 249370 247451 247050 247437 247906 248332 248880 249580 250371 251260 252133
65226 252133 252687 252805 252713 252527 251870 250404 248553 247181 246508 245851 244608 243054 241857 241152 240624 240390 241283
65209 241283 243997 248183 252590 256018 258056 259080 259727 260305 260525 259769 257680 254536 251060 247981 245759
65194 245759 244430 243479 242114 240064 238034 236946 236791 236808 236870 237973 240822 244528 247454 249104 250345 251793
65178 251793 252874 252812 251820 250719 249770 248557 246893 245245 244069 243051 241330 238471 235050 232140 230272
65163 230272 229087 228091 227380 227283 227574 227622 227266 226940 226800 226373 225373 224250 223549 223203 222981 223140 224088 225810
65145 225810 228261 231970 237399 243930 250326 256244 262472 269578 277134 284502 291667 298980 306784 315672
65131 315672 326418 339131 352929 367007 381582 397370 414606 433111 452747 472997 492499
65120 492499 509905 525059 538440 549504 556593 558693 556409 550753 541762 528961 512705 494341
65108 494341 475274 456408 438328 421375 405453 390181 375363 361137 347743 335452 324611
65097 324611 315349 307197 299417 291876 285251 280098 276003 272001 267763 264013 261674 260825 260653 260322 259684
65082 259684 259051 258420 257171 254746 251465 248353 246106 244592 243511 243143 243948 245714 247772 250049 253205
65067 253205 257410 261676 265036 267959 271832 277186 283232 289141 294960 300955 306752 311672 315429 317942
65053 317942 318857 317917 315645 313022 310426 307393 303487 299005 294770 291655 290330 290944 292783 294657 295985
65038 295985 297290 299332 301926 303933 304288 302723 299536 294962 288993 281718 273667 265675 258307 251501
65024 251501 244935 238696 233380 229541 227238 226109 225574 224919 223646 222073 221279 222042 223948 225954 227824
65009 227824 230578 235361 242169 249901 257528 264977 272802 281225 289704 297555 304766 311852 318853 324881
64995 324881 328924 330850 331304 330819 329599 328183 327759 329461 333606 339912 348249 358756 371217 384618
64981 384618 397387 407917 414896 417515 415716 410229 402165 392469 381750 370470 358988 347394 335585
64968 335585 323782 312893 304108 298097 294626 292822 291660 290481 289447 289477 291299 294483 297802 300583
64954 300583 303230 306210 309111 311174 312343 313186 314035 314749 315184 315213 314355 312115 308886 305927 304205 303699
64938 303699 304023 305111 306918 309026 311145 313644 316972 320718 323830 325716 326500 326167 324062 319610 313154
64923 313154 305783 298498 291813 285941 280919 276536 272450 268561 265139 262422 260224 258133 256120 254734
64909 254734 254582 255758 257925 260861 264699 269626 275555 282199 289375 297181 305895 315750 326712 338491
64895 338491 350801 363555 376752 390319 404234 418757 434347 451445 470457 491740 515051
64884 515051 538926 560954 578833 591015 596529 594909 586695 573574 557566 540210 522695 506310
64872 506310 492169 480659 471584 464780 460169 457323 455460 453920 452351 450420 447662 443608 437834 429971
64858 429971 419971 408303 395560 382004 367867 353885 340964 329284 318350 308008 298786 290987
64846 290987 284062 277388 271241 266481 263463 261688 260415 259245 258143 257157 256165 254814 252873 250708 249125
64831 249125 248509 248379 248063 247557 247323 247429 247413 247023 246719 247320 249320 252586 256481 260230 263460 266488 269992
64814 269992 274386 279601 285465 292099 299927 309405 320654 333178 345941 357900 368465 377401 384371
64801 384371 388844 390464 389291 385698 380251 373717 366979 360741 355301 350513 345979 341497 337548 335097
64787 335097 334590 335268 335973 336549 337920 340682 344174 347233 349354 350732 351609 352186 352978 354601 357184 360403
64771 360403 364191 369040 375510 383769 393670 404962 417254 430051 443012 456036 469033 481812
64759 481812 494283 506563 518773 530953 543323 556451 570944 587149 605247 625404 647378
64748 647378 669955 691001 708216 719907 725217 723935 716215 702552 684021 662412 639735 617334
64736 617334 595617 574805 555740 539573 526763 516780 508868 502757 498428 495442 492781 489360 484664
64723 484664 479078 473754 470090 469120 471219 476265 483993 494289 507306 523182 541473 560929 580148
64710 580148 598321 614951 628773 637562 639361 633674 621260 603226 580793 555630 529657 504333
64698 504333 480425 458368 438460 420641 404582 390162 377557 366740 357266 348791 341492 335756
64686 335756 331663 329037 327753 327671 328346 329133 329687 330234 331427 333958 338158 343793 350310 357407 365269 374111
64670 374111 383696 393505 403162 412267 419922 424888 426440 424842 420919 415478 409252 402948 396911 390970
64656 390970 384994 379491 375230 372318 370081 367969 366137 364999 364585 364723 365591 367697 371340 376328 382200
64641 382200 388593 395493 403334 412778 424206 437553 452811 470418 490751 513341 536972 560432
64629 560432 582701 602515 618372 629150 634276 633317 626081 613306 596530 576936 555024 531837
64617 531837 509550 489976 473049 457788 444277 433505 425446 418622 411887 405564 400372 396152 392243
64604 392243 388353 384416 380161 375507 371022 367352 364473 361988 359837 358188 356908 355775 355066 355409 357121
64589 357121 360164 364606 370670 378401 387793 399169 413018 429534 448716 470772 495739 522645
64577 522645 549707 575655 600455 624472 647274 667605 684231 696436 703796 705795 701836 691636
64565 691636 675605 654771 630254 603005 574189 545488 518423 493409 470029 448374 429534
64554 429534 414447 402722 393116 384867 378020 372703 368745 366099 365105 366116 369223 374530 382207 391916
64540 391916 402399 412064 419881 425414 428168 427511 423355 416457 407788 397973 387654 377896 369594 362560
64526 362560 355860 349168 343248 338876 335833 333374 331292 329949 329372 328944 328221 327674 328251 330251 332814
64511 332814 334630 335133 334978 335344 336907 339593 343132 347467 352603 358456 365150 373172 382924 394201 406306
64496 406306 418546 430386 441303 450769 458384 463860 467050 468205 468096 467636 467445 467962 469762 473398
64482 473398 478965 486003 493677 500817 506008 508151 506998 502954 496543 488421 479612 471045 462794 454373
64468 454373 445989 439080 435284 435199 438216 443168 448900 454659 460316 466009 471208 474352 473704 468572 459650
64453 459650 448433 436489 424978 414398 404709 395809 387832 380969 375237 370582 367010 364435 362639
64440 362639 361658 362008 364204 368129 373200 379142 386307 395154 405636 417194 429258 441782 455477
64427 455477 471572 491168 514653 541814 572627 607954 649423 698690 757006 825384 904591
64416 904591 994227 1091702 1192746 1293508 1392172 1488482 1582119 1671918 1756126 1832509 1898166
64405 1898166 1950139 1986705 2007828 2014219 2006319 1984171 1947539 1895681 1827658 1743666 1646179 1539525
64393 1539525 1428461 1317220 1209318 1107428 1013232 927613 851019 783509 724686 673836
64383 673836 630132 592695 560810 534321 513475 498101 487305 480244 476713 476365 477707 478635 477882
64370 477882 475395 471414 465891 458798 450244 440081 428051 414638 401202 388915 377944 368035 359430
64357 359430 352778 348317 345552 343639 341932 340403 339742 340828 343873 348240 353163 358233 362953 366388
64343 366388 367765 367158 365075 361615 356647 350614 344454 338678 333152 327892 323350 319617 316056 312254
64329 312254 308854 306782 305991 305754 306003 307563 310904 315456 320495 326111 332793 340587 349359 359591 372099
64314 372099 386779 402102 416042 427134 434598 438047 437505 433521 426845 418038 407533 395971 384192
64301 384192 372946 362666 353458 345114 337290 329848 323019 317132 312274 308348 305377 303547 302962 303503
64287 303503 304890 306772 308792 310676 312309 313678 314862 316168 318134 321205 325351 330192 335505 341523
64273 341523 348594 356524 364316 370684 374999 377652 379364 380242 379837 378136 376033 374595 374139 374382 375199
64258 375199 376780 379131 381789 384092 385418 385231 383250 379623 374586 367902 359059 348258 336885 326620
64244 326620 318161 311079 304801 299344 294999 291653 288799 286192 284162 283131 283047 283524 284374 285666 287261
64229 287261 288679 289547 289911 289920 289536 288793 288110 287987 288480 289226 289849 290098 289735 288627 286858 284461 281129 276596
64211 276596 271327 266406 262598 259777 257357 255047 253076 251895 251803 252672 253929 254953 255611 256313 257541
64196 257541 259490 262190 265720 270197 275732 282508 290777 300640 311953 324573 338624 354330 371534
64183 371534 389355 406319 420876 431880 438660 440857 438492 432331 423844 414424 404620 394332 383616
64170 383616 372957 362752 352914 343186 333642 324630 316293 308336 300334 292253 284648 278333 273820 271060
64156 271060 269576 268717 267944 267309 267700 270167 274753 280365 286050 291925 298518 305675 312734 319387 325633
64141 325633 331048 334909 337030 337754 337134 334887 331284 327268 323397 319307 314572 309405 304175 298942 294020
64126 294020 290374 288750 288761 289492 290700 292817 295948 299603 303407 307558 312504 318554 325851 334367 343877
64111 343877 354115 364883 375750 385756 393799 399351 402629 404179 404546 404370 404486 405779 408871 413839
64097 413839 420187 427250 434662 442189 449102 454156 456469 456050 453217 447946 440287 431054 421436 411984
64083 411984 402495 392857 383492 374931 367411 360992 355698 351403 347870 344982 342725 340980 339632 338844
64069 338844 338826 339326 339777 339999 340395 341271 342294 342785 342276 340669 338259 335824 334345 334228 334872 335283 335024
64052 335024 334350 333505 332200 329898 326476 322474 318741 315868 313980 312960 312752 313421 315089 317933 322095
64037 322095 327381 333113 338545 343462 348152 352681 356400 358434 358656 358043 357986 359239 361596 364571 368223
64022 368223 373114 379468 386636 393522 399332 403719 406344 406733 404734 400911 396253 391421 386374 380770
64008 380770 374683 368791 363790 359770 356264 352745 348924 344757 340493 336675 333709 331405 329253 327118
63994 327118 325331 324099 323347 323179 323865 325183 326370 327139 328136 329899 331909 333305 334137 335243 337182 339875
63978 339875 342998 345970 347838 348041 347231 346540 346074 344921 342683 340093 337887 335940 333916 332069 330866
63963 330866 330388 330596 331743 334002 336995 340137 343240 346556 350538 355788 362772 371210 380149 389089 398626
63948 398626 409537 421657 434310 447585 462372 479228 497993 518718 542278 569612 600723
63937 600723 634832 671314 710095 751217 794410 839126 884732 930487 975453 1018521 1058396
63926 1058396 1093508 1122223 1143478 1157169 1163596 1162620 1153817 1137545 1115263 1088403 1057415 1022368
63914 1022368 984076 943926 902832 861118 819361 778604 739643 702816 668633 637939 611167
63903 611167 588076 568442 552346 539395 528374 518280 509240 501892 496318 492184 489475 488340 488391
63890 488391 488890 489598 490875 492952 495669 498933 502913 507681 513078 519094 526063 534342 543993 554832
63876 554832 566611 579172 592604 607248 623452 641477 661806 685170 711924 741630 773717
63865 773717 808382 846353 887920 932860 981365 1034391 1092786 1156509 1224965 1297737 1374666
63854 1374666 1455527 1539968 1627533 1717389 1808043 1897619 1984502 2067621 2146158 2219109 2285087
63843 2285087 2342448 2389591 2425288 2448858 2460109 2459101 2445923 2420677 2383736 2335984 2278687
63832 2278687 2213121 2140439 2061847 1978630 1891903 1802639 1712125 1622106 1534192 1449309 1367906
63821 1367906 1290432 1217257 1148391 1083751 1023563 968036 916741 868849 824101 783081 746387
63810 746387 713855 684770 658523 634883 613872 595558 579788 565965 553260 541095 529389
63799 529389 518396 508505 500032 492871 486374 479934 473660 468075 463171 458360 453495 449283 446265 443871
63785 443871 441024 437433 433758 430658 428161 425878 423375 420225 416093 410999 405388 399921 395200 391573
63771 391573 389011 387272 386307 386336 387366 389006 391177 394831 401329 411063 423109 436265 449763 462671
63757 462671 473306 479992 482248 480665 475655 466976 454644 439790 424201 409189 395177 382207
63745 382207 370559 360828 353537 348667 345497 343077 341030 339826 340094 341737 343889 345700 347011 348288
63731 348288 350161 353041 356947 361553 366419 371249 376020 380990 386624 393219 400363 407022 412608 417743
63717 417743 423445 429582 434789 438072 439806 440727 440606 438677 435076 431041 427534 424333 420726 416682 412912
63702 412912 409905 407332 404545 401525 399040 397759 397408 397106 396414 395665 395250 395085 395005 395178 395774 396582 397370
63685 397370 398304 399508 400484 400542 399756 399018 399192 400506 402604 404748 406227 407123 408581 411740 416473 421723
63669 421723 426963 432590 438824 445008 450234 454094 456631 458171 459373 460704 461525 460401 456804 451889
63655 451889 447062 442391 437068 430958 424900 419694 415523 412344 410244 409344 409768 411691 415155 419966 426063
63640 426063 433733 443097 453657 464863 476876 490067 503868 516832 527959 537403 545743 553074
63628 553074 559072 563521 566463 568153 569101 569906 570871 572000 573541 576246 580866 587584 596091 606057 617393
63613 617393 630382 645822 664851 688262 715950 747146 781118 817478 855885 895569 935091
63602 935091 972430 1005432 1032454 1052713 1066007 1072230 1071479 1064791 1054519 1043514 1033585 1024689 1015650
63589 1015650 1005490 993911 980667 965005 946033 923511 898078 870899 843276 816315 790519
63578 790519 765706 741705 719161 699311 682862 669504 658646 650212 644328 640618 638353 637206
63566 637206 637346 638762 641060 644136 648556 654791 662292 669822 676669 683169 690160 698473 709089 723148
63552 723148 741310 763373 789077 819129 855138 898944 952716 1019269 1100455 1193690 1290062
63541 1290062 1376934 1443481 1484750 1501778 1499030 1481795 1454881 1422476 1388399 1355981 1327372
63530 1327372 1302956 1281666 1262063 1243115 1224116 1204201 1182177 1156822 1127328 1093675 1056790
63519 1056790 1018385 980409 944362 910913 880133 852080 827088 805419 786758 770214 754797
63508 754797 739835 725174 711298 699100 688990 680041 670444 658985 645736 631219 615567 599011
63496 599011 582605 567661 554625 543141 533122 524989 518823 514011 510004 506908 505046 504418 504917
63483 504917 506661 509668 513486 517489 521450 525603 530383 536284 543679 552412 561715 570828 579608 588289
63469 588289 596777 604577 611330 617163 622448 627428 632153 636671 641246 646394 652486 659176 665404 670189
63455 670189 673319 675064 675400 673933 670582 665962 661037 656706 653788 652879 653869 655914 658418 662040 668354
63440 668354 678457 692272 709401 730492 757844 795194 846964 916559 1003533 1101441 1198976
63429 1198976 1284386 1349783 1392163 1411613 1409665 1389324 1355529 1314517 1272338 1233788 1202201
63418 1202201 1179598 1166844 1163969 1170643 1186363 1210038 1239391 1270959 1300860 1325694 1342973 1351351
63406 1351351 1351064 1344082 1333179 1320338 1306145 1290763 1274920 1259447 1244107 1227524 1208304 1185773
63394 1185773 1159679 1129763 1095970 1058887 1019739 980060 941262 904183 868940 835458 804139
63383 804139 775783 750860 729245 710658 694941 681794 670755 661680 654879 650543 648405 648168 649843
63370 649843 653369 658321 664443 672216 682468 695641 711816 731230 754275 781113 811720 846303
63358 846303 885337 929172 977818 1030933 1087703 1146756 1206454 1265104 1320640 1370342 1411405
63347 1411405 1441919 1461249 1469864 1469286 1462031 1450994 1438643 1426843 1416957 1409342 1402726 1394727 1383275
63334 1383275 1367378 1346694 1321002 1290290 1254953 1215760 1173941 1131286 1089712 1050697 1015513
63323 1015513 985961 964428 953384 955227 971670 1001119 1035842 1063405 1073099 1061668 1032913 992742
63311 992742 945517 894091 841107 789252 740820 697451 659839 627586 599849 576323 557157
63300 557157 541939 529429 518505 508746 499855 491146 482115 473087 464795 457566 451233 445555 440312
63287 440312 435181 429985 424957 420429 416364 412523 409049 406503 405279 405201 405765 406587 407579 408833 410404
63272 410404 412169 413871 415337 416544 417480 418112 418566 419129 419951 420849 421564 422047 422392 422770 423695 426020 430147
63255 430147 435361 440463 445184 450482 457183 464709 471530 476638 480266 483264 486260 489536 493373 498102
63241 498102 503729 509714 515357 520460 525504 531111 537448 544266 551401 558947 567003 575561 584746 594939
63227 594939 606428 619000 632016 644787 656887 668306 679521 691234 703856 717288 731369
63216 731369 746306 762329 779036 795483 810991 825538 839190 851403 861063 867092 868953 866793
63204 866793 861233 852745 841102 825747 807012 786678 766871 748519 731312 715069 700458 688182
63192 688182 678036 669265 661610 655602 651999 651254 653411 658139 664958 673698 684739 698495 714737
63179 714737 732703 751712 771181 790065 806915 820845 832095 841347 848890 854811 859691 864458
63167 864458 869507 874379 878405 881390 883549 884944 885047 882755 876834 866531 851815 833011 810452
63154 810452 784704 756963 728824 701542 675680 651358 628501 606864 586319 567233 550225
63143 550225 535416 522283 510448 500159 491726 484838 478887 473641 469156 465305 461957 459428 458015
63130 458015 457019 455000 451327 447002 443515 441306 439793 438532 437708 437517 437727 438048 438549 439357 440223 440678
63114 440678 440599 440380 440551 441351 442654 444175 445693 447191 448876 451063 453982 457649 461895 466517 471466
63099 471466 476995 483573 491568 501109 512414 526265 543728 565035 588779 612530 634233 652798
63087 652798 667367 676594 679080 674433 663623 648399 630616 611990 593952 577439 562893 550588
63075 550588 540808 533613 528612 525204 522943 521607 521037 521190 522322 524855 528948 534373 540895 548604 557689
63060 557689 568076 579555 592271 606778 623423 641858 661349 681484 702444 724725 748825
63049 748825 775174 804028 835247 868242 902208 936340 969947 1002715 1035017 1067681 1101128
63038 1101128 1134866 1168064 1200562 1233031 1266216 1300334 1335183 1370434 1405521 1439404 1470744
63027 1470744 1498288 1520974 1537746 1547554 1549655 1543818 1530122 1508712 1479944 1444791 1404848 1361779
63015 1361779 1316890 1271432 1227100 1185814 1148779 1116032 1087132 1062269 1042611 1029675 1024425
63004 1024425 1026768 1035631 1049510 1067026 1087010 1108238 1129483 1149955 1169382 1187407 1203257 1216427
62992 1216427 1227524 1237944 1248696 1259858 1271140 1282589 1294585 1307449 1321104 1334889 1347630
62981 1347630 1358093 1365398 1368843 1367538 1360608 1347709 1328933 1304341 1274116 1239267 1201523 1162253
62969 1162253 1121986 1081164 1040715 1001417 963273 926109 890438 857123 826504 798558 773643
62958 773643 752254 734012 717645 702146 687390 673469 660122 647162 634878 623521 612751
62947 612751 602088 591641 581913 573027 564606 556347 548326 540687 533432 526631 520537 515372 511160 507899
62933 507899 505623 504118 502758 500889 498360 495533 492801 490315 488116 486312 485002 484157 483686 483518 483560
62918 483560 483707 484012 484811 486569 489696 494507 501173 509471 518739 528273 537730 546878 555057 561234 564700
62903 564700 565542 564381 561912 558737 555426 552535 550633 550192 551173 552686 553457 552834 551159 549076 546747
62888 546747 543915 540439 536526 532658 529551 528027 528638 531373 535661 540561 545067 548637 551516 554136
62874 554136 556191 556817 555810 553978 551936 549255 545351 540595 535818 531210 526526 522015 518230 515140
62860 515140 512397 510365 509834 510638 511554 511846 512009 512631 513395 513729 513705 513771 514113 514779 515856 517058 517702 517634
62842 517634 517663 518503 519710 520263 519802 518738 517487 516269 515351 514880 514668 514669 515380 517199 519779 522650 526203
62825 526203 531280 538029 545907 554554 563705 572380 579247 583999 587438 589998 591056 590094 587632 584549
62811 584549 581230 577923 575123 572935 570712 568156 566228 566077 567444 569133 570884 573761 578536 584601
62797 584601 590881 597156 603988 611715 620047 628507 636996 645928 655956 667522 680699 695582 712708
62784 712708 732863 756512 783737 814672 849572 888393 930762 976561 1026043 1079031 1134352
62773 1134352 1190638 1247520 1305505 1364597 1423488 1480272 1533628 1582970 1627504 1665465 1694559
62762 1694559 1713248 1721574 1720534 1710661 1691532 1662851 1625659 1581944 1533162 1479698 1421992 1361657
62750 1361657 1301051 1241965 1185076 1130508 1078424 1029049 982533 939061 898954 862504 829761
62739 829761 800550 774624 751701 731404 713267 696876 682094 669137 658323 649659 642785 637354
62727 637354 633261 630297 627813 625128 622225 619717 618019 616912 616021 615404 615411 616187 617624 619717 622742 627063
62711 627063 632868 640048 648244 657157 666928 678177 691576 707474 725953 747082 770939 797440
62699 797440 826243 856785 888497 921277 955827 993203 1033841 1077235 1122707 1170058 1219066
62688 1219066 1268635 1316936 1362223 1403029 1437797 1465005 1483833 1494185 1495913 1488572 1472210 1447913
62676 1447913 1417158 1380909 1339743 1294630 1247097 1198639 1150286 1102704 1056432 1011913 969518
62665 969518 929609 892504 858365 827206 799021 773789 751332 731221 712935 696233 681431
62654 681431 669129 659398 651245 643146 634249 624896 615905 607594 599681 591902 584442 577766 572201 567699
62640 567699 563984 560907 558659 557556 557711 558981 561059 563308 564749 564782 563960 563482 563720 563758 562651 560508
62624 560508 557997 555464 553109 551372 550273 548874 546466 544038 543383 544748 546546 547656 548716 550567
62610 550567 552605 553751 554221 555140 556808 558557 560229 562621 566260 570713 575500 580993 587953 596737 607423
62595 607423 620270 635483 652783 671763 692628 716105 742472 770984 800348 829626 858531
62584 858531 887005 914673 940580 963239 980875 992025 996327 994806 989000 979623 966282 948634
62572 948634 927469 904332 880334 855805 830915 806007 781213 756310 731304 706887 684087
62561 684087 663637 645786 630368 616817 604443 593025 583013 574823 568129 562081 556101 550119
62549 550119 544231 538563 533470 529444 526659 524836 523662 523100 523178 523809 525022 527104 530141 533531 536294
62534 536294 537933 538709 539014 538810 537946 536830 536370 537220 539336 542300 545810 549736 554061 559055 565337 573465
62518 573465 583519 595273 608623 623617 640226 658474 678663 701036 725259 750746 777527
62507 777527 806178 836641 867601 897361 924945 950061 972372 991300 1006241 1016550 1021640 1021597
62495 1021597 1017507 1010699 1001831 991180 979513 967956 957089 946957 938041 931444 927801 926627 927161
62482 927161 929444 934208 942045 952931 966007 979449 991058 999689 1005918 1010768 1013896 1013552 1008236
62469 1008236 997739 982520 962785 938653 910890 880922 850065 818979 787874 757034 727036
62458 727036 698576 672170 647971 625832 605625 587520 571902 558897 548130 539133 531860 526494
62446 526494 522738 519700 516726 513974 511978 511009 511191 512767 515623 518819 521276 522848 524063 524941 524954
62431 524954 524178 523485 523260 522858 521803 520622 519810 518791 516870 514590 513056 512285 511396 510272 509778 510170
62415 510170 510447 509762 508626 508138 508597 509386 509774 509382 508299 507146 506718 507119 507562 507312 506554 506002 506028 506618
62397 506618 507889 510155 513585 518137 523640 529615 535315 540417 545465 551115 557032 562187 566213 569816
62383 569816 573621 577255 580085 582473 585634 590317 596168 602550 609483 617366 626061 634877 643592 652984
62369 652984 663890 675977 688016 699445 711224 724949 741540 761038 783370 808817 837903
62358 837903 871266 909637 953547 1002952 1057389 1116449 1179673 1245782 1312397 1376800 1436782
62347 1436782 1490502 1535961 1571337 1596031 1610928 1617372 1616101 1607389 1591757 1569917 1542098 1508066
62335 1508066 1468113 1423660 1376529 1327937 1278546 1229276 1181471 1136253 1094097 1055164 1019594
62324 1019594 987220 957331 929111 902241 876866 853007 830268 808106 786258 764889 744415
62313 744415 725226 707594 691792 678161 666872 657625 649797 642994 637306 632951 629813 627429 625336
62300 625336 623390 621851 621133 621287 621733 621702 621011 620124 619443 618966 618836 619740 622290 626261 630906 635894 641472
62283 641472 647739 654255 660478 666183 671278 675461 678304 679572 679401 678245 676662 675039 673539 672409
62269 672409 672180 673318 675799 679383 684269 691171 700753 713379 729512 749896 775123 805299 840389
62256 840389 880682 926663 978628 1036578 1100214 1168566 1239557 1310127 1376965 1437253 1488978
62245 1488978 1530775 1561622 1580922 1589080 1587758 1578872 1563025 1539213 1506396 1465143 1417593 1366185
62233 1366185 1312782 1258608 1204424 1150806 1098756 1049972 1006033 967268 932819 901831 874107
62222 874107 849617 827954 808601 791290 775828 761931 749502 738711 729405 720778 712057 703254
62210 703254 694776 686499 677867 668891 660415 653178 647065 641591 636700 632668 629474 626737 624276 622376
62196 622376 621457 621738 623286 626116 630087 634901 640372 646610 653790 661889 670804 680564 691200 702479
62182 702479 714066 725882 737959 749828 760443 768856 774736 778150 779356 779207 779300 781092 784998 790909
62168 790909 799438 811985 829582 852443 880744 914986 955114 999973 1048130 1098516 1149499 1197931
62156 1197931 1240254 1274570 1301005 1320235 1332554 1338281 1337942 1331557 1318528 1298740 1273286 1243657
62144 1243657 1210700 1174797 1136634 1097316 1058067 1020266 985442 954624 927817 904548 884821
62133 884821 869188 858127 851816 850303 853318 859948 869180 881028 896772 917765 944158 974895
62121 974895 1008709 1044921 1083370 1123795 1165431 1207255 1248503 1288665 1326851 1361358 1390079
62110 1390079 1411276 1423965 1428025 1424419 1415185 1402782 1389262 1375976 1363630 1352252 1341446 1331309
62098 1331309 1323117 1318697 1319162 1324584 1334737 1349513 1368550 1391017 1415925 1442313 1469108 1495398
62086 1495398 1520943 1545881 1569735 1591346 1610123 1626859 1642950 1659380 1676933 1696799 1720133
62075 1720133 1747224 1777718 1811457 1848384 1887606 1927208 1965209 2000277 2031581 2058580 2081344
62064 2081344 2100652 2117425 2132316 2146081 2159953 2175103 2191710 2208909 2225769 2242197 2258950
62053 2258950 2277057 2297275 2319756 2343868 2368257 2391214 2410991 2425717 2433232 2431481 2419389 2397176
62041 2397176 2365531 2324463 2273264 2211600 2140396 2061535 1976970 1888325 1797145 1705230 1614590
62030 1614590 1527111 1444234 1366817 1295256 1229702 1170186 1116597 1068600 1025532 986341 949822
62019 949822 915258 882809 853065 826127 801380 778239 756840 737746 721147 706623 693720
62008 693720 682548 673721 667773 664689 664066 665618 669394 675442 683431 692721 702613 712295 720710 726866
61994 726866 730382 731530 730767 728355 724277 718180 709504 698092 684704 670561 656373 642185 628109
61981 628109 614622 602061 590422 579890 571016 563966 558021 552258 546461 541080 536605 533263 531008
61968 531008 529465 528176 527131 526712 526893 526966 526405 525569 525132 525276 525910 527160 529063 531144 532983 534904
61952 534904 537571 541229 545969 552304 560608 570290 580437 591174 603546 618107 634576 652875 673538
61939 673538 696785 722045 748691 776525 805193 833892 862044 889709 916968 943454 968769
61928 968769 992735 1014870 1034219 1050168 1062855 1072347 1077931 1078782 1074953 1067242 1056560 1043884 1030438
61915 1030438 1017303 1005135 994646 986935 982865 982614 986424 995289 1009965 1029561 1052013 1075905
61903 1075905 1100966 1126715 1151474 1173082 1189938 1201131 1206232 1205481 1199632 1189038 1173216 1151925
61891 1151925 1126435 1099083 1071455 1043562 1014934 985990 957877 931278 905970 881603 858393
61880 858393 836797 816847 798185 780553 763886 748091 733139 719424 707656 698241 690995 685455
61868 685455 681194 677834 675133 673271 672823 674265 677616 682583 688856 696334 705424 717200 732820 752547
61854 752547 775621 801257 829514 861057 896416 935733 978883 1025470 1074824 1126111 1178279
61843 1178279 1229842 1279075 1324539 1365139 1399611 1426507 1445032 1455500 1458716 1455435 1446848 1435031
61831 1435031 1422239 1410016 1399501 1392307 1390323 1394673 1405375 1421997 1444149 1471229 1501920 1533936
61819 1533936 1564124 1589219 1606984 1616557 1617536 1609188 1591044 1563803 1528886 1487327 1439827 1387747
61807 1387747 1333142 1277821 1223084 1170401 1121437 1077104 1037253 1001495 969627 941123 915034
61796 915034 890869 868894 849124 830710 812866 795775 779929 765108 750777 737117 724846
61785 724846 714174 704673 696042 688297 681240 674493 668144 662678 658088 653721 649270 645271 642126 639174
61771 639174 635355 630537 625581 621232 617561 614482 612080 610162 608123 605812 604138 604157 605702 607601 609221
61756 609221 611042 613474 615941 617761 619408 622045 625977 630350 634360 638009 641476 644535 647106 649918
61742 649918 654067 660080 667810 677019 687608 699354 711888 724924 738212 751203 763109 773438
61730 773438 782282 790003 796879 803178 809358 815898 822987 830521 838370 846436 854427 861802 868068 873032
61716 873032 876673 878946 879884 879723 878677 876627 873263 868525 862631 855724 847883 839581 831711 824845 818765
61701 818765 812899 806976 800980 794877 788872 783672 779978 777772 776526 776025 776459 777773 779436 780933 782069
61686 782069 782726 782828 782698 782920 783581 783946 783099 780688 776923 772233 767102 761897 756574 750787 744508 738287
61670 738287 732672 727588 722410 716522 709727 702445 695593 689883 685027 680053 674614 669590 666040 663951
61656 663951 662451 660899 659264 657700 656340 655445 655157 655061 654397 652867 650886 648996 647358 645947 644925
61641 644925 644645 645368 647073 649393 651684 653257 653612 652510 649985 646448 642589 638931 635447 631762 627576
61626 627576 622758 617255 611351 605981 602355 601101 602017 604682 608998 614882 621721 628479 634360 639157
61612 639157 642891 645271 645728 644039 640814 637156 633762 630541 627216 624113 622120 621928 623585 626792 631352
61597 631352 637033 643161 648664 652721 655229 656525 656722 655677 653611 651347 649540 647910 645663 642518
61583 642518 638802 634564 629248 622448 614349 605139 594552 582553 570046 558260 547670 538018 529226
61570 529226 521645 515455 510379 506036 502167 498493 494760 490959 487208 483393 479247 474657 469668 464431
61556 464431 459593 456264 454844 454055 452070 448652 445205 442607 440058 436631 432954 430470 429659 429860 430448
61541 430448 431328 432526 434104 436433 439818 443841 447655 450897 453800 456485 458725 460385 461482 461779 460900
61526 460900 458918 456257 453003 448925 444287 439881 435994 432008 427408 422575 418159 414286 410942 408539
61512 408539 407281 406319 404376 401164 397526 394261 391540 389391 387957 387028 385980 384560 383232 382494 382252
61497 382252 382123 381889 381420 380648 379976 380150 381222 382166 382155 381808 382351 383869 385305 386134 387018 388569 390384
61480 390384 391836 393026 394311 395458 395999 396125 396454 397090 397583 397764 397952 398264 398375 398159 398047 398415 399038
61463 399038 399448 399482 399212 398666 398034 397881 398687 400183 401590 402584 403745 405890 409116 412647 415510 417267
61447 417267 418160 418700 419182 419540 419593 419362 419255 419959 422056 425576 430014 435000 440866 448157 456438 464006
61431 464006 469187 471791 472997 473966 474925 475505 475443 474813 473970 473528 474106 475844 478317 481168 484636 489151
61415 489151 494502 499721 503795 506298 507310 507024 505586 503230 500379 497456 494525 491113 486617 481028
61401 481028 475083 469436 463833 457506 450397 443587 438280 434680 432049 429589 426953 424140 421360 418946
61387 418946 417025 415170 412733 409654 406703 404786 404192 404649 405819 407419 409019 410099 410474 410491 410737 411574
61371 411574 412970 414535 415681 415950 415477 415135 415927 418095 420930 423607 426030 428691 431856 435249 438584
61356 438584 442074 446162 450925 456032 461137 466102 470910 475735 481117 487783 496146 506155 517703 530890
61342 530890 545683 561583 577952 594577 611503 628242 643534 656133 665668 672463 676739 678377
61330 678377 677434 674435 669939 664192 657457 650314 643198 635950 628433 621428 616120 612534 609245 605078
61316 605078 600464 596629 593986 592035 590376 588950 587439 585361 582892 580845 579670 579095 578962 579756 581959
61301 581959 585456 589985 595686 602829 611425 621412 632730 644637 655400 663328 667972 669894 669535 666896
61287 666896 662123 655740 648308 640371 632689 625957 620242 615168 610751 607540 605840 605317 605569 606624 608626
61272 608626 611403 614667 618289 622147 625967 629640 633465 637790 642630 647911 653798 660409 667399 674261
61258 674261 681026 688314 696775 706834 718972 733801 751620 772064 794138 816378 836965 854162
61246 854162 866935 875040 878489 877283 871817 862998 851564 837572 821095 803159 785365 768618
61234 768618 752851 738011 724660 713347 704036 696476 690640 686358 683084 680574 679430 680337 683113
61221 683113 687182 692688 700284 709895 720472 731040 741209 750532 758288 764316 769358 774049 778086
61208 778086 780900 782653 784026 785424 787008 789255 792888 798312 805521 814435 825031 837368 851889
61195 851889 869439 890572 914982 942053 971795 1004762 1041147 1080462 1122067 1165527 1210304
61184 1210304 1255447 1299725 1341965 1381298 1417256 1449631 1478219 1502968 1524432 1543509 1560320
61173 1560320 1573663 1582042 1584912 1582474 1574804 1562039 1545134 1525317 1502614 1475699 1443507 1406395
61161 1406395 1365584 1322246 1277505 1232615 1188518 1145548 1104004 1064666 1028367 995365 965513
61150 965513 938732 914917 893679 874725 858433 845521 836094 829369 824511 821530 821123 823605 828114
61137 828114 833011 837157 840607 843916 847093 849755 852257 856062 862654 872422 884940 900029 918146
61124 918146 939869 965518 995358 1029879 1069557 1114340 1163460 1215896 1271078 1329132 1390427
61113 1390427 1454916 1521941 1590484 1659435 1727717 1794402 1858735 1919972 1977231 2029646 2076567
61102 2076567 2117521 2152105 2180013 2201040 2214916 2221441 2220851 2213671 2199785 2178070 2147453 2108151
61090 2108151 2061401 2008354 1949885 1887321 1822410 1756384 1689617 1622418 1555684 1490666 1428554
61079 1428554 1370299 1316334 1266377 1220022 1177510 1139369 1105361 1074543 1046496 1021735 1000666
61068 1000666 982862 967651 954694 943673 934126 926058 920066 916401 914423 913401 913345 914679 917735
61055 917735 922928 930683 940658 951703 963245 976167 991738 1010310 1031752 1056436 1084783 1116272
61043 1116272 1149946 1185730 1224368 1266123 1310328 1356191 1403298 1451381 1500243 1549920 1600304
61032 1600304 1650635 1699913 1747802 1794624 1840562 1885492 1929568 1973278 2016608 2058503 2097408
61021 2097408 2132323 2163499 2192299 2220363 2249008 2279753 2315124 2357882 2409060 2467589 2532357
61010 2532357 2603928 2684121 2775526 2882710 3012974 3174781 3376277 3626334 3936057 4318638
61000 4318638 4790291 5374473 6106084 7033968 8225286 9764267 11718083 14058521 16590824
60991 16590824 18977702 20881536 22127684 22758308 22954080 22927062 22879354 23001495 23423116
60982 23423116 24112783 24835849 25254896 25112275 24345034 23055663 21403571 19529267 17548059
60973 17548059 15567591 13684223 11964231 10437092 9105912 7960135 6982259 6152209
60965 6152209 5451346 4863122 4370837 3957313 3607429 3309521 3054078 2832670 2638647
60956 2638647 2467524 2315968 2181261 2061935 1957680 1867867 1790740 1724316 1667092 1617289
60946 1617289 1572255 1529459 1487708 1446863 1406823 1367421 1328970 1292117 1257107 1223583 1191144
60935 1191144 1159812 1130003 1102272 1077010 1054101 1032832 1012312 992078 972308 953563 936303
60924 936303 920525 905717 891264 876897 862725 848920 835583 822865 810959 799909 789666
60913 789666 780394 772413 765722 759897 754658 750231 746881 744335 742074 740005 738326 736720 734231 730234
60899 730234 725173 720023 715214 710421 705220 699509 693256 686254 678371 669834 661093 652507 644224 636184
60885 636184 628103 619662 610903 602318 594372 587090 580311 574139 568883 564617 561137 558267 555921 553884
60871 553884 551925 550188 549147 549032 549534 550292 551423 553374 556343 560054 564073 568252 572903 578521 585246
60856 585246 592543 599495 605487 610553 615106 619438 623520 627207 630591 634033 637635 640655 641784 640323
60842 640323 636875 632608 628088 623217 617957 612408 606197 598541 589263 579350 570190 562475 555899 549651
60828 549651 543153 536673 531291 527821 525746 523685 520969 518161 515889 513942 511954 510297 509717 510485 512481
60813 512481 515644 519708 523821 527199 530105 533586 538271 543901 549958 556184 562453 568652 574817 581007
60799 581007 586918 591931 595650 598171 599874 601194 602540 604083 605562 606598 607223 607836 608569 608965 608387
60784 608387 606597 603863 600666 597361 594029 590559 586728 582067 575835 567605 558116 549064 541652 535567
60770 535567 529756 523916 518702 514652 511542 508890 506570 504678 503124 501574 499715 497558 495614 494682
60756 494682 495196 496798 498739 500551 502093 503137 503435 503254 503468 504966 508095 512610 517810 522740 526678
60741 526678 529631 532172 534776 537544 540506 543781 547302 550739 553929 557153 560831 565097 569749 574456
60727 574456 578834 582508 585299 587351 589001 590513 591900 592989 593697 594294 595251 596704 598218 599208 599412
60712 599412 598802 597328 595055 592374 589645 586696 583055 578638 573892 569248 564779 560403 556059 551591
60698 551591 546782 541648 536521 531762 527484 523551 519748 516100 513105 511376 510771 510252 509019 507551 506930
60683 506930 507341 507932 508115 508271 508988 510223 511636 513351 516068 520564 527060 534806 542344 548611 553795
60668 553795 558699 563488 567690 571320 575044 579009 582413 584631 585977 586829 586866 585871 584528 583522 582401
60653 582401 580364 577862 576306 576214 576678 576885 577187 578263 579924 581396 582344 583011 583457 583208 581768 579264
60637 579264 576436 574082 572549 571721 571418 571717 572841 574819 577315 579828 582115 584466 587437 591208 595273
60622 595273 599019 602459 606040 609775 613094 615687 618036 620785 623977 627201 630198 632962 635538 638061
60608 638061 640772 643638 646192 648080 649582 651254 653356 655914 658945 662053 664151 664455 663761 664022 666497
60593 666497 670769 675641 680359 684744 688786 692596 696448 700413 704083 706886 708578 709231 708883 707434 704824
60578 704824 701189 696942 692687 688945 685859 683278 681100 679381 678224 677780 678342 680152 683127 687086 692222
60563 692222 698942 707180 716275 725650 735137 744458 752906 759976 765949 771348 776078 779659 782220 784717
60549 784717 788080 792525 797823 803875 810805 818664 827312 836527 846212 856488 867559 879390 891621
60536 891621 903982 916666 930048 944034 958055 971780 985505 999721 1014571 1030023 1046305
60525 1046305 1063831 1082755 1102906 1124155 1146547 1170047 1194399 1219318 1244589 1269891 1294797
60514 1294797 1319137 1343193 1367259 1391031 1413595 1433945 1451351 1465248 1475008 1480014 1479997 1475354
60502 1475354 1467163 1456756 1445056 1432260 1418141 1402644 1386170 1369476 1353493 1339123 1326813
60491 1326813 1316211 1306314 1295974 1284126 1269686 1251729 1229994 1204968 1177231 1146926 1114117
60480 1114117 1079446 1044051 1008859 974373 941187 910283 882501 857830 835493 814745 795403
60469 795403 777605 761308 746175 731879 718329 705596 693800 683102 673613 665151 657220 649428
60457 649428 641859 634845 628443 622323 616166 609911 603592 597185 590753 584558 578905 573967 569767 566134
60443 566134 562674 559045 555367 552025 549014 545806 542122 538432 535305 532524 529317 525362 521086 517054
60429 517054 513540 510722 508766 507450 506117 504300 502185 500261 498703 497346 496071 494953 494114 493669 493778
60414 493778 494503 495618 496730 497608 498291 498916 499609 500540 501906 503767 505923 507984 509516 510204 510055 509458
60398 509458 508887 508496 508106 507656 507409 507607 508156 508968 510434 513128 516985 521195 525036 528414 531347 533374
60382 533374 533968 533317 532136 530770 528970 526642 524326 522675 521795 521295 520765 520017 519106 518290 517789 517459 517007
60365 517007 516557 516670 517555 518683 519480 520079 520964 522125 523111 523747 524293 524902 525438 525896 526543 527484 528418 529051
60347 529051 529468 529944 530680 531909 534012 537235 541330 545691 549825 553670 557563 562028 567527 574236 582053
60332 582053 590787 600281 610244 619963 628332 634323 637627 638793 638566 637074 633853 628745 622462 616048
60318 616048 610013 604289 598826 593802 589361 585591 582780 581270 580966 581363 582236 583964 587093 591998 599158
60303 599158 609368 623206 640370 659719 679774 698968 715722 728676 736860 739533 736186 727107
60291 727107 713830 698575 683147 668529 655300 643891 634382 626491 619954 614623 610072 605600 600936
60278 600936 596592 593111 590230 587267 584121 581275 578802 576078 572725 569319 566649 564677 562776 560855
60264 560855 559681 559992 561773 564544 567997 572121 577006 582772 589559 597306 605558 613566 620551 625985
60250 625985 629839 632582 634587 635400 633942 629643 623132 615597 607784 599953 592419 585596 579568 574203
60236 574203 569722 566707 565405 565385 566097 567495 569842 573060 576557 579725 582535 585557 589386 594031 598977
60221 598977 603830 608653 613585 618435 622961 627283 631633 635846 639582 643010 646793 651369 656688 662718
60207 662718 669690 677666 686254 694987 703548 711448 718003 723075 727488 732154 736921 740719 742858 743839
60193 743839 744860 746726 749237 751477 752665 752820 752513 752001 750934 749000 746497 743893 741136 737883 734252
60178 734252 730734 727316 723244 718013 712283 707445 704351 702733 701848 701472 702134 704390 708098 712536 717212
60163 717212 722289 728107 734476 740681 746050 750281 753305 755155 756003 756072 755442 754197 752812 752132 752702 754289
60147 754289 756258 758353 760947 764563 769401 775407 782601 791176 801359 813370 827524 844078 862760
60134 862760 882460 901597 918846 933425 944763 952194 955153 953668 948499 940841 931901 922611 913501
60121 913501 904779 896586 889208 883075 878607 876076 875495 876551 878680 881285 883908 886236 888076 889396
60107 889396 890353 891129 891738 891947 891378 889749 887093 883760 880103 876176 871935 867663 864008 861468 859996
60092 859996 859127 858388 857652 857377 858567 862094 867899 875138 883287 892692 903732 915851 927922 939210
60078 939210 949311 957324 961978 962773 960367 955525 948286 938506 926645 913422 899058 883533 867475
60065 867475 852133 838365 826115 814974 804818 795725 787648 780432 773843 767415 760599 753371 746434
60052 746434 740482 735489 731131 727660 725737 725368 725625 725682 725672 726306 728122 731491 736834 744113 752304 760083
60036 760083 767075 773853 780694 786972 791971 795623 798088 799181 798692 796809 793620 788514 780741 770458
60022 770458 758605 745734 731598 716015 699625 683519 668464 654726 642300 631074 620934
60011 620934 611974 604466 598480 593688 589727 586577 584460 583469 583456 584177 585431 587127 589331 592175 595668
59996 595668 599728 604451 610149 616987 624644 632422 639554 645440 649876 653263 656353 659563 662665 665281
59982 665281 667407 669116 670000 669478 667644 665315 663066 660612 657403 653478 649349 645216 640727 635556 629938
59967 629938 624490 619694 615657 612273 609486 607389 606127 605670 605658 605549 604996 604067 603062 602144 601242 600289
59951 600289 599434 598951 599004 599619 600782 602430 604295 605905 606800 606735 605700 603876 601585 599053 596119 592354
59935 592354 587684 582746 578317 574488 570731 566843 563402 561091 559908 559314 558911 558602 558262 557768 557391 557712
59919 557712 558932 560571 562005 563109 564178 565503 567321 569924 573407 577349 581109 584523 587983 591785
59905 591785 595716 599417 602852 606115 609104 611776 614647 618515 623540 628916 633681 637617 641138 644608
59891 644608 648229 652467 657932 664581 671501 677888 683993 690665 698178 706033 713917 722252 731592 741885
59877 741885 752573 763023 772570 780527 786602 791088 794181 795240 793153 787398 778399 767016 754223
59864 754223 741241 729265 718677 708906 699342 690148 681932 674989 669154 664173 659898 656321 653737
59851 653737 652697 653531 656066 660169 666342 675317 687017 700345 713994 727074 738861 748449 755066
59838 755066 758635 759845 759901 760314 762574 767396 774177 781487 788259 794357 799993 804894 808257 809371 807978
59823 807978 804091 797731 788973 778105 765590 751933 737604 722938 708045 693008 678386 665332
59811 665332 654885 647068 640935 635619 631166 628241 627204 627663 628834 630061 630992 631494 631633 631694 631952 632233
59795 632233 631789 629887 626500 622224 617435 611925 605647 599447 594526 591237 588940 587081 585850 585566 585969
59780 585969 586512 587003 587555 588189 588992 590398 592767 595689 598210 599805 600717 601318 601674 601971 602836 604755 607384
59763 607384 609881 611844 613578 615460 617441 619296 621077 623055 625364 627878 630411 632842 635097 637143
59749 637143 638988 640559 641620 642076 642360 643283 645254 647887 650522 652896 655025 656630 657209 656727 655801 655045
59733 655045 654513 653959 653362 652994 653156 654049 655690 657705 659372 660144 660128 659872 659778 659868 660050 660398 661153 662520
59715 662520 664468 666704 668952 671224 673621 675865 677357 677854 677856 678193 679416 681612 684390 686778 687604 686463
59699 686463 684137 681691 679445 677240 675385 674605 675070 676093 676937 677377 677356 676638 675178 673494 672314 671983
59683 671983 672394 673342 674768 676762 679403 682512 685533 687811 688954 688764 686951 683268 677975 671813 665482
59668 665482 659435 654204 650495 648750 648934 650827 654166 658356 662448 665661 667684 668339 667424 665201 662662
59653 662662 660912 660554 661885 665201 670385 676528 682567 688105 693057 696802 698416 697751 695532 692246 687731
59638 687731 682138 676584 672239 669246 667208 666385 667671 671353 676493 681730 686305 690177 693642 697214
59624 697214 701645 707491 714513 721699 728012 733009 736607 738359 737302 732805 725573 717562 710764 706107
59610 706107 703552 702929 704312 707632 712426 718179 724696 731868 739246 746125 751953 756383 759035 759583 758204
59595 758204 755637 752645 749476 745918 741651 736483 730446 723789 716802 709543 701961 694354 687437 681700
59581 681700 676831 672055 666934 661640 656564 652022 648359 645958 644931 644882 645109 645066 644691 644434 644951 646600
59565 646600 649087 651717 654038 656242 658928 662520 666927 671618 675960 679593 682674 685753 689338 693396
59551 693396 697369 700730 703550 706366 709492 712688 715589 718266 721144 724633 729143 735343 744121 756453
59537 756453 773524 796286 823832 852227 876238 892989 903486 910400 915416 919426 924169 932029
59525 932029 944259 960455 979721 1001284 1023862 1045534 1064844 1081438 1095292 1105888 1112409 1114227
59513 1114227 1110871 1102122 1088433 1070863 1050347 1027475 1003187 978982 956101 934960 915680 898478
59501 898478 883119 868816 855499 844702 838212 835967 836045 836655 837461 839035 841879 846180 851837 858308
59487 858308 864867 871405 878748 887950 899428 912997 928510 946206 966623 990480 1018631 1051638
59475 1051638 1088945 1128398 1166848 1201436 1230312 1252238 1266068 1271267 1268896 1261570 1252207 1243094
59463 1243094 1236076 1232969 1235293 1243925 1259388 1282234 1312818 1350953 1396146 1447955 1505871 1569346
59451 1569346 1638801 1716642 1806469 1910515 2027220 2150302 2269224 2370685 2441292 2471138
59441 2471138 2456791 2402160 2316745 2212200 2099012 1984857 1874750 1771670 1676714 1589363
59431 1589363 1508601 1434130 1366374 1305617 1251788 1205162 1166706 1137334 1117098 1105356 1101551
59420 1101551 1105535 1117213 1136035 1160737 1189464 1220335 1252346 1285983 1322617 1362432 1402101
59409 1402101 1434551 1451981 1450255 1430937 1399350 1360941 1319345 1276999 1236629 1201908 1176790
59398 1176790 1163488 1160075 1160016 1155258 1140923 1117327 1087774 1055147 1020901 986418 953856 925114
59386 925114 900434 878560 858333 839897 824231 811737 801569 792461 783930 776414 770426 765940
59374 765940 762553 759792 757158 754246 751101 748246 746084 744506 743300 742770 743531 745711 748749 752195 756435
59359 756435 762393 770631 781068 793548 808329 825764 845771 868024 892736 920979 954058 992596
59347 992596 1036131 1083295 1132288 1181497 1230038 1277714 1324252 1368514 1408374 1441321 1465361
59336 1465361 1479737 1484978 1481992 1470995 1451501 1423423 1387799 1346282 1300323 1251222 1200562 1150061
59324 1150061 1101036 1054310 1010437 969738 932370 898748 869555 844795 823255 803638 786048
59313 786048 771559 760419 751587 744174 738287 734087 730920 728079 725820 725001 726139 729401 735020 743094
59299 743094 753384 766017 782028 802214 825305 847853 866044 877350 880849 877067 867884 855852
59287 855852 842899 829763 816823 805059 795816 789842 786873 786116 786996 789658 794995 804108 817513
59274 817513 834935 855958 880655 909319 941688 976739 1013135 1049537 1084406 1115902 1142345
59263 1142345 1162771 1176922 1184753 1186152 1181096 1169932 1153356 1132286 1107888 1081647 1055120 1029361
59251 1029361 1004620 980767 958051 937318 919478 904959 893819 886177 882191 881674 884207 889800
59239 889800 899138 912824 930563 951383 974475 999304 1024942 1049817 1072369 1091617 1106855 1117243
59227 1117243 1122067 1121114 1114371 1101631 1082988 1059636 1033537 1006098 977619 948241 918875 890808
59215 890808 864775 840875 819159 799759 782515 766996 752984 740539 729513 719434 710073 701775
59203 701775 694948 689464 684843 680782 677168 673770 670362 667130 664604 663146 662754 663274 664363 665285 665249
59188 665249 664207 662955 662264 662295 663012 664643 667377 671029 675441 680835 687315 694420 701814 710061 719957
59173 719957 731357 743536 756707 772212 790992 812659 836451 862361 890789 921517 953480
59162 953480 985155 1014845 1041027 1062865 1080159 1092603 1099486 1100381 1095618 1085813 1071490 1053539
59150 1053539 1033392 1012160 990009 966947 943720 921271 899715 878550 857599 837040 816837
59139 816837 796922 777814 760360 744911 731366 719805 710363 702614 695835 689893 685184 681793 679422
59126 679422 678123 678271 679714 681713 683907 686664 690372 695120 701219 709213 719022 729783 740866 752423
59112 752423 764619 777073 789530 802428 816165 830294 844054 857301 870339 883052 894782
59101 894782 904931 913355 920328 926391 931973 936889 940468 942403 943145 943210 942591 941249 939751 938822 938514
59086 938514 938357 938085 937646 936557 933807 928497 920279 909290 896052 881420 866223 850841 835331
59073 835331 819970 805434 792396 781062 771028 761516 751980 742725 734799 729026 725214 722494 720216
59060 720216 718218 716409 714504 712219 709463 706289 702798 699083 695134 690866 686360 681874 677470 672879
59046 672879 668061 663649 660386 658194 656302 654336 652786 652161 652122 651812 650815 649424 648147 647373 647518 649053
59030 649053 652170 656632 662126 668556 675876 683931 692801 703083 715449 730022 746521 764802 784580
59017 784580 804595 822837 837933 849793 858659 864353 867035 867981 868644 869280 869390 869270 870215 873271 878686
59002 878686 886618 897462 911214 927238 944947 964129 984496 1005512 1026865 1048482 1069969 1090703
58990 1090703 1110563 1129719 1147442 1161953 1171778 1176489 1175855 1169345 1157172 1140969 1122592 1102902
58978 1102902 1082402 1062360 1044280 1028783 1015898 1006076 999864 996835 995901 996718 999873 1005686 1013746
58965 1013746 1023811 1036275 1051327 1068278 1086226 1104920 1124414 1143966 1161720 1175585 1184274
58954 1184274 1187410 1184822 1176135 1161268 1141102 1117230 1091117 1063892 1036829 1011352 988400 968408
58942 968408 952073 940451 933876 931390 931610 933550 936152 937811 937170 933877 927851 918427 905229 889481
58928 889481 873323 857844 842641 827299 812397 798885 787235 777463 769426 762869 757593 753683
58916 753683 751304 750323 750527 752088 755317 760029 765613 771734 778562 786414 795596 806487 819351 834186
58902 834186 851112 870566 892572 916119 939894 963388 986617 1009146 1030365 1050677 1071522
58891 1071522 1094305 1120188 1150853 1188211 1233029 1284735 1342709 1406413 1473563 1539325 1598614
58880 1598614 1649005 1690782 1724635 1750070 1765611 1769546 1760391 1737486 1701653 1655211 1601185 1542456
58868 1542456 1481438 1420206 1360776 1305134 1254761 1210101 1170682 1135826 1105039 1077747 1053039
58857 1053039 1029965 1008019 987277 968112 950674 934437 918468 902493 887511 874795 864375
58846 864375 855133 846384 838559 831989 825826 818868 811040 803328 796326 789499 781929 773290 763954 754526
58832 754526 745556 737464 730349 723815 717260 710532 704213 699089 695503 693459 693160 694950 698674 703658
58818 703658 709573 716767 725366 734590 743498 751944 760068 767177 772011 774143 774417 773873 772806 770976 768241
58803 768241 764766 760988 757468 754487 751844 749358 747331 746030 744905 743068 740486 738030 736240 734796
58789 734796 733444 732756 733638 736542 741493 748408 757005 766681 776774 786788 796291 804946 812766 820044
58775 820044 826890 833068 838314 842500 845541 847525 848985 850636 852751 855029 856989 858168 858124 856782 854727
58760 854727 852667 850708 848702 847141 847001 848748 852193 857281 864134 872148 879945 886616 892380 897819
58746 897819 903156 908639 914873 922261 930559 939304 948202 956783 964208 969844 973670 975984 977262 978532
58732 978532 981242 986356 993953 1003845 1016022 1030230 1045730 1061760 1077725 1092715 1105619 1116112
58720 1116112 1124950 1132967 1140449 1147843 1156208 1166288 1177666 1189453 1201287 1213147 1224702 1235430
58708 1235430 1244918 1252568 1257499 1259325 1258479 1255154 1248363 1236739 1219906 1198474 1173140 1144545 1113778
58695 1113778 1082307 1051479 1022486 996498 974171 955132 938406 923284 909484 896775 884817
58684 884817 873104 860795 847135 832487 818398 805997 794748 783493 772328 762626 755382 750344
58672 750344 746811 744616 744211 746294 751451 759797 770933 784586 801244 821759 846197 873215 900397
58659 900397 925055 945018 959210 967709 971268 970854 967494 962075 955049 946640 937425 928256 919446 910534
58645 910534 901155 891688 882845 875119 868929 864745 862710 862665 864858 870018 878279 888635 899891 911464
58631 911464 922671 932064 938349 941536 942432 941422 938572 934467 930064 925926 922442 920589 921657 926328
58617 926328 934730 947320 964959 988085 1016391 1049171 1085303 1122808 1159008 1191350 1217977 1237801
58605 1237801 1250491 1256453 1256540 1251964 1244524 1236347 1228815 1221942 1215054 1207728 1199876 1191555 1183203 1175493
58591 1175493 1168510 1161734 1155396 1151083 1150270 1152968 1158656 1167673 1180492 1196303 1213713 1232541 1253487
58578 1253487 1276041 1297989 1317074 1332147 1342753 1348946 1351784 1352916 1353315 1353251 1353588 1355939 1361132 1368577
58564 1368577 1377788 1389687 1405662 1425861 1449062 1473780 1498811 1522868 1544306 1561407 1572885
58553 1572885 1578168 1577348 1570933 1559822 1545540 1530031 1514788 1500246 1486234 1472665 1459429 1445934
58541 1445934 1431309 1414991 1396858 1377052 1355988 1334188 1311828 1288966 1266553 1246442 1229773
58530 1229773 1215988 1204235 1194984 1189296 1187132 1187710 1191151 1198418 1209650 1223756 1239728 1257182 1275396
58517 1275396 1292860 1308138 1320557 1329999 1336838 1342044 1346436 1349721 1351062 1350643 1349798 1349586 1350213 1352008
58503 1352008 1355886 1362505 1371805 1383673 1398225 1415081 1433095 1451182 1468786 1485287 1499603 1510749
58491 1510749 1518327 1522205 1522195 1518178 1510210 1498492 1483687 1467098 1450045 1433317 1417820 1405339 1397588
58478 1397588 1394665 1395406 1399059 1405438 1413537 1421298 1427062 1430087 1429462 1423791 1412610 1397115 1378940 1358941
58464 1358941 1337579 1315541 1293400 1271396 1250087 1230638 1214060 1200727 1190852 1184740 1182258 1182768
58452 1182768 1185864 1191418 1198581 1205587 1210916 1213987 1214407 1211508 1205253 1196882 1187990 1179345 1171061 1163451
58438 1163451 1157215 1153041 1151264 1151623 1153288 1155523 1158347 1162111 1166637 1171550 1177399 1185603 1197196 1212320
58424 1212320 1230804 1252238 1275360 1298369 1320055 1339825 1356742 1369792 1379286 1386739 1392917 1397182
58412 1397182 1399117 1399462 1398626 1395431 1388362 1377388 1363766 1348728 1333157 1318062 1304589 1293691 1286013
58399 1286013 1281706 1280152 1280512 1282756 1287511 1294655 1302764 1310167 1315848 1319136 1319395 1316452 1310739 1302724
58385 1302724 1292769 1281530 1269671 1257213 1244104 1231427 1220871 1212873 1206505 1201424 1198514 1198153 1199227
58372 1199227 1200562 1202143 1204179 1206156 1207732 1209742 1213420 1219261 1227204 1237215 1249176 1262877 1278504
58359 1278504 1296344 1315719 1335163 1353816 1371512 1387196 1398702 1404713 1405804 1403014 1396710 1387643
58347 1387643 1377747 1368827 1361320 1355157 1350925 1349384 1350705 1354882 1362048 1371884 1383717 1397689 1414700
58334 1414700 1434630 1455831 1477012 1498373 1520217 1541788 1562282 1581724 1599989 1616170 1629799
58323 1629799 1641463 1651444 1659105 1664489 1669040 1673702 1677717 1680544 1683595 1688788 1696585 1706725 1719643
58310 1719643 1735707 1754009 1773289 1793263 1813931 1834564 1854555 1874391 1894719 1915341 1935966
58299 1935966 1956784 1977272 1995752 2011382 2025517 2040017 2055367 2071491 2089025 2108384 2128814
58288 2128814 2149693 2171708 2195507 2220388 2245564 2271480 2298595 2326157 2353507 2381306 2410076
58277 2410076 2438943 2467401 2496952 2529348 2564322 2600704 2638650 2679123 2722177 2767314 2814772
58266 2814772 2865089 2918247 2974256 3033518 3095748 3159961 3226410 3296768 3371262 3447422 3522908
58255 3522908 3597577 3671597 3743920 3814438 3885475 3959270 4035976 4115870 4201172 4293629 4392613
58244 4392613 4497817 4611468 4735508 4868867 5010015 5159983 5320283 5490072 5668025
58235 5668025 5854769 6050865 6254724 6465443 6685588 6918554 7165494 7427339 7707020
58226 7707020 8006709 8325711 8664250 9026559 9417306 9838243 10291675 10783561 11319313
58217 11319313 11900136 12527628 13208407 13950098 14757027 15635045 16596993 17658646 18833563
58208 18833563 20137474 21593884 23230425 25075052 27162686 29541775 32269556 35408284
58200 35408284 39035921 43258962 48213020 54063620 61022129 69365457 79448560 91726442
58192 91726442 106799351 125464380 148738924 177766868 213404460 255344666 301118349
58185 301118349 345862126 383549942 409251435 420938124 419617367 407971134 388774702
58178 388774702 364161940 335777761 305176795 273949180 243533630 214967643 188801235
58171 188801235 165215913 144219724 125760369 109723116 95906606 84051705 73895668
58164 73895668 65196476 57732364 51309013 45769531 40986034 36844279 33244130 30106759
58156 30106759 27367938 24966154 22845377 20964555 19293859 17803385 16463379 15252694
58148 15252694 14158308 13167453 12266788 11447459 10703950 10028508 9412152 8849935 8339902
58139 8339902 7877834 7457419 7073897 6722841 6397094 6089891 5799932 5529243 5277523
58130 5277523 5042689 4825020 4625826 4443066 4272673 4113307 3965714 3828415 3698190
58121 3698190 3574068 3456915 3345823 3238741 3136011 3039450 2948390 2860185 2774249 2692143
58111 2692143 2614055 2538600 2465834 2397176 2332422 2269917 2209568 2152749 2099306 2047528 1997057
58100 1997057 1949072 1903560 1859072 1815272 1773274 1733351 1694576 1656703 1620256 1584895 1549935
58089 1549935 1516302 1485724 1458116 1431969 1407085 1384549 1364085 1343893 1323307 1303352 1284384
58078 1284384 1265343 1245699 1226168 1207067 1187772 1168218 1149259 1131176 1113316 1095537 1078565
58067 1078565 1062670 1047360 1032526 1018642 1005734 993443 981993 971834 962419 952702 942731 933352
58055 933352 924491 915151 904941 894098 882099 867969 852155 836582 822533 809712 797612 786536
58043 786536 776939 768808 761939 756021 750449 744883 739789 735527 731255 725849 719621 713953 709449 705583
58029 705583 701834 697907 693173 687273 681147 676111 672008 667575 662422 657261 652317 647100 641826 637530
58015 637530 634461 631683 628632 625864 623905 622405 620816 619004 616948 614685 612689 611498 610817 609789
58001 609789 608181 606572 605412 604720 604635 605426 607031 609292 612455 616594 620828 623984 625812 626735 626893 626459
57985 626459 626400 627635 629632 631002 631252 630767 629450 626791 623169 619618 616245 612171 607103 601769 596766
57970 596766 592164 588276 585545 583591 581597 579725 578998 579770 581468 583840 587136 590995 594542 597724 601233
57955 601233 604938 607673 608819 608766 607693 605275 601840 598339 594767 590027 583848 577473 571960 567128 562737
57940 562737 559245 556641 553867 550376 547220 545683 545764 546848 548915 552132 556031 560060 564347 569126 573904
57925 573904 577896 580786 582496 582733 581380 578842 575454 571011 565348 558897 552227 545500 538797 532510
57911 532510 527043 522527 519107 516984 515900 515120 514176 513131 511911 510012 507146 503580 499554 494933 489659
57896 489659 484004 478236 472568 467533 463716 461069 459185 458205 458513 459524 459881 459167 458398 458498 459274 460293
57880 460293 461656 463419 465172 466763 468473 469977 470128 468410 465628 462533 458717 453625 447642 441333
57866 441333 434524 427176 420339 415074 410957 406758 402195 398010 394694 392204 390696 390481 391229 392070 392624
57851 392624 393340 394765 396996 399922 403611 408342 414385 421639 429441 436990 443988 450519 456288 460663
57837 460663 463566 465577 466858 466762 464946 462084 458945 455513 451650 447879 444672 441507 437507 432698 427878
57822 427878 423571 419794 416542 413796 411351 409290 408378 409300 411725 414739 417945 421348 424255 425090 422643
57807 422643 417166 410125 403022 396376 389640 382130 374004 366054 358646 351468 344444 338129 332826 328006
57793 328006 323129 318420 314296 310544 306699 302781 299093 295730 292809 290751 289740 289335 289136 289373 290257
57778 290257 291386 292484 294154 297036 300669 304106 307328 311163 316067 321790 327966 334162 339567 343528
57764 343528 346257 348211 349116 348487 346861 345291 343707 341021 337002 332845 329503 326530 323104 319328 315865
57749 315865 313005 310726 309105 308059 307088 305782 304207 302426 300096 297034 293777 290993 288605 286054
57735 286054 283244 280656 278574 276761 275014 273621 273030 273311 274094 274920 275528 275925 276293 276803 277469 278205 279015
57718 279015 279987 280963 281329 280425 278227 275438 272829 270706 269151 268443 268773 269674 270157 269555 268028 266249
57702 266249 264868 264193 264083 264118 264128 264436 265260 266084 266133 265385 264489 263716 262714 261384 260225 259530 258970 258344
57684 258344 258154 258988 260838 263384 266506 270326 275351 282874 294401 310286 329686 352474 380496
57671 380496 416494 462673 520678 591028 670291 749108 815104 858848 877056 871129 844595 802259
57659 802259 749882 692963 635679 581049 531317 487664 450035 417780 390317 367053 347189
57648 347189 329977 315007 302092 291132 282139 275015 269247 264175 259649 256054 253591 251873 250358
57635 250358 248829 247333 245953 244730 243624 242530 241590 241368 242292 243887 244949 244607 242952 240668 238423
57620 238423 236656 235503 234693 233715 232271 230464 228614 227066 226095 225682 225424 224878 223989 222984 222053 221357
57604 221357 221138 221409 221690 221448 220728 219974 219381 218853 218449 218336 218309 217835 216625 214756 212314 209342 206165
57587 206165 203317 201049 199198 197540 195972 194419 192860 191375 189833 187778 185002 182065 179809 178524
57573 178524 178021 178179 178813 179243 178748 177369 175617 173645 171451 169680 169142 169500 169513 168796 168346 168954 170088
57556 170088 170895 171367 171905 172453 172829 173298 174049 174558 174235 173306 172345 171204 169284 166772 164905 164836 166652
57539 166652 169564 172608 175119 176925 178264 179358 179993 179722 178575 177380 177131 177925 178637 177965 175908 173972
57523 173972 173587 174570 175517 175519 174957 174687 175080 176012 177222 178343 179013 179271 179607 180478 181937 183776 185677 187227
57505 187227 188216 188993 190112 191541 192705 193370 193872 194319 194183 192991 190850 188053 184756 181412 178851 177434
57489 177434 176597 175680 174668 173607 171971 169414 166713 165044 164460 163900 162675 161225 160308 160073 160131 160090 159795
57472 159795 159382 159168 159218 159006 157903 156071 154516 154041 154424 154827 154857 154928 155596 156748 157592 157454 156470 155480
57454 155480 155356 156504 158740 161316 163194 163772 163412 163005 162997 163161 163218 163210 163171 162963 162628 162490 162763 163487 164890
57435 164890 167178 169699 171025 170357 168367 166220 164321 162595 161394 161245 161912 162474 162379 161827 161160 160400
57419 160400 159494 158601 157949 157621 157471 157173 156505 155690 155191 155075 154974 154822 155071 155873 156642 156903 157024 157486 157980
57400 157980 157963 157583 157257 156799 155983 155633 156903 159517 161824 162780 162888 163031 163397 163889 164532 164988 164584 163422
57382 163422 162650 163027 163928 164461 164856 165844 167187 167906 167745 167446 167452 167181 165924 163899 162047 161045 160852 161123
57364 161123 161788 163115 165163 167372 168922 169539 169728 170168 171192 172842 174949 176932 177983 177963 177795 178520
57348 178520 180110 181706 182833 183810 184967 186101 187013 188056 189692 191669 193141 193654 193703 194095 194881 195232
57332 195232 194488 193114 192350 192960 194555 196143 197049 197199 196871 196540 196746 197711 198974 199674 199365 198530 198264
57315 198264 199421 201966 205029 207622 209411 210816 212455 214651 217409 220557 223739 226521 228805 231010
57301 231010 233636 236732 240008 243257 246447 249566 252737 256317 260423 264404 267280 268842 269924 271433
57287 271433 273522 275888 278385 280958 283369 285487 287693 290533 294017 297693 301349 305177 309274 313454
57273 313454 317745 322567 328120 333914 339315 344391 349875 356369 363909 372225 381043 389996 398547 406329
57259 406329 413536 420776 428430 436228 443544 450157 456577 463519 471160 479115 487097 495258 503736 512233
57245 512233 520373 528336 536744 545900 555448 564840 573849 582559 591114 599676 608401 617218 625719 633525
57231 633525 640810 648319 656749 666145 675961 685727 695566 705941 716918 727946 738581 749257 760990
57218 760990 774260 788520 803010 817831 833868 851702 870904 890592 910474 931102 953127
57207 953127 976507 1000571 1024702 1048756 1072834 1096855 1120454 1143270 1165375 1187463 1210581
57196 1210581 1235443 1262002 1289816 1318736 1348976 1380647 1413706 1448426 1485262 1523925 1563137
57185 1563137 1601825 1640194 1679071 1718630 1758520 1798936 1840580 1883479 1926725 1969638 2012363
57174 2012363 2054915 2096415 2135930 2173526 2209770 2244499 2276841 2306473 2334232 2361322 2388289
57163 2388289 2414958 2441224 2467660 2495300 2524816 2556075 2588704 2622961 2659486 2698115 2737494
57152 2737494 2776243 2814143 2851752 2889244 2926185 2962266 2997596 3032268 3066186 3099428 3132239
57141 3132239 3164343 3194589 3221673 3245147 3265571 3283850 3300712 3316800 3332910 3349845 3368038
57130 3368038 3387463 3407963 3429523 3452210 3475941 3500457 3525417 3550377 3574778 3598090 3620023
57119 3620023 3640552 3659927 3678796 3698122 3718729 3740965 3764900 3790557 3817752 3846167 3876230
57108 3876230 3909825 3949652 3997904 4056047 4125836 4210027 4312194 4436531 4588112 4773145
57098 4773145 4999224 5276034 5615982 6033746 6545140 7166556 7914715 8805505 9851999
57089 9851999 11062572 12438653 13971543 15639905 17409327 19232777 21052563 22809864
57081 22809864 24463225 26000799 27426200 28722255 29826047 30642444 31084597 31105610 30702298
57072 30702298 29902488 28753900 27318025 25663939 23861687 21978433 20076642 18211547
57064 18211547 16428303 14760821 13231810 11852776 10624893 9541587 8591336 7759427
57056 7759427 7029835 6387789 5821068 5318927 4871018 4468232 4103749 3772302 3468949
57047 3468949 3189388 2930861 2691719 2470500 2266157 2078517 1907351 1751146 1607696
57038 1607696 1475852 1355891 1248155 1152015 1066224 989769 922279 863974 815272 776417 747735
57027 747735 730569 727754 742699 777361 829753 892010 951141 993887 1012776 1007820 982724 940846
57015 940846 885334 821135 754506 690396 631356 578514 532252 491974 456490 425008 397178
57004 397178 372434 350173 330446 313554 299058 286033 274209 263879 254765 246030 237517 229968
56992 229968 223854 218899 214958 212422 211464 211778 213471 217354 223943 232804 243158 254232 264564 271806
56978 271806 274070 271175 264233 254531 243210 231415 220003 209320 199606 191277 184518 179059 174775
56965 174775 172063 171199 171788 173473 176878 183332 193840 208665 227416 248699 269824 287698 300373
56952 300373 307558 309743 307369 300932 291355 279855 267591 255652 245138 236890 230980 226720 223421
56939 223421 221133 220513 222062 225887 232319 242306 256781 275833 298720 324159 349835 371957 386427
56926 386427 391067 386438 374533 357301 336468 313780 290701 268177 247032 228106 211614 196869
56914 196869 183148 170545 159553 150261 142470 136200 131432 127535 123626 119461 115606 112799 111493
56901 111493 111800 113421 115734 118425 121928 126938 133667 141896 151469 162309 174272 187538 202970
56888 202970 221482 243110 267097 292409 317434 339512 355827 364977 367051 362503 352060 337777
56876 337777 322704 308775 295860 283428 272153 263145 256648 252655 252143 256393 265395 278212 294953
56863 294953 317385 347481 386251 433748 488543 546257 599587 641198 666950 676519 671821 655684
56851 655684 631465 602649 572136 542014 513908 489197 468853 453386 443015 437801 437857 443847
56839 443847 457357 480549 515443 563636 626283 703295 791694 884468 971358 1041558 1087004
56828 1087004 1104572 1096058 1066194 1020360 963530 900381 835353 772176 713523 661192 616337
56817 616337 579415 550251 528587 514616 508984 512443 525722 549710 585485 633671 692994 758773
56805 758773 822872 875969 910918 924722 918109 893914 855851 807947 754160 698136 643077 591479
56793 591479 544784 503547 468107 438867 415908 398856 387507 382228 383433 391131 405457 426992
56781 426992 455523 488414 520881 548041 566348 573562 568704 552682 528197 498258 464950 429842
56769 429842 394794 361545 330741 302186 275986 252822 233022 216008 200980 187762 176655
56758 176655 167680 160242 153456 146615 139530 132670 126845 122456 118977 115417 111452 107874 105686 104801
56744 104801 103979 102155 99540 97194 95705 94613 93094 90839 88150 85528 83450 82325 82268 82858 83416
56729 83416 83675 84031 84903 85971 86398 85847 84969 84595 84751 84944 85281 86632 89383 92573 94814 95806 96394
56712 96394 97240 98043 98182 97627 96931 96651 97085 98321 100185 102127 103471 103965 104114 104843 106675 109187 111359
56695 111359 112515 112777 112553 111916 110797 109519 108641 108326 108294 108404 108829 109582 110296 110720 111061 111613 112286 112745
56677 112745 112799 112480 111956 111473 111148 110729 109883 108901 108734 109976 112061 113834 114739 115117 115467 115805 115811 115265 114276
56658 114276 113254 112763 113260 114848 117206 119722 121786 123135 124019 124931 126140 127582 129098 130496 131422
56643 131422 131560 131107 130739 130881 131294 131545 131581 131554 131380 130871 130160 129702 129855 130645 131756 132593 132582 131711 130642
56624 130642 130018 129782 129423 128723 127932 127283 126661 125737 124247 122187 119924 118010 116747 116039 115739 115859 116259
56607 116259 116497 116326 116042 116001 116100 116216 116840 118650 121531 124613 127191 129075 130138 130222 129608 128951 128523 128071
56589 128071 127626 127866 129292 131506 133635 135173 136079 136469 136614 137000 137943 139299 140855 142785 145366 148364
56573 148364 151125 153217 154694 155768 156533 157072 157574 158278 159395 161123 163588 166828 170885 175809 181428
56558 181428 187184 192363 196499 199501 201541 203019 204523 206558 209173 211878 213935 214792 214430 213458 212716
56543 212716 212545 212506 211937 210704 209188 207738 206491 205676 205592 206072 206337 205738 204440 203091 202001 200985 199823
56526 199823 198419 196590 194280 192129 191262 192063 193462 193932 192978 191232 189223 186743 183601 180502 178660
56511 178660 178563 179395 179785 179121 178070 177714 178187 178486 177750 176341 175248 174783 174510 174268 174392 174785 174641 173529
56493 173529 172098 171164 170645 169998 169264 168949 169139 169411 169551 169791 170369 171333 172684 174279 175656 176416 176750
56476 176750 177197 178048 179312 180998 182811 183821 183284 181818 181009 181645 182967 183860 184096 184094 184094 184064 184029 184038 184087 184372
56456 184372 185286 186849 188440 189369 189496 189058 188279 187473 187128 187425 187904 188042 188010 188399 189338 190357 191088 191634
56438 191634 192169 192574 192713 192814 193299 194361 195884 197684 199559 201120 201885 201771 201301 201001 200659 199618 197877
56421 197877 196469 196459 197844 199763 201469 202730 203535 203987 204354 204784 204996 204724 204367 204620 205477 206174 206285
56404 206285 206300 206843 207815 208665 209232 209941 211290 213308 215471 217121 218121 218999 220295 221872 223183 224035
56388 224035 224642 225090 225289 225413 225792 226368 226823 227293 228335 230128 232310 234651 237122 239220 240071 239562 238604
56371 238604 237923 237326 236540 235975 236051 236461 236769 237141 237821 238423 238497 238387 238820 239968 241528 243371 245455 247364
56353 247364 248635 249375 250005 250598 250945 251022 250885 250441 249872 249948 251236 253210 254793 255547 255752 255616 255203 255001
56335 255001 255819 257989 261135 264657 267982 270540 272092 272993 273676 274064 274004 273971 274620 275878 277209 278591
56319 278591 280363 282169 283022 282624 281906 281963 282965 284262 285076 285042 284597 284914 286924 290275 293713 296420 298465
56302 298465 300150 301746 303909 307429 312128 316703 320059 322300 324129 325812 327166 328099 328729 329264 330111
56287 330111 331780 334301 336977 339089 340747 342798 345951 350169 354893 359748 364961 370968 377675 384418
56273 384418 390836 397401 404736 412715 420691 428324 435605 442283 447966 452778 457324 462029 467008 472533
56259 472533 478966 486200 493748 501471 509707 518762 528851 540549 554605 571196 590050 611388 636037
56246 636037 664336 695543 728665 763363 799830 838348 879183 922291 966635 1010134 1050646
56235 1050646 1086812 1117854 1143034 1161662 1173357 1178089 1176161 1168192 1154775 1136070 1112101 1083506
56223 1083506 1051602 1017665 982442 946359 909773 873050 836890 802559 771234 743074 717395
56212 717395 693742 672190 652657 634663 617971 602806 589199 576655 564750 553659 543910 535938
56200 535938 529884 525367 521545 517915 514950 513341 512729 511930 510370 508470 506619 504656 502558 500751 499489
56185 499489 498657 498354 498861 499834 500440 500602 501249 502974 505240 507303 509152 511117 513265 515611 518228 520796
56169 520796 522668 523740 524731 526392 529058 533030 538482 544812 550959 556652 562479 568609 574503 580126
56155 580126 586254 593160 600221 607342 615483 625045 634924 644053 652895 662585 673580 685963 700021
56142 700021 715531 731428 747332 764706 785555 810692 840214 874916 916184 965161 1022985
56131 1022985 1091198 1170655 1260186 1356839 1456782 1555323 1647242 1728766 1799358 1861041 1916385
56120 1916385 1967394 2015058 2058541 2095189 2122364 2139109 2145734 2142901 2132148 2116383 2098357 2078640
56108 2078640 2055626 2026822 1989491 1941287 1881798 1813176 1738383 1659475 1578488 1498962 1424954
56097 1424954 1358801 1300918 1251224 1209510 1174856 1145980 1122148 1102979 1087864 1076441 1069025
56086 1069025 1065554 1064717 1065158 1066890 1070443 1075218 1079909 1084008 1087809 1091432 1094941 1098846 1103452 1108313
56072 1108313 1113357 1119797 1128846 1140277 1153310 1167918 1184022 1200521 1216702 1233667 1252698 1273028
56060 1273028 1292929 1312203 1331712 1351164 1369330 1386040 1402129 1417810 1432802 1447677 1463372
56049 1463372 1479789 1496479 1514152 1533756 1554702 1575838 1597586 1621121 1646021 1670827 1695542
56038 1695542 1721378 1748338 1775230 1802029 1830193 1860672 1893436 1928845 1967546 2009098 2052354
56027 2052354 2096947 2142900 2189452 2236155 2284382 2335667 2389266 2443575 2499102 2557525 2618564
56016 2618564 2680564 2743685 2809720 2879119 2951036 3026009 3105636 3189718 3276629 3366534 3461498
56005 3461498 3562517 3669212 3782311 3903538 4033093 4169907 4314096 4466342 4625406
55996 4625406 4789417 4959106 5136527 5321320 5511980 5710248 5920228 6143464 6379050
55987 6379050 6628346 6895215 7181668 7487769 7815915 8170684 8554352 8967181 9412223
55978 9412223 9895094 10418950 10984775 11596706 12261975 12985860 13772712 14632435 15580243
55969 15580243 16630042 17794489 19091956 20547224 22185923 24036556 26139733 28549725
55961 28549725 31328898 34551174 38314278 42744195 47992863 54247269 61750049 70815663
55953 70815663 81846606 95369531 112087807 132915906 158919338 190995656 229136534
55946 229136534 271463451 313781222 350425760 376265796 388596900 387628956 375497101
55939 375497101 354902668 328401229 298360974 267004366 236222355 207347360 181119565
55932 181119565 157820279 137429949 119754503 104525317 91459161 80273619 70693331
55925 70693331 62470142 55396303 49295575 44013459 39421902 35421470 31929406 28870468
55917 28870468 26181517 23814539 21728061 19881084 18238707 16776204 15472669 14306039
55909 14306039 13257602 12315056 11467001 10699273 9999888 9362468 8781570 8249268 7759232
55900 7759232 7309392 6897377 6517481 6165077 5839886 5541832 5267305 5012482 4776928
55891 4776928 4561114 4363349 4181724 4016217 3866339 3729193 3602017 3484357 3376053
55882 3376053 3275681 3182565 3097426 3019011 2942651 2864248 2783626 2702379 2620797 2538621 2456569
55871 2456569 2375287 2294677 2215710 2140801 2070964 2004625 1940546 1879797 1823478 1770735 1720595
55860 1720595 1673696 1630575 1590113 1551238 1514444 1480187 1447535 1415788 1385731 1357849 1330900
55849 1330900 1303652 1276479 1249981 1223589 1196804 1170307 1144680 1119507 1094834 1071922 1051396
55838 1051396 1032228 1013719 996898 982707 970297 958343 946684 935526 924553 913907 904542
55827 904542 896333 887348 876183 863588 850609 836713 821204 804987 789341 774135 758720 743499
55815 743499 729160 715326 701336 687468 674214 661298 648590 637099 627831 620529 614583 610409
55803 610409 608946 610543 615187 622855 632811 643553 654161 664662 674383 681343 684178 683390 679807 673310
55789 673310 664146 653949 644126 634526 625000 616761 610523 604544 596274 585140 572237 558293 543630
55776 543630 529239 516095 503920 492180 481815 474530 470747 469487 469721 470559 470729 469291 466586 463407
55762 463407 459714 455093 449676 443558 436183 427688 420012 415128 412812 411545 410887 411279 412139 412050 410675
55747 410675 408872 407008 404649 401762 398743 395298 390722 385350 380403 376402 372897 369681 366952 364405
55733 364405 361569 359075 358173 358785 359336 358743 357292 355351 352608 349066 345565 342563 339354 335172 330409
55718 330409 326125 322850 320346 318138 315907 313645 311656 310190 309115 308267 307993 308883 311096 314356 318293
55703 318293 322142 324444 323892 320542 315586 310056 304355 298774 293530 288281 282486 276426 271162 267336
55689 267336 264616 262427 260603 259227 258406 258368 259245 260643 261913 262954 264336 266545 269445 272458 274895
55674 274895 276231 276445 276049 275450 274529 273233 272229 272347 273550 275083 276525 278077 279967 282190 284789
55659 284789 287793 290883 293627 296021 298361 300734 303118 305796 309109 312881 316555 319720 322057 323044
55645 323044 322387 320548 318158 315069 310609 304634 297656 290065 281971 273788 266229 259621 253752 248466
55631 248466 243900 240179 237326 235393 234189 233115 231761 230428 229466 228389 226499 224212 222847 222999 223885
55616 223885 224420 224214 223318 221702 219317 216304 212997 209906 207545 205852 204012 201427 198679 196885 196223
55601 196223 195774 194709 192946 190729 188391 186584 185933 186172 186191 185157 183191 180925 178947 177708 177394 177729
55585 177729 178224 178639 178837 178449 177235 175673 174586 174246 174365 174793 175609 176708 177994 179862 182792 186521
55569 186521 190200 193218 195313 196228 196087 195775 195982 196150 195383 194088 193400 193090 191606 188482 185230 183268
55553 183268 182221 180986 179418 178078 177121 176276 175311 173928 171831 169447 167889 167549 167406 166459 165214 164945
55537 164945 165913 167184 167949 168257 168558 169098 169782 170197 169810 168441 166487 164556 163062 162299 162558 163893 165918
55520 165918 167983 169432 169802 169096 167866 166687 165650 164791 164665 165747 167371 168210 167856 167078 166396 165460
55504 165460 164123 163048 162698 162602 162215 161682 161181 160378 159277 158778 159488 160600 160908 160474 160363 161041 161895 162189
55486 162189 161729 160698 159456 158502 158129 158208 158562 159216 159975 160206 159549 158410 157314 156219 155048 154295 154407
55469 154407 155035 155609 156204 157017 157469 156914 156016 156267 158104 160403 161927 162378 161935 160738 159234 158241 158179
55452 158179 158658 159051 158985 158153 156377 154202 152819 152829 153465 153482 152494 151060 149833 149141 149187 150006 151187 152109
55434 152109 152602 153111 154042 155197 156006 156157 155816 155369 155242 155939 157864 160809 163716 165314 165119 163717 162097
55417 162097 160918 160369 160421 160932 161621 162099 162007 161237 160151 159523 159948 161236 162548 163168 162980 162212 161046 159607
55399 159607 158073 156600 155233 153942 152633 151191 149725 148638 148129 147729 146831 145655 145101 145506 146166 146363
55383 146363 146287 146573 147451 148753 150317 151814 152612 152397 151687 151223 151104 151064 151256 151989 152829 152785 151540 149865
55365 149865 148589 147752 147081 146736 147070 147929 148742 149239 149678 150300 150922 151228 151202 151015 150663 150083 149580 149723 150580
55346 150580 151430 151529 150938 150234 149653 148999 148205 147401 146496 145348 144481 144876 146710 148832 149930 149795 149064 148180
55328 148180 147184 146217 145585 145383 145509 146052 147222 148808 150030 150132 149087 147690 146977 147427 148629 149718
55312 149718 150105 149689 148605 147192 146140 146098 146926 147679 147567 146684 145720 145324 145841 147195 148835 150221 151524
55295 151524 153401 155837 157829 158521 158121 157303 156269 154952 153588 152430 151239 149715 148188 147278 147116
55280 147116 147444 148216 149414 150465 150607 149914 149364 149714 150717 151549 151719 151440 151311 151637 152018 151826 151137 150749
55262 150749 151077 151597 151808 152145 153222 154665 155519 155540 155197 154604 153467 152151 151787 152884 154549 155501 155363
55245 155363 154601 153654 152603 151481 150538 150166 150603 151653 152780 153643 154376 155146 155739 155971 156168 156683 157201
55228 157201 157214 157023 157401 158270 158679 158311 158067 158597 159108 158409 156663 155218 154918 155366 155861 156337 157093 158087
55210 158087 158885 159164 158929 158284 157261 155992 154837 154075 153531 152813 151972 151639 152277 153547 154634 155045 154883
55193 154883 154548 154447 154817 155542 156260 156825 157446 158069 158011 156710 154676 153107 152583 152615 152512 152192 152052 152428
55175 152428 153285 154195 154594 154373 154184 154773 156092 157423 158329 159051 159920 160837 161505 161868 162193 162895 164205 165883
55157 165883 167419 168764 170478 172683 174315 174208 172723 171336 170633 169674 167593 164822 162219 159893 157585
55142 157585 155621 154707 155016 156060 157258 158168 158473 158251 158069 158390 158999 159361 159296 158944 158371 157717 157561 158504
55124 158504 160314 161877 162174 161137 159593 158551 158515 159207 159904 160148 160140 160379 161104 162190 163417 164577 165451
55107 165451 165912 166011 165852 165462 164956 164700 165107 166298 168075 170057 171738 172595 172450 171710 171043 170779 170665 170156
55089 170156 168926 167297 166263 166827 168998 171512 172850 172540 171305 170059 169110 168355 167784 167441 167092 166350
55073 166350 165193 164084 163436 163179 163045 163102 163681 164812 166058 166983 167557 167987 168390 168724 168807 168295 167000 165412
55055 165412 164526 164784 165504 165769 165560 165543 166004 166647 167336 168329 169634 170753 171301 171415 171368 171256 171261 171728 172604
55036 172604 173235 173182 172920 173277 174295 175125 175029 174145 173188 172697 172729 173071 173496 173825 173901 173699 173431 173361 173409 173160
55016 173160 172448 171739 171654 172218 172846 173055 172942 173011 173726 175170 176823 177776 177514 176521 175833 176028 176991 178526
54998 178526 180607 182872 184428 184602 183685 182608 182010 181886 182018 182466 183530 185330 187539 189539 190796 191037
54982 191037 190244 188778 187436 186944 187185 187325 186940 186560 186800 187460 187957 188116 187908 186940 185082 183271 182720
54965 182720 183449 184521 185583 187082 188912 190071 190075 189665 189586 189536 188945 188055 187596 187915 188915 190268 191301
54948 191301 191310 190583 190447 191691 193457 194337 194031 193257 192539 191875 191200 190471 189539 188625 188589 189960 191982 193387
54930 193387 194031 194954 196899 199530 202218 204920 208040 211932 216836 222947 230272 238477 246924 254793 261356
54915 261356 266300 269693 271513 271455 269372 265596 260609 254758 248528 242614 237266 231935 226120 220241 215175
54900 215175 211191 207974 205418 203702 202627 201569 200245 199014 198324 198207 198454 199008 200090 202027 204827
54885 204827 207834 210125 211509 212826 214941 217850 221187 225114 230090 236078 242666 249646 256756 263017
54871 263017 267202 268990 268978 267592 264708 260439 255502 250513 245469 240144 234575 229049 224041 220186 217729
54856 217729 215943 213702 210795 208105 206307 205068 203751 202258 200723 198978 196957 195241 194498 194433 193903
54841 193903 192235 190097 188809 188888 189507 189511 188759 188135 188236 188599 188595 188530 189229 190770 192364 193402 193911 193987 193567
54822 193567 192891 192455 192241 191697 190821 190512 191349 192613 193223 193228 193684 195265 197631 200033 201963 203178 203622
54805 203622 203545 203347 203192 202861 202056 200733 199187 197935 197427 197656 198037 197878 197014 195905 195132 194937 195274 196112
54787 196112 197413 198774 199403 198867 197872 197867 199469 201591 202576 202117 201582 202409 204696 207523 210140 212426 214527
54770 214527 216595 219017 222490 227659 234641 242942 251757 260307 267927 274032 278276 280757 281879 281831 280351
54755 280351 277096 272071 265643 258424 251318 245273 240574 236636 232857 229359 226433 223650 220342 216808
54741 216808 214177 212910 212251 211488 210984 211421 212534 213295 213145 212560 212412 213182 214778 216826 219065 221523
54725 221523 224394 227816 231935 237043 243290 250216 256956 262949 268141 272386 275059 275492 273542 269638
54711 269638 264560 259270 254447 249954 245099 239672 234364 229926 226307 222969 219685 216563 213621 210818
54697 210818 208392 206716 205892 205812 206435 207612 208761 209182 208724 207837 206963 206222 205660 205425 205579 205993 206514 207016
54679 207016 207276 207098 206705 206626 207032 207399 207134 206420 206056 206439 206990 206783 205613 204209 203453 203571 204081 204332
54661 204332 204016 203312 202669 202341 202087 201507 200753 200629 201756 203810 205810 206977 207143 206508 205402 204172 202975
54644 202975 201776 200774 200590 201552 202979 203729 203467 202877 202617 202672 202847 203273 204068 204964 205583 205809 205678 205282
54626 205282 204913 204909 205115 204979 204454 204280 204921 205702 205580 204516 203508 203381 204061 204957 205549 205558 204975 204113 203463
54607 203463 203369 203881 204757 205475 205427 204382 202747 201204 200197 199847 200072 200533 200703 200396 200125 200595 201807 202963
54589 202963 203310 202908 202529 202893 203976 204998 205178 204549 203872 203656 203551 202959 201974 201321 201401 201779 201706 200964 200067
54570 200067 199696 199973 200343 200168 199425 198619 198093 197729 197334 197001 196896 197034 197438 198206 199221 200109 200757 201522
54552 201522 202570 203347 203202 202290 201339 200649 199928 199111 198742 199281 200438 201475 201984 202186 202569 203363 204321 204965
54534 204965 205111 205125 205507 206290 206993 207186 206912 206534 206336 206385 206684 207289 208163 208914 208939 208068 207012 206856 208009
54515 208009 209865 211506 212476 212811 212791 212846 213327 214019 214154 213255 211814 210835 210921 212008 213673 215283 216125 215902
54497 215902 215078 214421 214234 214294 214279 213928 213009 211581 210172 209269 208771 208343 208091 208341 208877 209048 208696 208313 208155
54478 208155 207807 206952 206056 205864 206474 207284 207683 207566 207283 207282 207730 208419 209105 209844 210787 211715 212186 212142 211984 211928
54458 211928 211689 210996 210091 209471 209406 209869 210628 211195 211007 210038 209038 208825 209462 210427 211378 212310 213035 213020 211993
54439 211993 210427 209132 208531 208542 209027 209949 211041 211736 211777 211703 212337 213785 215267 215970 215684 214550 212733
54422 212733 210732 209600 210224 212429 215193 217612 219320 220145 220039 219394 218882 218740 218573 218037 217347 216909 216819
54405 216819 216957 217264 217653 217963 218230 218788 219772 220780 221320 221440 221555 221770 221762 221357 220937 221082 221955 223080 223711
54386 223711 223496 222855 222649 223343 224522 225334 225332 224827 224493 224788 225711 226936 228107 229056 229760 230196 230398 230635
54368 230635 231257 232180 232762 232451 231523 230869 231087 232004 233094 234060 234830 235250 235080 234297 233243 232387 231946 231670
54350 231670 231026 229733 228224 227387 227668 228536 229048 228888 228549 228553 228859 229151 229294 229237 228792 227917 227058 226813 227293
54331 227293 228138 229011 229699 229790 228831 226959 224950 223455 222545 222093 222168 222768 223563 224238 224818 225377 225764 225977
54313 225977 226508 227803 229526 230831 231383 231818 233110 235627 238706 241033 241662 240892 239963 239678 239654 239184 238366
54296 238366 237832 237631 237142 236040 234692 233489 232448 231648 231500 232188 233268 234192 234966 235928 237070 237945 238218
54279 238218 238034 237770 237544 237107 236247 235244 234691 234788 235058 235008 234872 235356 236722 238449 239759 240184 239702 238709
54261 238709 237869 237611 237691 237510 236823 235842 234742 233528 232408 231779 231727 231913 232083 232296 232587 232820 232963 233045 232770
54242 232770 231783 230529 230171 231269 233072 234596 235830 237248 238616 239173 238825 238343 238294 238479 238633 239039 240067
54225 240067 241490 242678 243261 243302 242984 242494 242201 242599 243824 245370 246488 246861 246754 246467 245978 245280 244851
54208 244851 245292 246505 247597 247744 246822 245115 242825 240178 237700 235947 235069 234893 235264 236011 236736 237078
54192 237078 237165 237493 238315 239413 240473 241337 241834 241754 241183 240628 240614 241246 242243 243228 243910 244267 244740 245982 248093
54173 248093 250227 251375 251476 251416 251910 252843 253891 255274 257402 260033 262372 264056 265536 267326 269325
54158 269325 271082 272351 272984 272507 270309 266314 261297 256510 253003 251093 250224 249474 248370 247165 246250
54143 246250 245621 245154 245067 245542 246020 245465 243501 240922 238885 237779 237089 236196 235207 234945 236037 238050 239790
54126 239790 240616 241123 242220 243873 245289 246075 246579 247223 248157 249571 251546 253437 254182 253630 252937 253192 254175
54109 254175 254954 255244 255527 256140 256935 257795 258887 260297 261772 262951 263649 263870 263732 263399 262963 262377 261595
54092 261595 260716 259942 259462 259395 259710 260103 260162 259757 259138 258592 258152 257754 257451 257326 257341 257389 257437 257584 258042 258980
54072 258980 260185 261025 261074 260669 260430 260280 259547 258109 256763 256171 256021 255624 254855 254034 253337 252848 252802 253213
54054 253213 253569 253536 253704 254910 256893 258346 258436 257700 257266 257708 258916 260675 262997 265969 269485 273149
54038 273149 276456 279233 281840 284790 288190 291732 295137 298369 301477 304572 307970 312029 316729 321605
54024 321605 326232 330597 334869 339014 342766 345839 347998 349007 348685 347073 344438 341119 337447 333780
54010 333780 330364 327003 323088 318378 313666 310109 307740 305218 301513 297287 293899 291462 288842 285497
53996 285497 282254 280020 278693 277837 277584 278110 278799 278720 277703 276297 274862 273265 271329 269144 267012 265404
53980 265404 264748 264930 265243 265187 264973 264912 264748 264125 263310 262803 262502 261921 260996 259998 258868 257393 255922 255104
53962 255104 254895 254619 254156 254289 255672 258079 260921 263859 266614 268766 270149 271037 271679 272045 272292 272968
53946 272968 274313 275807 276845 277588 278653 280193 281820 283327 284946 286795 288535 289852 291072 293005
53932 293005 296171 300377 305063 309871 314751 319708 324709 329794 334952 339804 343759 346608 348694 350375
53918 350375 351654 352575 353624 355400 358142 361825 366375 371409 376127 379973 383179 386135 388482 389396 388689
53903 388689 387092 385517 384512 384301 384735 385198 385023 384048 382431 380185 377440 374822 372743 370437 366655
53888 366655 361418 356147 351810 347858 343396 338547 334051 330266 327227 325134 323954 322920 321190 318870
53874 318870 316768 315235 313836 312128 310178 308186 306048 303588 300991 298707 296906 295139 292722 289559
53860 289559 286416 284214 283134 282681 282453 282432 282571 282668 282776 283242 284127 284969 285378 285473 285460 285181 284435 283450 282666
53841 282666 282296 282377 282983 284066 285255 286135 286560 286503 285864 284770 283859 283812 284605 285521 285893 285670 285306 285242 285474
53822 285474 285523 284898 283617 282195 281177 280917 281702 283619 286156 288364 289708 290515 291399 292600 294099 295994
53806 295994 298311 300678 302590 303968 305241 306943 309403 312633 316295 319909 323224 326266 328970 331170
53792 331170 333082 335412 338659 342597 346644 350367 353351 355079 355515 355525 356087 357189 357977 357834 356771 354830
53776 354830 351841 347997 344171 341312 339679 338812 338007 336653 334386 331249 327772 324722 322609 321355 320451
53761 320451 319524 318705 318334 318339 318160 317388 316242 315300 314959 315283 316146 317251 318135 318445 318248 317961 317954 318221 318377
53742 318377 318103 317768 318456 321047 325232 329776 333713 336894 339430 341295 342752 344583 347431 351312 356127
53727 356127 362204 369865 378804 388463 398754 410001 422512 436820 454122 475874 503052 536391
53715 536391 577115 626421 683542 744317 801665 847660 876107 884618 875003 851588 818798 780114
53703 780114 738588 697266 658630 623962 593556 567301 544930 526054 510391 497941 488688 482148
53691 482148 477416 473750 470970 469092 467612 465453 461900 457346 452746 448453 444112 439687 435857 433085
53677 433085 430846 428303 425328 422400 419829 417636 415885 414546 413189 411360 409250 407554 406776 406953 407792
53662 407792 408573 408173 405888 402225 398446 395382 393128 391686 391199 391553 392308 393129 393877 394366 394549 394842 395683
53645 395683 396816 397642 398218 399146 400442 401366 401618 401820 402427 402943 402883 402947 404438 407712 411785 415398 418081
53628 418081 420158 422106 424041 425833 427630 429961 433024 436182 438810 441508 445572 451082 456394 460087
53614 460087 462656 465566 469270 473120 476867 481143 486290 491608 496188 499976 503604 507477 511425 515128
53600 515128 518523 521802 525108 528288 530894 532518 533175 533338 533480 533635 533488 532922 532276 531857 531405 530390
53584 530390 528835 527375 526349 525313 523805 522133 520842 519725 518026 515499 512563 509464 505966 502024
53570 502024 498027 494192 490305 486343 482787 479952 477489 474911 472173 469517 467237 465880 466024 467395
53556 467395 468713 469005 468623 468475 468751 469106 469646 470822 472448 473705 474166 474196 474269 474519 475097 476430 478892
53539 478892 482557 487307 492788 498330 503457 508568 514576 521745 529443 537297 545959 556199 567645 579060
53525 579060 589850 600827 613324 627793 643377 658767 673448 688123 703921 721266 739641
53514 739641 758456 777956 799139 822960 849694 878937 909997 942230 975065 1007789 1039511
53503 1039511 1069602 1098194 1125932 1153139 1179516 1204983 1230545 1257832 1287834 1320713 1357194
53492 1357194 1399611 1450751 1511221 1578011 1645455 1707285 1758052 1793900 1813413 1818269 1812567 1800908
53480 1800908 1786697 1771846 1757405 1744090 1732361 1722395 1714147 1707412 1701851 1697039 1692579 1688195 1683595
53467 1683595 1678147 1670751 1660412 1647159 1632119 1616360 1599933 1582486 1564427 1546633 1528924 1509831
53455 1509831 1488381 1465450 1442640 1420299 1397489 1373627 1349194 1324746 1300140 1275201 1250555
53444 1250555 1227213 1205583 1185405 1166518 1149174 1133507 1119100 1105385 1092402 1080957 1071909
53433 1071909 1065338 1060438 1056280 1052700 1050468 1050520 1053048 1057328 1062501 1068407 1075520 1084190 1094346 1106111
53419 1106111 1120261 1137555 1157696 1179490 1202084 1225596 1250417 1276447 1303422 1331512 1361066
53408 1361066 1391964 1423777 1456571 1491129 1528248 1568106 1610397 1654826 1701356 1750125 1801213
53397 1801213 1854515 1909793 1966839 2025436 2085126 2145261 2205492 2266021 2327152 2388766 2450452
53386 2450452 2511939 2573001 2633028 2691109 2746595 2799218 2848578 2893839 2934230 2969663 3000627
53375 3000627 3027516 3050124 3067870 3080461 3088293 3092042 3091847 3087098 3077154 3062046 3042187 3017575
53363 3017575 2987705 2952297 2911708 2866527 2817065 2763478 2706198 2646043 2583981 2520946 2457827
53352 2457827 2395485 2334582 2275331 2217451 2160564 2104715 2050363 1997819 1946898 1897287 1848958
53341 1848958 1801966 1756085 1711083 1667241 1625148 1585059 1546849 1510658 1477089 1446610 1419108
53330 1419108 1394149 1371338 1350295 1330661 1312400 1295842 1281191 1268249 1256828 1247214 1239954 1235357
53318 1235357 1233454 1234260 1237758 1243629 1251136 1259201 1266537 1271977 1274986 1275796 1274918 1272737 1269728 1266805 1265066
53303 1265066 1265234 1267589 1272311 1279565 1289308 1301435 1316190 1334107 1355368 1379454 1405562 1433154
53291 1433154 1461941 1491578 1521690 1552122 1582851 1613573 1643563 1672061 1698669 1723254 1745542
53280 1745542 1765026 1781276 1794217 1804014 1810841 1814868 1816313 1815272 1811550 1804944 1795741 1784664 1772161
53267 1772161 1757912 1741245 1721946 1700551 1677910 1654638 1630866 1606230 1580039 1551636 1520825
53256 1520825 1488029 1454023 1419445 1384410 1348525 1311400 1273326 1235451 1199086 1164780 1132124
53245 1132124 1100435 1069486 1039554 1010959 983756 957768 932703 908258 884335 861200 839239
53234 839239 818441 798322 778587 759710 742503 727159 713117 699933 687800 676895 666583
53223 666583 655851 644438 633077 622534 612763 603141 593185 582906 572715 563133 554410 546271 538230
53210 538230 530178 522475 515481 509337 504174 500015 496272 491929 486675 481413 477164 473830 470643 467499
53196 467499 464973 463107 461135 458708 456637 455915 456482 457482 458434 459646 461668 464810 469089 474195 479385
53181 479385 483697 486391 487164 486114 483632 480123 475535 469231 460706 450500 440194 431339 424448 419021
53167 419021 414354 410213 406709 403740 400800 397515 394226 391732 390420 389894 389534 389063 388421 387486 386258
53152 386258 385048 384128 383380 382663 382222 382290 382478 382143 381217 380096 378745 376664 373938 371597 370533 370551 370790
53135 370790 370629 369838 368456 367088 366865 368345 370689 372550 373572 374347 375083 375184 374333 373204 372726 373126
53119 373126 373990 374861 375449 375620 375521 375474 375538 375502 375460 375929 377024 377956 377887 377038 376421 376638 377524 378826 380577 382613
53099 382613 384345 385351 385907 386691 388111 390024 391857 392992 393384 393953 395894 399394 403390 406865 409905
53084 409905 413095 416387 419271 421738 424217 426552 427821 427404 425594 422970 419828 416517 413624 411228
53070 411228 408542 404975 401165 398237 396267 394299 391782 389201 387174 385609 383996 382016 379626 377017
53056 377017 374690 373148 372264 371343 369975 368450 367196 366258 365544 365038 364480 363368 361628 359845 358481 357408
53040 357408 356608 356695 358014 359722 360624 360647 360666 361043 361290 361166 361169 361599 361919 361497 360487 359573 359185 359304 359752
53021 359752 360380 361109 361949 362849 363523 363762 363935 364793 366630 368947 371010 372442 373206 373471 373613 373988 374480
53004 374480 374639 374388 374226 374506 374956 375122 374940 374602 374208 373822 373606 373609 373663 373735 374090 374913 376014 377127 378203
52985 378203 379230 380052 380647 381251 382047 383036 384374 386426 389259 392491 395882 399459 402754 404621 404524 403515
52969 403515 403100 403455 403551 402837 401860 401208 400714 399990 399075 398190 397300 396244 395016 393644 392021 390006 387574
52952 387574 384834 382074 379703 377845 376088 374013 371919 370532 370009 369730 369224 368745 368601 368374 367291 365237
52936 365237 363031 361652 361410 361854 362347 362660 362975 363343 363375 362652 361312 359939 358912 358118 357310 356482 355902
52919 355902 355973 356992 358741 360394 361240 361554 362319 364020 366072 367587 368252 368292 367976 367541 367278 367315 367436 367425
52901 367425 367429 367718 368150 368197 367476 366115 364635 363652 363557 364230 365075 365580 365805 366155 366713 367088 367003 366692 366488 366220
52881 366220 365368 363824 362142 360901 360039 359067 357761 356353 355147 354280 353869 353984 354368 354567 354551 354894 356018
52864 356018 357560 358810 359550 360040 360356 360223 359475 358264 356836 355434 354495 354484 355308 356170 356214 355232 353710
52847 353710 352352 351564 351198 350764 350082 349626 349944 350793 351180 350381 348644 346854 345810 345876 346944 348485 349890
52830 349890 351055 352547 355026 358538 362436 365840 368139 369221 369382 368991 368185 366913 365163 363048 360847
52815 360847 359174 358872 360317 362821 365223 367257 370045 375101 383054 393285 404302 414189 421125 424097
52801 424097 423282 419667 414288 407840 400728 393281 385941 379248 373536 368619 364008 359474 355294 351909
52787 351909 349551 348181 347455 346707 345301 343218 341110 339698 339277 339777 340894 342005 342357 341727 340692 340024
52771 340024 339926 340083 340226 340352 340490 340512 340242 339683 339131 339052 339728 340957 342228 343149 343588 343540 343169 342918 343160
52752 343160 343680 343881 343601 343309 343358 343495 343392 343296 343791 345146 347092 349011 350176 350186 349452 348930 349064 349325
52734 349325 349081 348488 348123 348150 348465 349331 351088 353252 354688 354934 354799 355250 356087 356143 354699 352340 350392
52717 350392 349698 350052 350667 350972 350804 350082 348689 346781 344917 343656 343148 343250 343833 344807 345973 347070 347889
52700 347889 348291 348262 348047 348044 348446 349120 349887 350618 351047 350877 350304 349995 350267 350654 350701 350771 351507 352773 353784 354218
52680 354218 354500 354952 355364 355705 356707 359161 362811 366386 368795 370033 370891 372042 373584 375310 377034
52665 377034 378558 379645 380435 381742 384421 388308 392200 395078 396980 398453 399547 399826 399168 398057 397064
52650 397064 396310 395494 394283 392681 391063 389739 388532 387030 385302 383931 383187 382646 381910 381252 381096 381273
52634 381273 381366 381534 382359 384034 386217 388590 391065 393530 395888 398287 400738 402612 403098 402200 400785 399607
52618 399607 398800 398230 397665 396515 394219 391231 388980 388427 389074 389795 390142 390332 390377 389959 389092 388331 388124 388304
52600 388304 388346 387922 387119 386289 385848 386186 387573 389986 392958 395746 397777 398953 399453 399382 398804 398033 397604
52583 397604 397864 398709 399759 400710 401543 402522 403955 405833 407743 409258 410342 411279 412350 413680 415204 416556
52567 416556 417173 416827 415960 415238 414880 414670 414409 414021 413381 412491 411742 411563 411847 412129 412289 412649 413420 414538
52549 414538 415996 417796 419532 420619 421079 421582 422468 423304 423602 423484 423234 422747 421934 421318 421654 423014 424658
52532 424658 425787 426206 426324 426696 427481 428258 428530 428428 428649 429577 430827 431815 432396 432668 432627 432543 433334 435908
52514 435908 440135 444973 449626 454150 458848 463610 468108 472246 475945 478624 479415 478094 475529 472880
52500 472880 470398 467372 463307 458765 454759 451616 448916 446393 444320 442867 441646 440261 438950 438317
52486 438317 438550 439257 439953 440433 440707 440877 441072 441382 441792 442236 442663 442947 442835 442163 441165 440451 440570 441611
52468 441611 443312 445634 449075 454174 460633 467290 473146 478056 482074 484574 484753 482890 480312 477910
52454 477910 475332 471916 467796 463617 459691 456027 452848 450422 448452 446224 443479 440741 438658 437275
52440 437275 436056 434455 432391 430289 428654 427628 427040 426864 427322 428393 429494 429964 429706 429091 428363 427512
52424 427512 426617 425953 425646 425459 425038 424319 423672 423723 424902 426982 429144 430679 431681 432931 435209 438896
52408 438896 444158 451216 460270 471264 483895 497799 512569 527354 540438 549554 553120 551389 546131
52395 546131 539043 530650 520895 510338 500295 491797 484867 478933 473663 469163 465568 462724 460373 458506
52381 458506 457427 457384 458216 459496 461054 463200 466279 470095 474056 477939 482257 487612 493760 499583 504024
52366 504024 506795 508039 507724 505776 502681 499370 496435 493830 491464 489594 488392 487566 486783 486100 485626
52351 485626 485144 484539 484297 484995 486548 488469 490594 492924 495076 496703 498327 500797 503875 506330 507755
52336 507755 509379 512602 517443 522952 528569 534475 541152 549221 559343 571673 585566 600194 615129
52323 615129 630013 644123 656825 668188 678616 688147 696644 704492 712530 721324 730859 740874 751206
52310 751206 761942 773503 786394 800610 815476 830330 845124 860195 875815 892235 909571
52299 909571 927149 943383 956927 967660 976096 982299 986067 987803 988277 987666 985623 982281 978436 974646
52285 974646 970878 967143 963730 960548 956877 952207 946985 942229 938593 935975 933872 932040 930911 931213
52271 931213 932992 935286 937174 938864 941193 944318 947719 951447 956534 963912 973536 984741 996838 1009135
52257 1009135 1021171 1033399 1047096 1063039 1080574 1098304 1115190 1130502 1143194 1152183 1157314 1159557
52245 1159557 1160121 1159650 1158305 1156334 1154330 1152944 1152406 1152402 1152493 1152548 1152612 1152481 1151781 1150509 1149158 1148148 1147369 1146417
52227 1146417 1145058 1143365 1141589 1140046 1138923 1138112 1137394 1136814 1136717 1137388 1138853 1140997 1143573 1146138 1148381
52212 1148381 1150543 1153169 1156435 1160166 1164546 1170205 1177375 1185455 1193737 1202074 1210502 1218737 1226507 1233987
52198 1233987 1241405 1248636 1255760 1263644 1273189 1284097 1295132 1305563 1315644 1325576 1334813 1342680 1349023
52185 1349023 1353799 1356579 1356928 1354899 1350623 1343821 1334385 1323218 1311751 1300582 1289323 1277893 1267167
52172 1267167 1257920 1249775 1241942 1234667 1229180 1226210 1225169 1225006 1225425 1227121 1231060 1237607 1245964 1254435
52158 1254435 1261572 1267196 1271975 1276099 1278955 1280230 1280622 1281084 1281902 1283034 1284819 1287665 1291271 1294827 1297922
52143 1297922 1300726 1303343 1305399 1306257 1305308 1302227 1297331 1291532 1285497 1279071 1272002 1264945 1258991 1254325
52129 1254325 1250140 1246063 1242963 1242142 1244336 1249713 1258212 1269415 1282534 1296971 1312744 1330204 1349524
52116 1349524 1370539 1392670 1414913 1436328 1456792 1476904 1496983 1516584 1535233 1553201 1571195
52105 1571195 1589651 1608672 1628394 1649027 1670669 1693315 1716948 1741465 1766646 1792134 1817101
52094 1817101 1839870 1858412 1871471 1878941 1881032 1877677 1869129 1856614 1841883 1826368 1811232 1797898
52082 1797898 1787807 1781570 1778642 1777798 1777707 1777291 1776070 1774300 1772667 1771856 1772443 1774907 1779376 1785426 1792392
52067 1792392 1799796 1807350 1814768 1821868 1828756 1835716 1842962 1850641 1858917 1867852 1877299 1887016 1896700 1905820
52053 1905820 1913716 1920077 1925111 1929055 1931735 1932734 1931701 1928303 1922359 1914430 1905929 1898111 1891072 1884165
52039 1884165 1877279 1871248 1867030 1864822 1863983 1863480 1862453 1860650 1858408 1856063 1853440 1849999 1845262 1838906
52025 1838906 1830697 1820744 1809683 1798308 1787046 1775956 1765097 1754586 1744487 1734940 1726324 1719044
52013 1719044 1713295 1709216 1707017 1706681 1707780 1709945 1713137 1716928 1719669 1719017 1713351 1702320 1686240 1665617
51999 1665617 1641370 1614967 1588011 1561881 1537704 1516269 1497802 1482034 1468435 1456093 1443589
51988 1443589 1429625 1413997 1397652 1381738 1366887 1353267 1340747 1328781 1316497 1303130 1288206
51977 1288206 1271466 1253006 1233432 1213424 1193261 1173286 1154652 1138755 1125882 1115286 1106790
51966 1106790 1101295 1099324 1100162 1103220 1109293 1119245 1131998 1145017 1156500 1165844 1172067 1173260 1168203
51953 1168203 1157564 1142899 1125132 1104711 1082636 1060539 1039903 1021742 1006798 995517 987931
51942 987931 983994 983920 987660 994072 1001111 1007072 1011404 1014327 1016014 1016308 1014878 1011371 1005468 996983 985936
51927 985936 972578 957441 941261 924609 907589 890176 872897 856844 842832 830823 820318
51916 820318 811032 802904 795705 789117 783180 778319 774915 773141 773301 776076 782291 792431 806340 823330
51902 823330 842721 864494 889177 916603 944753 970183 989747 1001725 1005423 1000510 987302 967367
51890 967367 943178 917017 890391 864427 840364 819451 802592 790231 782435 778919 779123 782595
51878 782595 789475 800602 817041 839408 867462 900021 934992 969535 1000508 1025079 1041149 1047584
51866 1047584 1044465 1033166 1015783 994166 969567 943214 916751 891838 869649 851065 836900
51855 836900 827366 821603 818439 817537 819195 823088 827907 832341 835741 837710 837778 835882 832560 828277 822928
51840 822928 816328 808704 800429 791786 783399 776357 771358 768173 766480 766801 769886 775480 782344 789279
51826 789279 795365 799351 799796 796232 789664 781591 772826 763524 754073 745610 739696 737574 739633 745420
51812 745420 754026 764317 774862 783987 790213 792596 790721 784746 775605 764693 752915 740297 726930
51799 726930 713936 702914 694493 688054 682844 678834 676308 675110 674661 674522 674703 675511 677234 679982 683778
51784 683778 688613 694214 699734 704052 706636 707901 708585 709008 709160 709227 709717 711291 714737 720849 730065 742444
51768 742444 758253 778144 802414 830371 860672 891621 920603 943951 958509 963378 959577 948381
51756 948381 930805 908382 883187 856819 830171 804327 780718 760066 741972 725964 712248
51745 712248 701044 691912 684370 678801 676142 676938 681007 687792 696705 707344 719606 733405 748160
51732 748160 762761 775952 786359 792338 792675 787806 779817 770861 761979 753508 745778 738801 731845 724155
51718 724155 715982 708439 702514 698605 696774 696920 698654 701340 704335 707276 710409 714659 721025 729929
51704 729929 741670 757557 779552 807981 839928 870606 896304 915926 930287 940789 948676 955028
51692 955028 961221 969204 980555 994600 1007805 1015826 1016234 1009093 995496 976547 953662 928863 904308
51679 904308 881858 863119 849248 840286 834939 831286 827663 822956 816588 808507 799042 788648 777862
51666 777862 767457 758366 751413 747191 745984 747356 749860 751651 751716 750348 748511 747121 747031 749219 754546
51651 754546 763378 775681 791272 809567 828983 846795 859935 866291 865568 859144 849057 836937
51639 836937 823589 809338 794575 779919 765940 752827 740498 729044 718810 709860 701512 692902
51627 692902 684054 676023 669812 665442 662265 659761 657704 655855 654045 652494 651646 651669 652434 654025 656802
51612 656802 660825 665443 669690 672937 674991 675690 674657 671664 667183 662347 658141 654634 651251 647808
51598 647808 644978 643598 643900 645805 649785 656876 667719 681754 697377 712648 725808 735618 741682
51585 741682 744664 746083 747656 750623 755551 762673 772417 785616 803490 827526 859168 899018 946028
51572 946028 997708 1051690 1107428 1166596 1231724 1303945 1381485 1460236 1536369 1608978 1680530
51561 1680530 1755136 1836749 1928573 2032913 2150415 2279063 2413764 2546472 2666853 2764156
51551 2764156 2830086 2860737 2855980 2817543 2748094 2651629 2533596 2400053 2256808 2109160 1961871
51540 1961871 1818983 1683750 1558683 1445378 1344332 1255274 1177756 1111245 1054764 1006950
51530 1006950 966611 933025 905617 883675 866464 853354 843689 836719 831805 828508 826466 825391
51518 825391 825215 825981 827517 829466 831725 834513 837708 840258 840513 837199 830051 819642 806841 792444
51504 792444 777122 761434 745718 730020 714353 699084 684963 672641 662258 653584 646458 640932
51492 640932 637129 635109 634861 636305 639286 643582 648734 653847 657761 659619 659244 656976 653432 649443 645784
51477 645784 642588 639284 635397 631194 627233 623580 619964 616504 613701 611620 609551 606650 602738 598448
51463 598448 594804 592545 591570 591094 590579 590351 591025 592603 594661 597248 600900 605680 610862 615820 620855
51448 620855 626978 635321 646852 662242 681823 706183 736795 775102 820072 866923 909016 941388
51436 941388 962643 974236 978954 980194 981557 985628 992294 998223 998664 990564 974422 953319 930407
51423 930407 907564 886031 867431 853529 845200 841987 842552 845432 849634 854871 861268 868658 876258
51410 876258 883090 888526 892285 894129 893970 892142 889255 885702 881566 877046 872771 869548 867942 868197 870465
51395 870465 874965 881873 891138 902539 916057 932166 951710 975539 1004434 1039455 1082224 1134767
51383 1134767 1199065 1276794 1369369 1478002 1603475 1745699 1903441 2074356 2254868 2439542
51373 2439542 2620562 2788540 2934647 3052356 3137434 3186929 3198888 3173168 3111999 3019584
51363 3019584 2901278 2763029 2610943 2450834 2287993 2127241 1972819 1828038 1695089
51354 1695089 1575239 1469013 1376136 1295550 1225659 1164687 1111040 1063609 1021689 984391 950307
51343 950307 918131 887576 859299 833903 811426 791740 774792 760180 747043 734833 723890
51332 723890 714847 707700 701797 696554 691769 687310 682903 678347 673796 669781 666909 665399 664919 665077 666121
51317 666121 668775 673277 678966 685006 691104 697197 702814 707273 710352 712422 714043 715800 718297 721806
51303 721806 725975 730177 734011 736999 738084 736108 730907 723354 714170 703355 691098 678626 667482
51290 667482 658162 650062 642725 636621 632578 630926 631514 634317 639579 647295 656810 667102 677279 686630
51276 686630 694395 699881 703010 704510 705387 706336 707798 710352 714585 720554 727690 735353 743258 751159 758366
51261 758366 763859 766932 767531 765978 762519 757207 750063 741249 731182 720594 710436 701540 694301 688736
51247 688736 684791 682443 681475 681357 681487 681464 681013 679799 677600 674638 671503 668650 666103 663806 662135 661893
51231 661893 663747 667678 673075 679444 687088 697031 710155 726330 744250 761971 777597 789717 797527
51218 797527 800688 799143 793229 783913 772623 760578 748403 736469 725259 715122 705986 697841 691309
51205 691309 687176 685381 685042 685534 686981 689503 692538 695309 697512 699157 700085 700188 699980 700445 702236 705300
51189 705300 709303 714164 720055 727022 734780 742912 751249 759961 769151 778439 787056 794280 799596 802599
51175 802599 803089 801254 797427 791724 784286 775895 767793 760727 754604 749261 745025 742218 740606 739757 739548
51160 739548 739797 739763 738527 735720 731432 725709 718681 711005 703527 696462 689362 681885 674172 666548 659326
51145 659326 652911 647536 642765 637761 632250 626907 622585 619503 617354 615926 615306 615642 616893 618764 620892
51130 620892 623307 626734 632173 639954 649366 659307 669116 678613 687537 695247 701110 705124 707973 710313
51116 710313 711947 711916 709577 705394 700463 695396 690032 684124 677848 671572 665506 659844 654985 651307 648836
51101 648836 647310 646495 646359 647015 648582 650982 653788 656425 658707 661226 665050 670863 678246 685753 691883
51086 691883 696153 699244 702043 704664 706527 707176 706681 705330 703360 701210 699705 699646 701261 704305 708732
51071 708732 715072 723913 734983 746883 758008 767699 776360 784501 792032 798520 803651 807096 808416
51058 808416 807605 805465 802758 799183 793903 787085 780102 774004 768557 763198 758277 754713 752826 752168 752253
51043 752253 752859 753764 754833 756480 759573 764770 772226 781943 794029 808501 825094 843241 861942
51030 861942 879688 894910 906692 914765 918861 918555 913926 905890 895466 883037 868805 853734 839458
51017 839458 827174 817021 808716 802547 799447 800231 804850 812392 821837 832923 846219 862209 880376
51004 880376 899450 918464 937150 955232 971804 985807 996807 1004907 1010061 1011977 1010664 1006638
50992 1006638 1000514 992774 983981 974789 965519 956083 946663 938217 932019 928828 928806 932158 939459 951311
50978 951311 967912 989034 1014243 1042957 1074300 1107053 1139948 1172214 1203817 1235020 1265685
50967 1265685 1295218 1323228 1349967 1375985 1401695 1427585 1454570 1483646 1515121 1548566 1583512
50956 1583512 1619784 1656968 1693866 1728815 1760550 1788593 1812962 1833767 1851165 1865565 1877724
50945 1877724 1888695 1899826 1912794 1929271 1949922 1973330 1995963 2013528 2022741 2022243 2012461 1994980
50933 1994980 1971797 1944602 1914428 1881961 1848086 1813824 1779642 1745062 1709137 1671265 1631519
50922 1631519 1590379 1548371 1505934 1463413 1421077 1379146 1337870 1297650 1259077 1222793 1189188
50911 1189188 1158227 1129615 1103198 1079158 1057794 1039169 1023093 1009424 998178 989150 981572 974476
50899 974476 967531 961223 956024 951665 947598 943912 941194 939441 937730 935296 932496 930358 929453 929625 930596
50884 930596 932358 934968 938322 942269 946756 951839 957589 963886 970160 975603 979954 983961 988670 994324
50870 994324 1000312 1006231 1012526 1019951 1028742 1038675 1049678 1062010 1075816 1090807 1106565 1123083 1140890
50857 1140890 1160676 1182916 1207918 1236130 1268237 1304946 1346768 1393970 1446652 1504851 1568704
50846 1568704 1638482 1714293 1795773 1882272 1973388 2069026 2168819 2271601 2375469 2478066 2576785
50835 2576785 2669070 2752768 2826119 2887481 2935559 2970134 2992202 3003184 3004290 2996910 2983122 2965333
50823 2965333 2945644 2925958 2908339 2894618 2885588 2880875 2879407 2879678 2879795 2877849 2872284 2861610 2844019
50810 2844019 2817815 2782199 2737184 2682833 2619133 2546723 2467366 2383557 2297884 2212645 2129747
50799 2129747 2050864 1977695 1911617 1852757 1799952 1752373 1710923 1677367 1652338 1635071 1624888
50788 1624888 1621767 1625174 1633388 1644572 1657880 1673014 1689293 1705633 1720926 1733990 1743627 1749291
50776 1749291 1751439 1750879 1748088 1743347 1736907 1728512 1717179 1702112 1683655 1662947 1640786 1617137 1591436
50763 1591436 1563006 1531518 1497624 1463019 1429514 1398014 1368501 1340640 1314137 1288944 1265654
50752 1265654 1245452 1229166 1216428 1206151 1197670 1191061 1186561 1184199 1183963 1185910 1190136 1196901 1206684
50739 1206684 1219780 1235958 1254856 1276610 1301812 1330981 1364444 1402553 1445472 1492774 1543702
50728 1543702 1597877 1655293 1715528 1777382 1839519 1901177 1962004 2021408 2078308 2131411 2179544
50717 2179544 2221635 2256507 2282887 2299866 2307501 2306862 2299522 2287258 2272335 2257588 2245586 2237557
50705 2237557 2233283 2232105 2233872 2238948 2247482 2258744 2271105 2282613 2291449 2295742 2293294 2282111 2261479
50692 2261479 2232193 2195582 2152707 2104661 2053059 1999714 1946212 1894217 1845701 1802129 1763679
50681 1763679 1730072 1702081 1681466 1669371 1665604 1669816 1682657 1705227 1737744 1779210 1828125 1883068
50669 1883068 1942669 2005372 2069374 2132708 2193481 2250101 2301418 2346861 2386661 2421803 2453374
50658 2453374 2481834 2507116 2529291 2548721 2565482 2579065 2588888 2594806 2596971 2595592 2591220 2585058
50646 2585058 2578596 2573005 2569137 2568034 2571073 2579533 2594190 2615310 2642812 2676338 2715350 2759296
50634 2759296 2807607 2859523 2914227 2971551 3032620 3099312 3172234 3248454 3320773 3379390 3415036
50623 3415036 3421961 3399438 3351345 3284290 3205443 3121327 3037784 2960096 2892390 2836762 2793280
50612 2793280 2761060 2739324 2727461 2724311 2727707 2734844 2743104 2750559 2755710 2756798 2751401 2736852 2711264
50599 2711264 2674369 2627426 2572253 2510271 2442517 2370369 2295832 2220849 2146559 2073514 2002400
50588 2002400 1934109 1869255 1808169 1751491 1700217 1654819 1614599 1578246 1544913 1514613 1487778
50577 1487778 1464674 1445187 1429121 1416773 1409049 1406596 1408860 1414432 1422436 1432971 1446030 1460735
50565 1460735 1476192 1492597 1510827 1531309 1554127 1580097 1611026 1648638 1693567 1745256 1802356
50554 1802356 1863220 1926444 1991039 2055865 2119071 2178524 2232674 2280588 2321450 2354861 2381756
50543 2381756 2404298 2424454 2443094 2460695 2478433 2498146 2521434 2549136 2581464 2618321 2659555
50532 2659555 2705175 2755455 2810919 2872398 2941076 3018203 3104623 3200643 3306211 3420853 3543373
50521 3543373 3671887 3804274 3938369 4071632 4200895 4322603 4433247 4529566 4608650 4668084
50511 4668084 4706023 4721137 4712647 4680433 4625056 4547828 4451081 4338288 4213702 4081857 3947504
50500 3947504 3815589 3690766 3576957 3477746 3396958 3338102 3303066 3291811 3303379 3336441 3388403
50489 3388403 3454395 3527507 3599784 3662950 3709097 3731978 3728222 3697462 3641441 3563035 3465598
50478 3465598 3352605 3227764 3095413 2960465 2827482 2699726 2579118 2466843 2363722
50469 2363722 2270138 2185968 2110592 2042924 1981772 1926572 1877708 1835870 1801226 1773434 1752137
50458 1752137 1736765 1725720 1716279 1705726 1692465 1675931 1655839 1632033 1605048 1576316 1547461
50447 1547461 1519502 1492927 1468321 1446480 1427820 1411990 1398354 1386617 1376786 1368750 1362270 1357376
50435 1357376 1354371 1353359 1354031 1356027 1359417 1364777 1372870 1384034 1397662 1412412 1427386 1443098 1460920
50422 1460920 1481540 1504427 1528894 1555112 1583833 1615637 1650928 1690319 1734393 1783154 1836243
50411 1836243 1893742 1956333 2024549 2098136 2176220 2257684 2341123 2424666 2506360 2584882 2659759
50400 2659759 2730711 2796859 2856638 2908355 2950503 2981510 2999543 3002939 2990819 2963184 2920684
50389 2920684 2864685 2797445 2721766 2640409 2556177 2472535 2393572 2322999 2263442 2216759 2184472
50378 2184472 2167381 2164983 2175689 2197475 2227947 2263892 2301339 2336318 2365504 2386257 2396382
50367 2396382 2394046 2377941 2347725 2304539 2250923 2189676 2122603 2050529 1974619 1897305 1821603
50356 1821603 1749549 1681504 1616794 1554768 1495311 1438789 1385851 1337168 1293114 1253651 1218496
50345 1218496 1187319 1159676 1134990 1112880 1093410 1076703 1062325 1049474 1037854 1027930 1020107 1014050
50333 1014050 1009190 1005611 1003979 1004750 1007823 1012894 1019609 1027352 1035300 1042941 1050345 1057786 1065213 1072070
50319 1072070 1077549 1081117 1082947 1083772 1084201 1084423 1084791 1086221 1089473 1094208 1099363 1104439 1109812 1115769 1121920
50304 1121920 1127746 1133149 1138182 1142765 1147015 1151428 1156301 1161352 1166292 1171514 1177710 1184830 1191694 1196601
50290 1196601 1198196 1195965 1190229 1181723 1171104 1158826 1145381 1131404 1117546 1104473 1092950 1083601
50278 1083601 1076509 1071306 1067663 1065418 1064334 1064214 1065399 1068683 1074591 1083082 1093945 1106899 1121107
50265 1121107 1135187 1148109 1159681 1169868 1178160 1184049 1187765 1190128 1191944 1193816 1196041 1198196 1199135
50252 1199135 1197865 1194259 1188591 1180898 1171297 1160548 1149541 1138371 1126491 1113733 1100629 1087899
50240 1087899 1076180 1066163 1058343 1052486 1047833 1044022 1041426 1040532 1041372 1043722 1047541 1052995 1060229 1069228
50226 1069228 1079818 1091749 1104831 1118928 1133756 1148812 1163531 1177311 1189305 1198491 1204245 1206590
50214 1206590 1205686 1201470 1194061 1184146 1172425 1158986 1143762 1127318 1110468 1093199 1074763 1055018
50202 1055018 1035029 1016102 998694 982640 967996 955148 944217 934765 926239 918565 912184 907532
50190 907532 904543 902704 901496 900608 899861 899376 899866 902303 906967 913170 920213 928220 937613 948193 959288
50175 959288 970658 982681 995691 1009589 1024009 1038473 1052374 1065213 1076805 1087114 1096099 1104087
50163 1104087 1111911 1120148 1128481 1136327 1143785 1151274 1158572 1165217 1171853 1180226 1191562 1205666 1221730
50150 1221730 1239077 1256626 1272478 1284891 1293443 1298841 1301945 1303275 1302964 1300506 1294700 1284365 1269164
50137 1269164 1249661 1226909 1202451 1178470 1157252 1140207 1127422 1118130 1111416 1106451 1102314 1097898
50125 1097898 1092336 1085638 1078686 1072376 1066783 1061326 1055484 1049048 1041927 1034291 1026914 1020877 1016769 1014507
50111 1014507 1013903 1014889 1017137 1020049 1023325 1027113 1031390 1035642 1039321 1042199 1044068 1044645 1044114 1043274 1042723
50096 1042723 1042306 1041722 1041256 1041408 1042205 1043479 1045630 1049454 1055308 1062897 1071882 1082160 1093513 1105455
50082 1105455 1117689 1130433 1144067 1158612 1173737 1189302 1205931 1225051 1248251 1276484 1309888
50071 1309888 1348307 1391726 1440040 1492694 1548737 1607095 1666482 1725173 1781343 1833943 1883259
50060 1883259 1930592 1977454 2025113 2074709 2127406 2183877 2243383 2303530 2361100 2412835 2455183
50049 2455183 2483860 2494778 2485947 2458242 2414358 2357614 2291787 2221107 2149432 2079479 2013064
50038 2013064 1951669 1896301 1847267 1804847 1770015 1743782 1725860 1714650 1708604 1706966 1709052 1713568
50026 1713568 1719195 1725464 1732580 1740666 1749676 1759888 1771720 1784527 1795806 1801956 1800060 1789026 1769333
50013 1769333 1742265 1709657 1674037 1638293 1604723 1574265 1546596 1520848 1496390 1473400 1453023
50002 1453023 1436950 1426692 1423238 1427319 1439587 1460116 1487686 1519681 1552802 1584011 1611242 1633807
49990 1633807 1652372 1668369 1682987 1696252 1706863 1712939 1713175 1707492 1696898 1683011 1667804 1653259
49978 1653259 1640651 1630148 1621499 1615086 1611865 1612233 1615587 1621314 1629734 1641565 1656809 1674716 1694752
49965 1694752 1717106 1742286 1770736 1802973 1839657 1881311 1928322 1981610 2043045 2114731 2197739
49954 2197739 2291820 2396392 2511245 2635683 2766979 2900320 3030672 3154643 3270615 3377957
49944 3377957 3477009 3569718 3659258 3748370 3838006 3927419 4014847 4097631 4171975 4233132 4276110
49933 4276110 4296490 4291222 4259285 4201740 4121060 4020408 3903405 3774067 3636392 3493801
49923 3493801 3348907 3203644 3059584 2918313 2781674 2651490 2528971 2414549 2308377
49914 2308377 2210735 2121815 2041425 1969260 1905431 1850577 1805547 1771090 1747594 1734791 1731723
49903 1731723 1737250 1750686 1771792 1800010 1833575 1869334 1903536 1933047 1956000 1971531 1979223 1979043
49891 1979043 1971403 1956703 1934730 1904924 1867366 1823243 1774331 1722408 1669223 1616469 1565370
49880 1565370 1516320 1469043 1422972 1377643 1333267 1291056 1252563 1218507 1188487 1161912 1138743
49869 1138743 1119236 1103575 1092030 1084968 1082208 1082703 1085263 1089448 1095597 1104422 1116815 1133658 1155444
49856 1155444 1182415 1215213 1254690 1300527 1350438 1401202 1450096 1495010 1534098 1566469 1593025
49845 1593025 1615635 1635276 1651435 1663052 1669301 1669584 1663769 1652829 1638877 1624436 1611990 1604098
49833 1604098 1603166 1610736 1627221 1652302 1685212 1724717 1769368 1817976 1869590 1923266 1978523 2036157
49821 2036157 2098051 2166031 2241363 2325319 2419356 2523923 2636999 2753777 2867512 2970713
49811 2970713 3056386 3119154 3155747 3164821 3146653 3103036 3037060 2952581 2853678 2744265 2627879
49800 2627879 2507845 2387783 2271541 2162087 2060514 1966604 1880260 1801806 1731034 1666839
49790 1666839 1608166 1554754 1506698 1463909 1426380 1394367 1367761 1345608 1326772 1310698 1296958
49779 1296958 1284443 1271848 1259034 1247316 1238144 1231991 1228770 1228922 1233625 1243909 1259810 1280231
49767 1280231 1303235 1326361 1347106 1363697 1375672 1383625 1388452 1391003 1392225 1392860 1392460 1388964 1379748
49754 1379748 1363170 1339059 1308139 1271689 1231695 1190596 1150423 1112287 1076723 1044199 1015156
49743 1015156 989842 968313 950428 935738 923593 913533 905491 899546 895559 893126 891828 891587 892811
49730 892811 896004 901044 907057 913314 920151 928697 939822 953707 970329 989925 1012831 1039170 1068605
49717 1068605 1099900 1130699 1158298 1181026 1198826 1212507 1222755 1229843 1233765 1234205 1230487 1221779
49705 1221779 1207446 1187501 1163049 1136193 1109014 1082471 1056535 1031310 1007570 986222 967757
49694 967757 952360 940050 930523 923306 918290 915699 915376 916687 919482 924528 932402 942301 952681 962991
49680 962991 974176 987362 1002558 1018968 1036371 1055850 1078938 1105981 1135424 1164837 1192527
49669 1192527 1217863 1240198 1258151 1270516 1277755 1282171 1286307 1291088 1295324 1296873 1294179 1286604 1273545
49656 1273545 1253964 1227435 1195382 1160549 1125152 1090017 1055522 1022595 992325 965064 940363
49645 940363 917693 897055 879082 864573 853526 844629 836196 827775 820271 814361 809469 804663 799826
49632 799826 795341 791212 787215 783545 780498 777715 774491 770761 767113 763794 760347 756408 752351 748928
49618 748928 746565 745205 744609 744606 745080 745764 746127 745729 744856 744543 745617 747882 750453 752765 754898 757078 759232
49601 759232 761072 762368 763142 763753 764676 766006 767283 767972 767881 766966 765000 761894 758163 754700 752089 750382
49585 750382 749398 748949 748889 749259 750238 751676 752914 753453 753662 754372 755908 758036 760856 765187 771888 781183
49569 781183 792855 806880 823655 843672 866874 892154 917567 941268 962216 979868 993477
49558 993477 1002161 1005595 1004275 999186 991553 982784 974053 965797 957988 950921 945239 941056 937602 934084
49544 934084 930596 927804 925914 924236 921729 917818 912758 907419 902756 899354 897339 896530 896650 897610 899767
49529 899767 903698 909484 916357 923342 930179 937375 945598 955388 967207 981040 995839 1009894 1022007
49516 1022007 1031954 1039731 1044956 1047426 1047915 1047943 1048837 1051214 1055126 1060164 1065345 1069229 1070550 1068891 1064747
49501 1064747 1058823 1051277 1041785 1030439 1018252 1006549 996042 986827 978994 972707 967710 963366 959337
49488 959337 955743 952484 948870 944265 938782 933072 927736 923182 919666 917034 914559 911480 907692 903717
49474 903717 900102 897038 894484 892431 891136 891234 893418 897791 903642 910174 917363 925906 936461 949185
49460 949185 963857 979985 996714 1013045 1028442 1043082 1057316 1070915 1082933 1092212 1097930 1099874
49448 1099874 1098484 1094653 1089125 1081855 1072114 1059502 1044782 1029368 1014018 998493 982666 967411
49436 967411 953926 942533 932772 924581 918731 915986 916401 919625 925420 933647 944147 956928 972113
49423 972113 989680 1009847 1033858 1063234 1096920 1129370 1152789 1162101 1157752 1143962 1125093 1103944
49411 1103944 1082474 1062806 1047100 1036863 1032620 1034123 1040752 1051833 1066660 1084319 1103709 1124040
49399 1124040 1145372 1168412 1193536 1220023 1246417 1271590 1295186 1316988 1336183 1351570 1362326
49388 1362326 1368251 1369340 1365576 1357208 1344766 1328603 1308863 1286302 1262780 1240343 1219882 1201184
49376 1201184 1184188 1169620 1158270 1150336 1145879 1145413 1149389 1157228 1167424 1178539 1189540 1199096 1205279
49363 1205279 1206605 1203187 1196432 1187629 1177215 1165392 1152870 1140568 1128763 1116993 1104889 1092840
49351 1092840 1081660 1071743 1062725 1053969 1045174 1036500 1028257 1020684 1013956 1008169 1003155 998466 993754 989169
49337 989169 985112 981524 977676 972916 967536 962670 959347 957863 958032 959714 962888 967424 973037 979442
49323 979442 986416 993786 1001564 1010071 1019713 1030564 1042273 1054434 1066977 1080107 1093994 1108613
49311 1108613 1123810 1139374 1155006 1170322 1184966 1198686 1211249 1222210 1230840 1236469 1239037 1239258
49299 1239258 1238127 1236370 1234599 1233811 1235098 1238489 1242511 1245400 1246667 1247082 1247276 1246908 1245152 1241419 1235443
49284 1235443 1227262 1217410 1206659 1195287 1183086 1170460 1159001 1150346 1144826 1141777 1140854 1142311 1146239
49271 1146239 1152307 1160284 1170111 1181602 1194875 1211003 1231001 1253610 1274906 1290880 1300035 1303176
49259 1303176 1301493 1295865 1287674 1279162 1272526 1268919 1268459 1270947 1276517 1285526 1297614 1310859 1322380
49246 1322380 1330221 1334418 1336037 1335629 1333090 1328616 1323005 1316966 1310534 1303231 1294611 1284879 1275298 1267798
49232 1267798 1263774 1263405 1266296 1272333 1281471 1293177 1306873 1322734 1341317 1362475 1385245 1408672
49220 1408672 1432004 1454120 1473654 1489942 1503254 1513913 1521822 1527036 1530150 1531777 1532200 1531867 1531819
49207 1531819 1533350 1537593 1545576 1558049 1574787 1594369 1615044 1635652 1655579 1674273 1691089 1705325
49195 1705325 1716233 1723358 1727059 1728225 1727224 1723460 1716250 1705706 1692619 1677927 1662646 1647750
49183 1647750 1633703 1620486 1608422 1598482 1591366 1586874 1584782 1585775 1590747 1599695 1612308 1629405 1652619
49170 1652619 1682345 1716638 1752209 1785710 1814007 1834455 1846077 1850394 1850577 1849787 1850407 1854235 1862465
49157 1862465 1875181 1891203 1908836 1926900 1945110 1963707 1982929 2002906 2023876 2046140 2069554
49146 2069554 2093174 2115661 2136147 2154682 2171862 2188109 2203325 2217111 2229262 2239965 2249484
49135 2249484 2257710 2264245 2268899 2271852 2273148 2272277 2268528 2261664 2252079 2240453 2227490 2213935 2200563
49122 2200563 2188142 2177560 2169939 2166385 2167522 2173336 2183504 2197883 2216818 2240983 2270719 2305448
49110 2305448 2344053 2386181 2433081 2486733 2547752 2613704 2679240 2738558 2789416 2835763 2885483
49099 2885483 2943270 3004377 3055747 3084463 3086236 3066814 3036050 3000501 2960430 2912566 2855180
49088 2855180 2790722 2724159 2659608 2599029 2543477 2494226 2452241 2417457 2389451 2368273 2353802
49077 2353802 2344543 2337978 2332201 2326565 2320694 2313799 2305434 2296332 2287842 2280755 2275166 2271259 2269585 2270494
49063 2270494 2273645 2278207 2283270 2288023 2291944 2295021 2297639 2300028 2301952 2303056 2303378 2303412 2303786 2304967 2307054
49048 2307054 2309632 2311906 2313176 2313240 2312375 2311168 2310543 2311680 2315582 2322738 2333388 2348027 2367385 2391952
49034 2391952 2421841 2457098 2497830 2543918 2594741 2649213 2705899 2763019 2818340 2868932 2910976
49023 2910976 2940359 2954329 2953019 2939288 2917064 2889886 2860500 2830861 2802067 2774637 2749093
49012 2749093 2726069 2705846 2688380 2673979 2663295 2656284 2651783 2648717 2647340 2648634 2652768 2658819 2665811
48999 2665811 2673234 2680545 2686879 2691600 2694660 2696274 2696572 2695708 2693891 2691039 2686778 2681033 2674436 2667964
48985 2667964 2662398 2658284 2656030 2655586 2656028 2655779 2653432 2648404 2640947 2631722 2621403 2610576 2599836 2589776
48971 2589776 2580769 2572879 2566088 2560557 2556526 2554070 2553215 2554292 2557908 2564382 2573343 2584045 2596004 2609197
48957 2609197 2623624 2638805 2653878 2668238 2681995 2695725 2709804 2724145 2738539 2753058 2767943
48946 2767943 2783258 2798819 2814482 2830431 2847214 2865488 2885690 2907987 2932566 2959838 2990192
48935 2990192 3023761 3060756 3101849 3147623 3197566 3250114 3303781 3357717 3411146 3463297 3514612
48924 3514612 3567392 3624470 3687655 3758051 3836867 3924035 4015728 4104615 4183705 4249984 4304616
48913 4304616 4350708 4391400 4429121 4465388 4500948 4536263 4571656 4606905 4641181 4673852 4705126
48902 4705126 4735587 4765401 4794353 4822441 4849924 4876878 4903029 4928015 4951540 4973292 4992980
48891 4992980 5010508 5026087 5040259 5053838 5067596 5081744 5095801 5109020 5120852 5131155 5140502
48880 5140502 5150592 5163884 5182059 5204530 5228261 5248659 5260481 5258594 5239114 5200572 5144147
48869 5144147 5072781 4990047 4899483 4804303 4707268 4610737 4516828 4427473 4344203 4267781 4197981
48858 4197981 4133879 4074746 4020656 3971971 3928281 3888373 3851339 3817121 3785644 3756136 3728019
48847 3728019 3702086 3679964 3662573 3649842 3641815 3638965 3641037 3646245 3652052 3656368 3657794 3655421 3649032
48834 3649032 3639340 3627674 3615541 3604537 3596095 3590908 3588907 3590126 3595199 3604620 3618016 3634737 3654760
48821 3654760 3678268 3704615 3732534 3761293 3790841 3820808 3850345 3879246 3908425 3938791 3970314
48810 3970314 4002757 4036625 4072656 4110819 4150658 4192463 4237355 4286370 4340076 4398915 4462894
48799 4462894 4530555 4598856 4664475 4724964 4778652 4824342 4861789 4892162 4917440 4939359 4959272
48788 4959272 4978735 4999527 5022739 5047905 5073035 5095374 5112205 5121342 5121312 5111552 5092596 5065913
48776 5065913 5033164 4995528 4953895 4909474 4863604 4816749 4768206 4717187 4663839 4608789 4552055
$$ [...]
##END NTUPLES=NMR SPECTRUM
##END=
