##TITLE=AC1514_ROEFFECT0002_8213552_DwLke5yO5g
##JCAMPDX= 6.0         $$ Bruker NMR JCAMP-DX V2.0
##DATA TYPE= NMR SPECTRUM
##DATA CLASS= NTUPLES
##ORIGIN= BRUKER
##OWNER= Administrator
$$ 1.72 TOPSPIN		Version 2.1
$$ 2013-10-04 16:35:11.795 -0700  Administrator@X
$$ Compression mode = diff/dup
##.OBSERVE FREQUENCY= 400.02188249412
##.OBSERVE NUCLEUS= ^1H
##.ACQUISITION MODE= SIMULTANEOUS (DQD)
##.ACQUISITION SCHEME= undefined
##.AVERAGES= 8
##.DIGITISER RES= 22
##SPECTROMETER/DATA SYSTEM= spect
##.PULSE SEQUENCE= zg30
##.SOLVENT NAME= COFFEE_meoh
##.SHIFT REFERENCE= INTERNAL, COFFEE_meoh, 1, 14.98509
##AUDIT TRAIL= $$ (NUMBER, WHEN, WHO, WHERE, PROCESS, VERSION, WHAT)
$$ ##TITLE= Audit trail, TOPSPIN		Version 2.1
$$ ##JCAMPDX= 5.01
$$ ##ORIGIN= Bruker BioSpin GmbH
$$ ##OWNER= Administrator
$$ $$ E:\/data/COFFEE/nmr/AC1514_ROEFFECT0002_8213552_DwLke5yO5g/10/pdata/1/auditp.txt
$$ ##AUDIT TRAIL=  $$ (NUMBER, WHEN, WHO, WHERE, PROCESS, VERSION, WHAT)
(   1,<2013-10-04 16:35:05.327 -0700>,<Administrator>,<X>,<go>,<TOPSPIN 2.1>,
      <created by zg
	started at 2013-10-04 16:33:58.780 -0700,
	POWCHK enabled, PULCHK disabled,
       configuration hash MD5:
       C8 4E 4E 5D D3 5C D8 9E 9F 52 82 E0 59 8A DE 15
       data hash MD5: 64K
       3F D1 B6 53 41 83 8E 61 0C EF 37 27 13 3A 42 DF>)
(   2,<2013-10-04 16:35:08.124 -0700>,<Administrator>,<X>,<proc1d>,<TOPSPIN 2.1>,
      <Start of raw data processing
       efp LB = 0 FT_mod = 6 PKNL = 1 PHC0 = 0 PHC1 = 0 SI = 32K 
       data hash MD5: 32K
       56 24 55 D4 E8 35 35 9D B9 B0 82 DF 22 EB 59 07>)
(   3,<2013-10-04 16:35:08.436 -0700>,<Administrator>,<X>,<proc1d>,<TOPSPIN 2.1>,
      <pk PHC0 = 97.8717 PHC1 = 0 
       data hash MD5: 32K
       DB 6F A6 8C 1E 44 FE 36 E7 FC 98 AC D4 F4 ED 05>)
(   4,<2013-10-04 16:35:08.530 -0700>,<Administrator>,<X>,<proc1d>,<TOPSPIN 2.1>,
      <abs ABSG = 1 
       data hash MD5: 32K
       9A EA 94 C7 37 DB 20 10 3B C9 53 1C 7E 35 17 4B>)
(   5,<2013-10-04 16:35:08.592 -0700>,<Administrator>,<X>,<proc1d>,<TOPSPIN 2.1>,
      <abs ABSG = 2 
       data hash MD5: 32K
       F4 3B E3 A1 D0 E7 5F B8 24 60 B2 95 DF FE 83 E5>)
(   6,<2013-10-04 16:35:08.655 -0700>,<Administrator>,<X>,<proc1d>,<TOPSPIN 2.1>,
      <abs ABSG = 3 
       data hash MD5: 32K
       92 07 AF 61 62 27 C1 09 9C AC DA 35 CF 61 72 9E>)
(   7,<2013-10-04 16:35:08.733 -0700>,<Administrator>,<X>,<proc1d>,<TOPSPIN 2.1>,
      <abs ABSG = 4 
       data hash MD5: 32K
       07 B5 4C C9 29 C4 17 2F 26 C7 D4 59 AF A8 C6 BA>)
(   8,<2013-10-04 16:35:08.795 -0700>,<Administrator>,<X>,<proc1d>,<TOPSPIN 2.1>,
      <abs ABSG = 5 
       data hash MD5: 32K
       13 1C 6E 3B 37 17 BB E7 E1 37 56 26 90 BE C8 87>)
$$ ##END=
$$ 
$$ $$ hash MD5
$$ $$ A2 86 CC 24 41 7E BD FF F0 70 3B 0E E0 3C 8D 87
##$RELAX= 
##$RELAX= 
##$RELAX= 
##$RELAX= 
##$RELAX= 
##$RELAX= 
##$RELAX= 
$$ Bruker specific parameters
$$ --------------------------
##$DU= <E:\>
##$EXPNO= 10
##$NAME= <AC1514_ROEFFECT0002_8213552_DwLke5yO5g>
$$ [...]
150 150 150 150 150 150 150 150
##$TP07= 0
##$TPNAME0= <>
##$TPNAME1= <>
##$TPNAME2= <>
##$TPNAME3= <>
##$TPNAME4= <>
##$TPNAME5= <>
##$TPNAME6= <>
##$TPNAME7= <>
##$TPOAL= (0..7)
0.5 0.5 0.5 0.5 0.5 0.5 0.5 0.5
##$TPOFFS= (0..7)
0 0 0 0 0 0 0 0
##$TUNHIN= 0
##$TUNHOUT= 0
##$TUNXOUT= 0
##$USERA1= <user>
##$USERA2= <user>
##$USERA3= <user>
##$USERA4= <user>
##$USERA5= <user>
##$V9= 5
##$VALIST= <valist>
##$VCLIST= <CCCCCCCCCCCCCCC>
##$VD= 0
##$VDLIST= <DDDDDDDDDDDDDDD>
##$VPLIST= <PPPPPPPPPPPPPPP>
##$VTLIST= <TTTTTTTTTTTTTTT>
##$WBST= 2048
##$WBSW= 25
##$XGAIN= (0..3)
0 0 0 0
##$XL= 0
##$YL= 0
##$YMAX_a= 640604
##$YMIN_a= -544829
##$ZGOPTNS= <>
##$ZL1= 120
##$ZL2= 120
##$ZL3= 120
##$ZL4= 120
##$ABSF1= 14.98509
##$ABSF2= -5.573092
##$ABSG= 5
##$ABSL= 3
##$ALPHA= 0
##$AQORDER= 0
##$ASSFAC= 0
##$ASSFACI= 0
##$ASSFACX= 0
##$ASSWID= 0
##$AUNMP= <proc_prof1d_extract_pilot.lims>
##$AXLEFT= 0
##$AXNAME= <>
##$AXNUC= <1H>
##$AXRIGHT= 0
##$AXTYPE= 0
##$AXUNIT= <>
##$AZFE= 0.1
##$AZFW= 0.1
##$BCFW= 0
##$BC_mod= 0
##$BYTORDP= 0
##$COROFFS= 0
##$CY= 15
##$DATMOD= 1
##$DC= 0
##$DFILT= <>
##$DTYPP= 0
##$F1P= 0
##$F2P= 0
##$FCOR= 0.5
##$FTSIZE= 32768
##$FT_mod= 6
##$GAMMA= 0
##$GB= 0
##$INTBC= 1
##$INTSCL= 1
##$ISEN= 128
##$LB= 0
##$LEV0= 0
##$LPBIN= 0
##$MAXI= 10000
##$MC2= 0
##$MEAN= 0
##$ME_mod= 0
##$MI= 0
##$NCOEF= 0
##$NC_proc= -8
##$NLEV= 6
##$NOISF1= 0
##$NOISF2= 0
##$NSP= 0
##$NTH_PI= 0
##$NZP= 0
##$OFFSET= 14.98509
##$PC= 1
##$PHC0= 97.8717
##$PHC1= 0
##$PH_mod= 1
##$PKNL= yes
##$PPARMOD= 0
##$PPDIAG= 0
##$PPIPTYP= 0
##$PPMPNUM= 2147483647
##$PPRESOL= 1
##$PSCAL= 4
##$PSIGN= 0
##$PYNMP= <proc.py>
##$REVERSE= no
##$SF= 400.02
##$SI= 32768
##$SIGF1= 0
##$SIGF2= 0
##$SINO= 400
##$SIOLD= 32768
##$SPECTYP= <>
##$SREGLST= <1H.CDCl3>
##$SSB= 0
##$STSI= 32768
##$STSR= 0
##$SW_p= 8223.68421052631
##$SYMM= 0
##$S_DEV= 0
##$TDeff= 65536
##$TDoff= 0
##$TI= <>
##$TILT= no
##$TM1= 0
##$TM2= 0
##$TOPLEV= 0
##$USERP1= <user>
##$USERP2= <user>
##$USERP3= <user>
##$USERP4= <user>
##$USERP5= <user>
##$WDW= 1
##$XDIM= 32768
##$YMAX_p= 445667219
##$YMIN_p= -715020
##$CURPLOT= <Network HP LaserJet P1505>
##$CURPRIN= <$Network HP LaserJet P1505>
##$DFORMAT= <normdp>
##$LAYOUT= <+/1D_H.xwp>
##$LFORMAT= <normlp>
##$PFORMAT= <normpl>
##$SURQMSG= 1
$$ End of Bruker specific parameters
$$ ---------------------------------
##NTUPLES= NMR SPECTRUM
##VAR_NAME=  FREQUENCY,     SPECTRUM/REAL,   SPECTRUM/IMAG
##SYMBOL=    X,             R,               I
##VAR_TYPE=  INDEPENDENT,   DEPENDENT,       DEPENDENT
##VAR_FORM=  AFFN,          ASDF,            ASDF
##VAR_DIM=   32768,         32768,           32768
##UNITS=     HZ,            ARBITRARY UNITS, ARBITRARY UNITS
##FACTOR=    0.250966925370066, 1,           1
##FIRST=     8223.43324360094, -84817,       -164447
##LAST=      0,             -120915,         -181189
##MIN=       0,             -715020,         0
##MAX=       8223.43324360094, 445667219,    0
$$ Real data points
##PAGE= N=1
##DATA TABLE= (X++(R..R)), XYDATA
$$ [...]
19557C1708c11600h6053R245m8605A09447B9439a12630j54465M0706A35076E4462
19545g7564j42816E7331a17584d4321I3962a31582N5871Q476E3967J01952F6827
19533C1237b17285j63174F8408N6296b19649A74051a7072K616d048E2829m630
19522D8199a63344g2601k98323E3874J15230B079i790q6801M0017A7652a26087
19510A12923c35877C14784l2393q4833B7805K49289h576l19913J04577j70622
19500c94534d7775d581r1690A18852b5035j55712I6367e163B4776b21495A78868
19488A33762a16188M145j6841o5903j6733f2176r3417l8896A1681A370g6465j10166
19476a86631E8793B8675f3542A59343b34899b9032A203h5860A30320a93783h7599
$$ y = [31708, -311600, -86053, -76808, -125413, 109447, 29439, -112630, -267095, -226389, 135076, 54462, -77564, -220380, 57331, -117584, -44321, 93962, -131582, -75711, -67235, 53967, 155919, 66827, 31237, -217285, -380459, 68408, 124704, -219649, 174051, -17072, -14456, -4048, 52829, 48199, -163344, -72601, -370924, 53874, 169104, 2079, -9790, -96591, -56574, 17652, -126087, 112923, -335877, 314784, 282391, 197558, 27805, 277094, -8576, -328489, -223912, -394534, -47775, -4581, -96271, 118852, -25035, -180747, 96367, -5163, 24776, -221495, 178868, 133762, -116188, -112043, -128884, -194787, -211520, -62176, -155593, -194489, 11681, 1370, -76465, -186631, 58793, 28675, -63542, 159343, -234899, -29032, 1203, -85860, 130320, -193783, -87599]
19464a29210I0160J94526j19648G8970k9686a84417F1701A0829J42581b89837
19453i6593A4068c9658l7613j30081j398l6681J06694N1596j01956O0655F6118
19441B20988a14836d1089A07588a97447R2787m0984n7595h5593j49875P519k5117
19430b53066G1366b98072h6114L4446B32836C773a08036j35232B4951c4457A09739
19418a02784d6425e776G9658b32835r2823A9301K4722a22132j13419J3476R9477
19407a22598J4765J0145C324h3524E5093a00321K5923p7805C238M8198b2109j5318
19395c7427j67399A74400A8312c104A9954K87428A40904b79798G0456a36905m66
19384a37371n5926R2220B124a66772e0845j25200L725j15737I6989i6455k5266
$$ y = [-129210, 90160, 284686, 165038, 78970, 49284, -184417, 61701, 10829, 153410, -289837, -96593, 14068, -39658, -77271, -207352, -208750, -245431, -138737, -87141, -189097, -128442, 66118, 220988, -114836, -41089, 107588, -197447, -104660, -145644, -203239, -85593, -235468, -227949, -253066, 71366, -298072, -86114, -51668, 232836, 3773, -108036, -243268, 24951, -34457, 109739, -102784, -46425, -5776, 79658, -232835, -325658, 19301, 44023, -122132, -235551, -222075, -122598, -107833, -97688, 3324, -83524, 55093, -100321, -74398, -152203, 3238, 51436, -22109, -37427, -204826, 174400, 18312, -3104, 19954, 307382, 140904, -279798, 70456, -136905, -137371, -193297, -101077, 2124, -166772, -50845, -176045, -172320, -288057, 96989, -96455, -121721]
19373a21721k2456A07997c95118A12924a70676m26195a98372r8722d7823D3753
19362b35688b301k4649A80665i9548J968A70278d00626c4379l68657B80993A29907
19350b69461j7299A08010h7307j88258h0507o907E3333b54045A65561a00819K009
19339i8810j80990D1801E023c72577J55055J01661q588l7049r9048f23C8512J50955
19327A89467i0740j7853B92575a2443m6098j69445D6255c8757L352l33585A00007
19315b5680j78455A704J90294b71826B01530e9680A62430a44288B6353a89110
19304b39030b088m32300H996b9291k0620A17836a49709c9866I123b60308h4327
19292h7067k5466C8959a98445O5708p276j61515F3485c7686l6350A3040b33062
$$ y = [-121721, -144177, 107997, -395118, 112924, -170676, -596871, -198372, -297094, -47823, 43753, -235688, -2301, -26950, 180665, -99548, -97580, 170278, -400626, -34379, -403036, 280993, 129907, -269461, -286760, 108010, -87307, -275565, -80507, -87414, 53333, -254045, 165561, -100819, -98810, -279800, 41801, 5023, -372577, -217522, -115861, -124449, -161498, -260546, -623, 38512, 189467, -90740, -108593, 292575, -12443, -58541, -227986, 46255, -38757, -35405, -368990, 100007, -25680, -204135, 1704, 191998, -271826, 201530, -59680, 162430, -144288, 26353, -189110, -239030, -2088, -434388, 8996, -29291, -49911, 117836, -149709, -39866, 9123, -260308, -84327, -87067, -112533, 38959, -198445, -132737, -140013, -301528, 63485, -37686, -74036, 13040, -233062]
19280a27977d875j14300C12998j51278a98021d4237C44695b2857G1984a11513
19269C06298d2660k1240A94029b68097B45203a61421B2444a25582E363f5072D690
19257f3137H4633g858l06805e4375b0627r2456a4258q8147L5182j5640i261D055
19244E8367b67194A209c89289k93498G0275p105J14325b15986A42359f0721b387
19232c00259B02962J84773B067b13012B58435b83667g7346B130i1116a4059D1860
19220c4188r9933N6919A61088a74865L4299g852A42554J43667j22125e7761l28867
19209c86628a9529j03344B42539D741a50494O4294L8286j82949G4100L8716K37142
19198C49958a50564L5033I8657J02748b10900k07688A90356i392r6987D2389e5637
$$ y = [-127977, -4875, -119175, 312998, 161720, -198021, -44237, 344695, -22857, 71984, -111513, 306298, -42660, -63900, 194029, -268097, 245203, -161421, 22444, -125582, 5363, -65072, 4690, -63137, 84633, -7858, -314663, -54375, -20627, -113083, -14258, -102405, -67223, -82863, -9261, 4055, 58367, -267194, 1209, -389289, -682787, 70275, 63170, 177495, -215986, 142359, -60721, -2387, -300259, 202962, 387735, 2067, -213012, 258435, -283667, -77346, 2130, -91116, -14059, 41860, -34188, -134121, -77202, 161088, -174865, -140566, -7852, 142554, 286221, 164096, -57761, -386628, -19529, -122873, 242539, 4741, -150494, -86200, -47914, -230863, 74100, 112816, 349958, -150564, -115531, 98657, 201405, -210900, -418588, 190356, -9392, -106379, 42389, -55637]
19186b06887D4388G861h4097n4055j62498Q7032C3165J64715I7170c08117a24358
19174F7079E197a79334E8634g6994A23515K91636b79144A04729r041a5684p9611
19163i5295j95418B23174c22791B04071a34687j50698A58059i7876m3946d0659
19152b23087P1898A3293L7710N6661i1858r6390j25671D35261j71069D8070A2829
19140H2662a70488B05824a30825L3526l6437G3992b70765A97800j8783a51564
19129A50453c56724a12636M7578A05037b06926P1809A63277J51570a05133F6459
19118e466k28037J3638b1247p4945j8311B8353a22213A55007E9943K27027d9015
19106A75710a70627M3888N0009q7640g8736J0001K2587m5767n5437k8861H5487
$$ y = [-206887, 44388, 7861, -84097, -138152, -300650, -213618, 33165, 197880, 97170, -308117, -124358, 67079, 5197, -179334, 58634, -76994, 123515, 415151, -279144, 104729, 95688, -15684, -95295, -290713, 223174, -322791, 204071, -134687, -285385, 158059, -97876, -141822, -40659, -223087, -151189, 13293, 51003, 107664, -91858, -188248, -313919, 435261, 264192, 48070, 12829, 82662, -170488, 205824, -130825, -97299, -133736, 73992, -270765, 197800, 179017, -151564, 150453, -356724, -112636, -65058, 105037, -206926, -135117, 163277, 314847, -105133, 66459, -5466, -233503, -219865, -21247, -96192, -114503, 28353, -122213, 155007, 59943, 286970, -49015, 175710, -170627, -126739, -76730, -164370, -78736, -68735, -46148, -91915, -147352, -176213, 85487]
19094e4177j145j11105j87611R9466E4869A6454Q692i5166A18385a86202l3292
19083b19494e5814j80386i0890F1944K2624b8653j24680j63875J00539B1637a58823
19071b12076A89754a42092A24018a71237l5535I6085a3748B77402B1140d6143
19060b93370J24458A89639c8372A60023a78204K2119j21509g2395O364a5646E4841
19048a66586D2316b50309f7420D949e9010j6529o9363k9445B2385Q8165a78601
19036g9665j69877f4824G5639K11a16082r6815q507i8745A97031e891B88100c56622
19023h240L348m980I9809b26682J01076A6194a11653A30092o0024a01217a2090
19011e7015j28489e5697E2475i4474H4599b9045G7374h394A56220K86256a97772
$$ y = [-54177, -55322, -166427, -354038, -254572, 54869, 16454, 25146, -95166, 118385, -186202, -219494, -55814, -236200, -90890, 61944, 84568, -28653, -153333, -317208, -216669, 21637, -158823, -212076, 189754, -142092, 124018, -171237, -206772, 96085, -13748, 277402, 21140, -46143, -293370, -168912, 189639, -38372, 160023, -178204, -156085, -277594, -72395, -66031, -15646, 54841, -166586, 42316, -250309, -67420, 4949, -59010, -75539, -144902, -174347, 22385, 110550, -178601, -79665, -249542, -64824, 75639, 75850, -116082, -212897, -221404, -98745, 197031, -5891, 288100, -356622, -8240, -4892, -9872, 99809, -226682, -125606, 16194, -111653, 130092, 70068, -101217, -12090, -57015, -185504, -55697, 52475, -94474, 84599, -29045, 77374, -8394, 156220, 442476, -197772]
18999e91977a68651C540c39804B21745h1112J2868l6666j20756P045M0957A19590
18987a68915L608J9828C2212a38700d7994G118b82152j03000J69225D5520d36091
18975F6908O3360n7003e1260j24985B9597a35603E6776N5648b39204d0875A10100
18963i3620F4388d0913A0035a1033j92658P8209j24329J13237b3372G778d0372
18951B32999P2611a89258C1215i3384A24837a90707R5306D06141a62027g1043
18940C1715K82818b40077n4062O5260C74407c75394J09250A8618a323j70823A14508
18928A33749a27649j10487b5408j14373n3304f2278A5272J8894a11634K4717c7078
18916B15627o7226a33065r622A37398C2828f4612j9769q0626j13289d3166A72930
$$ y = [-591977, -168651, 3540, -339804, 221745, -81112, -68244, -104910, -225666, -218621, -177664, 119590, -168915, -165307, -145479, 32212, -138700, -47994, 7118, -282152, -385152, -215927, 45520, -436091, 66908, 130268, 73265, -51260, -176245, 29597, -135603, 56776, 112424, -239204, -40875, 110100, -93620, 64388, -40913, 10035, -11033, -203691, -125482, -249811, -136574, -23372, 7778, -40372, 232999, 305610, -189258, 31215, -93384, 124837, -190707, -95401, 406141, -162027, -71043, 31715, 314533, -240077, -294139, -228879, 374407, -375394, -266144, 18618, -1323, -172146, 114508, 133749, -127649, -238136, -25408, -139781, -193085, -62278, 15272, 34166, -111634, -86917, -37078, 215627, 148401, -133065, -142687, 137398, 32828, -64612, -84381, -165007, -278296, -43166, 172930]
18904b44106A28438a28258C23604e9720K8572k35992C4665a97293A30845a61998
18893a80641l12624b3923B7194K6643a21975N7148I5394a28906A99132h3698j770
18882h5468m110q464l02678C57889b82728c7770n524k11930A93047J26996C8711
18870b06272i1776m963B64687R8650a22261I9839c41320g0008A30742a66981b6281
18858a23412I4158g6033k79778e6711D4452P9886a04657j43993B31513c5534l1438
18847f6972o6922r0441B48835a70316q8036H5255L5066B99c71197A16782C2498
18835a26726c0123l4641j55884f7809C51863F2947a85627K8177b5021j46274K0266
18824a51029D7226a39306b8815m17877d1377G5505Q0588K0729a54222A03430K22389
$$ y = [-244106, 128438, -128258, 323604, -59720, -31148, -267140, 34665, -197293, 130845, -161998, -180641, -493265, -23923, 27194, 53837, -121975, -64827, 95394, -128906, 199132, -83698, -85468, -89578, -98042, -400720, 357889, -282728, -37770, -43294, -255224, 193047, 320043, 38711, -206272, -91776, -96739, 264687, 363337, -122261, 99839, -341320, -70008, 130742, -166981, -26281, -123412, 94158, -76033, -355811, -56711, 44452, 124338, -104657, -248650, 231513, -35534, -66972, -133894, -224335, 248835, -170316, -258352, 85255, 120321, 299, -371197, 116782, 32498, -126726, -30123, -64764, -220648, -67809, 351863, 62947, -185627, -157450, -25021, -171295, -151029, 47226, -139306, -28815, -446692, -41377, 75505, 156093, 176822, -154222, 103430, 325819]
18813C25819G2257A5114M5962N3484R494A2104L6793a28043B50518a38019j39462
18802b77481E8575c512B51175a97191A24117M2261a70999B05946b29663L7629
18792a92034O3314k6397j00028A19627B5109c8485A42765l4337a24337H5838K2497
18781A08335K0297a12003A04655a222j94711D2102J37842i0947o058R635m90469
18770e77839f7768k11488b3449A87491a70041I262a34960J098A1738b62419a23082
18758B32053C5175a44724j11107E6736c13106A20004d03823c4331J2308n06594
18748e28617a34606q0787A29361c3231a2313j74265c0139j70809M1065j70299
18738c30182f7756H5873C8042o047J83639d70907B83587b49388A51303J59096
$$ y = [325819, 72257, 15114, 61076, 114560, 124054, 12104, 48897, -128043, 250518, -138019, -277481, 58575, -3512, 251175, -197191, 124117, 166378, -170999, 205946, -229663, -192034, -128720, -155117, -255145, 119627, 25109, -38485, 142765, 108428, -124337, 85838, 108335, 128632, -112003, 104655, -1222, -195933, 42102, 179944, -90947, -97005, -87370, -577839, -67768, -279256, -23449, 187491, -170041, 9262, -134960, -133862, 11738, -262419, -123082, 232053, 35175, -144724, -255831, 56736, -313106, 120004, -403823, -34331, -22023, -528617, -134606, -215393, 129361, -33231, -12313, -186578, -30139, -200948, -159883, -330182, -67756, 85873, 38042, 31995, 215634, -470907, 283587, -249388, 151303, 310399]
18728C10399b22201m9276J33884q9760d6818A45728h3055m5298H7867b06560N3005
18717a53555K3181J9089A50065P0838D8125P2468A7756J35506C3625d3567B19104
18705A71854d37488A93736B231J18435a76035j11849f8553A76119n4638g8302
18694B52715P6146b03023R2544j99840a45460c9289R85o8674O818j22162l9018
18683b61340h9568A61976b77325g8923B00388c92314B2007K8431b31557A1828
18672b12934A41489m3471C5116a91386R909b4820A81133a31776j21095B921g7065
18660e5146L445G7082j9c9203j61377A81995Q3778e8713n5712N4289j87795R5389
18648a52542N67C02553G6685a55428g5961k41769B3713b30312a04902j48910P2127
$$ y = [310399, -222201, -271477, -137593, -227353, -46818, 145728, -83055, -128353, 87867, -206560, -153555, -130374, -111285, 150065, 220903, 48125, 120593, 17756, 153262, 33625, -43567, 219104, 171854, -437488, 193736, 2231, 120666, -176035, -287884, -68553, 176119, 121481, -78302, 252715, 328861, -203023, -110479, -310319, -145460, -39289, -38304, -106978, -100160, -222322, -261340, -89568, 161976, -277325, -78923, 200388, -392314, 22007, 50438, -231557, 11828, -212934, 141489, 98018, 35116, -191386, -181477, -24820, 181133, -131776, -252871, 2921, -77065, -55146, -51701, 77082, 77063, -39203, -200580, 181995, 265773, -58713, -114425, -60136, -247931, -152542, -151975, 302553, 76685, -155428, -75961, -317730, 23713, -230312, -104902, -253812, -181685]
18637a81685F4026c13369A3864N0268a21655A7571J3910c0182k59974J1052A42532
18625C1910b27360F4280h1307j18823F3673b35893c475A38049O8454B1384g0415
18613h8704C4762a91407p287p7975a30034A20945b12077D1928j2297M312a45554
18601a21501A03743D1384J58930m8094L8861j8921l6916i0692p8126m693M6900
18590a26611k71251a74127L5089O9080J6957A41004O4879d6008m9526m2750k3013
18579a61297k2805F2217a5869k51718g8471B12138b2540m8519k54875a4105q611
18568b2716A12844D6776e8863k23071A0459a09329p5964N9164B16398B4835b92021
18556b97A84988F1019a8368l22035J41579o9428b2484B14895b31234Q113L4817
$$ y = [-181685, 64026, -313369, 13864, 64132, -121655, 17571, 31481, -30182, -290156, -279104, 142532, 31910, -227360, 64280, -81307, -200130, 63673, -235893, -3475, 138049, 206503, 21384, -70415, -88704, 34762, -191407, -198694, -276669, -130034, 120945, -212077, 41928, 29631, 33943, -145554, -121501, 103743, 41384, 200314, 152220, 191081, 172160, 135244, -90692, -168818, -173511, -126611, -397862, -174127, -139038, -69958, -53001, 141004, 205883, -46008, -95534, -138284, -161297, -184102, 62217, -15869, -267587, -78471, 212138, -22540, -71059, -325934, -14105, -22716, 112844, 46776, -58863, -281934, 10459, -109329, -185293, -126129, 216398, 24835, -292021, -297, 184988, 61019, -18368, -340403, -198824, -268252, -22484, 214895, -231234, -223121, -188304]
18545a88304I0354M5526a09656A98679E485J57595j3965a41922b6408F9606b31977
18533A34031h4463k02524a13750D1488a79259C75638c4200A80686c64323d9301
18522b94765a21150A53774a54046D3529j163J9460M5226m5015J07912P143a57369
18510b9121C16352a11981H5079a12173b3036l17196a12676q8206h4775j34337
18500b19112r3825A47078m9986b62768a18642k7379A20371D8734R7552A7693Q8647
18489A06340f3048B3903a06580k24409a44547g0767l20053I0068Q1354d82I9166
18477D6990h2646A02228e1594G3251a099j15692C63264f7669l56j89569g2077
18465b87919r8700D7735Q8898J30719r3887g2801D20931A34679A372K5107a64201
$$ y = [-188304, 90354, 135880, -109656, 198679, 5485, 163080, 149115, -141922, -26408, 69606, -231977, 134031, -84463, -286987, -113750, 41488, -179259, 375638, -34200, 180686, -364323, -49301, -294765, -121150, 153774, -154046, 43529, 42366, 61826, 107052, 62037, 169949, 177092, -157369, -29121, 316352, -111981, 85079, -112173, -23036, -340232, -112676, -200882, -84775, -219112, -312937, 147078, 97092, -262768, -118642, -146021, 120371, 48734, 146286, 17693, 106340, -63048, 23903, -106580, -330989, -144547, -70767, -390820, 90068, 171422, -482, 99166, 46990, -82646, 102228, -51594, 73251, -1099, -116791, 363264, -67669, -68025, -257594, -72077, -287919, -386619, 47735, 136633, 267352, 173465, -72801, 420931, 134679, 1372, 26479, -164201]
18453h9824j5496D3078N0150K8792c4646B1893a66132b2290o2898B63247a39592
18441C44892j70618e79585K46240d533l90347M9873a67120A76774e6154k09269
18431b65423i3877I7905b32778R2667j81476a29903j19708M8701r5219J5414f4145
18419b39463A32447e3416j20576p7465b6062A33937c2733k05945Q7330q1799B44560
18407B16101h1951n4819B22034b42915h3470B10913l7393K7149p2487a15452l9137
18396a54589J168f5309n8826c8714I3520a52812N3472c8477A02617D0344a62004
18384c48464R3178b4087I4298b50263E5197j2611K7224c29197A06234K0937C2539
18372E8548b16225A61942b65638A88950a03592H1278B7134B699J21807f5947k7292
$$ y = [-89824, -105320, 43078, 93228, 122020, -34646, 21893, -166132, -22290, -85188, 263247, -139592, 344892, 174274, -579585, -333345, -4533, -394880, -345007, -167120, 176774, -56154, -265423, -93877, 97905, -232778, -140111, -321587, -129903, -249611, -200910, -296129, -280715, -64145, -239463, 132447, -53416, -173992, -251457, -26062, 133937, -32733, -238678, -151348, -233147, 244560, 216101, -81951, -136770, 222034, -242915, -83470, 210913, 173520, 200669, 128182, -115452, -154589, -153421, -65309, -124135, -38714, 93520, -152812, -99340, -38477, 102617, 40344, -162004, -348464, -255286, -24087, 94298, -250263, 55197, 42586, 69810, -329197, 106234, 127171, 32539, 58548, -216225, 161942, -265638, 188950, -103592, 81278, 27134, 2699, 124506, -65947, -93239]
18361i3239a7783j83055F0266b59965I1697a1211F8378a57125c0534I5548h5991
18349c37645p5874C4650a14249E1552K1219J31197A9278a21730N3742j27879O6666
18338a29201m4073B6678K2980J661a49228m9269A30093a74989H951a65642M0607
18327a25035e8855k06334K7522A12611h2689j05240b8638F4799A517f5712j31999
18316a97711C33119c15000A16435e4975q452j01466G411K1309A0045C137L1056
18305C4193h1526J5914j6573l6481k78170A30874j4403D7308L0805j7472b58023
18293b62315C51495d1029k39822d2198H4358i0658a0714k1824k17889H8176a3453
18281A6316a37194B5513a3026H3595a71483A69552b66340O7026C3131b84337A93225
$$ y = [-93239, -17783, -200838, 60266, -259965, 91697, -11211, 68378, -157125, -30534, 95548, -85991, -337645, -413519, 34650, -114249, 51552, 72771, 203968, 19278, -121730, -67988, -195867, -129201, -173274, 26678, 49658, 51319, -149228, -198497, 130093, -174989, 8951, -165642, -125035, -58855, -265189, -237667, 112611, -82689, -187929, -28638, 64799, 1517, -65712, -197711, 333119, -315000, 116435, -54975, -63427, -164893, 7411, 28720, 10045, 3137, 34193, -81526, -65612, -82185, -118666, -396836, 130874, 116471, 47308, 78113, 60641, -258023, -262315, 351495, -41029, -280851, -42198, 84358, -90658, -10714, -32538, -250427, 88176, -13453, 16316, -137194, 25513, -13026, 83595, -171483, 169552, -266340, -199314, 33131, -284337, 193225]
18269A16864B7166g3065A11295b18408d6726j51766C0152J2871h7072A49419N3358
18258B02777c3635j84958j2388N186F094e6175l6232j66602J10197c5125k79312
18247c14437A64992d3702j81430B16051Q6449b5000B62054f0023a4556C6940j0704
18236B6236R1163b77350R4188q9593i9586n7552A43396P0594G4312O9693a58769
18224I0749l5398b34015g2369D3257b134j25240p4384D4593i7363K1340J8438
18213e7585j19052A9178b46911J8758G6626a9810l9819l97391d5154j04147B2621
18201b00941j55648d2605A22218G556J100c1151A46249E930R1051D4591a21008
18189F6739B9315f3183l1718J3093k40323a19788B5624g0163b2601A65507K53184
$$ y = [116864, 27166, -73065, 111295, -218408, -46726, -198492, 30152, 43023, -87072, 149419, 202777, -33635, -218593, -230981, -225795, 6094, -56175, -92407, -259009, -148812, -35125, -314437, 164992, -43702, -225132, 216051, 302500, -25000, 262054, -60023, -14556, 36940, 26236, 117399, -277350, -183162, -272755, -99586, -157138, 143396, 213990, 74312, 144005, -158769, 90749, 55351, -234015, -72369, 43257, -2134, -127374, -201758, 44593, -97363, -76023, -57585, -176637, 19178, -246911, -228153, 76626, -19810, -59629, -457020, -45154, -149301, 22621, -200941, -356589, -42605, 122218, 7556, 8656, -31151, 146249, 5930, 96981, 44591, -121008, 66739, 29315, -63183, -94901, -81808, -322131, -119788, 25624, -70163, -22601, 165507, 418691]
18178D18691a13985B49390e7775j15883f2891k1262A32237A8105g6924E25583
18167a70021M5021J7722j23237a0770E8504J02776a34471d5792k55706p369D00615
18155a69816j42376G5935a19955G563J31606q161a77323b9560A82085j9869L0617
18144A92833g4528A17157C248b21814d593j49474A59316a54577b5906A57930N0364
18133B08294F4180a99208C5122e3424B1758a51378A83084F2149b02053L233C52601
18121C36479a32523j81123A93534g396A73668o0724D5212a08833G6994K40800
18111C17794H0823A1859L6648a03275d8517E6176J50697r0985b82899a5991j63838
18100a79829B0760h0182b5299n9780j94668D6211a61969Q500M9180q4628R1015
$$ y = [418691, -113985, 249390, -57775, -173658, -62891, -84153, 132237, 18105, -76924, 525583, -170021, -125000, -107278, -230515, -10770, 58504, 161280, -134471, -45792, -301498, -308867, 400615, -169816, -312192, 75935, -119955, 7563, 139169, 131008, -177323, -29560, 182085, 162216, 192833, -74528, 117157, 3248, -221814, -4593, -154067, 159316, -154577, -25906, 157930, 208294, 64180, -199208, 35122, -53424, 21758, -151378, 183084, 62149, -202053, -198820, 352601, 336479, -132523, -313646, 193534, -7396, 173668, 112944, 45212, -108833, 76994, 317794, 80823, 11859, 48507, -103275, -48517, 56176, 206873, 115888, -282899, -15991, -179829, 20760, -80182, -25299, -85079, -279747, 46211, -161969, -153469, -104289, -188917, -97902]
18089i7902E1009a67395e3175B04249H3930B340a1396A18880g7941A41057o8855
18078G2202k6591a06017O192A84205a45767B10270g6483A05722L4781b39323F1330
18066a80065I2933e1858k45047A6150a50056A14339i2008B88452N7328g0530A54392
18054G9926i6996l9535j15315J06771k06850I854c77437i1247m8846l8519h9301
18042b97459c9313C3557d6079B88333a54369B18868a82503j439J3015A12309b12115
18030a17484G8991L0758k4051L4232c13594A84359c9888a7007j58338A77066K20537
18019C97603a4667B50051b73479I0634a56629e3312A10751a83621F4081h5022
18008g9804j72329A4085a56893A31076d8695A36258n0257b14977L4920C2298f1760
$$ y = [-97902, 51009, -167395, -53175, 204249, 83930, 2340, -11396, 118880, -77941, 141057, 72202, 45611, -106017, -99825, 184205, -145767, 210270, -76483, 105722, 140503, -239323, 61330, -180065, 92933, -51858, -296905, 16150, -150056, 114339, -92008, 288452, 345780, -70530, 154392, 79926, -96996, -136531, -251846, -145075, -351925, 9854, -377437, -91247, -140093, -178612, -89301, -297459, -39313, 33557, -46079, 288333, -154369, 218868, -182503, -183942, -170927, 112309, -212115, -117484, 78991, 109749, 85698, 119930, -313594, 184359, -39888, -17007, -175345, 177066, 397603, -14667, 250051, -273479, 90634, -156629, -53312, 110751, -183621, 64081, -85022, -79804, -252133, 14085, -156893, 131076, -48695, 136258, 86001, -214977, -180057, 32298, -61760]
17996h8253k7048l96830C77022c6217B20874g3962C2286j96j3645a80733f893
17984B26176f0285l2525A60899J87566d0243j23880O1081j12854G1711a94170
17973b34742I9586Q573a63808E76274a53627i29r9914A04399C8130c82575a02513
17961B73047f4405k61371B61205A26964b65331E2515b4206k06166c2752k1557
17951e4309k972k5507A76233d18878e0406j71784e8490H3659F972N9335a36882
17939b78840A66937C5663J42892o415d2279r0722I4312K21469a12427k597C11083
17927i9309A73724B6581a6316j98999h6345l02377a73229C6781b14520H7425K57101
17916C44526q7159o3380C1782b63637a2088j71305K1532a8367l41746A22087i3402
$$ y = [-88253, -115301, -512131, 377022, -36217, 220874, -73962, 32286, 32090, 18445, -180733, -6893, 226176, -60285, -92810, 160899, 348465, -40243, -164123, -103042, -215896, 71711, -194170, -234742, 99586, 108159, -163808, 576274, -153627, -929, -100843, 104399, 38130, -382575, -102513, 273047, -64405, -325776, 261205, 126964, -265331, 52515, -24206, -230372, -32752, -54309, -57281, -82788, 176233, -418878, -50406, -222190, -58490, 83659, 6972, 66307, -136882, -278840, 166937, 35663, 178555, 172140, -42279, -133001, 94312, 315781, -112427, -115024, 311083, -99309, 173724, 26581, -16316, -215315, -86345, -388722, -173229, 36781, -214520, 87425, 344526, 257367, 193987, 31782, -263637, -12088, -183393, -161861, -18367, -360113, 122087, -93402]
17904A66074k6541a72599Q3311b8724o1516G3277a14811D1684d09590F4002O6098
17893A30100a23998A341K28632F3368A3632a65710j30126B72736a2927j85451
17883a98378B59443j04937K125k6184m0206e7550A18481a54341j44373B21267
17872d5812q0697B09070a27851B5493M25821a25897M8269A39491j697i4277k1785
17861a16062A07675a74869A11012d8899R134D125J13815a25107A3675e3433A8251
17849b68573D6743c45998b0265C9118a86834E6579b1730H7810C2737Q7488a37032
17837B0397R0505e6602b4586F2992b12287H7587R2934a65632J5779A30174N9372
17826A89546q706b74060a00429a0556k3057j62915G267K12055C0127a42224g0163
$$ y = [166074, 139533, -172599, -89288, -28724, -90240, 73277, -114811, 41684, -409590, 64002, 130100, -123998, 1341, 229973, 63368, 13632, -165710, -295836, 272736, -12927, -198378, 259443, 154506, 156631, 130447, 90241, -57550, 118481, -154341, -298714, 221267, -45812, -126509, 209070, -127851, 25493, 451314, -125897, -77628, 139491, 137794, -94277, -116062, 107675, -174869, 111012, -48899, -39765, 4125, 117940, -125107, 13675, -53433, 18251, -268573, 46743, -345998, -20265, 39118, -186834, 56579, -21730, 87810, 32737, 120225, -137032, 20397, 110902, -56602, -24586, 62992, -212287, 87587, 180521, -165632, -149853, 130174, 189546, 180840, -274060, -100429, -10556, -33613, -196528, 7267, 219322, 30127, -142224, -70163]
17814D7534K284J55001G6710a10628J5706G9141C0216I898f7072o7396N4835D8454
17801b07294B2830a61308F6667a68802A32145P0388l5771c9754A82760c1277B28538
17789A21261g9690b8791a4151C58032c61922d1860B2256d1985j06288B38858d3895
17777a34313L7164l427M5158A16631a18451o6467n7913E2712P803h862A53462
17765a23975B68888n8445B827b3432A87600A6770J58234b87375A1289a51986I1209
17753A68492p5188a1753n8843j68643B44559q4605l9298a4402A67824a69354P6430
17742i2924g538r3936q8321a0596B83072A15562i1249B7945b51359A67562d307
17730e7310A44247C7524A951N6431a44838f2775j09358k36071A50274a02569n1248
$$ y = [47534, 49818, 204819, 76710, -110628, -94922, 79141, 30216, 9898, -67072, -134468, -79633, 48454, -207294, 22830, -161308, 66667, -168802, 132145, 202533, 166762, -39754, 182760, -31277, 228538, 121261, -79690, -28791, -14151, 358032, -361922, -41860, 22256, -41985, -148273, 238858, -43895, -134313, -97149, -100576, -55418, 116631, -118451, -184918, -242831, 52712, 60515, -8862, 153462, -123975, 268888, 210443, 2827, -23432, 187600, 16770, 175004, -287375, 11289, -151986, 91209, 168492, 93304, -11753, -70596, -239239, 244559, 159954, 120656, -14402, 167824, -169354, -92924, -7538, -101474, -189795, -10596, 283072, 115562, -91249, 27945, -251359, 167562, -4307, -57310, 144247, 37524, 1951, 58382, -144838, -62775, -172133, -408204, 150274, -102569, -153817]
17719a53817A52828a64480f9178E317N9830h9479A66268f9481F6951K53069a01031
17707B34867J2415a97540J6774C95162E1132c76897D2615J72942j2819O6712F1171
17695c68347H8600O4251B6053J73457b89404A803J27804c59628A41235N5324l7016
17684A59543F2819c92346d393G31g9417B63783C0591J72023q5662K03233a40323
17672B89309c47717B5400c9445q959G2554K66985H54N739M9454Q4268D6323g8178
17659e8568j13281j61659E6145A2055Q7582D6439J86484J41672A67159m2891K04778
17648C29046a7278G9423a41740I8745a69227j83836a16971j78422G8188A8761
17637a89977G6116M0466f4799m2532A95597c6569C64201j68385n788b11510i7124
$$ y = [-153817, 152828, -164480, -69178, 5317, 65147, -89479, 166268, -69481, 66951, 320020, -101031, 234867, 247282, -197540, -180766, 395162, 51132, -376897, 42615, 215557, 202738, 269450, 61171, -368347, 88600, 152851, 26053, 199510, -289404, 1803, 129607, -359628, 141235, 196559, 159543, 62819, -392346, -4393, 731, -79417, 263783, 30591, 202614, 116952, 320185, -140323, 289309, -347717, 25400, -39445, -48404, 72554, 339539, 854, 6593, 56047, 140315, 46323, -78178, -58568, -171849, -333508, 56145, 12055, 99637, 46439, 232923, 374595, 167159, 124268, 329046, -17278, 79423, -141740, 98745, -169227, -353063, -116971, -295393, 78188, 18761, -189977, 76116, 116582, -64799, -107331, 195597, -36569, 364201, 195816, 190028, -211510, -97124]
17625A64715a08393F3468b2832A25427c60676C41264j8j07117a24874A12692j5954
17614I6738a09233B25236e8940H2948J05213I0742a64948f4205b054n9659A9747
17602A15952O0748g0410B68157i1439k90997g6647l2636D13335A66081b04598
17591e6109k23838d5176B06555r1693Q9710A8047l833b35093D1861b16129J6725
17580a99404A29744M2048J104K1958C4770a45804B57760j3416e747C153J61887
17569A65040p6882L756K17453A30376a03632F430Q0582O0226B8992J04122J30778
17558B63892o9664b16676i2663A78263A2789L5655a82286I218a55940C88066G7587
17546I2976a01388B01049h9829b4087P089F4046c65612C48209I2244a0241j12880
$$ y = [164715, -108393, 63468, -22832, 125427, -360676, 341264, 341246, 234129, -124874, 112692, 96738, -109233, 225236, -58940, 82948, 188161, 90742, -164948, -64205, -2054, -61713, 19747, 115952, 176700, -70410, 268157, -91439, -382436, -76647, -109283, 413335, 166081, -204598, -56109, -279947, -45176, 206555, 114862, 204572, 18047, 14214, -235093, 41861, -216129, -199404, 129744, 171792, 172896, 194854, 34770, -145804, 257760, 244344, -5747, 3153, 165040, 88158, 91914, 309367, 130376, -103632, 6430, 87012, 147238, 28992, 133114, 263892, 194228, -216676, -92663, 178263, 12789, 48444, -182286, 9218, -155940, 388066, 77587, 92976, -101388, 201049, -89829, -24087, -16998, 64046, -365612, 348209, 92244, -10241, -123121]
17535a23121B74330D034a10424B8907e2740k4843I9207c27044f8068q7998A52256
17523E26961g3438A31901b9676A2369J28996O4217m8987O8569n5380c9993H4383
17511A74902D1393b50868J11722e4624B42959R4C1818A1557K56076q9929E935
17499i3243D6461a12378B03360Q0990Q9426b44020K6404A18568K5499j4911C3623
17487A44777J8058J56241i4262I2705J6520J7102a61974B24619B0871d8098I8348
17475C93347A10710K56K5837J0504L7936K12568H5390k7686J22964J21903a7230
17463A48620e6057A92818C8932Q4302i0796o7889C60155O9174a17076b8870C24050
17451B44405l5406M3988K3494l3529r3685j2989J90843K7328j61766c2443A01664
$$ y = [-123121, 274330, 4034, -110424, 28907, -52740, -77583, 99207, -327044, -68068, -156066, 152256, 526961, -73438, 131901, -29676, 12369, 141365, 205582, 156595, 225164, 169784, -39993, 84383, 174902, 41393, -250868, -139146, -54624, 242959, 243053, 31818, 11557, 267633, 177704, 5935, -93243, 46461, -112378, 203360, 284350, 373776, -244020, -217616, 118568, 144067, 129156, 33623, 144777, 162835, 319076, -94262, 92705, 109225, 126327, -161974, 224619, 20871, -48098, 98348, 393347, 110710, 110966, 136803, 147307, 185243, 397811, 85390, 57704, 180668, 302571, -17230, 148620, -56057, 192818, 38932, 123234, -90796, -158685, 360155, 429329, -117076, -28870, 324050, 244405, 208999, 252987, 276481, 242952, 149267, 136278, 327121, 354449, 192683, -32443, 101664]
17439A4961g6455A74216F8903K24261I7548J8978g1701A8950L23451q5664j3531
17428B43206D5395J06653E6765K00447A03847L47039A63971J56756A03433l7009
17418F6424l1838J6818P3142L2142N5854n8619K42789L4615j7341Q4777e8060
17406B18133K89587A50812J68651j45039M6622q6732N3415P3149j353K1229m6778
17395B33976o9851G5912J05372J30753j6496N991b9173j0874D7094J85649C7421
17383e8719l00095E9252J80329E7933k438J207f7047c0522A03397b0531D5181
17371i5728C8032K05919A14172a02176a177B07539i0083c2055D8527J34662a5054
17359C43747G0302K89441j28054f8865G145J02337J27141l0587q5592R3262l0856
$$ y = [14961, -76455, 174216, 68903, 293164, 97548, 116526, -71701, 18950, 342401, 256737, 243206, 45395, 152048, 56765, 257212, 103847, 450886, 163971, 320727, 103433, 66424, 34586, 51404, 124546, 156688, 212542, 153923, 396712, 431327, 413986, 498763, -58060, 218133, 507720, 150812, 319463, 174424, 221046, 134314, 187729, 260878, 259525, 280754, 233976, 164125, 75912, 181284, 312037, 295541, 301532, -29173, -40047, 47094, 232743, 37421, -58719, -358814, 59252, 239581, 57933, 55495, 56702, -67047, -30522, 103397, -20531, 45181, -95728, 38032, 243951, 114172, -102176, -1177, 207539, -90083, -32055, 48527, 183189, -15054, 343747, 70302, 359743, 231689, -68865, 7145, 109482, 236623, 206036, 120444, 213706, 182850]
17348A82850M9731J61431A54543p1134C6416p295i2087A77449A6943a61863m328
17337a66191D20595i4632C25919j41128B613K91747M645g9608B40315E8791K03757
17326B62548b45097A03615Q8556R9981B9173b08407a1246C13623m7741j25168
17316A40714A9960J16203O6405J80435b52220C63297a69475L3087B61776q3272
17306A78504E6006a14143B71248R8863o2147j29358j527a18766A56027J47884
17296C03911E6563j0687R0908J30663R7746A72220C6867J33381B6006K29135q623
17285B46518E7303K9068J23595G4343J40592F4989N6876a7098C83423j56463J55548
17274C82508A85299q7652K63875A26397A4473K80588G8149K37515M6006j68939
$$ y = [182850, 232581, 394012, 154543, 83409, 36416, 29121, -92087, 177449, 16943, -161863, -166191, 420595, -94632, 325919, 184791, 2613, 294360, 299005, -79608, 240315, 58791, 262548, -245097, 103615, 192171, 292152, 29173, -208407, -11246, 313623, 265882, 140714, 19960, 136163, 202568, 383003, -252220, 363297, -169475, -136388, 261776, 178504, 56006, -114143, 271248, 370111, 307964, 178606, 177079, -118766, 156027, 303911, 56563, 45876, 136784, 267447, 365193, 172220, 36867, 170248, 26006, 255141, 246518, 57303, 86371, 209966, 74343, 214935, 64989, 121865, -17098, 383423, 226960, 382508, 185299, 97647, 361522, 126397, 14473, 295061, 78149, 315664, 361670, 192731]
17264A92731e6344A94761a57296A78987b1598j88321J01519A17703C5944M86114
17254E22058k24423C2969g7718B22246I0375K08085K3122a1854B20321a62527
17243C16068A15271K8013d8165g605D02203l7177c0119B22637M3356J17390a66581
17231a052A18434J068Q3902k3504F2724L115J24343k6488m0641a22773B83313
17219A08117f6125A18004L37023k07198h1809B87228N5900b52663B21093g936
17208b00525G1434P1196O9759Q4526p9021f792C24986j05680f5506C61793E4206
17196B04688M4385b9693l9759C51847j17886r6130O0265D3423a26549G4383Q4361
17185A58744P0312A09279J46197A8778M05050j59453b9808C15351k6517R8682
$$ y = [192731, -56344, 194761, -157296, 178987, -21598, -209919, -108400, 117703, 35944, 522058, 297635, 32969, -77718, 222246, 90375, 298460, 321582, -11854, 220321, -162527, 316068, 115271, 143284, -48165, -7605, 402203, 365026, -30119, 222637, 265993, 383383, -166581, -1052, 118434, 119502, 203404, 179900, 62724, 65839, 190182, 163694, 123053, -122773, 283313, 108117, -66125, 118004, 455027, 247829, -81809, 287228, 343128, -252663, 221093, -7936, -200525, 71434, 142630, 212389, 296915, 217894, -6792, 324986, 219306, -65506, 361793, 54206, 204688, 249073, -29693, -69452, 351847, 233961, 137831, 198096, 43423, -126549, 74383, 158744, 229056, 109279, 255476, 18778, 423828, 264375, -29808, 315351, 288834, 387516]
17175C87516A53326L99264n0047A23678L49251C9212J16120J95301H33K38771
17165B39604p7828O8243l0078P528O1618A15616a07609C54147j28270O9315J10851
17154D06043j5884K5584j21833J8188p646j35896N4541K04402k11069J64729I1008
17142C38308A44548P7374A03804J43200J51281J35524m3233A71460J74740A24320
17131A44137K66313H4543I792J42140R3541j17245n9720L87898k24518J58124
17121C90012j12522H4896J5515J49008c1628B89156j1901J16761A74231K34718
17111D08949j52328P8320A56948P1279o5887Q2759N978J70326j18154q5067A8789
17099E80046k84067F6545M66832B61402G0368M20344n047J7085B22451j2927J68069
$$ y = [387516, 153326, 552590, 502543, 123678, 472929, 39212, 155332, 350633, 833, 239604, 161776, 230019, 199941, 207469, 269087, 115616, -107609, 354147, 225877, 295192, 406043, 390159, 415743, 293910, 312098, 304452, 168556, 223097, 427499, 216430, 381159, 91008, 338308, 144548, 221922, 103804, 247004, 398285, 533809, 490576, 171460, 346200, 124320, 144137, 410450, 84543, 9792, 151932, 245473, 128228, 68508, 456406, 231888, 390012, 277490, 84896, 100411, 249419, -31628, 289156, 277255, 394016, 174231, 408949, 256621, 334941, 156948, 228227, 162340, 245099, 251077, 421403, 303249, 218182, 18789, 580046, 295979, 66545, 533377, 261402, 70368, 490712, 485665, 502750, 222451, 209524, 377593]
17088C77593J30591k03952p0607n6461J78868J17480q2044q6326K63947L9460
17078F08549k87046O0693K1872J82508j01546n0674P2992j93652L6565L71577
17068G21838l46806n0184J81103j73010J31987j11545A49414M83676O3094k91905
17058D04279K58995O4710k76091J92487j98935J93462k89903M6248A95493L77860
17048E73353j51417f2264D27235j51694K85102o9142N8957J1920j33700l0460
17038C98218J4633j52067L79297l07923l9271N5578J1542J19227J77618J14256
17028G71108j67462o1191M3642j05357j45124J90281p5067K55512C35487M31442
17018G66929j47164r5701k5180L40878k38538n5593j7452k6682M2301j13363J43264
$$ y = [377593, 508184, 304232, 233625, 177164, 356032, 473512, 391468, 305142, 569089, 608549, 321503, 382196, 404068, 586576, 485030, 434356, 507348, 313696, 350261, 721838, 375032, 324848, 505951, 332941, 464928, 353383, 149414, 633090, 696184, 404279, 663274, 727984, 451893, 644380, 445445, 638907, 349004, 395252, 195493, 573353, 421936, -62264, 427235, 275541, 560643, 491501, 550458, 562378, 428678, 398218, 412851, 260784, 640081, 332158, 292887, 348465, 360007, 479234, 656852, 771108, 603646, 542455, 586097, 480740, 335616, 525897, 450830, 706342, 335487, 766929, 619765, 524064, 498884, 839762, 601224, 545631, 528179, 501497, 543798, 430435, 573699]
17007E73699J41093j33712j9211L6153k47992O48251l88326J98092j54181r1019
16997E62847J4553J76043k37674J70802k76310L60156l72296k4940j08913M27731
16987F91999K29863l85756J88668j75638J57520j47626J59654L51465m59070K05187
16977H16266r6488l6970J55418P3882k44631J10201K40098n07194L67188j72875
16967G04895j02894J31208Q7667K98360m91301N91900l17702J07346K0647n4916
16957I75210j42217j00445L07347p2676k60873J03583J38896k97739L07530j04922
16947H53694J75928O2734j93965k1785K03363k15643K75615j05304k1478K54359
16937A267518o6900l920J68471p17j55534j26712J97894m42256J73597P9439j16277
$$ y = [573699, 714792, 581080, 561869, 598022, 350030, 998281, 609955, 808047, 653866, 562847, 577400, 753443, 515769, 686571, 410261, 770417, 398121, 373181, 264268, 691999, 921862, 536106, 724774, 549136, 706656, 559030, 718684, 1070149, 611079, 816266, 719778, 682808, 838226, 912108, 667477, 777678, 1017776, 510582, 877770, 704895, 602001, 733209, 820876, 1119236, 627935, 1219835, 902133, 1009479, 1030126, 975210, 832993, 732548, 1039895, 967219, 706346, 809929, 948825, 651086, 958616, 853694, 1029622, 1092356, 898391, 876606, 1079969, 864326, 1139941, 1034637, 1013159, 1267518, 1200618, 1196698, 1365169, 1364452, 1208918, 1082206, 1280100, 837844, 1011441, 1090880, 974603]
16926I74603J75806p3262r7833J42037K12651k68348m1351K41513k43720K31508
16916A253604j41830N7117M3695J84240J44022j96177j77077J8523K39597p7832
16906A347882J73297j37912K95745k98494L5084J55303j47041k0534K84068p7564
16896A609834j12335q365L49854j03941m8763L7746J26072o5103R4847k39987
16886A639859J11786k3970O7561P2105k62718N61234k26249k07260J4692M62828
16876B209868j29365L61170j56439j95302J32321l1343M9229J46514R0346o4063
16866B412936Q8664N9908k46071J19609J43091p8252J97190J253m70758L58183
16856B585753L85700n17436L16875j64994L77696r3067J21601r8584L48405M1138
$$ y = [974603, 1150409, 1077147, 979314, 1121351, 1334002, 1065654, 1024303, 1265816, 1022096, 1253604, 1111774, 1168891, 1212586, 1396826, 1540848, 1344671, 1167594, 1186117, 1425714, 1347882, 1521179, 1383267, 1679012, 1380518, 1415602, 1570905, 1423864, 1403330, 1687398, 1609834, 1497499, 1489134, 1838988, 1735047, 1686284, 1724030, 1850102, 1784999, 1879846, 1639859, 1751645, 1727675, 1795236, 1867341, 1604623, 2165857, 1939608, 1732348, 1747040, 2209868, 2080503, 2441673, 2285234, 2089932, 2222253, 2190910, 2240139, 2386653, 2476999, 2412936, 2501600, 2561508, 2315437, 2435046, 2578137, 2499885, 2697075, 2698328, 2227570, 2585753, 2971453, 2454017, 2770892, 2605898, 2983594, 2890527, 3012128, 2913544, 3261949, 3303087]
16846C303087k42876k51338N39665J39059k22515J01876L31368l26687L15998
16837C687637j30882j49148M95826j38878L3461K96969j70327R6857L62942q4307
16827D300150N0201N2995P5766P9914j55197K50543K86349M40126j24762J06534
16817E362619r5049K56999m46P9121L9881K26921L25287j19526K99399J95880
16807F571086J35622K52002j95101J04621M30929n6308L34805K10481j36035N52626
16797H204728J18105n9747O86095J35651k31885Q05835k06091L79811R371N98522
16787A0440395j27092N91135O62017o8002N15877N13745J61523K10468Q00422
16778A3700488L25987K51844O54273M73621M12147O49438M90692O31700R39190
$$ y = [3303087, 3060211, 2808873, 3348538, 3487597, 3265082, 3366958, 3698326, 3371639, 3687637, 3556755, 3407607, 3903433, 3764555, 3798016, 4094985, 3924658, 4021515, 4384457, 4300150, 4350351, 4403346, 4479112, 4559026, 4403829, 4654372, 4940721, 5380847, 5256085, 5362619, 5267570, 5524569, 5524123, 5603244, 5643125, 5870046, 6195333, 6075807, 6375206, 6571086, 6706708, 6958710, 6763609, 6868230, 7299159, 7242851, 7577656, 7788137, 7652102, 8204728, 8322833, 8263086, 8949181, 9084832, 8852947, 9658782, 9452691, 9832502, 9841873, 10440395, 10313303, 10904438, 11566455, 11498453, 12014330, 12528075, 12689598, 12900066, 13700488, 14026475, 14278319, 14932592, 15406213, 15818360, 16467798, 16958490, 17590190, 18529380]
16769A8529380K71331R62831O65031M03725J204673R63893R02353J287988Q90014
16760B6081219J079263J114901R48561J601553J556368J202748J733167J585867
16752C6903647J658460J984406K135763K329348K208860K410406L063672K823065
16744E5517627K875962L791639L404748L993740M089789M206916M830761N147743
16736H7858925N376258N666469O366431O594144O854571P188414P648371P519225
16728A41072808P763779P635614P508861P665555O544347N650637N165520L998925
16720A93006046K604086J038022O1179j841164k773140m215853n303728o309283
16712A76266165p004593p572982p480927p954316p975919p804953p119020p875574
$$ y = [18529380, 18800711, 19763542, 20428573, 20832298, 22036971, 23000864, 23903217, 25191205, 26081219, 27160482, 28275383, 29223944, 30825497, 32381865, 33584613, 35317780, 36903647, 38562107, 40546513, 42682276, 45011624, 47220484, 49630890, 52694562, 55517627, 58393589, 62185228, 65589976, 69583716, 73673505, 77880421, 82711182, 87858925, 93235183, 98901652, 105268083, 111862227, 118716798, 125905212, 133553583, 141072808, 148836587, 156472201, 163981062, 171646617, 178190964, 183841601, 189007121, 193006046, 195610132, 196648154, 196709333, 194868169, 192095029, 187879176, 182575448, 176266165, 169261572, 161688590, 154207663, 146253347, 138277428, 130472475, 123353455, 115477881]
16704A15477881o684905o550717o099575n967968n436877n289944m618502m631027
16696G0198366l851399l710009l676415l270023k955904k564762k770340k366815
16688D5032699k329834k272369j695172k126514j424617k115914j720023r87625
16680C0360631j313178j405732j388570q63157j027040j062258r37260p59129
16672B1604307o25961r79084p52592r08784p30002l16827n57407o11450p86465
16663A5335735l02076n96676k58371o61283l57875p32926q2125q86365K36454
16654A1694492k00806l73032p54662j17686j10975q01013K18154m15660r4034
16645I044778k12626r09897L84969k81605k9300j82743m25250L9680n35902J31423
$$ y = [115477881, 108792976, 102242259, 96142684, 90174716, 84737839, 79447895, 74829393, 70198366, 66346967, 62636958, 58960543, 55690520, 52734616, 50169854, 47399514, 45032699, 42702865, 40430496, 38735324, 36608810, 35184193, 33068279, 31348256, 30360631, 29047453, 27641721, 26253151, 25389994, 24362954, 23300696, 22363436, 21604307, 20978346, 19999262, 19246670, 18337886, 17607884, 17291057, 16733650, 16122200, 15335735, 15033659, 14436983, 14178612, 13517329, 13159454, 12426528, 12344403, 11458038, 11694492, 11493686, 11120654, 10365992, 10248306, 10137331, 9336318, 9554472, 9138812, 9044778, 8832152, 7922255, 8307224, 8025619, 7996319, 7813576, 7388326, 7428006, 6892104, 7023527]
16635G023527l99631K39006j59947o25145K40013k13858j76297j97141K5383O1543
16625E817453m75859l92610L18836j49336m25452L43819k64231j377m05701J29957
16615D495499k1456N8519l05226k81013P4451q8105l2114k9256k77950J72405
16605C765754j59231j74383K69758l12284K27886n20120o7050L26493n7669j73896
16595C125258j61750m6046p0839M1511J03362j41273P7108n6955O585k02575j44222
16584B530164J22842j33014J26678j76927O3817p0931k42950K12321j36598k81546
16574B013856N90038n12109J85737K11132j63523m72010L07032j50882j08339
16565A900932Q9276k348J26791n8575q8779j45244l09531L11383m8483Q8389k29907
$$ y = [7023527, 6623896, 6862902, 6702955, 6077810, 6317823, 6103965, 5927668, 5730527, 5755910, 5817453, 5341594, 4948984, 5267820, 5118484, 4693032, 5036851, 4772620, 4771243, 4365542, 4495499, 4474043, 4532562, 4227336, 3946323, 4020774, 3932669, 3900555, 3871299, 3593349, 3765754, 3606523, 3432140, 3701898, 3389614, 3617500, 3097380, 3030330, 3356823, 3299154, 3125258, 2963508, 2917462, 2846623, 2888134, 2991496, 2850223, 2927331, 2870376, 2876961, 2674386, 2530164, 2653006, 2519992, 2646670, 2469743, 2533560, 2462629, 2219679, 2432000, 2295402, 2013856, 2603894, 2091785, 2277522, 2488654, 2325131, 1853121, 2160153, 2009271, 1900932, 1990208, 1987860, 2114651, 2056076, 1967297, 1822053, 1512522, 1823905, 1775422, 1863811, 1633904]
16554A633904J40741Q4253K1414m77113K72456K27183j3310m54854L4998j0008
16544A459664J07599J23323j10840r5963l78971M61826J27316l66166j97249L66500
16534A497039r4552K68918k54482L079j12292L00633j83361N6519r3303j33161
16524A255037l51861L77510K39707j20090k42378J62277l64805L0085P5394J54800
16514A215676O1397J25651m57007M43359m58595M6528J92240Q2985k14977j78828
16504H58429O695N27409R9129l21039r7902j78772J42842j37093K63453n26400
16494F36751K08060J56785j12085J99711k19393k22432K98423R2543k69937q2216
16484F86210K72015m03265K03784l14204M69535k49743J85254k10834o764N88799
$$ y = [1633904, 1774645, 1858898, 1880312, 1403199, 1675655, 1902838, 1889528, 1434674, 1469672, 1459664, 1567263, 1690586, 1579746, 1483783, 1104812, 1566638, 1693954, 1327788, 1130539, 1497039, 1402487, 1671405, 1416923, 1420002, 1307710, 1608343, 1424982, 1481501, 1388198, 1255037, 903176, 1280686, 1520393, 1400303, 1157925, 1320202, 955397, 985482, 1060876, 1215676, 1277073, 1402724, 945717, 1389076, 930481, 977009, 1169249, 1252234, 1037257, 858429, 865124, 1392533, 1491662, 1170623, 1072721, 893949, 1036791, 899698, 1163151, 636751, 844811, 1001596, 889511, 1089222, 869829, 647397, 945820, 1038363, 768426, 686210, 958225, 554960, 758744, 444540, 914075, 664332, 849586, 638752, 631988, 1220787]
16474A220787m73730J42802j76186K61171l27491M32475m68128Q6046K44951l12439
16464F30258p1108L37823l07663J28815k34848L29918r5744J60943k49530B87149
16453H05224Q279j71253p7080N4159N5018j19294L57429j89597r624l15377R8264
16442D96148K10574J7086l05193L23399M9790j71455m1017J07495j34437N490
16432E57880j27320K70613j99268j49965R4676J8656J5032L52420l31579J5759
16422E16904J55160K07306C81957A22241L14962J22835K01279k6825p0659k5985
16412F37848J15732J88585k24105M5140l40534k1423Q0566J28466k21864K38003
16402F26414j47768k13632K71231J92431C46285K25250N666j54042O4773r0259
$$ y = [1220787, 747057, 889859, 713673, 974844, 647353, 1079828, 611700, 697746, 942697, 630258, 559150, 896973, 589310, 718125, 483277, 813195, 717451, 878394, 628864, 287149, 805224, 813503, 642250, 565170, 619329, 674347, 555053, 912482, 722885, 713261, 397884, 496148, 706722, 723808, 418615, 742014, 791804, 620349, 579332, 686827, 552390, 557880, 430560, 701173, 501905, 351940, 446616, 465272, 480304, 832724, 501145, 516904, 672064, 879370, 381957, 122241, 437203, 560038, 761317, 734492, 663833, 637848, 753580, 942165, 718060, 763200, 422666, 401243, 481809, 610275, 388411, 626414, 478646, 265014, 536245, 728676, 346285, 571535, 577201, 423159, 487932, 397673]
16392C97673M87837k35623j31745N2681k417j26928L30400A48568L99117K8900
16382E76585B02817O30657l40926N9679j37438q5943J41650k25054J00496r889
16372C36049j45274P18040l73672J64125j35733L79381l42333j08901l4632k22397
16362B34653L38354M51R9961j89483M4793A76227K46131j29285L73392C14399
16351B02530P9832K4392P2581l4998P1109R987K827j81546M29654k37704P3078
16340E11742A82171J79400n7948R9250N5401J57391k61183K09953k00928j69262
16330A94245F3969K83534n3818K43801j78692r4519L83696A22524J58119A33853
16319B42425J4027K03738P0558d0984C34671A65864K33707r4431L12733B26587
$$ y = [397673, 885510, 649887, 518142, 570823, 568406, 441478, 771878, 148568, 547685, 576585, 202817, 833474, 492548, 552227, 414789, 328846, 470496, 245442, 345938, 336049, 190775, 908815, 535143, 699268, 563535, 942916, 600583, 491682, 457050, 234653, 573007, 573458, 673419, 483936, 528729, 176227, 422358, 293073, 666465, 314399, 202530, 282362, 306754, 379335, 344337, 415446, 425433, 428260, 246714, 676368, 438664, 511742, 182171, 361571, 303623, 402873, 458274, 615665, 354482, 564435, 363507, 194245, 63969, 347503, 293685, 537486, 358794, 264275, 647971, 122524, 280643, 133853, 242425, 256452, 460190, 530748, -40984, 334671, 165864, 399571, 305140, 617873, 226587]
16308b1901I4028J82242j34517n4993O08379C39322o2926K25703A67297K63837
16298D31134j08778K02050k20661L87027l31620o5603J74951A88160J08021o922
16288B89259j9302L9200J33391j64761R5613A66510K81083A36736J19049C9839
16277I5022N64262j11899k08256H1897N9824J56759F7411k6505O5329Q8018J72862
16266C67115q8971A32351K35384L46490l15018j8550D4078h25B78577J52036j58534
16255B72079K13893j79382L2650l5913j3037K59337p9690A702J52997m3628K85332
16244C96403A58036L73624q7673A86046K65324j61514l3595G6901L15302r4040
16234B98163J20699j66775J85823b1354C18999A55228O1728q204a38233H0593
$$ y = [-21901, 94028, 276270, 141753, 86760, 695139, 339322, 276396, 502099, 167297, 431134, 322356, 524406, 303745, 690772, 359152, 293549, 468500, 188160, 296181, 289259, 269957, 309157, 442548, 277787, 373400, 166510, 447593, 136736, 255785, 39839, 95022, 659284, 547385, 339129, 81897, 141721, 298480, 67411, 40906, 106235, 194253, 367115, 278144, 132351, 367735, 714225, 399207, 380657, 44078, -825, 278577, 430613, 272079, 485972, 306590, 339240, 303327, 290290, 549627, 469937, 1702, 154699, 111071, 396403, 158036, 531660, 443987, 186046, 451370, 289856, 256261, 76901, 392203, 298163, 418862, 252087, 437910, -21354, 318999, 155228, 216956, 208752, -138233, 80593]
16223C6399K5794K22105p1177k2308J2271J88597j84245J26690I8012J79181a5709
16211A17187P1441r1815K1458m3566h1233H7598P9193j1192g8416A94297k0029
16200A74268J9554K68567A65147b06382C07043K33800D3391A7612J76502l6990
16190A57124G3453J85627P9591A16302I312c5804A68871J24589G6608M1383N09628
16179F27619B28928p9179m7755k4428d1948B40685j06360o1301A8283J17685A4752
16167E2293L89203A3528K05974C190K32446d2715B47789J25389A78801p9079L27665
16156D27387A04314E0320j5397m039a64704F1648O6209R7689F6239J88939j10090
16145A45088F7789k9735K07682A4994J08324J05645l0088g6501B64965j28054
$$ y = [36399, 62193, 284298, 213121, 190813, 203084, 391681, 207436, 334126, 98012, 277193, -15709, 117187, 188628, 96813, 118271, 74705, -81233, 87598, 166791, 155599, -78416, 194297, 174268, 193822, 462389, 165147, -206382, 307043, 540843, 43391, 17612, 194114, 157124, 73453, 259080, 338671, 116302, 9312, -35804, 168871, 293460, 76608, 117991, 627619, 228928, 149749, 101994, 77566, -41948, 240685, 134325, 73024, 18283, 135968, 14752, 52293, 441496, 13528, 219502, 3190, 235636, -42715, 247789, 373178, 178801, 99722, 427387, 104314, 50320, 34923, 30884, -164704, 61648, 127857, 225546, 66239, 255178, 145088, 67789, 38054, 245736, 14994, 123318, 228963, 198875, -76501, 264965, 136911]
16135A36911n9488J30995D0789a2448l6672a8D50245a17047M5696B29523k3710
16124B05813K7016a1095A31249B5200o058a59991A45786b14067B03051E802J41702
16113A47504P0104d6941I9628b52439F3351b63819K4238M3625n641C3154K6J32174
16101A65354O2237i0472A21463C1172J9685b29409b0962F7645N892k5005b0850
16089a8129B93208a72561C04846A08921k4991A0313a8026C6171b12356o286C3051
16077A93830L020h68E26238a5400A65444a60593E0323r573l458J36484c16180
16065B56887B2264J09415b25965B87162e6658E6886a22849l54443A91877A648
16054I7211f6608l59326A00166L3235b21880F3161a41085G257L9606a09791A0199
$$ y = [136911, 77423, 208418, 40789, -12448, -49120, -18, 450245, -117047, -71351, 229523, 205813, 232829, -11095, 131249, 25200, 19142, -159991, 145786, -214067, 203051, 5802, 147504, 217608, -46941, 99628, -252439, 63351, -263819, -239581, -195956, -201597, 33154, 33180, 165354, 227591, -90472, 121463, 31172, 50857, -229409, -20962, 67645, 73537, 48532, -20850, -18129, 293208, -172561, 304846, 108921, 83930, 10313, -18026, 36171, -212356, -218642, 33051, 193830, 196850, -868, 526238, -15400, 165444, -160593, 50323, 40750, 37292, 173776, -316180, 256887, 22264, 131679, -225965, 287162, -56658, 56886, -122849, -477292, 191877, 1648, 97211, -66608, -425934, 100166, 133401, -221880, 63161, -141085, 7257, 46863, -109791, 10199]
16042A51793C4909J40659p5850c13090A26604m1610a64253I7016a13066A8120
16031a73903c2827B0939a51966d428k73208i8389r3424b7779B06174D3650J6722
16020F0372G434g1362B15316E6689N9413D9112a50421A31337b39548a14165d6199
16008c50031B28748F7632f2521A53809a38506f0793o3623M5177k09465J38117
15998a50587O2134p993A06601J35832k771K02256e3322A80676E7099a07386B5169
15986a64016k30675H8092a18334d6523C36322a00778A90423F5955B8687J9751
15976D8438b3198B7098P2136a14106A2459a04049F8907M8521b22239L6437A73182
15964A77852e5055a4274C45675j08600b05656B69904E0429i767j43445P704A10492
$$ y = [151793, 34909, 175568, 99718, -313090, 126604, 84994, -164253, 97016, -113066, 18120, -173903, -32827, 20939, -151966, -4428, -277636, -98389, -191813, -27779, 206174, 43650, 60372, 7434, -71362, 215316, 56689, 116102, 49112, -150421, 131337, -239548, -114165, -46199, -350031, 228748, 67632, -62521, 153809, -138506, -60793, -124416, -79239, -288704, -150587, -88453, -96446, 106601, 242433, 239662, 441918, -53322, 180676, 57099, -107386, 25169, -164016, -394691, 88092, -118334, -46523, 336322, -100778, 190423, 65955, 28687, 48438, -23198, 27098, 99234, -114106, 12459, -104049, 68907, 117428, -222239, -185802, 173182, 177852, -55055, -14274, 345675, 237075, -205656, 269904, 50429, -9767, -153212, -145508, 110492]
15952a75C1660K0852F455a73996L3128D0227b05511E9087G870a02310I2571k8206
15940F4365K04319a12961d2721m4092A03431d4046l4982j68844a09864A67858
15929F0350B0392b82059A67411a15777A19938A8332a036k41176B1232a93575o0783
15918b54358n9598J9830A78005P8264c33329J09521A2596a18287m0n5464B6362
15906F2686J19377C3941a92051B72723J91647a64338A07005a89850K636f1671
15895a80400D9255a49735C41562d4023j42302A19080M4807b32672A47369A3017
15884I3817a0549E8559J3228K19656j21572K1351f9023J5304A35191b7305j3471
15873d0776C7147f4959K4115j75284P9637k59952a37191A15343A1218b02590d4953
$$ y = [-175, 31660, 52512, 6455, -173996, -140868, 40227, -205511, 59087, 7870, -102310, 92571, 64365, 268684, -112961, -42721, -86813, 103431, -44046, -79028, -247872, -109864, 167858, 60350, 20392, -282059, 167411, -115777, 119938, 18332, -1036, -242212, 21232, -193575, -254358, -313956, -294126, 178005, 256269, -333329, -223808, 12596, -118287, -118327, -173791, 26362, 62686, 182063, 33941, -192051, 272723, 464370, -164338, 107005, -189850, -187214, -61671, -180400, 49255, -149735, 341562, -44023, -186325, 119080, 163887, -232672, 147369, 13017, 93817, -10549, 58559, 71787, 291443, 169871, 191222, -69023, -53719, 135191, -27305, -40776, 37147, -64959, -40844, -216128, -136491, -396443, -137191, 115343, 11218, -202590, -44953]
15861d956r5942b1026A98112a4476A81048q2436c16111A02046a19650K6808A14839
15849i4928n1962j25479I6376c34780a61865L5800d5859E3062b8654A86015c95415
15837D1549K52235E9877J51719b7890k47736a0773G0618c238k9226j31032j01975
15826b65471J26329e4159K4238k62201J39109F7330a17194n635N6189a7497I5192
15814d39302d1173p9213C990a07854A56216B9308J02224h0144G189e3312C601
15802c9173a0476l9987j33703c1631j16073b269j06798k16493a22866p6579i274
15790a28637j39238J26388Q709l4792c751j92658k2496e03l7281k1632B740c7831
15777b38913N2448A31760b43580B87199a44500D4604f3360p078A65097b620m5552
$$ y = [-4956, -100898, -21026, 198112, -14476, 181048, 98612, -316111, 102046, -119650, -92842, 114839, -94928, -146890, -272369, 96376, -334780, -161865, -126065, -45859, 53062, -28654, 186015, -395415, 41549, 293784, 59877, 211596, -27890, -275626, -10773, 70618, -3238, -32464, -163496, -265471, -139142, -54159, -29921, -292122, -153013, 67330, -117194, -122829, -66640, -17497, 95192, -439302, -41173, -120386, 3990, -107854, 156216, 29308, 131532, -80144, 7189, -53312, 3601, -39173, -10476, -50463, -184166, -31631, -147704, -2269, -109067, -325560, -122866, -199445, -9274, -128637, -267875, -141487, -132778, -167570, -3751, -196409, -218905, -503, -37784, -59416, 2740, -37831, -238913, -186465, 131760, -243580, 287199, -144500, 44604, -63360, -70438, 165097, -2620, -48172]
15766d8172j9953C49337a32551k6589b7237A60945e1216p2328r616A63507b6747
15754c03718A31968D5723c12686m2950M6782O9455F4846K35011F5867P7644D6156
15742A51471a9187l4588m0690J1417A7438f9086A23193C3157d02028A04562a84815
15730I7123b24773J01767B55035j04097C9102b28213j46188B64841b23258d0470
15719A00338b87555A61923b10762A04855J33293b51620E0768Q1975J02466b51669
15708a50952j67879a11857j0664F0284i5320q8317j01969D77488a23894a2481
15697a3771E691Q314a62143O3666k221j44370f5348C849J70587J98244A27902
15685a54371g6424j16104H7668b70350k616I3089h0146A05829J87850c75345A41587
$$ y = [-48172, -68125, 349337, -132551, -159140, -27237, 160945, -51216, -123544, -133160, 163507, -26747, -303718, 131968, 45723, -312686, -355636, -308854, -239399, 64846, 299857, 65867, 143511, 46156, 151471, -19187, -53775, -94465, -83048, 17438, -69086, 123193, 33157, -402028, 104562, -184815, 97123, -224773, -123006, 255035, 150938, 39102, -228213, -374401, 264841, -223258, -40470, 100338, -287555, 161923, -210762, 104855, 238148, -251620, 50768, 132743, 235209, -251669, -150952, -318831, -111857, -122521, 60284, -95320, -183637, -285606, 477488, -123894, -12481, -13771, 5691, 14005, -162143, -98477, -100698, -245068, -65348, 3849, 174436, 372680, 127902, -154371, -76424, -192528, 87668, -270350, -272966, 93089, -80146, 105829, 293679, -375345, 141587]
15673F4621c16302J11684a7385n1577B89646D8197K1023a64577I5830c2806m8872
15662h1678J4606c560l17702d0694e787G0991a29940j53239h6542k24068D9786
15650a3699D571K7633a72648M1275h455k29754K3314g101B27515d247B33324B5237
15637b6935A6832N4635i7933k17518J55327a7715l06571a01937G0259K27574d4916
15625a71751J3007M9260A67934A3369b07597D7733e6525B3517M0768l0689a87309
15613A28454i5096B37898a51853E2060b01360J9599K1868q1190h0896k6631j43342
15602b50869H8997L7138K33330a69597j81027A64897e2825G5313P596O9836F17
15590f1513j02386A63068b31902k6860a16558C01361h6261A88483h6732a5683
$$ y = [64621, -316302, -204618, -17385, -68962, 289646, 48197, 69220, -164577, 95830, -32806, -81678, -67072, -3560, -321262, -40694, -5787, 70991, -129940, -283179, -86542, -310610, 49786, -13699, 4571, 32204, -172648, -131373, -8455, -238209, -214895, -7101, 227515, -4247, 233324, 25237, -26935, 16832, 71467, -97933, -315451, -160124, -17715, -324286, -101937, 70259, 297833, -44916, -171751, -158744, -109484, 167934, 13369, -207597, 47733, -56525, 23517, 64285, 33596, -187309, 128454, -95096, 237898, -151853, 52060, -201360, -181761, -159893, -241083, -80896, -107527, -250869, 88997, 126135, 359465, -169597, -350624, 164897, -52825, 75313, 82909, 152745, 617, -61513, -163899, 163068, -231902, -258762, -116558, 301361, -86261, 188483, -86732, -15683]
15579a22078L2224k04962N0418A04512k8100b67393B9861b61770L7312J0319k2889
15568b37028k2913F7169b91507a9620p6235A0230c10092B18775B3570K4459j2422
15557C5607K59684a52521F643R6100a31681p4091e0954A06594K3351e5751l0205
15546h5956p5459e0544H1504A3793b72165D6066R5907C7053b56846a27086B00682
15534B27493F0537c2796A00682j3877C7973c7137l5146A58050O75a88840B63807
15522a77022f8857A76115J38068a51433J0358A30536a52047C7436J26665c05561
15511A29352i3564B7352J53007q9354J92296r6635a81813B28115q1454J37068
15501B83729a50527j28599E9290O1751h2313n2093d6376l19967H4102a93872l56
$$ y = [-122078, -89854, -294816, -244398, 104512, 76412, -267393, 29861, -261770, -224458, -214139, -237028, -259941, 67169, -291507, -19620, -95855, 10230, -310092, 218775, 23570, 48029, 35607, 295291, -152521, 6643, 102743, -131681, -205772, -50954, 106594, 129945, -55751, -85956, -161415, -50544, 81504, 13793, -272165, 46066, 141973, 37053, -256846, -127086, 200682, 227493, 60537, -32796, 100682, 86805, 37973, -37137, -72283, 158050, 158725, -188840, 263807, -177022, -68857, 176115, 314183, -151433, -141075, 130536, -152047, 37436, 164101, -305561, 129352, -93564, 27352, 180359, 91005, 283301, 186666, -181813, 228115, 146661, 283729, -150527, -279126, 59290, 121041, -82313, -134406, -46376, -366343, 84102, -193872, -194228]
15490a94228G4614b82319a36777G5502a41254o2268c669k27621G0321J00226b66307
15478b26273o532a10758H6336g50B12110a75817B00840J57505b30813F1505b42238
15466A93749a1674j16883k8671A17609D2863e3894n2690A19176b4517B61842F0084
15454D4496a1168k77584d5314B4594c02644a48457c4019I0611a55795O3358e031
15442b77143i6432A96159a42538a0833A66246D4351g4019j24785b8823A2867Q5938
15431I8805i9196A85934A6313R5906b82025D2322b25439B61086a26499D46958
15420b87749a11335I3321Q7290h4718A52256n5699N4240c5891F4232a76594A03479
15408F1568b62502e642B26307G819a19809A38393J36953b64463a19252d9807l2647
$$ y = [-194228, 74614, -282319, -136777, 75502, -141254, -203522, -3669, -231290, 70321, 170547, -266307, -226273, -232805, -110758, 86336, -750, 212110, -175817, 200840, 358345, -230813, 61505, -242238, 193749, -11674, -128557, -157228, 117609, 42863, -53894, -106584, 119176, -24517, 261842, 60084, 44496, -11168, -288752, -45314, 24594, -302644, -148457, -34019, 90611, -155795, -92437, -5031, -277143, -96432, 196159, -142538, -10833, 166246, 44351, -74019, -198804, -28823, 12867, 98805, -99196, 185934, 16313, 112219, -282025, 42322, -225439, 261086, -126499, 446958, -287749, -111335, 93321, 180611, -84718, 152256, 96557, 150797, -35891, 64232, -176594, 103479, 61568, -262502, -5642, 226307, 7819, -119809, 138393, 275346, -264463, -119252, -49807, -82454]
15397h2454A74507N283B4199Q946M9247l8458a64226b7097A13977a32134C09925
15385A27125Q8834a81513L0197O8615J3031n3990C81624a7552B0068a14569B22305
15373F6846C2456K86248i7500j18838k6603M5871A59307b78538a00486m439B63936
15361H7666A3004L22174a82973C81944e20184i8649k39909F9322a7074m6527B51915
15349g421F357g4266n320B05875e4330K0671I9008R3117E3226a49261A08507R8027
15337B06534O4826a03051j14569c2440j63801F0883B8883J44505a20742A9418
15326A17591p280a21770A61390B1379J28324n5064L809C4415L2421M781a91031
15314A3944a46489f3812k56196C78819p9737a3614k2144E5804d1439A18712n7191
$$ y = [-82454, 174507, 179790, 24199, 33145, 82392, 43934, -164226, -27097, 113977, -132134, 309925, 127125, 215959, -181513, -151316, -82701, -69670, -123660, 381624, -17552, 20068, -114569, 222305, 66846, 32456, 318704, -97500, -216338, -242941, -197070, 159307, -278538, -100486, -104925, 263936, 87666, 13004, 335178, -182973, 381944, -520184, -98649, -338558, 69322, -17074, -63601, 251915, -7421, 6357, -74266, -79586, 205875, -54330, -33659, 99008, 192125, 53226, -149261, 108507, 206534, 271360, -103051, -217620, -32440, -196241, 60883, 28883, 173388, -120742, 19418, 117591, 110311, -121770, 161390, 21379, 149703, 94639, 98448, 34415, 66836, 71617, -191031, 13944, -146489, -63812, -320008, 378819, 299082, -13614, -35758, 55804, -41439, 118712, 61521]
15303F1521e675B61746o4479b72999C33957a04185d5716J3567j13209A36786O6230
15292B03016Q058a22538j5070j16641h5788b0035o3318A07068P5200M310R1854
15281B78432A06074m4816B7433a50556A2683J47322F2998J35891I980K3280L07896
15270C41156j02988j01008a72739B55666a6391E0284c6410p9612e408n967A57045
15258C40315e876A88722e3163c460A31036J53862A38866J0739k0696M82858K33463
15247H45230M41840j63424k14192k97843A11820c2850k1640A5292b32942C6050
15236g991B03700c29756a55670B93527D8942K47182A31740J29386A9268c7800
15225c8555A21718N5937K06278F89a3261D274E62J68671M7402a50668J228F90131
$$ y = [61521, -5675, 261746, 197267, -272999, 333957, -104185, -45716, -32149, -145358, 136786, 203016, 211074, -122538, -137608, -254249, -85788, -20035, -83353, 107068, 182268, 186578, 278432, 106074, 61258, 27433, -150556, 12683, 160005, 62998, 198889, 9980, 33260, 341156, 238168, 137160, -172739, 255666, -16391, 50284, -36410, -116022, -5408, -11375, 157045, 340315, -5876, 188722, -53163, -3460, 131036, 284898, 138866, 149605, 128909, 611767, 845230, 1287070, 1123646, 909454, 611611, 111820, -32850, -54490, 15292, -232942, 36050, -7991, 203700, -329756, -155670, 293527, 48942, 296124, 131740, 261126, 19268, -37800, -38555, 121718, 177655, 383933, 689, -13261, 4274, 562, 169233, 216635, -150668, -149440, 690131]
15212A09038o679N9385h6556j18445C29109A59859C6340L24193A5708J85386n0099
15201A50995p2107G520f5192B27496b8492B65066A08735N8911C524J17670J16096
15190B37290L993E2945K14479e806q3346A0225R1711D1980g6178c097I4003J4149
15178A08152E3472Q7813B0061a76566A56945A1979N1604J9945a92230I5404f291
15166b1160G6215P4953a48230K0689B06040F1090J69069D8133i5399E025N45519
15155E50544a48980A60320J02814o505m7415m0336K00341j26147c0502E2118b05521
15143B59263m7840h7252A89255F6716K24598h1066A02346c47514d1956H6492N8580
15132A45072o607J57150J54014E7429J59896F8278M05313A20179E6350P2417K6061
$$ y = [109038, 102359, 161744, -86556, -205001, 329109, 159859, 36340, 360533, 15708, 201094, 150995, 78888, 7520, -65192, 227496, -28492, 265066, 108735, 167646, 3524, 121194, 237290, 241283, 52945, 267424, -5806, -89152, 10225, 101936, 41980, -76178, -3097, 94003, 108152, 53472, 141285, 20061, -176566, 156945, 11979, 63583, 83528, -192230, 95404, -6291, -21160, 76215, 151168, -148230, -127541, 206040, 61090, 230159, 48133, -95399, 5025, 550544, -148980, 160320, 263134, 256629, 209214, 168878, 369219, 243072, -30502, 52118, -205521, 259263, 211423, -87252, 189255, 66716, 291314, -81066, 102346, -347514, -41956, 86492, 145072, 138465, 295615, 449629, 57429, 217325, 68278, 473591, 120179, 56350, 128767, 154828]
15121A54828E818h4959C34006k9051H5690e8624A45856a224F7124K74144A08561
15109G4032J70221C4891A2523K45190g6176A48106K90576E7961a47435B89930
15098A73791L246J18893c0825A53993P4644a12604A04501K5671n6100K0351J16412
15087B10835d0326A66991L56098d4568M688A3214O9511k5975M78676A04812j5951
15076H8861a29416j956l7392A34449M27013j71473j72130a4223j65713A14920
15065A98386Q9797j13599l3808m3707K35433r8910o5513p1927L4761n2121e40342
15053A04212a0409p1817E80128H7801J10442K5197B669e9032C91607h808B39819
15041A85058P529l2845a7054P020B55619o0572b47601I4269K40514R6969n2280
$$ y = [154828, 5818, -84959, 334006, 304955, 85690, -58624, 145856, -1224, 67124, 341268, 108561, 74032, 244253, 34891, 12523, 257713, -76176, 148106, 438682, 57961, -147435, 289930, 173791, 177037, 295930, -30825, 153993, 228637, -112604, 104501, 130172, 74072, 94423, 210835, -40326, 166991, 523089, -44568, -39880, 13214, 82725, 56750, 535426, 104812, 88861, -129416, -131372, -168764, 134449, 561462, 389989, 217859, -14223, -179936, 114920, 198386, 288183, 174584, 140776, 97069, 332502, 233592, 168079, 96152, 130913, 78792, -540342, 104212, -10409, -82226, 580128, 87801, 198243, 223440, 2669, -59032, 391607, -8808, 239819, 185058, 192587, 159742, -17054, -10034, 255619, 195047, -247601, 94269, 334783, 431752, 379472]
15030C79472j62492o4861R0512r9381K89302q5705a27462H4270Q9656p0750e6738
15018f4663B09609L9271C224b23951A30733J40060H133l292J2235L56490b9571
15006A75368j4936o7268L41466A31709N8814O2001A7003M08J72484k2016L75142
14995E43021H1224O448K5792L36564A02024n022K1498O28446A636J24547K84017
14984D10200D4236J48466K31527B05982r5196J01831q6496n2955J02545K9042
14974B04753R7544n530r2824M6101p6650c01741C81913a54729F4277N5442e3555
14962f60C62326A40696C1513K82942n9361Q9993F7342L99159A90449J48590p1558
14951B67481l2349J54974A66733K4702J2748Q4864J58574r3807m0519j30320L07557
$$ y = [379472, 216980, 152119, 242631, 143250, 432552, 346847, -127462, 84270, 173926, 103176, -56738, -64663, 209609, 248880, 3224, -223951, 130733, 270793, 8133, 4841, 17076, 373566, -29571, 175368, 160432, 93164, 434630, 131709, 190523, 252524, 17003, 17411, 189895, 167879, 543021, 81224, 87672, 113464, 450028, 102024, 97002, 118500, 746946, 1636, 126183, 410200, 44236, 192702, 424229, 205982, 110786, 212617, 126121, 73166, 175711, 204753, 302297, 296767, 203943, 250044, 173394, -301741, 381913, -154729, 64277, 119719, -53555, -660, 362326, 140696, 31513, 314455, 255094, 345087, 67342, 466501, 190449, 339039, 267481, 235132, 390106, 166733, 191435, 204183, 289047, 447621, 353814, 313295, 182975, 490532]
14940D90532F4765L89991n3014j89442K54733j34366k2606j27607a47758B84631
14929g7335F49905j74027m433G5673M41589b22512C30347M00957B12339m0894
14919A71445a83593C83026O9948c7265B54613a94029C07579J67000B27151J92990
14909D20141n3683A78785p3736j0318J77585L03854B74985J37288J15571B49478
14898D73238Q6293J0320n2412j01399L10026B7894M65833I2027J95768N09943
14888G97738C91420A82792J80802D3671L77535J31713A7985K84341K9969o173
14878C26122J51292A98899q7168O04344C30438j7485p2157M55719b5578G74006
14867B06264K02248J5145j53576K89707M0821k95740A01109N16757C7501M63814
$$ y = [490532, 64765, 454756, 401742, 212300, 467033, 332667, 310061, 182454, -147758, 284631, -77335, 649905, 475878, 471445, 75673, 517262, -222512, 330347, 731304, 212339, 171445, -183593, 383026, 452974, -37265, 254613, -194029, 307579, 474579, 227151, 420141, 366458, 178785, 105049, 94731, 272316, 576170, 274985, 412273, 527844, 249478, 473238, 559531, 569851, 517439, 416040, 726066, 27894, 493727, 92027, 287795, 797738, 391420, 182792, 363594, 43671, 421206, 552919, 17985, 302326, 332295, 326122, 477414, 198899, 111731, 716075, 330438, 312953, 240796, 696515, -25578, 774006, 206264, 408512, 423657, 270081, 559788, 600609, 304869, 101109, 617866, 37501, 501315]
14857E01315o6809K0130j38480K598o056M95528l69585j04011A12016J63540K51501
14846E27057j34967J88103k5776j21022o2241p0586P0216K22311B83048K282M18378
14835G03708j92647M445J88409k02999J90153k77569l1839J80004A41248K80565
14825D21813K06116j71921k02536J12860I8158L58804B17714J24553J01076r9993
14815C43350K48884r7445O3563k17589j2070L37563B95727K44212A79113J47503
14805C26616K05023B48615M23988k31428L19468j06968k43462m7979J00016K45632
14795G07882k60025J33582q0176j07544J64364J99307B50914O01755J13924l60377
14785F06216j41416K87361k96015o9628R8872L26049k82157m8894K5321j13514
$$ y = [501315, 434506, 454636, 316156, 318754, 312698, 808226, 438641, 334630, 112016, 275556, 527057, 392090, 580193, 554417, 433395, 371154, 300568, 370784, 593095, 283048, 285330, 703708, 511061, 515506, 703915, 500916, 691069, 413500, 381661, 561665, 141248, 421813, 627929, 456008, 253472, 366332, 98158, 456962, 217714, 342267, 443343, 343350, 592234, 494789, 558352, 340763, 328693, 666256, 295727, 539939, 179113, 326616, 531639, 248615, 672603, 441175, 760643, 653675, 410213, 362234, 462250, 707882, 447857, 581439, 501263, 393719, 558083, 757390, 250914, 852669, 966593, 606216, 464800, 752161, 456146, 386518, 485390, 811439, 529282, 480388, 505709, 392195]
14775C92195J68756m2420j09792l5069K60431K82386l59501k75447J97550J76631
14765F55720B81187M72085j14882j82845K19319j39054j35829K92889J81590C99182
14754E22197P9420R3324l11023J63496N9712J59342P7897k89324J63932j78179
14744E40794M2846j92288J53267J64393j06052Q4267j88382J79279k35600k13495
14734B29029O25936R0643l40940n6149J91185j78973J30261j05520R9779J17363
14724H02614p4500J02576K29167l64938m365J35761J67288k14460M623k0432K70877
14713A034211l69980k80359M34622j23557r0248r8992K42517j70600K42924N50452
14703A370990l73429k23254j01061M04066k52442K24814l53010L48432E09229
$$ y = [392195, 560951, 518531, 408739, 373670, 634101, 916487, 556986, 281539, 479089, 655720, 281187, 753272, 638390, 455545, 674864, 535810, 399981, 692870, 874460, 399182, 522197, 601617, 694941, 383918, 547414, 607126, 766468, 844365, 555041, 718973, 540794, 583640, 391352, 544619, 709012, 602960, 687227, 498845, 678124, 442524, 229029, 854965, 945608, 604668, 548519, 739704, 560731, 690992, 585472, 685251, 802614, 728114, 830690, 1059857, 694919, 690554, 826315, 993603, 779143, 783766, 763334, 1034211, 664231, 383872, 818494, 694937, 604689, 505697, 748214, 577614, 820538, 1370990, 997561, 774307, 673246, 1077312, 824870, 1049684, 696674, 1045106, 509229]
14693I85038r9599J43462j00158j68232K50267l73867q9224M05142k71189L33567
14683A015207j69718L54623k44630J73294j751j06442j89718K17456M8110l09717
14673G86714J12491K51116n30563J62978J25321J82060l43806Q806J60696K33294
14663A149107J5956o0452j7743j9935K10900q3714l27107M46175k52357J23805
14653A184635l8199J10770j28344J4390K2613J24554K24537m21888J45548O4232
14643A302848p1459l19959J24326K86043k01528K32500M506J17780l22875J69614
14633A321796k95569M30661O1309k54589J69198n3300k20633K7221J06297J55588
14623A447979l0926J74944l69983K60893j83956K54873j30959o4986j40434J73797
$$ y = [985038, 885439, 1028901, 928743, 760511, 1010778, 636911, 547687, 952829, 681640, 1015207, 845489, 1200112, 955482, 1128776, 1127025, 1020583, 830865, 1048321, 1096431, 786714, 899205, 1150321, 619758, 782736, 908057, 1090117, 746311, 755117, 915813, 1149107, 1165063, 1104611, 1086868, 1066933, 1277833, 1194119, 867012, 1313187, 1060830, 1184635, 1146436, 1257206, 1128862, 1143252, 1165865, 1290419, 1514956, 1093068, 1238616, 1302848, 1231389, 911430, 1035756, 1321799, 1120271, 1352771, 1357277, 1475057, 1152182, 1321796, 1026227, 1456888, 1518197, 1263608, 1432806, 1379506, 1158873, 1186094, 1292391, 1447979, 1417053, 1591997, 1222014, 1482907, 1298951, 1553824, 1422865, 1357879, 1217445, 1391242]
14613A391242J35470q1690J9982O1060p5142J99318k64720j00538K22583l4155
14603A473410J8407J35737o1175J55559r4942Q346N5985J14955k23020o5602M4688
14592A562348J03445J1655m6531K41352L3365K7136k30401J82443m64550L92303
14582A812565l51042M46822J93315k64344M4885L3846Q5732n5993J47691P5215
14572B168692k79720K72393R987r6903K91343k52184Q5764J33460K75508k37213
14562B371127J89714j2837J49991M6410J24955K97834k64106L66789L47786L35369
14552C953032M1540Q86202M29952K159976L293681R837177J5260229M489644j6301503
14543B4049930A0331237E161573j796411n80891o27898J5991j77232J72860j34883
$$ y = [1391242, 1526712, 1445022, 1465004, 1526064, 1450922, 1650240, 1385520, 1284982, 1507565, 1473410, 1491817, 1627554, 1566379, 1721938, 1626996, 1635342, 1691327, 1806282, 1583262, 1517660, 1562348, 1665793, 1677448, 1630917, 1872269, 1905634, 1932770, 1702369, 1884812, 1420262, 1812565, 1461523, 1908345, 2101660, 1837316, 1882201, 1916047, 2001779, 1945786, 2093477, 2168692, 1888972, 2161365, 2171352, 2074449, 2365792, 2113608, 2199372, 2332832, 2608340, 2371127, 2560841, 2548004, 2697995, 2744405, 2869360, 3167194, 2903088, 3269877, 3617663, 3953032, 3994572, 4880774, 5310726, 7470702, 10764383, 20601560, 35861789, 40351433, 24049930, 10331237, 5161573, 3365162, 2784271, 2156373, 2172364, 1995132, 2167992, 2033109]
14534B033109K45361n02190J15454K67168N1692Q3172p1083K19917k08178M2209
14524B276631K45181k97940L04011k16696K88567P5841K7267j50537K30617l12999
14514B469943m139k9051O92213l12207M7147o7929q8190M44388n18562K50127
14504B883740r9712M59168j70207k31303L45554K03457m23323L32279k18377J12946
14494C194222j33844K96559k64159K01776J19005k4614K08411N7920L99337n05013
14484C549600p3342L45833j71983M41776l92493q8961K63714K8434J41392j01851
14474C942119j21695L84180q6352O2212L09692j2431j37180k297j73646N63618
14464D728220l6768l1280J24032j61720K58829k60714J68952L695K92619j52953
$$ y = [2033109, 2278470, 1776280, 1891734, 2158902, 2210594, 2293766, 2222683, 2442600, 2234422, 2276631, 2521812, 2223872, 2527883, 2311187, 2599754, 2675595, 2702862, 2552325, 2782942, 2469943, 2465804, 2436753, 3128966, 2816759, 2863906, 2795977, 2707787, 3152175, 2633613, 2883740, 2784028, 3243196, 3072989, 2841686, 3187240, 3390697, 2967374, 3299653, 3081276, 3194222, 3060378, 3356937, 3092778, 3294554, 3413559, 3388945, 3597356, 3655276, 4054613, 3549600, 3476258, 3822091, 3650108, 4091884, 3699391, 3610430, 3874144, 3902578, 4043970, 3942119, 3820424, 4204604, 4118252, 4180464, 4490156, 4477725, 4340545, 4338248, 4164602, 4728220, 4691452, 4660172, 4784204, 4622484, 4881313, 4620599, 4789551, 4793246, 5085865, 4932912]
14454D932912K68047J07998l63928j04178M56035P7126P6867l869K47284m01173
14444E293121N20770J93292k2453j39102l60540L61152K54592j25022M48016N95
14434F424421P596J73994R3948k25985M25022N5412K44894j234p6980N3860N8537
14423G233485L52496j26565L48657N2863M720K93635K23153N2131J04375J78491
14413H717441k12518K76181o5228l6544M63978L38491j64755M24218R9725J20433
14403I961422P0899j44572M21947O2075L78307K81229J3480R4436L23636J29080
14393A1591939L2505L01725J08782L12838K77163N19594j69700K48389K98886
14384A3522121k55129N59786M29873R2562J79371L57910L76666N6655K84751O95290
$$ y = [4932912, 5200959, 5308957, 4945029, 4840851, 5296886, 5374012, 5450879, 5447010, 5694294, 5293121, 5813891, 6007183, 5984730, 5845628, 5485088, 5846240, 6100832, 5975810, 6423826, 6424421, 6432017, 6606011, 6699959, 6473974, 6898996, 6954408, 7199302, 7198068, 7121088, 7174948, 7233485, 7585981, 7459416, 7808073, 7860936, 7865656, 8159291, 8382444, 8434575, 8538950, 8717441, 8504923, 8781104, 8715876, 8679332, 9143310, 9481801, 9317046, 9741264, 9840989, 9961422, 10032321, 9887749, 10309696, 10371771, 10750078, 11031307, 11044787, 11139223, 11462859, 11591939, 11624444, 11926169, 12034951, 12347789, 12624952, 13144546, 12974846, 13223235, 13522121, 13266992, 13826778, 14256651, 14349213, 14528584, 14886494, 15263160, 15319815, 15604566, 16299856]
14374A6299856M00228q9687J62977M72244L26805O21128L23866L10376O92099
14365A9519892K4248P16598j01088Q67353J74336O11029M88982K81133Q60400
14356B3442883L69619N49700M78999N50408O86729P61110O46220O36170O93072
14347B8814910M04247J163922R51040M18650R05664Q79101Q90346P97504J250174
14338C6475558M57186J332769Q30888J294468J141154J301518J333075J257145
14330D5423761J388704J655734J210248J717027J844801J831198J389042J959428
14322E8419943K219670K340088K326980J862652K450039K687267L092827K350952
14314G7750418L145041K901721L432591L417035L651809L790574L913702M379726
$$ y = [16299856, 16700084, 16610397, 16773374, 17245618, 17572423, 18193551, 18517417, 18827793, 19519892, 19544140, 20260738, 20159650, 21027003, 21201339, 21812368, 22301350, 22582483, 23442883, 23812502, 24362202, 24841201, 25391609, 26078338, 26839448, 27485668, 28121838, 28814910, 29219157, 30383079, 31334119, 31752769, 32658433, 33537534, 34427880, 35225384, 36475558, 36932744, 38265513, 39096401, 40390869, 41532023, 42833541, 44166616, 45423761, 46812465, 48468199, 49678447, 51395474, 53240275, 55071473, 56460515, 58419943, 60639613, 62979701, 65306681, 67169333, 69619372, 72306639, 75399466, 77750418, 80895459, 83797180, 87229771, 90646806, 94298615, 98089189, 102002891, 106382617]
14306A06382617M528341M550328N113996N487094N442439O210245O097060O902031
14298A50714151P141851P349426P888558Q270978Q900414R223386R982752J0045128
14290B19516644J0515254J1232098J2168468J2087089J2951398J3142223J3218122
14283C04831296J4102997J3628018J4404848J3639581J3957612J3492521J2936626
14276D00993499J1709226J0871521R683029P338432M617695M53817j586753k56372
14268D43824094r66691j981702m894069p109974q491884j0434636j2088980j2785097
14260C85071061j3882276j4060950j4577162j5048949j4378502j3789240j3840711
14253B85493271j3381391j3300468j2662446j2109533j0905436j0995088j0291360
$$ y = [106382617, 110910958, 115461286, 120575282, 126062376, 131504815, 137715060, 143812120, 150714151, 157856002, 165205428, 173093986, 181364964, 190265378, 199488764, 209471516, 219516644, 230031898, 241263996, 253432464, 265519553, 278470951, 291613174, 304831296, 318934293, 332562311, 346967159, 360606740, 374564352, 388056873, 400993499, 412702725, 423574246, 433257275, 440595707, 445213402, 445667219, 444080466, 443824094, 442857403, 440875701, 435981632, 428871658, 420379774, 409945138, 397856158, 385071061, 371188785, 357127835, 342550673, 327501724, 313123222, 299333982, 285493271, 272111880, 258811412, 246148966, 234039433, 223133997, 212138909, 201847549]
14246B01847549r516220r104081q415999q019080p821410p525536o628384o691737
14238A38125102o001645n097661n786608n279761m638435m936517l911051l989660
14230I8483764l762135m217574l221109l294023l417027l018028k269305k818790
14222G2465773k790591k485877k235438k054681j838242k175241k304716j797891
14214E4783096p45809k060350j613882j940523j331889j401735j055610j147458
14206D3485840j015074j544680j074264j457120j212131n87264m62426p23360
14198C5409521j320536j075439n98198n93026j023664o96427o97268j165758p06152
14189B7533053p63368J3374r97077m67800o33666m55694n99481l86513m34178
$$ y = [201847549, 192331329, 183227248, 174811249, 166792169, 158970759, 151445223, 144816839, 138125102, 132123457, 127025796, 121239188, 115959427, 111320992, 106384475, 102473424, 98483764, 94721629, 90504055, 87282946, 83988923, 80571896, 77553868, 75284563, 72465773, 69675182, 67189305, 64953867, 62899186, 61060944, 58885703, 56580987, 54783096, 54037287, 51976937, 50363055, 48422532, 47090643, 45688908, 44633298, 43485840, 42470766, 40926086, 39851822, 38394702, 37182571, 36595307, 36132881, 35409521, 34088985, 33013546, 32415348, 31822322, 30798658, 30102231, 29404963, 28239205, 27533053, 26769685, 26783059, 25785982, 25318182, 24684516, 24228822, 23629341, 23242828, 22808650]
14180B2808650m97474p10822l755r51272m37964l11977k75733l72564k80068q31598
14170A8135423O4462m85821k78512q11844K33941j06937l94274m22286n24239
14161A5409913k62244K0980m93622m4429o76903Q5331k8192m54802k90473m89184
14151A2776375J16455o1784l90470k79380j39452K28458n10522m44506N2226l34778
14141A1012622n5617k18074J53365k09962j78790k09273k21273k14557j75900
14132I682541J14049j05812l24709j55916N0079k9702j69190J16240q75057J99999
14122H502522Q2216j41991l95188K96927q5007k92610k66867k9715j01766j73970
14112G394551J91621l10341j15680j71928o15247P36670k60883j87569P7063k18297
$$ y = [22808650, 22311176, 21600354, 21596599, 20645327, 20207363, 19895386, 19619653, 19247089, 18967021, 18135423, 18199885, 17714064, 17435552, 16623708, 16857649, 16750712, 16356438, 15934152, 15409913, 15147669, 15168649, 14675027, 14630598, 13953695, 14039026, 14010834, 13556032, 13265559, 12776375, 12892830, 12831046, 12440576, 12161196, 12021744, 12250202, 11739680, 11295174, 11347400, 11012622, 10957005, 10738931, 10892296, 10682334, 10503544, 10294271, 10072998, 9858441, 9682541, 9796590, 9690778, 9366069, 9210153, 9260232, 9230530, 9061340, 9177580, 8302523, 8502522, 8584738, 8442747, 8047559, 8344486, 8259479, 7966869, 7700002, 7670287, 7568521, 7394551, 7586172, 7275831, 7160151, 6988223, 6372976, 7109646, 6848763, 6661194, 6738257, 6519960]
14102F519960l36609K02707N183k38412j8126j78438k01714J90950j00595J5729
14092E860635J31689l78657k82546L37278k02093j97070p0322J25820o4863q5438
14082E174433j26610J00229j21586J9357J76093k8232m51400O740j78696K21243
14072D791571P668r4726j10697K6700j69154p2571L09868j93170l51442k0805
14062D123242j30514M69215j45012j1236n07347K03712p9768j79100Q9071j86665
14052C645598R8302M0636J7662k42822O8764J6021j07415N2902l7194J1622J11727
14041C675803k34811m19426J5139L45438r6399N3666m4314l31540L1957r4565
14031B900948J59360K46460j81507l67047L07145M1427J9992k42361j43236j05459
$$ y = [6519960, 6183351, 6386058, 6391241, 6152829, 6134703, 5956265, 5754551, 5945501, 5844906, 5860635, 5992324, 5613667, 5331121, 5668399, 5466306, 5269236, 5198914, 5324734, 5259871, 5174433, 5047823, 5148052, 5026466, 5045823, 5221916, 5193684, 4742284, 4749024, 4570328, 4791571, 4799239, 4704513, 4593816, 4620516, 4451362, 4378791, 4688659, 4495489, 4144047, 4123242, 3992728, 4461943, 4316931, 4305695, 3798348, 4002060, 3922292, 3743192, 3832263, 3645598, 3743900, 3784536, 3802198, 3559376, 3628140, 3644161, 3536746, 3589648, 3552454, 3564076, 3675803, 3440992, 3021566, 3036705, 3382143, 3285744, 3339410, 3295096, 2963556, 2995513, 2900948, 3060308, 3306768, 3125261, 2758214, 3065359, 3106786, 3126778, 2884417, 2741181, 2635722]
14021B635722j79210L24763R7209L5908j19439l27281K48078k42966K43843k14091
14011B502536P5308m18655L07229j31545L99853k51477q8526O1795k34270K14324
14001B436572J30626j89322j02815J41468k63370J11825j8520O8081L0125j9459
13991B325211L27742K68672J095380J883182Q307170J6005081J0023127j2395238
13983B7840327j2956524n423738k793242j225023j090043l03009n03623j14845
13975C430280k95816j60561j12098J51617n21892P0641m5250j34133n3329J69575
13965B499034J65461l19676Q7876N4467l72294L00836k05292k9823J13689k77652
13955B016626j09182J68724N4492J13643k10185j45290P1190J52708m7263l31569
$$ y = [2635722, 2456512, 2781275, 2878484, 2914392, 2794953, 2467672, 2715750, 2472784, 2716627, 2502536, 2577844, 2159189, 2466418, 2334873, 2734726, 2483249, 2394723, 2456518, 2222248, 2436572, 2567198, 2377876, 2275061, 2416529, 2153159, 2264984, 2246464, 2314545, 2344670, 2325211, 2652953, 2921625, 4017005, 5900187, 14207357, 30212438, 40235565, 27840327, 14883803, 9460065, 6666823, 5441800, 4351757, 4048748, 3545125, 3430280, 3134464, 2973903, 2861805, 3013422, 2491530, 2562171, 2516921, 2382788, 2329459, 2499034, 2664495, 2344819, 2432695, 2487162, 2114868, 2415704, 2210412, 2180589, 2294278, 2016626, 1907444, 2076168, 2130660, 2244303, 2034118, 1888828, 1960018, 2112726, 2065463, 1733894]
13945A733894M64703m52557j44835L80413j26044j90760M70925l59914J00552
13936A876377j42700P185j30139K43700J45803k10863P873O7670k23217k64763
13926A376926L29327J22j55782q3844N09166r4609l78769l62286M94445j83057
13916A451639M48690m00006j46775K26176R0122j17517k01081O06374m97986O6063
13906A525699j53023o4689K93610j76674j51001L54096l15859L99320o9437N7267
13896A699309j74772l24021M61529l97948j29722N17429l04278K2056J69055Q9117
13886A627754k89975R5312p192n40195M92662j64297j05718K41469M2965Q6735
13876A479520k80882k61734M50720J966l18820K61223k06089L22123l40275k33314
$$ y = [1733894, 2198597, 1746040, 1601205, 1981618, 1855574, 1664814, 2135739, 1775825, 1876377, 1733677, 1740862, 1610723, 1854423, 2000226, 1789363, 1797236, 1864906, 1641689, 1376926, 1706253, 1706375, 1550593, 1466749, 1975915, 1881306, 1502537, 1140251, 1634696, 1451639, 1900329, 1500323, 1353548, 1579724, 1669846, 1552329, 1351248, 1957622, 1459636, 1525699, 1372676, 1307987, 1601597, 1424923, 1273922, 1628018, 1312159, 1711479, 1642042, 1699309, 1524537, 1200516, 1662045, 1264097, 1134375, 1651804, 1347526, 1369582, 1538637, 1627754, 1337779, 1433091, 1425899, 885704, 1378366, 1214069, 1108351, 1349820, 1392785, 1479520, 1198638, 936904, 1387624, 1389590, 1070770, 1331993, 1125904, 1448027, 1107752, 874438]
13866H74438O13665l32525k3731L9366R5068m1078k02521L15691K62k24338l4153
13855A080144L6319K2669M1146J93438k01023l1235K1377o7831J93067l76724
13845I11347K72285k14782K28855J10019l8669j66235k13177m9651N55327m62581
13835I32738K75633J5726l77981M87786l28220k28534Q6865j55625r5045L57767
13825I71110j79484L76928n18504J47930J26797K86587k52631J79565m4946j63693
13815I29659j85281L32587l37235j01506k34331N50087J75067l88355L7708J17806
13805H96206j02284L47649K1913k38423p32K04148m11023M8664j0657j18221J57052
13794G94292O7500n1341J80932k37408J10836M9446k16377K18345j04782L43960
$$ y = [874438, 1488103, 1155578, 1131847, 1171213, 1266281, 1225203, 1022682, 1338373, 1338635, 1114297, 1080144, 1116463, 1139132, 1180278, 1373716, 1172693, 1141458, 1162835, 1095004, 1288071, 911347, 1183632, 968850, 1197705, 1307724, 1269055, 1102820, 889643, 839992, 1395319, 932738, 1208371, 1224097, 846116, 1333902, 1005682, 777148, 864013, 708388, 613343, 971110, 791626, 1168554, 650050, 797980, 924777, 1211364, 958733, 1138298, 1093352, 929659, 744378, 1076965, 739730, 638224, 403893, 953980, 1129047, 740692, 778400, 896206, 793922, 1141571, 1163484, 925061, 924329, 1128477, 717454, 766118, 755461, 637240, 794292, 861792, 810451, 991383, 753975, 864811, 914257, 697880, 916225, 811443, 1155403]
13784A155403m31122N9122K04477m54102L5945K55586M1173k88289J98450k10659
13774E65984J43392j52833K81415Q0783J6130C96537R0979L12784l58601K83225
13764G24924J45619k03366J24535l5758k06126Q9033K9992k10259L10331C47842
13753H76060m06309M11479j24153k37253L34053Q4703m54482K08709M8563K548
13743G43918j0021j33850k61813O09822k58245R2179k10233j8660N7637o4503
13733E46231J97699K6487l45514K35477L9749j4498j34827M5316R5558n0386O9316
13722G10608q8105J21444k92187J62389P2868J10899K04381j20616j66200B87149
13711D89311K05757j42709B44475L17192O4078r8959k00795J7123L74297l5333
$$ y = [1155403, 724281, 783403, 987880, 533778, 569723, 825309, 866482, 578193, 776643, 565984, 709376, 556543, 837958, 918741, 934871, 396537, 487516, 800300, 441699, 724924, 870543, 667177, 791712, 755954, 549828, 638861, 668853, 458594, 768925, 347842, 876060, 469751, 881230, 757077, 519824, 853877, 938580, 484098, 692807, 741370, 743918, 733897, 600047, 338234, 948056, 689811, 781990, 571757, 553097, 610734, 546231, 743930, 770417, 424903, 660380, 700129, 685631, 550804, 596120, 691678, 641292, 710608, 622503, 743947, 451760, 614149, 687017, 797916, 1002297, 881681, 715481, 287149, 489311, 695068, 552359, 244475, 561667, 625745, 526786, 325991, 343114, 717411, 682078]
13701F82078j82141q5883J33442N94238A17711O57494o5829l35292N210K46437
13691F25731j47399J462K42466n4320o6863j47496K33455B52027J06029P9622
13681D37678J37754k22523j0116K06851K30409l59310J47376R3976q9899P415
13671E79611j7345r2670B15668K88244K0615N9079j78953N3023K33554j96433
13661D94797J08953p8655k40326K07662P9277m1937Q8620m3500J241K69631l63950
13650D81813K19740j85480p5817L04668B70456J24800K954p8612J25596J58724
13640F03918k33095K76316A74349j4754L09619L05954A75722l9011K83998J2718
13630D33427J16268p6971j79995J73240L12651l14111l2330o1828N4807J22927
$$ y = [682078, 499937, 414054, 547496, 1141734, 117711, 775205, 709376, 374084, 379294, 625731, 478332, 479794, 722260, 667940, 601077, 453581, 687036, 252027, 358056, 437678, 575432, 352909, 342793, 549644, 780053, 420743, 568119, 662095, 572196, 579611, 562266, 469596, 215668, 503912, 524527, 583606, 404653, 457676, 691230, 494797, 603750, 525095, 284769, 492431, 571708, 529771, 618391, 574891, 576132, 845763, 481813, 701553, 516073, 440256, 744924, 270456, 395256, 398210, 319598, 445194, 603918, 370823, 647139, 174349, 159595, 469214, 775168, 175722, 136711, 420709, 433427, 549695, 472724, 292729, 465969, 778620, 464509, 432179, 370351, 425158, 548085]
13620E48085B56842K65389k47109J3560J43604j65789j07935M75447l5438k77492
13610C21079Q2670q2383P4970j97405J64000Q0067q8238q9686J6603j6199K01145
13599D66623n0173J10783r431j07828m3424k6119K64092A21199K89597J19855
13589E30651B16343l2401L99341j99787J08419k10919J34001A10039b4206C92598
13578F54380l26151k4401O2576J31953A1429N69753j81478A91181J53692j9541
13568C25332j04574M3268k2107J46664J9135K2691j91225K55489j92668L0390
13558C32395K01699G3917N86662B78006J13829I9604m0639K87369j64853J13030
13548B94511j07939J55374a4548E43833A57306K70018P2487B39282l2391i6615
$$ y = [548085, 256842, 522231, 275122, 288682, 432286, 266497, 158562, 634009, 598571, 321079, 403749, 321366, 396336, 198931, 362931, 442998, 354760, 265074, 281677, 265478, 466623, 416450, 527233, 517802, 409974, 366550, 340431, 604523, 121199, 410796, 530651, 216343, 183942, 583283, 383496, 491915, 280996, 414997, 110039, -24206, 392598, 654380, 328229, 303828, 366404, 498357, 11429, 581182, 399704, 191181, 344873, 325332, 220758, 264026, 241919, 388583, 407718, 430409, 239184, 494673, 302005, 332395, 534094, 73917, 660579, 278006, 391835, 99604, 58965, 346334, 181481, 294511, 186572, 341946, -14548, 543833, 157306, 427324, 499811, 239282, 206891, -96615]
13537C60805J19627k20289A18141K35703K7407j45022R1950j767j22427b3990
13526C21459N5836j69083L0787M79757I6260Q0124a48576C83086j01675K10428
13516D91839A47874K26867D1579J23851P3016L4675K35159k21144J46156a2723
13505D62346q7597O3981k2639M0436L10485a04979A43158l1821M2131K61548k1311
13494C93705j66539A01978l8247L19600J85512A53101D1031L26892G7694L42481
13484D20175Q4257k27093L9840Q003A48605J32394N4364A29055K09561J75411
13474E14027n8686k09270E3288J12875J13442E2834B2900K73755K68004A34524
13463B61609j18609O3954J06831j925J69167r5880j47165L6481L3602n5065q5657
$$ y = [360805, 480432, 260143, 118141, 353844, 381251, 236229, 328179, 326412, 203985, -23990, 321459, 377295, 208212, 238999, 718756, 96260, 176384, -148576, 383086, 281411, 491839, 147874, 374741, 41579, 165430, 238446, 273121, 508280, 287136, 433292, -12723, 462346, 374749, 438730, 416091, 456527, 767012, -104979, 143158, 111337, 153468, 415016, 393705, 227166, 101978, 63731, 383331, 568843, 153101, 41031, 367923, 77694, 420175, 504432, 277339, 317179, 325182, 148605, 280999, 335363, 129055, 338616, 514027, 455341, 246071, 53288, 166163, 279605, 52834, 22900, 296655, 564659, 134524, 261609, 143000, 206954, 313785, 311860, 481027, 385147, 237982, 274463, 308065, 253000, 167343]
13452A67343K3719M09677k94156A01155n690K1548J0601J00364p4823g9C26479
13440b0829B38464o485g9219B30458r5444J32423L21620B21551a4182A82696k2056
13429A60640J24476H6230K17356A39353L01000i144A60697q0258J70533h2118
13418D47383p4333j06932r6814J8539L03918k30724F4732p246O1382j339K51312
13407C68841A57030l0302A8712J08215J4173K6784K1560h5798C22605J71874J6750
13396E11229H9264J67876e8455G7159M03781D9618J47114J52102P7125B9154J75324
13385B04478J57852n1888j3739l9780P9224K32386k74124A32612B1215N7151K87832
13374C66198m69K15940A29157J8623C2063P1250J29185J68655A26629R5705L7923
$$ y = [167343, 191062, 600739, 306583, 101155, 95465, 117013, 127614, 227978, 153155, -79, 326479, -20829, 238464, 231979, -79219, 230458, 135014, 267437, 589057, 221551, -14182, 182696, 160640, 285116, 86230, 303586, 139353, 440353, -9144, 160697, 80439, 250972, -82118, 447383, 373050, 266118, 169304, 187843, 491761, 261037, 64732, 57486, 118868, 117529, 368841, 157030, 126728, 18712, 126927, 141100, 167884, 189444, -85798, 322605, 494479, 511229, 89264, 257140, -58455, 77159, 480940, 49618, 196732, 348834, 425959, 29154, 204478, 362330, 310442, 296703, 256923, 336147, 568533, 294409, 132612, 21215, 78366, 366198, 365729, 581669, 129157, 147780, 32063, 103313, 232498, 401153, 126629, 222334, 260257]
13363B60257k46J51642l8664A36727a25433A04808b0654C9123M2013r600K35503
13352C07039l4785k9609d4301A85983L2371r6580J88528n6596A01818k7067J85384
13341B60135R7307J95011B13926J41799o4337J77979k22076c9871A68022a6149
13330C49551h2038B20517j3098K14254A86367D8983K60367A3062f983A72796P2754
13319B45550J19042l8114A08775j1855b9414G7536O5420O1161O0767j00402L12322
13308D76804A38878A1108K67806J13718j94091J12799d3567l0246k13389A29264
13297G5597J57690G451R2751K1630R8532f485A56418F7677O8099c28436C08403
13285A48486J3977P7475J50950a03783A32224J73757j47059L00673B22342j09420
$$ y = [260257, 260011, 411653, 372989, 136727, -125433, 104808, -20654, 39123, 81136, 71536, 307039, 272254, 242645, -44301, 185983, 218354, 121774, 310302, 253706, 101818, 74751, 260135, 357442, 552453, 213926, 355725, 291388, 469367, 247291, -39871, 168022, -16149, 349551, -82038, 220517, 207419, 421673, 186367, 48983, 309350, 13062, -6983, 172796, 245550, 364592, 326478, 108775, 96920, -29414, 77536, 142956, 204117, 264884, 164482, 476804, 138878, 11108, 278914, 392632, 198541, 311340, -43567, -73813, -287202, 129264, 75597, 233287, 7451, 100202, 121832, 220364, -6485, 156418, 67677, 135776, -328436, 308403, 148486, 162463, 239938, 390888, -103783, 132224, 305981, 158922, 459595, 222342, 112922]
13275A12922N1597J02205M3844a65382O9814l4098A23643K27358a26779B28984
13264C86176b2073A81931A7561R8351l9238j9814P4215J41293a92510B83551D6939
13252D18211E0449J6889k1666B902J66353k3422P1466J1697a64803A65849a76014
13240B96856B1130K37175A27900M09579k48518J9537n3569G1790k8672J7198a12018
13228C66174A39072a76359A93932J44360F8400O4940J33322p1166L0779M2416
13218B68691H2220l8166L21796A41184K30839p3075K0101B9587O3274a05024A61413
13206a21974b7239H9674h7579j9049d5131C61214j15076I2456b96945C27053O0141
13195C87194A40603D8964J23215j4653A816K6845K77150p295C3004K80131h494
$$ y = [112922, 164519, 266724, 310568, -165382, -95568, -129666, 123643, 351001, -126779, 228984, 386176, -22073, 181931, 17561, 115912, 76674, 56860, 131075, 272368, -192510, 283551, 46939, 418211, 50449, 67338, 45672, 2902, 169255, 145833, 217299, 228996, -164803, 165849, -176014, 296856, 21130, 258305, 127900, 537479, 288961, 308498, 254929, 71790, 43118, 60316, -112018, 366174, 139072, -176359, 193932, 338292, 68400, 133340, 266662, 195496, 226275, 268691, 82220, 44054, 365850, 141184, 372023, 298948, 319049, 29587, 92861, -105024, 161413, -121974, -27239, 89674, -87579, -106628, -45131, 361214, 246138, 92456, -296945, 327053, 387194, 140603, 48964, 172179, 157526, 1816, 28661, 305811, 298516, 33004, 313135, -8494]
13183a33548A08208b33612B79400I4708a44591A10317N1675o5019M14313C4767
13172B15666C8526M9396N827a10258B05246I6696m1045d6944m8668C15661A10950
13160D36766I9496K12132O1632G7468J84289a10112n1541C36494A44693b96221
13149B06150J93874a94723A46023h1808L4070B30330M6467B4331f604D62001j99933
13138B62068H8838d7071N03A04218l7608A2016J67548o4991L08517a02291L6697
13127f5594p2334A72593G6065K9750J36579l5519f6916A43038e8180E7894M2876
13116A00770c11125C15914j09464J398a11247B84845J3316a13036a1119n4941
13106f6060C05152a01488k1154B16944a82681i63A02973a777A56804k4719o3090
$$ y = [-133548, 108208, -233612, 279400, 94708, -144591, 110317, 161992, 96973, 511286, 34767, 215666, 38526, 87922, 93749, -110258, 205246, 96696, 55651, -46944, -95612, 315661, 110950, 436766, 99496, 311628, 373260, 77468, 261757, -110112, -161653, 336494, 144693, -296221, 206150, 400024, -194723, 146023, -81808, -47738, 230330, 276797, 24331, -6604, 462001, 262068, 88838, -47071, -46568, 104218, 66610, 12016, 179564, 114573, 423090, -102291, -65594, -137928, 172593, 76065, 105815, 242394, 206875, -66916, 143038, -58180, 57894, 100770, -311125, 315914, 206450, 207848, -111247, 284845, 298161, -113036, -11119, -66060, 305152, -101488, -122642, 216944, -182681, -963, 102973, -1777, 156804, 132085, 68995]
13095F8995a709A7619J17016C6354J11358n810g962B45560F146N00736A15327
13083B29504b53474C69859c6822D61241A6213b7427A93141a75106B20972A020
13072A4113K32802r9633P7776J47384A10307k1011M01235a07242o4855G2939L4423
13061A07362R9475d6885B06622R0246f3799K5733j2143B61732L20503B61839J05063
13050C66902j31303a29542C40877G6995b79815C08069r8064A04661J3464d6547
13039e4415A11759a72716h333B59770g8829c2124r269I8561J87363b84985G0817
13027E01074k04054G8254L82430g7568b6079A02152M8520L9739K87699A00868
13016C9003K05228A00303b922A45825M9656r6052l6010J78665a6990C25986a66791
$$ y = [68995, -1709, 17619, 134635, 36354, 147712, 141902, -7962, 245560, 6146, 506882, 115327, 229504, -253474, 369859, -36822, 461241, 16213, -27427, 193141, -175106, 220972, 1020, 14113, 246915, 147282, 225058, 372442, 110307, 89296, 490531, -107242, -172097, 72939, 107362, 206837, -46885, 206622, 296868, -63799, -38066, -50209, 261732, 582235, 261839, 366902, 235599, -129542, 340877, 76995, -279815, 308069, 210005, 104661, 118125, -46547, -54415, 111759, -172716, -8333, 259770, -78829, -32124, -41393, 98561, 285924, -284985, 70817, 501074, 297020, 78254, 460684, -77568, -26079, 102152, 150672, 190411, 478110, 100868, 39003, 244231, 100303, -2922, 145825, 195481, 99429, 63419, 242084, -16990, 325986, -166791]
13004G9749b7174I4078C8812L6347e5964o4453C20133A19019b169A40066L8077
12993A78143J5780q3446d2956j91293I5201K46185C5793J8443q102L8947k3562
12982F1519L4966c2922p610B58263J59393j72840H0403K73168B1625L87830a55708
12970a70659j04148J34438A09875a88378A25836K23733C0693d9721D04861e8227
12959B69504b84108D14427A17592F443M8369L45970p6941d8347j39673C8152d245
12947A12914a25024A65474e9193A78878l6300F261a83892N2621q3622d3121o4927
12936a08048G9248a82335B67077b730j61043K7252C8258L53091E9409K95993h0355
12924h2572A25473D1312Q2376C8178m40j4928e0118B20643k1241E3743a34349
$$ y = [79749, -27174, 94078, 38812, 75159, -55964, -120417, 320133, 119019, -2169, 140066, 178143, 193923, 110477, -42956, -234249, 95201, 341386, 35793, 54236, 46134, 85081, 61519, 96485, -32922, -40532, 258263, 417656, 244816, 80403, 353571, 21625, 409455, -155708, -170659, -274807, -140369, 109875, -188378, 125836, 349569, 30693, -49721, 404861, -58227, 269504, -284108, 414427, 117592, 6443, 54812, 400782, 323841, -48347, -188020, 38152, -4245, 112914, -125024, 165474, -59193, 178878, 142578, 6261, -183892, -131271, -214893, -43121, -108048, 79248, -182335, 267077, -2730, -163773, -136521, 38258, 391349, 59409, 355402, -80355, -82572, 125473, 41312, 123688, 38178, 37738, 22810, -50118, 220643, 199402, 53743, -134349]
12912A31780D6369f4636A881J44271l0244J7725n5846h2598r3413A81576p1187
12901A10389a01953A12184B6480R4004a16126l0683A76186Q714p5414P1713R1739
12890B72938A15872J42196l1697J47647J03186E8953J7746l0022K55344j02823
12880A99198p2412b0217o5590M1262H9397H53J69129M8268J08595a21620D2821
12868d2357m325r7174A3406Q5543i9904K3301l2448B36370K5216a89364b724F4449
12855a9449C42669b8619l7750B63929b15649A56887b8474p8885d366E02603A25627
12843A95552D2864K42807q4646k2231k2107j5252K9087J55573A43930K87037a6878
12831A2594M6963j0917J94860A00606d0399k04330L6781G1397A6569a59547L0093
$$ y = [131780, 46369, -64636, 1881, 146152, 115908, 133633, 77787, -82598, -176011, 181576, 110389, -101953, 112184, 26480, 120484, -116126, -146809, 176186, 184900, 109486, 181199, 272938, 115872, 258068, 226371, 374018, 477204, 58953, 76699, 46677, 302021, 199198, 126786, -20217, -85807, -44545, 89397, 853, 169982, 218250, 326845, -121620, 42821, -42357, -46682, -143856, 13406, 98949, -99904, -76603, -109051, 236370, 261586, -189364, -2724, 64449, -19449, 342669, -28619, -66369, 263929, -215649, 156887, -28474, -107359, -4366, 502603, 125627, 195552, 42864, 285671, 201025, 178794, 156687, 141435, 170522, 326095, 143930, 430967, -16878, 12594, 59557, 48640, 243500, 100606, -40399, -244729, -207948, 71397, 16569, -159547, -129454]
12820a29454I0143m1466K83426i0443B90143b16981R1553I7687K21360a39629
12809I0818M2783K24972i6127D5578J40904h849q7074M2613H4728K22216k0615
12798B86329A00865M0650E893M7011A9011R711J8932a34790A50830a12925A33884
12786d8014B11245F3245P7836a29394B45821c58491B34206p6808p944a01019e142
12774B70553a8925n8299G3239M8507b5835A3773h207A13478J87931C8801c7092
12762e4595k00239H5340b37092J17204C5029b17092B4804j111A0652J81512a30838
12750h8563j4978J7732A35406a00038a9381B5627P2156P4853F1335L13970A19160
12738A02680P4461Q408J5900i8512o8025B4924O8783K62232K6014A00474d04632
$$ y = [-129454, 90143, 48677, 332103, -90443, 290143, -216981, -125428, 97687, 319047, -139629, 90818, 133601, 358573, -96127, 45578, 186482, -8849, -95923, -53310, 84728, 306944, 286329, 100865, 141515, 5893, 52904, 19011, 28722, 47654, -134790, 150830, -112925, 133884, -48014, 211245, 63245, 141081, -129394, 245821, -358491, 234206, 157398, 149454, -101019, -5142, 270553, -18925, -77224, 73239, 121746, -25835, 13773, -8207, 113478, 301409, 38801, -37092, -54595, -254834, 85340, -237092, -119888, 35029, -217092, 24804, 23693, 10652, 192164, -130838, -88563, -103541, -85809, 135406, -100038, -19381, 25627, 97783, 172636, 61335, 375305, 119160, 102680, 177141, 185549, 201449, -98512, -166537, 24924, 93707, 355939, 381953, 100474, -404632]
12726D21007j10556D6979J44049b6681C6841O6767J42895m9979j4543a16566C9326
12714A59819p2953a95328d0124o054D4298M3439O2092B7431L01326j51584D7151
12702a05572C9257K18377n9459E5012h4168j17296I1934J51254D8650d1902q9579
12691a31481k5083B08504q5189a1425D9611Q2690E446J31283C6032J47960F7680
12679e8727K1133D3150h581C1511j5371a43690e3166C9032f3192B23613c8567
12667b3981B22037m9225J53305N167j56030Q824E825N5536J55507a04254H2830
12655B70138A3001c73456A12239K39133F7129b07099B68505K00574a49230A46478
12644a21995C49095o0287c07194C7627O5769K38655b69393a31722F4590E953L53536
$$ y = [421007, 310451, 46979, 191028, -26681, 36841, 103608, 246503, 196524, 181981, -116566, 39326, 159819, 86866, -195328, -40124, -46178, 44298, 87737, 149829, 27431, 328757, 177173, 47151, -105572, 39257, 257634, 198175, 55012, -84168, -201464, 91934, 243188, 48650, -41902, -131481, -156564, 208504, 123315, -11425, 49611, 132301, 5446, 136729, 36032, 183992, 67680, -58727, -37594, 43150, -8581, 31511, 16140, -143690, -53166, 39032, -63192, 223613, -38567, -23981, 222037, 172812, 326117, 331284, 175254, 184078, 5825, 61361, 216868, -104254, 82830, 270138, 13001, -373456, 112239, 351372, 67129, -207099, 268505, 469079, -149230, 146478, -121995, 349095, 288808, -307194, 37627, 103396, 342051, -269393, -131722, 64590, 5953, 359489]
12633C59489j50632P9200l5360B1830a03851B15789n5004c7483A22568L9054C0866
12621B02898J63796p9816j05566n6736N5723m605d5881j00664O8916B64827A316
12609b30576C0649a29978f0065A74276a23165H6419K08765q3567J1138N7058H4356
12597A37138O5379B5917N8602L07866a49889A78386C982J46893a82265f8491n5068
12586a23559B60350J23321a30077B29810c7536B40200p8500G8887O0507a10668
12575B95719j47524a48073b8774B98554a53914N326H0876Q324J03695b68234I5501
12563A06452b7732k2005P571D0748b01992N3516A3067i0463l91422d9721E0765
12551A34917f4489j268b1051j5080C2820r396J81971b30661B01714D3842b6868
$$ y = [359489, 208857, 288057, 252697, 21830, -103851, 215789, 160785, -37483, 122568, 161622, 30866, 202898, 366694, 286878, 181312, 124576, 180299, 175694, -45881, -146545, -77629, 264827, 1316, -230576, 30649, -129978, -60065, 174276, -123165, 86419, 295184, 211617, 222755, 279813, 84356, 137138, 202517, 25917, 84519, 392385, -149889, 178386, 3982, 150875, -182265, -68491, -123559, 260350, 383671, -130077, 229810, -37536, 240200, 161700, 78887, 139394, -110668, 295719, 148195, -148073, -28774, 298554, -153914, -148588, 80876, 89200, 192895, -268234, 95501, 106452, -27732, -49737, -42166, 40748, -201992, -148476, 13067, -90463, -481885, -49721, 50765, 134917, -64489, -65757, -21051, -36131, 32820, 23424, 205395, -230661, 201714, 43842, -26868]
12539a28177k6594p5394H6442J61473E5532d0396e73k76640e9374K1290h814j08852
12527a17666j42672a1112q2405K533L6728j29691b3392j8618m1750j18271G4256
12515h858l56220a41183C25805G6300m62N7359a324C89389h005E8627L2658a14098
12502H221O6484a6897A77012f8171A91709a50278a0949H0115i2840C11586b96397
12490B00619N4829r7327b12441E4352a01390B10610I9845A0485Q1162K40343j05053
12479B26937R9888b02192R6400A18995i4645l9116B7932J24615R7031i0514A27585
12467D25216c05666O2352B34062d8609D69880c6357J3696I4446K20764o8376C7204
12455D1170K76714E8788I441K3539N0315A4110J3847J58510a77236r000E64J5845
$$ y = [-128177, -154771, -230165, 86442, 247915, 55532, -40396, -573, -277213, -59374, -38084, -8814, -117666, -260338, -11112, -93517, -90984, -54256, -183947, -23392, -42010, -83760, -202031, 74256, -8858, -365078, -141183, 325805, 76300, 75838, 133197, -1324, 389389, -8005, 58627, 91285, -114098, 8221, 74705, -16897, 177012, -68171, 191709, -150278, -10949, 80115, -92840, 311586, -296397, 200619, 255448, 158121, -212441, 54352, -101390, 210610, 99845, 10485, 91647, 331990, 226937, 326825, -202192, -105792, 118995, -94645, -133761, 27932, 152547, 249578, -90514, 127585, 425216, -305666, -243314, 234062, -48609, 469880, -36357, -22661, 94446, 315210, 246834, 37204, 41170, 317884, 58788, 9441, 32980, 83295, 14110, 27957, 186467, -177236, -186236, 564, 16409]
12443A6409J37379a34903B41279q5874L6366a01865F7046O1237h9880L6038D6066
12431G7144K62231j50882J48549I5741b78553i5375j33067m1420A75189d3379
12420b8675D1988B0188e9889G3748a73168D53752A65944M4421a24064c2683A05066
12408B32447Q5138d2626G4349c10663E4376a80390a9727k61460n7470J54015g9671
12396B43260n6259q9447J00459K76264b26775P5881k4224b2900H6641b03450Q0900
12385a22550A54386e1506J9651q1226C55839b66355A05180O6645o1429j7443d9672
12373H3730O1552J41587F8229J16560M2148J47754a37447e2522A57814F8463g2190
12361c18130E2466a82557L8594K1552b259A80546d5250A00086l5222a14340l03448
$$ y = [16409, 153788, -134903, 241279, 155405, 191771, -101865, 67046, 128283, -89880, -53842, 46066, 77144, 339375, 188493, 337042, 95741, -278553, -95375, -228442, -269862, 175189, -43379, -28675, 41988, 20188, -59889, 73748, -173168, 453752, 165944, 210365, -124064, -32683, 105066, 232447, 317585, -42626, 74349, -310663, 54376, -180390, -19727, -281187, -338657, -184642, -79671, 243260, 187001, 97554, 198013, 474277, -226775, -150894, -175118, -22900, 86641, -203450, -122550, 154386, -51506, -31855, -113081, 355839, -266355, 105180, 171825, 110396, 92953, -49672, 83730, 145282, 286869, 68229, 184789, 226937, 374691, -137447, -52522, 157814, 68463, -72190, -318130, 52466, -182557, -143963, -122411, -2259, 180546, -45250, 100086, 64864, -114340, -417788]
12350d17788C71026A9977L68746C6253b23501A82501a23748D22451k04631a45768
12339c75140B96323e7730E9376a26381K5659o5412N9118E1725b64900O3106h1200
12327a05442q4100A02797K51343c0674C992a43146B3091J44026a0311j09477A0893
12315A77798a08548D7093f9138H1848b27403E2848i8095C69432I9679g79F3508
12303B30595C8039a1186G1982d9089A73952b5112A52667a50713J2848D5397e1151
12291H8866B7313L88085b82902a08343n4738I7020L4121k2349l9113J64604a79783
12279b42995E43877F9826d8405A60013a42356D15096A49099K01234M4337c7661
12268i9886H5911K4690b20327o359e8320k2057A62607c22781C92942a20486A40609
$$ y = [-417788, 371026, 19977, 388723, 36253, -223501, 182501, -123748, 422451, 217820, -145768, -375140, 296323, -57730, 59376, -126381, -100722, -166134, -107016, 51725, -264900, -201794, -81200, -105442, -189542, 102797, 354140, -30674, 3992, -143146, 23091, 167117, -10311, -119788, 10893, 177798, -108548, 47093, -69138, 81848, -227403, 52848, -98095, 369432, 99679, -779, 63508, 230595, 38039, -11186, 71982, -49089, 173952, -25112, 152667, -150713, -137865, 45397, -51151, 88866, 27313, 415398, -282902, -108343, -163081, 97020, 131141, 108792, 69679, 234283, -179783, -242995, 543877, 69826, -48405, 160013, -142356, 415096, 149099, 350333, 394670, -37661, -99886, 85911, 110601, -220327, -226686, -58320, -80377, 162607, -322781, 392942, -120486, 140609]
12256c7009j58802D66884b66239B78817C7975a63737A56735A4565a49416A63868
12245C2418J21450g802B06523a50575A81516a47016I4245l0902J7767C4336L65534
12234C99870c9348p9059j27135a06441E3145K44079B2381L17328D7J12658P6846
12223A89551l4171m2036K26736B2429L63440k7086Q4174A99541M5121k1242m1650
12212A81770K45206b51196F91478i2930C23850A03457e5326A66918C5780L46578
12202C82358j59663K4253j11690Q3584a07155L4326D80718I4744H309a13361C88664
12190A37067J66724J14781q5174b1286E2572a64799G7659a10458L825H6353R152
12179I5505o321d0917B26950a338j01391A28514L1123L3381j0015q7461d05555
$$ y = [-37009, -195811, 466884, -266239, 278817, 37975, -163737, 156735, 14565, -149416, 163868, 32418, 153868, -7802, 206523, -150575, 181516, -147016, 94245, 63343, 81110, 34336, 399870, -39348, -118407, -245542, -106441, 53145, 297224, 22381, 339709, 47, 112705, 189551, 155380, 113344, 340080, 22429, 385869, 358783, 442957, 199541, 244662, 223420, 181770, 426976, -251196, 691478, -92930, 323850, 103457, -55326, 166918, 35780, 382358, 222695, 246948, 135258, 218842, -107155, -72829, 480718, 94744, 8309, -113361, 388664, 137067, 303791, 418572, 333398, -21286, 52572, -164799, 77659, -110458, -106633, 86353, 95505, 89184, -40917, 226950, -1338, -102729, 128514, 159637, 193018, 183003, 95542, -405555]
12167C67778F7439N7528J10516e3536o5651l2283q1857A94781E1289j0859K4677
12156F5107J28460L3007P2777a57101C45387G9745K97547C2051g1662J6030B48659
12144I03P0721J24018d1345o6019a8415A93633J92287j86288J13256j07538M6960
12133B52310l6667q1537D9009P0576L2066m2226f6082A33449c9308A49606E1241
12121b53714B45093J90091B01426c3787A56924a34202A12897a83083A13451B5271
12110B7219J6600q20M43277A36598j1166p657g2602K4841B60431Q3050i2251A85570
12097F5417a56391A3664L3372O0491a86027A0583L7510M5483a96185i6909k30627
12086c27536A10792o653J86167a8920A2381a80771H4808c9261j42876b0743M694
$$ y = [367778, 67439, 124967, 235483, -53536, -119187, -151470, -233327, 194781, 51289, 40430, 65107, 193567, 226574, 299351, -157101, 345387, 79745, 377292, 32051, -71662, -55632, 248659, 903, 71624, 195642, -41345, -107364, -18415, 193633, 385920, 199632, 312888, 205350, 252310, 215643, 134106, 49009, 119585, 151651, 109425, -66082, 133449, -39308, 149606, 51241, -253714, 245093, 435184, 201426, -33787, 156924, -134202, 112897, -183083, 113451, 25271, 27219, 43819, 42999, 486276, 136598, 125432, 117775, -72602, -47761, 260431, 343481, -92251, 185570, 65417, -156391, 13664, 47036, 107527, -186027, 10583, 48093, 93576, -196185, -96909, -327536, 110792, 104139, 290306, -18920, 12381, -180771, 84808, -39261, -182137, -20743, -16049]
12075a6049j64526M8475H324c44141i5931c9578a3152A1683J71548N0838A05490
12063B8369f9003l2685q9361e661p5684j08624d8102G630N18616H5513d5892j12496
12051a58388A95780E9996M7389f2556j73236g898B56832F4251P5400l0601c1031
12039a42019D47013H4332j4043a80687M0623B3143J02440b83159d9458k10854
12029b60312I6932C9797J58959j4903k4798N80300C21165A40104m7191Q7109a33365
12017C07171A596c63756A06303R6606a16524C10489h7368B56801a16100D1578
12006F9227g127k0298A78516O4455b04117A41978b26425e0615I8161Q551b78779
11994A42566a43060D538h8497B07146e8322A33914K01315o8441I24R5876a02964
$$ y = [-16049, -180575, -132100, 8324, -344141, -95931, -39578, -13152, 11683, 183231, 234069, 105490, 28369, -69003, -101688, -191049, -5661, -81345, -189969, -48102, 7630, 526246, 85513, -45892, -158388, 195780, 59996, 107385, -62556, -235792, -7898, 256832, 64251, 139651, 109050, -31031, -142019, 447013, 84332, 70289, -180687, -140064, 23143, 125583, -283159, -49458, -260312, 96932, 39797, 198756, 183853, 159055, 739355, 321165, 140104, 92913, 180022, -133365, 307171, 1596, -363756, 106303, 202909, -116524, 310489, -87368, 256801, -116100, 41578, 69227, -7127, -27425, 178516, 242971, -204117, 141978, -226425, -50615, 98161, 106712, -278779, 142566, -143060, 4538, -88497, 207146, -58322, 133914, 335229, 266788, 924, 96800, -102964]
11982b58797g2232k8164D6156a23788A0891K2480J74566r1111O2752e4618F8626
11970h8216A10129a59357N3670C81741H366K7783i9501A5190a3656j98256C7062
11958a4309A27533R5325r5016b75904B16478B6326j711b35385e5968A57532l2696
11947A24836f1921a006k78783Q6683h4830A63199i2360f852r414j95701p2159
11936b84126B86571h3574j64132I6538O0041B1997g4098b3497C49879e20673H5891
11924A28767O191d1816B67190c6166D2629a5456c24E1458e2733E420b95338B94742
11911E318a11696A21809c28909A30080a1237A01006B8524P8601b4945H5518P2498
11900A58016o4240f7243j59595e6098A21008K7891G27L0845J35616J2262E2181
$$ y = [-258797, -72232, -100396, 46156, -123788, 10891, 33371, 207937, 116826, 179578, -54618, 68626, -88216, 110129, -159357, -105687, 381741, 8366, 36149, -99501, 15190, -13656, -211912, 37062, -14309, 127533, 222858, 127842, -275904, 216478, 26326, 24615, -235385, -55968, 157532, 124836, -61921, -1006, -279789, -193106, -84830, 163199, -92360, -6852, -16266, -211967, -284126, 286571, -83574, -247706, 96538, 156579, 21997, -74098, -23497, 349879, -520673, 85891, 128767, 134958, -41816, 267190, -36166, 42629, -15456, -324, 51458, -52733, 5420, -295338, 294742, 5318, -111696, 121809, -328909, 130080, -11237, 101006, 28524, 107125, -24945, 85518, 158016, 93776, -67243, -226838, -56098, 121008, 148899, 727, 31572, 167188, 179450, 52181]
11888g4563j1941q3054A94867m3108R5326i8581l56788B08930A2928g4665A26263
11876E2298e5389o7170B2959O2765b77322A04594j8229J56561J61625D6931q326
11865C8605i3458j83860A75816q7509h5167c1113j17154F4524M8674a41432a2518
11853D5642b14552R4134j00421J770J5279I9716a26941B67395a53671P3774H0186
11841f1992B09829b5183C5417N746i2572B1761b86175a39568k3464k96202a03169
11829E0190i3305c120F5385A1160K9319a23170r4626L9049a8744A28952a15276
11817b57548N4868N9856H922b08518B23248b2907B6902b24053J7355j97746a93861
11805b75758A32165c3787k2357j19672C66302b51356a04929D0739J89063b89811
$$ y = [-74563, -86504, -169558, 194867, 151759, 247085, -98581, -455369, 208930, 12928, -74665, 126263, 52298, -55389, -122559, 22959, 85724, -277322, 104594, 86365, 242926, 404551, 46931, 38605, -93458, -277318, 175816, 88307, -85167, -31113, -148267, 64524, 113198, -141432, -12518, 45642, -214552, -120418, -220839, -219069, -203790, 99716, -126941, 267395, -153671, -79897, 80186, -61992, 209829, -25183, 35417, 41163, -92572, 21761, -286175, -139568, -163032, -459234, -103169, 50190, -93305, -3120, 65385, 11160, 40479, -123170, -217796, -178747, -18744, 128952, -115276, -257548, -202680, -142824, 8922, -208518, 223248, -22907, 26902, -224053, -206698, -404444, -193861, -275758, 132165, -33787, -56144, -175816, 366302, -251356, -104929, 40739, 229802, -289811]
11794i2386C97219H7708g7841j79879D74267I0628d1701k1876a5197A96663D197
11782g1737a2057o5797o5028c004k45254d0648B29726k9004b99519E2c3989A12543
11769A15958a34468B60392B4971P4396h3141D58147E0573c0211l7178n5187C00590
11757g5563k6717L1247j5222D1621K00560i368A94185F6874J63948c309m7149
11746e0458B02709p6328E4582G939a46664I777J4357R0273b64165a02816o480
11735a09296R437B76528A34123c10168J10872e7050A15479B1538J67876K783r5065
11724I7132m093a33813o9479M4021k65074K08363B08179a33069j80677A90477
11713A32257O6419K41830c11925J10793H8969K2168E5487Q186e22868E36835j15913
$$ y = [-92386, 397219, 87708, -77841, -257720, 474267, 90628, -41701, -63577, -15197, 196663, 4197, -71737, -12057, -77854, -142882, -3004, -248258, -40648, 229726, 200722, -299519, 52, -33989, 112543, 115958, -134468, 260392, 24971, 99367, -83141, 458147, 50573, -30211, -67389, -122576, 300590, -75563, -102280, -71033, -86255, 41621, 242181, -9368, 194185, 66874, 230822, -3309, -50458, 202709, 126381, 54582, 7939, -146664, 9777, 24134, 114407, -264165, -102816, -109296, -99859, 276528, 134123, -310168, -199296, -57050, 115479, 21538, 189414, 192197, 97132, 93039, -133813, -203292, -159271, -424345, -215982, 208179, -133069, -313746, 190477, 132257, 198676, 440506, -311925, -201132, 88969, 111137, 55487, 63673, -522868, 536835, 420922]
11702D20922B704O6409a95303A64470m7435e3037K6032j0457B37963j0361b03572
11690D7688K57581b09715g2688A8810O9611d210m7795A75059Q0670A03331a68716
11678a39524j0499A22280d2345B00420M6379C4017b05206C32945p2152h1806A05446
11666g2765a6486A27078M7746m5557b49277G1418k5552L31358a0974j57821C19046
11654h6931A05770J71502f3089m2984B14757b0733A26116d0129j8131l98074C6217
11642A06287a53858A04742K5645c29467I5355a0737q0687B873P7961k7556J24743
11631A78021a17367A31311F0916d8883C4509K48804a71511A36066d2853B95503
11620i0891j011D7037j8511a43027q0584C16809c0416A31403M734l9158a58013
$$ y = [420922, 2704, 69113, -195303, 164470, 117035, -53037, -27005, -37462, 237963, 227602, -203572, 47688, 305269, -209715, -72688, 18810, 88421, -4210, -52005, 175059, 255729, 103331, -168716, -139524, -150023, 122280, -42345, 200420, 246799, 34017, -205206, 332945, 260793, -81806, 105446, -72765, -16486, 127078, 174824, 129267, -249277, 71418, 45866, 377224, -10974, -168795, 319046, -86931, 105770, 277272, -63089, -106073, 214757, -20733, 126116, -40129, -58260, -456334, 36217, 106287, -153858, 104742, 130387, -329467, 95355, -10737, -91424, 2873, 80834, 53278, 178021, -117367, 131311, 60916, -48883, 34509, 283313, -171511, 136066, -42853, 295503, -90891, -91902, 47037, 28526, -143027, -223611, 316809, -30416, 131403, 136137, 96979, -158013]
11608A5017J49861A1494a53139j3967r6837B40324L2023L9520j55456L795o2562
11597I7644a23848j36058e7778l7410j42905O4371A02048k9277a70861I5328K78031
11586C73359g4061q6508C4716O6342M1533k1105J40316A15776D9059d0847o3824
11575a04671b6404D9723M5582a56358e1828C05106a38685H3698J19627a8187G8762
11563a5250r2590C23436q3244I1470M84026a81907P4743d9515E9036Q3496E6738
11551A61075E7851J05820A4960N8132J62198G4257a85509i2303A40091C1003a71432
11539a35040j30319i4268I7030K9714C9091j4039j635F019a6061A59222i4783
11527B26716b0847B72279j27764h5306j77355A35349a24332A06141e9769A42367
$$ y = [15017, 164878, 11494, -153139, -167106, -263943, 240324, 272347, 311867, 156411, 160206, 97644, -123848, -259906, -57778, -95188, -238093, -173722, 102048, 72771, -170861, 95328, 373359, -74061, -160569, 34716, 101058, 142591, 121486, 261802, 115776, 49059, -40847, -104671, -26404, 49723, 95305, -156358, -51828, 305106, -138685, 83698, 203325, -18187, 78762, -15250, -107840, 323436, 240192, 91470, 575496, -181907, -107164, -49515, 59036, 142532, 56738, 161075, 57851, 163671, 14960, 73092, 235290, 74257, -185509, -92303, 140091, 31003, -171432, -135040, -265359, -94268, 97030, 126744, 39091, 25052, 23417, 6019, -16061, 159222, -94783, 226716, -20847, 272279, 144515, -85306, -262661, 135349, -124332, 106141, -59769, 142367]
11516I4258J94319A105M7354d1559p4998B64632n1072A3793K16796A06420F260
11504A7984Q0655c07421e9243A11841K28782c5173A47278J6512b0090A81454F8694
11492c5354F9281c6425A07668m0947e6336j79240B5981L07512B4860a9333m2179
11481f1512C29736b6499D18653B07680M2639L2429J88447B00052q5L5626f715
11469g0658G674L32674m5351c2661B50543M5683A43612n1650J11985l6041n2706
11458A15200n551c12219a12193A67617b34368A47092b7522m8666j2137J3484B32983
11446i1632a5916C16607b6447m150B92M37980B2082K69811B7108K17115c1518
11434E0237N370K11856A1814O3950b893A08198A3893d8131J835A66237E246b74436
$$ y = [94258, 288577, 1105, 48459, -41559, -116557, 264632, 213560, 13793, 230589, 106420, 6260, 17984, 98639, -307421, -59243, 111841, 340623, -35173, 147278, 163790, -20090, 181454, 68694, -35354, 69281, -36425, 107668, 66721, -56336, -235576, 25981, 333493, 24860, -19333, -61512, 329736, -26499, 418653, 207680, 250319, 282748, 471195, 200052, 199967, 235593, -6715, -70658, 7674, 340348, 294997, -32661, 250543, 296226, 143612, 91962, 203947, 167906, 115200, 109649, -312219, -112193, 167617, -234368, 147092, -27522, -76188, -88325, -74841, 232983, -91632, -15916, 316607, -26447, -30597, 292, 438272, 22082, 291893, 27108, 244223, -31518, 50237, 55607, 267463, 11814, 75764, -2893, 108198, 13893, -48131, -46296, 166237, 5246, -274436]
11421b38681D10006H3028M077b2312C47624A51098d70426g1928A76221a53842
11410A61851P1183a1971j58974B42051c437m2115a8238j06967B99528c09421b5480
11398a07662a5034j03639C37106h8712j38233A16675M0159q790a39923j44545
11388b84468A1794b16271G4275f4604F9925K19776a0009o5631J7907D9873L4219
11377H4092a48064B56252A26016M5157d78682h8669C80961i3509j27809B75712
11366C28062B0716b68163B17664e5413C959i5216K7918k23469H3116b43412A39065
11354H4823k429B8167a80568C2623c437o471j18578a0296A50579l5291k3850g7247
11341d252A83480i3917j8528k14770C0835J01583a13673k1227J1567N0335B193
$$ y = [-238681, 410006, 83028, 87105, -22312, 347624, 151098, -470426, -71928, 176221, -153842, 161851, 233034, -11971, -170945, 242051, -3437, -45552, -18238, -125205, 299528, -309421, -25480, -107662, -15034, -118673, 337106, -88712, -226945, 116675, 156834, 148044, -139923, -284468, 11794, -216271, 74275, -64604, 69925, 289701, -10009, -75640, -57733, 49873, 84092, -148064, 256252, 126016, 171173, -478682, -88669, 380961, -93509, -221318, 275712, 328062, 20716, -268163, 217664, -55413, 3959, -95216, -67298, -290767, 83116, -243412, 139065, 84823, 82394, 28167, -180568, 32623, -3437, -9908, -128486, -10296, 150579, 115288, 91438, -77247, -4252, 183480, -93917, -112445, -327215, 30835, 132418, -113673, -134900, -123333, -72998, 2193]
11329A53980b51532B86056g3288E7781a50039b4636m9529a047C62963L3079r1990
11318C04052c457q7336n2430I7234b25772B33717g5328e165j43066A27310n131
11307A22179D9723b22415D647a6504A72556G1499a17866k33296B88143a12088
11296e3323m42264A87409o3162a36481J5173F0693c16103a38566C6904c7859C578
11284f014l1578m1412A01257K5568N4968C0665K3775d97172A1050b6776C3856
11272i8257A19380J17015a28066B5912L38410D7915A7551J42822L97031a88400
11261f1611F9292c7312j77587A51737b12684J8039J4776N890J7662O9367A08879
11249b24549j3340j9901A31442a63199a3283j73264C9837F676a10721d4493p8785
$$ y = [153980, -251532, 286056, -73288, 57781, -150039, -24636, -74165, -1047, 362963, 396042, 304052, -3457, -90793, -143223, 97234, -225772, 233717, -75328, -5165, -148231, 127310, 122179, 49723, -222415, 4647, -16504, 172556, 71499, -117866, -351162, 288143, -112088, -53323, -495587, 187409, 124247, -136481, -121308, 60693, -316103, -138566, 36904, -37859, 3578, -6014, -37592, -79004, 101257, 126825, 181793, 30665, 54440, -497172, 11050, -26776, 33856, -98257, 119380, 236395, -128066, 25912, 364322, 47915, 17551, 160373, 557404, -188400, -61611, 69292, -37312, -214899, 151737, -212684, -194645, -179869, -173979, -156317, -86950, 108879, -224549, -237889, -257790, 131442, -163199, -13283, -186547, 39837, 6676, -110721, -44493, -123278]
11238a23278A21870a00176G9076b08602A57259a09995A35686g304B28874A08883
11227g8733j29475c9863L290j8781b1164A76853a51977A6737b70081A27791i8399
11215H4402d2319B11220b371C38835b00733f0926H0000M5062M1907a33908D15543
11203a83292b1227l7963k02236A77028C8151J1836K58863A38487N0336F2881h8715
11191A04310b62774i4634j68665j02796a20856k45347B59265C1735d15297B52214
11180B4170a66142I5594O6210n5796H44f8215C9345K9217K08057D4085c31512
11168A00775C0292d7590j83349B9356f4907p8298b5021q5228F3064a10068l62283
11157d72351C6601M2056g1920p5483m1927P1952B80237j05750o797h3242J39n5369
$$ y = [-123278, 121870, -100176, 79076, -208602, 157259, -109995, 135686, -7304, 228874, 108883, -78733, -208208, -39863, -36573, -55354, -21164, 176853, -151977, 16737, -270081, 127791, -98399, 84402, -42319, 211220, -2371, 338835, -200733, -60926, 80000, 125062, 166969, -133908, 415543, -183292, -21227, -59190, -261426, 177028, 38151, 49987, 308850, 138487, 188823, 62881, -88715, 104310, -262774, -94634, -263299, -366095, -120856, -366203, 259265, 31735, -415297, 252214, 24170, -166142, 95594, 161804, 106008, 844, -68215, 39345, 68562, 276619, 44085, -331512, 100775, 30292, -47590, -230939, 29356, -64907, -143205, -25021, -110249, 63064, -110068, -472351, 36601, 78657, -71920, -147403, -189330, -117378, 280237, 174487, 167690, -83242, -83103, -138472]
11145a38472B99770C4496a67361f6440p2733I2394L4402D8972O1110i3561q5117
11134a78678L4579A35525o6847J9554j6641c88505A98598a122K04l83935a05694
11122A60068b86005A303N9437P2640b90148d4710l3159D31443a55861f9890k7590
11111i7480B39141j01912a3506A96161N6634A07973b1037H2258J52142j9388J4415
11100B29427q6633n9536J23755l1301M516M6435F9209J66352j4494p6266r965
11089A34836A0229b1563C29497j9567e3938C8023J78927J41264p8523j13373M77466
11078F43784B85197p4190J74294j02608G3723J75565k3552G6494Q9301L05844
11068D71639j02984r4801K3037o585K37851k12000M881K00882K37657B70820M34818
$$ y = [-138472, 299770, 34496, -167361, -66440, -139173, 92394, 126796, 48972, 110082, -93561, -178678, -144099, 135525, 68678, 88232, 71591, -388505, 198598, -1122, -918, -384853, -105694, 160068, -286005, 1303, 60740, 133380, -290148, -44710, -77869, 431443, -155861, -69890, -97480, 239141, 137229, -13506, 196161, 252795, 107973, -21037, 82258, 234400, 215012, 229427, 142794, 83258, 207013, 175712, 180228, 226663, 69209, 235561, 221067, 144801, 134836, 10229, -21563, 329497, 309930, -53938, 38023, 216950, 358214, 279691, 166318, 643784, 285197, 211007, 385301, 282693, 73723, 249288, 225736, 76494, 165795, 471639, 368655, 273854, 296891, 290306, 528157, 316157, 321038, 521920, 759577, 270820, 705638]
11057G05638j26405Q5468j40007n2851L07558j74644J59586C37076K64370J82638
11047G84084k0049C42209M62612j7106l404K4816J0367J41686m32646j67175O25295
11036I86654D54161J11549J44071k66596n4291M14014M6236J38093J7927m6998
11026I58166N6859k79699M5735J57408j61336k2747k39549M7361J09886p4755
11016E97329J33076k10839J69743C14297M25589q8956j14645K43040k90503K85902
11006G74724l0415k93433j00053K15758M0332O0151J04155j0906J4459j67072
10996F07700k7219j19190L86436k98349J35434k83000K97000m1327K6230K3675
10986G07390L61125m40641L33722k59547p5590O85399j64858K35561k4258M65390
$$ y = [705638, 579233, 664701, 524694, 471843, 779401, 604757, 764343, 337076, 601446, 784084, 764035, 342209, 804821, 787715, 784311, 809127, 819494, 961180, 528534, 361359, 986654, 454161, 565710, 709781, 443185, 388894, 802908, 849144, 987237, 1005164, 958166, 1015025, 735326, 781061, 938469, 777133, 754386, 514837, 562198, 672084, 597329, 730405, 519566, 689309, 314297, 739886, 650930, 536285, 779325, 488822, 774724, 744309, 450876, 350823, 566581, 606913, 667064, 771219, 760313, 774772, 607700, 580481, 461291, 847727, 549378, 684812, 401812, 698812, 657485, 683715, 707390, 1068515, 627874, 961596, 702049, 626459, 1311858, 1147000, 1382561, 1358303, 1823693]
10976A823693Q7936J35854P7941N86876K32100k89465J40275j53282J51504n3676
10966B739756j85390k69840o52239N9822l64378j4656m65101N29250m9628M5008
10956A372604k13010j17696p1206k21355j38621k08959J57986J01784j50223K71775
10946G83079A48876L10948G8757J62674J95330j21501A41907J76730j06519I1457
10935c8521R471C12915R0048A74623F0251a09136A34238b23738A99184F3572L39074
10924D02646D0561a64535k2985P5743F8374P5958C1988L2798G590b16934O3084
10913a53850O8939H0701k0670D100g1845H4837a87629G1201L2555D7239L6696
10902H3935L1051l7251K39794g7402D9021g9097B4314h2874B5958J56178n4126
$$ y = [1823693, 1911629, 2047483, 2125424, 2712300, 2944400, 2654935, 2795210, 2641928, 2793432, 2739756, 2554366, 2284526, 1632287, 1692109, 1327731, 1313075, 847974, 1377224, 1327596, 1372604, 1159594, 1041898, 970692, 749337, 610716, 401757, 559743, 661527, 511304, 783079, 148876, 459824, 78757, 241431, 436761, 315260, 141907, 318637, 212118, 91457, -38521, -29050, 312915, 402963, 174623, 60251, -109136, 134238, -223738, 199184, 63572, 402646, 40561, -164535, -187520, -111777, 68374, 144332, 31988, 64786, 7590, -216934, -153850, -84911, 80701, 60031, 4100, -71845, 84837, -187629, 71201, 103756, 47239, 83935, 114986, 77735, 317529, -77402, 49021, -79097, 24314, -82874, 25958, 182136, 128010]
10891A28010J54074p0745b74977i7160j55847h4984k86790J38043P3094C0498
10880F8961b8081A3500N093a18765I6459a04187k24721A85399b36798f3675k49445
10869c13120A74040b32693d3983m0476k38265f0966o3453e4124j3073E5902a55169
10857B58472j04039a84517L4657g2909K2441l1543o5056b7895B37111b70319A1027
10845A70322b48735F3870j3495J7107b6707B49888d907A3468c1809j00904C53386
10833e2277C5446e6072K495A28121a94091h7770D721R572b75940c81k29373d7783
10820A46802F665J12770f1671G69J62487a48796H3016c9737j28809m8616N7151
10809a60011r2857C1926j020a38324A37707d34869A7302a11056C8167K4829L258
$$ y = [128010, 282084, 211339, -274977, -97160, -253007, -84984, -371774, -233731, -160637, 30498, 68961, -28081, 13500, 18593, -118765, 96459, -104187, -328908, 185399, -236798, -63675, -313120, 174040, -232693, -43983, -84459, -322724, -60966, -124419, -54124, -67197, 55902, -155169, 258472, 154433, -184517, -149860, -72909, -50468, -82011, -147067, -27895, 237111, -270319, 11027, 170322, -248735, 63870, 50375, 67482, -26707, 249888, -4907, 13468, -31809, -132713, 353386, -52277, 35446, -56072, -53577, 128121, -194091, -87770, 4721, 14293, -275940, -381, -229754, -47783, 146802, 6665, 119435, -61671, 769, 163256, -148796, 83016, -39737, -168546, -217162, -160011, -252868, 31926, 30906, -138324, 137707, -434869, 17302, -111056, 38167, 62996, 66254]
10798F6254a7271G717N1500a51900k01483L3498J57025j02502k83757C24379a44855
10786g7593A45477b1466j51615B30672q7345A471J49961b1225H2254b41651B89127
10774d9235l8501k0896G5245a00663a3028C3640k422K64936b71419C1657b24670
10762b1586C5035J30726o0376b13182b8790G1541h7237L6138H1995a82373a4011
10750b9029j5636B98748A16091j2918a96335b59j19601A9395a03631B81637b07063
10738a57012A61683a68151B97081l6675I8084a21768A41917a05131F1347f7711
10727c5278C5501e2036j0469k0151K2911B18127A3735L06187D6107p147g2064
10715A49220m1833a86977f4318H2487a40533A20440d0894A46014b00492K4633
$$ y = [66254, -17271, 7717, 59217, -151900, -353383, -319885, -162860, -265362, -549119, 324379, -144855, -77593, 145477, -21466, -173081, 230672, 143327, 1471, 151432, -21225, 82254, -241651, 289127, -49235, -87736, -108632, 75245, -100663, -13028, 33640, 31218, 296154, -271419, 31657, -224670, -21586, 35035, 165761, 105385, -213182, -28790, 71541, -87237, -51099, 81995, -182373, -14011, -29029, -44665, 298748, 116091, 103173, -196335, -259, -119860, 19395, -103631, 281637, -207063, -157012, 161683, -168151, 297081, 260406, 98084, -121768, 141917, -105131, 61347, -67711, -35278, 35501, -52036, -62505, -82656, -59745, 218127, 13735, 319922, 46107, 38960, -72064, 149220, 107387, -186977, -64318, 82487, -140533, 120440, -40894, 146014, -200492, -175859]
10705a75859L7793r7750P5042A05318a40346K3105I878c69708A15424g7176l1171
10694a08347J2221K9335j12620l996Q0211A1085c99611G9282A1569a02043G9373
10682H4979a02709K8019c1847l7997G2185a051r8529j3789j29966a21459j3883
10671a35342M3147K8209p789a6228r3716K8196A02286f5874l2556B01139b46422
10659F3287e0288n23j85014e5921B58808b28736B269a36482E2909J31163a21216
10647b25605e8527j75344j54599B8319a35199k29958J18276B294a15995a8158
10636A3701a03135j1322F8484d73670F0628g0284H2311b25766H0164a96389A74546
10624b63349B7930a46721j53234a31907B2407L00817a59504k0738B1086b99438
$$ y = [-175859, -138066, -235816, -160774, 105318, -140346, -117241, 9878, -369708, 115424, -77176, -108347, -96126, -66791, -179411, -183407, -103196, 11085, -399611, 79282, 11569, -102043, 79373, 84979, -102709, -74690, -31847, -69844, 72185, -1051, -99580, -113369, -243335, -121459, -135342, -92195, -63986, -71775, -16228, -109944, -81748, 102286, -65874, -98430, 201139, -246422, 63287, -50288, -50811, -235825, -55921, 258808, -228736, 2269, -136482, 52909, 184072, -121216, -225605, -58527, -233871, -388470, 28319, -135199, -365157, -246881, 2294, -115995, -18158, 13701, -103135, -114457, 68484, -473670, 60628, -70284, 82311, -225766, 80164, -196389, 174546, -263349, 27930, -146721, -299955, -131907, 22407, 323224, -159504, -180242, 21086, -299438]
10613A22752E0871d1781C47617d2905r911k50970P3103F4080d7097j66455K3259
10602a90293h6866j09948j11728a40665n8074A17597b18461r5858J49768k6686
10592a91237a4789n4155L4432E8414d0398F0022L60795a63286L1870A49709b63321
10580a01028n9394k82418a40423L5463e0984j68646k81904a67045o7360g6935
10569E4838J26788a68343m3611A0372c00731R3625b8161j63156B69196p8151b4476
10557B78050c10010e2933G5659i8261N761A9336Q5323K84707b21609A44416J23780
10546B68196b1234l3414a1210j9202C31821a38122A03874b70052a08446k58562
10536c67008g5673A53372c17102N4127O8484d7478p5830p1475O0303p5975O6372
$$ y = [122752, 50871, -41781, 347617, -42905, -52816, -303786, -230683, 64080, -47097, -213552, -190293, -86866, -196814, -308542, -140665, -198739, 117597, -218461, -314319, -164551, -191237, -14789, -68944, -34512, 58414, -40398, 60022, 420817, -163286, -131416, 149709, -263321, -101028, -160422, -442840, -140423, -104960, -50984, -219630, -501534, -167045, -234405, -76935, 54838, 181626, -168343, -211954, 10372, -300731, -207106, -28161, -191317, 269196, 191045, -24476, 278050, -310010, -52933, 75659, -98261, -92500, 19336, 104659, 389366, -221609, 144416, 268196, -21234, -54648, -11210, -30412, 331821, -138122, 103874, -270052, -108446, -367008, -75673, 153372, -317102, -262975, -194491, -47478, -123308, -194783, -134480, -210455, -144083]
10525a44083J9254o4054G4629a9518m2379C4928K3224K76600a50913P652H0045
10513C37625D5661h3976c019k29945b4868l69347b0802o8487J9185B6949b90227
10501F3895J54238g851B73259n631a87790A15439J0817r653a5780p1838k84011
10490c71629K7725F4420f0203B79890A289a13093A24394b26664e7289A58320o9629
10479H8691J71903C0169L68951r5889j47939o7631R6823P8607c01456B64423A1693
10467A25013b51983D0426J1821a16734A33931a39256A61622o2936k8914h7307
10456A35333K73912B9468a216A6274J12308j782a08177L9489A99007d9983Q509
10445d1474j24923A92398n0279D1683N4230R8140E6470a11115A09619e6743A22217
$$ y = [-144083, -124829, -188883, 74629, -19518, -61897, 34928, 58152, 334752, -150913, -143261, 80045, 337625, 45661, -83976, -3019, -232964, -24868, -394215, -20802, -89289, -70104, 26949, -290227, 63895, 218133, -7851, 273259, 267628, -187790, 115439, 126256, 116603, -15780, -87618, -371629, -343904, 64420, -60203, 279890, 1289, -113093, 124394, -226664, -57289, 158320, 88691, 260594, 30169, 399120, 303231, 155292, 87661, 184484, 263091, -301456, 264423, 11693, 125013, -251983, 40426, 52247, -116734, 133931, -139256, 161622, 98686, 69772, -87307, 135333, 409245, 29468, -1216, 16274, 128582, 126800, -108177, -68688, 199007, -49983, -41474, -166397, 192398, 142119, 41683, 95913, 194053, 56470, -111115, 109619, -56743, 122217]
10433A6509b5956A03430h6226j83081J08909B01548D3403b17837A38292n0609
10423H7683b29210A60160j2221a43898K3218M9262J3142C1193b2494q966b417
10411g1526K8326B62907r7677F1983E575b54465j54479a1399q9904m4635C07424
10399D332K893N2251b26161G2952a69850B58372n2016I1423O8896R6819a06097
10387e4281C05847A09024l3555J90796i6800D6517a61274J4711g219B54640r1658
10376A62982B2536K52340J02506j42663L6986j08982J56047j36708K59794l6113
10366D05743j16123N52654l44543j86544J02492A71225D1083J08175O4812J67051
10356C81121A65923a80110P0561B85079k5711M6099J05234J78290j85925n5024
$$ y = [16509, -25956, 103430, -86226, -269307, -160398, 201548, 43403, -217837, 138292, 87683, -229210, 160160, 147939, -143898, -120680, -71418, -58276, 31193, -22494, -31460, -2417, -71526, -43200, 262907, 165230, 61983, 5575, -254465, -408944, -11399, -101303, -145938, 307424, 4332, 7225, 59476, -226161, 72952, -169850, 258372, 206356, 91423, 160319, 257138, -106097, -54281, 305847, 109024, 75469, 266265, -96800, 46517, -161274, -146563, -7219, 254640, 162982, 22536, 274876, 377382, 234719, 271705, 162723, 318770, 182062, 441856, 405743, 289620, 842274, 497731, 311187, 413679, 171225, 41083, 149258, 214070, 381121, 165923, -180110, -109549, 285079, 259368, 305467, 410701, 588991, 403066, 348042]
10346C48042A62675J27758L8611K06209a01723C23072p0519F4063b02436A91076
10335e197A80236a01683o6209G7247M35239C8290J4453L8728O6964a7438L20D9623
10322A99105Q4051o7760L74105A4846J3731M02464H7972J02604c4104o316j42251
10311a82671B31367m1379e3189k7526j4140B7763f8323p1069A44713B1903K84095
10300C05998f9046C01428A34509n8822a92139B64227k377a55272J2740G3374e0957
10288C15924e337j7483A16968A4056a66049g8154B8934K54320c15636d5658D1438
10276C06950H1010J6308P2691a24794c3877H6441B2223c4218D413Q8941f1232
10264c33600J49425a5792B32279B0368a30988k3480D7772A3001K10933m2225K5889
$$ y = [348042, 162675, 290433, 329044, 535253, -101723, 323072, 252553, 64063, -202436, 191076, -5197, 180236, -101683, -167892, 77247, 512486, 38290, 52743, 91471, 158435, -17438, -17118, 49623, 199105, 283156, 215396, 589501, 14846, 28577, 431041, 87972, 190576, -34104, -40420, -182671, 231367, 189988, -53189, -80715, -94855, 27763, -68323, -139392, 144713, 21903, 305998, -69046, 301428, 134509, 75687, -192139, 264227, 261850, -155272, -142532, 73374, -50957, 315924, -5337, -22820, 116968, 14056, -166049, -78154, 28934, 283254, -315636, -45658, 41438, 306950, 81010, 97318, 170009, -124794, -33877, 86441, 22223, -34218, 4413, 93354, -61232, -333600, -184175, -15792, 232279, 20368, -130988, -154468, 47772, 13001, 223934, 181709, 207598]
10253B07598d1802j21906N6973M0422F7390a01186q4610k83246a69566E1565J3464
10242F5029b7875j46372E4581J56267h1717A70698b92550J09152C539c4482A80728
10230B24860E7012d74006E2312c7177f600j0860j00003A07639d18597A9750b25684
10218A64467F8026c79959p4839A27759a00449j12406a9778j51892d8814J6332
10208c2482F4362M4052b15127G4728B8600J2432K07590a93472J2310l8538B17510
10196c35206Q6494j93841a95109J5417F3346R967b63139a8225j82857L5242B05276
10184a8737j99028k48783f5189J9873n7696J0217A2242b17398J02755A57283k7237
10173A30046J1432b6677B22859a86904J4196C6728c3211k25930J18616n2423j27291
$$ y = [207598, -41802, -163708, -106735, -66313, 67390, -101186, -185796, -469042, -169566, 51565, 65029, -27875, -174247, 54581, 210848, -81717, 170698, -292550, -183398, 3539, -34482, 180728, 224860, 57012, -474006, 52312, -37177, -6600, -17460, -117463, 107639, -418597, 19750, -225684, 164467, 68026, -379959, -454798, 127759, -100449, -212855, -19778, -171670, -48814, -32482, 64362, 108414, -215127, 74728, 28600, 41032, 248622, -193472, -181162, -219700, 217510, -335206, -248712, -442553, -195109, -179692, 63346, 73313, -263139, -18225, -201082, -165840, 205276, -18737, -217765, -466548, -65189, -45316, -103012, -92795, 12242, -217398, -114643, 157283, 130046, 141478, -26677, 222859, -186904, -172708, 36728, -33211, -259141, -140525, -192948, -320239]
10162c20239M4618A43115O455f7987I0565a17704I4887g0368F1414b77352A16388
10150E8795i8865j55248P7118A20736a11642k33824a4135A04259k6686F274d2575
10138A93071c5048A77974a97709B11093a33000E2523b0607j39140c3342j44453
10128a77795L6516E4565a46761E7756L1398a51352B5046e5851I3157j1374b78664
10116d2727j64100i548p3544j47961A01263b18909L6950A46073c5886A82703a58401
10104b03010b7859B1057g1985H1559c44360c3300j2402j58028A96979E3063a93079
10092B01263h3224m065C0932P6831B2014e584k30404b8781n137q73k57437C13793
10079B91376B9076b43885A93420a49108D9981N705c1781o5082B4939a18742n3850
$$ y = [-320239, -275621, 143115, 149570, -67987, 90565, -117704, 94887, -70368, 61414, -277352, 116388, 58795, -98865, -254113, -176995, 120736, -111642, -345466, -14135, 104259, 77573, 6274, -42575, 193071, -35048, 177974, -197709, 211093, -133000, 52523, -20607, -159747, -33342, -177795, -141279, 54565, -146761, 57756, 89154, -151352, 25046, -55851, 93157, 81783, -278664, -42727, -206827, -9548, -83092, -231053, 101263, -218909, -181959, 146073, -35886, 182703, -158401, -203010, -27859, 21057, -71985, 81559, -344360, -33300, -45702, -203730, 196979, 53063, -193079, 201263, -83224, -87289, 30932, 107763, 22014, -5584, -235988, -28781, -33918, -34791, -292228, 313793, 291376, 29076, -243885, 193420, -149108, 49981, 55686, -31781, -96863, 24939, -118742, -172592]
10068a72592A33520a39179d936A56237K9525C753b97604J08016E4800a58618k20425
10057c79043B92354i9890K9023q2018A33309a3418B85141b20107A09168a7456
10046f21573b32728B32995c41021B37240l8742O9553A00521B0034m811b17862
10035d8324l6327E4475b3318i817k42571D2245f4198B53741c8803j81880O3217
10024a57466c0900k5049E5745d02175i3290j63333M7572A74309i1736A52193F073
10012G7073b4510B37360D7371b25505A25492c69296h1756I6191c40740A02260
10001b93862e2365k54491J14798d7849m9100p7888j70265a48369B9400b96833
9990a44476A03859O8650d1987k01835I3131K50239a43845A8253h579A55870k9689
$$ y = [-172592, 133520, -139179, -4936, 156237, 185762, 3753, -297604, -189588, 54800, -158618, -379043, 292354, -99890, -70867, -152885, 133309, -13418, 285141, -220107, 109168, -17456, -621573, -232728, 232995, -341021, 237240, 198498, 268051, 100521, 20034, 15223, -217862, -48324, -84651, 54475, -23318, -9817, -252388, 42245, -64198, 253741, -38803, -220683, -157466, -30900, -55949, 55745, -402175, -93290, -256623, -209051, 174309, -91736, 152193, 6073, 77073, -24510, 237360, 47371, -225505, 125492, -369296, -81756, 96191, -340740, 102260, -293862, -52365, -306856, -192058, -47849, -96949, -174837, -345102, -148369, 29400, -296833, -144476, 103859, 172509, -41987, -243822, 93131, 343370, -143845, 18253, -8579, 155870, 126181]
9979A26181h3595b3602j20097C2079e6110a2098A17371b17821h8265J1402B1914
9967C35986G1258c18745a8601q6743n9366g7555B4229N3230a98711P9606o0149
9956a79254F3885a77204D4530a6321j7393A30018c66825J46777C327d3987P223
9945c6764k6513j197A4440b62191j14275a10149F8352J80352A2577h9744D6394
9933i6647k06195P5522b8743n6305A1108M2513a05912q7776O5692l4989o364A3314
9920a90626I4900c8764A58938K18539i417A30475A0170J66519a53410n0245j99398
9909d03053b8879p7799m6154a4449j71145K9001g5907C6030d24416a01423F3708
9897C3443c62367G0499e17508B85685R7108a29920A27170k8839b22502r3278a12080
$$ y = [126181, -83595, -23602, -143699, 32079, -56110, -12098, 117371, -217821, -88265, -76863, 21914, 335986, 71258, -318745, -18601, -105344, -164710, -77555, 24229, 77459, -198711, -119105, -179254, 63885, -177204, 44530, -16321, -33714, 130018, -366825, -220048, 3327, -43987, -36764, -63277, -64474, 14440, -262191, -376466, -110149, 68352, 248704, 12577, -89744, 46394, -96647, -302842, -227320, -28743, -85048, 11108, 53621, -105912, -193688, -127996, -162985, -169349, 13314, -190626, 94900, -38764, 158938, 377477, -9417, 130475, 10170, 176689, -153410, -203655, -403053, -28879, -106678, -152832, -14449, -185594, -156593, -75907, 36030, -424416, -101423, 63708, 33443, -362367, 70499, -517508, 285685, 382793, -129920, 127170, 98331, -222502, -315780, -112080]
9885a19887A13305d84053C0352h5248k79973a5743n8319f82j28609d5781a2832
9873G3327a57613A0225a76179e3798C8899f2130A24695b43886i9892K7204F391
9861c56458Q8158c6561B55372a37649b9748j31983P8145a0278p0185C66474a9467
9849a30034C5293M4189a15097j17652o9177a16281A43968R988D3612a63750o725
9838a70475j33432a13628G8493b11438E7151k3449a01039C50822a04808A18410
9827G5510C4342K5875N3365J08051c99439g6794m8795K1426p9221P6494J276d7649
9814D5215a06291F7836c18555a03042K9510j99640L1682A60597a6944G0207A7659
9802A284a28886G2098c62959A46402b52424A60267a08544d8577B71956J17703
$$ y = [-119887, 113305, -484053, 30352, -85248, -365221, -15743, -74062, -682, -129291, -45781, -12832, 73327, -157613, 10225, -176179, -53798, 38899, -62130, 124695, -243886, -99892, -72688, 6391, -356458, -268300, -36561, 255372, -137649, -29748, -161731, -83586, -10278, -80463, 366474, -19467, -130034, 35293, 79482, -115097, -232749, -301926, -116281, 143968, 153956, 43612, -163750, -170475, -303907, -113628, 78493, -211438, 57151, 33702, -101039, 350822, -104808, 118410, 75510, 34342, 60217, 113582, 221633, -399439, -76794, -125589, -104163, -183384, -106890, -105614, -47649, 45215, -106291, 67836, -318555, -103042, -73532, -273172, -241490, 160597, -16944, 70207, 17659, 1284, -128886, 72098, -362959, 146402, -252424, 160267, -108544, -48577, 271956, 389659]
9792C89659j56413c68705E9365K6107c17349A3728J90937c2365l3392p7161l106
9781a46024r995A70656F5343N4788D4073b42597C1847e4995E703a12991j24084
9770b37075R0293B79378A4080a58846A13372g6207j64448L0971A04516C0824d99706
9758b30072p3495h6071j40673B08039a60983F4839c8315a144C7324K31339D3005
9746a31258B07140H8033M7541a30237M2935D73322a41714A25131b49248J17486
9736a31762o3541A61808J38042e5263l69720e8092K0684A70264E311g1937a2958
9724B38071m5351a55284L0442I6785J12089e7459B07850D7662K9572a74331e230
9712A92834b18877E7828k6569d9063l13688a56718A04382a58115f291j59583d5731
$$ y = [389659, 233246, -368705, 59365, 85472, -317349, 13728, 204665, -32365, -65757, -142918, -146024, -156019, 170656, 65343, 120131, 44073, -242597, 31847, -54995, 5703, -112991, -237075, -146782, 279378, 14080, -158846, 113372, -76207, -240655, -209684, 104516, 30824, -499706, -230072, -303567, -86071, -226744, 208039, -160983, 64839, -38315, -1144, 37324, 268663, 43005, -131258, 207140, 88033, 135574, -130237, -87302, 473322, -141714, 125131, -249248, -131762, -195303, 161808, 299850, -55263, -424983, -58092, -37408, 170264, 5311, -71937, -12958, 238071, 192720, -155284, -124842, 96785, 208874, -57459, 207850, 47662, 77234, -174331, -5230, 192834, -218877, 57828, 31259, -49063, -362751, -156718, 104382, -158115, -6291, -165874, -45731]
9700a96878B5592d68574h2025l309a7607k8035j79493g4840k58094c2353k81285
9689c13638c1550m7288o2154p1279D8653Q6539b58931f6335J3349D3518h2144
9677d249I9978A901g0859j57091B30150d5714A7381c14294A06249k9763J43768
9666B20254J27492a9814k9219j44563A5790h3074j34333N6164A94145a88691m6557
9655b35248e0981k7391j66857k92194b10418l0709i7019k9029f00j50559E1046
9643b25623O28f1577D6521a75297c1641j9078j06489J8673K6427J1126j35894
9632b36876J13032j16629J18919k54196a18687j27919E3434b11163A66923a51445
9621i7115d4395m6624I9137a95037j2697A2033g0890q967K9440P371j92568d7621
$$ y = [-196878, 25592, -468574, -82025, -85334, -17607, -45642, -225135, -74840, -332934, -32353, -313638, -31550, -78838, -140992, -212271, 48653, 135192, -258931, -66335, -52986, 43518, -82144, -4249, 99978, 1901, -70859, -227950, 230150, -45714, 17381, -314294, 106249, 76486, 220254, 347746, -19814, -49033, -193596, 15790, -83074, -217407, -161243, 194145, -188691, -235248, -50981, -78372, -245229, -537423, -210418, -241127, -97019, -126048, -600, -151159, 51046, -225623, -224995, -61577, 46521, -175297, -31641, -50719, -157208, -138535, -112108, -100982, -236876, -123844, -240473, -121554, -375750, -118687, -246606, 53434, -211163, 166923, -151445, -97115, -44395, -91019, 99137, -195037, -207734, 12033, -70890, -79857, -50417, -43046, -235614, -47621]
9608a4528C53799b21539Q3223j04127L6524F5579J31247i3728j90678b8952F3086
9596B2950J45936b51673L1312D466a53408C7258J21945d5691n4376j05689A02157
9584b9019H9044a24529H0935b51441B9866K44907a47422j00464I3989P4116b40978
9572G018J10891e1589B77392A24906A3711J19886B6990a38870N5350j99728a14312
9560A0061J13131a77230I3744c626n7696j67066O3409b5590A19157a60803B16725
9548e1882D695a01985A65568g6387C5474g6160m3752D6689b15283D30184g7154
9536d3299k93601a12908j81414a5785E1164A7380a85278M4474r4759O0919j95203
9525c69847c9903C11759A48811d12431E8433J26141a7288k78955o9058N2693g7105
$$ y = [-14528, 353799, -221539, -138316, -242443, -205919, 65579, 196826, -93728, -284406, -28952, 63086, 22950, 168886, -251673, -220361, 4466, -153408, 37258, 159203, -45691, -100067, -205756, 102157, -29019, 89044, -124529, 80935, -251441, 29866, 274773, -147422, -247886, 93989, 168105, -240978, 7018, 117909, -51589, 277392, 124906, 13711, 133597, 26990, -138870, -83520, -283248, -114312, 10061, 123192, -177230, 93744, -3626, -61322, -228388, -164979, -25590, 119157, -160803, 216725, -51882, 4695, -101985, 165568, -76387, 35474, -76160, -119912, 46689, -215283, 430184, -77154, -43299, -336900, -112908, -294322, -15785, 51164, 17380, -185278, -140804, -235563, -174644, -369847, -39903, 311759, 148811, -412431, 58433, 184574, -17288, -296243, -365301, -312608, -77105]
9513d8659A01857e1507A22133p319a610j59260N1507h821A75469n874a01497A12540
9500A7078c076E716K39068F3034a93360b1778k78410A06997e644k0949o9161m3796
9488a39550D75769a40103j01454b4448j26799n0226k9884m3680n4337a01175j70869
9477b72044a12344G4338B9036a43699n0651B09042c72637a13918c5152k92803
9467c27955J52574B4085J0685a14152l3960A41438b00533A07853D9949a73296
9456C7610b50388C84148b78371Q9002P3256B12590H733d38647a01595j39735h1213
9444b26016e9176l5034D16261B5347b89203a3393l29418b2643o8815j26501B29046
9432a24278o5650e6452A00014b38071e2342n2487A75919b0971j98201k98q5037
$$ y = [-48659, 101857, -51507, 122133, 114814, -1610, -160870, -109363, -8821, 175469, 169595, -101497, 112540, 17078, -3076, 5716, 244784, 63034, -193360, -21778, -300188, 106997, -5644, -26593, -95754, -139550, 475769, -140103, -241557, -24448, -151247, -201473, -231357, -275037, -329374, -101175, -272044, -112344, 74338, 29036, -143699, -194350, 209042, -372637, -113918, -35152, -327955, -175381, 24085, 34770, -114152, -148112, 141438, -200533, 107853, 49949, -173296, 37610, -250388, 384148, -278371, -189369, -116113, 212590, 8733, -438647, -101595, -241330, -81213, -226016, -59176, -94210, 416261, 25347, -289203, -13393, -342811, -22643, -91458, -217959, 229046, -124278, -189928, -56452, 100014, -238071, -52342, -104829, 175919, -20971, -219172, -219470, -304507]
9421c04507B16441h3193G2836a8706j56800B73124c2312k16244M4005R5562C37698
9409I5681L9324Q1360i3880n654A97327b94840f6174l5123l31547C8364c12056
9397i3574n1340f8939r2871j72901E5948J05M0672C5572c19839F2478O7679m6513
9385H3644i9715n3654J4469G7314K9335a89412K3981N9138I7781f8946k045j4914
9373h5905D4678K90426i5120j32471b6688j8297F3433b85483A6476a60813N5647
9362a05166N389J8755p2810e0804j5517L828H6193c4717C6891Q9495l5361c68522
9349B74461a13905A26615C9722J43528a10392r693A22688k6611G074a83747m0562
9338b24309J02475j4585C1760O8987J62077r7511b9921j60385e0910k39700A64091
$$ y = [-304507, 216441, -83193, 72836, -18706, -175506, 273124, -32312, -248556, -204551, -108989, 337698, 95681, 135005, 216365, -93880, -99534, 197327, -294840, -66174, -101297, -432844, 38364, -312056, -93574, -144914, -68939, -161810, -334711, 55948, 56053, 96725, 35572, -319839, 62478, 130157, 83644, -99715, -153369, -138900, 77314, 106649, -189412, -165431, -106293, 97781, -68946, -70991, -85905, 44678, 335104, -95120, -227591, -26688, -44985, 63433, -285483, 16476, -160813, -105166, -99777, -81022, -153832, -50804, -66321, -62493, 86193, -34717, 36891, 126386, 91025, -368522, 274461, -113905, 126615, 39722, 183250, -110392, -120085, 122688, 96077, 7074, -183747, -224309, -121834, -136419, 31760, 100747, 262824, 165313, -29921, -190306, -50910, -290610, 164091]
9326F7119a85377j32831c6045a7527A71931J01106b6632A75551c03713c5021F9086
9314i0074j63796Q9688C16812b82224C8910J43934g2093j37582O8627r1453d5743
9302a39819j12672k4478J09704p2327a14524e085p9981j95924i8355b9633q8363
9291a17996A48482l8714C0970e4199A24687m3334b07298B80285F2979J7405g9257
9279c33393F7050N3684j9285B409N2673J26692d6821j6548n8751B6192d38827
9267a91060A7893d24044A84858a92188A17819f3072F8323h5006M0221k26655J20195
9256a51245A12621A603a51259P0797m229B40270a42329C1928a98688L0607j42559
9245c10640g5425j65440B96177b1398j33739l4286C4861h3781A87934e4786k24809
$$ y = [67119, -185377, -318208, -36045, -17527, 171931, 273037, -26632, 175551, -303713, -35021, 69086, -90074, -253870, -164182, 316812, -282224, 38910, 182844, -72093, -209675, -141048, -232501, -45743, -139819, -252491, -276969, -167265, -239592, -114524, -5085, -85066, -280990, -98355, -29633, -117996, 148482, 109768, 30970, -54199, 124687, 81353, -207298, 280285, 62979, 80384, -79257, -333393, 67050, 120734, 101449, 2409, 55082, 181774, -46821, -63369, -122120, 26192, -438827, -191060, 17893, -424044, 184858, -192188, 117819, -63072, 68323, -85006, -44785, -271440, -151245, 112621, 1603, -151259, -80462, -84691, 240270, -142329, 31928, -198688, -168081, -310640, -75425, -240865, 296177, -21398, -155137, -189423, 34861, -83781, 187934, -54786, -279595]
9234b79595G4535a30672n9901l9569b1555A71154a0668C8863K71610D6958a25095
9222i7340j18426J9074G2507a02464b7498q4291k52496J64659C3799j0694e7550
9210F5962A2456b90024G1589a54771C9076b87660d0444A61637b65811a21711G6211
9198B50008o8183f342I95M8801f8022C35416j18058G2037c65269I2232e05410
9186d08787b2631j94194a5477A25260a27920A50273h735B002K3861f9091l3409
9175a02500n1181H3044e9477E7538c374k63385f7917k5994c4757j76118j3119
9164b23994a02978j22375F6855B1877a74635k76439D19613g1255G5497M9634B4351
9152b1776p7915j64748B02304b58585A10570M2596a45062e9898H767J49010a29412
$$ y = [-279595, 74535, -130672, -190573, -230142, -21555, 171154, -10668, 38863, 310473, 46958, -125095, -97340, -215766, -196692, 72507, -102464, -27498, -111789, -364285, -199626, 33799, 23105, -57550, 65962, 12456, -290024, 71589, -154771, 39076, -287660, -40444, 161637, -265811, -121711, 76211, 250008, 181825, -6342, 995, 49796, -68022, 335416, 217358, 72037, -365269, 92232, -505410, -408787, -22631, -216825, -15477, 125260, -127920, 150273, -8735, 2002, 25863, -69091, -102500, -153681, 83044, -59477, 57538, -3374, -266759, -67917, -93911, -34757, -210875, -223994, -102978, -225353, 66855, 21877, -174635, -451074, 419613, -71255, 75497, 125131, 24351, -21776, -99691, -264439, 202304, -258585, 110570, 153166, -145062, -59898, 8767, 157777, -129412]
9140a12745H4446a36889G497O107f0178j7976r6281c6532k37875M2143B53177
9128I9183K9807a84841b5221D3696a73886g8332A01168J09728I3898a53716b9824
9116d08348D4507L2357a08714M750B14060a52469F5087M8898i997j69135e3103
9104A27801c8081j26722J3413B67025a73090b9285o1268I50J13120A9939J86664
9093B06603G4185J45798C6095a1542j72292A35111i0578I6550J02544c3494A4893
9081a81199A80623f5033o4435j84989D9858e6546F744d24514B0364K96480g3164
9069b41855M3457B2373N8066J21599H5294a83493A37685a44905N1813k21681c5361
9057B28843q5170o8437e7636k43148a36405E1983M458d0046l1891l14596f5951
$$ y = [-112745, 84446, -136889, 7497, 13604, -60178, -78154, -174435, -36532, -274407, -232264, 253177, 99183, 128990, -184841, -25221, 43696, -173886, -78332, 101168, 210896, 93898, -153716, -29824, -408348, 44507, 76864, -108714, -103964, 214060, -152469, 65087, 113985, -9997, -179132, -53103, 127801, -38081, -164803, -151390, 267025, -173090, -29285, -90553, 950, 114070, 19939, 206603, 74185, 219983, 36095, -11542, -183834, 135111, -90578, 96550, 199094, -33494, 14893, -181199, 180623, -65033, -129468, -314457, 49858, -56546, 6744, -424514, 20364, 316844, -73164, -241855, -198398, 22373, 80439, 202038, 85294, -183493, 137685, -144905, -93092, -314773, -35361, 228843, 143673, 75236, -57636, -300784, -136405, 51983, 56441, -40046, -71937, -386533, -65951]
9045A65976i3560j11060n8962a02696k10480e3412D1690f048o9318F020h0286
9033d377I5773a38472o6436I3043a54230A65388b9278j34401J6767f0551A38449
9021G5307d3564B06039c10064e04j35844d8391j38015B23063b40928b7726A69232
9009d9549F4029a16142d7377m6420e983j14499b258I0466L0618b73088R8593d4824
8996h5227k30182q58R8095A08447n0035b90208N9060A33536N1501b65720C6800
8984b68798d404j10347n1180n7316e8955F3802a33537L8937j69682J3358F4851
8972d53530B69711r8564b41755C1544K84386A09241J32599g9951J7621B50572
8961B77631a70999j52746a24927J4292j28820k8935A68012K45624A18777b37519
$$ y = [165976, -93560, -204620, -263582, -102696, -313176, -53412, 41690, -6048, -75366, 6020, -80286, -4377, 95773, -138472, -204908, 93043, -154230, 165388, -29278, -163679, -146912, -60551, 138449, 75307, -43564, 206039, -310064, -504, -136348, -48391, -186406, 223063, -240928, -27726, 169232, -49549, 64029, -116142, -47377, -93797, -5983, -120482, -2258, 90466, 121084, -273088, -174495, -44824, -85227, -315409, -316267, -218172, 108447, 58412, -290208, -231148, 133536, 185037, -265720, 36800, -268798, -4404, -114751, -165931, -223247, -58955, 63802, -133537, -94600, -264282, -250924, 64851, -453530, 269711, 171147, -241755, 31544, 315930, 109241, 241840, -79951, -62330, 250572, 277631, -170999, -323745, -124927, -110635, -239455, -268390, 168012, 413636, 118777, -237519]
8950d23971h7733I5881a07751A12685L9557f2245A35848a30319B32901a78298
8939H053b99869J19467A87768G352N18519j92640j63775n7804b29389A76454p6209
8928A00245J93915a1648C03896K75425N97809M618967Q902846k283284C249907
8918H47427j40719B52618J46489A2093J44990a15766l2596c1820r1589D31067
8907B20904o0775D2493a02405B12814B0808b9333k38672H5945Q1459a72843P2113
8896a00730C51546a71492d8550B66717r8170C7119e4479A57200j2460f2628B17118
8884G0748b59059J21766n3422D399J73928m3537e221p5336g284C5837a39342H6500
8871g7695b7929j10699M2575A75309b5j6246I4733a42231N0133n6136H0161e9261
$$ y = [-423971, -87733, 95881, -107751, 112685, 152242, -62245, 135848, -130319, 232901, -178298, 8053, -299869, -180402, 187768, 7352, 525871, 333231, 169456, 111652, -229389, 176454, 100245, 294160, -11648, 303896, 579321, 1177130, 5796097, 14698943, 12415659, 3249907, 847427, 706708, 252618, 399107, 12093, 157083, -115766, -148362, -31820, -123409, 431067, 220904, 160129, 42493, -102405, 212814, 20808, -29333, -268005, 85945, 167404, -172843, -100730, 351546, -171492, -48550, 266717, 168547, 37119, -54479, 157200, 144740, -62628, 217118, 70748, -259059, -137293, -190715, 4399, 178327, 134790, -5221, -80557, -7284, 35837, -139342, 86500, -77695, -27929, -138628, -96053, 175309, -25, -16271, 94733, -142231, -92098, -148234, 80161, -59261]
8858H2144B7193a77268p2098e0581j42484g4446c821G1108e76662B61961G3019
8846d8280D4081K5834a57379D38683G2483M5958b29489A91696c465F9718a10806
8834a49887I0047b62002J25842e8882B45035a65086J729f9847m4974O560j52339
$$ y = [82144, 27193, -177268, -249366, -50581, -193065, -74446, -3821, 71108, -576662, 261961, 73019, -48280, 44081, 69915, -157379, 438683, 72483, 118441, -229489, 191696, -3465, 69718, -110806, -149887, 90047, -262002, -136160, -58882, 245035, -165086, -163357, -69847, -114821, -108261, -260600]
$$ [...]
##END NTUPLES=NMR SPECTRUM
##END=
