##TITLE=AC1514_ROEFFECT0002_8213552_DwLke5yO5g
##JCAMPDX= 6.0         $$ Bruker NMR JCAMP-DX V2.0
##DATA TYPE= NMR SPECTRUM
##DATA CLASS= NTUPLES
##ORIGIN= BRUKER
##OWNER= Administrator
$$ 1.72 TOPSPIN		Version 2.1
$$ 2013-10-04 16:48:16.004 -0700  Administrator@X
$$ Compression mode = diff/dup
##.OBSERVE FREQUENCY= 400.02188249412
##.OBSERVE NUCLEUS= ^1H
##.ACQUISITION MODE= SIMULTANEOUS (DQD)
##.ACQUISITION SCHEME= undefined
##.AVERAGES= 64
##.DIGITISER RES= 22
##SPECTROMETER/DATA SYSTEM= spect
##.PULSE SEQUENCE= noesygpps1d.comp
##.SOLVENT NAME= COFFEE_meoh
##.SHIFT REFERENCE= INTERNAL, COFFEE_meoh, 1, 14.96083
##AUDIT TRAIL= $$ (NUMBER, WHEN, WHO, WHERE, PROCESS, VERSION, WHAT)
$$ ##TITLE= Audit trail, TOPSPIN		Version 2.1
$$ ##JCAMPDX= 5.01
$$ ##ORIGIN= Bruker BioSpin GmbH
$$ ##OWNER= Administrator
$$ $$ E:\/data/COFFEE/nmr/AC1514_ROEFFECT0002_8213552_DwLke5yO5g/12/pdata/1/auditp.txt
$$ ##AUDIT TRAIL=  $$ (NUMBER, WHEN, WHO, WHERE, PROCESS, VERSION, WHAT)
(   1,<2013-10-04 16:48:10.395 -0700>,<Administrator>,<X>,<go>,<TOPSPIN 2.1>,
      <created by zg
	started at 2013-10-04 16:36:39.264 -0700,
	POWCHK enabled, PULCHK disabled,
       configuration hash MD5:
       C8 4E 4E 5D D3 5C D8 9E 9F 52 82 E0 59 8A DE 15
       data hash MD5: 64K
       62 F7 DB 55 D4 3B F3 C0 85 47 7F BE 95 83 14 22>)
(   2,<2013-10-04 16:48:13.348 -0700>,<Administrator>,<X>,<proc1d>,<TOPSPIN 2.1>,
      <Start of raw data processing
       efp LB = 0.3 FT_mod = 6 PKNL = 1 PHC0 = 0 PHC1 = 0 SI = 128K 
       data hash MD5: 128K
       7A 86 A8 32 51 04 53 6D C2 E2 D8 38 BF EE 45 9F>)
(   3,<2013-10-04 16:48:14.520 -0700>,<Administrator>,<X>,<proc1d>,<TOPSPIN 2.1>,
      <pk PHC0 = -79.77173 PHC1 = 0 
       data hash MD5: 128K
       89 0D D3 BB 49 30 81 87 61 B0 49 60 3C C4 2A 22>)
(   4,<2013-10-04 16:48:15.020 -0700>,<Administrator>,<X>,<proc1d>,<TOPSPIN 2.1>,
      <abs ABSG = 1 
       data hash MD5: 128K
       40 9C AD C0 30 C9 06 3B 7D 31 A8 47 19 5C 2E 4E>)
(   5,<2013-10-04 16:48:15.129 -0700>,<Administrator>,<X>,<proc1d>,<TOPSPIN 2.1>,
      <abs ABSG = 2 
       data hash MD5: 128K
       9C 38 64 9D 4A F8 8C 9A A7 6B D4 34 14 EB 3C 3B>)
(   6,<2013-10-04 16:48:15.254 -0700>,<Administrator>,<X>,<proc1d>,<TOPSPIN 2.1>,
      <abs ABSG = 3 
       data hash MD5: 128K
       3D 52 10 97 4A F5 7E CA 4D 7B E2 91 C4 C9 22 3F>)
(   7,<2013-10-04 16:48:15.489 -0700>,<Administrator>,<X>,<proc1d>,<TOPSPIN 2.1>,
      <abs ABSG = 4 
       data hash MD5: 128K
       B0 B2 73 80 F8 1E 8C 22 B2 2D A6 8A 10 DA 61 B2>)
(   8,<2013-10-04 16:48:15.786 -0700>,<Administrator>,<X>,<proc1d>,<TOPSPIN 2.1>,
      <abs ABSG = 5 
       data hash MD5: 128K
       7D 77 97 29 87 96 8A 98 33 31 3D 32 92 5A E3 ED>)
$$ ##END=
$$ 
$$ $$ hash MD5
$$ $$ B2 D9 04 5B F3 89 ED 2E 5F 98 9B A0 BA 4C 83 33
##$RELAX= 
##$RELAX= 
##$RELAX= 
##$RELAX= 
##$RELAX= 
##$RELAX= 
##$RELAX= 
##$RELAX= 
$$ Bruker specific parameters
$$ --------------------------
##$DU= <E:\>
##$EXPNO= 12
$$ [...]
##$TP07= 0
##$TPNAME0= <>
##$TPNAME1= <>
##$TPNAME2= <>
##$TPNAME3= <>
##$TPNAME4= <>
##$TPNAME5= <>
##$TPNAME6= <>
##$TPNAME7= <>
##$TPOAL= (0..7)
0.5 0.5 0.5 0.5 0.5 0.5 0.5 0.5
##$TPOFFS= (0..7)
0 0 0 0 0 0 0 0
##$TUNHIN= 0
##$TUNHOUT= 0
##$TUNXOUT= 0
##$USERA1= <user>
##$USERA2= <user>
##$USERA3= <user>
##$USERA4= <user>
##$USERA5= <user>
##$V9= 5
##$VALIST= <valist>
##$VCLIST= <CCCCCCCCCCCCCCC>
##$VD= 0
##$VDLIST= <DDDDDDDDDDDDDDD>
##$VPLIST= <PPPPPPPPPPPPPPP>
##$VTLIST= <TTTTTTTTTTTTTTT>
##$WBST= 2048
##$WBSW= 25
##$XGAIN= (0..3)
0 0 0 0
##$XL= 0
##$YL= 0
##$YMAX_a= 6072285
##$YMIN_a= -12984210
##$ZGOPTNS= <>
##$ZL1= 120
##$ZL2= 120
##$ZL3= 120
##$ZL4= 120
##$ABSF1= 14.96083
##$ABSF2= -5.597352
##$ABSG= 5
##$ABSL= 3
##$ALPHA= 0
##$AQORDER= 0
##$ASSFAC= 0
##$ASSFACI= 0
##$ASSFACX= 0
##$ASSWID= 0
##$AUNMP= <proc_prof1d_extract.lims>
##$AXLEFT= 0
##$AXNAME= <>
##$AXNUC= <1H>
##$AXRIGHT= 0
##$AXTYPE= 0
##$AXUNIT= <>
##$AZFE= 0.1
##$AZFW= 0.1
##$BCFW= 0
##$BC_mod= 0
##$BYTORDP= 0
##$COROFFS= 0
##$CY= 15
##$DATMOD= 1
##$DC= 0
##$DFILT= <>
##$DTYPP= 0
##$F1P= 0
##$F2P= 0
##$FCOR= 0.5
##$FTSIZE= 131072
##$FT_mod= 6
##$GAMMA= 0
##$GB= 0
##$INTBC= 1
##$INTSCL= 1
##$ISEN= 128
##$LB= 0.3
##$LEV0= 0
##$LPBIN= 0
##$MAXI= 10000
##$MC2= 0
##$MEAN= 0
##$ME_mod= 0
##$MI= 0
##$NCOEF= 0
##$NC_proc= -2
##$NLEV= 6
##$NOISF1= 0
##$NOISF2= 0
##$NSP= 0
##$NTH_PI= 0
##$NZP= 0
##$OFFSET= 14.96083
##$PC= 1
##$PHC0= -79.77173
##$PHC1= 0
##$PH_mod= 1
##$PKNL= yes
##$PPARMOD= 0
##$PPDIAG= 0
##$PPIPTYP= 0
##$PPMPNUM= 2147483647
##$PPRESOL= 1
##$PSCAL= 4
##$PSIGN= 0
##$PYNMP= <proc.py>
##$REVERSE= no
##$SF= 400.020009702907
##$SI= 131072
##$SIGF1= 0
##$SIGF2= 0
##$SINO= 400
##$SIOLD= 131072
##$SPECTYP= <>
##$SREGLST= <1H.CDCl3>
##$SSB= 0
##$STSI= 131072
##$STSR= 0
##$SW_p= 8223.68421052631
##$SYMM= 0
##$S_DEV= 0
##$TDeff= 65536
##$TDoff= 0
##$TI= <>
##$TILT= no
##$TM1= 0
##$TM2= 0
##$TOPLEV= 0
##$USERP1= <user>
##$USERP2= <user>
##$USERP3= <user>
##$USERP4= <user>
##$USERP5= <user>
##$WDW= 1
##$XDIM= 131072
##$YMAX_p= 380566388
##$YMIN_p= -12444
##$CURPLOT= <Network HP LaserJet P1505>
##$CURPRIN= <$Network HP LaserJet P1505>
##$DFORMAT= <normdp>
##$LAYOUT= <+/1D_H.xwp>
##$LFORMAT= <normlp>
##$PFORMAT= <normpl>
##$SURQMSG= 1
$$ End of Bruker specific parameters
$$ ---------------------------------
##NTUPLES= NMR SPECTRUM
##VAR_NAME=  FREQUENCY,     SPECTRUM/REAL,   SPECTRUM/IMAG
##SYMBOL=    X,             R,               I
##VAR_TYPE=  INDEPENDENT,   DEPENDENT,       DEPENDENT
##VAR_FORM=  AFFN,          ASDF,            ASDF
##VAR_DIM=   131072,        131072,          131072
##UNITS=     HZ,            ARBITRARY UNITS, ARBITRARY UNITS
##FACTOR=    0.0627417313425164, 1,          1
##FIRST=     8223.62146879497, -463,         -60945
##LAST=      0,             1437,            -61124
##MIN=       0,             -12444,          0
##MAX=       8223.62146879497, 380566388,    0
$$ Real data points
##PAGE= N=1
##DATA TABLE= (X++(R..R)), XYDATA
$$ [...]
63816F74839l3421l0870k7867k4887k2321k0272j8801j7879j7048j5702j3837
$$ 674839 641418 610548 582681 557794 535473 515201 496400 478521 461473 445771 431934
63805D31934j2139j1113j0456r560q282o922n712m723m131m077m194l738k477
$$ 431934 419795 408682 398226 388666 380384 373462 367750 363027 358896 354819 350625 346887 344410
63792C44410j140o92j219j820j646q09k31o36j804k754k678j776j116j580k922
$$ 344410 343270 342578 341359 339539 337893 337084 336853 336217 334413 331659 328981 327205 326089 324509 321587
63777C21587m046m166l552l049l085l335l229k574j612o24L83J585L018M469N735
$$ 321587 317541 313375 309823 306774 303689 300354 297125 294551 292939 292315 292698 294283 297301 301770 307505
63762C07505O885Q065R108R548R097P889O174L938J020k479o096r221j1322j2134
$$ 307505 314390 322455 331563 341111 350208 358097 364271 368209 369229 366750 360654 351433 340111 327977
63748C27977j1758j0600r080p457n943m808m158l748l194k354j362m67J08K53
$$ 327977 316219 305619 296539 289082 283139 278331 274173 270425 267231 264877 263515 263048 263156 263409
63734B63409J85L64R71J654K061K446L267M381N109N229N278N718O278O456O296
$$ 263409 263594 263958 264929 266583 268644 271090 274357 278738 283847 289076 294354 300072 306350 312806 319102
63719C19102O229O389O446O076N240M084K791J537M20n96j575k541l499m418n056
$$ 319102 325331 331720 338166 344242 349482 353566 356357 357894 358314 357718 356143 353602 350103 345685 340629
63704C40629n085m550m007l906l998l721k977k159j473o93K37Q15N46k91q18m94
$$ 340629 335544 330994 326987 323081 319083 315362 312385 310226 308753 308060 308297 309112 309658 309367 308549 308055
63688C08055L73J096J458J806K408K920K732J763O78K74P32J581K230K458K461
$$ 308055 308428 309524 310982 312788 315196 318116 320848 322611 323289 323563 324295 325876 328106 330564 333025
63673C33025K570K868L144L256L437L967M599M685L980K994K331K048J940J988
$$ 333025 335595 338463 341607 344863 348300 352267 356866 361551 365531 368525 370856 372904 374844 376832
63659C76832K114J848P81q18k449m122o020p541p646o268m573l497k781j828p52
$$ 376832 378946 380794 381575 380757 378308 374186 368166 360625 352979 346711 342138 338641 335860 334032 333280
63644C33280P7Q50J948L166M100M924O001O994P308P256P830R121J0003R683Q694
$$ 333280 333357 334207 336155 339321 343421 348345 354346 361340 368648 375904 383734 392855 402858 412541 421235
63629D21235P931P422O717N780M820L759K597J933K244K906K868K271K492M361
$$ 421235 429166 436588 443305 449085 453905 457664 460261 462194 464438 467344 470212 472483 474975 479336
63615D79336P176R823J2147J4652J7471K0269K2864K5236K7157K8457K9535L0954
$$ 479336 486512 496335 508482 523134 540605 560874 583738 608974 636131 664588 694123 725077
63603G25077L2433L2801L1167K7724K3226J8133J2597O883J366l716q093j1236
$$ 725077 757510 790311 821478 849202 872428 890561 903158 910041 911407 907691 899598 888362
63591H88362j2657j2503j1571j0752j0666j1705j3957j6973j9947k2308k4006
$$ 888362 875705 863202 851631 840879 830213 818508 804551 787578 767631 745323 721317
63580G21317k5094k5353k4487k2627k0344j8174j6252j4351j2262j0046p978o189
$$ 721317 696223 670870 646383 623756 603412 585238 568986 554635 542373 532327 524349 518160
63568E18160m489k675r04M97J524K518L620M611N357O145P261Q608R954J1389
$$ 518160 513671 510996 510092 510589 512113 514631 518251 522862 528219 534364 541625 550233 560187 571576
63554E71576J3182J5418J8057K1181K4842K8850L3056L7665M2949M8822N5065
$$ 571576 584758 600176 618233 639414 664256 693106 726162 763827 806776 855598 910663
63543I10663O1524O7227O9420O4698N1794L3062J2923m796j8041k6207k9699k9678
$$ 910663 972187 1039414 1108834 1173532 1225326 1258388 1271311 1266515 1248474 1222267 1192568 1162890
63531A162890k7488k4117k0275j6797j4497j3717j4375j6329j9378k3023k6570
$$ 1162890 1135402 1111285 1091010 1074213 1059716 1045999 1031624 1015295 995917 972894 946324
63520I46324k9468l1400l2196l1986l1204l0103k8431k6022k3429k1404j9897
$$ 946324 916856 885456 853260 821274 790070 759967 731536 705514 682085 660681 640784
63509F40784j8173j5996j3977j2618j1697j0893j0368j0267j0157r634r133r456
$$ 640784 622611 606615 592638 580020 568323 557430 547062 536795 526638 517004 507871 498415
63497D98415j0564j1445j1273j0212q915p716o562n455m575l987l553l160k882
$$ 498415 487851 476406 465133 454921 446006 438290 431728 426273 421698 417711 414158 410998 408116
63484D08116k714k268r86J130L271M559N047N603O727P860Q168P670P154P125
$$ 408116 405402 403134 402148 403278 406549 411108 416155 421758 428485 436345 444513 452183 459337 466462
63470D66462P266P064O507N950N505M877L805K502J585J573K388L369L849L704
$$ 466462 473728 480792 487299 493249 498754 503631 507436 509938 511523 513096 515484 518853 522702 526406
63456E26406L262K748K075J208M49L1k93r38j779k143j617n03P45K208M302P104
$$ 526406 529668 532416 534491 535699 536148 536179 535886 534948 533169 531026 529409 528906 529651 531859 536161 543265
63440E43265J0314J3772J7616K1961K6842L2551L9539M7670N5923O2931O7325
$$ 543265 553579 567351 584967 606928 633770 666321 705860 753530 809453 872384 939709
63429I39709O7281O0555M6189K6352N737j1329k3149l0204l3294l2625k8364k1344
$$ 939709 1006990 1067545 1113734 1140086 1145823 1134494 1111345 1081141 1047847 1015222 986858 965514
63417I65514j2917m255M116J2023J9076K4532K7791K8834K7908K5011K0033J3368
$$ 965514 952597 948342 952458 964481 983557 1008089 1035880 1064714 1092622 1117633 1137666 1151034
63405A151034N971j179p348j1861j4244j4823j4701j4840j5456j6492j8215k0850
$$ 1151034 1157005 1155826 1148478 1136617 1122373 1107550 1092849 1078009 1062553 1046061 1027846 1006996
63393A006996k3988k6929k9506l2055l4501l6007l5816l4088l1672k9190k6633
$$ 1006996 983008 956079 926573 894518 860017 824010 788194 754106 722434 693244 666611
63382F66611k3835k1010j8537j6370j4088j1600r435p919o485m342j627P64K479
$$ 666611 642776 621766 603229 586859 572771 561171 551736 543817 537332 532990 531363 532127 534606
63369E34606L999N597O882P882R606J2813J6825K0419K3457K6704L0322L3625
$$ 534606 538605 544202 551084 558966 568572 581385 598210 618629 642086 668790 699112 732737
63357G32737L6329L8994M1980M4749M6568M7281M6935M5265M1944L7098L1143
$$ 732737 769066 808060 850040 894789 941357 988638 1035573 1080838 1122782 1159880 1191023
63346A191023K4391J7044R419K003m475r082j1216j1356j0882j0902j1455j2101
$$ 1191023 1215414 1232458 1241877 1243880 1239405 1230323 1219107 1207751 1196869 1185967 1174512 1162411
63334A162411j2905j4547j7643k2107k7076l1320l3946l4846l4301l2322k8745
$$ 1162411 1149506 1134959 1117316 1095209 1068133 1036813 1002867 968021 933720 901398 872653
63323H72653k3915j8725j3634q139j519O101J3292J7472J5648O279q739k4557
$$ 872653 848738 830013 816379 808240 806721 812822 826114 843586 859234 865513 856774 832217
63311H32217l6658m3640m6536m6365m3411l8406l2880k7912k3447j9218j5617
$$ 832217 795559 751919 705383 659018 615607 577201 544321 516409 492962 473744 458127
63300D58127j3133j1530j0158q773p626o899o516o321o157n800n103m215l494
$$ 458127 444994 433464 423306 414533 406907 400008 393492 387171 381014 375214 370111 365896 362402
63287C62402l140l079l132l183l170k963k434j694j135j089j337j246n62K18M77
$$ 362402 359262 356183 353051 349868 346698 343735 341301 339607 338472 337383 336046 334800 334238 334456 334933
63272C34933K94K79O78J112J202J093J179J548J882J788J203N23K84N89J028J314
$$ 334933 335227 335506 336184 337296 338498 339591 340770 342318 344200 345988 347191 347714 347998 348587 349615 350929
63256C50929J776K805M084M873M970M847M781M503L863L203K872K840L098L832
$$ 350929 352705 355510 359594 364467 369437 374284 379065 383568 387431 390634 393506 396346 399444 403276
63242D03276M836N367N113M812N245O074O415O237O320O984P727Q220Q813R731
$$ 403276 408112 413479 418592 423404 428649 434723 441138 447375 453695 460679 468406 476626 485439 495170
63228D95170J0528J0767J0764J1196J2229J3386J4076J4017J3351J2584J2206
$$ 495170 505698 516465 527229 538425 550654 564040 578116 592133 605484 618068 630274
63217F30274J2289J2627J3272J4373J5434J5327J3558J0954Q592O486L926P55
$$ 630274 642563 655190 668462 682835 698269 713596 727154 738108 746700 753186 757112 757867
63205G57867k533n751r164j2599j5234j6621j7218j7578j7561j6827j5579j4220
$$ 757867 755334 749583 740419 727820 712586 695965 678747 661169 643608 626781 611202 596982
63193E96982j2659j0586q180n949l971j902L21K373M209O190Q395J0347J1733
$$ 596982 584323 573737 565557 559608 555637 553735 554056 556429 560638 566828 575223 585570 597303
63180E97303J2911J4288J5545J5957J5261J3858J2306J0997J0117R462Q401O556
$$ 597303 610214 624502 640047 656004 671265 685123 697429 708426 718543 728005 736406 742962
63168G42962M536L436L503L798L418K505J598M23j931n682r861j3374j6127j8779
$$ 742962 747498 750934 754437 758235 761653 764158 765756 766179 764248 758566 748705 735331 719204 700425
63154G00425k1649k4219k5684k5740k4747k3352k1958k0569j9004j7249j5500
$$ 700425 678776 654557 628873 603133 578386 555034 533076 512507 493503 476254 460754
63143D60754j3907j2286j0288p914n814m839n154n871n827m782l608l167l273
$$ 460754 446847 434561 424273 416359 410545 405706 400552 394681 388854 384072 380464 377297 374024
63130C74024l077k261j383j026j090j167j202j422j789j952j730j335j048q87
$$ 374024 370947 368686 367303 366277 365187 364020 362818 361396 359607 357655 355925 354590 353542 352655
63116C52655o38j23O05J193J261Q34M76P49J558K259K426K225K081K231K726L555
$$ 352655 352017 351894 352499 353692 354953 355787 356263 357012 358570 360829 363255 365480 367561 369792 372518 376073
63100C76073M565N494O299P264Q587J0044J1347J2619J4137J5640J6331J5710
$$ 376073 380638 386132 392431 399695 408282 418326 429673 442292 456429 472069 488400 504110
63088E04110J4006J1600Q300L710j826p053j0813j2962j4036j4279j3453j1583
$$ 504110 518116 529716 538016 541726 539900 532847 522034 509072 495036 480757 467304 455721
63076D55721r355p454n820m018k121p07M3P01J802L136M155M800N503O498P548
$$ 455721 446366 438912 433092 429074 426953 426246 426289 426990 428792 431928 436083 440883 446386 452884 460432
63061D60432Q383R106J0045J1411J3153J4995J6618J7948J9298K1056K3199K5290
$$ 460432 468815 477921 487966 499377 512530 527525 544143 562091 581389 602445 625644 650934
63049F50934K6971K8320K9563L0620L1151L1004L0495L0101K9992K9983K9947
$$ 650934 677905 706225 735788 766408 797559 828563 859058 889159 919151 949134 979081
63038I79081L0018L0284L0519L0524L0562L1076L1921L2293L1581K9920K7684
$$ 979081 1009099 1039383 1069902 1100426 1130988 1162064 1193985 1226278 1257859 1287779 1315463
63027A315463K4779K0751J5400Q972J923n300j2345j9099k5553l1353l5798l8569
$$ 1315463 1340242 1360993 1376393 1385365 1387288 1381988 1369643 1350544 1324991 1293638 1257840 1219271
63015A219271m0062m0705m0259l8349l5276l1621k7372k2203j6509j1181o339
$$ 1219271 1179209 1138504 1098245 1059896 1024620 992999 965627 943424 926915 915734 909395
63004I09395j254M194Q922J2057J4118J6108J7987J8858J8342J6952J5338J3764
$$ 909395 908141 912335 921257 933314 947432 963540 981527 1000385 1018727 1035679 1051017 1064781
62992A064781J2413J1593J1444J1740J2070J2146J2023J2043J2339J2352J1182
$$ 1064781 1077194 1088787 1100231 1111971 1124041 1136187 1148210 1160253 1172592 1184944 1196126
62981A196126Q612N305J797k210p085j2384j7352k1902k6371l0607l4065l6646
$$ 1196126 1204738 1210043 1211840 1209630 1202545 1190161 1172809 1150907 1124536 1093929 1059864 1023218
62969A023218l8619l9788l9607l8225l6548l4964l2842k9743k6410k3950k2471
$$ 1023218 984599 944811 905204 866979 830431 795467 762625 732882 706472 682522 660051
62958F60051k1166j9481j7542j5639j3822j2132j0772r900r449r262r241r347
$$ 660051 638885 619404 601862 586223 572401 560269 549497 539597 530148 520886 511645 502298
62946E02298r476r438r010q129p034o109n544n227m967m641m114l275k284j594
$$ 502298 492822 483384 474374 466245 459211 453102 447558 442331 437364 432723 428609 425334 423050 421456
62932D21456j545k046k650k942k716k035j272q87j023j322j291q20k17J95M10
$$ 421456 419911 417865 415215 412273 409557 407522 406250 405363 404340 403018 401727 400907 400690 400885 401295
62917D01295O24R12J168J401J987L304N103O477O763O229N581M989L996K308K38
$$ 401295 401919 402831 403999 405400 407387 410691 415794 422271 429034 435263 440844 445833 449829 452137 452375
62902D52375j746l388m505m854m363l188j480N24K155K597J854R32O60P32M08
$$ 452375 450629 447241 442736 437882 433519 430331 428851 429375 431530 434127 435981 436913 437573 438305 438713
62887D38713k86o98o40n70p04o46j30N26R73J383K039K745L093L053K865K470
$$ 438713 438427 437729 437089 436519 435815 435169 435039 435565 436538 437921 439960 442705 445798 448851 451716 454186
62871D54186J514n1j765l115l900m036l500k719k571l468m544m415k823j026k76
$$ 454186 455700 455649 453884 450769 446869 442833 439333 436614 434043 430575 426031 421616 418793 417767 417491
62856D17491m28m71j1M05K98j12l66l25l4M95J137J576J662J642J830K259K766
$$ 417491 417063 416592 416581 416986 417284 417172 416806 416481 416447 416942 418079 419655 421317 422959 424789 427048 429814
62839D29814L118L016K286J284P85J149J913K380K318J818Q83k73r07l21J264
$$ 429814 432932 435948 438234 439518 440303 441452 443365 445745 448063 449881 450764 450491 449584 449263 450527
62824D50527K954M200N115N812O044N618M728L588K155M36j176k156k348k068
$$ 450527 453481 457681 462796 468608 474652 480270 484998 488586 490741 491177 490001 487845 485497 483429
62810D83429j794j755j696j113J36J519K359K567K545K532K515K687L450M765
$$ 483429 481635 479880 478184 477071 477207 478726 481085 483652 486197 488729 491244 493931 497381 502146
62796E02146N999O673O916P036P112P302P974R169J0379J1329J2536J4512J6924
$$ 502146 508145 514818 521734 528770 535882 543184 551158 560327 570706 582035 594571 609083 626007
62783F26007J9236K1824K5537L0280L4919L8759M2202M5770M9316N2542N5519
$$ 626007 645243 667067 692604 722884 757803 796562 838764 884534 933850 986392 1041911
62772A041911N8047N9246N8515N6398N3726N0237M4958L7816K9922K2160J4316
$$ 1041911 1099958 1159204 1217719 1274117 1327843 1378080 1423038 1460854 1490776 1512936 1527252
62761A527252N873l049j1955k0613k8837l6073m1724m5768m8656n0689n1900n2391
$$ 1527252 1533125 1530076 1518121 1497508 1468671 1432598 1390874 1345106 1296450 1245761 1193861 1141470
62749A141470n2424n2092n1172m9422m6818m3512l9739l5809l2033k8592k5533
$$ 1141470 1089046 1036954 985782 936360 889542 846030 806291 770482 738449 709857 684324
62738F84324k2902k0768j9085j7564j5757j3405j0779q534p053o020m951l972
$$ 684324 661422 640654 621569 604005 588248 574843 564064 555530 548477 542457 537506 533534
62726E33534l563l571l134j911p21m55q08q14k01N32J153J938K861L443L640M090
$$ 533534 529971 526400 523266 521355 520634 520179 519371 518557 518356 518888 520041 521979 524840 528283 531923 536013
62710E36013N193O530P645Q813J0553J2787J4971J6869J8739K0914K3453K6091
$$ 536013 541206 547736 555381 564194 574747 587534 602505 619374 638113 659027 682480 708571
62698G08571K8356K9993L1407L3332L5910L8501M0614M2479M4313M5577M5519
$$ 708571 736927 766920 798327 831659 867569 906070 946684 989163 1033476 1079053 1124572
62687A124572M4045M1455L7669L2399K5793J8278R903O18q850j7258k4103k9934
$$ 1124572 1168617 1210072 1247741 1280140 1305933 1324211 1334114 1334732 1325882 1308624 1284521 1254587
62675A254587l5214l9566m2490m4196m5198m5526m4866m3256m1138l8787l6120
$$ 1254587 1219373 1179807 1137317 1093121 1047923 1002397 957531 914275 873137 834350 798230
62664G98230l3078k9923k7035k4567k2380k0251j8147j6240j4691j3415j2190
$$ 798230 765152 735229 708194 683627 661247 640996 622849 606609 591918 578503 566313
62653E66313j0929r752q758p904p128o504o172o150o245o161n788n309m874m217
$$ 566313 555384 545632 536874 528970 521842 515338 509166 503016 496771 490610 484822 479513 474639 470422
62639D70422k971j409m50n21q70m76O13J396J286O65J23k68o87j121j427j543
$$ 470422 467451 466042 465592 465071 464201 463725 464338 465734 467020 467685 467808 467540 466853 465732 464305 462762
62623D62762j434j135r40j137j495j383o30J64L98K14J80N47J131J643J924K036
$$ 462762 461328 460193 459253 458116 456621 455238 454608 454772 455170 455384 455564 456111 457242 458885 460809 462845
62607D62845K332L186M406N229N170M673M637N397O516P453Q172R116J0711J2971
$$ 462845 465177 468363 472769 477998 483168 487841 492478 497875 504391 511844 520016 529132 539843 552814
62593E52814J5560J8194K0849K3345K5128K5868K6100K6628K7302K7074K5297
$$ 552814 568374 586568 607417 630762 655890 681758 707858 734486 761788 788862 814159
62582H14159K2247J8216J3112P375K270j567n092r446j4176j7926k0392k2395
$$ 814159 836406 854622 867734 875109 877379 875812 870720 861274 847098 829172 808780 786385
62570G86385k4220k5188k4929k4012k3012k1932k0858k0210j9941j9213j7471
$$ 786385 762165 736977 712048 688036 665024 643092 622234 602024 582083 562870 545399
62559E45399j5207j3220j1704j0459r433q533p427o067m967m462m172l702l362
$$ 545399 530192 516972 505268 494809 485376 476843 469416 463349 458382 453920 449748 446046 442684
62546D42684l497l613k969j774r00m73L48J985L622M157L448K262J362R63Q35
$$ 442684 439187 435574 432605 430831 429931 429458 429806 431791 435413 439570 443018 445280 446642 447605 448440
62531D48440O23J47l61m29K05J350K594L577M072M107M157M907O509Q334R688
$$ 448440 449063 449210 448849 448420 448625 449975 452569 456146 460218 464325 468482 473389 479898 488232 497920
62516D97920J0710J2195J4580J7344J9592K1052K2295K3943K5886K7403K7947
$$ 497920 508630 520825 535405 552749 572341 593393 615688 639631 665517 692920 720867
62505G20867K7617K6769K5476K3472K0616J7081J3111Q803M209m90n003r016j2225
$$ 720867 748484 775253 800729 824201 844817 861898 875009 883812 888021 887531 882528 873512 861287
62492H61287j4405j5524j5773j5394j4565j3419j2046j0443q538o349l990j569
$$ 861287 846882 831358 815585 800191 785626 772207 760161 749718 741180 734831 730841 729272
62480G29272Q85L313N569P489Q848R301Q593O931M900K849N62k193n099p678j0068
$$ 729272 730157 733470 739039 746528 755376 764677 773270 780201 785101 787950 788512 786319 781220 773542 763474
62465G63474j2907j6282j9369k1341k2261k2726k2921k2562k1596k0401j9257
$$ 763474 750567 734285 714916 693575 671314 648588 625667 603105 581509 561108 541851
62454E41851j7997j6383j4501j2625j0969r673q738p774o195m026k145j377j451
$$ 541851 523854 507471 492970 480345 469376 459703 450965 443191 436996 432970 430825 429448 427997
62441D27997j372o67K16P58R61R65O42J5l47R4J041J574J170K02n97q57p95r24
$$ 427997 426625 425958 426174 426932 427893 428858 429500 429515 429168 429262 430303 431877 433047 433249 432652 431795 431000 430076
62423D30076j501k173k259j628j020j127j609j575q98l76n35r64j097r98r41q27
$$ 430076 428575 426402 424143 422515 421495 420368 418759 417184 416286 415910 415375 414411 413314 412316 411375 410548
62407D10548n55m51o65o37R6Q56N55n77j027O6J829K949L286L599M223M773M845
$$ 410548 409993 409542 408877 408240 408336 409192 409747 409170 408143 408209 410038 412987 416273 419872 424095 428868 433713
62390D33713M456L845L333L307L883M569M606L716K368J372J349K416M058N398
$$ 433713 438169 442014 445347 448654 452537 457106 461712 465428 467796 469168 470517 472933 476991 482389
62376D82389N873N686N486N748O573P803R015R678R720R763J0412J1460J2327
$$ 482389 488262 493948 499434 505182 511755 519558 528573 538251 547971 557734 568146 579606 591933
62363E91933J3147J4779J7681K1323K4937K8392L2066L6218M0705M5100M8856
$$ 591933 605080 619859 637540 658863 683800 712192 744258 780476 821181 866281 915137
62352I15137N1668N3711N5269N6037N5164N2040M6715L9492L0704K1031J1500
$$ 915137 966805 1020516 1075785 1131822 1186986 1239026 1285741 1325233 1355937 1376968 1388468
62341A388468K740n325j2748j9099k4171k8593l3070l7369m0731m3009m4622m5466
$$ 1388468 1391208 1385883 1373135 1354036 1329865 1301272 1268202 1230833 1190102 1147093 1102471 1057005
62329A057005m4839m2578l9564l6715l4028l0977k7497k4163k1619k0079j9345
$$ 1057005 1012166 969588 930024 893309 859281 828304 800807 776644 755025 734946 715601
62318G15601j8976j8584j8038j7397j6645j5664j4445j3173j2032j1132j0517
$$ 715601 696625 678041 660003 642606 625961 610297 595852 582679 570647 559515 548998
62307E48998j0032r237p777n902m319l424k942k406j684r21l08p6m32j244j937
$$ 548998 538966 529729 521952 516050 511731 508307 505365 502959 501275 500354 500046 499970 499538 498294 496357
62292D96357j993j393m58N64J552K331K782L001L196L449L759M136M490M530M031
$$ 496357 494364 492971 492513 493077 494629 496960 499742 502743 505939 509388 513147 517283 521773 526303 530334
62277E30334L248K781K964L498L731L325K580K104K107K233K174K335L472N744
$$ 530334 533582 536363 539327 542825 546556 549881 552461 554565 556672 558905 561079 563414 566886 572630
62263E72630Q517J1241J4067J7320K0849K4360K8133L2766L8272M3898M8899N3060
$$ 572630 581147 592388 606455 623775 644624 668984 697117 729883 768155 812053 860952 914012
62251I14012N6445N9005O0526O0560N8356N3255M5435L5889K5603J5083M841m260
$$ 914012 970457 1029462 1089988 1150548 1208904 1262159 1307594 1343483 1369086 1384169 1389010 1384750
62239A384750j1692j8025k4345l0936l6989m1635m4786m6845m8020m8244m7480
$$ 1384750 1373058 1355033 1330688 1299752 1262763 1221128 1176342 1129497 1081477 1033233 985753
62228I85753m5810m3375m0387l7096l3591k9791k5821k2190j9324j7030j4780
$$ 985753 939943 896568 856181 819085 785494 755703 729882 707692 688368 671338 656558
62217F56558j2493j0681r773r586r598r467r123q513p599o546n660n118m809m498
$$ 656558 644065 633384 623611 614025 604427 594960 585837 577324 569725 563179 557519 552401 547592 543094
62203E43094m049l555l217l082k874k281j339m10L21J109K257L694N093O199O873
$$ 543094 539045 535490 532273 529191 526317 524036 522697 522287 522608 523717 525974 529668 534761 540960 547833
62188E47833P080P062P364Q247R278R875J0110J0482J0953J0841R803Q375P149
$$ 547833 554913 561975 569339 577586 586864 596739 606849 617331 628284 639125 648928 657303 664452
62175F64452N985M457K767J682J647K423L601N186P622J1358J6365K1914K6991
$$ 664452 670437 674894 677661 679343 680990 683413 687014 692200 699822 711180 727545 749459 776450
62162G76450L1091L4519L7731M0615M2562M2988M1462L7695L1857K4808J7530
$$ 776450 807541 842060 879791 920406 962968 1005956 1047418 1085113 1116970 1141778 1159308
62151A159308J0380L354l106q314j2437j6607k1542k6500l0166l2179l3215l3852
$$ 1159308 1169688 1173042 1169936 1161622 1149185 1132578 1111036 1084536 1054370 1022191 988976 955124
62139I55124l3923l2975l0794k7423k3085j8294j3703r634n892k129J803N921
$$ 955124 921201 888226 857432 830009 806924 788630 774927 765293 759401 757272 759075 764996
62127G64996J0215J4486J8303K1358K3868K6425K9457L2841L6014L8294L9220
$$ 764996 775211 789697 808000 829358 853226 879651 909108 941949 977963 1016257 1055477
62116A055477L8703L6890L3896K9707K4373J8177J1596N207l15m394o988q788
$$ 1055477 1094180 1131070 1164966 1194673 1219046 1237223 1248819 1254026 1253711 1249317 1242329 1233541
62104A233541j0613j2578j4034j4341j3442j1619q975n427j041L873Q967J3907
$$ 1233541 1222928 1210350 1196316 1181975 1168533 1156914 1147939 1142512 1141471 1145344 1154311 1168218
62092A168218J8239K1432K3239K3938K4047K3832K3146K1806K0061J8503J7522
$$ 1168218 1186457 1207889 1231128 1255066 1279113 1302945 1326091 1347897 1367958 1386461 1403983
62081A403983J7005J6722J6849J7764J9413K1243K2979K4990K7580L0160L1614
$$ 1403983 1420988 1437710 1454559 1472323 1491736 1512979 1535958 1560948 1588528 1618688 1650302
62070A650302L1414K9974K7934K5501K2596J9239J5634J2146R371P904P865Q825
$$ 1650302 1681716 1711690 1739624 1765125 1787721 1806960 1822594 1834740 1844111 1852015 1859880 1868705
62058A868705J0310J2144J4118J5777J6896J7888J9216K0461K0546J8994J6516
$$ 1868705 1879015 1891159 1905277 1921054 1937950 1955838 1975054 1995515 2016061 2035055 2051571
62047B051571J4056J1519P768J817o292j5700k5471l4963m3690n1314n7848o3610
$$ 2051571 2065627 2077146 2084914 2086731 2080439 2064739 2039268 2004305 1960615 1909301 1851453 1787843
62035A787843o8730p2820p5381p6445p6461p5539p3248o9332o4371n9350n4708
$$ 1787843 1719113 1646293 1570912 1494467 1418006 1342467 1269219 1199887 1135516 1076166 1021458
62024A021458n0138m5250m0177l5535l1854k9143k6871k4532k2198k0350j9162
$$ 1021458 971320 926070 885893 850358 818504 789361 762490 737958 715760 695410 676248
62013F76248j8225j7140j5985j4860j3320j0879p899n371l660k113o1K246M106
$$ 676248 658023 640883 624898 610038 596718 585839 577940 572569 568909 566796 566735 568981 573087
62000E73087N350O398P539Q552R026Q673P354N098K254n74k879m618o170p877
$$ 573087 578437 584835 592374 600926 609952 618625 625979 631077 633331 632757 629878 625260 619090 611213
61986F11213r623j0876j1273j1101j1073j1541j2111j2091j1202r774q391p436
$$ 611213 601590 590714 579441 568340 557267 545726 533615 521524 510322 500548 492157 484721
61974D84721o863o302n464m501l796l381k840j921r72m79m13l99l27l42l30Q6
$$ 484721 477858 471556 466092 461591 457795 454414 451574 449653 448681 448202 447789 447390 447063 446721 446391 446477
61958D46477Q38J262R74N18P56J782K913L632M093M640N286N933O777Q096R807
$$ 446477 447315 448577 449551 450069 450825 452607 455520 459152 463245 467885 473171 479104 485881 493977 503784
61943E03784J1533J3083J4660J6541J8792K1257K3590K5324K6194K6518K6925
$$ 503784 515317 528400 543060 559601 578393 599650 623240 648564 674758 701276 728201
61932G28201K7527K7660K6631K4599K2333K0379J8735J7170J5409J3043R774N862
$$ 728201 755728 783388 810019 834618 856951 877330 896065 913235 928644 941687 951461 957323
61920I57323J961j623n110q506j1173j2488j2594j2045j0912q783n619k018J526
$$ 957323 959284 957661 952551 944045 932872 920384 907790 895745 884833 876050 870431 868413 869939
61907H69939N225R517J4203J8421K1419K3054K3491K2679K0396J6683J1927O537
$$ 869939 875164 884681 898884 917305 938724 961778 985269 1007948 1028344 1045027 1056954 1063491
61895A063491Q28m717r477j3347j7014k1079k4979k7433k7964k7425k6730k5847
$$ 1063491 1064319 1059602 1050125 1036778 1019764 998685 973706 946273 918309 890884 864154 838307
61883H38307k4456k2958k1969k1165j9602j7249j5319j4760j5077j5057j4146
$$ 838307 813851 790893 768924 747759 728157 710908 695589 680829 665752 650695 636549
61872F36549j2626j0859q992p222n756m487l101j607l90L88J212K687M803O880
$$ 636549 623923 613064 604072 596850 591094 586607 583506 581899 581509 581897 583109 585796 590599 597479
61858E97479Q340R415J0964J3571J6919K0188K3010K5846K9323L3396L7363M0570
$$ 597479 605819 615234 626198 639769 656688 676876 699886 725732 755055 788451 825814 866384
61846H66384M2890M4539M5653M6093M5549M3760M0707L6585L1478K5200J7697
$$ 866384 909274 953813 999466 1045559 1091108 1134868 1175575 1212160 1243638 1268838 1286535
61835A286535R612K106l973q595j2011j4022j4100j2099q436l662J859P713J3351
$$ 1286535 1296147 1298253 1294280 1285685 1273674 1259652 1245552 1233453 1225017 1221355 1223214 1230927 1244278
61822A244278J8372K2602K5654K6754K5433K2001J6988J0362J999p310j6143k3915
$$ 1244278 1262650 1285252 1310906 1337660 1363093 1385094 1402082 1412444 1414443 1407133 1390990 1367075
61810A367075l1258l8546m4842m8937n0829n1362n0832m8884m5655m2020l8537
$$ 1367075 1335817 1297271 1252429 1203492 1152663 1101301 1050469 1001585 955930 913910 875373
61799H75373l5038l1452k8245k5603k2973j9971j7180j5382j4433j3588j2646
$$ 875373 840335 808883 780638 755035 732062 712091 694911 679529 665096 651508 638862
61788F38862j2045j1957j1967j1687j1120j0348r288p874o169m338k803k255k958
$$ 638862 626817 614860 602893 591206 580086 569738 560450 552576 546407 542069 539266 537011 534053
61775E34053m095m458l908l506m047n068n670n675n392m790l607k066p85k4M39
$$ 534053 529958 525500 521592 518086 514039 508971 503301 497626 492234 487444 483837 481771 480986 480962 481401
61760D81401P04O02K37P1K51L79K44L33J103K151K651K491K415K897L524L678
$$ 481401 482105 482707 482944 483015 483266 483645 483889 484222 485325 487476 490127 492618 495033 497930 501454 505132
61744E05132L378L056K866K729K872L785N546P593R324J0581J1389J1632J1247
$$ 505132 508510 511566 514432 517161 520033 523818 529364 536957 546281 556862 568251 579883 591130
61731E91130J0506R762R049Q173P156O283N767N586N571N524N296M952M762M815
$$ 591130 601636 611398 620447 628620 635776 642059 647826 653412 658983 664507 669803 674755 679517 684332
61717F84332M842M529L852K860J470j77j442j860j914k499l725m876n584o192
$$ 684332 689174 693703 697555 700415 701885 701708 700266 698406 696492 693993 690268 685392 679808 673616
61703F73616o795o797n939n067n147n981o470n948m611k981j537o88m80l64K10
$$ 673616 666821 660024 654085 649018 643871 637890 631420 625472 620861 617880 616343 615655 615175 614811 615021
61688F15021R91J225O88p2n11o35o97q65j288k052k906l451l687m055m748n390
$$ 615021 616012 617237 617925 617853 617342 616707 616010 615145 613857 611805 608899 605448 601761 597706 592958 587568
61672E87568n511n103m551m227m298m663m930m711l996l207k754k691k710k365
$$ 587568 582057 576954 572403 568176 563878 559215 554285 549574 545578 542371 539617 536926 534216 531851
61658E31851j438k87L55J96k65n35q89j722k503k222q98L62R04J204J696J920
$$ 531851 530413 530126 530481 530677 530412 529877 528988 527266 524763 522541 521643 522005 522909 524113 525809 527729
61642E27729J404O19L11N18Q66J292J727J665Q26j29n03p66j848l532m670m931
$$ 527729 529133 529752 530063 530581 531447 532739 534466 536131 536957 536828 536325 535559 533711 530179 525509 520578
61626E20578n110n504n263l909k417j822j602m96J471K944L241L286M151N448
$$ 520578 515468 509964 504701 500792 498375 496553 494951 494455 495926 498870 502111 505397 509548 514996
61612E14996N853M907L531K670K059P08j631l909m851m226k950k065j771j458
$$ 514996 520849 525756 529287 531957 534016 534724 533093 529184 524333 520107 517157 515092 513321 511863
61598E11863m58J197K772L570L581L289K878K025O09q27j602j680j616j831k291
$$ 511863 511405 512602 515374 518944 522525 525814 528692 530717 531326 530499 528897 527217 525601 523770 521479
61583E21479k777l162l476l937m881o361p900q885r173r029q614p921p142o660
$$ 521479 518702 515540 512064 508127 503246 496885 488985 480100 470927 461898 453284 445363 438221 431561
61569D31561o539o372n779m877m069l572l278k953k546k307k605l500m533n077
$$ 431561 425022 418650 412871 407994 403925 400353 397075 394122 391576 389269 386664 383164 378631 373554
61555C73554m770l652k121r44q75j879k966l218k745k211j708q01M28J237J247
$$ 373554 368784 365132 363011 362067 361192 359313 356347 353129 350384 348173 346465 345664 346092 347329 348576
61540C48576R04P35P53R37J630K931M158M499L994L393L172L123K814K052Q98
$$ 348576 349480 350215 350968 351905 353535 356466 360624 365123 369117 372510 375682 378805 381619 383671 384569
61525C84569m92j893l013l627l763l735l845m022l913l470l097l032k963k718
$$ 384569 384077 382184 379171 375544 371781 368046 364201 360179 356266 352796 349699 346667 343704 340986
61511C40986k768l378l650k512n18M81k86j560j890j374r44r63j309k021k880
$$ 340986 338218 334840 331190 328678 328160 328641 328355 326795 324905 323531 322587 321624 320315 318294 315414
61496C15414l009j990q19o96j285j247k87N86P31O25P52Q91Q99J172J844K262
$$ 315414 312405 310415 309596 308900 307615 306368 306081 306667 307398 308023 308775 309666 310565 311737 313581 315843
61480C15843J873J020L95J60J69M96J131J547J218M09j15j25j08m21p59p25m83
$$ 315843 317716 318736 319131 319291 319460 319956 321087 322634 323852 324261 324146 324021 323913 323492 322733 322008 321525
61463C21525m73o31m08L38R57Q32K99K03P08J131J066R37J197J595J708J602J463
$$ 321525 321052 320421 320013 320351 321308 322140 322439 322642 323350 324481 325547 326484 327681 329276 330984 332586 334049
61446C34049J068L42j00K66R21J042Q70J341K511L465L864M386N334N938N573
$$ 334049 335117 335459 335359 335625 336546 337588 338458 339799 342310 345775 349639 354025 359359 365297 370870
61431C70870M813M525M645M518L891K946J811O86N1J47N13N67L54L02N65J108
$$ 370870 375683 380208 384853 389371 393262 396208 398019 398705 398756 398903 399416 399983 400337 400639 401204 402312
61415D02312K056L353M367M447L665K574J490N31m7k37p53k235m130n204n247
$$ 402312 404368 407721 412088 416535 420200 422774 424264 424795 424748 424511 423758 421523 417393 412189 406942
61400D06942n342o194p019o633n043l376k577k722l346l881l815k966j781j043
$$ 406942 401600 395406 388387 381754 376711 373335 370758 368036 364690 360809 356994 354028 352247 351204
61386C51204j089j502j694j591j499j454j120m63j22o46j610j961j259j04P49
$$ 351204 350115 348613 346919 345328 343829 342375 341255 340792 340670 340024 338414 336453 335194 335090 335839
61371C35839J162J319J197P78L74K46K58K83O53J647K749L136K760K337K281K332
$$ 335839 337001 338320 339517 340295 340669 340915 341173 341456 342109 343756 346505 349641 352401 354738 357019 359351
61355C59351K369K777L693M506M649M472M786N752O766P389P877Q718R995J1392
$$ 359351 361720 364497 368190 372696 377345 381817 386603 392355 399121 406510 414387 423105 433100 444492
61341D44492J2621J3615J4265J4211J3030J0762Q178O266N372M913M044K535Q97
$$ 444492 457113 470728 484993 499204 512234 522996 531174 537440 542812 547725 551769 554304 555201
61328E55201l39j298k597m496o373p217o680n455m544m291m310m150l750l263
$$ 555201 554862 553564 550967 546471 540098 532881 526201 520746 516202 511911 507601 503451 499701 496438
61314D96438k779k372k224k419k652k357j306m4M88m8q90q42N20K529M175M969
$$ 496438 493659 491287 489063 486644 483992 481635 480329 480285 480773 480725 479835 478993 479513 482042 486217 491186
61298D91186N060M961N254O125O936O620M857K566Q38k60j446l036m619n673n982
$$ 491186 496246 501207 506461 512586 519522 526142 530999 533565 534403 534143 532697 529661 525042 519369 513387
61283E13387n493m371l225k694k693k586k100j559j049j34J352K747L310L106
$$ 513387 507894 503523 500298 497604 494911 492325 490225 488666 487617 487483 488835 491582 494892 497998
61269D97998K786K755L017L510M180M855N389N863O308O521O369O178O437P256
$$ 497998 500784 503539 506556 510066 514246 519101 524490 530353 536661 543182 549551 555729 562166 569422
61255E69422Q413R797J1435J3147J4519J5305J5591J5493J4875J3412J0911P557
$$ 569422 577835 587632 599067 612214 626733 642038 657629 673122 687997 701409 712320 719877
61243G19877L907M75k678n826q979j1652j3397j4302j4700j4548j3503j1592r538
$$ 719877 723784 724259 721581 715755 706776 695124 681727 667425 652725 638177 624674 613082 603544
61230F03544q224p864p722o744m638k344j076r14p11M58K225L618M338M819N356
$$ 603544 595320 587456 579734 572990 568352 566008 564932 564018 563307 563765 565990 569608 573946 578765 584121
61215E84121N788N929N768N262M429L703L562L794L602K631J426P24O80J069J735
$$ 584121 589909 595838 601606 606868 611297 615000 618562 622356 625958 628589 630015 630739 631419 632488 634223
61200F34223K625L654M899O660R034J1625J3978J6105J8297K0598K2765K4742
$$ 634223 636848 640502 645401 652061 661095 672720 686698 702803 721100 741698 764463 789205
61188G89205K6802K9168L1650L3652L4518L3899L2015K9492K6889K4468K2346
$$ 789205 816007 845175 876825 910477 944995 978894 1010909 1040401 1067290 1091758 1114104
61177A114104K0689J9455J8129J6054J3106R821O778M015J171j984n328q687j2030
$$ 1114104 1134793 1154248 1172377 1188431 1201537 1211358 1218136 1222151 1223322 1221338 1216010 1207323 1195293
61164A195293j5339j8453k1244k3817k6302k8501l0004l0731l1084l1438l1746
$$ 1195293 1179954 1161501 1140257 1116440 1090138 1061637 1031633 1000902 969818 938380 906634
61153I06634l1725l1150k9763k7260k3767k0060j6905j4322j1911r619p607n623
$$ 906634 874909 843759 813996 786736 762969 742909 726004 711682 699771 690152 682545 676922
61141F76922l274r17M91O52K85j7n08j429k140j838o41P21J986L444N225P205
$$ 676922 673648 672731 673222 673874 674159 674142 673634 672205 670065 668227 667586 668307 670293 673737 678962 686167
61125F86167R465J2222J5361J8572K1797K5050K8025L0554L3197L6564M0188M2994
$$ 686167 695632 707854 723215 741787 763584 788634 816659 847213 880410 916974 957162 1000156
61113A000156M4921M6961M9370N0953N0736M9425M8414M7971M7288M5773M3367
$$ 1000156 1045077 1092038 1141408 1192361 1243097 1292522 1340936 1388907 1436195 1481968 1525335
61102A525335L9977L5622L0950K6694K2555J7555J1563N552J10n413j1763j8575
$$ 1525335 1565312 1600934 1631884 1658578 1681133 1698688 1710251 1715803 1715913 1710500 1698737 1680162
61090A680162k4940l0598l5778m0259m3434m5256m6395m7338m7924m7858m7145
$$ 1680162 1655222 1624624 1588846 1548587 1505153 1459897 1413502 1366164 1318240 1270382 1223237
61079A223237m5792m3614m0743l7914l5786l4103l1951k8827k5154k1792j9270
$$ 1223237 1177445 1133831 1093088 1055174 1019388 985285 953334 924507 899353 877561 858291
61068H58291j7485j5885j3915j1447q879o702n056l807k866k133j268Q9J785L244
$$ 858291 840806 824921 811006 799559 790680 783978 778922 775115 772249 770116 768848 768937 770722 773966
61054G73966M190M977O096P692R655J1788J3731J5156J6284J7836K0215K3108
$$ 773966 778156 783133 789229 796921 806576 818364 832095 847251 863535 881371 901586 924694
61042I24694K6124K9273L2424L4940L6504L7803L9575M1469M2694M3445M4589
$$ 924694 950818 980091 1012515 1047455 1083959 1121762 1161337 1202806 1245500 1288945 1333534
61031A333534M6077M6950M6994M7182M8111M9015M8942M7859M6158M3987M1820
$$ 1333534 1379611 1426561 1473555 1520737 1568848 1617863 1666805 1714664 1760822 1804809 1846629
61020A846629M0789M1605M3833M6988N1543N7979O5551P3164Q1100R0939J04288
$$ 1846629 1887418 1929023 1972856 2019844 2071387 2129366 2194917 2268081 2349181 2440120 2544408
61009B544408J22565J47649J81719K26747K84984L59333M52393N65926P01847
$$ 2544408 2666973 2814622 2996341 3223088 3508072 3867405 4319798 4885724 5587571
61000E587571Q61519J041697J233171J426142J611843J767488J837351J745134
$$ 5587571 6449090 7490787 8723958 10150100 11761943 13529431 15366782 17111916
60992A7111916J448469R91814M99209J04496j18207j67243q1589Q1109K37040
$$ 17111916 18560385 19552199 20051408 20155904 20037697 19870454 19788865 19869974 20107014
60983B0107014K77240J12443k64367p60874j237780j585632j764175j789250j700111
$$ 20107014 20384254 20496697 20232330 19471456 18233676 16648044 14883869 13094619 11394508
60974A1394508j539162j345539j150142r70491q11960o74766n58778m63207l85515
$$ 11394508 9855346 8509807 7359665 6389174 5577214 4902448 4343670 3880463 3494948
60965C494948l22560k71963k31813k00163j75279j55593j39205j24281j10254
$$ 3494948 3172388 2900425 2668612 2468449 2293170 2137577 1998372 1874091 1763837
60956A763837r7768q7131p7567o8234n9223n1072m4016l8141l3721l0775k8749
$$ 1763837 1666069 1578938 1501371 1433137 1373914 1322842 1278826 1240685 1206964 1176189 1147440
60945A147440k7078k5803k5191k5036k4666k3578k1886k0233j9270j8974j8552
$$ 1147440 1120362 1094559 1069368 1044332 1019666 996088 974202 953969 934699 915725 897173
60934H97173j7321j5622j4440j4152j4231j4165j3960j3588j2782j1714j1157
$$ 897173 879852 864230 849790 835638 821407 807242 793282 779694 766912 755198 744041
60923G44041j1462j1856j1442j0387r535r200q988q597q134p718p335p023o811
$$ 744041 732579 720723 709281 698894 689359 680159 671171 662574 654440 646722 639387 632364 625553
60910F25553o476n801m978m365l980l591l251l239l507l619l388l111l074l178
$$ 625553 619077 613276 608298 603933 599953 596362 593111 589872 586365 582746 579358 576247 573173 569995
60896E69995l267l485m050m775n161m946m459m296m655n126n198m872m550m421
$$ 569995 566728 563243 559193 554418 549257 544311 539852 535556 530901 525775 520577 515705 511155 506734
60882E06734m361m433m963n812o105n211l695k731k684k906k841k657k644k577
$$ 506734 502373 497940 492977 487165 481060 475849 472154 469423 466739 463833 460992 458335 455691 453114
60868D53114k143j497r84n56J46J226K380L256L749M014M332M876N416N374M503
$$ 453114 450971 449474 448490 447934 448080 449306 451686 454942 458691 462705 467037 471913 477329 482703 487206
60853D87206L365K846L125L507L410L094L084L199K686J373O7m59m67q71k084
$$ 487206 490571 493417 496542 500049 503459 506553 509637 512836 515522 516895 516962 516503 516036 515165 513081
60838E13081l649m942n743o084o063n974o291p123p869p721o534n030m145m210
$$ 513081 509432 504490 498747 492663 486600 480626 474335 467212 459343 451622 445088 440058 435913 431703
60824D31703m650m481l198j357j01n6p94j420j490j176p51k53L75J100J831K550
$$ 431703 427053 422572 419374 418017 417916 417860 417066 415646 414156 412980 412229 411976 412351 413451 415282 417832
60808D17832L263L917M347M416M186L942L946M202M504M629M439L937L410L290
$$ 417832 421095 425012 429359 433775 437961 441903 445849 450051 454555 459184 463623 467560 470970 474260
60794D74260L631L916L654L028K454J800O56o85j316j068q69j447k289k554k352
$$ 474260 477891 481807 485461 488489 490943 492743 493399 492714 491398 490330 489461 488014 485725 483171 480819
60779D80819k401k850l233l432l880m785n757o256o066n310m362l659l259k770
$$ 480819 478418 475568 472335 468903 465023 460238 454481 448225 442159 436849 432487 428828 425569 422799
60765D22799k014j479j624k024j892j237q42j090j508j575j319r90o43k62Q4L90
$$ 422799 420785 419306 417682 415658 413766 412529 411687 410597 409089 407514 406195 405205 404562 404300 404384 404774
60749D04774O65Q17Q95J293K209L037K980K261J962K558L349L557L233K757K147
$$ 404774 405439 406256 407151 408444 410653 413690 416670 418931 420893 423451 426800 430357 433590 436347 438494
60734D38494J394Q66R26J416K002K579L005K921K269J664J760K473L156L338K982
$$ 438494 439888 440754 441680 443096 445098 447677 450682 453603 455872 457536 459296 461769 464925 468263 471245
60719D71245K323J710J397J238Q73L62J91M28M21l42j473k256k501k482k390k375
$$ 471245 473568 475278 476675 477913 478786 479148 479339 479767 480188 479846 478373 476117 473616 471134 468744 466369
60703D66369k683l261l574l294k861k877l279l659l975m402m704m482l864l328
$$ 466369 463686 460425 456851 453557 450696 447819 444540 440881 436906 432504 427800 423318 419454 416126
60689D16126l016k733k448k222j824j042k23J72L34Q18J511J755J497J524K330
$$ 416126 413110 410377 407929 405707 403883 402841 402618 402790 403124 403942 405453 407208 408705 410229 412559
60674D12559L403L943L842L579L531L677L732L510L192L214L620L851L475K859
$$ 412559 415962 419905 423747 427326 430857 434534 438266 441776 444968 448182 451802 455653 459128 461987
60660D61987K555K379J800J001O59P48N26j78o43n50n80j217j796j476m98K36
$$ 461987 464542 466921 468721 469722 470381 471129 471655 471477 470834 470284 469704 468487 466691 465215 464717 464953
60644D64953M03L52L35L48N06Q61R94L39r81k178k628k369j739r51j12N70Q08
$$ 464953 465356 465708 466043 466391 466897 467758 468752 469091 468110 465932 463304 460935 459196 458245 458133 458703 459511
60627D59511N52J95L71J277K331K755K483K129K095K221K352K713L412M036M088
$$ 459511 460063 460258 460629 461906 464237 466992 469475 471604 473699 475920 478272 480985 484397 488433 492521
60612D92521L523K623J679J011Q32Q92P08L94O94J825K830K706J639O44L22O31
$$ 492521 496044 498667 500346 501357 502189 503081 503789 504183 504877 506702 509532 512238 513877 514521 514843 515474
60596E15474J357K170K515K232K028K584L435L518K703J884J589J455J202J136
$$ 515474 516831 519001 521516 523748 525776 528360 531795 535313 538016 539900 541489 542944 544146 545282
60582E45282J303R55m53k223l009k344j109n52j055j857j876q99J73M24N9R1J027
$$ 545282 546585 547540 547087 544864 541855 539511 538402 537850 536795 534938 533062 532163 532336 532760 532819 532910 533937
60565E33937K361L376L871L987L877L793M005M346M235L428K401J780J678J865
$$ 533937 536298 539674 543545 547532 551409 555202 559207 563553 567788 571216 573617 575397 577075 578940
60551E78940K207K628K949L141L471M145M942N478N628N486N172M902M965N408
$$ 578940 581147 583775 586724 589865 593336 597481 602423 607901 613529 619015 624187 629089 634054 639462
60537F39462N913O242O521O879P082O883O465O187O151O357P056Q402R946J0969
$$ 639462 645375 651617 658138 665017 672099 678982 685447 691634 697785 704142 711198 719600 729546 740515
60523G40515J1383J1818J2792J4129J5337J6190J6815J7467J8325J9392K0454
$$ 740515 751898 763716 776508 790637 805974 822164 838979 856446 874771 894163 914617
60512I14617K1230K1570K1460K0921K0073J9228J8610J8074J7220J5797J3798
$$ 914617 935847 957417 978877 999798 1019871 1039099 1057709 1075783 1093003 1108800 1122598
60501A122598J1403R072P515P031O903N974M040K101R75J76j348l795o521r274
$$ 1122598 1134001 1143073 1150588 1157619 1164522 1170496 1174536 1176637 1177612 1177788 1176440 1172645 1166124 1156850
60487A156850j2555j6547k0469k3540k6074k8889l1834l3723l3821l2778l1699
$$ 1156850 1144295 1127748 1107279 1083739 1057665 1028776 996942 963219 929398 896620 864921
60476H64921l0770k9369k7112k4335k1576j9149j7246j5941j5052j4255j3442
$$ 864921 834151 804782 777670 753335 731759 712610 695364 679423 664371 650116 636674
60465F36674j2715j2058j1348j0682j0295j0090r723r211q954q963q650p715o699
$$ 636674 623959 611901 600553 589871 579576 569486 559763 550552 541598 532635 523985 516270 509571
60452E09571o219o060n615m886m494m772n413n840n597m534l126k326k538k992
$$ 509571 503352 497292 491677 486791 482297 477525 472112 466272 460675 456141 453015 450689 448151 445159
60438D45159k766k244k620m003m974m451l079k224k196k228j817j293j148j401
$$ 445159 442393 440149 437529 433526 428552 424101 421022 418798 416602 414374 412557 411264 410116 408715
60424D08715j735j880j738j349q22k45K91N94N05J89P1L07N96O19M60L71L49K23
$$ 408715 406980 405100 403362 402013 401191 400946 401237 401831 402336 402525 402596 402903 403499 404118 404578 404949 405298 405521
60406D05521p4m84r38j244j151p47m79n41m66K38J276J890J799J394J092R87J155
$$ 405521 405447 404963 404025 402781 401630 400883 400404 399863 399397 399635 400911 402801 404600 405994 407086 408073 409228
60389D09228J702K379K613K114J222M92J84J82J85j31q07j395j331o66m1Q5j07
$$ 409228 410930 413309 415922 418036 419258 419750 419934 420116 420301 420170 419363 417968 416637 415971 415930 416015 415908
60372D15908k62l55m69m27p3L85O12N93N09L37p4o28r74r62q06p78q72p78j51
$$ 415908 415646 415291 414822 414395 414322 414707 415319 415912 416421 416758 416684 416056 415082 414120 413314 412536 411664 410886 410735
60353D10735R61J889J898J084M01M77Q50Q34P08J217K179K528J943J444J947L004
$$ 410735 411696 413585 415483 416567 416968 417445 418295 419129 419837 421054 423233 425761 427704 429148 431095 434099
60337D34099L621L691L837M336M957N666O598P395P390O561N600M810L637J594
$$ 434099 437720 441411 445248 449584 454541 460207 466805 474200 481590 488151 493751 498561 502198 503792
60323E03792q95l009m435n383o025o311o111n325l989k571j776j831k175k093
$$ 503792 502897 499888 495453 490070 484045 477734 471623 466298 462309 459738 457962 456131 453956 451863
60309D51863j319J41K296M822O957Q306R410J0959J2729J3975J4440J4185J2734
$$ 451863 450544 450685 452981 457803 464760 473066 482476 493435 506164 520139 534579 548764 561498
60296E61498R535N234J358j597m702q661j2360j4067j3478j1758j0002q495p132
$$ 561498 571033 576267 577625 576028 571326 562665 550305 536238 522760 511002 501000 492505 485373
60283D85373n815m453l098k037j425j065q47j021j529j613q14M3k08j372k065
$$ 485373 479558 475105 472007 469970 468545 467480 466633 465612 464083 462470 461656 461699 461491 460119 458054
60268D58054j625q35n97q17r60r32p81j64J239L091M641N417N375M708L865L519
$$ 458054 456429 455594 454997 454180 453220 452288 451507 451343 452582 455673 460314 465731 471106 475814 479679 483198
60252D83198M009M844N023L874J580r62k819l781m473n480o379o212m856l304
$$ 483198 487207 492051 497074 500948 502528 501566 498747 494966 490493 485013 478634 472422 467566 464262
60238D64262k400j982j642j516j721j620n59J036K102K370K511K919L195K985
$$ 464262 461862 459880 458238 456722 455001 453381 452822 453858 455960 458330 460841 463760 466955 469940
60224D69940K647K651K882K932K760K690K930L353L699L755L502L150L010L221
$$ 469940 472587 475238 478120 481052 483812 486502 489432 492785 496484 500239 503741 506891 509901 513122
60210E13122L667M096M311M306M360M828N637O070N433L931K611K308K870L522
$$ 513122 516789 520885 525196 529502 533862 538690 544327 550397 555830 559761 562372 564680 567550 571072
60196E71072L762L717L682L540K890J731P92P88J455J742J078p3j013j633k038
$$ 571072 574834 578551 582233 585773 588663 590394 591186 591974 593429 595171 596249 596176 595163 593530 591492
60181E91492k054j733j842k953m326m660l774k788k515k683k825k987l123k673
$$ 591492 589438 587705 585863 582910 578584 573924 570150 567362 564847 562164 559339 556352 553229 550556
60167E50556j326L56J584K111K087J774J747K636M190N242N220M954N307N768
$$ 550556 549230 549586 551170 553281 555368 557142 558889 561525 565715 570957 576177 581131 586438 592206
60153E92206N328M150L227K789K280J684J575J842J674J088J224K638M421N706
$$ 592206 597534 601684 604911 607700 609980 611664 613239 615081 616755 617843 619067 621705 626126 631832
60139F31832P007R129J1546J2966J3133J2965J3071J3039J2293J0737Q379N018
$$ 631832 638839 647968 659514 672480 685613 698578 711649 724688 736981 747718 756097 761115
60127G61115P65l504o733q547r399r876j0092r683q321o205m012k350j359q54
$$ 761115 761880 758376 751643 743096 733697 723821 713729 704046 695725 689520 685508 683158 681799 680945
60113F80945o08l10L74J301J641P99n49r32J58J608K089J585J020Q37N93j16j092
$$ 680945 680337 680027 680401 681702 683343 684142 683593 682661 682819 684427 686516 688101 689121 689958 690551 690435 689343
60096F89343j919k382k355j778r38k99J65J008K417L776M541N063N936O936P355
$$ 689343 687424 685042 682687 680909 679971 679672 679837 680845 683262 687038 691579 696642 702578 709514 716869
60081G16869P203P146P208O435M296J649k63j305k339l910n654o891p262o875
$$ 716869 724072 731218 738426 744861 749157 750806 750543 749238 746899 742989 737335 730444 723182 716307
60067G16307o246o099o784p921q806r202r363r442r285q788q089p356o666o136
$$ 716307 710061 703962 697178 689257 680451 671249 661886 652444 643159 634371 626282 618926 612260 606124
60053F06124n823n513m923m160l564l084k206p01R91K240K877L165L417L829M414
$$ 606124 600301 594788 589865 585705 582141 579057 576851 576150 577141 579381 582258 585423 588840 592669 597083
60038E97083M936N118N020M924M777M175L119K278K112K082J302l09k035l422
$$ 597083 602019 607137 612157 617081 621858 626033 629152 631430 633542 635624 636926 636617 634582 631160
60024F31160m752o343p924r019r656j0306j1230j2117j2503j2309j1821j1129
$$ 631160 626408 620065 612141 603122 593466 583160 571930 559813 547310 535001 523180 512051
60012E12051r896p943n850m519m062l648k642j461q41p14l86L65J021J215J241
$$ 512051 502155 494212 488362 483843 479781 476133 473491 472030 471189 470475 470089 470454 471475 472690 473931
59997D73931J463J727J691J432J320J465J645J766K104K972M272N466O091O264
$$ 473931 475394 477121 478812 480244 481564 483029 484674 486440 488544 491516 495788 501254 507345 513609
59983E13609O540P142P549O999N390L351J477j54j705l204m613n922o870o903
$$ 513609 520149 527291 534840 541839 547229 550580 552057 551903 550198 546994 542381 536459 529589 522686
59969E22686n866m535l980m311m538l840k616j904j980k090j587q74p91j347j648
$$ 522686 516820 512285 508305 503994 499456 495616 493000 491096 489116 487026 485439 484565 483774 482427 480779
59954D80779j152m47l92q67r68l29L99N37K30M6J13J69J65K56K93j32j056k045
$$ 480779 479627 479180 478788 477921 476953 476624 477023 477560 477790 477836 477949 478118 478283 478539 478832 478700 477644 475599
59936D75599k854l727m772n459n179m131l155k736k580k211j653j234j007o88
$$ 475599 472745 469018 464246 458787 453608 449477 446322 443586 441006 438795 437142 435908 434901 434213
59922D34213j05M95P77P31O80Q04Q81O22K70N20J644K924L380K982K665L067L742
$$ 434213 434108 434603 435380 436111 436791 437595 438476 439098 439368 439888 441532 444456 447836 450818 453483 456550 460292
59905D60292L962L747L617L622L358K798K404K323K179J931K242L435M637M709
$$ 460292 464254 468001 471618 475240 478598 481396 483800 486123 488302 490233 492475 495910 500547 505256
59891E05256L752L027L385M392N105N168M899M730M891N396O079O692P164P613
$$ 505256 509008 512035 515420 519812 524917 530085 534984 539714 544605 550001 556080 562772 569936 577549
59877E77549Q028Q092P498O409N396M864M546L588J348j868m994p216q636r709
$$ 577549 585577 593669 601167 607576 612972 617836 622382 625970 627318 625450 620456 613240 604604 594895
59863E94895j0375j0205r229q061p103o223n336m706m375l789k477o83J084K781
$$ 594895 584520 574315 565086 557025 549922 543699 538363 533657 529282 525493 523016 522333 523417 526198
59849E26198M608O400P878R178J0444J1039J0065P707N275L598K220N98o95p16
$$ 526198 530806 537206 545084 554262 564706 575745 585810 593517 598792 602390 604610 605208 604513 603797
59835F03797L56J320J402Q55K18l58q98j319j565j687j614j238q86j244k569m373
$$ 603797 604153 605473 606875 607730 607948 607590 606692 605373 603808 602121 600507 599269 598383 597139 594570 590197
59819E90197o088p657r139j0152j0295r816r293q803p949o721n592m712l629k160
$$ 590197 584109 576452 567313 557161 546866 537050 527757 518954 511005 504284 498692 493980 490351 488191
59805D88191r16m60l43L49J692K747K700J700M54n49j300k064l118m439n483n529
$$ 488191 487275 486815 486472 486821 488513 491260 493960 495660 496114 495565 494265 492201 489083 484644 479161 473632
59789D73632m468l059k153j871j724j408j078q53m79L22J368K118K245J926J542
$$ 473632 469164 466105 463952 462081 460357 458949 457871 457018 456539 456861 458229 460347 462592 464518 466060
59774D66060J245R30N39K38K27N16R48J407J803J980J780J327J050J268J815K166
$$ 466060 467305 468235 468774 469012 469239 469755 470703 472110 473913 475893 477673 479000 480050 481318 483133 485299
59758D85299K000J460R35O77O72P93R20R80J010J121J327J410J198R61J251K153
$$ 485299 487299 488759 489694 490371 491043 491836 492756 493736 494746 495867 497194 498604 499802 500763 502014 504167
59742E04167K897K591J229l49j436j963k045j588o95N5K29K29P97J852K452J934
$$ 504167 507064 509655 510884 510535 509099 507136 505091 503503 502808 502863 503092 503321 504118 505970 508422 510356
59726E10356P41j90m16j71J76M21M64K85J09L05R81J728J950J515R45Q40J170
$$ 510356 511097 510907 510491 510320 510496 510917 511381 511666 511775 512080 513061 514789 516739 518254 519199 520039 521209
59709E21209J391J243J126J448J924J905J210K88m26q87j164j235j201j262j377
$$ 521209 522600 523843 524969 526417 528341 530246 531456 531744 531318 530431 529267 528032 526831 525569 524192
59694E24192j241q11n06o43r71j051q82p80q14o97j78O84J597K173K159J690J271
$$ 524192 522951 522140 521634 520991 520020 518969 518087 517307 516493 515796 515618 516302 517899 520072 522231 523921 525192
59677E25192J215J242P84k68j472k354k834l070l107k847k275j676j499j948k621
$$ 525192 526407 527649 528433 528165 526693 524339 521505 518435 515328 512481 510206 508530 507031 505083 502462
59662E02462k729j806j98J280K106K381K485K560K453K120K019K708M036N023
$$ 502462 499733 497927 497729 499009 501115 503496 505981 508541 510994 513114 515133 517841 521877 526900
59648E26900M910M097L505L190K319O00j138k106k569l097l536l470l130k961
$$ 526900 531810 535907 539412 542602 544921 545521 544383 542277 539708 536611 533075 529605 526475 523514
59634E23514k580j239P59K187K490K413K701L103L005K394J672J130J060J780
$$ 523514 520934 519695 520454 522641 525131 527544 530245 533348 536353 538747 540419 541549 542609 544389
59620E44389K962L476K550P99n52j194j776k642l287l166k355j189K33J870L484
$$ 544389 547351 550827 553377 554176 553624 552430 550654 548012 544725 541559 539204 538015 538248 540118 543602
59605E43602M855N962O714O751N894M583L488K708J752L29j170k208k803l394
$$ 543602 548457 554419 561133 567884 573778 578361 581849 584557 586309 586638 585468 583260 580457 577063
59591E77063m170m859n137m961m462l879l615l967m588m653l862k943k743l135
$$ 577063 572893 568034 562897 557936 553474 549595 545980 542013 537425 532772 528910 525967 523224 520089
59577E20089l283k854k290j974j719j315r73r55j128j163r51n57kP08J540K511
$$ 520089 516806 513952 511662 509688 507969 506654 505681 504726 503598 502435 501484 500927 500925 501633 503173 505684
59561E05684L548M216L980K973K109K148K878L533L672L339K674J809J057P87
$$ 505684 509232 513448 517428 520401 522510 524658 527536 531069 534741 538080 540754 542563 543620 544407
59547E44407J126J914K931L901M533M810N177O125P738R826J2330J5248J8180
$$ 544407 545533 547447 550378 554279 558812 563622 568799 574924 582662 592488 604818 620066 638246
59534F38246K0259K0558J8476J4069Q288K804q43k071j246Q65L462N889P960R997
$$ 638246 658505 679063 697539 711608 719896 722700 721857 719786 718540 719405 722867 728756 736716 746713
59520G46713J2144J3771J3985J2658J0490Q068N341K091j583n392r106j2545j5512
$$ 746713 758857 772628 786613 799271 809761 817829 823170 825261 823678 818286 809180 796635 781123
59507G81123j7812j9164j9164j7750j5632j3764j2381j1048r627q526p806o834
$$ 781123 763311 744147 724983 707233 691601 677837 665456 654408 644781 636255 628449 621615
59495F21615n261l681k730k056r26N32J544J969K495L444M260M411M253M572N705
$$ 621615 616354 612673 609943 607887 606961 607493 609037 611006 613501 616945 621205 625616 629869 634441 640146
59480F40146P448R403J1091J2135J2778J3847J5630J7107J6940J5180J3147J1568
$$ 640146 647594 656997 668088 680223 693001 706848 722478 739585 756525 771705 784852 796420
59468G96420R630O398K443o75k106k169j297N79L443O828J0360J4083J7953K1486
$$ 796420 806050 812448 814891 814216 812110 809941 808644 809223 812666 819494 829854 843937 861890 883376
59454H83376K4420K7215L0393L3772L6896L9871M3015M5836M7137M6077M2433
$$ 883376 907796 935011 965404 999176 1036072 1075943 1118958 1164794 1211931 1258008 1300441
59443A300441L5747K5145J0541o460k3308l7836m8675n5040n6890n5112n1043
$$ 1300441 1336188 1361333 1371874 1365414 1342106 1304270 1255595 1200555 1143665 1088553 1037510
59432A037510m5749m0032l4772l0692k7713k5031k1898j8095j3729r035m404j38
$$ 1037510 991761 951729 916957 886265 858552 833521 811623 793528 779799 770764 766360 766222
59420G66222M061Q893J4428J9573K3069K4832K5878K6931K7687K7592K6725K5233
$$ 766222 770283 779176 793604 813177 836246 861078 886956 913887 941574 969166 995891 1021124
59408A021124K2218J6082O367n209j5901k3810k8406k9800k8296k4521j9265j3135
$$ 1021124 1043342 1059424 1065791 1060582 1044681 1020871 992465 962665 934369 909848 890583 877448
59396H77448o977k660k489p163j4727k2016k6923k9007k8564k6061k2407j8868
$$ 877448 870471 867811 865322 858159 843432 821416 794493 765486 736922 710861 688454 669586
59384F69586j6199j4200j2298j0374q782p723o889n734m105k492j506j153q90
$$ 669586 653387 639187 626889 616515 607733 600010 593121 587387 583282 580790 579284 578131 577241
59371E77241n15m78j034j498j021J37Q53O88M54R97K145L305M479O066P896R242
$$ 577241 576726 576248 575214 573716 572695 572832 573685 574373 574827 575824 577969 581274 585753 591819 599715 608957
59355F08957R764J0003J0789J2537J5201J8536K2182K5599K8243K9885L0771L1370
$$ 608957 618721 628724 639513 652050 667251 685787 707969 733568 761811 791696 822467 853837
59343H53837L1966L2430L2425L1706L0166K7692K4181J9738J4555Q592J635o098
$$ 853837 885803 918233 950658 982364 1012530 1040222 1064403 1084141 1098696 1107288 1108923 1102825
59331A102825j3739k0326k5516k9530l2584l4604l5414l5017l3688l1937l0228
$$ 1102825 1089086 1068760 1043244 1013714 981130 946526 911112 876095 842407 810470 780242
59320G80242k8567k6523k3848k0898j8227j5977j3979j2212j0760r392p706n716
$$ 780242 751675 725152 701304 680406 662179 646202 632223 620011 609251 599859 592153 586437
59308E86437l857k288o23J491L890O230Q463J0683J2754J4342J5111J4674J2560
$$ 586437 582580 580292 579669 581160 585050 591280 599743 610426 623180 637522 652633 667307 679867
59295F79867Q560L096k921q415j2339j3965j3412j1669r712p725n498l337j928
$$ 679867 688427 691523 688602 680187 667848 653883 640471 628802 619090 611365 605867 602530 600602
59282F00602j290n20J079L107M658N495O201P380R157J1403J3962J6561J8873
$$ 600602 599312 598792 599871 602978 607636 613131 619332 626712 635869 647272 661234 677795 696668
59269F96668K0852K2723K4367K5007K3854K0980J7265J3466R715N915K131j636
$$ 696668 717520 740243 764610 789617 813471 834451 851716 865182 874897 880812 882943 881307
59257H81307n629r828j3495j5730j6444j6404j6255j6006j5403j4398j3003j1209
$$ 881307 875678 865850 852355 836625 820181 803777 787522 771516 756113 741715 728712 717503
59245G17503r257p586o171m335j545J807M862P259R278J1228J3136J4874J6163
$$ 717503 708246 700660 694489 690154 688609 690416 695278 702537 711815 723043 736179 751053 767216
59232G67216J6532J5720J4081J2148R914O954L239o51m254p698j1272j4859j7929
$$ 767216 783748 799468 813549 825697 835611 842565 845804 845153 840899 833201 821929 807070 789141
59219G89141j9930k0649k0435j9956j9496j8633j6920j4746j2996j1963j1199
$$ 789141 769211 748562 728127 708171 688675 670042 653122 638376 625380 613417 602218
59208F02218j0338r454q552p543o753o661o880o302m653l062k503k467j962j063
$$ 602218 591880 582426 573874 566331 559578 552917 546037 539735 535082 532020 529517 527050 525088 524025
59194E24025n91p04r28j166j642j918j118P16K382K871K342J585J178J403K261
$$ 524025 523434 522730 521802 520636 518994 517076 515958 516674 519056 521927 524269 525854 527032 528435 530696
59179E30696L266L787L886M355N588O968P758Q105Q732R913J1295J2540J3713
$$ 530696 533962 537749 541635 545990 551578 558546 566304 574409 583141 593054 604349 616889 630602
59166F30602J5119J6952J9129K1156K2305K2109K0748J8836J6768J4346J1019
$$ 630602 645721 662673 681802 702958 725263 747372 768120 786956 803724 818070 829089
59155H29089O602J705k678o127r059j1888j4287j5699j6242j6516j6634j6149
$$ 829089 835691 837396 834718 828591 819532 807644 793357 777658 761416 744900 728266 712117
59143G12117j4978j3718j2859j2310j1897j1705j1680j1476j1060j0848j0856
$$ 712117 697139 683421 670562 658252 646355 634650 622970 611494 600434 589586 578730
59132E78730j0262q433n908l831k676k124j717j104L8J565K610K540K018K338
$$ 578730 568468 560035 554127 550296 547620 545496 543779 542675 542713 544278 546888 549428 551446 553784
59118E53784L693M987N570O210P875J0203J1905J2298J1798J1022J0109R081Q381
$$ 553784 557477 562464 568034 574244 582119 592322 604227 616525 628323 639345 649454 658535 666916
59105F66916Q644R918J1372J1879J1002R355P956P229O750N932M748L686L067
$$ 666916 675560 685478 696850 708729 719731 729086 737042 744271 751021 756953 761701 765387 768454
59092G68454K655J975Q93j99p73p00l91m41j084k034k886l716n102p381r962j1718
$$ 768454 771109 773084 773977 773778 773005 772305 771914 771473 770389 768355 765469 761753 756651 749270 739308 727590
59076G27590j2228j2220j2527j2952j2678j1581j0446r768r142q130p135o773
$$ 727590 715362 703142 690615 677663 664985 653404 642958 633190 624048 615918 608783 602010
59064F02010o807o425n416m371l718l137k241j338j136j813k729l119k901k692
$$ 602010 595203 588778 583362 578991 575273 572136 569895 568557 567421 565608 562879 559760 556859 554167
59050E54167l021l625l762l202k594k634l153l407l126k755k638k480j829p54
$$ 554167 551146 547521 543759 540557 537963 535329 532176 528769 525643 522888 520250 517770 515941 515187
59036E15187K73R62J328J415J244J043J219J970L027M028M983O222P911R746J1242
$$ 515187 515460 516422 517750 519165 520409 521452 522671 524641 527668 531696 536679 542901 550812 560558 571800
59021E71800J2196J2733J3042J3191J3265J3407J3545J3196J1798R352O598M386
$$ 571800 583996 596729 609771 622962 636227 649634 663179 676375 688173 697525 704123 708509
59009G08509K894J641L23o54p49j09O50J493L115N763Q563J0536J1865J3416J5226
$$ 708509 711403 713044 713367 712713 711964 711855 712505 713998 717113 722876 731439 741975 753840 767256 782482
58994G82482J6425J6584J6289J6077J5631J4486J2870J1162R006N697J310l128
$$ 782482 798907 815491 831780 847857 863488 877974 890844 902006 911012 916709 918019 914891
58982I14891o669r289j1592j3918j5720j6002j4455j2086j0282r265q012n831
$$ 914891 908222 898933 887341 873423 857703 841701 827246 815160 804878 795613 787601 781770
58970G81770l251j075P33K633M599O337P952R655J1106J1768J1754J1673J1811
$$ 781770 778519 777444 778177 780810 785409 791746 799698 809353 820459 832227 843981 855654 867465
58957H67465J1926J1650J0458P647L107k061o469r841j2796j5521j7576j8768
$$ 867465 879391 891041 901499 909146 912253 910192 903723 893882 881086 865565 847989 829221
58945H29221j9168j8351j5810j2264r352p697o307m318k179o45K30M22o93l280
$$ 829221 810053 791702 775892 763628 754276 746579 740272 735954 733775 733130 733360 733782 733089 729809
58931G29809o224q433j0165j2035j3406j3123j1454r869r021q194o895n661m936
$$ 729809 723585 715152 704987 692952 679546 666423 654969 645100 636079 627885 620990 615329 610393
58918F10393m245l167k173j799j628q94L15J234J705K472M111O142P573Q102Q442
$$ 610393 606148 602981 600808 599009 597381 596487 596802 598036 599741 602213 606324 612466 620039 628141 636583
58903F36583R436J1100J2755J4012J5148J6408J7335J7304J6528J5976J6277J7216
$$ 636583 646019 657119 669874 683886 699034 715442 732777 750081 766609 782585 798862 816078
58891H16078J8451K0211K2949K6606L0608L4464L8041M1263M3747M4817M3845
$$ 816078 834529 854740 877689 904295 934903 969367 1007408 1048671 1092418 1137235 1181080
58880A181080M0669L5785L0029K3936J7394J0015J735p101j6046k4699l2484l8601
$$ 1181080 1221749 1257534 1287563 1311499 1328893 1338908 1340643 1333542 1317496 1292797 1260313 1221712
58868A221712m2469m4218m4504m3738m1716l8233l3883k9808k6599k3875k1172
$$ 1221712 1179243 1135025 1090521 1046783 1005067 966834 932951 903143 876544 852669 831497
58857H31497j8812j7395j6729j5951j4701j3550j3043j2884j2409j1472j0349
$$ 831497 812685 795290 778561 762610 747909 734359 721316 708432 696023 684551 674202
58846F74202r123p699o302n372m894m374l616l038l050l447l761l903m092m383
$$ 674202 665079 657380 651078 645706 640812 636438 632822 629784 626734 623287 619526 615623 611531 607148
58832F07148m638m892n298n722n718n049l976k976k343k099k029j723q36N64J978
$$ 607148 602510 597618 592320 586598 580880 575831 571855 568879 566536 564437 562408 560685 559849 560413 562391
58817E62391L027L751M337M729M735M359L865L548L551L814L978L570K431R50
$$ 562391 565418 569169 573506 578235 582970 587329 591194 594742 598293 602107 606085 609655 612086 613036
58803F13036k74r68j277j518j909k431k749k484j704r82p39p11m24L4J55j32k14
$$ 613036 612762 611794 610517 608999 607090 604659 601910 599426 597722 596740 596001 595290 594866 594900 595055 594923 594709
58786E94709M79J890L530M991O063O686P041P470Q081Q481Q123O902N333M158
$$ 594709 595188 597078 600608 605599 611662 618348 625389 632859 640940 649421 657544 664446 669779 673937
58772F73937L733L734L434K350O88q87j825k057j877j702j844k316k860l172l091
$$ 673937 677670 681404 684838 687188 687876 686989 685164 683107 681230 679528 677684 675368 672508 669336 666245
58757F66245k511j378N1J207J820K378L541N159O349O595O330O260O515O743O737
$$ 666245 663734 662356 662407 663614 665434 667812 671353 676512 682861 689456 695786 702046 708561 715304 722041
58742G22041O651O717O958P182P083O432N262L895K807K369K605L115L405L491
$$ 722041 728692 735409 742367 749549 756632 763064 768326 772221 775028 777397 780002 783117 786522 790013
58728G90013L968N256P008Q521R455R846R638Q791P668O740N995N188M544M603
$$ 790013 793981 799237 806245 814766 824221 834067 843705 852496 860164 866904 872899 878087 882631 887234
58714H87234N356O290P327Q847J0619J1631J1394J0580R769Q347N490J623k004
$$ 887234 892590 898880 906207 915054 925673 937304 948698 959278 969047 977394 982884 984507 982503
58701I82503m866p470j0342j3451j6579j9467k1604k2562k2551k2153k1419j9885
$$ 982503 977637 970167 959825 946374 929795 910328 888724 866162 843611 821458 800039 780154
58689G80154j7478j4856j2617j0780r287q494q739r716j0675j1093j0896j0203
$$ 780154 762676 747820 735203 724423 715136 706642 697903 688187 677512 666419 655523 645320
58677F45320r160q026p066o311n508m425l080j531M39L153O394R188J0673J1159
$$ 645320 636160 628134 621068 614757 609249 604824 601744 600213 600652 603805 610199 619387 630060 641219
58663F41219J1892J3620J5707J6866J6421J4642J2086R125N982K890J40j926l076
$$ 641219 653111 666731 682438 699304 715725 730367 742453 751578 757560 760450 760590 758664 755588
58650G55588l492l707m056m379m437m352m390m528m569m508m417m043k946r72
$$ 755588 752096 748389 744333 739954 735517 731165 726775 722247 717678 713170 708753 704710 701764 700792
58636G00792J561M080N907O495N936N120M923N210N052L932K340J089M52J51o6
$$ 700792 702353 706433 712340 718835 724771 729891 734814 740024 745076 749008 751348 752437 752889 753040 752974
58621G52974j44J67J105K774N146Q095J1354J4473J7028J9068K1050K3033K4165
$$ 752974 752830 752997 754102 756876 762022 770117 781471 795944 812972 832040 853090 876123 900288
58608I00288K3382K0628J6919J3190R533N777K228m78k158l228m132m878n246
$$ 900288 923670 944298 961217 974407 983940 989717 991945 991467 989309 986081 981949 977071 971825
58595I71825n220n089n120n306n411n261m861m238l327j995j98J920M055N924
$$ 971825 966605 961516 956396 951090 945679 940418 935557 931319 927992 925997 925799 927719 931774 937698
58581I37698P485Q940J0383J1560J2117J2043J1519J0478Q669O245L925K394J863
$$ 937698 945183 954123 964506 976066 988183 1000226 1011745 1022223 1030892 1037137 1041062 1043456 1045319
58568A045319K239L328M684N772O643Q092J0670J3805J6367J7908J8817J9338
$$ 1045319 1047558 1050886 1055570 1061342 1067985 1076077 1086747 1100552 1116919 1134827 1153644 1172982
58556A172982J9036J7349J4287J0423O461K939j0k669n394q089j0209j1367j1761
$$ 1172982 1192018 1209367 1223654 1234077 1240538 1243477 1243467 1240798 1235404 1227315 1217106 1205739 1193978
58543A193978j1832j1745j1453j1245j1772j3267j4972j5831j5724j5582j6008
$$ 1193978 1182146 1170401 1158948 1147703 1135931 1122664 1107692 1091861 1076137 1060555 1044547
58532A044547j6370j5671j3933j2029j0334q319n502k140J177M095O405P978R042
$$ 1044547 1028177 1012506 998573 986544 976210 967891 962389 960249 961426 965521 971926 979904 988946
58519I88946J0066J1139J1787J1554J0363Q333N787L575K550K528K443J835J395
$$ 988946 999012 1010151 1021938 1033492 1043855 1052188 1057975 1061550 1064100 1066628 1069071 1070906 1072301
58506A072301J729K404K867L458M735O411P849R120J0681J2379J3575J4052J4036
$$ 1072301 1074030 1076434 1079301 1082759 1087494 1093905 1101754 1110874 1121555 1133934 1147509 1161561 1175597
58493A175597J3524J2330J0596Q622O267L162o84m907r133j2769j4919j5250j4632
$$ 1175597 1189121 1201451 1212047 1220669 1226936 1230098 1229414 1224507 1215374 1202605 1187686 1172436 1157804
58480A157804j4158j3724j2388r892p005m451k318n97M51O03j84j905m305o667
$$ 1157804 1143646 1129922 1117534 1107642 1100637 1096186 1093868 1093271 1093722 1094325 1094141 1092236 1087931 1081264
58466A081264q388r617j0784j1680j1742j1019j0155r454q658p616o471n214l680
$$ 1081264 1072876 1063259 1052475 1040795 1029053 1018034 1007879 998425 989767 982151 975680 970466 966786
58453I66786j966k84J456L361M975N663N358M296K284q60m308o625p268o889o178
$$ 966786 964820 964536 965992 969353 974328 979991 985349 989645 991929 991069 986761 980136 972868 965979 959801
58438I59801n237m114l032j900l25J663L573N177O652P969Q840R377J0101J1218
$$ 959801 954564 950450 947418 945518 945193 946856 950429 955606 962258 970227 979067 988444 998545 1009763
58424A009763J2529J3989J5611J6877J7104J6428J5593J4703J3111J0601P783
$$ 1009763 1022292 1036281 1051892 1068769 1085873 1102301 1117894 1132597 1145708 1156309 1164092
58413A164092N148K700O58m87r96j944l789n731o981p837q834r581r181p454n068
$$ 1164092 1169240 1171940 1172598 1172111 1171115 1169171 1165382 1159651 1152670 1144833 1135999 1126418 1117237 1109783 1104715
58398A104715k715o02J361L285N163O872Q268R117Q957P362M681J949l57k961
$$ 1104715 1102000 1101398 1102759 1106044 1111207 1118079 1126347 1135464 1144421 1151783 1156464 1158413 1158056 1155095
58384A155095o473j0070j2360j3129j3200j2925j2082j0998j0441j0295r574p946
$$ 1155095 1148622 1138552 1126192 1113063 1099863 1086938 1074856 1063858 1053417 1043122 1033548 1025602
58372A025602o108m541k956j195L97J756L250M874O203P329Q817J0594J1962J2850
$$ 1025602 1019494 1014953 1011997 1010802 1011199 1012955 1016205 1021079 1027282 1034611 1043428 1054022 1065984 1078834
58358A078834J3967J5428J6295J5837J4310J2228R801P286M974K658R2k092k978
$$ 1078834 1092801 1108229 1124524 1140361 1154671 1166899 1176700 1183986 1188960 1191618 1191710 1189618 1186640
58345A186640k859k846k935j851R03M216O916Q977J0785J2445J4124J6061J7873
$$ 1186640 1183781 1180935 1178000 1176149 1177052 1181268 1188184 1197161 1207946 1220391 1234515 1250576 1268449
58332A268449J8923J9341J9649J9537J8330J6505J5102J3853J1672Q900P059O292
$$ 1268449 1287372 1306713 1326362 1345899 1364229 1380734 1395836 1409689 1421361 1430261 1437320 1443612
58320A443612N250L756L293M342N569O342P675R875J1594J2313J3430J5676J7734
$$ 1443612 1448862 1452618 1455911 1460253 1465822 1472164 1479839 1489714 1501308 1513621 1527051 1542727 1560461
58307A560461J8781K0074K2421K4275K4207K3358K3457K4076K3793K2606K1372
$$ 1560461 1579242 1599316 1621737 1646012 1670219 1693577 1717034 1741110 1764903 1787509 1808881
58296A808881K0134J8721J7818J7845J7953J7538J7510J8676K0323K1741K3670
$$ 1808881 1829015 1847736 1865554 1883399 1901352 1918890 1936400 1955076 1975399 1997140 2020810
58285B020810K6765L0109L2727L5178L8129M0940M3035M5111M7501M9057M9120
$$ 2020810 2047575 2077684 2110411 2145589 2183718 2224658 2267693 2312804 2360305 2409362 2458482
58274B458482M8872M9060M8230M5057M0686L7001L4330L2592L2847L5642L9537
$$ 2458482 2507354 2556414 2604644 2649701 2690387 2727388 2761718 2794310 2827157 2862799 2902336
58263B902336M3137M6950N1549N5850N9156O2778O7576P1965P4529P6402P8817
$$ 2902336 2945473 2992423 3043972 3099822 3158978 3221756 3289332 3361297 3435826 3512228 3591045
58252C591045Q0608Q0691Q0752Q2748Q5868Q8713R2313R8167J05315J12196J19323
$$ 3591045 3671653 3752344 3833096 3915844 4001712 4090425 4182738 4280905 4386220 4498416 4617739
58241D617739J27347J34851J40976J47800J57006J66754J75125J83907J95367
$$ 4617739 4745086 4879937 5020913 5168713 5325719 5492473 5667598 5851505 6046872
58232F046872K08071K19831K32079K47151K63793K79806K96689L17147L40421
$$ 6046872 6254943 6474774 6706853 6954004 7217797 7497603 7794292 8111439 8451860
58223H451860L64596L91087M22096M56201M91285N29342N73520O23217O77121
$$ 8451860 8816456 9207543 9629639 10085840 10577125 11106467 11679987 12303204 12980325
58214A2980325P38005Q09097Q89167R77067J077524J196193J332991J487426J666464
$$ 12980325 13718330 14527427 15416594 16393661 17471185 18667378 20000369 21487795 23154259
58205B3154259J879573K130422K422324K768285L187578L697994M322418N099168
$$ 23154259 25033832 27164254 29586578 32354863 35542441 39240435 43562853 48662021
58197D8662021O075428P294743Q800508J0642666J2862993J5471258J8435795
$$ 48662021 54737449 62032192 70832700 81475366 94338359 109809617 128245412
58190A28245412K1673824K5025491K8242873L1003709L2873304L3189851L1066604
$$ 128245412 149919236 174944727 203187600 234191309 267064613 300254464 331321068
58183C31321068K5745356J7176236O323728n142206j5534195k3679328k9047108
$$ 331321068 357066424 374242660 380566388 375424182 359889987 336210659 307163551
58176C07163551l1639875l1855654l0335326k7760666k4686955k1500421j8457688
$$ 307163551 275523676 243668022 213332696 185572030 160885075 139384654 120926966
58169A20926966j5712782j3324193j1285915r572041q151546o979883o005618
$$ 120926966 105214184 91889991 80604076 71032035 62880489 55900606 49894988
58162D9894988n189564m505950l929122l433645l005435k639699k328230k058699
$$ 49894988 44705424 40199474 36270352 32836707 29831272 27191573 24863343 22804644
58154B2804644j824597j625316j456756j310448j181341j068522r68987q77991
$$ 22804644 20980047 19354731 17897975 16587527 15406186 14337664 13368677 12490686
58146A2490686p94911p22074o58451o00442n47686n02117m62532m25988l93371
$$ 12490686 11695775 10973701 10315250 9714808 9167122 8665005 8202473 7776485 7383114
58137G383114l67616l47341l27929l08071k89763k72645k54069k34405k16898
$$ 7383114 7015498 6668157 6340228 6032157 5742394 5469749 5215680 4981275 4764377
58128D764377k02198j87976j73839j61903j52294j42652j32467j23717j17000
$$ 4764377 4562179 4374203 4200364 4038461 3886167 3743515 3611048 3487331 3370331
58119C370331j10837j05041j00931r8048r4328q9725q6155q3605p9936p4864p0680
$$ 3370331 3259494 3154453 3053522 2955474 2861146 2771421 2685266 2601661 2521725 2446861 2376181
58108B376181o8475o6790o4578o2528o0892n8829n6498n5247n5204n4983n4088
$$ 2376181 2307706 2240916 2176338 2113810 2052918 1994089 1937591 1882344 1827140 1772157 1718069
58097A718069n3198n1949m8876m3916l8731l4161k9574k4823k0769j7606j4765
$$ 1718069 1664871 1612922 1564046 1520130 1481399 1447238 1417664 1392841 1372072 1354466 1339701
58086A339701j2585j2021j2665j3071j3112j3961j5746j7307j8257j9224j9998
$$ 1339701 1327116 1315095 1302430 1289359 1276247 1262286 1246540 1229233 1210976 1191752 1171754
58075A171754j9658j8578j8199j8689j8844j8329j7872j7287j5639j3593j3137
$$ 1171754 1152096 1133518 1115319 1096630 1077786 1059457 1041585 1024298 1008659 995066 981929
58064I81929j4423j5171j3965j1993j0714r834q663p718p762q490r201r753j0155
$$ 981929 967506 952335 938370 926377 915663 905829 897166 889448 881686 873196 863995 854242 844087
58051H44087j0146r766r518r510r244q459p517o835o654p108p711p299n574m100
$$ 844087 833941 824175 814657 805147 795903 787444 779927 773092 766438 759330 751619 744320 738746 734646
58037G34646m368n510n562m461l866m353m904n146n876p064p495o978o929p970
$$ 734646 730278 724768 719206 714745 710879 706526 701622 696476 690600 683536 676041 669063 662134 654164
58023F54164q728p948o292n073m494m106l952m288m866n190m957l993k463j211
$$ 654164 645436 637488 631196 626123 621629 617523 613571 609283 604417 599227 594270 590277 587814 586603
58009E86603j043j591j747j232p11m84k30q5n69j411j687j336j196j485j617j705
$$ 586603 585560 583969 582222 580990 580279 579795 579565 579480 578911 577500 575813 574477 573281 571796 570179 568474
57993E68474k667m451n716n790n521n647n696n244m806m663m050k499r07k80l34
$$ 568474 565807 561356 555640 549850 544329 538682 532986 527742 522936 518273 514223 511724 510817 510537 510203
57978E10203k55q8l70r61j234j035p64p38r80j345j551j308o89k4N82J143J374
$$ 510203 509948 509860 509490 508529 507295 506260 505496 504758 503778 502433 500882 499574 498885 498861 499443 500586 501960
57961E01960R79L33R9K11J4n54q81q05q87j418k029k473k907l227l036k531k495
$$ 501960 502939 503272 503371 503582 503596 503042 502161 501356 500469 499051 497022 494549 491642 488415 485379 482848 480353
57944D80353l120l666l563l076k600k098j490q89k27O14J336J558J631K198L007
$$ 480353 477233 473567 470004 466928 464328 462230 460740 459851 459624 460238 461574 463132 464763 466961 469968
57929D69968L192K729K427K422J942Q34k9k87q12k173l548l933l550l298l537
$$ 469968 473160 475889 478316 480738 482680 483514 483485 483198 482386 480213 476665 472732 469182 465884 462347
57914D62347m023m517m789m576l980l493l342l271l065k750k240j462q30q53j240
$$ 462347 458324 453807 449018 444442 440462 436969 433627 430356 427291 424541 422301 420839 420009 419156 417916
57899D17916j288j037j115j479j505j293j627k457k791k360k054k281k267j573
$$ 417916 416628 415591 414476 412997 411492 410199 408572 406115 403324 400964 398910 396629 394362 392789
57885C92789r29q88q38j67O99J205J560J929J747P21l88q27r31j404k217k964
$$ 392789 391860 390972 390134 389967 390666 391871 393431 395360 397107 397828 397440 396613 395682 394278 392061 389097
57869C89097l585m071m160l901l873m300m692m728m629m264l064j334l96o96r63
$$ 389097 385512 381441 377281 373380 369507 365207 360515 355787 351158 346894 343830 342496 342100 341404 340441
57854C40441j67R13J138Q92J298K401L444M217M912N244M923M499M619M831M267
$$ 340441 340274 341187 342325 343217 344515 346916 350360 354577 359489 364733 369656 374155 378774 383605 387872
57839C87872L057K045J435P78ro10j097j826k701l273l436l394l218k994l032
$$ 387872 390929 392974 394409 395187 395178 394568 393471 391645 388944 385671 382235 378841 375623 372629 369597
57824C69597l366l460k957k224j604p94L84J293J365J070J103J278J043M38l99
$$ 369597 366231 362771 359814 357590 355986 355192 355576 356869 358234 359304 360407 361685 362728 363166 362767
57809C62767j984m515o832p594p139o873p130p031o268n611n445n095m013k674
$$ 362767 360783 356268 349436 341842 334703 327830 320700 313669 307401 301790 296345 291250 287237 284563
57795B84563j847j655j739j839j946k213k743l248l135k272j343r72r36p83o94
$$ 284563 282716 281061 279322 277483 275537 273324 270581 267333 264198 261926 260583 259611 258675 257892 257198
57780B57198r48j007j08J461K611K869K727K737L073L788M679M986M143K771K027
$$ 257198 256250 255243 255135 256596 259207 262076 264803 267540 270613 274401 279080 284066 288209 290980 293007
57765B93007K084K093J641J191R97O09k24j058j603k191k978l357k817j902j649
$$ 293007 295091 297184 298825 300016 301013 301622 301398 300340 298737 296546 293568 290211 287394 285492 283843
57750B83843k276k898k555j176M77J583J872J579J060O18M97O37N12l31j421j724
$$ 283843 281567 278669 276114 274938 275415 276998 278870 280449 281509 282127 282624 283261 283773 283442 282021 280297
57734B80297j002k25k60q28j266j623k227k676k221r41K01M87L6n67p32j36R60
$$ 280297 279295 279070 278810 277982 276716 275093 272866 270190 267969 267028 267229 267716 267752 267185 266453 266317 267277
57717B67277J739J606Q05K7l36k29K55O73L74o24j380j243p68q23j337j631j523
$$ 267277 269016 270622 271427 271454 271118 270889 271144 271817 272191 271567 270187 268944 268176 267353 266016 264385 262862
57700B62862j191n26N34J358J312P79N55N56N9r87j861k143j987j509q24m80q53
$$ 262862 261671 261145 261679 263037 264349 265128 265683 266239 266298 265311 263450 261307 259320 257811 256987 256507 255654
57683B55654j268p37N53J567K146L216N250P692J0097J2777J5958J9375K3037
$$ 255654 254386 253649 254202 255769 257915 261131 266381 274073 284170 296947 312905 332280 355317
57670C55317K7512L2952L8604M3557M7161M8300M5061L5899K1069K788j5530l0486
$$ 355317 382829 415781 454385 497942 545103 593403 638464 674363 695432 698220 682690 652204
57658F52204m0097m4585m5423m3620l9426l3523k7423k2336j8387j5243j2793
$$ 652204 612107 567522 522099 478479 439053 405530 378107 355771 337384 322141 309348
57647C09348j0890r099p166n326l898k989k722l198m002m339l777k568j122L05
$$ 309348 298458 289359 282193 276867 272969 269980 267258 264060 260058 255719 251942 249374 248252 248557
57633B48557J404J885J833J511Q71j30q91p16P1L72k14j013j437j585j562j181
$$ 248557 249961 251846 253679 255190 256061 255931 255040 254324 254395 254767 254553 253540 252103 250518 248956 247775
57617B47775o71p33j451j984j699q99j04N99J084R32J46n97q48q56q10m16L15
$$ 247775 247104 246371 244920 242936 241237 240338 240234 240833 241917 242849 242995 242398 241550 240694 239884 239468 239783
57600B39783P65O84O62J007J065L87l32l31r4n22j420j860j688j544j661j664
$$ 239783 240548 241232 241894 242901 243966 244353 244021 243690 243596 243074 241654 239794 238106 236562 234901 233237
57584B33237j506j577j814j609q38k08k47o38q60j027j538k194k244j328l6O66
$$ 233237 231731 230154 228340 226731 225893 225685 225438 224800 223940 222913 221375 219181 216937 215609 215573 216239
57568B16239M77L7J05P13J291J408J115O99M05M02O49P86M89k9k14J68Q39J470
$$ 216239 216716 216753 216858 217571 218862 220270 221385 222084 222489 222891 223540 224326 224815 224786 224572 224740 225579 227049
57550B27049J909K014J701J229R87J005J005R47R91R75N57q7l17Q9O69R68R81
$$ 227049 228958 230972 232673 233902 234889 235894 236899 237846 238837 239812 240369 240282 239965 240054 240723 241691 242672
57533B42672P82L32j06nP51J640K069J805R15j42m60M66J808K225J655J326J803
$$ 242672 243454 243786 243680 243675 244426 246066 248135 249940 250855 250713 250253 250719 252527 254752 256407 257733 259536
57516B59536K237J955J560J720J964J607J031J036J492J655J349R77O77L45J44
$$ 259536 261773 263728 265288 267008 268972 270579 271610 272646 274138 275793 277142 278119 278796 279141 279285
57501B79285K79N46P38J119J793K061J294N6m97j91J40rk33r5K74N62P16Q13Q73
$$ 279285 279564 280110 280848 281967 283760 285821 287115 287171 286674 286483 286623 286614 286381 286286 286560 287122 287838 288651 289524
57482B89524R35R56P63L45O2K43P61J336J969K647K988K676K008J446R51L01j79
$$ 289524 290459 291415 292178 292523 292585 292828 293589 294925 296894 299541 302529 305205 307213 308659 309610 309911 309732
57465C09732M0P67J213J073Q17Q38R29P72M63L64P01J398K110K448K367K261K419
$$ 309732 309772 310539 311752 312825 313642 314480 315409 316181 316644 317008 317709 319107 321217 323665 326032 328293 330712
57448C30712K596K419J964J609J480J501J694K065K296K071J576J271J303J564
$$ 330712 333308 335727 337691 339300 340780 342281 343975 346040 348336 350407 351983 353254 354557 356121
57434C56121K061K743L156K884K235J879J900J790J403J231J615K249K721L001
$$ 356121 358182 360925 364081 366965 369200 371079 372979 374769 376172 377403 379018 381267 383988 386989
57420C86989L187L105K567J768J242J443K376L534M225M221L971L983M126L903
$$ 386989 390176 393281 395848 397616 398858 400301 402677 406211 410436 414657 418628 422611 426737 430640
57406D30640L309K925L083L376L294K960K902L262L572L432L075L047L378L479
$$ 430640 433949 436874 439957 443333 446627 449587 452489 455751 459323 462755 465830 468877 472255 475734
57392D75734L008K503K726L610M353M548M607M914N173M954M426M083M101M279
$$ 475734 478742 481245 483971 487581 491934 496482 501089 506003 511176 516130 520556 524639 528740 533019
57378E33019M409M383M182L977M005M176M159L968M050M555N045N171N090M899
$$ 533019 537428 541811 545993 549970 553975 558151 562310 566278 570328 574883 579928 585099 590189 595088
57364E95088M368L648L530M349N247N326M989N312O436P503P896P700P133O366
$$ 595088 599456 603104 606634 610983 616230 621556 626545 631857 638293 645796 653692 661392 668525 674891
57350F74891N795N748N969O031O126O674P384P566P244P069P159O964O403O142
$$ 674891 680686 686434 692403 698434 704560 711234 718618 726184 733428 740497 747656 754620 761023 767165
57336G67165O495O946P075P214P743Q418Q819Q868Q529P630O425N880O690Q347
$$ 767165 773660 780606 787681 794895 802638 811056 819875 828743 837272 844902 851327 857207 863897 872244
57322H72244R679J0168J0203J0248J0221R853R347R333J0141J1257J1727J1180
$$ 872244 881923 892091 902294 912542 922763 932616 941963 951296 961437 972694 984421 995601
57310I95601J0236R745R947J0510J1141J1748J2253J2668J3170J3739J3922J3410
$$ 995601 1005837 1015582 1025529 1036039 1047180 1058928 1071181 1083849 1097019 1110758 1124680 1138090
57298A138090J2693J2572J3157J3857J4284J4564J4755J4639J4197J3862J4066
$$ 1138090 1150783 1163355 1176512 1190369 1204653 1219217 1233972 1248611 1262808 1276670 1290736
57287A290736J4809J5751J6476J6741J6765J7134J8006J8739J8721J8350J8492
$$ 1290736 1305545 1321296 1337772 1354513 1371278 1388412 1406418 1425157 1443878 1462228 1480720
57276A480720J9171J9586J9372J9111J9443K0370K1501K2389K2556K1914K1296
$$ 1480720 1499891 1519477 1538849 1557960 1577403 1597773 1619274 1641663 1664219 1686133 1707429
57265A707429K1786K3283K4458K4429K3769K3519K3904K4512K5113K5699K6113
$$ 1707429 1729215 1752498 1776956 1801385 1825154 1848673 1872577 1897089 1922202 1947901 1974014
57254A974014K6205K6091K5891K5508K4944K4506K4339K4080K3303K2018K0474
$$ 1974014 2000219 2026310 2052201 2077709 2102653 2127159 2151498 2175578 2198881 2220899 2241373
57243B241373J8771J7076J5824J5316J5310J5359J5344J5367J5374J5265J5201
$$ 2241373 2260144 2277220 2293044 2308360 2323670 2339029 2354373 2369740 2385114 2400379 2415580
57232B415580J5441J5976J6544J6996J7433J8010J8758J9607K0496K1502K2724
$$ 2415580 2431021 2446997 2463541 2480537 2497970 2515980 2534738 2554345 2574841 2596343 2619067
57221B619067K3921K4475K4050K3186K2813K3194K3781K4092K4193K4204K3975
$$ 2619067 2642988 2667463 2691513 2714699 2737512 2760706 2784487 2808579 2832772 2856976 2880951
57210B880951K3513K3252K3506K4012K4321K4352K4283K4166K4033K4102K4537
$$ 2880951 2904464 2927716 2951222 2975234 2999555 3023907 3048190 3072356 3096389 3120491 3145028
57199C145028K5098K5368K5222K4899K4617K4320K3808K3130K2740K3154K4289
$$ 3145028 3170126 3195494 3220716 3245615 3270232 3294552 3318360 3341490 3364230 3387384 3411673
57188C411673K5324K5553K5247K5318K6205K7485K8627K9683L1081L3082L5556
$$ 3411673 3436997 3462550 3487797 3513115 3539320 3566805 3595432 3625115 3656196 3689278 3724834
57177C724834L8107M0346M2232M4049M5793M6830M6516M5033M3054M0754L7769
$$ 3724834 3762941 3803287 3845519 3889568 3935361 3982191 4028707 4073740 4116794 4157548 4195317
57166D195317L4038K9963K5726K1072J5988J0934O276K126j148l002l573l840
$$ 4195317 4229355 4259318 4285044 4306116 4322104 4333038 4339314 4341440 4340292 4337290 4333717 4329877
57154D329877m526n367n769n571m864l656k168r51k76K05Q94J694K400L105L920
$$ 4329877 4325351 4319984 4314215 4308644 4303780 4300124 4297956 4297005 4296729 4296934 4297828 4299522 4301922 4305027 4308947
57139D308947M796N871P541R783J1938J3512J4639J5399J5391J4516J3568J3339
$$ 4308947 4313743 4319614 4327155 4336938 4348876 4362388 4377027 4392426 4407817 4422333 4435901 4449240
57127D449240J3541J3370J2762J2394J2780J4079J6615K0816K6655L3667M1484
$$ 4449240 4462781 4476151 4488913 4501307 4514087 4528166 4544781 4565597 4592252 4625919 4667403
57116D667403M9934N8790O7983P7957Q9288J01976J15680J30714J48352J69986
$$ 4667403 4717337 4776127 4844110 4922067 5011355 5113331 5229011 5359725 5508077 5678063
57106E678063J96337K27625K64296L07415L58549M19532M92508N80261O86308
$$ 5678063 5874400 6102025 6366321 6673736 7032285 7451817 7944325 8524586 9210894
57097I210894Q14398R67843J149343J360967J603315J874190K168068K476775
$$ 9210894 10025292 10993135 12142478 13503445 15106760 16980950 19149018 21625793
57089B1625793K790303L097053L384108L637923L845148L993467M072294M071686
$$ 21625793 24416096 27513149 30897257 34535180 38380328 42373795 46446089 50517775
57081E0517775L978692L774726L439584K961612K346167J615734Q03920n0082
$$ 50517775 54496467 58271193 61710777 64672389 67018556 68634290 69438210 69388128
57073F9388128r04308j716744k449180l070552l558749l901874m099267m160825
$$ 69388128 68483820 66767076 64317896 61247344 57688595 53786721 49687454 45526629
57065D5526629m104325l952236l729184l459635l165597k864981k571116k292912
$$ 45526629 41422304 37470068 33740884 30281249 27115652 24250671 21679555 19386643
57057A9386643k035323j800265j587884j397621j228625j079626r48718q33639
$$ 19386643 17351320 15551055 13963171 12565550 11336925 10257299 9308581 8474942
57049H474942p32702o45264n70803n07549m52709m04203l61467l24350k92089
$$ 8474942 7742240 7096976 6526173 6018624 5565915 5161712 4800245 4475895 4183806
57040D183806k63782k39030k17423j97991j79903j63139j47837j33455j19205
$$ 4183806 3920024 3680994 3463571 3265580 3085677 2922538 2774701 2641246 2522041
57031B522041j04767q9914p4162n7541m1266k7041j6614j2710j8911l6350o0746
$$ 2522041 2417274 2327360 2253198 2195657 2154391 2127350 2110736 2098026 2079115 2042765 1982019
57020A982019q4480j01973j12063j15679j13412j06010r5563q4660p4828o6321
$$ 1982019 1897539 1795566 1683503 1567824 1454412 1348402 1252839 1168179 1093351 1027030
57010A027030n8922n2502m7228m3487m1194l9288l6662l3578l1283l0156k9273
$$ 1027030 968108 915606 868378 824891 783697 744409 707747 674169 642886 612730 583457
56999E83457k7948k6543k5308k3571k0787j7535j4638j2032r179o003k664J024
$$ 583457 555509 528966 503658 480087 459300 441765 427127 415095 405916 399913 397249 398273
56987C98273N105Q864J1448J2874J3732J4119J3439J1163P310K316l095q041j1872
$$ 398273 403378 412242 423690 436564 450296 464415 477854 489017 496327 498643 495548 487507 475635
56974D75635j4376j5536j5388j4347j3178j2221j0994r011o650m680l200j578
$$ 475635 461259 445723 430335 415988 402810 390589 379595 370584 363934 359254 356054 354476
56962C54476O58L358O144Q791J1152J3027J4140J4094J2402Q818L672k218p886
$$ 354476 355134 358492 364636 373427 384579 397606 411746 425840 438242 447060 450732 448514 440628
56949D40628j2543j5812j7841j8930j8972j7541j4742j1576r077p204n036j905
$$ 440628 428085 412273 394432 375502 356530 338989 324247 312671 303594 296390 291354 289449
56937B89449J918N648Q780J1417J3988J6716J9321K1217K1802K0417J6246Q936
$$ 289449 291367 297015 305795 317212 331200 347916 367237 388454 410256 430673 446919 455855
56925D55855m73r732j6912k1634k4507k5820k5331k3192k0412j8079j6442j4965
$$ 455855 455382 445650 428738 407104 382597 356777 331446 308254 287842 269763 253321 238356
56913B38356j3161j1111r275p940o970o039m981l868k819j847r15l6O40R27Q21
$$ 238356 225195 214084 204809 196869 189899 183860 178879 175011 172192 170345 169430 169394 170034 170961 171782
56898A71782P06J099K132L429M649N913P517R416J1334J3167J4940J6471J7421
$$ 171782 172488 173587 175719 179148 183797 189710 197227 206643 217977 231144 246084 262555 279976
56885B79976J7621J7030J5481J2831R244N013K38m776r036j1415j1778j0992r737
$$ 279976 297597 314627 330108 342939 352183 357196 357434 352658 343622 332207 320429 309437 299700
56872B99700p983n685l239q07K144O058J0511J4781J8912K3632K9273L5236M0436
$$ 299700 291717 286032 282793 281986 284130 290188 300699 315480 334392 358024 387297 422533 462969
56859D62969M3881M4823M2751L7398K8715J7014L328j0402k1873k9375l2522l2175
$$ 462969 506850 551673 594424 631822 660537 677551 680879 670477 648604 619229 586707 554532
56847E54532k9718k6077k1341j5311q315j135N815J2911K0713K9229L7960M6420
$$ 554532 524814 498737 477396 462085 453770 452635 458450 471361 492074 521303 559263 605683
56835F05683N4327O1381O6991P0046O8836O1445M6867K6049J979k1459m1000n4933
$$ 605683 660010 721391 788382 858428 927264 988709 1035576 1061625 1063604 1042145 1001145 946212
56823I46212o2964o5497o3234n7351m9538m1327l3376k5501j7371q935l84Q053
$$ 946212 883248 817751 754517 697166 647628 606301 572925 547424 530053 521118 520734 528787
56811E28787J6244K4191L1826L8656M3924M7162M8030M5313L6938K1988K565j7175
$$ 528787 545031 569222 601048 639704 683628 730790 778820 824133 861071 883059 885624 868449
56799H68449l3765m5739n2795n5019n3244m9025m3662l7676l1409k5386j9731
$$ 868449 834684 788945 736150 681131 627887 578862 535200 497524 466115 440729 420998
56788D20998j3961p834j898L219P638J1929J6305K0374K3276K3886K1407J6037
$$ 420998 407037 399203 397305 400524 408162 420091 436396 456770 480046 503932 525339 541376
56776E41376Q720J86r156j8360k5878l0821l3509l4408l3299l0094k5816k1886
$$ 541376 550096 550282 541126 522766 496888 466067 432558 398150 364851 334757 308941 287055
56764B87055j8913j6705j5065j3831j2573j0945r174p662o409n296m577m503m775
$$ 287055 268142 251437 236372 222541 209968 199023 189849 182187 175778 170482 165905 161402 156627
56751A56627m931m911m730m036k675j369r71j339j620j499j379j453j422j147
$$ 156627 151696 146785 142055 138019 135344 133975 133004 131665 130045 128546 127167 125714 124292 123145
56737A23145q62o29k06L80O89M76j3m18o07n78l71j44mK00O42J143J379J389J424
$$ 123145 122283 121654 121448 121828 122517 122993 122980 122562 121955 121377 121006 120862 120858 121058 121700 122843 124222 125611 127035
56718A27035J406J009K37m65p44o02j63M40R40J086R87R46J004R54P56N47K77
$$ 127035 128441 129450 129687 129222 128478 127876 127713 128153 129093 130179 131166 132112 133116 134070 134826 135373 135650
56701A35650k44r03j312j406j566j972k181j617l63Q16J246R91P08Q48J089P40
$$ 135650 135406 134503 133191 131785 130219 128247 126066 124449 124086 124902 126148 127139 127847 128695 129784 130524
56685A30524l21j372j641j103l17L03P63J199J616J833J611R01M7m78n88n91o02
$$ 130524 130203 128831 127190 126087 125770 126073 126836 128035 129651 131484 133095 133996 134043 133565 132977 132386 131784
56668A31784l94K0J80j51n19l57K64Q67J184J190R01M88L46O36J054J316J523
$$ 131784 131390 131410 131590 131439 130920 130563 130827 131694 132878 134068 134969 135457 135803 136439 137493 138809 140332
56651A40332J734J712J436J319J448J215K93o43q42n25k58R4P76J148M98n05n37
$$ 140332 142066 143778 145214 146533 147981 149196 149489 148846 148004 147479 147221 147315 148091 149239 149737 149232 148695
56634A48695M04J012P37M23O47P63K07m36l56K80P79R14Q17M76Lj37K68P18O95
$$ 148695 149099 150111 150848 151271 151918 152681 152888 152452 152096 152376 153155 154069 154886 155362 155365 155228 155496 156214 156909
56615A56909L99K64J75k50q40j001n59M2L67L78J80k63r00j308r37J98J195R99
$$ 156909 157308 157572 157747 157497 156657 155656 155097 155139 155506 155884 156064 155801 154901 153593 152656 152854 154049 155048
56597A55048l61j595j589o09L22R04J579K313K351J473N65M29P02N57Ok71m8J97
$$ 155048 154687 153092 151503 150894 151216 152120 153699 156012 158363 159836 160401 160830 161532 162089 162095 161824 161776 161973
56579A61973J46J12M67J004J165P78L21L80R85J619J849J743J580J440J347J542
$$ 161973 162119 162231 162698 163702 164867 165645 165966 166346 167331 168950 170799 172542 174122 175562 176909 178451
56563A78451K267L353M323M882N042M945M791M775M767M233K886J235Q0l96n87
$$ 178451 180718 184071 188394 193276 198318 203263 208054 212829 217596 221829 224715 225950 226030 225634 225047
56548B25047o89n64k27Q4L28N91O29M1j025j870k042j645r47j75K90J60k42l07
$$ 225047 224358 223794 223567 223651 223979 224570 225199 225240 224215 222345 220303 218658 217711 217536 217826 217986 217744 217437
56530B17437n6j21o92j192j238j257j744k413k531j856r07m55q57j736k304k168
$$ 217437 217381 217260 216568 215376 214138 212881 211137 208724 206193 204337 203430 202975 202118 200382 198078 195910
56514A95910j663j204p30k19k50j172k098j772l90N57L84k4K63R28J208R66M50
$$ 195910 194247 193043 192313 192094 191844 190672 188574 186802 186412 186969 187353 187329 187592 188520 189728 190694 191144
56497A91144k42q66r08l22K08K39J69M02O23M42R0q1k09m01k57M51J166J280J005
$$ 191144 190902 190036 189128 188806 189014 189253 189422 189824 190447 190889 190979 190898 190689 190288 190031 190482 191648 192928 193933
56478A93933Q92R59R30Q52Q36N75p8m95J2J086J626J162L03k3N92J814K785K800
$$ 193933 194825 195784 196714 197566 198402 198977 198899 198404 198416 199502 201128 202290 202593 202570 203162 204976 207761 210561
56460B10561J973J028K63o55j687k039j297k74P1j47k21l5J13L31Q09J075N50
$$ 210561 212534 213562 213825 213170 211483 209444 208147 207873 207944 207797 207576 207541 207654 207985 208794 209869 210419
56443B10419l16m34M24J345J508R64K54j52l0L89M37k08r05q17r3L85L61M78J181
$$ 210419 210103 209669 210093 211438 212946 213910 214164 214012 213982 214371 214808 214600 213695 212878 212785 213170 213531 214009 215190
56424B15190K063K456K143J352N52K45O13J212J413J090N34j12q37j350j278p17
$$ 215190 217253 219709 221852 223204 223756 224001 224614 225826 227239 228329 228863 228751 227914 226564 225286 224569
56408B24569r2M39R13J050M44o77j422j154l2J268K055J932J157N93Q73J577J748
$$ 224569 224477 224916 225829 226879 227323 226646 225224 224070 224038 225306 227361 229293 230450 231043 231916 233493 235241
56391B35241J154M83L67O88R47Q48M16o7k04J23N81Q20Q75Q73O33R9j32N55J764
$$ 235241 236395 236878 237245 237933 238880 239728 240144 240077 239873 239996 240577 241397 242272 243145 243778 243877 243745 244300 246064
56372B46064K354J809P49J14K92J075J916K190J694R25N68P37J055J274J306R61
$$ 246064 248418 250227 250976 251090 251382 252457 254373 256563 258257 259182 259750 260487 261542 262816 264122 265083
56356B65083K24l46k47J90K36o2j8M84P94N58J76k5j85l03J5Q04J480J768K141
$$ 265083 265307 264961 264714 264904 265140 265078 265060 265544 266338 266896 267072 267047 266862 266559 266574 267378 268858 270626 272767
56337B72767K939L616L516K898K560K729K912K687K184J781J681J751J645J104
$$ 272767 275706 279322 282838 285736 288296 291025 293937 296624 298808 300589 302270 304021 305666 306770
56323C06770L48k5L67J203J710J345K09j076j831j747j029j65M09N21L21J93M29
$$ 306770 307118 307093 307460 308663 310373 311718 311927 310851 309020 307273 306244 306079 306488 307009 307330 307523 307952
56306C07952R56J510K002K411K499K099J654J804K333K338J691J425K130K894
$$ 307952 308908 310418 312420 314831 317330 319429 321083 322887 325220 327558 329249 330674 332804 335698
56292C35698K643J769J435J878K454K910L438L785L504K994L144L928M360L969
$$ 335698 338341 340110 341545 343423 345877 348787 352225 356010 359514 362508 365652 369580 373940 377909
56278C77909L351L132L302L705M372N139N680O029O466O861O861O645O699O948
$$ 377909 381260 384392 387694 391399 395771 400910 406590 412619 419085 425946 432807 439452 446151 453099
56264D53099O932O753O874P043O546N573N251O036P174Q026Q870J0090J1537J3150
$$ 453099 460031 466784 473658 480701 487247 492820 498071 504107 511281 519307 528177 538267 549804 562954
56250E62954J5240J7741K0046K1989K4179K6925K9660L1820L3551L5116L6417
$$ 562954 578194 595935 615981 637970 662149 689074 718734 750554 784105 819221 855638
56239H55638L7383L8083L8190L7125L5002L2426K9204K4385J7939J1141M824j549
$$ 855638 893021 931104 969294 1006419 1041421 1073847 1103051 1127436 1145375 1156516 1161340 1159791
56227A159791q380j4776j9823k3867k7550l0509l2129l2776l3219l3473l3156
$$ 1159791 1151411 1136635 1116812 1092945 1065395 1034886 1002757 969981 936762 903289 870133
56216H70133l2375l1344k9793k7603k5385k3505k1320j8368j5557j3962j3144
$$ 870133 837758 806414 776621 749018 723633 700128 678808 660440 644883 630921 617777
56205F17777j1972j0543r809r566q505o285m206l404l527l562l132k474j864j432
$$ 617777 605805 595262 585453 575887 567382 561097 556891 553487 549960 546398 543266 540792 538928 537496
56191E37496j156p86j15O42J151J539K143K786K898K421J959J904J945J713J420
$$ 537496 536340 535554 535439 536081 537232 538771 540914 543700 546598 549019 550978 552882 554827 556540 557960
56176E57960J527K054K532K632K594K922L719M477M694M471M289M352M467M529
$$ 557960 559487 561541 564073 566705 569299 572221 575940 580417 585111 589582 593871 598223 602690 607219
56162F07219M651M840N068N508O281P023P402P860R058J0609J1397J1238J1163
$$ 607219 611870 616710 621778 627286 633567 640590 647992 655852 664910 675519 686916 698154 709317
56149G09317J1686J1999J1415J0568J0386J0811J1458J2674J4991J8055K1069
$$ 709317 721003 733002 744417 754985 765371 776182 787640 800314 815305 833360 854429
56138H54429K3906K7079L0945L5602M1189M7653N4517O1279O7620P2894P6027
$$ 854429 878335 905414 936359 971961 1013150 1060803 1115320 1176599 1244219 1317113 1393140
56127A393140P6411P4254O9757O2890N4558M6971M1839L8726L5917L2132K6740
$$ 1393140 1469551 1543805 1613562 1676452 1731010 1777981 1819820 1858546 1894463 1926595 1953335
56116A953335J9306J0136P25p347j3696j8638k2262k4917k7936l2667l9102m6276
$$ 1953335 1972641 1982777 1983502 1976155 1962459 1943821 1921559 1896642 1868706 1836039 1796937 1750661
56104A750661n3447n9961o4560o6045o4379o0302n4352m7070l9558l2769k6600
$$ 1750661 1697214 1637253 1572693 1506648 1442269 1381967 1327615 1280545 1240987 1208218 1181618
56093A181618k0602j5107j0745p344m325j723Q1J258K240L060L796M967O593P665
$$ 1181618 1161016 1145909 1135164 1127820 1123495 1121772 1121853 1123111 1125351 1128411 1132207 1137174 1143767 1151432
56079A151432P638P623Q889J0921J2268J2612J2556J2159J1300J0975J2442J5225
$$ 1151432 1159070 1166693 1175582 1186503 1198771 1211383 1223939 1236098 1247398 1258373 1270815 1286040
56067A286040J7525J8476J8620J8494J8267J8602K0201K2396K3619K3362K2560
$$ 1286040 1303565 1322041 1340661 1359155 1377422 1396024 1416225 1438621 1462240 1485602 1508162
56056A508162K2031K1792K1785K2044K2114K1513K0757K0791K1628K2554K3510
$$ 1508162 1530193 1551985 1573770 1595814 1617928 1639441 1660198 1680989 1702617 1725171 1748681
56045A748681K5090K7333K9698L2010L4362L6426L7945L9508M1711M3996M5462
$$ 1748681 1773771 1801104 1830802 1862812 1897174 1933600 1971545 2011053 2052764 2096760 2142222
56034B142222M6227M6834M6882M5717M3841M2217M0899L9688L9399M0798M3071
$$ 2142222 2188449 2235283 2282165 2327882 2371723 2413940 2454839 2494527 2533926 2574724 2617795
56023B617795M5086M7302N0653N4448N7426O0055O3597O7589P0641P3011P6000
$$ 2617795 2662881 2710183 2760836 2815284 2872710 2932765 2996362 3063951 3134592 3207603 3283603
56012C283603P9456Q2431Q5743R1046R7685J03297J07441J11897J17442J23111
$$ 3283603 3363059 3445490 3531233 3622279 3719964 3823261 3930702 4042599 4160041 4283152
56002D283152J28627J34860J41739J48441J55539J64311J73940J82293J89551
$$ 4283152 4411779 4546639 4688378 4836819 4992358 5156669 5330609 5512902 5702453
55993E702453J98184K09218K21387K34023K47869K63000K78909K96538L17335
$$ 5702453 5900637 6109855 6331242 6565265 6813134 7076134 7355043 7651581 7968916
55984G968916L40531L64511L90365M20609M54894M90934N29234N72694O21902
$$ 7968916 8309447 8673958 9064323 9484932 9939826 10430760 10959994 11532688 12154590
55975A2154590O75323P33939Q01016Q77463R62447J058532J170930J301888J451639
$$ 12154590 12829913 13563852 14364868 15242331 16204778 17263310 18434240 19736128 21187767
55966B1187767J624935J830639K075100K363096K706060L122823L632617M256266
$$ 21187767 22812702 24643341 26718441 29081537 31787597 34910420 38543037 42799303
55958D2799303N025896N985829P182874Q662926J0474604J2661552J5242002J8191853
$$ 42799303 47825199 53811028 60993902 69656828 80131432 92792984 108034986 126226839
55950A26226839K1430024K4796866K8045457L0855164L2804202L3258115L1326519
$$ 126226839 147656863 172453729 200499186 231354350 264158552 297416667 328743186
55943C28743186K6150642J7508724O278686n732608j6543000k4759500k9863747
$$ 328743186 354893828 372402552 378681238 372948630 356405630 331646130 301782383
55936C01782383l2036624l1846788l0011652k7229675k4058558k0870669j7885803
$$ 301782383 269745759 237898971 207887319 180657644 156599086 135728417 117842614
55929A17842614j5220483j2915433j0958717r316762p952786o825006n887076
$$ 117842614 102622131 89706698 78747981 69431219 61478433 54653427 48766351
55922D8766351n100124m438094l878976l399851k983867k623688k313726k044930
$$ 48766351 43666227 39228133 35349157 31949306 28965439 26341751 24028025 21983095
55914B1983095j809767j605821j430940j279721j147279j031821r31448q42616
$$ 21983095 20173328 18567507 17136567 15856846 14709567 13677746 12746298 11903682
55906A1903682p63554o94991o36050n83346n35320m93330m57308m24417l93232
$$ 11903682 11140128 10445137 9809087 9225741 8690421 8197091 7739783 7315366 6922134
55897F922134l65211l40706l17464k94448k73327k54718k36537k17756k00296
$$ 6922134 6556923 6216217 5898753 5604305 5330978 5076260 4839723 4621967 4421671
55888D421671j85523j72030j58551j46149j35826j26667j18031j11174j07141
$$ 4421671 4236148 4064118 3905567 3759418 3623592 3496925 3378894 3267720 3160579
55879C160579j05125j04062j03678j03084j00610r6108r1183q6483q1166p5716
$$ 3160579 3055454 2951392 2847714 2744630 2644020 2547912 2456729 2370246 2289080 2213364
55869B213364p2376p1645p1076o8897o6339o4942o4030o2476o0782n9680n8551
$$ 2213364 2140988 2069343 1998267 1929370 1863031 1798089 1734059 1671583 1610801 1551121 1492570
55858A492570n6796n5061n3642n1326m7160m1847l6108k9425k1734j4778j0311
$$ 1492570 1435774 1380713 1327071 1275745 1228585 1186738 1150630 1121205 1099471 1084693 1074382
55847A074382q257p768q635j0460j1994j2685j3544j5237j6605j6415j5368j4991
$$ 1074382 1066125 1058357 1049722 1039262 1027268 1014583 1001039 985802 969197 952782 937414 922423
55835I22423j5543j6212j6501j6273j5259j3598j2105j1192j0352r280q487q232
$$ 922423 906880 890668 874167 857894 842635 829037 816932 805740 795388 786108 777621 769389
55823G69389q026p808q390r959j1444j2076j2367j2775j2756j2017j1293j0960
$$ 769389 761363 753555 745165 735206 723762 711686 699319 686544 673788 661771 650478 639518
55811F39518j0185q520o969o414o202n414m310l356k031J35K398L874M810N645
$$ 639518 629333 620813 613844 607430 601228 595814 591504 588148 586117 586252 588650 592524 597334 602979
55797F02979N868N008L801L119K683J926J152O71j30j568k636k609k562l741n344
$$ 602979 608847 613855 617656 620775 623458 625384 626536 627207 627077 625509 622873 620264 617702 613961 608617
55782F08617n825n666o928j0334j4473j7779j9763k0324j9385j7366j4929j2221
$$ 608617 602792 597126 590198 579864 565391 547612 527849 507525 488140 470774 455845 443624
55770D43624r261o764n468m839l723k174j429j983k892l133k653j834q82o6K24
$$ 443624 434363 427599 422131 417292 413569 411395 409966 407983 405091 401958 399305 397471 396589 396523 396747
55755C96747j22q96k094l921o265q627j0540j1662j1709j0746r352q053o774n338
$$ 396747 396625 395729 393635 389714 383449 374822 364282 352620 340911 330165 320813 312760 305986 300648
55741C00648m041l249k767k252j819j567j050RR21Q64K15M9N61R26O60J14l97
$$ 300648 296607 293358 290591 288339 286520 284953 283903 283912 284833 285697 285912 285961 286522 287448 288108 288222 287825
55724B87825j116k239l495m438m757m288l272k402k060j739q56J05J21p20j137
$$ 287825 286709 284470 280975 276537 271780 267492 264220 261818 259758 258019 257163 257268 257389 256669 255532
55709B55532m02O88R85M78R7M53J226J643J173j73j969l649m705m846m230l486
$$ 255532 255130 255818 256803 257281 257378 257831 259057 260700 261873 261700 259731 256082 251377 246531 242301 238815
55693B38815l147l015k534j791j580k255l172l540l270k571j436j9J051J382J404
$$ 238815 235668 232653 230119 228328 226748 224493 221321 217781 214511 211940 210504 210485 211536 212918 214322
55678B14322J609J740J342O39J06l72j145j950k255k136k097k212k218k121k027
$$ 214322 215931 217671 219013 219652 219758 219386 218241 216291 214036 211900 209803 207591 205373 203252 201225
55663B01225j610n77O19J318J621J995K202J644O33L08J074K136K686K766K712
$$ 201225 199615 199038 199657 200975 202596 204591 206793 208437 209070 209378 210452 212588 215274 218040 220752
55648B20752K545K307K292K596K797K480J701Q16P0n12j138k083l280m135m136
$$ 220752 223297 225604 227896 230492 233289 235769 237470 238286 238356 237844 236706 234623 231343 227208 223072
55633B23072l504k923k749k834k856k509j648p27o82j814l090l240k302j371j078
$$ 223072 219568 216645 213896 211062 208206 205697 204049 203322 202640 200826 197736 194496 192194 190823 189745
55618A89745j063q81n68l39m35j216k730m154m412l479k439k227k757l365l506
$$ 189745 188682 187801 187233 186894 186459 185243 182513 178359 173947 170468 168029 165802 163045 159680 156174
55603A56174l052k335j919j999k154k051j972k100j872q43K41K75n78j126r13
$$ 156174 153122 150787 148868 146869 144715 142664 140692 138592 136720 135877 136118 136393 135815 134689 133776
55588A33776n72n04l49J05N16P21Q88Q41J92o98r00l19J53J40L51J270K355L008
$$ 133776 133204 132700 132351 132456 132972 133693 134581 135422 135614 134916 134016 133697 133850 133990 134341 135611 137966 140974
55570A40974L373L632L484K880K438K443K279J466M49k28p71j459j892j704j346
$$ 140974 144347 147979 151463 154343 156781 159224 161503 162969 163418 163190 162419 160960 159068 157364 156018
55555A56018j392j654j699j635j639j373o63k02o29j346j282m87J9k76r07j405
$$ 156018 154626 152972 151273 149638 147999 146626 145963 145761 145132 143786 142504 142017 142036 141760 140853 139448
55539A39448j756j946j798j423j146r38m82J08K63k06p91r64p67n34l89k84k48
$$ 139448 137692 135746 133948 132525 131379 130441 129959 130067 130330 130124 129333 128369 127602 127068 126679 126395 126147
55522A26147l96p44j085j090o33k5K91K78K45K65M2m23o28l58k23q45j836k188
$$ 126147 125751 125007 123922 122832 122199 122174 122465 122743 122988 123253 123295 122872 122244 121886 121663 120818 118982 116794
55504A16794j484k84N92O82l1j121j812j569o40K32N61M31J46k9R1M73P85P45
$$ 116794 115310 115026 115618 116300 116269 115148 113336 111767 111127 111359 111920 112351 112497 112468 112559 113032 113817 114562
55486A14562M76K85K55L04M87Q60J165J060N65qm46o82n95j78J96J12l09n35l06
$$ 114562 115038 115323 115578 115882 116369 117229 118394 119454 120019 120011 119565 118883 118288 118110 118306 118418 118109 117574 117268
55467A17268J69O31J005J222J189R93P90M98l2n65o18j67J97L2m11o45o13n94
$$ 117268 117437 118068 119073 120295 121484 122477 123267 123765 123733 123168 122550 122383 122580 122612 122201 121556 120943 120349
55449A20349o73o45m01r7J1k16o95j086j006m27J37J41l30o66m76pL00L89M98
$$ 120349 119676 119031 118630 118533 118544 118328 117633 116547 115541 115114 115251 115392 115062 114396 113920 113913 114213 114602 115100
55430A15100O95Q07P84P57P39N86L63M15Q84J406J510J115M11m48j209j358n54
$$ 115100 115795 116602 117386 118143 118882 119468 119831 120246 121130 122536 124046 125161 125572 125124 123915 122557 122003
55413A22003P69J710J834J488J143P28j03j291k168k061j105k62k80p47o81kK43
$$ 122003 122772 124482 126316 127804 128947 129675 129572 128281 126113 124052 122947 122685 122405 121658 120977 120975 121218
55396A21218n42j487j474p37l71o69r43p74m59j97J87N63N11J35M0K65J82l27
$$ 121218 120676 119189 117715 116978 116607 115938 114995 114221 113762 113565 113752 114315 114826 114961 115001 115266 115448 115121
55378A15121n08k4L71Jo76q31l76K58Q61J236R21j51j181j396j000o39m00k5L44
$$ 115121 114613 114589 114960 114961 114285 113454 113078 113336 114197 115433 116354 116203 115022 113626 112626 111987 111587 111562 111906
55359A11906L73J98J67K08J35K53R16J697J746Q79k77j059j221q20k84k82r27
$$ 111906 112279 112477 112644 112852 112987 113240 114156 115853 117599 118478 118201 117142 115921 115101 114817 114535 113608
55342A13608j385r37r8J04k93l46K00N18L5p04r26n89j25K16M14M85N62P66R32
$$ 113608 112223 111286 111188 111292 110999 110653 110853 111371 111406 110702 109776 109187 109062 109278 109692 110177 110739 111505 112437
55323A12437P31K28j31j76j89l03j89M11J179J462Q87l34j503j882j367n60m8
$$ 112437 113168 113396 113265 113089 112900 112597 112408 112819 113998 115460 116347 116013 114510 112628 111261 110701 110653
55306A10653K68O65Q00J36j020j661j398q23m17J23J049J808J744J098O80P43
$$ 110653 110921 111586 112386 112522 111502 109841 108443 107620 107203 107326 108375 110183 111927 113025 113705 114448
55290A14448P92M30l4KO62J365J358M92o26j309j462j393j173o37P5M97L92k3
$$ 114448 115240 115670 115636 115638 116300 117665 119023 119515 118889 117580 116118 114725 113552 112915 112990 113487 113879 113856
55272A13856n25j099j584j557q77L5O72R65J099J111R29O43M43L58L11L36N97
$$ 113856 113331 112232 110648 109091 108214 108249 108921 109886 110985 112096 113025 113668 114111 114469 114780 115116 115713
55255A15713J204J939K271J738N27n28p86n15m30p69j208j533j774j693r23K40
$$ 115713 116917 118856 121127 122865 123392 122864 122078 121563 121133 120364 119156 117623 115849 114156 113233 113473
55239A13473Q59N51Q4K98R88J364J219R74P77L06n00j133j120n99n5K56L87L74
$$ 113473 114332 114883 114967 115265 116253 117617 118836 119810 120587 120893 120393 119260 118140 117541 117486 117742 118129 118503
55221A18503J14l68p62p32l63q4k4K76J172K146K196J080l16j020r98q13p29o07
$$ 118503 118617 118249 117487 116755 116392 116308 116284 116560 117732 119878 122074 123154 122838 121818 120820 120007 119278 118671
55203A18671m48m26m07L2Q75J329O56p89j673j077M91J570J254J2r89j118p15
$$ 118671 118223 117797 117390 117422 118297 119626 120282 119493 117820 116743 117234 118804 120058 120070 119081 117963 117248
55186A17248m12l93l52K0O25J032R17M35M8n6j56m66o56k70N09R71Q42O26P87
$$ 117248 116836 116443 116091 116111 116736 117768 118685 119120 119168 119112 118956 118490 117834 117564 118073 119044 119886 120512 121299
55167A21299J008P56K69L13R73J357Q66K15N40J721K418J905J053R89J447J190
$$ 121299 122307 123063 123332 123645 124618 125975 126841 127056 127596 129317 131735 133640 134693 135682 137129 138319
55151A38319j80j752k548k395j539k36R51J184K53j067j903k103j837j074K3P68
$$ 138319 138139 136387 133839 131444 129905 129669 130620 131804 132057 130990 129087 126984 125147 124073 124096 124864
55135A24864O43j2n28p41p71m99QJ15n35j170p84L77J150J085P50N19J16m98p43
$$ 124864 125507 125495 124967 124226 123455 122956 122964 123079 122544 121374 120590 120967 122117 123202 123952 124471 124587 124089 123346
55116A23346k81N16J177J572J567J006J99j92l8Q9j98o68j021j154q52N8J031
$$ 123346 123065 123581 124758 126330 127897 128903 129102 128910 128872 128961 128763 128095 127074 125920 125068 125126 126157
55099A26157J171N30J86P02J364J386R63N86J61m24o58j46N32N79J28j39j59m08
$$ 126157 127328 127858 128044 128746 130110 131496 132459 133045 133206 132782 132124 131978 132510 133089 133217 133078 132919 132511
55081A32511r08j148q87m00J8K83L43K73L43N53L77m45j197r43N4N54L4n88k23
$$ 132511 131603 130455 129568 129168 129186 129469 129812 130085 130428 130981 131358 130913 129716 128773 128827 129381 129415 128827 128604
55062A28604R63J878J849J182N23J17j77m33n53n36n66o72n54o0L97L14j17j75
$$ 128604 129567 131445 133294 134476 134999 135116 134939 134506 133953 133417 132851 132179 131625 131565 131962 132276 132159 131984
55044A31984M16J099J198O26j94p81q51n22k62l40l98j2M91M59K3m7L28L67k09
$$ 131984 132400 133499 134697 135323 135129 134348 133497 132975 132713 132373 131975 131963 132454 132913 132936 132889 133217 133584 133375
55025A33375o08k16M98Q47Q40O34oj024j633j369q00m58J07J250K086J642N10
$$ 133375 132767 132551 133049 133896 134736 135370 135364 134340 132707 131338 130538 130080 130187 131437 133523 135165 135675
55008A35675J7J85l1p75j068n23P4J49N9J19K0l20l21L40J170J646J852J937J636
$$ 135675 135692 135877 135846 135071 134003 133480 133554 133703 133762 133881 133901 133581 133260 133600 134770 136416 138268 140205 141841
54989A41841Q37K2l71m95o21n77p0P48J440J701J438P65O6k75l70o21r84r32l75
$$ 141841 142678 142700 142329 141834 141213 140636 140566 141314 142754 144455 145893 146658 146724 146449 146079 145458 144474 143542 143167
54970A43167Q3L5j29N6L77M26L76O66J181J375J097P74P25P80P24P12R95J413
$$ 143167 143250 143285 143156 143212 143589 144015 144391 145057 146238 147613 148710 149484 150209 150989 151713 152425 153420 154833
54952A54833J442Q26k4m54l13n1n8j99j49O9J72K9k89o63q93p22j98K28K61K21
$$ 154833 156275 157101 157077 156623 156310 156259 156201 156002 155853 155922 156094 156123 155834 155171 154278 153556 153358 153586 153847 154068
54932A54068N45J128J548J706J697J350N51j00K15J388K395K595K478K877L987
$$ 154068 154613 155741 157289 158995 160692 162042 162593 162493 162708 164096 166491 169086 171564 174441 178428
54917A78428N280O049N911N170M610M552M259K875P49r54j897k842m139n021m828
$$ 178428 183708 189757 195668 200838 205448 210000 214259 217134 217883 216929 215032 212190 208051 203030 198202
54902A98202m112l800l956m043l919l851l782l306k289j105k66q9n36j151j306
$$ 198202 194090 190290 186334 182291 178372 174521 170739 167433 165144 164039 163773 163684 163148 161997 160691
54887A60691p89O7Q44J389J624J464J117J077J527K091K384K462K528K640K931
$$ 160691 159902 159969 160813 162202 163826 165290 166407 167484 169011 171102 173486 175948 178476 181116 184047
54872A84047L664M688N278M871L657K214R41M5m13q13j746l161m201m328m072
$$ 184047 187711 192399 197677 202548 206205 208419 209360 209405 208992 208179 206433 203272 199071 194743 190671
54857A90671m164m473m434m011l510k859j891j047r68j470j741j481j115q83n13
$$ 190671 186507 182034 177600 173589 170079 167220 165329 164282 163314 161844 160103 158622 157507 156624 156111
54842A56111N2M18M46N00P22O32q0q86j034n26n3q1m46p51p85n30j3O01R74Q56
$$ 156111 156163 156581 157027 157527 158249 158881 158801 157915 156881 156355 156302 156221 155775 155024 154239 153709 153696 154297 155271 156127
54822A56127M01N0jn3m16q25o76J24R46J163Q06K77j52l47j73K62M85J32n02p92
$$ 156127 156528 156578 156577 156524 156108 155283 154607 154731 155677 156840 157646 157923 157771 157424 157251 157513 157998 158130 157628 156836
54802A56836m65K18Q63J167R95M88K7k58o61j298j624j080oO67O19M52O86J096
$$ 156836 156371 156589 157452 158619 159614 160102 160129 159871 159210 157912 156288 155208 155202 155869 156488 156940 157626 158722
54784A58722J209J062J044J286J458J157L15o91j267j102m07L42R09J347J717
$$ 158722 159931 160993 162037 163323 164781 165938 166253 165562 164295 163193 162786 163128 164037 165384 167101
54769A67101K053K534L357M395N253N740N975O060N905N467M914M398L919L409
$$ 167101 169154 171688 175045 179440 184693 190433 196408 202468 208373 213840 218754 223152 227071 230480
54755B30480K725J534m15k752m576n375n560n828o190n999m925l486k513k250
$$ 230480 233205 234739 234324 231572 226996 221621 216061 210233 204043 198044 193119 189633 187120 184870
54741A84870k182j704q50k24k57p00r34p01k63P5L29O27Q85R23P68O72Q33J198
$$ 184870 182688 180984 180134 179910 179653 178953 178019 177318 177055 177130 177459 178086 178971 179894 180662 181334 182167 183365
54723A83365J599J987K540L474M673N599N735N179M541M116L413J828l89k243
$$ 183365 184964 186951 189491 192965 197638 203237 208972 214151 218692 222808 226221 228049 227660 225417
54709B25417l148l549m162m917n144m641m031l907m054l889l294k651k205j845
$$ 225417 222269 218720 214558 209641 204497 199856 195825 191918 187864 183975 180681 178030 175825 173980
54695A73980j563j559j772j689r57M5O29O33M51K92j37r96j693j419k16Q91J076
$$ 173980 172417 170858 169086 167397 166440 166485 167114 167747 168198 168490 168353 167357 165664 164245 164029 164920 165996
54678A65996O38M14N76N76J77j33l1J02j07l10j31nm87j054o81M28Q80J56n41
$$ 165996 166634 167048 167624 168200 168377 168244 168213 168315 168208 167898 167767 167762 167275 166221 165540 165968 166848 167004 166463
54659A66463q9P90O66m07j006m75K26J03m51l58N81J509J721J405J126R66N44
$$ 166463 166374 167164 167830 167423 166417 165942 166168 166271 165820 165462 166043 167552 169273 170678 171804 172770 173314
54642A73314k37r02r71n72k18j37j78k17k60j59K14M66q0j345k256j934p95j8
$$ 173314 173077 172175 171204 170632 170414 170277 170099 169882 169622 169463 169677 170143 170063 168718 166462 164528 163733 163715
54624A63715j65p05p76n5R76J432Q46k23o78j80M47L45k76n94l30J34M56O00N41
$$ 163715 163550 162845 162069 162014 162990 164422 165268 165045 164367 164187 164634 164979 164703 164109 163779 163913 164369 164969 165510
54605A65510L17K09M06O39O24O51J062J413R92Q7j61N53J028J10j700k824k502
$$ 165510 165827 166036 166442 167081 167705 168356 169418 170831 171823 171910 171749 172302 173330 173440 171740 168916 166414
54588A66414j473q56q37p39r9O57P95K84j91k33k32n68q71n69J62O37N96K75k10
$$ 166414 164941 164085 163248 162509 162410 163067 163862 164146 163955 163722 163490 162922 162051 161482 161644 162281 162877 163152 162942
54569A62942q15j046l61Q64J570J402J047J004Q82L42j08J01O52Q26N26J81Mm5
$$ 162942 162127 161081 160720 161584 163154 164556 165603 166607 167489 167831 167723 167824 168476 169302 169828 170009 170013 169968
54551A69968J33N58P92M08l14o87n77m58o18p74o26k60Q5L30M97N93O43O46M50
$$ 169968 170101 170659 171451 171859 171545 170858 170281 169823 169205 168431 167805 167545 167630 167960 168457 169050 169693 170339 170789
54532A70789p9p31j050q53l83K5K29J70k23p63r13k33J001J915J858J023J24l92
$$ 170789 170710 169979 168929 168076 167693 167718 167947 168117 167894 167131 166218 165985 166986 168901 170759 171782 171906 171514
54514A71514o41p83o19O1Q90J112M78l93p02l08L10O88P84P99R01J136J404J455
$$ 171514 170873 170090 169471 169532 170422 171534 172012 171619 170917 170609 170919 171607 172391 173190 174091 175227 176631 178086
54496A78086J063L11l85n97l42k7L6m9nJ16j8m57p81o56k85k5K14P26J289J247
$$ 178086 179149 179460 179075 178478 178136 178109 178145 178096 178091 178207 178189 177732 176951 176295 176010 175985 176199 176925 178214 179461
54476A79461M44l88m18L13J020J043M14l62q52j028j114j163r46l66J31J4n34
$$ 179461 179905 179517 179099 179412 180432 181475 181889 181527 180675 179647 178533 177370 176424 176058 176189 176203 175669
54459A75669o28K11J334J626P69m83j239j335j184j060p98k16M84R19R56P39L54
$$ 175669 175041 175252 176586 178212 178981 178498 177259 175924 174740 173680 172882 172666 173150 174069 175025 175764 176118
54442A76118j77o08o13l24k60m83l78L28R16O61J1l8N52R32P29L94J35l56r26
$$ 176118 175941 175333 174720 174396 174136 173653 173275 173603 174519 175180 175191 175153 175705 176637 177366 177760 177895 177539 176613
54423A76613p45L17J094O25m35p80k16L70M63L58L30K26k1j45nJ66J55P7K26P67
$$ 176613 175868 176185 177279 177904 177469 176689 176473 176843 177306 177664 177994 178220 178199 178054 178049 178215 178370 178447 178673 179440
54403A79440J498J830J205q4q63k90J050J775J347M97J00K23M59O33P79P22J66
$$ 179440 180938 182768 183973 183889 183026 182736 183786 185561 186908 187405 187505 187728 188187 188820 189599 190321 190487
54386A90487p99j517j338l11P75J206J059Q53O53Q2p19q62J11J331J607R49M05
$$ 190487 189688 188171 186833 186522 187297 188503 189562 190415 191068 191150 190431 189569 189680 191011 192618 193567 193972
54369A93972N05O91L13m99j174j343q91J04J195J687J274L57m46q82j003q32l72
$$ 193972 194477 195168 195481 194982 193808 192465 191574 191678 192873 194560 195834 196191 195745 194863 193860 193028 192656
54352A92656J93N93P00N74L88L24M26M67J70m13q91r57o67l24k68p33j603k226
$$ 192656 192849 193442 194142 194716 195104 195428 195854 196321 196491 196078 195187 194230 193563 193239 192971 192238 190635 188409
54334A88409j866n62P06R53J73p69j120r03o57q01j252j580j407o41N06J619K220
$$ 188409 186543 185981 186687 187640 187813 187044 185924 185021 184364 183563 182311 180731 179324 178683 179189 180808 183028
54317A83028K061J374P24M83N63P03P89P48M51m5l82l58k38k69j75L91J064J135
$$ 183028 185089 186463 187187 187670 188233 188936 189725 190473 190924 190879 190497 190139 189901 189632 189457 189848 190912 192047
54299A92047O02K26M08O52M00k21p83j191j509j569j178n28N5N59J126J651J841
$$ 192047 192649 192875 193283 193935 194335 194114 193331 192140 190631 189062 187884 187356 187411 187970 189096 190747 192588
54282A92588J580J010L68n3n1J67Q6m07p10l09M02N89R5m62o17n60o63j000j389
$$ 192588 194168 195178 195546 195493 195442 195609 195695 195288 194578 194269 194671 195260 195355 194893 194276 193716 193053 192053 190664
54263A90664j563j200j83J037J709J512P74m3o63q06k29P44J205O23m56r66m56
$$ 190664 189101 187901 187718 188755 190464 191976 192750 192707 192044 191238 191009 191753 192958 193581 193125 192159 191703
54246A91703O38J536J663Q60n10j691k059j583o40L89J161J285O63j82n44k99
$$ 191703 192341 193877 195540 196400 195890 194199 192140 190557 189917 190306 191467 192752 193415 193233 192689 192390
54230A92390J28M32O98R49R53N87M9l77n26k63L60Q51O29k12q99r44o53m55k60
$$ 192390 192518 192950 193648 194597 195550 196137 196186 195809 195283 195020 195380 196231 196860 196648 195749 194805 194152 193697 193437
54211A93437P1K69J53K09R02J723J726Q48n9m74p01r54r08m43j85o31j264j170
$$ 193437 193508 193777 193930 194139 195041 196764 198490 199338 199279 198805 198104 197150 196242 195799 195614 194983 193719 192549
54193A92549k89N65Q12O91P30J030J256J099O37L01M70J014J322Q70k25j295j723
$$ 192549 192260 192825 193637 194328 195058 196088 197344 198443 199080 199381 199851 200865 202187 203057 202832 201537 199814
54176A99814j424q85p00r68j103m57Q21J890K197K057K042K193K179J982J921
$$ 199814 198390 197505 196805 195837 194734 194277 195098 196988 199185 201242 203284 205477 207656 209638 211559
54161B11559K123K344K416K430K379J938Q70m98j497j768j551j273j084r41j002
$$ 211559 213682 216026 218442 220872 223251 225189 226059 225561 224064 222296 220745 219472 218388 217447 216445
54146B16445j536k367k731k081q58j16l68j154j712j735j372r69q81j221j513
$$ 216445 214909 212542 209811 207730 206872 206756 206388 205234 203522 201787 200415 199446 198565 197344 195831
54131A95831j070O7R34P77P0r8N52J185J019K76j74J31Q18J221J136R63J097J385
$$ 195831 194761 194828 195762 196539 196609 196511 197063 198248 199267 199543 199369 199500 200318 201539 202675 203638 204735 206120
54113B06120J394J075Q48R84J246J299J124R06P30O15N71N03L09J55L12N93M14
$$ 206120 207514 208589 209437 210421 211667 212966 214090 214996 215726 216341 216912 217415 217724 217879 218191 218784 219198
54096B19198l66j071j073n64p6K81O31P51M12J8K14Q81J216Q44K54l5k15p43j526
$$ 219198 218832 217761 216688 216124 216048 216329 216960 217711 218123 218141 218355 219236 220452 221296 221550 221515 221300 220557 219031
54077B19031j873j277m8R19J058O53K94ro36j372j368m44L38K6q87j221p51k50
$$ 219031 217158 215881 215833 216752 217810 218463 218757 218748 218112 216740 215372 214928 215266 215292 214405 213184 212433 212183
54059B12183k25m26m78k41L05Q87Q37m1q13m68O20J239J177J335J996K291J743
$$ 212183 211958 211532 211054 210813 211118 212005 212842 212801 211988 211520 212140 213379 214556 215891 217887 220178 221921
54042B21921J087J116J619K122K705L474M009L995L799L851M012M083M244M457
$$ 221921 223008 224124 225743 227865 230570 234044 238053 242048 245847 249698 253710 257793 262037 266494
54028B66494M208L415K952L410M060L820K753J782J338J190J166J225J072M91
$$ 266494 270702 274117 277069 280479 284539 288359 291112 292894 294232 295422 296588 297813 298885 299376
54014B99376j63n45j076k289l752m530m543m495m629m445l677k654j684r21q09
$$ 299376 299213 298668 297592 295303 291551 287021 282478 277983 273354 268909 265232 262578 260894 259973 259164
53999B59164j699k881l001j813o07m66r44j056q15j013j852k613k535j592m29
$$ 259164 257465 254584 251583 249770 249163 248697 247753 246697 245882 244869 243017 240404 237869 236277 235848
53984B35848J13l85j463k054j557m79J59r5q18j283j109m48J71K56j90o72p36
$$ 235848 235961 235576 234113 232059 230502 230023 230182 230087 229269 227986 226877 226429 226600 226856 226666 225994 225258
53967B25258m29r1J08K91O21J035J270J097N75N3j55k8K90P51J343J794J724J066
$$ 225258 224829 224738 224846 225137 225758 226793 228063 229160 229735 229788 229633 229605 229895 230646 231989 233783 235507 236573
53949B36573J62n93j008r85n33J57Q47J522K197K567K309J757J683K212K550K158
$$ 236573 236735 236142 235134 234149 233616 233773 234620 236142 238339 240906 243215 244972 246655 248867 251417 253575
53933B53575J641J868K636K973K647K497L128L995M247L954L878M200M176L267
$$ 253575 255216 257084 259720 262693 265340 267837 270965 274960 279207 283161 287039 291239 295415 298682
53919B98682K129J957K998M193M515M188M186M728M985M356L387K929K840K249
$$ 298682 300811 302768 305766 309959 314474 318662 322848 327576 332561 336917 340304 343233 346073 348322
53905C48322R31l00p42o83p79j088j250j283j607k352l169l718l936l810l370
$$ 348322 349253 348953 348211 347528 346749 345661 344411 343128 341521 339169 336000 332282 328346 324536 321166
53890C21166k983l168l873m397m300l889l558l166k633k530l282m086l694k270
$$ 321166 318183 315015 311142 306745 302445 298556 294998 291832 289199 286669 283387 279301 275607 273337
53876B73337j407k022l167l469k927k474k373j994r86J58P31M59n06j657k254
$$ 273337 271930 269908 266741 263272 260345 257871 255498 253504 252518 252676 253407 253866 253360 251703 249449
53861B49449j918j205j034j475j687j256q74j255j881j555p5J397J761J287J005
$$ 249449 247531 246326 245292 243817 242130 240874 240000 238745 236864 235309 235234 236631 238392 239679 240684
53846B40684J196J133M25j61K58J244J472N89k83k03K95J76m66p23m44m06r16
$$ 240684 241880 243013 243438 243277 243535 244779 246251 246840 246557 246354 246649 246825 246359 245636 245192 244786 243870
53829B43870j193n92L80P41K97l16n54m63l46l16k26J01N81Q73P98O72Q84J272
$$ 243870 242677 242085 242465 243206 243503 243187 242633 242170 241824 241508 241282 241383 241964 242837 243635 244307 245191 246463
53811B46463J328J011Q22R78J120J188J829L373M912N166M098K904K428K287J766
$$ 246463 247791 248802 249624 250602 251722 252910 254739 258112 263024 268190 272288 275192 277620 279907 281673
53796B81673R10M15P22J605K453K744K383J754J408J491J579J186L16n61j070
$$ 281673 282583 282998 283720 285325 287778 290522 292905 294659 296067 297558 299137 300323 300639 300078 299008
53781B99008j265j423j663j839j836j757j788j918j933j782j716j981k388k464
$$ 299008 297743 296320 294657 292818 290982 289225 287437 285519 283586 281804 280088 278107 275719 273255
53767B73255k057j571j481j699j642j036l18j67o75j309j639j736j728j373m38
$$ 273255 271198 269627 268146 266447 264805 263769 263451 263284 262609 261300 259661 257925 256197 254824 254386
53752B54386P03J362J404J376J626J773J269K08p87j233j064l91O03J561K032
$$ 254386 255089 256451 257855 259231 260857 262630 263899 264107 263320 262087 261023 260632 261235 262796 264828
53737B64828J860J337R59J023J455J935K215K326K411K395K064J502J179J404
$$ 264828 266688 268025 268984 270007 271462 273397 275612 277938 280349 282744 284808 286310 287489 288893
53723B88893J918K324K636L091L573L698L368K883K441K003J729J989K741L343
$$ 288893 290811 293135 295771 298862 302435 306133 309501 312384 314825 316828 318557 320546 323287 326630
53709C26630L367L246L677M589N228N203M955N120N823O862Q202J0040J2427J5155
$$ 326630 329997 333243 336920 341509 346737 351940 356895 362015 367838 374700 382902 392942 405369 420524
53695D20524J7996K0935K4166K7832L1738L5346L8138L9817L9859L6937K9429
$$ 420524 438520 459455 483621 511453 543191 578537 616675 656492 696351 733288 762717
53684G62717J7015J676j3295k5280l3321l7578l8548l6940l3708k9742k5607k1652
$$ 762717 779732 781408 768113 742833 709512 671934 633386 596446 562738 532996 507389 485737
53672D85737j8196j5411j3248j1646j0562r695q442o569m632l421l064l039k939
$$ 485737 467541 452130 438882 427236 416674 406979 398537 391968 387336 383915 380851 377812 374873
53659C74873k824k777k605k189j777j735k076k483k682k597k265j702r74k90L8
$$ 374873 372049 369272 366667 364478 362701 360966 358890 356407 353725 351128 348863 347161 346187 345897 345935
53644C45935j11m20l44K64R21J042O37K31K38O34J232J864K344K527K455K265
$$ 345935 345824 345404 345060 345324 346245 347287 347924 348155 348393 349027 350259 352123 354467 356994 359449 361714
53628C61714J984J693J743K398L282L686L493L239L233L205L075L294M008M565
$$ 361714 363698 365391 367134 369532 372814 376500 379993 383232 386465 389670 392745 396039 400047 404612
53614D04612M485M330M801N396N016L710K755K912L534L794L806M034M296M127
$$ 404612 409097 413427 418228 423624 428640 432350 435105 438017 441551 445345 449151 453185 457481 461608
53600D61608L628L272L076K625J813R62K73l09p34q28p37q20j023q20n1N79L04
$$ 461608 465236 468508 471584 474209 476022 476984 477257 476948 476214 475386 474649 473829 472806 471986 471935 472514 472818
53583D72818p08j568j793j720j777j851j756j855k703m040m816m439l556l127
$$ 472818 472110 470542 468749 467029 465252 463401 461645 459790 457087 453047 448231 443792 440236 437109
53569D37109l086k585j472p04j039j989k605k749k909l067k627j514n47l90p12
$$ 437109 434023 431438 429966 429262 428223 426234 423629 420880 417971 414904 412277 410763 410216 409826 409114
53554D09114q08o05n66q36j000o49K00J239K160K732K864K677K483K568L058L871
$$ 409114 408306 407701 407135 406299 405299 404650 404850 406089 408249 410981 413845 416522 419005 421573 424631 428502
53538D28502M711N239N369N383N589N927O121O154O350P014Q114R366J0472J1245
$$ 428502 433213 438452 443821 449204 454793 460720 466841 472995 479345 486359 494473 503839 514311 525556
53524E25556J1674J1952J2365J2989J3601J3873J3728J3475J3650J4627J6303
$$ 525556 537230 549182 561547 574536 588137 602010 615738 629213 642863 657490 673793
53513F73793J8188J9887K1428K3027K4594K5684K5989K5792K5743K6187K6782
$$ 673793 691981 711868 733296 756323 780917 806601 832590 858382 884125 910312 937094
53502I37094K6871K6209K5166K4152K3085K1779K0697K0728K2020K3499K3944
$$ 937094 963965 990174 1015340 1039492 1062577 1084356 1105053 1125781 1147801 1171300 1195244
53491A195244K3261K2319K1774K1540K1214K0525J9369J7939J6844J6615J6983
$$ 1195244 1218505 1240824 1262598 1284138 1305352 1325877 1345246 1363185 1380029 1396644 1413627
53480A413627J7033J6243J5033J4127J3720J3459J3012J2401J1944J1967J2507
$$ 1413627 1430660 1446903 1461936 1476063 1489783 1503242 1516254 1528655 1540599 1552566 1565073
53469A565073J3284J4056J4824J5603J6148J6333J6471J6658J5899J2527N649
$$ 1565073 1578357 1592413 1607237 1622840 1638988 1655321 1671792 1688450 1704349 1716876 1722525
53458A722525m306j6244k8849m0241m8298n2010n2105n0020m6772m3078l9699
$$ 1722525 1718219 1701975 1673126 1632885 1584587 1532577 1480472 1430452 1383680 1340602 1300903
53447A300903l6968l4482l1878k9462k7462k5303k2379j9183j6780j5425j4461
$$ 1300903 1263935 1229453 1197575 1168113 1140651 1115348 1092969 1073786 1057006 1041581 1027120
53436A027120j3373j2076j0405q181n868m284l525k752j232R43L228N218O750
$$ 1027120 1013747 1001671 991266 983085 977217 972933 969408 966656 965424 966367 969595 974813 981563
53423I81563P932R197J0888J2791J4395J5604J6751J8040J9451K1022K2664K3899
$$ 981563 989495 998692 1009580 1022371 1036766 1052370 1069121 1087161 1106612 1127634 1150298 1174197
53411A174197K4468K5057K6614K9023L1253L2835L4231L5741L7099L8422M0406
$$ 1174197 1198665 1223722 1250336 1279359 1310612 1343447 1377678 1413419 1450518 1488940 1529346
53400A529346M3092M5451M6911M8421N1067N4283N6431N6863N6492N6492N7152
$$ 1529346 1572438 1617889 1664800 1713221 1764288 1818571 1875002 1931865 1988357 2044849 2102001
53389B102001N7988N8366N7953N6965N5956N5103N3841N1517M8197M4468M0672
$$ 2102001 2159989 2218355 2276308 2333273 2389229 2444332 2498173 2549690 2597887 2642355 2683027
53378B683027L6733L2545K8187K3796J9553J5609J1871P968L659r68n818j0934
$$ 2683027 2719760 2752305 2780492 2804288 2823841 2839450 2851321 2859289 2862948 2861980 2856162 2845228
53366B845228j6063k0609k4397k8092l2397l7179m1856m6304n0695n4626n7205
$$ 2845228 2829165 2808556 2784159 2756067 2723670 2686491 2644635 2598331 2547636 2493010 2435805
53355B435805n8083n7930n7670n7595n7276n6130n4037n1562m9566m8516m8187
$$ 2435805 2377722 2319792 2262122 2204527 2147251 2091121 2037084 1985522 1935956 1887440 1839253
53344A839253m8065m7712m6756m5003m2871m1209m0271l9291l7520l5283l3363
$$ 1839253 1791188 1743476 1696720 1651717 1608846 1567637 1527366 1488075 1450555 1415272 1381909
53333A381909l1741k9686k7001k4349k2352k0929j9602j8056j6275j4600j3587
$$ 1381909 1350168 1320482 1293481 1269132 1246780 1225851 1206249 1188193 1171918 1157318 1143731
53322A143731j3361j3122j1786r138o046l567k234j988k191j705K78L338O183
$$ 1143731 1130370 1117248 1105462 1096324 1090278 1086711 1084477 1082489 1080298 1078593 1078871 1082209 1088392
53309A088392Q081R456J1015J2866J4653J6058J6840J6881J6432J6006J5744J5296
$$ 1088392 1096473 1105929 1116944 1129810 1144463 1160521 1177361 1194242 1210674 1226680 1242424 1257720
53297A257720J4597J4290J5036J6650J8328J9572K0563K1735K3219K4687K5558
$$ 1257720 1272317 1286607 1301643 1318293 1336621 1356193 1376756 1398491 1421710 1446397 1471955
53286A471955K5399K4225K2405K0372J8461J6851J5391J3584J1139Q397N861L412
$$ 1471955 1497354 1521579 1543984 1564356 1582817 1599668 1615059 1628643 1639782 1648179 1654040 1657452
53274A657452N80k421m678n872o875q647j1111j3581j5817j7945j9734k0771k1340
$$ 1657452 1658032 1655611 1650933 1645061 1638186 1629539 1618428 1604847 1589030 1571085 1551351 1530580 1509240
53261A509240k2358k4269k6486k8195k9315l0388l1766l3209l4215l4501l4180
$$ 1509240 1486882 1462613 1436127 1407932 1378617 1348229 1316463 1283254 1249039 1214538 1180358
53250A180358l3592l2964l2300l1489l0478k9271k7862k6354k5013k4065k3409
$$ 1180358 1146766 1113802 1081502 1050013 1019535 990264 962402 936048 911035 886970 863561
53239H63561k2741k1926k1169k0665k0298j9778j8988j8079j7159j6060j4549
$$ 863561 840820 818894 797725 777060 756762 736984 717996 699917 682758 666698 652149
53228F52149j2722j1111j0247j0173j0387j0308r826r385r511j0173j0696j0463
$$ 652149 639427 628316 618069 607896 597509 587201 577375 567990 558479 548306 537610 527147
53216E27147r677r196r478r903r431p860o123n291n520o114o400o237n762n029
$$ 527147 517470 508274 498796 488893 479462 471602 465479 460188 454668 448554 442154 435917 430155 425126
53202D25126m156l597l866m871n830o040n525m732l843k849k054j942k434k808
$$ 425126 420970 417373 413507 408636 402806 396766 391241 386509 382666 379817 377763 375821 373387 370579
53188C70579k572j988j511j191r21q62j196j757k237k590k822k766k400k097k092
$$ 370579 368007 366019 364508 363317 362396 361534 360338 358581 356344 353754 350932 348166 345766 343669 341577
53173C41577k014j503r83j129j735j884j337q69j053j350r02K39J155J074O0j153
$$ 341577 339563 338060 337077 335948 334213 332329 330992 330123 329070 327720 326818 327057 328212 329286 329346 328193
53157C28193j761j493p87l22k56k39j01j51o23j168j259q52l46K1M17J048J766
$$ 328193 326432 324939 324152 323830 323574 323335 323234 323083 322460 321292 320033 319181 318835 318856 319273 320321 322087
53140C22087K188K175K078K411L277M284N085N792O592P219P105O025M309K453
$$ 322087 324275 326450 328528 330939 334216 338500 343585 349377 355969 363188 370293 376318 380627 383080
53126C83080P37q10k318l860n147n616n117m326m060m287m298l749k998k388j788
$$ 383080 383817 383007 380689 376829 371682 366066 360949 356623 352563 348276 343978 340229 337231 334843 333055
53111C33055j065n08m90r16j287j178o22j00j18o05r16o51k11j63l54k17K98P89
$$ 333055 331990 331482 330992 330076 328789 327611 326989 326889 326771 326166 325250 324599 324388 324225 323871 323654 323952 324741
53093C24741J187J706K092J856J309J361K086K479K111J913K644L418K833R99
$$ 324741 325928 327634 329726 331582 332891 334252 336338 338817 340928 342841 345485 348903 351736 352735
53079C52735n48p19J79J186J611J164r9j728l101l823l829l343k867k880l199
$$ 352735 352187 351468 351647 352833 354444 355608 355509 353781 350680 346857 343028 339685 336818 333938 330739
53064C30739l018k002r81j028k052k924k861k132j409r93p92o95p34j003j382
$$ 330739 327721 325719 324738 323710 321658 318734 315873 313741 312332 311339 310547 309852 309118 308115 306733
53049C06733j391n71P96J694J435M88j78k95l78q04j310j433j042l57K56M81K44
$$ 306733 305342 304771 305567 307261 308696 309184 309006 308711 308333 307529 306219 304786 303744 303387 303643 304124 304368
53032C04368k70q98j597k219k415k020j289n34J84P69R16O36N47J153K057K413
$$ 304368 304098 303200 301603 299384 296969 294949 293660 293126 293310 294079 294995 295631 296178 297331 299388 301801
53016C01801J925R68q6r83j301o93M60J236J113L68m36r24r05l74L46Q69J143
$$ 301801 303726 304694 304608 303625 302324 301631 302091 303327 304440 304808 304372 303448 302543 302169 302515 303384 304527
52999C04527J337J350R49L66K70R43J846K220J829J019K97RK15P09J171J378J347
$$ 304527 305864 307214 308163 308529 308799 309742 311588 313808 315637 316656 316953 316962 317177 317886 319057 320435 321782
52982C21782J346J732K457K828K170R00L05R66K042K538K614K837K863J959M88
$$ 321782 323128 324860 327317 330145 332315 333215 333520 334486 336528 339066 341680 344517 347380 349339 349827
52967C49827l26j62K9l97q94p97l67k56o40j331k157k771k658j840j121j164j682
$$ 349827 349501 349339 349368 348971 348077 347280 346913 346657 346017 344686 342529 339758 337100 335260 334139 332975 331293
52950C31293j990j947j882j926j925j778j488j069p04p13j052j140o27l1j46j001
$$ 331293 329303 327356 325474 323548 321623 319845 318357 317288 316584 315871 314819 313679 313052 313021 312875 311874
52934C11874j880k249k157j764j009J8P88P68J07m48l82K4J24j56k15L52J130
$$ 311874 309994 307745 305588 303824 302815 302833 303621 304389 304496 304048 303666 303690 303814 303658 303443 303795 304925
52917C04925J413J090N90J86j64l67j35N09J083J112M64o16j576j798j269q22
$$ 304925 306338 307428 308018 308204 308040 307673 307538 308047 309130 310242 310706 310090 308514 306716 305447 304625
52901C04625j114j615j283j83O01O48P42J387J860J366K86n13q98j203j274p39
$$ 304625 303511 301896 300613 300430 301031 301679 302421 303808 305668 307034 307320 306807 305909 304706 303432 302693
52885C02693J19N65L76j8k37k71k68m37r91j698j889j292n30k44k20JJ51k67q69
$$ 302693 302812 303377 303753 303735 303498 303227 302959 302522 301531 299833 297944 296652 296122 295878 295658 295659 295810 295543 294674
52866B94674q04j15L49L21M42R53J172N68l62q10n37K31J200J900J828J104M59
$$ 294674 293870 293755 294104 294425 294867 295820 296992 297560 297198 296388 295851 296082 297282 299182 301010 302114 302573
52849C02573K16j61j070j963k107j669j338j297j234j113j119j013l09Q71J772
$$ 302573 302789 302628 301558 299595 297488 295819 294481 293184 291950 290837 289718 288705 288396 289267 291039
52834B91039K036K123K511K971L018K612K062J421M81o91j577j709j224p59q31
$$ 291039 293075 295198 297709 300680 303698 306310 308372 309793 310274 309583 308006 306297 305073 304314 303483
52819C03483j275j466j045l11K29N43R95J637K060K066K150K939M392N874O897
$$ 303483 302208 300742 299697 299386 299615 300158 301153 302790 304850 306916 309066 312005 316397 322271 329168
52804C29168P320O909N292K565m86l046m910o209o809o448n375m360l930l879
$$ 329168 336488 343397 348689 351254 350768 347722 342812 336603 329794 323346 317971 313611 309681 305802
52790C05802l616k885k009j586j934k698l079k622j690r78o54l33J47M02Q3n78
$$ 305802 302186 299301 297292 295706 293772 291074 287995 285373 283683 282705 282051 281718 281865 282267 282350 281772
52774B81772r79p09J87J242J797J553R89Q67J208J242N35l59p77q52j026j140
$$ 281772 280793 280084 280271 281513 283310 284863 285852 286719 287927 289169 289704 289345 288568 287716 286690 285550
52758B85550p34jL66J97l4j06l51q68j152q15j40M10Q12J216J483J339Q07J68
$$ 285550 284816 284815 285181 285378 285344 285238 284887 284019 282867 282052 281912 282322 283134 284350 285833 287172 287979 288147
52740B88147l55o15n57m10n59r19q27P3J172J639J563J673K106K164J481O70M27
$$ 288147 287792 287177 286620 286210 285651 284732 283905 283978 285150 286789 288352 290025 292131 294295 295776 296446 296873
52723B96873N17K21m83q65n39q1k72j104j854j995j741j647j865j963j442l53
$$ 296873 297390 297611 297128 296263 295724 295643 295371 294267 292413 290418 288677 287030 285165 283202 281760 281407
52707B81407P07J159R97O92N79N00J29m13n51P1J067J673J520Q99L10k6j61j75
$$ 281407 282114 283273 284270 284962 285541 286041 286170 285757 285206 285277 286344 288017 289537 290436 290746 290720 290559 290384
52689B90384j30j26k12k31R2Q65J861K616K702J991P84l51r27p74l6R04J508J371
$$ 290384 290254 290128 289916 289685 289777 290642 292503 295119 297821 299812 300596 300245 299318 298544 298508 299412 300920 302291
52671C02291O73J41L03Q81J268J443J898K603K669J502j68r97n82K48O29N44M31
$$ 302291 302964 303105 303408 304289 305557 307000 308898 311501 314170 315672 315504 314507 313925 314173 314802 315346 315777
52654C15777N19P95J216J557J405O83p3l61m39q81j581j711q57L47R70Q21M38
$$ 315777 316296 317091 318307 319864 321269 321952 321879 321518 321079 320198 318617 316906 316049 316396 317366 318187 318625
52637C18625K17om76r47q52M4J326K280K535K251J843J634J758K150K538K545
$$ 318625 318842 318836 318360 317413 316561 316605 317931 320211 322746 324997 326840 328474 330232 332382 334920 337465
52621C37465K046J316P24L30j06p24j376j819k019k096k079j794j135l69M1N0
$$ 337465 339511 340827 341551 341881 341775 341051 339675 337856 335837 333741 331662 329868 328733 328364 328405 328455
52605C28455K20J025K094K540K072J289P91N38L26L74Q98J477J452Q37L39M38
$$ 328455 328675 329700 331794 334334 336406 337695 338486 339024 339350 339724 340622 342099 343551 344388 344727 345165
52589C45165R07J181Q75Or32j209o05K02M18J70K52R27J611J815J693J519J177
$$ 345165 346072 347253 348128 348134 347202 345993 345388 345590 346008 346178 346430 347357 348968 350783 352476 353995 355172
52572C55172N65j8k68k95l34l55k52j69l10o06p68n86r1L83L84j55o56n52j46
$$ 355172 355737 355719 355451 355156 354822 354467 354215 354046 353736 353130 352362 351776 351685 352068 352452 352297 351641 351089 350943
52553C50943k20p60q41j3R41J062M60k0O0M52P12N76J48NO38J592J772R80L45
$$ 350943 350723 349963 349122 349109 350050 351112 351572 351552 351612 352064 352776 353352 353500 353505 354143 355735 357507 358487 358832
52534C58832O71J161P39j45j58Q15J545J237L55m70j165j662j600r90l95j36L4
$$ 358832 359503 360664 361403 361258 361100 361915 363460 364697 365052 364582 363417 361755 360155 359165 358770 358634 358668
52517C58668K77M61Q42K038L865N061M719L436K412K022J975K175K634K813K083
$$ 358668 358945 359406 360248 362286 366151 371212 375931 379367 381779 383801 385776 387951 390585 393398 395481
52502C95481P70j02k45n90j967l899n147n172m566l981l267j944l03O33L61l89
$$ 395481 396251 396149 395904 395314 393347 389448 384301 379129 374563 370582 367315 365371 365068 365701 366062 365673
52486C65673n92j89J32J51L40R05J344J277R87Q36O54J83l38n53n97q37j189j250
$$ 365673 365081 364892 365024 365175 365515 366420 367764 369041 370028 370864 371518 371701 371363 370810 370213 369376 368187 366937
52468C66937q76k28O27J653K538K967L214L868M900N450M798L189J439N9j010
$$ 366937 366061 365833 366460 368113 370651 373618 376832 380700 385600 391050 395848 399037 400476 400535 399525
52453C99525j955k782l403l745l695l130k125j096n55o56j073j383j525j673j759
$$ 399525 397570 394788 391385 387640 383945 380815 378690 377594 377039 376383 375310 373927 372402 370729 368970
52438C68970j426n51M44R73Q31K51m35r30j001o71l19l00m16j45N74J052O80k04
$$ 368970 367544 366993 367437 368410 369241 369492 369057 368127 367126 366455 366136 365836 365420 365275 365849 366901 367581 367377
52420C67377o02l0R26J356J089P18P74J240J851K564L473M562N771P118Q514R665
$$ 367377 366775 366745 367671 369027 370116 370834 371608 372848 374699 377263 380736 385298 391069 398187 406701 416366
52404D16366J0438J1124J1838J1844J0092O560K434j204m372p420r929j0997j0508
$$ 416366 426804 437928 449766 461610 471702 478262 480696 479492 475120 467700 457771 446774 436266
52391D36266r315q178p089n790m409l243k305j519j053j075j237r19j1R37J475
$$ 436266 426951 418773 411684 405894 401485 398242 395937 394418 393365 392290 391053 390134 390123 391060 392535
52376C92535J795K277K866L253L495L923M504M757M487M086L878L534K582J152
$$ 392535 394330 396607 399473 402726 406221 410144 414648 419405 423892 427978 431856 435390 437972 439124
52362D39124k24j372k495l493l845l289k237j273o20j80J73N26R02J185J264J297
$$ 439124 438900 437528 435033 431540 427695 424406 422169 420896 420276 420096 420269 420795 421697 422882 424146 425443
52346D25443J544J895J995J894K108K810L448L586L639M217N089N456N149M915
$$ 425443 426987 428882 430877 432771 434879 437689 441137 444723 448362 452579 457668 463124 468273 473188
52332D73188N391O418P527Q656J0000J1519J2885J3826J4197J3934J3221J2656
$$ 473188 478579 484997 492524 501180 511180 522699 535584 549410 563607 577541 590762 603418
52320F03418J2868J3737J4310J3728J2216J0814J0151R813R196Q562Q739R917
$$ 603418 616286 630023 644333 658061 670277 681091 691242 701055 710251 718813 727552 737469
52308G37469J1296J2119J2416J2466J2101J1154J0183R989J0434J0516R697Q524
$$ 737469 748765 760884 773300 785766 797867 809021 819204 829193 839627 850143 859840 868364
52296H68364P691P046O038M604L061J378o96k899m458n116n515o228o842o537
$$ 868364 876055 883101 889139 893743 896804 898182 897486 894587 890129 885013 879498 873270 866428 859891
52282H59891n430m687n099n995n942m379k159m35N99J592K866L932M278M241M640
$$ 859891 854461 849774 844675 838680 832738 828359 826200 825765 826364 827956 830822 834754 839032 843273 847913
52267H47913N650O606O982P127P685Q676R636J0395J1226J2222J3041J3330J3106
$$ 847913 853563 860169 867151 874278 881963 890639 900275 910670 921896 934118 947159 960489 973595
52254I73595J2568J1906J1348J1031J0692R811Q227O268M211K067m7j762k971
$$ 973595 986163 998069 1009417 1020448 1031140 1040951 1049178 1055446 1059657 1061724 1061677 1059915 1056944
52241A056944l955m748m910m366l848l860l826l047k033j893k619l071k656j981
$$ 1056944 1052989 1048241 1043331 1038965 1035117 1031257 1027431 1024384 1022351 1020458 1017839 1014768 1012112 1010131
52227A010131j660j509j262j140j175p84L26J514K137K549L407M471M889M505
$$ 1010131 1008471 1006962 1005700 1004560 1003385 1002601 1002927 1004441 1006578 1009127 1012534 1017005 1021894 1026399
52213A026399M096M338N158O101O822P185P337P666Q354Q905Q525P052N237M064
$$ 1026399 1030495 1034833 1039991 1046092 1052914 1060099 1067436 1075102 1083456 1092361 1100886 1107938 1113175 1117239
52199A117239L987M759N755O400O559O551O666O779O573O035N427M913M412L795
$$ 1117239 1121226 1125985 1131740 1138140 1144699 1151250 1157916 1164695 1171268 1177303 1182730 1187643 1192055 1195850
52185A195850K936J649j80k362m482o233p544q473r138r675j0050j0009r356q242
$$ 1195850 1198786 1200435 1200255 1197893 1193411 1187178 1179634 1171161 1162023 1152348 1142298 1132289 1122933 1114691
52171A114691p059o125n551n185m606l367j494M93K249L966N829P454Q355Q634
$$ 1114691 1107632 1101507 1095956 1090771 1086165 1082798 1081304 1081797 1084046 1088012 1093841 1101295 1109650 1118284
52157A118284Q661Q280P017N011L094J833J085O36N95R02J082R22Q73J317J788
$$ 1118284 1126945 1135225 1142242 1147253 1150347 1152180 1153265 1153901 1154496 1155398 1156480 1157402 1158275 1159592 1161380
52142A161380J528N27n78j526k677m170n444n903n653n258n004m689m020k901
$$ 1161380 1162908 1163435 1162857 1161331 1158654 1154484 1149040 1143137 1137484 1132226 1127222 1122533 1118513 1115612
52128A115612j437J89J813L502N584Q253J1241J4083J6664J9149K1415K2998K3712
$$ 1115612 1114175 1114364 1116177 1119679 1125263 1133516 1144757 1158840 1175504 1194653 1216068 1239066 1262778
52115A262778K3940K4026K3775K2895K1609K0370J9193J7782J6170J4744J3694
$$ 1262778 1286718 1310744 1334519 1357414 1379023 1399393 1418586 1436368 1452538 1467282 1480976
52104A480976J2917J2378J2092J1790J1203J0679J0967J2158J3399J3762J3015
$$ 1480976 1493893 1506271 1518363 1530153 1541356 1552035 1563002 1575160 1588559 1602321 1615336
52093A615336J1387R182O797M536K135r92m785q386j1163j3148j4121j3209j0112
$$ 1615336 1626723 1635905 1642702 1647238 1649373 1648381 1643596 1635210 1624047 1610899 1596778 1583569 1573457
52080A573457o042k530J78K707N030O424O754O715O766O713O495O630P587R253
$$ 1573457 1567415 1564885 1565063 1567770 1572800 1579224 1585978 1592693 1599459 1606172 1612667 1619297 1626884 1636137
$$ [...]
##END NTUPLES=NMR SPECTRUM
##END=
