##TITLE=AC1515_ROEFFECT0003_8201897_h56B3qxHBn
##JCAMPDX= 6.0         $$ Bruker NMR JCAMP-DX V2.0
##DATA TYPE= NMR SPECTRUM
##DATA CLASS= NTUPLES
##ORIGIN= BRUKER
##OWNER= Administrator
$$ 1.72 TOPSPIN		Version 2.1
$$ 2013-09-26 19:23:07.098 -0700  Administrator@X
$$ Compression mode = diff/dup
##.OBSERVE FREQUENCY= 400.02188249412
##.OBSERVE NUCLEUS= ^1H
##.ACQUISITION MODE= SIMULTANEOUS (DQD)
##.ACQUISITION SCHEME= undefined
##.AVERAGES= 8
##.DIGITISER RES= 22
##SPECTROMETER/DATA SYSTEM= spect
##.PULSE SEQUENCE= zg30
##.SOLVENT NAME= COFFEE_meoh
##.SHIFT REFERENCE= INTERNAL, COFFEE_meoh, 1, 14.98509
##AUDIT TRAIL= $$ (NUMBER, WHEN, WHO, WHERE, PROCESS, VERSION, WHAT)
$$ ##TITLE= Audit trail, TOPSPIN		Version 2.1
$$ ##JCAMPDX= 5.01
$$ ##ORIGIN= Bruker BioSpin GmbH
$$ ##OWNER= Administrator
$$ $$ E:\/data/COFFEE/nmr/AC1515_ROEFFECT0003_8201897_h56B3qxHBn/10/pdata/1/auditp.txt
$$ ##AUDIT TRAIL=  $$ (NUMBER, WHEN, WHO, WHERE, PROCESS, VERSION, WHAT)
(   1,<2013-09-26 19:22:59.514 -0700>,<Administrator>,<X>,<go>,<TOPSPIN 2.1>,
      <created by zg
	started at 2013-09-26 19:21:52.895 -0700,
	POWCHK enabled, PULCHK disabled,
       configuration hash MD5:
       C8 4E 4E 5D D3 5C D8 9E 9F 52 82 E0 59 8A DE 15
       data hash MD5: 64K
       8C EB CD B3 C2 85 F2 A1 5C A8 27 EE 0A 66 88 AA>)
(   2,<2013-09-26 19:23:02.664 -0700>,<Administrator>,<X>,<proc1d>,<TOPSPIN 2.1>,
      <Start of raw data processing
       efp LB = 0 FT_mod = 6 PKNL = 1 PHC0 = 0 PHC1 = 0 SI = 32K 
       data hash MD5: 32K
       32 EE 47 74 86 C1 CC B2 04 66 D4 80 09 01 86 4E>)
(   3,<2013-09-26 19:23:03.024 -0700>,<Administrator>,<X>,<proc1d>,<TOPSPIN 2.1>,
      <pk PHC0 = 95.80627 PHC1 = 0 
       data hash MD5: 32K
       E2 25 21 F8 0C 20 55 A0 17 D4 8A 10 0B CD 29 21>)
(   4,<2013-09-26 19:23:03.145 -0700>,<Administrator>,<X>,<proc1d>,<TOPSPIN 2.1>,
      <abs ABSG = 1 
       data hash MD5: 32K
       43 E8 E5 78 64 8C F2 22 ED EB D3 44 BB 19 F1 F6>)
(   5,<2013-09-26 19:23:03.231 -0700>,<Administrator>,<X>,<proc1d>,<TOPSPIN 2.1>,
      <abs ABSG = 2 
       data hash MD5: 32K
       D7 AB DC C3 5B B4 DA E4 25 F3 A3 BA 42 F0 8D 29>)
(   6,<2013-09-26 19:23:03.368 -0700>,<Administrator>,<X>,<proc1d>,<TOPSPIN 2.1>,
      <abs ABSG = 3 
       data hash MD5: 32K
       C2 F2 99 28 75 82 D2 D8 96 75 FD 45 6F 2C 25 FB>)
(   7,<2013-09-26 19:23:03.540 -0700>,<Administrator>,<X>,<proc1d>,<TOPSPIN 2.1>,
      <abs ABSG = 4 
       data hash MD5: 32K
       29 6A 62 D5 83 0B DC 54 9C 4E C7 A1 0C AB FF 86>)
(   8,<2013-09-26 19:23:03.592 -0700>,<Administrator>,<X>,<proc1d>,<TOPSPIN 2.1>,
      <abs ABSG = 5 
       data hash MD5: 32K
       40 E6 D5 55 74 EA 93 9A F5 EB 51 01 E8 A5 B0 E8>)
$$ ##END=
$$ 
$$ $$ hash MD5
$$ $$ 9A B6 EA F0 DC 2A 5E F4 30 17 98 1D FF EB 8F B4
##$RELAX= 
##$RELAX= 
##$RELAX= 
##$RELAX= 
##$RELAX= 
##$RELAX= 
##$RELAX= 
$$ Bruker specific parameters
$$ --------------------------
##$DU= <E:\>
##$EXPNO= 10
$$ [...]
150 150 150 150 150 150 150 150
##$TP07= 0
##$TPNAME0= <>
##$TPNAME1= <>
##$TPNAME2= <>
##$TPNAME3= <>
##$TPNAME4= <>
##$TPNAME5= <>
##$TPNAME6= <>
##$TPNAME7= <>
##$TPOAL= (0..7)
0.5 0.5 0.5 0.5 0.5 0.5 0.5 0.5
##$TPOFFS= (0..7)
0 0 0 0 0 0 0 0
##$TUNHIN= 0
##$TUNHOUT= 0
##$TUNXOUT= 0
##$USERA1= <user>
##$USERA2= <user>
##$USERA3= <user>
##$USERA4= <user>
##$USERA5= <user>
##$V9= 5
##$VALIST= <valist>
##$VCLIST= <CCCCCCCCCCCCCCC>
##$VD= 0
##$VDLIST= <DDDDDDDDDDDDDDD>
##$VPLIST= <PPPPPPPPPPPPPPP>
##$VTLIST= <TTTTTTTTTTTTTTT>
##$WBST= 1024
##$WBSW= 4
##$XGAIN= (0..3)
0 0 0 0
##$XL= 0
##$YL= 0
##$YMAX_a= 663422
##$YMIN_a= -563485
##$ZGOPTNS= <>
##$ZL1= 120
##$ZL2= 120
##$ZL3= 120
##$ZL4= 120
##$ABSF1= 14.98509
##$ABSF2= -5.573092
##$ABSG= 5
##$ABSL= 3
##$ALPHA= 0
##$AQORDER= 0
##$ASSFAC= 0
##$ASSFACI= 0
##$ASSFACX= 0
##$ASSWID= 0
##$AUNMP= <proc_prof1d_extract_pilot.lims>
##$AXLEFT= 0
##$AXNAME= <>
##$AXNUC= <1H>
##$AXRIGHT= 0
##$AXTYPE= 0
##$AXUNIT= <>
##$AZFE= 0.1
##$AZFW= 0.1
##$BCFW= 0
##$BC_mod= 0
##$BYTORDP= 0
##$COROFFS= 0
##$CY= 15
##$DATMOD= 1
##$DC= 0
##$DFILT= <>
##$DTYPP= 0
##$F1P= 0
##$F2P= 0
##$FCOR= 0.5
##$FTSIZE= 32768
##$FT_mod= 6
##$GAMMA= 0
##$GB= 0
##$INTBC= 1
##$INTSCL= 1
##$ISEN= 128
##$LB= 0
##$LEV0= 0
##$LPBIN= 0
##$MAXI= 10000
##$MC2= 0
##$MEAN= 0
##$ME_mod= 0
##$MI= 0
##$NCOEF= 0
##$NC_proc= -8
##$NLEV= 6
##$NOISF1= 0
##$NOISF2= 0
##$NSP= 0
##$NTH_PI= 0
##$NZP= 0
##$OFFSET= 14.98509
##$PC= 1
##$PHC0= 95.80627
##$PHC1= 0
##$PH_mod= 1
##$PKNL= yes
##$PPARMOD= 0
##$PPDIAG= 0
##$PPIPTYP= 0
##$PPMPNUM= 2147483647
##$PPRESOL= 1
##$PSCAL= 4
##$PSIGN= 0
##$PYNMP= <proc.py>
##$REVERSE= no
##$SF= 400.02
##$SI= 32768
##$SIGF1= 0
##$SIGF2= 0
##$SINO= 400
##$SIOLD= 32768
##$SPECTYP= <>
##$SREGLST= <1H.CDCl3>
##$SSB= 0
##$STSI= 32768
##$STSR= 0
##$SW_p= 8223.68421052631
##$SYMM= 0
##$S_DEV= 0
##$TDeff= 65536
##$TDoff= 0
##$TI= <>
##$TILT= no
##$TM1= 0
##$TM2= 0
##$TOPLEV= 0
##$USERP1= <user>
##$USERP2= <user>
##$USERP3= <user>
##$USERP4= <user>
##$USERP5= <user>
##$WDW= 1
##$XDIM= 32768
##$YMAX_p= 480793517
##$YMIN_p= -806931
##$CURPLOT= <Network HP LaserJet P1505>
##$CURPRIN= <$Network HP LaserJet P1505>
##$DFORMAT= <normdp>
##$LAYOUT= <+/1D_H.xwp>
##$LFORMAT= <normlp>
##$PFORMAT= <normpl>
##$SURQMSG= 1
$$ End of Bruker specific parameters
$$ ---------------------------------
##NTUPLES= NMR SPECTRUM
##VAR_NAME=  FREQUENCY,     SPECTRUM/REAL,   SPECTRUM/IMAG
##SYMBOL=    X,             R,               I
##VAR_TYPE=  INDEPENDENT,   DEPENDENT,       DEPENDENT
##VAR_FORM=  AFFN,          ASDF,            ASDF
##VAR_DIM=   32768,         32768,           32768
##UNITS=     HZ,            ARBITRARY UNITS, ARBITRARY UNITS
##FACTOR=    0.250966925370066, 1,           1
##FIRST=     8223.43324360094, -15786,       -179255
##LAST=      0,             -178034,         -87176
##MIN=       0,             -806931,         0
##MAX=       8223.43324360094, 480793517,    0
$$ Real data points
##PAGE= N=1
##DATA TABLE= (X++(R..R)), XYDATA
$$ [...]
23809 522377 -230940 30872 112128 -108026 -131869 50399 -46021 -26138 214782 -26557 -306686
23798 -306686 -15912 -294606 -281013 -184680 69764 -137146 -77946 198659 125202 109864 7534
23786 -330070 -21106 -227694 39545 -55018 -15021 -12523 119118 -177569 120355 30780 -146256
23774 -97792 -73220 360479 -111264 -249878 452318 128556 -48443 171911 -128759 70333
23763 252961 -7252 176264 -243827 -96098 -56435 1430 530 66770 -235242 -137530 -60568 32896
23750 -46733 -148812 12601 179173 -38065 2579 -34651 -144206 158898 -165582 97314 -16564
23738 124983 -143386 38410 -145102 28804 -246049 8416 128317 228513 -355781 -170467
23727 101205 194749 33244 -71859 182254 -158238 -113155 -30827 -248382 -71726 -156447 -101829
23716 -101829 -126212 -597472 -94503 -345588 57289 351019 68133 -200683 -101450 -265850
23706 -265850 412949 -155521 127879 -162323 200030 -35678 189476 -152491 -225672 -307138
23696 -307138 -73429 196979 422289 76193 7051 -347335 -8534 308988 -178463 193025 -63693
23684 51635 -314804 -75937 -60568 -37333 273548 169597 -161453 177158 -229757 88429
23673 217661 -50005 95226 -22127 -31765 98002 -321120 -268292 -30182 -338987 -136391 -171097
23662 -171097 189756 9517 -42575 90893 190992 146667 -188913 -67065 24875 213557 116472
23651 116472 8254 343730 -311340 -222649 556848 -267903 -21985 -21034 90899 -66316 -41636
23640 -41636 141944 -21346 -166644 -182189 192458 134132 -252782 -413523 -240091 -250406
23630 -250406 205837 -64026 59325 -23714 156511 -271961 216890 115810 23843 -36278
23619 -61384 -222531 151929 11667 2808 235069 -50753 -127168 8667 -22782 137224 26493
23607 -55643 164495 41541 -81838 102870 -195504 63725 95713 249204 -173150 184484
23596 -116690 -137380 -23787 -225775 191037 31879 32284 133973 3351 -152853 -358035 319472
23584 -13304 -176257 -50780 113205 321758 -36812 20369 32494 -79851 44118 -35804 -142730
23573 -142730 -108291 116859 134218 83129 -168522 327015 -24985 -233000 -115569 228807
23562 -151267 -115338 54731 -72957 -134897 114881 -250954 20246 -84101 -264978 129841 1712
23550 45282 -96337 -296827 225474 -170940 66087 -79870 -351539 -262881 206081 223534 -261153
23538 69155 -308660 -93721 -455735 92826 -134163 79377 -109326 140825 -63954 129697
23527 44647 -98345 -85379 -63068 -106398 58959 -48743 108219 148888 -2152 -250110 -97645
23515 87430 -127580 -33611 166014 204354 -46776 337561 13425 8688 23903 -127398 -140976
23504 -140976 320147 74710 -72598 52192 53134 9048 264684 -289843 160426 78719 122090
23493 122090 -131190 -106447 -34808 -113611 -134312 118891 -5923 133163 47648 -1798 210079
23481 110345 50486 -54422 -306418 -117743 229425 48346 -69279 -143872 -84698 -126215 222131
23469 -56390 -252329 22233 -225377 -102365 -300315 69488 74859 -265810 -264659 -23894 174430
23457 -217106 510871 -251710 19500 -221570 151644 -61676 -66643 -37213 -83619 -88913 -220403
23446 -220403 213824 167903 -60946 54216 -100136 -139529 -12060 93928 -27540 -158536 -131394
23435 -131394 -90414 -314497 108455 -114791 -26733 -225354 -36049 -169891 -114443 119351
23424 -3205 218962 -128607 -153560 -307487 -104680 -53744 -103504 37241 569453 151020 185417
23413 185417 226493 -163370 88601 362275 -38353 116516 -103436 -210624 -177004 -124163
23403 -124163 270447 -254298 69809 101987 143959 -28389 15433 -185902 -255676 194496 281978
23392 281978 150063 86476 213635 173362 -440114 -333750 19759 77609 451293 64458
23381 149250 141017 16307 -103512 148242 19992 40962 31009 29800 -419328 -205219 -26292
23369 222515 -55657 -260581 -140264 126373 376906 -206378 12855 130449 219777 97545
23358 -57925 -372534 -6996 -22270 -104622 -40474 106789 -109905 221464 87729 -91639 -84382
23347 -84382 -80270 68223 -80259 -2225 -67302 -13372 -106438 132402 -203477 38629 -131979
23335 -378813 -300032 -40042 172840 -306806 26456 227780 -264912 -68422 150914 -9573 139325
23323 129397 97603 125953 10314 -38895 -114284 -196543 -36732 23975 325617 89104 -19240
23311 151693 -283179 -25410 -288308 187518 -103300 -29411 -235573 518 98803 46395 -57523
23299 86384 -137340 7086 -41251 231311 -159241 -58015 140104 57359 200290 -28825 -512
23287 126077 159971 -117269 221081 -42883 -6631 193566 -1721 -81438 -400094 -165762 -90867
23276 -90867 -112843 84790 -220083 -161298 -100641 268017 -39718 24195 -43393 83211 18061
23264 163516 151910 -196446 -129846 98703 -280011 161092 -361432 -227229 188758 -284151
23253 162966 -56561 -133104 -6808 108036 -42207 50957 -141594 88230 183891 117209 149258
23242 149258 -62289 -102026 156066 160729 -58535 -206232 -334338 119099 -130720 -231862
23232 -231862 -18579 -142680 124791 23459 17715 164679 -114014 7538 216043 -64497 -113644
23221 -113644 -51636 -95443 -145130 -33487 -116280 274346 239877 -148526 76927 -142435 -83514
23210 -83514 -13466 -9242 224827 -383796 -349715 9142 341798 -29812 -68267 95653 -140050
23198 -102033 -86215 -38319 -175673 -15392 -221396 79119 41389 184229 -143973 -180134 -134675
23187 -134675 62071 294262 -3004 -63960 -154130 -39827 -104361 252152 -173756 98739 60977
23176 60977 53355 21740 -124272 -156909 -48390 -124562 330746 -83810 142540 -102708 203270
23164 -134242 10711 -273236 125606 -147536 90934 37778 239099 -90629 163468 103314
23154 103314 110047 -223160 149176 -86765 105610 -134675 -68035 83801 358194 -36178 27272
23142 -50260 203484 251160 -220166 -74689 19061 -565975 170226 -129558 213829 107193
23132 107193 -77737 134345 34872 24450 103506 -375537 -108997 -140705 -287895 88228 367749
23121 367749 -8116 106838 108829 73636 173210 -153020 -61219 324985 -37462 -36531 -253531
23110 -253531 -132636 -434243 -83582 48346 135385 163118 191531 85561 -91296 1427 -181941
23098 215905 151939 19705 86770 130079 161992 73018 -63472 -49232 503000 62546 277026
23087 277026 -39103 96761 162969 -254300 104612 19329 -115888 -439490 -391786 -128017
23076 -1048 73311 -227060 -102080 -222994 124773 45516 114360 71028 -228677 -383182 -536145
23065 -536145 -93571 157303 -72226 -136819 -111929 -35126 -79454 -77332 185958 98144 76463
23054 76463 308121 208532 -1850 -287455 -325173 80933 126180 108113 -14213 -282188 -1515
23042 -192255 205949 35710 26430 107752 -163251 -72422 -155772 -39275 -120904 -397357 154462
23030 -357516 -117216 -16920 -4083 128564 34035 -196011 -255538 81347 -123965 319284 173570
23019 173570 -139167 98252 -159035 493359 173992 260716 -40139 -211632 12281 246630
23009 246630 119716 210153 254885 -65741 -138845 37234 157124 178060 -10621 -109487 -287110
22998 -287110 -3886 17656 249664 49331 308946 334937 -211480 25371 -280901 -230079 -191505
22987 -191505 8963 -269003 101174 -16914 84629 164250 -11958 -48331 -83530 13663 24589
22976 24589 330780 104886 -117692 195218 -150153 -293552 141387 124443 180837 112999
22966 112999 91565 -85512 -60650 48161 -146553 -210009 -106992 -233621 197906 53894 -323912
22954 -470687 -122938 143293 104124 337226 -113591 102707 -228201 -404124 -6421 -512503
22944 -512503 -61053 -336065 -207832 -16939 9211 -28026 -127930 16503 179137 -161899 95463
22932 180479 65896 116372 366416 -181386 70209 -188438 -222488 -34305 315729 72904 260220
22921 260220 3104 -225548 -234644 -48019 -136953 257051 -140693 -177158 -616840 -227524 218008
22909 -119152 -293029 56263 266469 -514973 240694 -240399 177708 -98044 -2836 -11685 -185936
22898 -185936 46768 87747 -152432 -16980 -92909 -29680 39704 -104526 13538 179299 -582989
22886 318747 18269 275311 88297 -16255 -49229 -197263 173397 -160063 112444 -458065
22875 -66220 -161916 135257 131508 107724 78657 -18790 168577 -211148 199669 44870 -242054
22863 -40096 81883 -344144 11903 156658 -34622 7058 140230 103264 -82646 -162822 311694
22851 155905 -183574 -71515 75816 -89908 -279379 112323 -241343 171131 -12517 172418
22840 3201 -58860 -34276 -328910 -296699 -129449 -96061 -178666 182056 -70597 -63807 214168
22828 -254965 -290239 -36992 -249456 -137086 146222 124290 -155418 275539 -241990 18022
22817 -41890 -17810 -53646 -51757 -102485 224491 256225 -155510 276583 465615 42789 82257
22806 82257 142292 -246013 126866 -155408 6384 133756 -120163 -176013 110228 13076 -133945
22794 -249748 48142 25198 187849 135243 275740 -57545 405823 -26562 313901 -262799
22783 -394779 -63403 143145 -18981 18594 99745 146660 50546 48085 -48518 49649 12967
22771 -378574 255649 102965 -348314 -129951 249749 -9881 -97617 -77632 97450 -41935 36845
22759 5233 36838 -121398 -131182 243502 -553162 13293 -268064 -214371 214134 32024 116188
22748 116188 -277780 -189478 -92400 -281574 -26309 -244648 -270541 -86700 -7291 126430 -39193
22736 -205796 -256057 -542358 70104 83045 86917 -350930 280784 36537 6866 81599 -1627
22724 81133 46536 -86654 153179 -95471 89913 -209300 160936 -345074 -198853 -14804 219669
22712 -97643 72582 264080 -224045 -109123 50699 5940 -124363 -66013 57451 88089 -335679
22700 129965 -2993 123710 -80982 294767 26365 48074 -24106 -179543 -153228 69738 167827
22689 167827 44579 -277696 -50866 -507918 -57831 15915 -167449 111607 -224222 -28642
22678 -183504 193481 -165275 1862 -429721 169448 170541 106887 -122988 114871 -23480 50845
22666 63393 -132520 -454843 -367221 -105966 -273787 47053 188452 -142841 -107743 63234
22655 -262534 96157 -123911 -315562 172803 -93226 -176823 -472816 92202 55263 -151629
22644 -215157 -169191 2856 155797 -349023 64756 173439 -212479 184825 -315338 -300686
22634 -300686 -209549 106979 -224902 262889 -275234 487370 -69213 47351 -94308 281152
22623 91607 -436480 42223 143984 160043 -225650 -232451 -156550 -230505 -319862 107364 13266
22611 351906 -237245 -74752 -367743 46272 65648 122136 117071 -38199 -232769 -726400 81248
22599 287483 -249956 -95424 -196400 -110570 -414168 -40820 -13677 -75358 35016 -76131 424441
22587 -135987 13818 28117 -187067 119267 -109099 148954 38348 5470 96025 103930 229916
22576 229916 -335777 34912 -13478 -7652 -227130 205474 -165093 -280892 -159918 113761
22565 -241565 -324931 49501 224146 -102110 2343 -117679 -142651 106088 99555 -132686 -72946
22554 -72946 127098 336130 -14016 -152447 -145892 -117225 -133056 94412 27595 202442 52440
22542 -124580 -95622 -212467 -421991 264762 65943 156384 76307 -248379 -20258 -351679
22532 -351679 301084 10393 108826 220881 59456 110438 253552 615 -152701 -30656 185390
22520 23272 50273 -10907 44442 148949 226691 -65959 18775 57942 -171288 -323061 34693
22508 -61085 -352737 -148872 -180636 -109642 11504 -184864 -175968 -43910 -209357 -164039 -70099
22496 -194404 -236747 35939 105812 119257 -221216 -92917 293092 -12929 -259446 -360611 6444
22484 132021 251554 92565 -123671 -134996 -102146 45151 -315375 -151586 -223132 259351
22473 -23072 -105912 334850 -168244 -65990 58296 34052 46340 91339 237913 -256351 2564
22461 65283 -235089 200953 37543 -207791 -32034 -48273 -98788 -79317 97440 329254 -29057
22449 242956 -181832 -224090 93295 -36492 -361141 -204419 -245746 75686 259634 -87417 -92743
22438 -92743 75332 -60196 -56607 179790 7767 -235629 -26196 946 -105303 21269 356117 -132274
22425 -282117 -62508 -234750 -260010 -56841 231419 -15867 94253 53051 -116605 -107311 -288189
22414 -288189 371740 -90608 -222851 9964 244987 215894 204270 -273522 19166 132611 173147
22403 173147 200803 -235061 -287751 98449 109118 -100406 -175076 12392 -16520 -323024 -302004
22392 -302004 21581 -155152 6303 53984 -77107 -245687 45173 -50262 202053 -23331 53127
22380 -408068 -114821 204046 -273095 -458008 -174839 82318 -91576 -208265 19688 -41779
22369 -1790 46366 -166109 -27085 -157543 -265072 101826 -426897 -172013 62767 -250242
22358 -93967 166800 -179164 -244131 -41791 -80352 -127481 4292 364560 -254027 -66713 184465
22346 -41486 -252623 -67845 2518 -302334 138985 -153168 -61233 -14146 -112982 -37405 164539
22334 -421766 -66136 -227063 119884 110669 -87223 91721 -111948 -152851 164399 -157596 -4485
22322 322540 189929 112433 -214572 -53036 -55757 -11538 38983 43307 -292625 -18116 -63238
22311 -63238 -135116 43894 240368 -42126 65528 -393125 9709 116 214447 -45041 -16132 107102
22298 -436774 237359 -209051 -26493 48105 38244 232285 -164770 112527 -557231 -160233
22287 -191972 -218031 94520 -24247 280933 -94530 -84423 558477 -347732 -170976 216300
22276 -133636 -16483 14522 -40163 -169070 135876 -4234 -40525 64332 -14906 214032 -68293
22264 -258001 256059 -42413 115132 -178526 -38991 -294210 -651412 -368290 -290188 -315553
22254 -315553 -55482 350821 -347208 20280 205212 -102936 -218890 302808 108586 39734
22243 -386038 -83421 -211671 67543 151728 100683 -12098 -13299 -140758 -406946 55124 82848
22232 82848 -372754 -125585 -67573 -270672 -11403 -74288 -304940 -232151 345004 175857
22222 175857 351557 -114894 -93463 41736 32416 -368713 -4992 -195605 300449 102179 64068
22211 64068 -11746 38207 48731 -44671 6815 -13151 -88341 -235985 -177827 -91752 -88402 101214
22198 -116787 -425158 -55679 -34436 -7316 57863 -198669 124463 198090 48230 287912 -129086
22186 149547 -131770 269137 -61471 -67967 76829 -46204 -295089 98483 -240602 -102612 80120
22174 286481 -55219 -196927 -218652 67269 -219808 204489 23430 164554 -177460 30876
22163 -103635 12348 56897 -226447 -135136 -117247 -71773 -88907 -27606 91671 -240618 161827
22151 47100 -196951 66494 159705 51644 -80097 -199967 168920 -359291 -435238 38540 -233542
22139 -13928 59423 -396076 245919 61108 15824 185375 -2619 -336168 -109391 -239683 -301726
22128 -301726 -120172 209488 427570 -214456 -47487 -176256 -75884 -78840 -55425 287098
22117 -197734 -183696 -46152 -171303 -20201 159332 -279719 -26642 -155002 333807 122336
22106 79336 -136024 -23440 -34446 -278386 162556 299057 90346 -245992 -239 -202759 386456
22094 -219798 181344 -202189 190248 60495 39556 -138450 296928 166600 -23917 -199457
22084 -199457 -169856 -133071 105329 -95420 -124599 -227328 306816 39267 -222671 -341548
22074 -341548 -240906 282208 -71067 293196 -156395 -2366 100241 44063 103711 95944 152500
22063 152500 -271098 -342933 196590 236760 214599 -174611 9858 -145375 33196 318905 -138365
22051 -152687 -191379 -32542 -56040 -103517 13364 -249736 -21853 -84848 152164 -133288 -3956
22039 -309195 57142 296004 136009 278276 -35954 23539 -157240 -120358 -65458 -100184 85713
22027 -232698 134096 13617 592790 -63070 418141 -68019 -346655 42197 125749 -121557
22016 142614 -102891 -440452 12230 182344 -63836 217151 30966 -83216 227596 -31876
22005 -73327 -178643 48008 165067 -245159 39598 -89122 31207 -217047 114989 -19478 -118935
21994 -118935 26482 -176664 -246593 52808 -180389 -230371 -180385 -134188 74780 187195 -141869
21982 -22904 86505 -513408 266933 -34742 -419159 -149486 -36337 -195592 -177408 -225484 -25057
21970 -308137 -65358 163333 -13622 383905 163062 -384392 -85864 153424 343507 101835
21959 80709 -113576 192851 -122263 91306 -187370 -219814 -425417 39074 -207496 -156458
21949 -156458 -143221 -19357 -231488 -364408 -45495 -247626 -117018 -268242 -39391 21187
21938 -5931 29106 54712 -349107 -353570 4623 164799 66412 -174161 206349 -66494 -76057 81621
21925 -368186 -29378 13833 -145816 92050 -32600 -66898 24944 -59051 -200529 -318967 116357
21913 -101558 -211155 21772 -67529 105476 -27213 -313203 -199386 -136233 -2822 245676 80174
21901 62590 -181663 -204513 5462 -130068 168508 -146229 -122184 135185 23707 -25473 -101630
21890 -101630 -373305 -127306 -160173 -19714 117040 180066 -79803 -79703 193503 -238557 -302351
21879 -302351 -410114 -76807 40173 -50356 105430 66952 -113450 162127 -18128 -113251 -27513
21867 -233809 -48348 102481 64241 -368595 -420604 -33769 -141673 -159305 -82415 145954 21178
21855 280874 201497 -270829 -117202 -19498 -244971 29115 126568 35496 -258813 91857 -125283
21843 157755 -6524 -299260 -39276 17740 -88960 -215836 67790 68011 -156361 -311803 -67413
21831 -304118 -200193 62312 73732 194634 -113111 183116 -110307 -123124 -241925 -161952
21821 -161952 214835 -68875 182047 -142287 245683 114929 -130112 -6131 -74605 122935
21810 44366 306824 5954 -91776 -182672 -332782 111712 59096 -55573 61849 -4174 509452
21798 -37644 34306 -406722 -395986 -39989 -11077 -266337 302596 -12049 -206193 196340 121593
21787 121593 83525 57960 -145262 -151716 -69362 -99989 -292971 60343 -246765 147020 -58820
21775 -102556 -27135 50504 166506 -3758 163748 -158767 -259757 233705 93273 152976 84749
21764 84749 60096 -135368 34524 131936 225410 77115 181843 84836 259325 24364 -377913
21752 -202279 -60589 -125237 -123907 58683 -200533 -175901 258230 108420 -221395 -170930 -101001
21741 -101001 157112 223448 -30017 169077 81676 -220273 106535 -225110 203322 -206691
21730 -228890 -14674 284000 -94081 166521 213427 -2015 -333494 -263174 -178531 -199333 43975
21718 167996 76384 -164357 -161448 147042 18678 51965 160790 48191 234549 174706 140611
21707 140611 49486 -252132 -94463 -42981 369794 131753 -106345 180573 148613 198569
21697 198569 99885 -86114 -131634 228338 -60358 -107593 -303218 -84126 128572 49000 -63453
21685 69620 -16633 -133399 -7903 336765 76687 -145257 -317869 65010 31915 -61782 320509
21673 -228023 166041 70630 -108555 182561 -303641 -37819 -195597 -151001 56788 -97484
21662 14561 133327 -249225 -89515 -138545 130001 -32801 -2049 6445 -410424 -42944 34854
21650 555687 162847 -163188 274716 25068 -9833 -310527 -37612 -141217 -4286 -154678 118351
21638 -82503 -201382 -139812 -91050 -27623 -494344 157911 -167674 -201490 -15 138475 -79566
21626 -35164 -134632 -425446 -22965 -109580 -123027 -42210 -271524 -96869 -37038 -207698 -32069
21614 -240075 -98327 -6824 -575381 229353 -344718 -69130 19533 -24369 -288992 194522 256529
21603 256529 109014 3600 195905 146779 110784 29340 -29863 261016 -187970 62595 -218944
21591 -22885 -295506 -142646 -34982 -70196 109932 -133835 -176303 -317812 50041 -24757 -289361
21580 -289361 -86808 50237 74352 139397 163529 -239069 -10590 53045 -179785 222364 -107917
21568 -150861 62247 101564 -46579 -371951 310079 -103434 -315339 -106036 27451 -37505
21557 150978 134620 -252073 -195628 -118975 -127896 227472 220306 -49519 -184788 -319979 55797
21545 68079 -289740 -409861 46849 -258218 293937 218480 134637 131792 32139 -94601 167404
21533 -36316 -19344 -175061 -85924 -68277 45443 -92155 14849 -63767 18393 36326 298934
21522 298934 23751 9640 -200246 -187224 -70323 10053 254154 -33207 24034 132245 -201473
21510 -189458 -54933 158803 374466 -94642 -432733 142514 2549 64389 -58711 112716 330973
21499 330973 48446 219365 138484 -17973 -271427 197946 -245 34084 -141499 172371 108882
21488 108882 -191213 332492 3534 210795 21903 -243312 -132625 -203249 -27155 121345
21477 -39503 74218 -270812 -113934 -202929 -70459 -159130 -125522 -177706 -63258 -104553 -122931
21466 -122931 -28736 -93681 -219353 -108762 -65300 -191266 -101840 -228745 -120526 -296863
21456 -296863 423565 -226639 -199790 16877 -40261 -236880 220818 -125412 -432795 -9487
21445 -4041 214854 175919 72533 181344 77935 79694 76146 -21637 212862 12237 227803
21434 227803 328999 172618 -16326 151277 332576 353629 136102 60220 31478 -165672
21423 -229938 -20503 -70880 -238882 104343 109661 -76990 153185 -185157 -54851 -287474 59542
21411 3895 -199479 56012 -60440 -204050 -185694 -177800 165315 -198901 -380872 -150298 -2542
21399 -36507 194003 -53400 2128 -64499 -35407 348277 28424 121809 -18410 -132044 -203859
21388 -203859 -183441 -231142 90890 22923 -371593 102144 -193847 166552 329973 -220650
21377 123218 -137332 11346 -347471 -113207 30044 50909 78597 141195 -96185 -167119 212201
21365 -178429 -124037 -147206 -205884 294969 428226 -211488 -23200 -217821 -207274 -32730 -118556
21354 -118556 91980 38660 -147316 -220549 -282924 -95912 -252693 168436 150598 -54816 -37120
21343 -37120 365122 345059 -212038 -153770 -29453 -338299 81289 -81436 -245067 -196342 -219308
21332 -219308 -297617 -38171 -103513 262651 -235844 831 257625 -144467 -53120 152708 -317796
21320 -97392 -41842 158936 -160649 -20871 184992 -226302 -314093 125380 -134181 -173438
21310 -173438 117606 -226230 -11295 -109048 -223072 249413 158284 -135532 -242310 302295
21299 -189533 125247 219552 -130050 233920 46887 -187851 142596 -128865 -21621 -217124
21289 -217124 181694 54245 37442 -193883 -5844 -217443 29991 -214590 -242258 -43667 -153420
21278 -153420 16324 -112333 2832 75454 -173996 -332722 -77707 -103438 -285500 20955 6140
21266 -31463 231996 -136968 -296360 23073 -100432 -524792 -120909 -28475 127301 54023
21255 -139350 130373 -297891 -64836 10800 -34843 182087 196956 86523 -27115 -392771 -127235
21243 82816 -107437 -608436 -292387 100736 289938 -151912 -170607 -31380 -29778 45765 167509
21232 167509 -264704 171115 337748 -160107 81706 -103708 -6622 -119086 -196163 105549
21221 101311 6968 -69970 -112618 148509 68674 -132256 -85437 -43608 -328456 -131079 -68883
21210 -68883 128800 -87426 -121749 -176426 -342414 -306508 36056 260250 -376581 -244008 15252
21198 -275532 82132 -314460 -293300 -81374 -58411 -189201 90044 -35946 -251318 -67189 -39576
21187 -39576 76645 89181 -133787 253013 170496 62245 174338 132228 -152640 347822 -397976
21175 98991 -86200 -212436 -23118 -288019 119839 81795 49829 -68136 141724 -97645 192902
21163 -257726 -102470 13270 -21763 -153323 -33277 192243 427 -475258 -15302 45032 -14692
21151 -256897 -142565 169440 -131918 30338 34435 -185818 -23692 -63013 69537 19076 -252837
21139 -289573 -142905 -12605 -195284 -186626 30685 56808 -281785 -76073 75404 -244032 -36470
21127 -2220 -213981 5441 -118430 -46597 -219540 -105780 -83106 131046 -195200 -249276 -185851
21116 -185851 241464 -223859 78438 -62229 -185817 178556 259761 -274799 -220592 2283 232561
21105 232561 -266956 154357 -233864 -127217 361098 -503863 -143899 -263134 -141028 89932
21094 -107962 232842 -343321 -126593 -61648 -73399 95477 -257428 -7453 -298373 94104 -132502
21082 -3030 96656 93377 -51920 -134615 -353411 216673 -127223 3722 139485 -178825 54118
21070 -385299 98262 -463207 243916 -293313 -1131 -65574 -15388 97379 -270242 -9074 -235943
21059 -235943 4313 -309234 82171 -147696 11384 80364 14482 -60359 86075 115264 -462 -77661
21047 -77661 124277 29543 -31054 33550 116100 -126912 -372706 -173038 -156741 -193684 -420468
21036 -420468 -106857 143062 -92807 57437 -10178 -133774 59362 55815 -151196 116005 -96851
21024 14516 8846 -306174 -56083 -46189 309009 12742 -31422 -337531 360375 -345143 -395090
21013 -395090 -77627 -58537 -118673 -195857 -25866 95983 242287 253609 13734 -356430 223067
21001 -40425 -316965 -202111 110194 203920 -137576 -21566 15565 -97369 -147047 -4692 752031
20989 281283 -188867 34450 -144405 -206213 -309150 -174108 277347 -110333 -206535 147167
20978 -155666 -204014 68449 101832 28288 -367590 -254918 33149 -67062 -347851 -42598 -21071
20966 -285001 99010 -338083 -74420 -272705 98595 -7078 -221665 46435 -112258 -166273 445026
20954 -61205 9671 265361 -94618 -342139 -221737 -98115 -64322 -222131 7967 59712 1927
20942 -193837 -123409 -197523 -168246 72014 174349 -93930 192313 286668 220550 -149225 -117164
20931 -117164 -182761 214150 -100033 -142529 159936 -8095 43518 -40428 313 -57914 -29592
20920 -29592 787 -181876 7997 -19429 -158061 -26158 -13135 20117 -205969 122746 13123
20908 208534 -139847 -55593 -42230 -377225 -84360 -83991 365316 -58435 -87746 9772 -69139
20896 -102079 -59807 -223832 -73428 96194 23813 -130339 -7869 -93752 120452 -70494 -242851
20885 -242851 -38530 74073 72492 67312 -431950 -74311 -20521 -2551 -281690 -56425 -109 103216
20872 139610 40145 5635 180064 -254869 -108110 115794 -115864 117898 82452 -539 -141294
20861 -141294 -410825 131413 12523 -79892 3887 -266099 145423 34616 61833 98267 -36923
20849 -226203 88995 -205216 -264015 178292 -29751 71758 265008 -161388 -177281 -175857 -42993
20837 -194662 35741 260042 -133972 -290324 -256403 -98252 51067 -20469 172539 -128231
20826 -101783 -126098 10076 -39965 286924 -140498 -57893 -17735 -81811 -87571 -73753 -270857
20815 -270857 -83638 -287920 26459 95452 150459 165803 223265 133587 155526 87594 -101168
20803 -178104 -38515 -296882 -136286 -320428 -221174 40414 210202 261365 -65317 171242
20792 -212768 -215593 -63472 -96610 -111094 -109240 -135235 -50370 -171656 -219804 -53849 168632
20780 -145851 -96874 23364 -115447 -50351 76123 -259503 -54256 -198820 -375060 -208052
20770 -208052 -181000 -122497 285097 -137075 101081 94652 250436 -124941 -51461 -46426 -150424
20759 -150424 -116369 14157 -19108 -467235 -50812 148108 42203 243284 33331 -24700 25439
20747 -488703 -217920 125033 -179340 -230268 -201449 2781 -39167 -194972 -399030 -146709
20736 -249049 204702 -392603 -202781 48467 -144579 -271386 170862 -99763 -137989 111366
20725 43651 58973 28787 -181869 148788 -92568 30859 -133349 -147596 136610 -280694 132475
20713 173852 61881 12022 276771 322488 -193760 -113687 -219333 -30133 257087 -192308
20702 -11418 -25899 149591 -85098 -325078 -235077 -191387 62198 104589 -15722 -238621 -179396
20691 -179396 60314 2215 -133500 66035 -83875 102323 -184653 -85870 -97104 -92345 190241
20679 -439347 -90986 25368 103977 -1348 -362733 -42265 -176047 85859 -299084 -241788 -177014
20668 -177014 -288112 77591 160767 216541 -95794 570520 -164038 -94162 34980 -277400 -157182
20657 -157182 291081 -18537 -146029 39352 -91423 -51049 91667 72821 48270 -176392 -392368
20646 -392368 -169922 -26005 113733 80457 -107833 -42464 57276 39240 -121139 -216210 -67023
20634 -345059 -68590 -17486 115829 -253545 -83954 90511 -77643 152811 34944 -93322 -276536
20623 -276536 -343523 -4504 -144866 58858 -10812 56329 18370 -119637 22485 101372 79709
20612 79709 -513463 -173216 127295 -355575 -81205 -171947 -6912 -362229 186968 -239933
20601 17457 76164 -259962 -402721 -186214 88707 -115537 -233095 -66092 89755 7576 -157600
20589 227117 30567 12419 69661 328527 115624 -152334 -5795 204623 116378 192923 207898
20578 207898 162067 41125 -93478 -221696 203086 170516 145789 -109391 104474 111506 -405938
20566 270907 -120056 84049 -147943 -90324 -348478 193242 -29506 121477 -92775 -215249
20556 -215249 46337 321145 -285206 44848 -186497 253819 -94954 15045 33755 -109409
20545 -174611 274454 -334365 44224 -357307 273142 19514 -337324 -68817 -450863 148892
20534 -177748 20342 9271 -230631 -44865 148022 -127649 -229625 -598652 -81245 -14952 -265723
20523 -265723 -64831 -58216 -156702 -284904 -267693 167766 -184983 -231386 -353911 83031 -5540
20511 -170192 95008 166007 47061 44486 27843 -271927 82801 -83929 240343 441604 14502
20499 12833 -176583 134539 -94816 44360 138527 32252 68577 -277078 -154762 -144788 30816
20487 -419515 -150385 -254843 246082 -169914 290676 177457 -213440 -267808 103398 113260
20477 113260 -218800 261369 -49863 -38987 -80657 -14127 -54194 -198027 155368 -17014 182020
20465 120910 -237301 -282491 22638 -104443 98742 162481 124249 103957 138505 -158970 -95757
20454 -95757 -10379 -28279 108960 202381 -151710 -42019 -297559 -95942 -202877 -181856 -8270
20442 -134702 178765 260882 -126913 209805 19644 -172501 159225 316390 -148722 -139596
20432 -139596 -216147 -245992 -484598 -141322 92375 -128659 -171584 -107295 -43305 189002 -47302
20420 -321101 115000 -270988 119375 -93874 -119145 -7205 -183592 286454 -386428 -35556
20409 64008 4469 97891 155133 -94955 24801 -282777 111656 -165147 -162538 99248 44662
20397 190333 110941 -170764 -20500 -118503 82935 -232578 203978 -99121 53712 120591 5386
20385 -104753 207000 -252480 -365267 -235563 -107556 36149 -108800 -209767 262308 130380
20374 -286894 -144134 -281790 -332007 -31124 -36317 -63152 -122670 64758 -14442 74203 166098
20363 166098 -482529 311750 -424145 -56561 -253572 -19395 33366 180413 -191034 71783
20352 12802 -114461 -168440 -357185 -28197 86006 -389719 -189158 119508 -197792 -339119
20342 -339119 -86264 -187547 71807 78949 20496 66854 -8745 121976 118657 14083 609 -152101
20329 -19209 -308635 261804 -268956 -38109 -10026 -273062 -109843 -240298 -281516 -112046
20318 139546 -583678 -147285 274774 -191198 -105061 -501826 -172531 198675 -92952 29789
20307 30549 -411611 -135644 -47279 -18146 -21816 -63289 -257023 -105155 -87399 -104231 -50345
20295 -235604 -182881 23181 -314958 -474750 -200378 203852 -375636 128987 -265725 -142581
20285 -142581 -241858 45278 -64081 97609 219965 397806 -23169 -343563 67641 -96659 -306784
20274 -306784 -122065 -10954 -18842 155905 -17136 34066 -160407 26185 50575 -44221 -227076
20263 -227076 74196 -264539 -47733 174934 207021 120182 -399433 -154542 51737 177208
20253 177208 45620 -24844 -82321 -295730 111545 -138960 -26682 473670 120163 -141552
20242 -196487 -114922 81257 384912 -132830 -146085 -230913 -114118 -186319 -120687 369927 -286146
20230 -119272 -69313 1347 -137219 28584 136446 58341 -100227 -85350 -209493 81714 -283220
20218 -356460 -66234 -264562 -61523 -151348 107925 118528 -190811 -196462 -89898 8100 -323758
20206 141785 -138775 -181437 -129773 -340033 -95717 157663 -210654 -212046 -117995 -30052 340915
20194 139722 -65626 104853 -115028 -92773 288567 -205626 -238367 110178 71057 -290957
20183 3936 -176842 100397 -248927 -263247 -115526 -36845 -151441 41169 12765 -191371 -134764
20172 -134764 -9692 -128014 -260270 5022 -44194 -139516 4768 76768 -251665 -134953 -82965
20161 -82965 -195847 -98713 -116475 -200542 -265530 -212316 150104 -68720 99079 300578 155008
20150 155008 -16305 -129527 114304 -142143 86504 -70352 -188523 -399862 165739 -467800
20139 1524 36077 -263122 -238148 -248873 -296178 208868 -7152 158093 -70582 110826 87224
20128 87224 -15958 -108082 -80156 -147863 -462673 -14711 -127917 -131114 -267254 -186759 -97167
20117 -97167 -284177 -132927 -205533 14378 -39261 307152 -27579 -371014 172095 -108406
20106 92629 -223495 -183349 -15400 -106084 -437726 -605135 123632 243140 -32043 -34937 160415
20094 -9510 -10918 120320 122264 66756 47408 121162 36535 -50297 -187784 -230931 186545 248517
20082 248517 -87750 92237 5952 161198 -191775 -199516 -171701 142544 317619 28385 -1494
20070 -16227 -116496 -173568 186542 -307982 230528 285668 32609 -82155 43552 -101227 65860
20058 -86195 -200330 -117810 -51105 147018 -87673 -232141 -36546 -154720 -1421 151624 -97158
20046 137715 -149933 -392532 -110254 -163192 -209513 -189457 217215 -255541 29553 -219695
20035 303454 156621 67572 -397508 -65656 -343846 -154767 -394555 226175 84219 -207616
20024 257876 -186806 -49168 -166338 -432523 -506619 -41443 373457 -139414 -160193 -46885
20013 -252666 148042 20253 -401780 -102772 -10165 -196117 303420 -58665 -128051 -78091
20003 -78091 165568 111940 -233325 -148619 254969 -154618 -91647 -22974 4655 132712 46993
19991 -205080 -51440 -340222 -89537 -200767 -15916 -5966 -187060 -163721 292910 -58019 -87091
19980 -87091 -116255 74886 -201461 189906 -255477 -112225 -205038 64719 -5333 2572 -164053
19968 -95058 277064 -100308 129681 -580794 -110294 -314767 14267 -103682 -80802 126764
19957 74679 7781 -193692 140739 -207834 -122934 130766 214767 26572 -598331 -147798 17984
19945 400437 149252 -102435 9848 129660 -52676 44285 -228277 -139101 304566 -275566
19934 -237499 -128959 -254362 -103252 -6816 -311018 -117416 -127398 -162000 211527 -125819
19923 -10839 -148384 -220962 -6650 -68066 -216350 -52994 35213 -105928 -243812 -276360 11275
19911 -194476 104125 -181892 211224 -322739 175622 -29718 -58602 -6318 -251226 -43584
19900 28790 -96059 -182337 -128190 -277364 -289427 -11733 -201351 -313695 -137663 -590499 60598
19888 40984 127454 173508 324066 -198403 -120064 -374313 151970 -217735 -170565 -275682
19878 -275682 -59593 -144778 -13982 -468316 -447229 -41036 89017 9023 126934 -46746 -1470
19866 -123951 -51949 -158955 -48010 -194901 -407095 187772 -141006 37596 -83674 27890
19855 -52935 -184321 -150288 95928 7559 16440 351183 136396 -252412 -272516 -292448 -97282
19843 -473671 -85342 15310 -43536 228066 17642 -50039 115123 47083 -45093 -191864 -192585
19832 -192585 -328502 -104765 221607 -40715 -206310 -244839 55353 80260 419856 96236
19821 275886 57368 72158 -26469 -260459 304403 -118009 -130514 -326843 235222 39847
19810 118354 322241 -160057 52233 -104498 44078 80987 -75054 -186582 192749 -165116
19799 97737 -167712 296587 -243419 35746 -339719 27528 94646 -40197 -60583 -62727 87938
19787 5109 14553 -133109 -209314 -276220 -187373 14213 -119769 -102310 -188088 -110847 145865
19775 -177694 -138818 -276081 92370 -29858 -108129 152721 176296 -85032 110449 120012 -222315
19763 181190 -321542 149959 -48414 -33122 -154560 -130039 131276 158519 -108039 169724
19752 -448649 92413 195731 52675 118345 -128408 158489 -366172 -123572 28258 -103232
19741 -332183 -175998 -85694 -403224 -431994 69133 -138550 71346 -55249 -201864 -163985 3594
19729 -277504 44644 -193324 -138952 -32471 -69783 -83102 95421 200581 201914 279573 -149570
19717 -544854 290547 -100116 103374 -232805 62097 -37913 -381601 98338 -154834 -34860
19706 157781 -415640 -5789 -156351 152378 -102538 -24381 212774 123777 -409758 -167547
19695 -7599 186492 177867 -93533 -23070 -417629 -175360 -56900 -162712 174766 -163151 26363
19683 25853 -126868 -269297 -277059 155543 -315952 -118401 -2921 125970 -434219 -247917
19673 -247917 104881 -274688 -126234 -91591 -103298 16955 -110931 82603 -94154 142632
19662 93866 -99692 -206146 7989 18235 -193793 -16479 128308 -26391 -290268 -112377 -89366
19651 -89366 -290077 -125390 -287113 -65579 65304 310113 -358347 -46402 -54145 -345465 -213349
19640 -213349 -126464 99103 -156702 195144 -254078 -132868 -443220 -90204 -233996 -169221
19630 -169221 -35959 6093 -385911 21284 114456 -65590 -201611 203342 -115368 -231104 47710
19618 200877 -87916 112312 -114710 -156644 280714 116198 -159523 -301870 15959 7145
19607 -138052 -182198 39449 26007 125233 -21644 -21673 -206680 31534 -220824 -313730 -142518
19595 -280317 299348 -155782 -265017 76166 133383 -18662 -201011 135853 -92633 27194
19584 88575 -29808 -44258 -117299 104026 -67508 -438331 41559 -238499 -329420 -11570 238442
19572 -58029 9973 -183770 -294403 23745 -194515 -148800 -129462 -65506 132397 -57692 299189
19560 -134681 194330 -317636 -113354 -77848 -50552 131024 -304623 -278875 -253523 -121165
19549 -112382 -149048 -174520 115080 143753 -77410 -12577 -233829 58324 -164010 28719 237554
19538 237554 -135744 -349575 -258408 -138333 84020 -153357 106624 -286813 -163413 -335239
19528 -335239 109283 35897 -132588 -36029 -213254 -197265 -176360 215265 -184528 7555 26759
19517 26759 -473811 -248286 -344740 2924 297383 -114564 -70794 -373781 -160239 -217284 70899
19505 354119 -171442 343985 -6447 -11281 -284074 -120573 131849 -97416 168981 -133211
19494 -72786 174784 -153802 -184861 -140388 -3727 -28529 -621833 -66944 -152438 -229604 -102518
19482 -122838 111075 -21845 -14251 -189244 -8229 167578 -6213 -340694 -76286 158009 119725
19471 119725 -205469 -128412 -242895 -200688 -259350 -71429 94432 82892 -218825 137869 -11904
19459 -41732 -107647 -106945 112336 -25232 11114 406705 163636 196909 136951 -286229 94091
19447 -71111 294377 5829 -61380 -64210 -344816 -212684 -51432 3913 -23174 -43005 72088 133246
19435 133246 -170524 164942 -89226 332246 -29952 191065 221968 75659 146879 227504 73772
19423 212583 123262 108427 161983 78538 -5999 -190161 2967 -26266 390975 -259660 -93046
19411 -2064 79076 76604 204514 -578532 -141557 32994 204107 -7083 -301835 -288523 -435649
19400 -435649 -173808 -91306 -223670 -168143 -69949 -82637 -147708 20707 -47771 -138056 7501
19388 -189285 -78118 -117244 139162 -168921 43072 -58872 -509698 36606 -341925 -18833 -19189
19377 -19189 -56257 -190228 412631 -134558 -81986 -66808 -274071 61590 -71496 -12882 166467
19365 -52579 56300 -41362 -240663 145198 -452592 327349 -245587 209936 -163811 -10058
19354 -71203 23901 74853 170345 -230168 222715 -210672 -113847 106837 -98078 -293972 -28530
19342 -174246 -373698 -156672 -281896 250420 140947 -84496 -48936 121993 66807 -79961
19331 -199288 -317489 -145660 -35567 139884 171844 -28944 -72641 -299011 -66631 -107388 20771
19319 -122375 -251088 -289496 -111124 -137494 -110744 -341322 48571 -270375 -41279 5601 -195537
19307 64585 22767 -231975 -197354 9304 39052 -437060 191935 83678 27721 197078 -277460
19295 -173531 -320258 147344 -609022 177172 37811 18300 163279 -22811 -14298 -28904 -53715
19284 -53715 -2869 99154 -343770 -150610 -116081 -141665 -214954 -145497 202517 113079 -520889
19272 -134562 -186135 299481 69690 -140396 -92710 -115543 62075 54166 -243728 -151598 9046
19260 -96968 285319 166972 -418546 -213503 50022 -175106 -310425 47502 -180228 278450
19249 8007 -220779 24891 281192 -201848 68994 29597 -86954 -15821 296196 167713 -213539
19237 -1983 -164794 36537 -198357 -264484 -159371 199188 -257598 -447703 -79905 -346612
19227 -346612 -502884 -226235 108359 -84041 -343553 -68172 221345 12808 151180 209048
19217 209048 231628 107148 249147 10737 -344936 -199453 -140281 74518 220558 -280070
19206 226251 -14011 45009 -33299 -211565 -352613 -87656 -88211 14300 -241425 -171411 -447191
19195 -447191 -16181 -250582 314245 -166819 201728 -313694 111419 -143173 377933 132091
19184 222808 40925 -255571 10121 -15766 30594 -39924 191174 -128306 -102961 96863 -7055
19172 4255 30509 -179239 -246972 -178823 -60340 -344676 82653 -97245 -83686 152686 -312044
19160 -196866 -906 86840 66821 -270026 176350 101591 -108139 -327310 -53422 131666 -275168
19148 -4331 -7170 402074 209167 -432007 233458 46888 -60174 -213550 88418 150825 166849
19137 166849 -58619 24750 -46707 -131060 -47266 37630 -238334 50751 -227131 60784 121820
19126 121820 160251 11457 -69905 749 23593 -106383 -112943 -79497 113124 -33940 -181748
19115 -181748 -186288 -242313 106703 -80872 55098 -264835 -191284 91382 -124601 -16992 -310207
19104 -310207 -165430 18469 -28483 -279233 143771 -563 -147222 -259037 142932 -353691
19093 -45168 129930 174182 72870 -34526 37589 15060 -144400 16985 -208916 -311312 -303704
19082 -303704 28630 -236821 19706 -219856 -450485 171827 -122048 -87122 -151335 225808
19071 64462 34420 -189354 80765 18602 5777 -244167 -79795 8599 33044 36895 -166046 56260
19058 -315984 -157964 248357 -152312 -46267 11528 15620 -220475 -174286 -193725 259550 -324172
19046 163941 -23996 208785 -42534 62277 -108699 262700 206974 -40956 -137613 -196927 70896
19034 -211190 -93157 -181121 167766 95746 234448 -46604 301075 100585 204747 250102
19024 250102 -217884 218406 -177123 79041 220856 -2586 -103082 202563 -279136 162315
19013 137225 -285582 -20622 43181 71329 -71540 -84554 453383 -233110 109891 -160986
19002 3684 39668 -119677 -23915 303360 -267749 50896 -149271 83322 -303545 -281703 -155613
18991 -155613 -243172 -173319 248152 -177620 -213257 -189421 -451793 13634 109031 246298 -149187
18979 -35703 -29219 -281827 -272560 -96213 -230116 -68399 -311040 -102865 47736 -318026 228712
18967 231700 32223 123927 -67616 -552558 -48195 7476 -188733 -75675 321428 -181203 58316
18955 -180680 -160447 -139424 145038 143317 -48810 122082 -231074 -273911 6617 -516120 103433
18943 162339 115394 -243433 231926 336798 76863 -33380 -128421 -144911 -151249 -254563 14781
18931 -357694 102038 344304 44468 166081 117119 213611 -172979 -338204 -67874 -93081
18921 -93081 24139 -64034 -157048 -338886 -217201 -123033 153649 -2056 294383 -73878 108563
18909 -123226 120410 -83972 261980 218365 -162705 134987 57074 -60282 51201 -108449
18898 39792 22752 -58402 -184410 164253 172424 34157 21038 -415114 58225 -2560 -104707
18887 -104707 156601 116327 -248390 -80040 55873 -59198 -35542 306601 -387207 -308963 -93526
18875 64045 -276757 -129132 -100924 57061 195746 -151079 15968 341673 -81617 -92120 -8850
18863 211370 236277 -302991 -215505 -7635 -195093 -20201 -201140 -5146 -80942 256067 418915
18852 418915 -166459 -39724 114362 41469 -101723 20473 -147137 -170322 -48256 192619
18841 113679 -111241 24915 18873 181420 -216370 68070 -211421 129596 113989 60608 -26920
18829 -281721 10916 187650 -110050 207560 280144 -67360 -34163 23796 166862 408146
18819 408146 -134926 -135062 247220 -116928 -30420 84626 -11942 -7926 24094 -413167 90717
18807 292629 81864 132436 -314382 -207671 -435446 -55115 -239644 -207642 -197692 68462 -124604
18795 -126891 -10450 -256376 -111617 -150202 321487 -12769 -20765 -218812 18201 78712 -60109
18783 -302084 14066 17953 -16402 203645 -99228 -241443 180640 -11770 100897 -406809 94227
18771 -47763 -54090 -316409 -228465 -132702 -158385 -68838 83170 181451 21210 -118186 140219
18759 -116321 -249739 116058 128264 -191203 -192426 -86897 110005 -237988 -89027 -40589 -216554
18748 -216554 -90340 -195541 47399 30865 -155880 -274054 -9925 49668 834 -64487 -416297
18737 -416297 -217620 78493 -74099 183638 114784 329649 155958 67630 -67992 -352745
18727 -352745 -59159 242317 -202597 -206265 -245434 -16272 50322 -101480 -249493 96561 92078
18716 92078 132379 92618 -130609 5036 21185 -67285 -52212 -173674 -155220 -42749 -265078
18705 -265078 -103085 370656 -132253 -75322 130207 253442 -244464 163816 -95161 -235659
18695 -235659 -162714 181997 -149350 -113217 -244735 8459 -62535 -229970 -322785 96447 -119912
18683 124665 136167 73068 -197862 -8826 -271768 -267587 -252315 166808 70213 149824 170891
18672 170891 206234 -123595 9371 21031 201446 -157697 -50034 47724 -213739 -137240 -151037
18661 -151037 36128 68477 93144 -214699 -131723 -24072 -161638 65430 258999 166482 -235712
18649 -19444 -103708 178091 -228015 -260436 -401471 93396 -69415 -126909 55064 87480 4313
18637 28482 -107341 980 103647 -122205 -64507 -24969 -178455 -196870 -176363 -306277 -398947
18626 -398947 39368 -452663 -138651 -270920 112290 35501 -278930 22717 -49538 140310
18615 295011 -314777 -30531 -90578 211450 168400 -351883 -50603 127592 -330849 -102177
18604 -180531 60467 -80685 -19842 -257126 -141360 -26367 -20517 249822 175258 48050 -40234
18592 -405835 -22586 -498462 155585 -135156 -189022 -81730 142253 -10800 9360 -149708 -48247
18580 82019 -128638 29021 -33636 -60020 25772 165948 -424593 -160555 82835 206937 -116640
18568 -162436 -193495 99131 39747 43454 -199179 -24832 -188925 -64487 -80190 -207964 242512
18556 -58127 -255324 7698 -51593 58588 -111055 -155082 130747 292735 56752 -94914 -30354
18544 -244562 -169216 -22024 49267 -121851 -222520 -57181 -84150 -108744 -157193 276785 -15135
18532 71245 -128245 -126056 333191 306473 -203986 -168496 -196791 -212783 -109075 -216675 -539532
18521 -539532 -145533 -212807 -40722 -238924 24150 -135457 104648 -246155 95073 -119948
18510 178549 -82900 -99623 89920 -242995 -193221 -179196 32459 -98690 108779 9024 -206454
18498 -127464 -343274 1694 50830 -168249 -63614 57775 -127828 -3382 75238 257126 21017
18486 -145531 60399 142074 -301888 249528 233743 -218072 -141981 -340462 170778 -87666
18475 -194608 114729 -162538 166181 -40186 163056 121494 -76549 -113584 84157 60488 180352
18464 180352 -225696 310129 -185284 63184 20101 -133885 66252 -171030 -34061 -23457
18454 -23457 11239 -237812 -22082 -324840 -235577 -125593 -36296 386521 -264294 323319
18443 -262416 -252598 233615 -375355 9780 37399 -400117 -21022 -79352 -161011 -314209 101616
18431 14427 -172065 291398 -83016 135373 196162 -187526 -52210 186372 79419 -268117
18420 -168122 36000 50015 71836 -159937 15262 -80012 -56182 -147771 -101447 -125403 27772
18408 -80369 -41509 153299 64560 163820 281591 198546 -24127 268 148531 74117 -76552
18396 -279774 -149899 265362 -75750 -179253 -173269 53965 85269 -80172 -66728 92017 -18247
18384 -219941 -208844 -293508 -300765 -67189 -457416 -238591 47531 -321830 -176054 -54377 -379791
18373 -379791 63913 48710 4756 -362750 136617 -124515 -75514 -38966 214047 134476 -235227
18361 360261 -96344 -441775 -179702 83661 -332420 85513 340258 15576 220126 -78094
18350 58218 -37898 147958 -301493 -89215 -70109 7690 -88053 191502 -29037 -284322 -123620
18338 -237447 181899 328691 135232 -231674 -216989 -65464 -443200 -18046 -160217 -492341
18328 -492341 -142748 178632 20617 -272106 -217651 303340 -184792 104528 -94108 -55861
18318 -55861 -146649 8078 21491 103259 -131241 -219743 17228 -246079 -137671 -100902 -49224
18306 -174064 167932 19142 309115 -116802 -165095 112898 -31437 -241994 -34678 -104258
18296 -104258 292272 54805 44131 81208 -205152 -104303 -14509 23902 28007 -275973 -487452
18285 -487452 30503 -94845 6673 -300074 -192037 56091 302664 -83518 61927 11298 94627
18274 94627 -340732 -24417 49340 92418 -19105 -58336 203368 -333961 -79670 -271773 -175392
18263 -175392 59121 -99983 32508 -84492 -43553 26276 32448 46584 59918 173959 -971 210550
18250 45469 186418 97853 -227588 -166584 478091 -177400 -449488 76739 159851 85440 -175686
18238 -200418 -48878 -7633 33436 -55633 129317 34879 -289796 238002 -12526 161786 175743
18227 175743 -206209 -10174 9473 -29123 24912 -178129 -397558 -48321 -79783 273405 -79298
18215 -216919 201977 48956 -197130 228480 -62051 16393 445114 -95577 -30174 87823 330222
18204 330222 -182529 154450 -33288 -13834 276366 -62667 -240721 -155069 -33570 -40249 179789
18192 -489121 -205526 45814 198717 -252708 42040 -137956 26492 -77156 -94640 -226668
18182 -226668 196125 237338 33631 -36310 48966 -131732 255155 -11150 326786 183888
18172 183888 217590 -281078 -35118 189906 -154876 -43011 -230211 -34392 58971 177561
18162 177561 30773 -30710 208413 -107696 -180830 -373023 93946 136574 -303188 34680 105751
18151 105751 -32437 158807 154126 58266 196713 -109314 -54642 31351 27549 33335 113935
18140 113935 -109966 70137 237477 -142548 20151 -269870 -222591 -396967 162929 -36031
18129 -143254 -175490 118537 -340370 -279714 -55849 -63710 -19642 -111384 -49395 240011 149966
18118 149966 -367670 -217900 137220 78195 -314846 -326979 58300 110986 254810 73691
18107 4927 -48381 -130489 -197300 -201794 72371 -88626 328798 -112198 49635 -70082 -298361
18096 -298361 180550 31944 48863 255918 -106985 11873 -10979 -297962 73047 -504463
18085 -349546 -92172 37309 -141030 -302718 -105606 208319 95437 -157948 214164 105930
18074 -105270 165445 -78256 -74060 88275 -19055 -171109 -11162 -311005 92706 -55576 51398
18062 -100749 -150688 -43376 912 77492 50948 -246272 -354331 141635 197733 203147 -428941
18050 79310 -64467 189951 -201609 19861 -420591 -144019 94548 -223359 325980 -33181
18039 -223546 -226150 -173511 296738 243726 285529 69209 -3476 -240726 -313865 -200845 60297
18027 -415719 -150020 -330678 73063 -121067 87791 62482 32447 -149041 -87133 16178 110581
18016 110581 -109541 8456 -142653 -268477 197562 -96827 106075 -260778 -126034 136549
18005 -126093 -19074 -120549 52078 320694 225924 -330606 -32774 86392 -74251 -177091 47869
17993 221205 -61703 -119045 160457 -96064 -83953 -80800 26330 -150320 -255085 -308335 36017
17981 113378 -58964 286097 78603 143232 -192014 -12740 54033 108836 -35520 -150247 -48657
17969 -309227 -224834 49480 -126651 -267117 -250209 34222 384436 -84082 -204688 199625
17958 -35240 92819 -184012 -59578 13514 -89447 -262675 173484 219759 -287086 155798 -268596
17946 72523 24338 -323895 -71999 -46096 119751 -136744 -140075 166357 67847 -65584 45164
17934 -285582 128111 189210 -172707 -160531 41393 84804 65589 -224059 129485 -135866
17923 61062 -164985 -95089 -46927 -116767 81666 -315818 -52460 218998 40228 60056 -338377
17911 -137458 249863 -253469 71283 -154623 80129 195370 64358 87404 -163873 -191419
17901 -191419 -212546 380693 -5035 -191671 -418 -397453 71334 178704 28710 98553 -92898
17889 226561 -3098 195241 -115884 -1329 -27478 98917 105181 235437 171775 -170163 -202747
17878 -202747 320320 7069 59961 159501 15808 21664 -2463 -195397 319499 -169548 133607
17866 6301 -178468 333618 125258 -22561 181091 -4734 -157817 281277 88617 281947 280688
17855 280688 54816 6615 -163502 -102501 70956 105799 -82378 256619 5903 -255350 -284845
17844 -284845 -29885 -181003 231135 -13353 -127363 23584 156183 271836 -32796 76736
17833 -276319 124046 56557 -100347 -146313 160805 63009 -269422 401247 245915 -572400
17822 -46426 -224011 -49795 171754 -243320 -207615 -189981 121195 520385 -150108 -189071
17812 -189071 -59980 -53913 -157862 -112583 7782 55488 -477577 -260057 -121665 -184967 -119806
17801 -119806 -64661 -88555 68970 77171 155405 18025 66664 122608 -166458 315892 -87132
17789 -125932 -142142 68662 -19572 29165 36291 186129 531063 123136 85370 -351101 180309
17777 -186903 -44757 29697 -228295 -52491 248151 106529 229706 -139253 -25484 52981
17766 114432 10569 119599 277512 8485 -102534 184325 -108254 517393 -211536 -143106
17756 -143106 -199066 -98169 19806 112915 70665 124767 -58859 -100060 17996 -58566 -251156
17745 -251156 -89010 90194 -13155 243637 75770 -39966 -150359 -280734 -109679 -10817 66595
17733 -201297 -104536 -271663 7025 -24579 85812 -535868 253231 262839 273758 -9356 -52285
17722 -52285 155074 -217611 283417 -68601 -410264 71856 56813 190446 -134520 -155926
17712 -155926 18740 -63153 96642 -171909 -24910 106190 -207460 -96600 109793 49333 30601
17701 30601 27744 -560681 209757 223940 119053 348276 -83702 296678 -106154 -69653 -184335
17690 -184335 -128948 30574 202052 35564 57102 -150018 -187286 -102354 -74555 92361 202848
17679 202848 -150525 1439 -248792 -18558 122712 88977 -60973 242366 -269077 86719 -35178
17667 -57834 -62831 48383 223319 206119 255383 211021 -43 167483 332375 -67500 -147982 1951
17654 -417195 -167890 286328 -110158 -17455 155981 96893 218798 433060 -205462 -232946
17644 -232946 55031 -58545 86960 136474 -95483 44051 105071 1681 107908 306967 -34584
17632 -160894 106930 131753 118822 326074 -14955 67425 71872 94003 251482 -63058 32653
17620 390183 180958 -136556 101020 245754 355835 -111114 18911 -46308 16939 -68745
17609 54316 -64814 128290 -321844 234600 -44179 412281 -213775 43044 67860 138372 483070
17598 483070 -471712 -235028 -64252 -197771 267255 -284630 -30544 -30195 -175162 -115218 71188
17586 -30448 -154423 23527 65120 -428790 285562 -177940 -9203 -1928 139120 -85285 101108
17574 228580 315231 -9199 116545 59475 22200 179745 -176406 31040 7656 248654 217327
17563 217327 -180183 -115190 -68351 44747 309193 -5421 420104 227095 484274 391477 44482
17551 249487 49002 -359218 -222016 41696 222577 -106322 60713 107205 310596 -98377
17540 183582 -161564 -76387 313012 175771 47193 48477 -34833 47653 126032 -32554 35636
17528 15813 312063 -163983 85615 170570 -121438 72097 79938 338787 -144210 63782 -143348
17516 -134529 -96954 -148281 107751 172212 -79898 246419 -223284 -55198 129652 210987 -92068
17504 -1976 261434 297674 185906 -70022 97841 242969 282513 200621 -31945 15583 -156189
17492 106209 260989 39915 199249 6036 236377 110543 -298856 245676 266658 -197846
17481 180022 33231 236141 205971 175257 282535 331561 69525 210345 282160 164424 259736
17470 259736 292412 -286908 325512 6928 504222 500897 354802 114690 108931 551062 62213
17458 215425 -14255 343898 7759 269343 156007 320314 -46516 296102 320414 -5488 345642
17446 250092 50552 526139 159767 228297 111787 255830 16641 231292 627380 -51811
17435 276795 279910 435025 176237 -17636 48494 494513 394165 135630 125353 464794
17425 464794 336494 201895 434127 114399 42249 185841 41826 73190 159379 512452
17415 512452 370082 394239 -40936 177192 195975 173284 219556 29828 404462 97869 277163
17404 277163 453512 140277 302701 100848 201143 -145083 223278 264583 -5714 -57197
17394 -57197 181593 463331 207970 227453 99627 111514 -99977 36608 42862 368922 159711
17382 -114157 518334 80497 -68224 -102941 -153272 429932 31594 214249 28951 -3548 134872
17370 243468 262058 249877 871583 338572 145255 322509 -167787 -142580 -227857 19969
17359 52960 119185 106603 146302 158454 87101 138730 134007 31983 157272 360145 78018
17347 254269 288450 62603 -77674 224076 58014 332022 203374 295677 101689 156020 158520
17336 158520 177583 -453 257462 286004 148529 270637 -28393 71117 -119519 65577 75419
17325 75419 -56522 431320 249158 142723 128775 -89340 -107939 -76645 378622 94780 73609
17314 73609 46725 41126 314318 55163 -36549 -132415 315649 76575 35992 215928 120152
17303 120152 73198 -152129 110488 61876 490720 73588 6923 270468 60788 202525 32313
17291 -304989 22197 416555 304146 251535 50507 39287 25539 242453 -286264 -100196
17280 147784 132782 534302 258960 598832 353183 107254 -212840 395924 101881 258099
17270 258099 42345 256499 -73043 110275 317935 -87092 294545 190959 475862 -159257
17259 37756 -164985 130605 384702 60098 273842 293176 -21637 339827 392512 26857 -36947
17247 285987 341040 -216756 113372 -151184 298109 8809 72093 431087 473533 283973
17237 283973 515312 197148 -118735 353815 246642 156580 92768 13100 14884 492869
17227 492869 486059 313087 86765 166011 326737 145857 118645 -58681 263570 -12660 95653
17215 61110 252511 -34220 23289 197036 810956 481389 169014 394313 -52235 200935
17204 -62373 72136 209668 280856 478328 252567 194308 78989 652739 -19209 425057 93311
17192 356315 157310 383089 35832 150418 148511 84213 -8264 171401 490746 24639 218986
17181 218986 244935 17410 505996 275171 248795 111310 146622 494942 349816 -64867
17170 61119 664877 363832 168629 450279 -74831 63350 123249 255954 247188 403022 423425
17159 423425 345677 102850 331639 382682 -73934 491088 517442 481220 296171 355183 40652
17147 396146 106010 103698 217933 104586 -87227 193724 175936 527793 178595 160010
17137 160010 477561 374475 67477 106382 395933 382993 329632 201056 57454 184832
17127 184832 49605 423348 405680 96749 77314 31462 546412 200099 283282 202274 497099
17116 497099 339068 133750 554615 153308 196030 162982 468772 -106169 504877 426225
17106 426225 370554 515197 159322 583222 453035 106941 131787 278094 76540 493011
17096 493011 61144 343404 458984 206365 428472 529804 411324 260046 553136 652301
17086 652301 383877 425142 437715 485544 502026 515082 630945 -3571 476780 429476 262147
17075 262147 383415 394414 798191 721033 306399 445754 394956 450838 666677 403942
17065 403942 570540 243015 265836 503822 652175 621523 223014 347607 374136 757878
17055 757878 532307 386657 324573 187835 919109 479729 184979 646165 728927 194413
17044 203443 440337 345923 430609 418896 556172 534730 470839 705295 526243 353523
17034 353523 532721 315200 435983 707711 703934 539080 527928 544799 431357 371862
17024 371862 485807 549301 758239 508020 580783 302895 477301 565753 810052 1045564
17014 1045564 688891 428686 543258 410763 574393 875469 689969 637274 595530 532666
17004 532666 478854 434715 864412 832761 537396 743183 502852 691484 769422 645115
16994 645115 820308 510973 800339 835670 631827 821838 414611 327006 707460 925247
16984 925247 927851 991330 586577 515349 596292 799264 658164 423521 648285 657642 742010
16973 742010 799941 813876 550283 427978 579585 868784 1018006 854741 488821 1056295
16963 1056295 803028 933918 832380 705275 1101499 911247 1033833 1387599 916929
16954 916929 1192150 1060632 697029 1090715 931122 1109761 1229522 996447 658294 1014720
16944 1014720 823462 884110 888107 1151722 1042351 944222 866283 1465142 966497 1241147
16934 1241147 1133201 1215807 1051796 1225978 969938 1158054 850714 1101707 1149907 1214841
16924 1214841 1291156 1462148 1180859 1148314 1368185 1276375 1165030 1718778 1256029 1102303
16914 1102303 1312014 1092394 1238026 1350275 1513810 1472549 1298752 1167992 1301574 1417558
16904 1417558 1291296 1453884 1231544 1215001 1903315 1770821 1659682 1361025 1778209 1438452
16894 1438452 1864488 1781051 1588004 1596309 1873632 1606781 1919627 2167776 1789114 1329044
16884 1329044 1886483 1848530 1840170 1885823 1840039 2187575 2010976 1754762 1842883 1930775 1902025
16873 1902025 2261091 2055489 2077780 1936650 2238276 2147324 2208865 2537472 2281538 2248934
16863 2248934 2417607 2293049 2102481 2457424 2579885 2516508 2735877 2534546 2547003 2802867
16853 2802867 2695582 2553346 2748573 2657870 2879508 3242023 3136122 2890801 2877642 3060330
16843 3060330 2922675 3338951 3428680 3564616 3160273 3359901 3600488 3475372 3580773 3806959
16833 3806959 3856842 3820229 3536594 3981781 4166802 3986656 4224393 3871923 4234648 4474035
16823 4474035 4544309 4655914 4456370 4719791 4616768 4822922 4872097 5247123 5450696 5225922
16813 5225922 5296107 5821189 5838789 5693695 5724194 5913798 6244897 6336374 6379863 6329238
16803 6329238 7069645 6481290 6827862 7030403 7144098 7148227 7600207 7848905 7601663 7847077
16793 7847077 8707850 8893587 8680707 8718732 9210199 9217232 9766371 9755623 10194611 10646342
16783 10646342 10937275 11000742 11414653 11765284 12027211 12779899 12992429 13513760 13913301
16774 13913301 14198023 14689944 15434150 15670093 16390154 16725513 17707661 18013494 18528230
16765 18528230 19695435 20113892 20722421 21592561 22495700 23571974 24593692 25323771 26266648
16756 26266648 27892316 28479839 30261356 31618518 33311949 34824813 36456188 38060411
16748 38060411 39993268 42661563 44115765 47305117 49249726 52803974 55465994 58374740
16740 58374740 61891656 65615562 69343243 74108374 78709043 83713084 89476356 95390753
16732 95390753 101440719 108023160 115382232 123253379 131279081 139710272 148374619 157268601
16724 157268601 166025849 174903741 184126361 191809966 198897370 205140672 210044239 213858349
16716 213858349 215558451 216026557 214644805 211497937 207640278 201759588 194996107 187072183
16708 187072183 178436119 169702257 160258635 151265208 141917320 133340846 124837360 116867358
16700 116867358 109572110 101968124 95395334 89524931 83801278 78105306 73632672 68920834
16692 68920834 64935195 61076077 57064636 54077706 50866557 48018455 45556515 42960111
16684 42960111 40818325 38435084 36594700 35055981 33148028 31702832 30491045 28783204
16676 28783204 27873454 26476597 24967653 24168545 23006615 21970525 21346889 20430192 19301742
16667 19301742 18738168 17871066 17509239 17060135 16023582 15783384 15436210 14690148 14039283
16658 14039283 13248894 13058804 12469871 12082244 11660885 11581440 11088132 11032460 10191456 10158524
16648 10158524 9767161 9362448 9210065 9084204 8914539 8769177 8283202 8133164 7961980
16639 7961980 7970791 7296524 7352823 7326428 6741536 7010074 6671361 6300931 6574371 6204420
16629 6204420 5745214 6086877 5567451 5653106 5367801 5590415 5466835 5142153 4902536 4816262
16619 4816262 4865568 4907674 4639730 4567672 4348861 4272981 4012632 3967468 4082617 3792910
16609 3792910 3852336 3668566 3818155 3766878 3784127 3554179 3191372 3164340 3029286 3301533
16599 3301533 3136505 3196790 2959042 3051295 2851120 3076862 3079829 2509680 3102940 3115530
16589 3115530 2701966 3033007 2636079 2691804 2719227 2274877 2293496 2525877 2371800 2488481
16579 2488481 2408217 2419421 2409121 2346496 2324072 1895073 2291387 2245169 1887429 2117941
16569 2117941 2025147 1955389 1977929 2044362 2120885 1813160 1677449 1835778 1712968 1798417
16559 1798417 1386541 1601320 1405182 1866218 1677913 1578779 1676236 1488362 1577159 1442323
16549 1442323 1530031 1217195 1230437 1569187 1187781 1390735 1285027 1499163 901642 1330451
16539 1330451 1321671 1304487 1490454 1660132 1148705 1069248 1215161 1532827 1330730 1240166
16529 1240166 1140890 1126188 1080058 1045147 1216852 1167688 1230434 1151891 985320 921488 1077341
16518 1077341 1192178 1066158 878427 697696 1318110 1123925 788321 725851 1052959 884523
16508 884523 1039314 954220 976654 828160 1298068 818869 998244 1125609 807396 800357
16498 800357 751055 1025182 914557 850549 622512 1314265 684392 656844 959596 574130
16488 574130 753944 565627 730719 809641 783418 813368 613904 883324 754860 1010043
16478 1010043 1019757 867114 712770 998261 505629 604741 778332 694520 930155 648828
16468 648828 795400 814088 531547 878884 250196 873008 341257 737569 177638 654253
16458 654253 604763 842586 411042 656802 484687 403244 660020 724428 514222 662660
16448 662660 421152 561267 584822 640985 691482 589638 786775 491299 752757 792961
16438 792961 734503 331928 417949 352970 490851 813369 286489 418352 406530 428154
16428 428154 601789 474786 333388 357152 638547 351213 793952 483425 626030 548882
16418 548882 529106 816919 272302 271203 826233 700038 511280 705750 338518 153180
16407 765855 378601 413084 404862 615163 206462 543631 380467 585833 384607 70136
16396 453505 382259 241521 725927 -73910 273332 359673 378734 300603 430669 570434
16386 570434 284655 504216 614774 178722 491637 287405 452055 511523 316138 241840
16376 241840 390733 412623 189808 286178 337685 191409 332360 525319 387096 12837
16365 292688 453458 258474 8114 80132 524327 97904 675473 177104 330086 67803
16354 247651 401693 429897 259486 417677 276646 115199 393112 281509 254938 391841
16344 391841 413088 519515 87208 272461 264729 299156 628422 406324 489162 -9301 387827
16332 370582 561431 738599 -34933 477170 344205 617353 324266 155643 366134 285631
16322 285631 233870 558449 57991 300421 362847 23721 160267 376270 269572 357349
16312 357349 57578 439835 -25383 29252 490565 28336 -453449 238200 265581 245467 55089
16300 52118 164192 458510 289934 -111411 325835 -100224 285314 128777 315264 381510
16290 381510 337566 257189 -50709 -58569 157368 232718 -22746 -4922 363418 202288 181376
16279 181376 329083 356621 159337 79538 421418 329057 345075 314064 189527 313084
16269 313084 96559 426575 297987 146233 96965 386765 411279 579900 272753 251362
16259 251362 92914 -157132 443373 335694 140594 332550 44422 416671 -212336 -99134
16248 300983 -304005 -85741 123613 155601 167261 145250 189535 298708 -45797 -38996 -30907
16237 -30907 297417 9401 -154228 -233120 188576 168374 -9461 6505 105479 317630 12561
16225 -11885 141499 307425 307202 -70369 -34766 69096 347381 162299 -52633 -78995 30790
16213 265328 96684 401252 456373 283738 -193195 206049 295697 354221 429562 188251
16202 563730 292870 347496 176274 201634 -108027 375493 -130809 21614 -4941 -76897 301371
16190 -132837 159855 234499 218384 378989 -38198 15016 187717 177851 43524 133264 300462
16179 300462 479836 -10662 214217 120619 70200 187815 202262 153118 176678 131825 -266575
16167 15061 324862 88655 74943 -67053 334285 -122773 -202682 153557 217478 -215304 -95263
16155 23272 -23526 -268033 -159120 356212 -37657 -1168 100706 448915 -105510 29525 31273
16144 31273 13590 92676 88142 -19894 288201 -100789 265000 210938 -24355 167543 124311
16133 124311 104960 248352 111019 -239231 -231907 40461 -192856 -376541 -95634 212677
16122 -121275 -66631 -138123 -154197 70467 -122745 -77396 140661 129683 -10404 150053 107085
16111 107085 -144702 -66020 -3726 206608 22636 8885 301489 -167881 39092 209905 23373
16099 119954 109777 300065 -90883 -41076 -254435 75025 -92468 183730 240739 -160369 -31697
16087 205965 -9512 205401 127537 -221185 -26522 -357831 -356362 170066 -49547 66068 -62501
16075 111633 214432 10031 134957 -159625 14834 -289358 -44411 -64483 -201070 20014
16064 129965 98926 -321325 50827 -27580 -73292 6109 160276 -96668 75990 -293294 78813
16052 148886 -353008 48818 12495 -38453 -278723 120539 -154064 39674 86064 -253101
16041 170911 356851 -173998 228852 -27525 6475 -151519 203604 -241397 162278 -106177
16030 90864 -105043 237981 82731 85426 -627676 -23126 463603 186292 -286008 168104
16019 -44457 -420286 -413731 -69645 371933 19316 144631 12373 219176 48477 240212 78841
16007 -403518 74863 -24781 36709 -121592 292160 -28069 8975 -169814 -138443 193737 38293
15995 -125942 159250 302399 -117623 -6742 78454 74909 286332 -416020 109453 -313681
15984 -43556 -176013 31673 -209324 126337 -243308 6070 -14235 -187996 -408164 -146411
15973 -100274 49774 -384971 -180026 -218933 163293 -142385 -137431 352585 -147660 -95630
15963 -95630 231209 505677 191968 31766 -20842 249516 23515 -278870 -240699 -101268
15952 -84204 -124821 -298204 255893 8185 -175016 -32446 -523685 -507838 377031 -348882 54566
15940 30227 222335 -54297 -496035 31733 87706 -162396 -228959 64077 170911 134934 -62639
15928 16375 -86832 -54616 2417 14800 -147591 -29763 -83388 -42214 -67355 207440 -174550
15916 -87874 -59909 -112750 -156215 207088 -209375 -200333 347968 -132235 1952 224755 -155859
15904 504581 25247 -89114 -117233 -154232 -52297 -41362 10846 -195560 211 -137802 -167884
15893 -167884 -24709 53393 279930 51759 113726 96987 16680 205537 43934 406907 -222720
15881 -392083 -122625 -189136 -126712 77517 64754 8777 26927 -63583 26043 6662 -107415
15869 -139173 -187982 -214776 -18547 -363283 84378 142463 85010 3493 225672 38434 166627
15858 166627 23077 -218064 -119988 339387 -18028 -76480 42783 29412 -118075 -1532 200569
15846 182073 -6365 -51341 -197123 -409513 -172708 -283649 392153 -341761 -174174 -120183
15836 -120183 363337 -121992 -79038 144740 -121527 -57626 -168561 -450178 -250298 -75661
15825 -95173 -195980 -244643 242585 -165278 242264 70118 13398 -25757 63843 -65919 66770
15813 -200472 -84031 -406494 15777 6152 -19652 241087 196339 54139 151182 -90912 136443
15801 -230007 -56469 -162490 91738 53501 -250365 -20163 -15480 78815 -91079 102308 -67207
15789 143631 -107973 -104444 -201310 91395 146093 -224570 189669 -48320 26026 -75948 190924
15777 -175641 40247 -249985 135772 -180305 36238 -254446 276240 154858 39363 -38587
15766 283438 -239704 -85119 209772 77979 -364024 -118147 256553 -138999 76642 184269
15756 184269 197889 295154 -309535 -146045 -245808 125480 61278 61270 262298 262513 97923 -5017
15743 -221253 -49554 -212388 -85755 229569 -221067 -26647 -257701 313459 -279994 -37048
15732 33129 694 -190682 305431 70374 -147689 -91923 -71492 -187072 250533 11457 -91335
15720 45190 147036 -289760 226450 -83327 246946 -124378 141317 -80101 41218 -262293
15709 112882 -175002 -495197 -112535 113831 -46033 348681 334782 -193194 -161687 208441
15698 -213873 26599 33804 -134487 -182193 6761 97022 37280 63449 -78427 -51718 -44519 41100
15685 -255143 -104476 -64331 3202 -112386 -50344 -129173 -70398 -324564 -119834 -5983 -132542
15674 -132542 -130898 116421 -144883 -103909 -46701 302568 161480 -275400 -1530 20314 356450
15663 356450 -86697 -224293 55026 -140283 38308 -245593 80374 -76434 -119507 -255950 -361741
15652 -361741 -11020 -140586 -52575 -51808 172425 -37182 -133745 22221 28405 205576 -349567
15640 212872 -244008 227509 -226999 290213 247420 68842 -46968 -90482 1419 -96622 411750
15628 -157522 -230621 -255779 39853 47872 125447 39570 -25609 -16728 -241697 132551 -26998
15616 143328 -21306 -123426 -129656 -329640 53788 -212179 -204900 32166 4363 59867 117160
15605 117160 -238659 -196219 -129997 -455106 28503 -28257 -80327 41804 -221438 75020 -173760
15593 -365958 -94077 78002 -399652 178437 -263110 184885 45790 -83369 569537 70987
15582 -31732 -5617 44812 -159366 -268877 -8312 -360807 183242 -111882 -191962 -438533 89964
15570 3246 -200596 -112449 -228983 -196491 -227674 192953 365661 187840 361708 -328367
15559 -264651 49449 22549 507302 192922 -268020 -154906 -14743 -91070 55444 -36726 168607
15547 209607 98800 89893 -441231 -13449 -70871 32173 121138 217005 419562 198630 244142
15536 244142 -176675 -299845 -25380 -82095 -166694 -150913 53002 156791 25209 986 -119599
15524 -44151 199873 -83872 -112010 241731 97811 196437 110705 131345 320442 -179707 -119758
15513 -119758 -275469 311913 88740 25897 120397 88858 -132760 118401 144504 12599 152540
15502 152540 -294908 259418 88434 99581 137763 137287 -19363 -50690 -141736 31292 -10940
15490 -213530 -13313 1930 -263431 243769 124192 -183337 149203 -162388 25416 372634
15480 372634 481985 72907 77042 209213 59958 -166930 151869 -155165 351449 243320
15470 243320 -206084 201068 -25463 4423 13955 -10100 -59990 230960 73318 -3003 -44949
15459 -44949 192083 -358602 141232 12193 -115079 149892 58501 221269 72589 212398
15449 212398 259689 -15950 13469 56480 47415 30536 -153277 -210391 -98975 235044 242080
15438 242080 -67829 -224640 -60254 -148501 -1462 -317470 205919 -159398 -80847 43814 -119681
15426 -237489 -1464 -478370 -271384 -33782 -102885 -229930 100630 258894 136623 216671
15416 216671 35481 237117 117567 77663 164493 792 165858 179971 -121501 -8960 -55087
15405 -55087 143817 149919 -129226 149701 -204292 89906 -133198 -78461 -92377 -96739 145822
15393 -299012 274228 -10269 2347 -280409 -17409 87965 -123456 -242906 -180183 89436 58545
15382 58545 -26869 129187 -180626 -151097 -116051 -102382 173571 -362172 -127747 -157276 161133
15370 -112275 -230089 -213358 234276 -152740 142062 -15432 10306 119356 121847 264490
15360 264490 351524 104720 31509 -1119 -37443 -47076 97987 81758 194726 -75222 192408
15348 302004 42616 109551 138651 -413042 -31590 -115336 27339 7427 -164009 90306 190207
15337 190207 96599 60140 89145 -132917 -179190 -166828 475056 -294666 -9496 222347 -58847
15325 38993 -1310 -23892 -16941 -5627 136634 -76835 -218986 22613 -404605 1269 33036 210504
15313 210504 -294648 374415 138766 -22392 -52742 -264680 42793 10435 250796 16056
15302 274409 -295095 128435 61944 -187065 -70130 114021 109914 40965 -100007 -119024 87229
15290 -89779 -196047 294363 5293 -173643 259614 37957 180949 95423 -186541 77773 25724
15278 -159962 289338 66270 421847 -43707 242487 304430 10815 388305 341047 201774
15268 201774 -273233 1354 88945 313310 331415 533 155806 -35912 365872 190911 -126204
15256 367152 363902 230839 227083 75061 255835 370557 327876 1027479 1618035 1488881 1380552
15245 1380552 1402535 725396 396837 98637 356671 141126 309173 -13834 -159395 -23726
15234 -19423 18816 -138195 69051 75281 -34055 161012 55312 -598314 170827 337560 -131551
15222 244105 -145057 200397 -64088 201553 128430 322734 143947 30437 89290 199188
15212 199188 149676 20714 774 -291169 88212 -115278 179556 103851 241111 -74265 117412
15200 70423 236776 90737 235972 -75520 88653 245522 68025 63446 -266928 156451 -203570
15188 316455 130126 58354 -12170 -130329 28006 396114 -116845 4639 268935 148130
15178 148130 241645 11301 -49035 237989 -139867 -78978 30108 -76139 253848 17162 302623
15167 302623 -139811 61718 -16313 15819 248542 352756 -123816 201527 147718 116264
15157 116264 16177 -3083 61574 377431 -76021 179358 233981 -28779 -12824 37652 168473
15146 168473 117053 -8565 117816 151667 3246 133248 480081 104181 -77468 363964 68579
15134 174910 348941 19180 81402 317004 5826 57821 -90441 177972 -144028 170654 -94205
15122 162873 12164 307524 -335372 244175 51416 397297 -234867 108878 -29265 325291
15111 395186 26091 373746 25264 151376 73945 46357 -70381 32231 258344 -55387 147933
15099 246054 161349 200642 -3434 -242732 363107 351951 -143593 46630 -81491 130430 192070
15088 192070 -77371 37396 86434 274412 274461 231321 -46514 39483 214861 -57838 20100 291563
15076 291563 -75143 183265 329792 142125 333241 284689 207918 444596 311293 41375
15065 206411 323761 175042 -14202 269519 248433 395051 522632 162572 -25799 -18604
15055 -18604 167294 103441 399616 30407 -125036 -34591 179752 -74112 397702 136691
15044 115016 -38437 111517 129310 189807 -32510 313137 377856 50821 -23061 504829 347247
15033 347247 502967 96419 117296 465786 9076 381076 254858 139566 -56776 215390
15022 318991 369576 162106 382441 350783 150058 111723 -39981 453229 396635 195333
15011 204710 -55906 152732 427446 387122 312351 97165 339081 215616 319314 -3767 -2193
15000 -2193 -613 -14218 555690 144444 167029 189933 274263 307256 77017 339036 278539 -206154
14987 215328 462758 35321 621799 276174 491989 167121 636656 143826 286733 107317
14976 157898 99499 498916 11018 669532 411832 157970 22090 299397 365579 202376
14966 202376 447124 286214 204731 -201020 406759 246306 46206 238080 525573 211892
14955 393985 178733 500498 292127 198397 34378 179538 353629 146253 413584 453944
14945 453944 193120 169874 223281 317393 260799 308962 387916 357160 460676 128927 381145
14934 381145 384137 363439 468746 274076 797885 472539 693713 -66597 537990 255983
14923 508344 469726 61580 224418 151011 379526 356418 97904 318746 263946 360859 157197
14911 238413 369291 242389 295729 368275 423357 198877 141309 359860 218322 381046
14901 381046 474392 195847 229883 593986 198672 409550 638601 5354 400507 244949
14891 244949 213840 377854 623001 351030 222933 419463 620347 94799 501990 427043
14881 427043 472582 210173 229207 249086 500328 362428 438237 343449 260581 162286 579000
14870 579000 431214 411237 229419 331050 162073 295741 526599 939547 552054 293615
14860 293615 739679 242643 825019 550676 604037 738036 589165 432558 276448 469391
14850 469391 443043 409454 72128 538037 325251 541356 169778 707818 369727 324652
14840 324652 677540 909481 488576 578335 513633 720740 505511 516300 291588 112313
14829 682763 592148 304107 489623 804008 93395 525267 329271 418574 666749 565783
14819 565783 300611 780208 329973 515874 367086 833742 623447 571193 628634 425175
14809 425175 246042 597983 448585 562389 351732 247136 515779 408779 612361 561558
14799 561558 351966 501189 482899 208126 739384 388740 1010431 522827 866136 763734
14789 763734 793732 831371 679773 140409 381014 948655 330014 560794 479969 322176
14779 322176 880752 854490 792138 438436 813705 246534 597192 499090 781536 841857
14769 841857 492045 499386 255519 798936 729685 546385 876993 406166 731323 629409
14759 629409 342436 650960 868709 567351 661834 778693 742300 590750 897293 1072227
14749 1072227 415102 652462 470218 713010 740243 946301 940876 625234 613730 658318
14739 658318 561157 1118747 577900 784031 617353 843342 483767 541745 735243 693650
14729 693650 706856 1018014 818293 463205 563078 921021 835090 822833 194052 563601
14719 563601 716100 963079 1058906 571774 1087989 886742 680336 781885 774044 855459
14709 855459 649545 684818 913668 583592 777162 855973 824933 783832 646730 889403
14699 889403 753001 741647 871500 975435 971743 739831 875552 1250392 540036 1012339
14689 1012339 1002579 989911 1010843 1191631 1011999 871462 974481 811123 1257621 1181999
14679 1181999 1221868 728450 711540 795305 970299 699353 891268 1240426 1125823 1082340
14669 1082340 911337 352449 1137001 1274679 964723 1121565 1075686 1301300 898459 1049228
14659 1049228 803400 1063109 1388675 1217025 1246097 1045902 1254950 1235480 1571066 1286654
14649 1286654 1571816 1279376 1218076 1091637 1112965 1258845 1297611 1475196 1131717 1116998
14639 1116998 1523211 1271910 1666267 1639557 1703699 1249214 1168646 1511798 1316371 1532347
14629 1532347 1604533 1126764 1614549 1327470 1240328 1679992 1512962 1309918 1612862 1654206
14619 1654206 1413276 1617882 1413883 1681582 1569596 1405381 1496053 1675810 1690497 1580338
14609 1580338 1615049 1037495 1670818 1673190 1368785 1573348 1587651 1792096 1845770 1688239
14599 1688239 1852793 1281219 1530102 1757103 1850995 1859017 1819368 1821776 2023069 1935832 1606342
14588 1606342 1683151 2310834 1954234 2066500 2135556 1771418 1584151 2156029 1911510 1899120
14578 1899120 2147235 2109435 1876911 1997770 2219598 2001741 2139301 2296274 2200290 2550390
14568 2550390 2257575 2348523 2390024 2560754 2147099 2686145 2699923 2783425 2963252 3107822
14558 3107822 2938774 3184502 3400527 3427758 3997151 3875187 4481423 5437281 6845747
14549 6845747 9911138 15858611 26317682 40791738 37065159 19406208 8703636 4337057
14540 3114980 3109429 2509212 2263324 1835565 2241421 2056143 2028564 2260569 2133061 2119613
14530 2119613 2216465 2441582 2096161 2120804 2341751 2309447 2211412 2446269 2116259 2598588
14520 2598588 2525062 2412542 2531211 2438249 2891248 2711527 2971893 2871819 2636737 2761154
14510 2761154 2653881 3189652 3086458 2820957 2777037 2823493 3197013 3083166 3411669 3162449
14500 3162449 2771745 3510398 3071845 3333825 3736460 3473325 3518095 3361300 3570401 3665892
14490 3665892 3576838 3596876 3851271 3473760 3455332 3679923 3588238 4015319 4062015 3869750
14480 3869750 3861944 3792350 3958747 3971042 4252480 4356667 4162451 4518815 4173160 4045382
14470 4045382 4629349 4196315 4614811 4541067 4489590 4497228 4704735 4494801 4674872 4851923
14460 4851923 4789434 4653460 5125996 5192902 5103184 5031812 5090079 5010963 5350684 5135389
14450 5135389 5315681 5553905 5770182 5589315 5755117 5559241 5975581 5863941 5867474 6096758
14440 6096758 6256843 6267543 6388682 6175232 6182377 6545027 6991372 6823697 6759096 6886603
14430 6886603 6948661 7509552 7236420 7424245 7234714 7545226 7734493 7863954 7540376 7597729
14420 7597729 7731283 8140473 8452947 8358363 8567825 8864455 8385708 8717410 8768047 9143505
14410 9143505 9259067 9373917 9195129 9680106 10012960 9804043 10294828 10145759 10364323
14401 10364323 10654742 10618186 10744227 11425556 11500506 11572113 11949627 12152912 12074005 11960611
14391 11960611 12672911 12794312 12896225 12665915 13462511 13682882 14021376 14394951 14456033
14382 14456033 14796167 15057081 15072729 15363999 15601616 16280058 16613700 16824784 16947297
14373 16947297 17196855 17708502 18124696 18453587 18946728 19025362 19796947 19962237 20304397
14364 20304397 20421526 21447849 21639758 22005896 22454711 23000936 23613311 24104902 24515267
14355 24515267 25386317 25898904 26867289 27015992 27805277 28300129 29212843 29550303 30676488
14346 30676488 31464000 32275462 33019229 34111036 34951910 35635871 36902938 37969200 38891940
14337 38891940 40027075 41390306 42066395 43397542 44956246 46308240 47602266 49255418
14329 49255418 50886056 52174698 54132105 55984128 57538326 59590119 61745666 64044073
14321 64044073 65863095 68422715 70914234 73683880 76223508 79382561 82439035 85949682
14313 85949682 89495053 93123652 96531865 100839272 105375893 109121981 114726798 119168466
14305 119168466 124711887 130594754 136596649 142874156 149733386 156726546 164378155 172461717
14297 172461717 181269272 190344871 199971248 210087915 220577660 232111696 244135385
14290 244135385 256515293 269619654 283322315 297801480 312096951 327375850 342692403
14283 342692403 358539541 374318782 389764735 404992516 419887216 433839696 447143734
14276 447143734 458962685 469002363 476481206 480208571 480793517 479981232 478603550 477712911
14268 477712911 475743451 470272724 461660595 450505263 437547093 423787193 408823145
14261 408823145 393336572 376847717 360236959 343896454 327232620 311158407 296200206
14254 296200206 282086884 267913974 254282104 241252781 228931961 217841597 206668176
14247 206668176 196121663 186837157 177723265 169452835 161156388 153723778 146252965 139618319
14239 139618319 133392534 128163929 122120942 116721321 111508925 106987531 102650925 98536352
14231 98536352 95022066 91154189 87496397 84072215 80847929 77589142 74909743 72239130
14223 72239130 69443014 66968207 65070508 62667136 60621622 58507072 56534854 54571421
14215 54571421 53019110 51561157 50564611 48230141 46702980 45534274 44122740 43261442
14207 43261442 41980662 41006594 39465431 38356737 37403204 35968549 35860312 34666587
14199 34666587 33953066 32591181 31820025 30913495 30065076 29791376 28731605 28314538 27396054
14190 27396054 26856406 26130367 25664489 24952047 24148916 23430189 23099011 22745574 22408865
14181 22408865 21750192 21368303 20792042 20228472 19538421 19738605 19366709 18949458 18552081
14172 18552081 18173695 17773367 17653202 17179356 16667131 16562645 16099807 15681616 15522738
14163 15522738 15343043 15016756 14693341 14371947 13947031 13846239 13760786 13449173 12980994
14154 12980994 12761572 13204662 12651508 12136214 12091210 11989479 12009626 11734368 11250437 11237180
14144 11237180 10619412 10991770 10710488 10696270 10413052 10604075 10241762 9915577 9664345
14135 9664345 9881658 9481869 9428567 9302870 9067961 9074843 8808591 8907226 8430457 8688206
14125 8688206 8608725 8309919 8219217 8377852 7821691 7718665 7900595 7897329 7692240 7495467
14115 7495467 7386529 7270902 7312188 6872870 6856818 6963447 6510523 6566493 6799582 6690657
14105 6690657 6559182 6331959 6217122 6203505 6201335 6250399 6322706 5853715 5457178 5852087
14095 5852087 5647902 5409437 5728813 5347092 5413055 5437674 5380696 5180999 5251988 5187165
14085 5187165 5062944 4927676 4945304 4834378 4949356 4844198 4717969 5102956 4564732 4466423
14075 4466423 4437089 4557216 4496139 4651777 4775673 4426892 4427563 4422083 4555734 3941463 4122858
14064 4122858 4175571 4296026 3889266 4029871 4105168 3951655 4012076 4016727 3789777 3954943
14054 3954943 3586053 3949633 3657574 3906705 3274659 3705085 3677765 3531278 3341971 3459123
14044 3459123 3442159 3649006 3446360 3516128 3228280 3235857 3163922 3298909 3074085 3276198
14034 3276198 2785928 3104679 3331058 3328123 3042461 2835044 3166617 3236468 2926102 2911258
14024 2911258 2855314 2950333 2699722 2595373 2751978 2450554 2811828 2759616 2651168 2259337
14014 2259337 2454889 2590667 2474931 2527886 2365909 2334522 2462636 2531118 2802352 2293798
14004 2293798 2390389 2362443 2290809 2058718 2251388 1956434 2336379 2168454 2242163 2213559
13994 2213559 2515307 2397037 2470301 2918114 3477090 5406453 10128582 20275971 36667755
13985 36667755 38467132 21821514 11840105 7427046 5431879 4822820 4185793 3383044
13977 3383044 3164865 2718147 3119644 2885968 2917409 2799026 2516536 2208194 2479305 2707458
13967 2707458 2458250 2479783 2430812 2444864 1888677 2112588 2145790 2092339 2209575 2086084
13957 2086084 2222347 2146605 1871929 2278921 1977786 1844213 2117060 2130859 1904239 1884681
13947 1884681 1925424 2174188 1805425 1875589 1922135 1759696 1892300 1723635 1444213 1802728
13937 1802728 1972800 1888946 2052208 1612544 1601158 1829520 1920007 1806785 1940226 1706306
13927 1706306 1769799 1791645 1671113 1409284 1556707 1912793 1689249 1348206 1669878 1338684
13917 1338684 1299853 1661845 1550694 1231783 1672209 1426386 1480561 1653728 1284962 1179680
13907 1179680 1376214 1137584 1289584 968460 1122719 1323283 1568092 1569229 1061359 1478782
13897 1478782 1492193 1234296 1618239 1088229 1531573 1324534 1448125 1210814 1424936 897368
13887 897368 1449685 1531773 903760 1113287 1146388 1284309 1076558 1046084 1169241 1197571
13877 1197571 1133504 1155490 1156935 1217958 995066 1195442 883591 870700 864550 756140 1311799
13866 1311799 1180398 1220385 1143205 961162 1134725 1211859 1010370 1168871 747651 799131
13856 799131 842125 947663 668276 829403 950337 1312330 1016874 1412310 918273 960866
13846 960866 900304 815635 846091 1173376 1224434 966283 600272 988482 906252 1000293 836999
13835 836999 1189379 1064297 1189266 930798 742007 832314 1273595 901987 959610 850193
13825 850193 825919 847509 1238485 516473 470224 905500 912115 916161 792191 956009 789929
13814 789929 1236170 524969 642488 713664 715149 763035 915626 903547 716682 1031035
13804 1031035 873106 866103 500236 703630 862716 868805 1000892 959913 1012849 707853
13794 707853 940814 881044 769133 678887 783798 572370 831314 903943 687703 873925
13784 873925 825976 963117 422988 767985 554034 766695 672508 642099 948114 617758
13774 617758 632600 679481 751981 556104 391425 1082083 654631 505948 703634 908096
13764 908096 483163 543995 636721 891336 652229 697504 809919 668465 391983 383003
13754 383003 615857 693266 867769 521518 683368 289750 890133 237389 576675 436929
13744 436929 415328 708600 663938 663451 617218 376724 558082 810816 654420 763892 676111
13733 676111 540113 494889 951766 654743 302274 669241 664771 510282 502204 727160
13723 727160 606836 536293 812494 518062 470859 420290 495762 396702 509199 864823
13713 864823 459651 372239 338121 404014 467583 489959 695140 152145 601788 147157
13702 687158 432105 248958 374552 580205 371394 406451 725739 751530 538029 404412
13692 404412 658900 528285 735880 251624 734753 349514 514242 542324 623662 640544
13682 640544 529936 474931 479903 307852 461290 414929 302051 326641 240398 562206 389122
13671 389122 104401 97306 533107 761270 188146 500300 469611 422467 483594 730751
13661 730751 239770 200311 918726 302855 465017 252448 208166 873869 629564 437226
13651 437226 268898 537972 125380 398293 354232 263204 494227 596382 347523 782150
13641 782150 431399 241975 233485 684142 512722 857630 437607 471785 430671 245990
13631 245990 189723 526311 559524 -109496 473639 577371 412588 659791 212798 362627
13621 362627 314997 438604 164864 344947 83088 79627 523955 292189 547823 789764
13611 789764 325120 423932 127888 493925 445485 386561 427597 290692 229396 170232 389012
13600 389012 -52621 510638 464137 44168 215898 450465 600646 -82655 331905 395387
13590 395387 431856 960330 152184 255234 432119 72789 208810 103733 828493 257654
13579 263964 400273 205032 422818 247449 374611 33394 135170 59328 154077 263529
13569 263529 276974 642962 324328 359566 406049 98448 472853 637643 103566 562313
13559 562313 24527 81649 -203227 422913 307070 350382 340953 246814 321467 -195201 309484
13547 44926 355127 486937 154837 124305 489190 480584 404781 332859 -63820 214031 272214
13536 272214 233646 -10553 577779 216904 -48703 468452 251006 71756 -38640 255380
13525 -125253 281428 265604 102252 236921 -45595 416019 326512 313830 423187 316734
13515 316734 328484 170014 180173 359579 -51086 383852 217032 307237 54698 304303
13505 304303 182865 310153 447062 369314 191221 -169718 273819 59303 267996 448277
13495 448277 407407 168923 86391 206792 19964 153616 268131 82989 -91076 186238
13484 144510 200440 108865 286736 92414 222835 101949 590586 25379 294281 151796
13474 151796 241155 274517 -7317 47614 451619 334188 304741 82161 45229 444175 432164
13463 432164 573598 256738 142013 300602 238511 265650 388829 207596 319872 109094
13452 333906 63011 495482 206706 410228 181431 377928 -9368 331191 266933 248051
13442 248051 327240 100096 -124484 330888 -48898 62822 455663 92187 41766 357340
13432 357340 571594 492195 356728 400281 52585 63677 164481 97386 229672 -132366
13421 446010 -143199 134615 453446 480263 285113 28888 221669 342583 48196 137632
13411 137632 337297 -163620 171546 436518 82360 -134752 328787 410250 202219 370497
13401 370497 506991 87165 125229 380545 202248 292735 714017 313856 133027 -41509
13390 -153867 119432 476658 417308 340929 340132 79379 405456 337929 57863 588428 48626
13378 321854 501677 32385 317802 417405 494665 388778 343188 317054 245959 280948 70829
13366 436941 249489 164877 235817 251882 362912 131658 226511 441542 138186 -164614
13355 -25986 480443 263806 -222747 277374 249579 213347 -66259 221081 407923 136213
13344 157505 250636 274960 417189 312095 14379 576414 107380 257121 210062 30868
13333 33684 360432 344243 310448 327976 8978 244810 6262 359515 170885 164165 397852
13322 397852 105374 117169 41526 122844 324570 314478 28508 -71727 139129 105242 -91984
13310 124645 400346 83193 30092 151823 280506 -295606 -97305 70169 -104628 -41004
13299 -128029 543669 166212 25841 85645 -209974 166986 -75287 149639 -81544 456254
13288 -67825 -107710 137450 5530 317235 17087 186145 335152 150362 278234 171198
13278 171198 -31222 166235 77295 175165 65955 471883 25964 57094 357198 -5273 -152390
13267 -152390 333513 -29882 219320 32006 206614 339762 303946 -172149 347273 468890
13257 468890 -262276 126604 6956 -104551 97324 241546 -221743 151396 -330028 46494
13246 165490 30546 -38367 -10044 258914 102287 -151618 303257 252417 141336 65807
13235 99492 -43601 5585 -24388 81487 100632 -143732 -138842 -50617 -56416 -148 -7576 -68667 27917
13221 59851 -55795 80979 86526 -67312 -8867 -155792 74652 349923 -202435 115906 -84347
13209 507339 -154672 79953 280333 10798 215417 -115323 138485 16489 306862 362506
13199 362506 141052 -270954 -133806 -89360 203513 421656 221 272758 -82306 288626
13188 450781 195380 175815 -146879 -162590 36097 116181 112125 118758 -52490 157290 -35893
13176 115074 314147 -10003 -205373 152185 -237771 -96728 37726 93057 103338 228735
13166 228735 -122821 150479 -142586 -7793 -6828 365269 396554 45579 211714 -58996 -176531
13155 -176531 -160147 145042 -5433 -127030 29098 -73738 139169 129626 -49571 90827 132138
13144 132138 -94105 397875 347221 -118664 -112828 98009 -80807 101689 -34937 7798 57759
13133 57759 104116 319491 200875 356138 342451 22928 -89977 15677 119733 245205 113630
13121 46186 177333 259050 422389 205743 -76030 -40675 56801 377943 239340 41536 -86591
13109 183054 197679 211615 -46307 184713 -235034 459309 9455 -58191 43758 156644 -258196
13097 -51547 97671 72839 340930 -69981 42329 -88249 -108903 -223585 121077 152286 -37762
13085 62587 333649 404948 87972 23825 -104575 306702 -105750 -145959 260627 -138935
13074 2717 -46031 -318543 -9578 148676 -165129 176447 260274 337911 46061 -166110 199113
13062 27508 156163 222102 195669 -207344 48488 119614 223209 -89534 14785 130001 214246
13051 214246 218148 -3599 67484 -88309 -337616 -165304 -462772 -37993 37847 263468 194817
13040 194817 -31158 4488 -330849 -50791 -63898 111833 -122396 146900 -145460 303090
13029 57584 142707 -130732 429891 161835 493436 101867 310836 150711 112397 138278
13019 138278 -200212 26350 171902 489749 71460 8733 95807 -1850 -47114 234704 3945
13007 344810 -71423 134876 282265 -46243 51095 -398839 236934 144295 210734 125271 102280
12996 102280 218569 45967 123663 30414 235766 147586 -53555 272340 169071 210324 -57852
12984 234495 -101538 22491 -4659 -5611 179335 179669 173842 159179 -95610 308306 95532 211334
12972 211334 -131709 101353 -74611 -220909 281115 437347 -71797 90662 -16674 -125548
12962 -125548 -117537 -79057 88625 313227 116288 285867 164183 163986 -81094 -17575 33280
12950 4008 -38482 224860 -353988 148599 24033 -39927 180712 19648 32082 338942 270301
12939 270301 -66648 203296 226023 209880 -41705 -61674 219783 247368 301259 133174 279697
12928 279697 -28068 239337 -53444 40119 -58155 117258 -304381 289389 -128825 -216758
12918 -216758 -412640 -253513 -170946 150116 -349757 88952 -38900 28236 -262693 174605
12907 235242 -49588 482259 207761 -209116 -216503 -16077 693 150870 120350 124892 112203
12896 112203 -134234 -34725 272596 130580 149922 -54614 193840 154400 55938 -165646
12885 182345 16031 283813 209242 49545 -2920 121035 175557 18942 43236 122684 286073
12874 286073 -25221 -67843 232757 -54619 206683 211006 184911 122897 -37438 -27872 111697
12862 273659 -115225 -82127 65986 -84569 -86484 35325 -247855 147530 47629 268697 160820
12851 160820 -136286 72268 -210434 92903 292947 -216281 252358 31704 -98644 311246
12840 -154712 377017 -47560 -225062 -19661 349432 -161234 -36603 99045 83222 56615 236834
12829 236834 -18166 359123 -39570 95466 -140683 -227275 -132692 3672 304719 -127601 -88676
12818 -88676 214110 -178538 -69838 -270909 123736 54802 344560 -132102 36380 -32932
12807 -215831 -173366 48532 403412 -36153 29352 85524 -108243 -348213 147726 92320 63428
12796 63428 137788 5 -217919 -164433 307252 4298 11359 70100 -94088 -84602 -80849 326329 91780
12782 -132206 -392910 -36077 2409 255502 -146389 267963 70862 219243 199602 -568076
12771 54535 142564 -76207 -89696 328583 75025 128834 -17817 188074 119609 -95266 73924
12759 95344 -28872 -62255 54906 108845 52737 -47698 194298 -219155 195829 -182007 193751
12747 35745 134848 6539 41498 154784 -24106 -14053 57820 -332432 -21772 -8957 142348
12735 32147 121702 200535 65914 320004 269099 -371068 9228 74803 -4809 -10392 167736 -55756
12722 -66606 8613 48610 1011 254238 -297086 -22382 -163500 34888 299936 -61077 195398
12710 -88209 179239 464154 34724 178307 381800 252924 -26901 -76563 342086 136476
12699 56910 146725 -17791 237690 11303 -239185 2284 -135842 -12422 246832 -105762 35006
12687 171980 94556 135482 -91086 -98326 86906 -97639 -175358 -79663 -38902 144668 430135
12676 430135 50328 92317 -79785 327243 299924 51983 134266 115750 45512 65941 -26050
12664 76640 -8965 -80391 -67008 358959 -92635 119616 158923 252227 255768 36082 -25008 286506
12651 -244930 92502 -79133 130758 233732 -201089 -113769 142453 264953 -227216 266386
12640 -230538 -145257 114064 15956 -163318 209431 -15502 135046 -26974 196219 263383
12630 263383 78480 490503 189956 195161 109721 336830 101814 188180 57183 -19951 380483
12618 266623 77437 -166872 63957 -34145 -34727 -223930 -85645 -232983 202369 143734 -23609
12606 61941 -133299 -282264 74425 85002 -150137 58067 217369 -58098 129702 252000
12596 252000 -134037 -286184 -156453 27774 -60730 -44855 -89326 39844 223178 -59970 -176910
12585 -176910 9599 -191819 42397 153757 -86004 6225 -68836 99721 -43356 -51977 -15612 -141090
12573 -141090 81641 404837 -56411 35806 377345 209081 52101 -33942 153835 102567 -8508
12561 101309 -159145 318681 135443 58244 -47926 349867 53032 -54917 -221274 172236
12550 80939 65380 221002 192122 -135285 152734 -159148 -152428 -478360 8041 -93213 363090
12538 119279 -83191 61930 163625 443698 -372101 82508 -166283 178011 83995 106956
12528 106956 199150 141550 149945 70015 -55707 159829 262725 428438 67160 -105122 408958
12516 -68495 -2505 110933 77818 -114805 190511 -80357 57937 185101 -56607 280610 -77649
12504 -257319 -38952 -150854 247268 -27822 1080 238277 -64437 -82949 -81529 -56428 -209064
12493 -209064 171228 204817 6352 39001 117425 304210 -34589 -8726 -34432 150632 -177524
12481 73150 106248 -64333 -13007 244961 -9898 73219 -259375 107874 79749 -160517 333728
12469 -106380 37452 189809 -137920 -10825 -67011 62143 -110977 95272 -381337 -21030 -285151
12458 -285151 58875 -39311 -62050 -11785 43132 -481 -69275 152277 -189783 172762 -348069
12446 41546 39497 -359329 134185 -116349 86115 46831 -75164 105822 272064 28798 85252
12435 85252 323175 16931 -102079 63256 -202881 -126690 2096 179485 -41049 236650 61228
12423 391421 231061 -234232 117242 110764 303592 13387 -534492 -132857 150480 -40262
12412 70042 -88781 104970 210284 -37945 3439 -4820 95330 -77371 -284571 35300 -31753
12400 -116841 256510 50075 -35720 30720 -225847 81730 -77257 -108589 304078 -63560 -53058
12389 -53058 151067 41548 -7371 -53163 175383 20507 35840 296693 -82053 -3001 -198418
12378 -198418 111560 -76731 -299472 -106981 -118675 26841 397535 253947 -75767 -41356
12368 -41356 -63075 45429 -240279 34323 88219 -109785 208211 -194560 -387100 -8610 227715
12356 145861 398939 150857 -59277 86544 96777 218416 14076 164810 -199794 6934 171103
12345 171103 91601 -180456 15813 -114487 -13861 75641 -141300 50291 15864 166034 70543
12333 -120734 129984 -162441 -72401 3145 -76144 -200654 -168605 -166282 447027 -43666 -340639
12322 -340639 -170204 -263437 -82933 77347 -75696 358231 66349 163126 199682 107511 -120235
12310 65141 -158201 -137745 -144499 -307955 -217767 -189052 154219 13296 -83153 -196347 5638
12298 -132957 -75260 -338475 409915 218531 237995 -112477 360500 289674 -78283 82600
12287 70191 465458 194645 183747 100659 -13762 392944 471759 80372 44188 -49850 201020
12275 115642 217518 240553 77390 206102 -288440 -185742 32040 159880 417138 284741
12265 284741 9792 -356115 224030 -53936 -68759 56162 89651 -104591 166205 -197758 -15255
12253 255529 76937 91581 47886 113843 -47887 494074 -205751 120344 -85950 257889 -410
12241 -30722 -78668 -93869 225390 -17431 -194707 177078 107944 238634 110549 346047
12231 346047 9106 370712 535718 -18164 -147185 111210 208272 410419 -34884 55364 276809
12220 276809 331236 59898 494187 -114616 160754 -132638 -199273 334638 -14387 -167774
12210 -167774 108545 39731 287579 388780 -46976 -118879 -72831 -68006 277815 232288 562343
12199 562343 222755 189363 115649 245783 353747 246976 131099 130452 180571 -98250 52890
12187 153500 192592 138570 -132937 2928 305931 11671 116889 371170 17880 250566 451383
12176 451383 185340 -41826 -22877 76630 -73420 380000 167229 -174634 487235 102884
12165 42095 237691 338531 -44847 333719 110536 14673 59628 408764 192880 -123038
12154 32729 290494 219788 101445 132530 516894 68157 201248 -407477 -32586 233549
12143 -36456 -87783 99585 -42800 128446 172962 -166222 -153469 -60945 124359 -262430 -122531
12131 108090 -230494 193148 100589 -291418 -102629 -62784 168445 4903 -144925 129231
12120 -140702 -45629 -228634 25172 -93698 -46486 -60704 15176 137973 -70022 196522 27598
12108 -81158 -280236 -213866 -273576 -114193 258308 -61520 -15636 186694 -72115 -38194 -401149
12097 -401149 -58759 -327707 110358 -182325 -94456 -112588 -6977 -78189 116710 279348 -314786
12085 111907 -191148 373813 -76761 323101 -17607 -176619 310341 16737 -301819 366 -121498
12073 -131256 84317 -145944 283416 -133158 125081 -31246 104373 -197915 245915 216016
12063 216016 17941 284829 232521 302984 -276405 -176583 295228 -59373 116267 81375 -7347
12051 -165853 48850 -450131 97729 33514 -17616 -279216 -409611 219502 -33224 -38895 93057
12039 94774 8787 -92823 -89702 147881 -340057 -129776 342579 177867 522752 1170252 887568
12028 887568 336977 -32105 -96112 351720 -221412 -99837 -98004 -72860 -132701 -322164 -164347
12017 -164347 74424 -3353 516679 44146 -267267 75931 -191802 108562 -292892 -98344 49207
12005 59585 163510 54363 -25619 -99630 -126514 41030 -232081 100931 -54259 -224086 -195833
11994 -195833 -218510 139888 -87834 -88748 156458 -360290 -45781 -240651 -85779 397535 289902
11983 289902 -278058 136338 -33790 84637 177889 122601 -203397 -324582 355216 179569
11973 179569 178977 -174171 29243 -145499 160585 91962 -126707 119414 167799 346758 9230
11961 92507 -52315 -237538 99453 -287191 -77039 110272 258851 -213071 -249481 13425 -195158
11949 -103236 -135419 81237 231458 78998 223170 -209983 -87926 -70156 -108780 49484 77521
11938 77521 -233841 -342780 196098 -94469 44211 -39826 -62686 -3568 -297361 -240348 37210
11926 -319564 116653 70930 -356464 -161039 -65074 421113 -162640 117278 -24570 -165988
11916 -165988 29808 -193340 -82713 14752 4976 149723 151911 23063 76495 -10594 -353847
11905 -353847 169372 115521 249066 -106442 -150369 -10781 -72402 127129 77489 10153 -74579
11893 -141162 36733 265159 -100881 26190 179797 -235792 -12957 -76982 -175567 114915
11882 -31545 -47954 -388648 174873 -108807 -56542 485146 -74502 -138494 38883 40181 74450
11871 74450 -160105 -192708 81925 198633 -89149 42118 -171314 -41056 59091 -79097 -264198
11860 -264198 3124 11411 -138074 176306 -58962 -41719 30132 -90683 47061 -58072 -62857 -308788
11848 -308788 327924 42084 -32291 22622 257420 -90164 56884 146915 -177240 -300114 60115
11836 -363597 54703 39472 -235758 177265 175035 56947 -146113 -21367 -70935 39884 -253621
11824 -85778 120960 261227 67133 -110265 -82955 118332 -313905 93564 -248951 -224299
11814 -224299 -225679 -119592 -258684 195647 33178 36322 82606 -18708 -276050 -88958 49680
11802 -128464 178644 -161565 -101410 -103055 115336 -17581 -209714 -329121 -372993 -274553 195956
11790 -204190 103781 -136624 99027 -62985 -127240 312096 246706 -181354 196018 -201686
11779 -336478 -5189 -251311 145075 -114447 -247744 -138884 -362219 -50537 11786 -546154
11768 49256 162452 -53406 -376489 -135891 -27222 -75528 -2327 108175 63257 34280 -76680
11756 -247957 55905 321551 -176310 -115140 -55665 226926 -69669 -253915 164456 -165595
11745 1946 -173374 -242358 -44443 117965 187126 126218 -4034 144977 -159919 127586 -6011
11733 175594 41690 -119532 -229018 28786 -108941 -296585 11974 -140993 118738 71376
11723 71376 -138709 56121 34922 -10466 -89176 -113427 -139648 -166670 58086 316554 -77157
11711 221346 -3584 -11803 141870 -96951 115921 -64331 -72685 -354982 148500 371374 -167031
11699 320293 52855 354965 303463 -27935 139380 -207778 219131 -169972 28117 -69549
11688 53365 87885 -59582 -166827 -6254 139912 -93111 -22982 216103 60207 302181 157035
11677 157035 158171 -396182 -14944 24591 -226379 286629 368176 -37201 199430 -179889 149934
11665 -265345 -294159 -210812 368185 -363871 -46535 333556 51800 136446 324362 21113 -97832
11653 177910 -226749 -79490 -242091 228533 161211 308256 37989 -65595 -143937 28020 -89428
11641 -235046 361108 -305535 -614 -255541 174434 264715 325854 -250270 72411 -248071 -106294
11629 24194 -97456 -193689 220396 25458 135194 106578 -194427 93656 -89509 150033 -271156
11617 -419587 374628 7554 6275 -108518 134137 303799 -65447 -46280 -206308 4620 123098
11606 123098 66700 115214 -13842 -15007 79755 25804 282272 92865 -94863 100168 18530
11594 -187750 57143 42603 -3229 -360811 122653 142313 16081 283173 25777 -84025 106562
11582 -64162 -169243 216574 -285882 50776 -192710 228452 116306 173423 46546 22570
11571 104641 391561 -5522 -29953 184101 -130406 -95607 -205881 95431 -50423 34028 88192
11560 88192 463673 149974 85758 -118982 85970 -158795 87599 -22442 110227 395934
11550 395934 68958 -237177 -221969 -284932 233279 -233241 93715 38958 138997 265149
11540 265149 -108024 -24982 25684 88055 320751 -144131 -101278 75620 118198 -36756 -181982
11529 -181982 184395 45915 279950 305822 378773 125529 144219 167723 61457 119778 185721
11518 185721 130825 74153 247676 280323 -229372 358395 -17309 -24424 120030 -79175 -55126
11507 -55126 -91124 537472 240324 274245 114524 241590 -52796 54735 113269 68535 180930
11496 180930 189683 31081 -138058 260829 40733 66039 349254 201524 294564 -226522 26005
11484 107493 179467 -47619 52750 208108 9868 214015 441840 374507 360566 24430 228427
11473 228427 393347 68237 -119755 334772 -14250 46311 282771 183494 -29306 -265756
11463 -265756 335526 416519 319004 -98179 118771 153538 76759 171789 141639 286446 81013
11451 -43237 384773 93143 85504 316010 -108500 381311 172851 162273 -50741 900 242065
11440 242065 45704 -40172 128597 159212 299845 -376220 297774 284499 33803 203577
11430 203577 5970 48727 59913 96954 -121761 368718 -192327 -43032 -166604 118487 -66003
11418 -65015 111151 -62359 9301 221933 61213 -71579 -17823 105755 134052 27242 124551
11407 124551 -29568 -38158 111655 55319 -45117 511233 -111067 46083 -198870 157254 235067
11396 235067 -143361 -266322 235587 -311189 -30230 -54417 218539 -191787 135243 133381
11386 133381 202182 -216829 -62537 -165066 349501 -224491 23667 -6037 -186775 178504
11375 233661 -167635 135310 -217480 -123679 136956 73145 90064 -1724 219608 111541
11365 111541 183899 -188276 -82404 -310559 173878 -8160 -385263 83125 -70001 84049 -336983
11353 45397 351335 176347 59579 -137098 -102682 -264655 41401 -109254 79745 105486 -128784
11341 -90447 175156 108110 -67191 -22706 259986 -274063 40746 176335 -121995 68192 29433
11329 -405168 115815 69725 -89886 426370 -223890 -37085 189077 -152914 -45173 -62215
11319 -62215 -291940 -327274 -226796 196486 -221162 79753 160837 105750 112146 -70555 -337699
11308 -337699 -71980 -22127 94983 -111362 -67371 -54500 -293239 231154 -270305 51675 -25327
11296 -292002 -114832 64605 -87245 -51925 -33675 -135365 55295 -302772 25492 -89962 -134823
11285 -134823 -403993 227943 -78380 -166511 -168491 264327 100725 169050 2139 92212 -94772
11273 -269800 -13152 76741 -163165 149847 -116976 115484 -152887 90483 -37531 -97671
11263 -97671 -219167 51998 214250 -371139 -8052 -55917 -3119 -459768 44289 -75122 106892
11251 36410 -18206 -55573 -136901 365938 -229574 -10607 343887 239241 -234507 -125858
11241 -125858 -149539 -293080 -461891 -142854 -358601 -121296 -431365 -56854 -118106 -175279
11231 -175279 -179570 -185564 -65287 -113920 3770 -48978 100246 -37888 151641 -288654 60526
11219 -134037 -227923 51771 97387 -240924 -127675 -97361 -56529 205730 -221665 -42143 -10703
11207 -19663 294672 -270009 412698 9611 2469 74709 148491 190803 35840 -34635 -71059
11196 -71059 -14638 100428 -32501 -244990 -83893 35954 -32139 -93853 -42437 -164402 -252514
11185 -252514 -78554 129546 89048 -189694 -6872 44995 -285568 -1691 38638 -304514 -9005
11173 1849 -205299 5373 -249969 266141 154626 -114549 -195936 23415 -112107 135113 195929
11162 195929 195123 5034 40502 -116425 4008 262003 -300249 -157071 -101736 7963 -142165
11150 -174245 48659 86791 343877 -17290 -216943 -770884 83072 -162577 109168 105584 115237
11139 115237 545687 -171943 -79247 164346 73107 -23099 -143138 110963 62244 3469 297061
11128 297061 273111 145018 7962 36702 1236 -166431 -124435 61766 144515 108877 -250456
11116 40741 -137659 190845 -149901 32818 104381 503274 -258900 -76129 218681 47353
11105 78400 -217103 35861 176621 353326 -11215 229907 412335 122099 129221 -1975 268676
11093 -120816 255760 -36041 214574 150274 378753 102494 171987 239295 339838 218891
11083 218891 444983 278923 10692 248364 266079 358235 235251 387166 165439 407458
11073 407458 418148 217387 -97002 249496 254555 119283 333715 343711 162720 534445 451392
11062 451392 533302 318686 347053 937157 605787 530869 996911 327965 1170716 589032
11052 589032 627393 614754 644275 1026293 814716 946182 742386 1261762 973805 922979
11042 922979 926199 1134803 883558 1037625 985232 834751 785167 813831 807722 782969 487739
11031 487739 1095673 773495 987000 784764 853409 992933 570858 531790 818645 566226
11021 566226 500875 860079 538961 582352 331673 734766 875113 826945 566065 750068
11011 750068 522188 1305361 801057 592353 628819 1138503 977123 979412 1040168 938704
11001 938704 815909 760770 774610 793656 593082 742304 564885 634597 973407 803589
10991 803589 873523 736592 1089891 1140961 790145 664464 1132281 928831 1244275 1570364
10981 1570364 1339441 1487381 1719006 1766665 2054018 2247361 2828766 2951088 3358150 3050773
10971 3050773 3560162 3563719 3511851 3488573 3235318 2808728 2380109 1923228 2052412 1806610
10961 1806610 1709193 1380343 1780433 1737223 1362094 1674272 1560074 1344884 1246571 993538
10951 993538 844787 404507 898100 529326 400632 193187 316486 276523 231580 31020
10940 113506 106214 273678 -54548 -37550 295479 394379 29346 170253 -24431 33798 -396491
10928 349571 -127568 -108623 10534 211779 -15008 3550 -246715 -76995 6589 9423 32578
10917 32578 -226776 -104761 18682 10229 -86610 32606 -143994 -272904 -91984 -156970 92247
10905 -266240 9968 -136212 -157303 -143147 24209 361326 -6694 -354861 103185 49321 -224091
10893 -14330 -73658 90252 163698 22653 100334 229311 -156845 40220 128620 50359 2449
10881 111469 -80302 -128294 385948 185815 112831 -44433 -11823 -95070 73061 5940 237403
10870 237403 27444 -217824 -30449 128653 -22677 12787 360722 234510 53632 -160332
10859 -155819 5170 -116231 25748 26781 -421387 173307 39940 273192 88065 24664 163073
10848 163073 -383447 21904 -299810 -70593 -148235 -121507 -115346 291006 -101443 4300 142153
10837 142153 -182902 -83796 32874 -142386 -99425 288275 -244739 -54137 282452 55800
10826 211402 -164943 -79704 108951 -264447 -231125 145086 242464 202915 -27840 198121
10815 -214298 43212 55939 -293029 40389 -31805 -318686 -239813 -110211 76031 103187 5341
10803 -196 -164523 -150832 82821 -125580 -230679 227070 28266 -301860 33618 175125 53072
10791 -188071 51334 31017 -108614 258888 -87555 -191401 -55166 -131764 152350 -98723 -154141
10780 -154141 172301 120468 -134900 142003 -4527 -201926 134893 -252132 39337 -21989
10769 318091 -195041 187966 135962 -264667 -300725 -174066 -64844 -49057 197446 364142
10759 364142 -47195 -122583 -215883 -177565 154025 -136766 -414525 -176885 -121743 -381439
10749 -381439 193606 80542 66655 449064 -96737 -119839 -118299 243839 -63158 -299761 -238865
10738 -238865 -27504 166277 273344 218882 -194133 42316 -175786 -130353 -90383 -89156 -176922
10727 -176922 -60572 -312054 25866 25082 71053 -110244 161077 -181200 154389 40613 -302550
10715 109479 41767 -160708 -274043 -216068 -109247 -232589 -110493 -239895 -135143 -155258
10705 -155258 77070 -145445 311016 -47603 -14793 -58664 59820 40885 -153172 53026 -219819
10693 386 21738 -2275 33821 -33681 45185 -309435 -89214 -140495 -94078 -37980 -326808 19775
10680 50195 60193 -38148 103375 356363 -7694 28109 109961 -34674 -72960 251277 125267
10668 23977 -211928 -81197 164562 -120782 -27999 89045 123658 -111960 -123176 -389695 -239829
10657 -239829 -191163 122119 386090 -315261 -168032 -151115 157013 78427 28787 -94066
10646 -221104 3601 -170181 198532 -75481 -9933 70198 -130957 254172 3757 -261038 60227
10634 140613 18157 -18274 210077 98606 31340 -218524 85805 -7959 -175641 -64058 158063
10622 111397 -304573 -41837 -16239 -491086 73 -149655 -55228 -385032 27087 -77150 128187
10610 2904 -219711 159973 79727 -102723 -262823 -86725 82642 131509 -161036 -118963 89439
10598 8193 -148062 -13983 -194810 -247953 142795 46832 -176833 -41869 -73612 -107191 -172712
10587 -172712 -154433 -74081 29660 -149502 -27499 -204636 13440 115505 -73496 18402 -301125
10575 145585 -4609 -175721 106414 72170 -279600 164712 -43237 5205 225830 5876 191014
10564 191014 -115702 -57588 -76033 68383 199280 -23029 -161567 35507 -287314 -124173
10553 -52947 43729 147755 -193510 136989 -148344 -213205 152978 20998 -261872 286420
10542 37786 -200726 93455 -56534 -127952 -234649 -200529 -78767 21602 -20544 -117516 -256114
10531 -256114 141495 -8411 36031 -63198 -67423 -207303 -25034 113537 139918 83546 -66228
10519 74431 -329034 133632 67713 -188981 -244206 214572 221134 -205309 122293 -152570
10508 -52181 -177904 -195938 59599 -134771 -309438 -19110 35922 -81277 6235 13636 -296796
10496 165038 -410935 -99502 -327262 -162797 -111176 -226666 93679 103387 95183 -65083 311291
10484 -112226 138014 247127 612357 663333 576541 305706 528937 347254 238370 21045
10473 177303 41522 105802 129490 64115 154453 322279 124140 70937 -117726 -87534 -250568
10462 -250568 -222151 -166658 73472 358368 -130090 -41892 249576 -118943 -75956 253268
10451 -61109 108510 47613 -330988 -158616 -121106 7533 121720 -262373 -143238 137176
10440 137243 -48437 128544 14485 71730 -81476 -174276 94478 63433 -107408 -18189 248191
10428 -59368 85151 170816 92712 422665 24366 -110586 -84929 -25121 -21469 509924 223887
10416 227821 5595 -193613 37923 -95041 -252308 313555 110265 -192019 132701 74044
10406 74044 -204444 41253 -22614 -78484 -257401 -75194 133453 -33057 -200531 51526 -129498
10394 -328526 -7729 106379 145430 -10894 252273 338211 230550 382040 235735 171002 169944
10383 169944 -30969 -119152 142276 233046 -156112 81759 273889 167059 -83286 316218
10372 266692 273076 502700 469674 322727 603706 323115 354689 296898 394016 468109 88111
10360 543125 59490 448534 594748 477176 323810 254303 506770 387558 274074 451147
10350 451147 626883 751429 349120 332291 323077 567722 674074 268313 -75288 -64233
10340 -64233 -215562 152280 224836 655481 35800 269151 292265 267716 192038 163526 219237
10329 219237 -18222 261680 138719 413402 144804 -50175 434045 -17676 71853 311152
10319 311152 102160 144952 107659 141051 265470 -62058 -168843 227456 -235664 -48879
10308 143829 34652 171174 -46995 -134492 -112697 55537 -18656 38970 195708 -34496 57686
10296 216504 -314388 21132 503995 149114 -241205 24076 19509 -50484 114990 -128287
10285 -25642 47251 -105581 154798 140792 -17834 15985 -229046 -313440 -68369 -205376 -373592
10274 -373592 250125 203895 389216 55864 147057 26764 -98283 92653 -148485 -327294 105875
10262 247667 36166 380904 454021 374381 659108 363632 427521 202200 261412 38199 248814
10251 248814 -132754 -177842 53049 -141346 -49315 -240156 -318350 -32110 157146 -15565 410442
10239 92868 34382 -14316 -56411 -272278 150181 -296935 64336 -265182 32563 93216 167346
10228 167346 -128735 -54825 -138219 22712 67398 188672 49822 -384062 36791 78109 103954
10217 103954 32087 -195472 57759 320089 154964 95620 34883 134687 28095 63726 214389
10206 214389 -266609 -325584 17494 39587 -21376 -43889 103518 -282786 -127860 -180554 77122
10194 45787 -56363 -55579 -499214 51464 -140834 -35430 -171815 111527 41047 -111770 -342836
10183 -342836 -370332 81392 107380 -53327 62662 -123059 -15969 -195962 -350041 -327680 11200
10171 -43797 -152110 -147450 -544563 119690 -70015 -351455 -396081 -157193 87030 32620 -306084
10159 -150047 -112906 -690181 -157868 -280936 47677 -253662 3262 -90481 -74306 -16939 195670
10147 321050 82826 102912 -204299 -184103 -76613 -8222 -260760 -74887 -157543 -67645 -365452
10136 -365452 -210954 -46235 -153560 -79326 -22855 81547 58729 -51986 137256 123970 -65919
10124 -161052 -414296 -89633 -168058 -186306 70997 -24790 -186014 242027 61458 -489365 -123075
10112 -122821 -113056 -61068 -201477 6372 -157671 -468746 -55962 60614 24412 303390 -172034
10100 190716 -116532 -135825 143772 126161 181914 -354522 -170567 -160749 125854 77783 -37924
10088 -126645 66126 303616 93109 185362 151882 -183902 -253248 -46610 -349852 10042 -93811
10076 -183355 69716 35699 13493 -174630 -13682 -31557 -89537 -85735 -316060 68891 74549
10065 74549 -14989 30655 -11755 -168546 -226579 108030 -163697 27043 -18558 18999 -345327
10053 -323566 -13998 -104987 -13078 -123555 -338445 -264887 -138150 258113 -190518 -145139
10043 -145139 -137368 140184 9617 66401 95266 -262352 -250087 -249532 184623 -164680 -125312
10032 -125312 -163680 378489 -268666 46249 186290 83112 -198918 -31937 116991 72383
10022 72383 144044 -168496 41155 -90751 -196143 -87027 134905 218797 -309134 17617 -224710
10010 -196516 202185 -64325 36818 -212142 -44493 -171318 -223136 48492 -86472 -135731 60861
9998 -151583 -253287 -261093 376304 173250 28082 -324981 52512 -193101 -111876 -267711 -60189
9986 382471 -181190 -63971 36431 -348459 113672 13832 92442 -162695 -245281 -73022 69616
9974 -232428 37507 -49731 -328160 140339 154739 -39774 309837 -104997 -305121 -106123
9963 -79714 -2692 -147701 -142508 117279 -130091 5205 -173176 75933 186664 177866 41290 -409549
9950 -306632 8342 14457 -182649 2951 59394 77822 -72360 287445 1036 -574013 -174669 -64012
9937 -435162 -73838 -350760 -134321 -129500 187238 120438 181108 -19518 92853 -39580 -34141
9926 -34141 -279936 -35759 -398267 -100845 118446 -101576 27104 -142564 18319 28529 114319
9915 114319 61098 329805 -53415 -29911 -489347 -14475 -141634 62137 -241677 -59769 169010
9903 -308870 -114026 -295779 -100639 215571 -20592 3962 51999 -133568 -212504 79916 31609
9891 -188197 -36965 -223553 -412333 133425 -209409 53111 -166606 -253293 55269 118893 -125602
9879 -97713 196952 -57351 -280104 -268548 30762 3941 266372 -160995 47207 261990 -61587
9867 154496 57597 -274191 -121474 123801 37872 -184018 247787 190920 253724 -313035
9856 28558 -81983 -166934 -71917 -11311 147737 186766 -186962 -237028 139936 -219089 94271
9844 7840 -92781 -409417 122189 -20444 80356 106487 89797 -147135 28505 93988 208843
9833 208843 -134184 -12376 -170051 78333 87387 23124 183516 -174083 178104 -458285 -221460
9821 252891 -297740 194776 -8182 228454 -155622 300076 124664 90948 -201515 -221996
9811 -221996 -163834 96362 -207779 328517 -174141 -62390 -39507 -72450 -270952 -178071 -159816
9800 -159816 -9033 -133697 -127914 -60857 -359186 -260805 -217673 -30675 -146274 -146418 -312790 -21169
9787 152903 -202275 155610 -82251 84249 206996 -247676 -55614 59472 -189108 -153095 29386
9775 5132 -287921 -216765 -96690 -97646 -187455 -95723 81603 -71609 -233061 -52451 -276052 -31115
9762 -6244 -156915 5762 48729 -321629 156002 144022 2708 -137297 191296 -154261 201361
9750 -230644 -89491 -69350 -31079 -153261 85238 -150397 -79036 -113527 261938 -249994 -617424
9739 -617424 -148245 -209336 -141004 -309524 -182874 -54922 -19505 -50878 122068 -64913 -238719
9728 -238719 82474 -105481 -38250 10782 -113238 -129125 289314 -89433 -101339 -77407 15055
9716 17692 -357031 35824 -40471 -120091 82838 25572 -401946 94657 -92597 -323511 120090
9704 -145362 -90734 -55352 -66813 -154115 -52462 261007 -225118 -220977 -254934 -131841 79623
9692 -187510 -233582 10134 145456 16643 175083 -285980 33941 308162 -115592 -458952
9682 -458952 105525 -254943 -56816 -6491 30567 -251438 260807 -261079 -66719 -129830 -37323
9670 -7326 149377 -105688 -44904 235410 -249474 -441809 -80939 21051 136588 -82178 -271268
9659 -271268 -9726 73673 -107983 114184 80235 -228524 -38039 -46243 47882 -21630 -485950
9648 -485950 -127620 -589376 179355 293174 -406980 -189997 -319010 309756 -241711 -81358
9637 -64963 -110778 -278865 -54707 40791 -123761 -54851 -101092 36497 198097 322166 -55433
9625 307624 -199637 -86318 -112235 66852 -122997 10529 -56322 2665 -104133 62416 37742
9614 37742 -36748 -202507 -128533 174044 -191504 -170178 -203387 -14352 -228816 -1312 -133232
9603 -133232 128983 123394 -277976 -289327 236183 56711 -65402 -242863 -158455 -214078 -141081
9592 -141081 -305448 -73761 -198188 -196413 -217937 45963 204188 5404 -282158 -219882 -242528
9581 -242528 -52181 -227627 200661 152725 134820 -64097 169684 -335812 134503 -306009
9570 -95290 -156595 -96724 -61121 -81718 197165 -399864 -33464 -109252 -165239 -43728 65858
9558 -219834 16690 137571 7466 -81263 68662 -325288 -144833 86891 291970 -83827 311597
9546 78059 29516 -176147 -102004 -84670 10855 25872 156033 237467 -173685 -181032 -185905 99418
9533 -319425 280714 -54949 -297162 -129168 -11437 29431 -174062 198456 -337772 -339723 -261050
9522 -261050 30224 -204129 189679 -76191 -335027 18053 -303742 -59727 -120263 -353398 -183915
9511 -183915 6088 -98048 136750 143509 -216802 -5042 15270 -42 -300074 344621 129776 51336
9498 279532 -13961 -262325 -61034 -149658 365124 -93851 -116505 366185 -73992 234673 109705
9486 260487 -74904 235173 -186852 -186321 -196003 -375900 -44424 -309969 52496 -133491 135870
9474 -119356 -321056 -269985 -313877 -321071 -71803 76339 232116 -374932 -79812 327172 -58122
9462 -170366 -8418 66949 -259912 32659 -267189 -20044 -101062 220395 24787 166 -258741
9450 -344444 -128561 243993 -100103 -173217 -205981 -18300 -35227 -177728 -89773 -36566 -194257
9439 -194257 -86256 -426719 91871 -243202 79931 -126831 -173913 -386366 -267970 -439078
9429 -439078 -164021 75799 -272765 275797 130073 -263117 349532 75599 -219009 -203205
9419 -203205 214275 -86195 200953 -335271 101751 -271825 -53576 58662 -58293 -148214 113945
9407 -56632 170184 120076 -60523 406615 -193046 7029 -311914 171970 173510 200539 186401
9396 186401 -16990 -306835 -40911 7626 -49302 11833 -165599 -306649 38723 -124954 -349020
9385 -349020 -42737 -31063 -232831 -379184 175667 38 -318943 82848 54814 -153743 -102835
9374 -102835 -4075 82187 -142569 56729 -68818 -208542 -167634 208631 -76168 -56478 -128628
9363 -128628 170645 -153522 191144 -81087 -129622 99205 30609 -185592 153795 12610 -57216
9351 11386 -261500 35264 -290884 -110497 -21843 -234519 -451254 -47177 256129 -117905
9340 -45819 74302 66955 -329673 110055 99748 -250922 -35026 32231 -126653 -21960 16938
9328 186852 -64640 273778 -290929 -93712 -53091 -337297 -375193 -60528 95007 51098 -165370
9316 128409 -286726 -51941 -105714 472792 -282105 147156 -118695 33266 -90842 -160546 -141480
9305 -141480 -137880 248591 1793 -243461 155218 -187446 -384105 -253736 107593 -350996
9294 -265365 80144 12725 95785 -368715 74205 -25978 -46179 -237637 232622 -52300 -142879
9283 -142879 -13217 -160956 -364936 -86843 -235786 -31804 24202 -183624 -114219 -310571 -411440
9272 -411440 84421 -80339 -102202 -145209 285360 -60160 -66503 -149394 -140808 -59431 -57662 -215638
9260 -215638 -357230 -73965 -191120 223923 98247 96680 -11304 -527095 -11774 -211232 -291113
9249 -291113 -160458 33282 -280611 -226977 -167360 -140375 -203556 -305394 -178500 31177 1783
9237 119111 -4156 12642 -258195 34251 201735 -156878 156521 -1479 -185727 -192076 168001
9225 -44040 -111165 -158451 -82231 -120089 -96147 -205102 -189205 -96487 -62236 -312947 -82631
9213 -528277 50576 -132336 277321 251275 84846 -55194 129306 -92053 -65288 68240 69594
9202 69594 -182713 -215464 -130336 118044 -216849 -113364 52008 -299709 195014 -87770 -54855
9191 -54855 187437 -88231 227584 120814 135501 -172938 137353 -302717 -232975 104693
9180 -106464 -45200 -254064 -122019 57516 -46978 14208 -33669 -73917 -355380 -249024 -145579
9169 -145579 -93281 13457 -135601 -76313 -171918 179 152632 -52718 -133930 -213666 236537
9157 -78008 240980 29639 148539 -47234 -96235 212924 -80684 18847 318723 188256 -3127
9145 52359 117635 -168778 -429996 -20221 -19650 90961 -206817 -111251 -218150 69433 -92981
9133 -46878 -153539 -47539 110002 -24848 -190503 -271812 -150100 124092 198436 -84603 -62536
9122 -62536 34121 -168838 16712 136357 237168 -390481 17190 -240877 -120223 181996
9111 -55683 -19071 -220257 96701 160236 -46991 -134856 -76325 291862 -240040 53213 -193100
9099 -193434 -309112 -72741 -275521 -139073 -192611 -86023 -55793 21950 -249263 262075 -367136
9087 -45703 155316 134405 40914 335886 -284386 218798 131565 -291110 28132 -234805 -335058
9076 -335058 -12807 165129 -317488 -229502 -358368 -149553 202517 -123998 -146006 -120253
9066 -120253 -12027 -131924 -247712 -217115 -57024 150520 259526 33448 93355 326477 -21271
9054 -223964 -34725 -248878 -174149 -165491 44255 -35119 93459 45505 -131532 -118458 145030
9042 148799 -161648 139581 395920 -235254 281079 -280523 -11683 70857 -183621 -236285
9032 -236285 -68165 271945 194918 -50092 -383483 -244324 -195253 -21067 90756 23371 123101
9021 123101 -244672 -89646 -92735 -173961 20478 -114141 -341133 -180083 -271285 125497 59690
9009 -3180 -123865 146710 -150615 5549 -80587 -133819 -214096 -263261 258239 6593 -9606 -8625
8997 -8625 -276398 218147 -421106 -248137 -264700 43156 -180171 -89562 71496 -159799 -95098
8986 -95098 -8564 430881 -90195 27609 -285902 -14731 -95005 -389767 97518 95036 -71339 33995
8973 91325 -274657 116967 -399712 38807 -415138 -117693 -45429 -35728 31597 -82011 293040
8961 -335244 74936 -119734 -18923 -345462 108609 125586 61159 -209456 -1104 234551 25293
8949 126584 195409 -53661 95554 -216940 -281638 -127222 -136023 -84889 23440 -10987 -277977
8938 -277977 -117418 35702 259985 394646 -147647 73253 32967 211196 214104 -61303 87237
8926 252185 1043471 1724052 4099737 11870887 18442847 7208974 2087029 775338 786878
8917 786878 681616 435019 272218 -8243 277201 66199 60484 113334 479909 56677 -117099
8905 226691 27654 86031 -94119 14789 -18637 -218295 -6830 -83370 11801 -319359 -75812
8893 195806 -395651 -169711 -289728 28018 -149603 -139536 -137249 -172290 -9621 76088 -119505
8881 -149493 -122686 -89895 -69634 -250967 -190236 440346 18782 32907 245799 75697 -219742
8869 -55448 -376610 -385515 -42840 -2284 208058 -121740 -77904 -222438 78046 -209281 271585
8857 -59922 -236918 -52312 -288715 -20949 -26093 96544 -280591 23777 -195831 -230205 -107096
8845 -276765 131034 119178 -144452 -81311 60309 107125 -34923 435 -397062 272500 -35428
8833 247754 -49732 60061 -62551 35777 -16830 -268512 54418 -380944 27469 -37605 -71851
8822 -71851 -220245 -53336 158958 -229157 -115229 -298736 61937 -129379 -199030 -159198 -210524
8811 -210524 -14355 -383606 137102 -12787 103571 156210 -136422 40869 -303342 -263116 -72985
8799 -18606 50406 170125 136763 104004 235550 -243598 85260 -105882 -208459 -140063 183144
8787 285637 -290585 -170808 -199728 -162162 -141447 118598 -107759 36734 -199507 -10929 133292
8775 -506601 -93580 -29135 -125494 162091 -21061 376088 -41814 -103922 -22177 -201920 2179
8763 70060 -468655 -64749 -191073 34429 -154734 59030 135361 146370 -398803 -72428 174871
8751 15135 -156721 17849 -108759 -41487 175142 -211113 -282430 -38912 -127028 -91702 18771
8739 169662 34843 -133214 -261403 -57954 -65706 -11687 -244682 -65418 -37705 -312944 73811
8727 -23975 -50017 47649 30741 -360713 13600 126014 -153378 -210081 -30422 -92558 -25185
8715 -218720 301473 73333 -108616 -52031 81153 -17458 -101687 197793 -191421 -352884 -17721
8703 -209393 196575 -52379 -214356 -170381 165819 -139918 -220101 31536 -147749 56569 -81426
8691 -295518 -189808 -82481 -112970 -37421 -23890 189476 185100 -7561 -141573 -147653 64896 113610
8679 113610 -69139 155929 68011 256838 -220324 -15110 45715 263889 -215627 102918
8668 -86098 5129 -132797 -118525 140572 53246 -10798 39675 -261840 -73502 -184138 -179350
8657 -179350 -188564 -175853 -495945 -32012 -96854 -46456 -336031 285638 102536 -402150 29978
8645 168516 315034 5556 23953 125501 -438147 -192633 -241784 173751 -281562 -331935 -105778
8633 -157576 -253753 -389240 -154910 -187784 -185400 -35448 -18199 35572 -88709 -2679 -13363 341067
8620 -325829 -6601 168660 -87965 -263495 -89587 -48819 -111701 -6197 59008 -105367 -241442
8609 -241442 -256637 -125170 -134567 -251459 -158062 292791 20646 -297889 -18229 -222290 -42495
8597 93637 6162 -239299 72313 293395 115241 -163964 -217893 -117428 -198769 -230935 158264
8585 31940 -244494 -59938 88434 -135263 -2650 -145812 -110448 -72554 -341154 38971 -387607
8573 -112467 -251048 -157267 275492 -121577 240975 -15754 47474 106109 95520 87282 -28545
8561 -10928 -77595 -150518 149536 -381007 -116416 -372869 -244815 -47465 -48008 77337 -5575
8549 -87802 210883 377396 -145686 -196740 -37808 -149627 134608 92844 -42504 -56205 -246231
8538 -246231 148879 23963 143339 -181812 9638 -88024 -67506 92375 -4711 -207770 319921
8526 3898 -130936 -286971 -212058 -430469 3291 -118701 -207578 -125548 -176717 19368 -337412
8514 157713 -116580 -33287 -236868 56067 -169287 128160 -431991 -151422 -150441 388281 -177422
8502 -241020 137076 -74351 -181171 -230947 59268 166265 -225194 171343 -10434 35911 -86257
8490 131877 56558 -7475 -25159 64595 272176 -145552 -99411 -144779 -97765 169163 -161374
8478 -29846 98653 -113129 -43816 -105431 297033 -59796 -160044 -160808 -252298 -362460 -25628
8466 231558 -315545 8149 113778 -419444 -207550 55374 -198000 167197 -200983 -307376
8456 -307376 -235695 8454 -407421 -37870 -19021 -173974 131447 -148000 -337865 284700 -389547
8444 -2012 -31693 52381 333699 61414 -34134 -148099 -21797 222217 -70611 -209549 293649
8432 -309633 152593 107320 81726 145027 -289511 -51297 104366 132197 132752 41155 -360800
8420 32871 -163534 -338509 -132940 -178787 30730 202771 247019 -111500 155906 284081
8410 284081 -166880 377504 91614 -159318 -160080 -237902 -159529 -3835 21248 2832 -10366 70657
8397 -439123 41961 204856 -184301 -104296 -228534 -184981 -192380 -280145 229926 -4932 -10885
8386 -10885 -47951 -353245 -332650 -42379 -18374 -3019 -41150 34150 70700 -27300 134445 21400
8373 -133051 -154713 -242675 -70539 -344604 -179766 337840 -139783 -120478 205765 185732 57975
8361 63 -143304 129665 152115 -111833 -104550 -151482 -44794 -238958 -84669 8706 -201950 -40137
8348 -157412 185335 -321250 -306383 8722 80419 -48432 -226602 -94931 115887 -465610 17000
8336 -20323 -315262 -120633 -54617 -211686 -293448 46039 -115020 -84315 64941 198688 53369
8324 -14693 -26401 235870 353871 -143196 18438 -122779 117681 182152 -119528 40454 -326604
8312 -86008 92349 12088 -192868 -193098 -48832 -36975 -3431 -309673 86719 61579 9411 -287604
8299 167572 147210 -37810 -84529 66972 -88623 335347 46667 -16376 -212466 -132687 -225544
8288 -225544 127746 187432 -186614 -524681 -5812 7417 -120749 94073 65348 -390370 319436
8276 -254715 138846 -466617 29542 -377615 -98685 113724 20731 -149471 -102735 -80553 -72660
8265 -72660 138373 3071 150762 -6112 -55755 42144 -56050 247268 126678 303766 -191870
8253 22834 127561 -205803 158387 -341794 -301952 -186533 241431 140856 -159921 -105639
8243 -105639 -124828 -211180 -65387 38451 -266518 -116124 -171116 148151 -203684 -173975 -129273
8232 -129273 306683 -253724 -377164 -244773 -108539 68816 -258835 -3359 -52460 -20144 -285191
8221 -285191 -169475 21146 -121916 80899 -72939 -226140 196205 307074 -191987 -202132
8211 -202132 15639 106964 -108055 107710 194755 -10761 -199541 -13682 71061 10939 -352512
8199 192113 -251524 -255684 -248629 -252255 -66087 -222357 192068 -14745 -30951 -5229 591 63057
8187 63057 -1611 -145438 73654 65007 40888 -275674 52574 45309 -220935 383331 -148857
8175 -163303 363443 236128 -127825 -196364 -81609 -116039 -88850 -63546 -134570 161595 282710
8164 282710 -225922 37820 -63590 21855 -84608 26838 -203850 -332677 -232125 67691 353398
8153 353398 -269931 -81 -221217 -36849 -222340 -246698 -330375 -235383 279773 -124362 244717
8141 -56017 -346013 38545 18206 -180198 260118 -102207 268252 -168104 102308 -220901
8130 139620 -171460 -162469 101836 -66053 -151664 -196066 -98107 103778 -66253 -266217 -120759
8118 -205019 134950 -22686 31233 285540 -15110 -52042 15435 71361 48169 -392779 -140762
8106 -79501 14184 -168141 243681 -259499 -509949 -73251 -392598 149090 9365 -409225 145447
8094 -90017 -214012 -7845 -165072 209458 6380 -191197 -61873 -111491 197453 -179897 -115665
8083 -115665 11888 -126223 -308514 193430 -2873 182712 -240966 202830 90832 -66884 -126037
8072 -126037 -370626 312138 -163299 -260652 -74808 41586 -20483 87030 -189198 -171142 -59845
8060 66160 -13613 14259 -334562 -228614 385067 -70340 -57252 -234882 53689 83761 290769
8049 290769 148284 -120386 -36372 -150212 183736 -178736 -107674 -169839 -142341 189197
8038 -113571 -14472 -316068 -70956 61647 284638 -40479 89494 -223453 -80114 -338341 -241247
8027 -241247 -53525 8063 1004 130094 -438735 193348 -78869 -393374 -6292 135214 -39636
8015 -42938 102053 -57024 198771 249109 123177 21673 201001 98077 -132723 -481186 180404
8003 -35376 115870 127967 -50214 122865 129409 -408016 63601 148475 -230016 -20770 -202146
7992 -202146 -175374 -70683 401040 136536 -250245 189692 -25436 68058 7672 185826 61198
7980 90194 -167689 140082 -25192 -138877 -149349 -238594 93957 -197749 160977 -158629 207314
7968 -62907 -174061 -171619 -273054 -112716 78451 -137947 -158981 -130040 -77398 -111375 12863
7956 -2705 -425183 29221 71703 -89012 -204364 44339 -1471 12283 -284727 -316813 -182159
7945 -182159 -107980 175452 211287 163087 -77375 61911 -119616 -176531 -204808 -142562 -308780
7934 -308780 -159182 32093 120382 2073 -90070 -12136 294921 -140898 -39924 -91090 -22042
7922 -78869 32004 88227 154755 -24732 194698 -226906 248429 -128903 76764 75362 -7786
7910 54218 -95423 -31844 7466 -88035 193421 -134781 -109677 -319329 -252157 95075 158054
7899 158054 147903 31503 -134859 -102952 134789 7331 -142688 -412634 209168 -174712 -190731
7888 -190731 272303 -142524 20690 -28900 150049 -254506 -281752 -246634 -231874 190394 398576
7877 398576 -42484 -223322 -84250 -162348 -162404 -119253 74613 345781 -96369 -260611 -289241 -37590
7864 16395 96687 76859 -36011 -2826 -166246 -142498 55605 -172724 -191985 76989 -163916
7852 -364894 -636732 34674 121613 17410 103112 273632 213532 60959 74883 27452 183648
7841 183648 265610 -140577 -34990 -203273 2768 318450 230072 92751 -12272 31086 76578
7830 76578 34488 217124 -328374 -3739 81171 288583 -57522 -222004 -68912 49292 -70079
7818 195657 126543 94122 -44986 17617 147761 -520630 -417027 22023 -154619 -312701 -160313
7807 -160313 219012 -118737 382912 179774 -77251 -133015 -43655 21283 8742 -230828 10341
7795 -10533 -92920 -16133 279255 -240073 -39686 -474639 -71218 -32774 254868 -22958 -269697
7784 -269697 -344966 -78916 -92982 -63667 30776 -379138 264482 -108359 292237 66418 -147815
7772 -146016 149149 -51766 -155752 -132203 -87262 -176264 -87814 58072 31678 6667 223667
7761 223667 -509281 -59014 -377963 -28581 90630 5833 -288380 -30348 63357 -33598 8 -154070
7748 39870 99496 -312065 245561 -138606 30551 -21898 386640 232550 -277292 -88416 -126194
7737 -126194 16421 97027 -10957 145057 -209282 61445 -173564 -10604 -150784 232950 -201077
7725 4529 -67473 127793 -96384 49284 71402 -216580 -60456 -48783 53638 -233950 -203682
7714 -203682 -104190 -51811 -113773 -64638 -12607 -160256 -74869 -260926 273660 187687 17479
7702 153808 -65105 -362476 253545 84662 -148973 -21722 186052 -54084 -56226 -207477 114652
7690 -22088 -253435 -67104 -115396 379171 -13493 -14948 -7184 -107944 -254025 -49890 15777
7678 67234 189405 -291354 -247468 -246756 -21104 -66760 112768 -462209 -343198 526763 -351897
7666 -150394 21481 -18737 168482 41963 -162590 -132713 -187491 -211820 -229515 386738 205228
7655 205228 -104476 262281 261619 -93110 33433 225614 -159560 -107416 -93629 66149 220664
7644 220664 -215956 -292548 28406 449255 -10028 -24645 -78720 108037 -81288 -29334 92698
7632 -61525 -559182 -6064 -229378 -304454 46833 -192891 -154299 184500 -262480 -124058 -337
7620 -256330 -119942 -69353 53859 -97610 -41631 -292030 -50626 -70545 -291728 -33964 195733
7608 167551 114730 331839 140426 -185035 157758 -9109 -13408 192906 178136 188189 11085
7596 -47572 -270997 2077 -179633 -149388 133672 -122815 112542 188850 -364582 -320508 53302
7584 81487 50590 -147208 -120103 -219597 28730 62115 -39120 122713 -57128 -194428 -13902
7572 -126948 -177095 -152038 -30501 100840 -93061 10540 226303 -21016 -18569 -213281 -210493
7561 -210493 3195 -173355 96436 167478 23207 -114601 33480 -149994 -109422 -405905 399
7549 -237075 -34954 20548 60692 412849 48311 -9369 -75695 154979 -143661 -40994 40364
7537 419563 -239239 109379 44609 -126188 47479 -89652 2607 -219872 -146776 -60685 123068
7525 44303 -289337 23277 -179941 -79152 -29021 -233403 -53884 -281459 -256194 110415 114375
7514 114375 -712314 -9881 170672 -351454 -173008 183316 28342 -357156 -49979 13140 186487
7503 186487 190356 -198495 -241895 -72474 51468 -56646 -318529 81623 148645 -165743 -44408
7491 -61214 -238226 323039 87237 -213015 -229066 -111740 -82177 48091 -81758 -64965 -371568
7480 -371568 -42825 235833 -26786 -15176 -208440 85038 -141255 -133123 30643 -81227 -86547
7469 -86547 -130470 -293766 14314 -473383 63279 -109195 -120873 -202888 365935 29707 21024
7458 21024 -129010 -21211 269687 78290 -68710 -166491 -144643 -290894 -358876 29173 -48842
7446 9557 60036 -29574 -238911 -219782 -125009 110328 262478 86450 239118 -73055 -192447
7435 -192447 -330284 -230411 -6793 -45890 -98948 154862 33812 -272577 -450798 -821 72902
7423 -233376 225617 -468483 -336330 209467 -37622 290894 -26014 -127006 -178294 152863
7412 -72152 103775 26270 40540 -81890 -475861 139035 -373850 96060 133570 -18170 -105355
7401 -105355 206591 -193643 126518 -250645 554729 196416 29689 -88658 -101204 -136051
7391 -136051 111771 -149164 -149913 -1132 -1642 -150039 -19094 97428 -177500 239702 -270617
7379 -356269 -82042 -75902 -19340 -181266 -34334 18738 -97592 -160874 -215481 -87012 -122954 -9197
7366 -85862 153036 -263293 -173586 21876 -48220 -168789 -153254 94689 -38219 103208 -194702
7354 -82987 -373944 -346990 292626 -234172 -134205 -301379 -176043 24363 -58488 -115322 -23760
7342 11773 -57771 133429 99365 -33218 265011 87817 -283647 -170444 58287 -223076 89840
7330 68471 -216372 124928 -145548 24479 50425 17484 -125556 175080 -69586 -138587 138680
7318 -252345 -239472 66758 -114722 6224 31160 59080 -112652 61008 -240308 -169018 -466107
7307 -466107 -193342 71538 164474 -77338 100938 53578 386751 -117491 -60234 315202 -82906
7295 61480 285437 153544 66855 -103772 88169 -104585 -201766 -194277 -329312 -10236 -138595
7284 -138595 -69869 173134 -61232 43468 -79491 -298327 -133906 -61089 105087 -134775 263090
7272 -161114 16463 195153 -75122 -113777 29622 95896 -55998 330435 40556 -192369 -40873
7260 329778 84194 92436 -45644 -200504 -221957 164991 199199 -215784 -39861 -34049 -84629
7249 -84629 -252989 17892 -52422 -104228 211532 210372 6350 -103777 178765 7412 226241
7238 226241 -430119 -29200 281228 204908 287273 81817 130131 -138728 175035 35490 -244957
7226 89473 95925 -139407 43950 -157157 -25706 -313693 -127603 37728 138678 -65349 96483
7214 -77384 -117337 -25906 -354371 161464 218535 -113860 48563 62483 376970 31023 -58942
7202 248793 -61794 9320 4605 32476 -204769 -162042 96325 -70325 -104808 -93135 -409905 81561
7189 59930 -122647 -95552 -169982 -38899 -73721 -441056 83251 80419 -214008 -42733 -378680
7178 -378680 115728 223831 -49153 184835 23160 -109405 -387618 -274781 -243123 33737
7167 46866 172945 -114750 -30572 -114196 129531 113593 -7572 -248521 41096 143604 -344386
7155 -5810 59651 168763 78479 -48899 258280 73507 105293 130126 383061 -78501 1424 -526408
7142 243599 -340811 215717 -172288 6509 184497 -273630 17112 -134899 26737 -81903 121648
7130 32019 -127448 -127663 130375 -71785 -326246 495406 -115108 -480439 -362347 6138 176906
7119 176906 -45185 -194891 137890 30394 -106240 -74678 -91344 -133332 -97190 -245601 -56095
7107 -42085 50383 86070 -45381 -173635 159620 236554 -251601 358483 164968 -217654 -14499
7095 -198080 -61862 -17565 -27813 12079 -38058 24554 -51085 200150 -31518 56114 -224400
7083 182706 -105550 31593 7383 -54987 11669 31056 122381 -23784 53861 319163 135624
7071 6518 190726 257993 -54078 251833 7802 -50537 175405 310201 -117884 -200110 103789
7059 -57702 106153 -150902 -147260 -65115 125761 -308903 19004 -105415 202220 -192899 -124425
7048 -124425 -159589 363704 -58596 -198090 -112278 49201 -352328 -272557 297827 -16270 93214
7036 141782 -255450 -464760 6517 -144535 77916 158113 241608 -69131 -112972 -177037 -254970
7025 -254970 -116641 -85217 -135358 -715534 294381 -172564 32407 -142530 22738 210199
7015 210199 -91932 -205926 229039 182309 -423109 -17865 76485 14914 148185 -54888 210762
7003 -65782 -59082 -85029 284828 263570 -179757 -8774 261948 329518 -132856 -251690 65866
6991 -53066 -264786 -206094 176854 274056 -152216 63908 52270 -339185 -250642 -67495 69624
6979 24752 -144780 -645 344952 -5062 -46100 -191198 -88669 -288813 -174436 310174 -227760
6967 -189915 -110460 206306 -63970 -9894 250648 95087 -311801 25340 10072 -316264 -39345
6955 146057 94953 56092 424577 -54467 83463 102860 45126 -41664 187188 -101607 -159241
6944 -159241 -294360 -296419 59479 218833 -211546 -48297 299694 -49323 20601 220817 -59254
6932 47568 -262800 147222 17733 -159709 43606 -252800 -148849 254634 -69005 -393130
6922 -393130 -44329 117085 -253861 -35312 -134697 74856 81453 -200061 -288921 134115 -142950
6910 70141 -121686 20987 216998 -142906 15376 -419716 -308665 -304108 147061 41128 -77280
6898 228540 125509 -248294 224930 100734 -323500 134721 -121956 -110318 -16534 -197785
6888 -197785 -12796 49188 8700 -41566 -59626 -178013 -252673 -181509 160511 114120 18982
6876 24193 75842 73279 -358260 -175883 -315990 -325501 -120394 371293 156626 -145986 197444
6864 23849 89969 132472 63136 -386551 110896 155313 97304 -270925 -50996 343110 135072
6852 -502371 45410 106095 140969 -179604 -180983 269500 -131685 -36687 107767 193945 30301
6840 -316787 376967 3396 61752 157917 176155 -178232 57502 137131 177135 -110814 -156761
6829 -156761 -81696 -223872 -151927 -59576 -130738 66825 117040 241546 187186 190801 -239625
6817 265343 63063 29556 -103158 -138816 42024 -16863 116310 -164492 -43208 78810 -27929
6805 -276247 100562 -138464 -462646 -66842 -64787 131531 -288481 -190437 91599 314022 -149798
6793 44950 -192205 -86614 -37760 -165018 78208 57248 60916 -277669 123452 -142618 130539
6781 89953 87410 32751 56969 -55345 -287445 85405 -15617 -56034 139154 15293 -157800
6769 8030 294617 273665 93732 -117859 66911 -241976 247264 -63265 199299 -43833 -35897
6758 -35897 68050 -187544 105875 -12149 -149173 14448 -213761 -99375 -249312 177766 -238068
6746 7566 16033 -40463 -73403 -133985 228199 -91652 268195 -118795 21769 202641 -167728
6734 344567 101480 28984 46639 -197894 92947 87828 245541 48152 -175244 64394 -158228
6722 172493 62208 47691 -104158 190913 319310 -110658 31667 -145533 134656 108178
6712 108178 150652 412775 -202645 66661 151043 329922 171318 -54424 -81758 151369 -29950
6700 -40040 312839 -31330 -12889 -59897 -152495 175099 -79182 -7872 34287 -399553 -76779
6688 -72528 -10316 -40663 -472439 13517 124340 -119338 -35170 94534 -69767 -31370 -272913
6677 -272913 -120237 -173670 29164 -306860 -77622 106154 56649 52505 307972 -78458 -105153
6666 -105153 147705 -281419 -29453 -19583 4797 339885 21249 -292337 -56581 20159 67566
6655 67566 179752 64545 -155277 -29404 -14866 195483 132840 60671 -37327 -174786 1169
6643 497250 -91139 249624 162279 -353434 136897 -150451 14264 119724 -137733 -232816
6633 -232816 -7873 -133872 66979 -163600 -42768 -249176 25677 154444 -199484 -144603 53976
6621 96550 -89782 85211 -272685 6406 59491 83131 173157 250917 59133 40070 -427996 69885
6608 73805 -65195 -28031 116096 25764 1272 106095 -244490 -34008 -251318 149992 -130611
6596 -204680 135307 276387 114477 -120622 -17614 -159851 -341306 244979 26992 -77970
6585 168260 63191 63723 -108768 285649 -50433 145573 -63973 -66193 -19402 -331051 183389
6573 133485 70562 -104647 33766 151364 212747 -74940 -150507 86380 76613 132605 25867
6561 109265 -72735 -185929 158153 -73157 1022 -410341 60280 -10483 16831 108713 206906
6550 206906 -36550 -150185 -10912 30310 -214190 -180041 310574 -28239 -262111 41458 -22845
6538 -109117 -72137 175237 -21479 3745 -210336 -229591 -69082 -3640 -97236 -176610 24846 96013
6526 96013 46191 76954 53427 160676 324499 -211145 257939 -165730 -21874 297712 64867
6514 106293 146933 -65599 -39570 -128645 257238 -23126 -209299 194034 33786 -84382 82971
6502 90167 -63627 151782 27491 -108329 -8916 256917 -183431 -297211 -14904 -196132 47975
6490 -206724 -151510 36018 -238030 34275 -101719 -44981 -136818 -81935 -129350 260738 183473
6479 183473 -160131 -214990 103217 301343 -23449 -468072 32401 -226041 -260633 -80709 -63577
6468 -63577 46216 -126239 -201158 -39862 266208 -184450 -253289 257671 82278 -15642 106574
6456 -29099 219816 39960 -113034 -280397 -39038 446729 -367631 -44942 519160 -434083
6445 -15323 253622 32852 -113478 155555 -123049 -299968 89263 372037 88144 88368 24272
6433 81434 163405 83120 250699 -181918 282801 210643 130616 -91032 -174217 -78786 202703
6421 48384 20177 -223239 -75576 252310 -11064 24339 -34674 97032 -6595 -7809 15886 -153546
6408 96036 101408 -45924 313318 171244 -56139 -40240 79779 -49258 -73800 76805 -214959
6396 -156130 84912 147905 -194655 -61329 151811 -65105 -100169 14293 -2550 120598 217024
6385 217024 -20039 90162 -86455 74383 76790 163821 -116654 10582 128692 -15481 107429
6373 79384 235859 96531 116996 -164446 -82678 123374 -116610 -436042 -34027 -229301 91064
6361 28118 78033 -72234 -160070 36292 -455823 -219498 83193 -317436 -17019 -53608 -180895
6350 -180895 170462 -87756 77791 80536 156116 -6121 -190987 32390 86011 254671 -238427
6338 271833 -149166 1823 -82316 -162959 -91081 292274 77923 9563 131224 -53029 7436 51781
6326 51781 -272267 277780 -139953 -67268 85713 -246055 -20977 -26284 172093 -119927 -186377
6315 -186377 29115 216498 -142940 -3283 170384 -55201 124889 186875 92166 -193344 316391
6303 -147439 98055 350152 68466 -88353 -335168 -93514 -15822 -14121 -94737 274963 -234648
6291 -444726 343598 41505 40665 -309492 -28282 -35826 25861 -151195 236686 203227 142361
6280 142361 51431 173038 93707 -18770 111900 -87572 -220924 -17078 46984 218654 -317765
6268 198339 -127336 -56069 220266 50864 -254333 -297294 -51415 204976 -267984 -98554 52029
6256 -150411 51918 105573 -294784 -141251 -75387 -116667 -248328 -309289 83364 -3685 -59183
6245 -59183 185980 99597 -121713 -164624 62661 158763 -183506 -105564 215034 364454 185542
6234 185542 188298 -3891 189822 -76541 -282909 -95846 299076 -176839 -153260 -13455 -168999
6223 -168999 -131762 205941 99196 241314 68969 -35208 -117315 113934 -50617 -241568 92861
6211 -129583 155556 -443854 -4083 -198508 -111305 166496 -181115 -107640 89708 183289 196116
6200 196116 81680 -331602 -71148 361503 -58526 -283733 51729 -110801 -135230 -98035 9890
6188 -10310 198905 -1503 -309181 97742 52633 83521 -233703 53898 73156 232037 10209
6176 -21390 -291210 128215 165030 271276 -154310 236449 234916 234214 -68790 47916 -129375
6164 14317 -69410 40892 -31522 82737 253040 94054 -392379 71932 -18758 15962 188499
6153 188499 236355 35699 -21330 53520 97572 97258 -185078 -298003 68071 65396 -186860 182424
6140 -107834 -76472 -161049 124073 44738 -176453 269276 -130300 38624 -39159 206682 182216
6129 182216 -38287 -117738 -332417 -75984 309883 -44983 247791 -46984 -173592 -189837 -82899
6117 -48827 21565 -22348 159674 325597 156972 90814 -92138 -137999 101885 -198952 -318509
6106 -318509 -68014 17482 4484 -45142 -98649 -10686 -43254 33777 137533 26058 -193713
6094 84315 -165844 247013 -301626 51026 8541 -99997 -265394 96654 -10823 -60775 258175
6082 -74059 -146152 -94346 -181905 -104493 -124895 -47584 -114524 -294376 -346081 -280203 90697 -86826
6069 330798 -36394 49475 -88703 4203 -203424 -124173 47676 186978 79591 -38220 357284
6057 123957 -144208 -6391 -37361 60756 406918 -479408 -13000 273972 -31487 109468 71740
6046 71740 78142 -90471 211051 -81990 -225178 -34334 112758 -109092 222972 97985 -248552
6034 -346795 259440 -159742 308854 -82489 -613049 207123 244571 189048 33065 -172659
6023 116194 -31577 312135 30758 -74309 -53970 35207 43879 128172 254699 213508 -154709
6011 56936 3525 -146778 -77583 97852 -14383 -4404 124618 85447 -93093 166651 -39984 51618
5998 -100509 40303 63157 51144 -443749 267220 101496 231217 -164652 571481 221832
5987 19997 111605 150432 139955 199577 78096 -31994 -244394 -74179 -28498 318238 -147617
5975 -103984 -216534 -24423 -313195 173993 72810 -64889 -157162 -6412 90674 -18736 -70928
5964 -70928 49681 -43508 -82894 25869 -19627 -138480 -279077 160934 244356 -235598 -190212
5953 -190212 186694 -94796 -98194 -4845 153254 -49328 84111 112559 13854 5780 17712 -83059
5940 -268174 28870 -89760 -210374 -95606 -89402 24242 -109230 -276794 158147 287031 73042
5928 -229855 -54911 -245118 133340 121942 42257 78890 -14340 90936 -38343 -248914 -87094
5916 231601 -373884 46685 45613 -311966 -164078 -309281 170751 -202844 -153944 9287 -212090
5904 3973 256390 -472315 -203578 -293886 85067 302012 379319 -95733 -120485 -48704 -64655
5893 -64655 -76058 -1044 -22965 -60543 -22124 -92872 -193969 185328 -281362 48617 216200
5882 216200 -318372 146145 -149354 -187433 -31778 -218354 225503 195173 119864 -187724
5871 -20360 50074 87233 -83882 311018 239031 118177 -641217 111481 -106450 -116316 -26710
5859 252274 -56748 -325 317540 -50730 84503 136335 102137 327541 -284962 -91217 -70624
5848 -70624 -205474 -30086 -180769 38169 -157191 313864 -82181 -55228 -93449 -224360 41366
5836 -110204 126346 -131796 -242975 -49983 51474 -150656 -67235 88046 148110 184972 -69566
5824 -166748 118094 235054 -32357 -88858 -211892 100528 45105 79601 -22589 121135 291540
5813 291540 -98015 -184811 17747 -123131 290064 -176640 246823 -124018 -7155 59063 -339836
5801 -259087 342420 87747 80729 306814 295620 -45704 -554812 -152366 -186878 194637 201462
5790 201462 70951 -94247 248365 -90284 -487343 -164580 54037 -109109 247188 60691 173482
5779 173482 -183008 -89474 -9289 -79692 -59918 -89733 -35305 136629 -241998 -33324 -35943
5768 -35943 108963 -29246 43352 25977 136194 186011 70483 165011 -254543 95712 63430
5757 63430 -119082 -8202 -21717 -131808 -54908 -111491 -6194 -185892 48765 -48786 24935 95578
5745 95578 69106 -219976 -66796 -223007 -194497 -77858 454717 -9263 74800 -83687 326624
5733 -200902 -220014 184182 -260165 126133 -229874 -199923 -404381 276401 -11046 180736
5722 134921 76904 -147346 89434 -242270 19723 -98149 -323940 161564 -239699 -31996 19344
5710 77558 -83947 226086 -81632 -130687 -265166 -178678 -71915 117255 52457 -38741 85159
5698 -91357 -158233 202293 213534 52520 203713 -368917 -272406 -166101 311813 338333 -110831
5686 121694 -57893 120901 118235 -1267 -119401 946 99942 12939 3859 208343 39964 -104818
5673 -332236 -198381 202165 167605 61262 86866 -54770 -47579 133494 172625 -191320 -203065
5662 -203065 180273 80755 -158649 235858 10797 54939 169239 79635 -56544 75131 111268
5651 111268 -404123 297121 -287943 -40664 175669 197872 55375 40112 -135713 400547
5640 -207960 -320183 -139210 40602 242715 188798 108724 198676 -288113 43425 361126 72079
5628 182668 -263682 98868 -131987 133241 -67515 -10998 103525 334607 -134260 -43408
5617 127200 161867 100098 -15877 -51483 446887 -8836 181620 -169421 -342844 -58888 -121643
5606 -121643 40321 143029 -352437 -43753 -49849 9601 212215 82947 52818 148900 54659
5594 -174204 227471 -35340 39894 -258840 -18277 97178 -41977 -336098 -105712 71622 124507
5583 124507 35260 243098 -179697 -407304 39252 82410 -345680 84063 128033 182413 -277442
5571 -64250 20436 6852 -103153 297109 34449 -3691 96347 25980 -68465 -74237 3889 -42292
5558 -21990 239812 -264524 -132295 146812 -176348 -101417 -148224 -52514 222683 63178 29789
5546 193934 -104570 20709 5920 -97901 -118144 -177781 83164 -17978 239226 29125 219539
5535 219539 191824 -100473 -40434 32773 -149214 -202695 -237589 425793 -18196 64906 29779
5523 66307 29996 6580 -226669 -6163 80317 -84090 209138 124479 199970 426711 44320 -627315
5510 -25220 107219 574 58761 141221 225601 -134957 45930 246677 23430 151381 253666
5499 253666 -161808 -106766 419 -248108 -241179 -316027 3692 -194193 -331776 -165626 193220
5487 -154214 -206740 -277328 -78255 -111744 -164108 59277 296677 3475 257105 216172 1996 -193460
5474 42444 -178102 248262 -15726 242215 23866 93396 -66727 -270069 87650 27662 -183062
5462 219298 208545 22203 111387 20642 43372 -151080 67159 -49136 34231 16208 -85068
5450 157016 28762 109895 -112035 -51723 346 92793 192271 -121222 -62678 -64939 274894 -221715
5437 -185831 -141695 -545 182527 2869 -35576 296478 72569 -19340 -33500 -6637 -75780 -19850
5424 444448 116989 195546 104920 -89529 251254 -37420 179312 -101296 -178063 245041 108607
5412 24727 -327713 -75991 59305 137655 -291436 216663 -338573 -75492 -33577 90727 66980
5401 66980 -35546 117472 -5559 341399 -230567 242991 -13401 61403 -167039 112733 -129959
5389 92245 -55753 -62235 147489 172861 202836 -15907 226372 -248533 -109223 203280 -125924
5377 -22810 -4688 -64834 31096 263766 130960 181440 390386 -412888 248702 83658 242977
5366 242977 88087 -156405 -17458 116914 115003 278725 -257215 138817 103975 -176113 -145095
5355 -145095 262608 372482 54462 -39158 69238 -322224 1397 9599 -104156 108542 -28763
5343 -85792 -257400 -23150 9317 -179507 -387407 -389446 64868 -200354 -202187 -65431 -56579 -179717
5331 -179717 195619 100280 307492 17646 -159894 -23240 -110034 255989 144866 176034 -157331
5319 220118 54398 125484 -48823 -37590 296608 -21836 44549 -34231 209524 -169563 12620
5307 -123024 -118624 -24862 4072 -183166 111274 -137176 123736 -121909 89468 -103130 -189239
5296 -189239 71074 227306 -34065 178435 167015 77923 -167016 29753 163347 -392529 -281065
5285 -281065 -138330 -139608 159874 173284 -39300 17265 -492025 -17290 169256 -18696 -268049
5274 -268049 -223273 -46051 -93584 -127668 -23416 -63045 269023 212788 -252721 -34425 -400456
5263 -400456 -85903 -241917 148600 38922 108536 9558 123136 96916 -144779 -240871 -212842
5252 -212842 345493 105371 112154 62765 145152 -355070 330951 -150741 -8956 336421 -74225
5240 -15940 306856 335237 -35675 58407 -26518 -125471 166653 95950 93377 180301 -258368
5228 151055 128367 -354011 -127145 -41579 -170596 23060 204329 -29267 -152888 81566 118806
5217 118806 292460 88452 162923 -183142 -32801 135173 -152319 -22343 89781 102491 -36373
5205 8433 35118 108705 129992 41770 -121091 -167786 134018 20408 306527 311136 289940 -199277
5192 86721 -78737 195501 47374 236442 110027 184005 29068 -171714 -158686 -93684 -99354
5181 -99354 -68263 -416243 443892 -197493 150696 505486 76422 154083 -76418 -12959 74223
5169 160857 -194686 -77745 -49279 23010 -33257 -130484 268463 58959 -269212 -15751 75424
5157 -30527 167115 -34363 -70432 -177791 -68094 -200742 -227290 145587 -72175 -202187 -55022
5145 122710 -44580 107368 13155 112458 10580 158920 -64611 280327 174253 164747 -260618
5133 313015 61917 -98540 154080 -21003 -239767 369174 -76226 362098 -224802 24072 351268
5122 351268 -178692 -106936 216540 168324 170821 57496 113890 -167624 -272955 148044 205869
5111 205869 -146732 -142453 44042 16502 74024 -174242 -102843 6281 156155 -159652 -43459
5099 -96084 16499 151926 -198369 -134451 20144 -168889 250583 265773 242946 49798 -525
5087 236138 355241 -99600 -255106 -34334 -161550 34969 -10642 -16027 -201299 -50280 -484463
5076 -484463 176167 240131 408824 -312071 45323 -340604 -95644 -80483 -47258 -228625 -228492
5065 -228492 107371 -66120 -255004 169116 131822 -60269 -112350 -158013 92398 -162322 34344
5053 128353 138863 169957 226026 -74875 151669 112359 18421 196315 19264 -9998 -105203
5042 -105203 -136872 -102949 310426 -181039 51823 98838 -52814 291337 -160077 -134722 -174156
5031 -174156 -238251 -190461 47206 156468 -41919 -99158 -180764 122718 207999 331282 -256805
5019 -6023 -127256 46075 -30784 -407587 295353 -356899 42991 54885 50478 -38402 -132540
5008 -132540 109842 -91125 -191896 162356 194388 45770 -10896 80874 51655 169658 22435
4996 -84741 123474 86489 -364402 54669 -28112 169919 -85415 18121 -279698 111689 -139112
4984 190397 -154894 -243480 10544 -41095 -135232 163216 -100837 113220 60732 -370979 -68721
4972 374895 -114340 -265644 279087 71185 -92647 -471267 -28480 44809 169095 195329 534122
4961 534122 21150 67435 294212 -161092 -81580 -2156 101446 26719 -233077 -65101 -240719
4950 -240719 -146031 124272 -105954 -97274 -163750 85793 220250 -46808 -23142 -122936 95623
4938 -52398 237124 206061 69346 21069 72984 -210047 -456 -153225 12674 -82570 140651
4926 45246 7089 39470 59308 142459 165417 230512 78911 -116028 -215596 -366522 126453
4914 167150 52838 -143940 -60554 -21480 -37265 11089 79984 22501 199778 -71105 32270
4902 56868 -240156 -433378 15716 -75607 -118167 9666 270407 116979 -34465 -16034 -122302
4891 -122302 -299188 140191 163131 -270677 -189691 2286 -44883 36145 302199 -71415 -138371
4880 -138371 30517 69300 187432 66864 -149364 198447 111222 59827 -255870 110197 -39417
4868 160943 157781 80794 146998 -98714 -211471 60379 119336 84962 -213661 278653 344064
4857 344064 -17532 183307 47658 5677 -334658 64707 -199897 -129808 -168407 159212 33946
4845 259662 -123334 -97111 302903 229247 -40266 77474 359901 135697 -159748 -149773 -9996
4833 -349472 75505 -88075 460504 -9763 -237560 189584 -108152 88977 79661 -163527 224486
4821 -10303 -243264 111715 -356680 -80906 -257770 97174 90369 -186505 -90677 80898 243903
4810 243903 193742 118179 -131659 -123940 185812 -145946 -116613 -105113 162475 -195190 39752
4798 196728 373441 -92616 396558 -269162 -150291 270148 296103 -269780 272821 -89051
4787 -68834 131186 60507 280143 -315269 -198578 40479 152866 15345 69377 82797 -11504
4775 -123511 -246976 260920 -183499 -109478 -175935 98006 -121886 348854 -135124 -53402
4764 52105 209824 31782 5495 -259988 -146069 -166693 183984 4983 214995 19535 280687
4753 280687 -161632 5088 11782 75120 14055 -53672 -11729 -49333 84472 -57076 102506 29811
4740 19638 -9071 -292603 -226686 -170568 235126 -90758 -75314 -54138 110808 -66830 -118291
4729 -118291 8133 103024 376194 -107615 -84719 -240765 -40781 -111239 67726 -106350 -96294
4718 -96294 26353 -54722 35198 -91510 -6862 51169 367068 -180475 -87230 331571 82450
4706 -381542 -259924 322130 -54570 -255230 -390529 -106075 301652 363598 -110731 -393712
4696 -393712 -152094 -346022 234025 105003 206390 66447 219854 -380275 -31812 43450
4685 -291115 -47781 -86442 -280687 133935 62919 182486 -82819 541158 -25089 -177074 428465
4673 50261 223730 -72987 110449 -14161 -113553 311159 -4285 45253 50527 27733 268353
4662 268353 -65287 -96723 113170 -239362 -138788 43204 148682 371778 -236963 117741
4651 37264 17119 -150336 403897 -12585 -184544 426823 95931 174483 88445 -19520 342318
4639 -101414 -184488 -56537 -183874 75113 -63817 -153458 225503 7931 22353 115340 -186675
4627 -26859 60447 65146 -138674 299134 -126824 -233673 -9682 165112 149547 91935 -245472
4615 41578 -43843 -299036 -85620 -7584 -135086 55170 404985 108318 -130217 34803 105854
4604 105854 -307904 -127480 49165 320189 -76649 58652 19320 132238 -290168 -17188 -15411
4593 -15411 54061 43191 -114466 62228 49960 -135913 -82728 -150111 -55118 122825 47695
4581 -40140 52443 -58751 -296031 4526 -132116 80005 -69116 -68851 -73855 300417 -206363 144287
4568 139879 -159383 -36049 -9516 -86694 -173511 -192164 -50576 193448 92419 -36338 165588
4556 -140101 -131417 93457 -57414 132068 -135701 -43339 173447 -599038 379071 107337 862
4544 -112793 -86907 -131821 41620 109354 -111277 245732 -17615 -15889 -24243 228614 29701
4532 -109955 -94283 -77632 -172441 76484 35642 52738 -12150 -159989 344644 -380096 221952
4520 -173935 16002 328222 145442 326940 -20959 288489 102388 12675 166759 -153769
4509 -77237 11566 -154524 87284 -38154 319313 -159991 41906 151330 129003 -148555 122038
4497 103927 -5886 -75179 -132669 -169716 -205486 -27543 223732 101709 47243 -19290 -45483
4486 -45483 12177 -15501 3103 462086 104099 -97718 -365622 65612 47793 56379 182661
$$ [...]
##END NTUPLES=NMR SPECTRUM
##END=
