##TITLE=AC1515_ROEFFECT0003_8201897_h56B3qxHBn
##JCAMPDX= 6.0         $$ Bruker NMR JCAMP-DX V2.0
##DATA TYPE= NMR SPECTRUM
##DATA CLASS= NTUPLES
##ORIGIN= BRUKER
##OWNER= Administrator
$$ 1.72 TOPSPIN		Version 2.1
$$ 2013-09-26 19:36:06.922 -0700  Administrator@X
$$ Compression mode = diff/dup
##.OBSERVE FREQUENCY= 400.02188249412
##.OBSERVE NUCLEUS= ^1H
##.ACQUISITION MODE= SIMULTANEOUS (DQD)
##.ACQUISITION SCHEME= undefined
##.AVERAGES= 64
##.DIGITISER RES= 22
##SPECTROMETER/DATA SYSTEM= spect
##.PULSE SEQUENCE= noesygpps1d.comp
##.SOLVENT NAME= COFFEE_meoh
##.SHIFT REFERENCE= INTERNAL, COFFEE_meoh, 1, 14.96046
##AUDIT TRAIL= $$ (NUMBER, WHEN, WHO, WHERE, PROCESS, VERSION, WHAT)
$$ ##TITLE= Audit trail, TOPSPIN		Version 2.1
$$ ##JCAMPDX= 5.01
$$ ##ORIGIN= Bruker BioSpin GmbH
$$ ##OWNER= Administrator
$$ $$ E:\/data/COFFEE/nmr/AC1515_ROEFFECT0003_8201897_h56B3qxHBn/12/pdata/1/auditp.txt
$$ ##AUDIT TRAIL=  $$ (NUMBER, WHEN, WHO, WHERE, PROCESS, VERSION, WHAT)
(   1,<2013-09-26 19:36:02.052 -0700>,<Administrator>,<X>,<go>,<TOPSPIN 2.1>,
      <created by zg
	started at 2013-09-26 19:24:32.468 -0700,
	POWCHK enabled, PULCHK disabled,
       configuration hash MD5:
       C8 4E 4E 5D D3 5C D8 9E 9F 52 82 E0 59 8A DE 15
       data hash MD5: 64K
       0F 79 EC D1 CA CE 5D 8C 69 27 B8 DA 24 9E 65 A4>)
(   2,<2013-09-26 19:36:04.931 -0700>,<Administrator>,<X>,<proc1d>,<TOPSPIN 2.1>,
      <Start of raw data processing
       efp LB = 0.3 FT_mod = 6 PKNL = 1 PHC0 = 0 PHC1 = 0 SI = 128K 
       data hash MD5: 128K
       31 0F 70 95 53 CE 5B 07 F7 C4 30 E2 E2 2E 78 C8>)
(   3,<2013-09-26 19:36:05.927 -0700>,<Administrator>,<X>,<proc1d>,<TOPSPIN 2.1>,
      <pk PHC0 = -81.82068 PHC1 = 0 
       data hash MD5: 128K
       36 29 49 92 65 16 3D 3E 97 E7 55 BB 29 54 8D E1>)
(   4,<2013-09-26 19:36:06.340 -0700>,<Administrator>,<X>,<proc1d>,<TOPSPIN 2.1>,
      <abs ABSG = 1 
       data hash MD5: 128K
       56 A4 D9 9D 50 8A 03 A3 AF 73 D8 3D A6 D7 27 67>)
(   5,<2013-09-26 19:36:06.463 -0700>,<Administrator>,<X>,<proc1d>,<TOPSPIN 2.1>,
      <abs ABSG = 2 
       data hash MD5: 128K
       74 4B CD 1E 2B F7 6A 50 54 90 07 6A 42 A5 1B A5>)
(   6,<2013-09-26 19:36:06.539 -0700>,<Administrator>,<X>,<proc1d>,<TOPSPIN 2.1>,
      <abs ABSG = 3 
       data hash MD5: 128K
       E1 9C 1B 9B 4A 30 9D A9 BE EE 77 71 23 F6 BA 35>)
(   7,<2013-09-26 19:36:06.616 -0700>,<Administrator>,<X>,<proc1d>,<TOPSPIN 2.1>,
      <abs ABSG = 4 
       data hash MD5: 128K
       1C 98 47 5C 73 9F 54 C0 E6 7B 86 03 23 A2 3C D3>)
(   8,<2013-09-26 19:36:06.754 -0700>,<Administrator>,<X>,<proc1d>,<TOPSPIN 2.1>,
      <abs ABSG = 5 
       data hash MD5: 128K
       96 2B AD D8 0F 22 9C F0 58 EA 5C 4C 36 39 6D ED>)
$$ ##END=
$$ 
$$ $$ hash MD5
$$ $$ 44 F6 21 11 87 4B 22 A2 30 85 31 D7 A1 6C 98 B9
##$RELAX= 
##$RELAX= 
##$RELAX= 
##$RELAX= 
##$RELAX= 
##$RELAX= 
##$RELAX= 
##$RELAX= 
$$ Bruker specific parameters
$$ --------------------------
##$DU= <E:\>
##$EXPNO= 12
$$ [...]
##$TP07= 0
##$TPNAME0= <>
##$TPNAME1= <>
##$TPNAME2= <>
##$TPNAME3= <>
##$TPNAME4= <>
##$TPNAME5= <>
##$TPNAME6= <>
##$TPNAME7= <>
##$TPOAL= (0..7)
0.5 0.5 0.5 0.5 0.5 0.5 0.5 0.5
##$TPOFFS= (0..7)
0 0 0 0 0 0 0 0
##$TUNHIN= 0
##$TUNHOUT= 0
##$TUNXOUT= 0
##$USERA1= <user>
##$USERA2= <user>
##$USERA3= <user>
##$USERA4= <user>
##$USERA5= <user>
##$V9= 5
##$VALIST= <valist>
##$VCLIST= <CCCCCCCCCCCCCCC>
##$VD= 0
##$VDLIST= <DDDDDDDDDDDDDDD>
##$VPLIST= <PPPPPPPPPPPPPPP>
##$VTLIST= <TTTTTTTTTTTTTTT>
##$WBST= 1024
##$WBSW= 4
##$XGAIN= (0..3)
0 0 0 0
##$XL= 0
##$YL= 0
##$YMAX_a= 7439937
##$YMIN_a= -14235701
##$ZGOPTNS= <>
##$ZL1= 120
##$ZL2= 120
##$ZL3= 120
##$ZL4= 120
##$ABSF1= 14.96046
##$ABSF2= -5.597722
##$ABSG= 5
##$ABSL= 3
##$ALPHA= 0
##$AQORDER= 0
##$ASSFAC= 0
##$ASSFACI= 0
##$ASSFACX= 0
##$ASSWID= 0
##$AUNMP= <proc_prof1d_extract.lims>
##$AXLEFT= 0
##$AXNAME= <>
##$AXNUC= <1H>
##$AXRIGHT= 0
##$AXTYPE= 0
##$AXUNIT= <>
##$AZFE= 0.1
##$AZFW= 0.1
##$BCFW= 0
##$BC_mod= 0
##$BYTORDP= 0
##$COROFFS= 0
##$CY= 15
##$DATMOD= 1
##$DC= 0
##$DFILT= <>
##$DTYPP= 0
##$F1P= 0
##$F2P= 0
##$FCOR= 0.5
##$FTSIZE= 131072
##$FT_mod= 6
##$GAMMA= 0
##$GB= 0
##$INTBC= 1
##$INTSCL= 1
##$ISEN= 128
##$LB= 0.3
##$LEV0= 0
##$LPBIN= 0
##$MAXI= 10000
##$MC2= 0
##$MEAN= 0
##$ME_mod= 0
##$MI= 0
##$NCOEF= 0
##$NC_proc= -2
##$NLEV= 6
##$NOISF1= 0
##$NOISF2= 0
##$NSP= 0
##$NTH_PI= 0
##$NZP= 0
##$OFFSET= 14.96046
##$PC= 1
##$PHC0= -81.82068
##$PHC1= 0
##$PH_mod= 1
##$PKNL= yes
##$PPARMOD= 0
##$PPDIAG= 0
##$PPIPTYP= 0
##$PPMPNUM= 2147483647
##$PPRESOL= 1
##$PSCAL= 4
##$PSIGN= 0
##$PYNMP= <proc.py>
##$REVERSE= no
##$SF= 400.020009851428
##$SI= 131072
##$SIGF1= 0
##$SIGF2= 0
##$SINO= 400
##$SIOLD= 131072
##$SPECTYP= <>
##$SREGLST= <1H.CDCl3>
##$SSB= 0
##$STSI= 131072
##$STSR= 0
##$SW_p= 8223.68421052631
##$SYMM= 0
##$S_DEV= 0
##$TDeff= 65536
##$TDoff= 0
##$TI= <>
##$TILT= no
##$TM1= 0
##$TM2= 0
##$TOPLEV= 0
##$USERP1= <user>
##$USERP2= <user>
##$USERP3= <user>
##$USERP4= <user>
##$USERP5= <user>
##$WDW= 1
##$XDIM= 131072
##$YMAX_p= 413051223
##$YMIN_p= -16787
##$CURPLOT= <Network HP LaserJet P1505>
##$CURPRIN= <$Network HP LaserJet P1505>
##$DFORMAT= <normdp>
##$LAYOUT= <+/1D_H.xwp>
##$LFORMAT= <normlp>
##$PFORMAT= <normpl>
##$SURQMSG= 1
$$ End of Bruker specific parameters
$$ ---------------------------------
##NTUPLES= NMR SPECTRUM
##VAR_NAME=  FREQUENCY,     SPECTRUM/REAL,   SPECTRUM/IMAG
##SYMBOL=    X,             R,               I
##VAR_TYPE=  INDEPENDENT,   DEPENDENT,       DEPENDENT
##VAR_FORM=  AFFN,          ASDF,            ASDF
##VAR_DIM=   131072,        131072,          131072
##UNITS=     HZ,            ARBITRARY UNITS, ARBITRARY UNITS
##FACTOR=    0.0627417313425164, 1,          1
##FIRST=     8223.62146879497, -1385,        -76244
##LAST=      0,             931,             -76973
##MIN=       0,             -16787,          0
##MAX=       8223.62146879497, 413051223,    0
$$ Real data points
##PAGE= N=1
##DATA TABLE= (X++(R..R)), XYDATA
$$ [...]
63740B78975P22J135J223J692K563L160L062K615K415K678L318M302N469O238
63726C19567O006M963M103M243N255O389P117P382P253O690N682M378K980J627
63712C93635L68q38k078l314m262m667m680m764n051n037m157k618j328r28j107
63697C49174j062n04J24L96N92J305K549L605L847L446L070L068L227L205K931
63682C78973K531K114J763J530J338J046O94N32O64Q52Q66Q57J115J571J896K113
63666D00455K672L740M732M837L858K273N53j184k878m186m743m571m096l792
63652C97670l918m469n148n419m775l161j030J021K695M061N319O616Q020R469
63638D06951J0735J1567J1940J2052J2072J2066J2162J2561J3157J3342J2557
$$ y = [278975, 279697, 280832, 282055, 283747, 286310, 289470, 292532, 295147, 297562, 300240, 303558, 307860, 313329, 319567, 325573, 330536, 334639, 338882, 344137, 350526, 357643, 365025, 372278, 378968, 384650, 389028, 392008, 393635, 394003, 393165, 391087, 387773, 383511, 378844, 374164, 369400, 364349, 359312, 355155, 352537, 351209, 350281, 349174, 348112, 347608, 347732, 348128, 348720, 350025, 352574, 356179, 360026, 363472, 366542, 369610, 372837, 376042, 378973, 381504, 383618, 385381, 386911, 388249, 389295, 389989, 390521, 391185, 392037, 392903, 393760, 394875, 396446, 398342, 400455, 403127, 406867, 411599, 416436, 420294, 422567, 423120, 421936, 419058, 414872, 410129, 405558, 401462, 397670, 393752, 389283, 384135, 378716, 373941, 370780, 369750, 370771, 373466, 377527, 382846, 389462, 397482, 406951, 417686, 429253, 441193, 453245, 465317, 477383, 489545, 502106, 515263, 528605, 541162]
63627E41162J0905Q984P160N422L929L112L006K953K478K154L015N242P941J0333
63613F17796J2587J5211J8087K0533K2302K4013K6467K9594L2385L3921L4344
63602H87240L4444L4282L2729K8704K2534J5571Q744K228l603p819r964j0743
63590A034347j1138j1415j1528j2027j3742j6699k0093k3231k5968k8173k9484
63579H30849k9738k9170k8010k6260k3981k1351j8364j4948j1524q914p370o166
63567F05053m467k212K03K623M986O834P678P817Q237R565J1484J3305J4730J6018
63553G01854J7639J9939K3012K6813L1419L7021M3585N0795N8560O7173P6302
63542A154112Q3881Q6639Q2047O9637N0672K7466L355j7555l1948l8999m0285
$$ y = [541162, 552067, 561051, 568211, 573633, 577562, 580674, 583680, 586633, 589111, 591265, 594280, 599522, 607463, 617796, 630383, 645594, 663681, 684214, 706516, 730529, 756996, 786590, 818975, 852896, 887240, 921684, 955966, 988695, 1017399, 1039933, 1055504, 1064248, 1066476, 1062873, 1055054, 1045090, 1034347, 1023209, 1011794, 1000266, 988239, 974497, 957798, 937705, 914474, 888506, 860333, 830849, 801111, 771941, 743931, 717671, 693690, 672339, 653975, 639027, 627503, 618589, 611219, 605053, 600586, 598374, 598577, 601200, 606186, 613020, 620698, 628515, 636752, 646317, 657801, 671106, 685836, 701854, 719493, 739432, 762444, 789257, 820676, 857697, 901282, 952077, 1010637, 1077810, 1154112, 1237993, 1324632, 1406679, 1476316, 1526988, 1554454, 1557809, 1540254, 1508306, 1469307, 1429022]
63531A429022l8003l3646k8271k3272k0124j9348k0177k1567k3375k6255l0472
63520A144512l5165l9003m1338m2319m2121m0542l7632l4141l0986k8349k5679
63509G47237k2584j9387j6752j4972j3772j2679j1516j0484r898r912j0501j1512
63497E83268j2567j3039j2482j1162r915r259q907q270p208n985m754l506k411
63484D73803j743j397q22L80K059L779N235O290O906P264P730Q424Q941Q755P915
63469E43519P045O651O586O357N769N141M888N119N721O614P720Q692R032Q593
63455F37447P740O805N579L676J277q47k098k455k143j236J49J701L230N025P459
63440F71309J0431J3557J6998K1634K8230L6641M6121N6212O6842P7233Q4982
$$ y = [1429022, 1391019, 1357373, 1329102, 1305830, 1285706, 1266358, 1246181, 1224614, 1201239, 1174984, 1144512, 1109347, 1070344, 1029006, 986687, 944566, 904024, 866392, 832251, 801265, 772916, 747237, 724653, 705266, 688514, 673542, 659770, 647091, 635575, 625091, 615193, 605281, 594780, 583268, 570701, 557662, 545180, 534018, 524103, 514844, 505937, 497667, 490459, 484474, 479720, 476214, 473803, 472060, 470663, 469841, 470221, 472280, 476059, 481294, 487584, 494490, 501754, 509484, 517908, 526849, 535604, 543519, 550564, 557215, 563801, 570158, 575927, 581068, 585956, 591075, 596796, 603410, 611130, 619822, 628854, 637447, 645187, 651992, 657571, 661247, 662524, 661677, 659579, 657124, 654981, 653745, 653894, 655595, 658825, 663850, 671309, 681740, 695297, 712295, 733929, 762159, 798800, 844921, 901133, 967975, 1045208, 1130190]
63429A130190Q6676P9774O4122M1948J6806p497k7639m1403m8050m8130m2906
63418A203891l3981k3155j2043j558Q120J6901K4275K9547L2325L2591L0416K5850
63406A333179J9161J1116K928m172r493j3056j5237j6353j6741j7056j8087k0274
63394A235915k3600k7860l2673l7266m0752m2795m3668m3531m2123l9454l6275
63383H25918l3455l1109k8720k5836k2359j8467j4639j1489r144o948m212j061
63371F18479J867M291O435Q520J0637J2945J5524J8143K0706K3773K7997L3098
63359H02415L8031M2190M5809M9103N1806N3770N5316N6525N6736N5120N1432
63348A358253M5810L8325K9225J9372R938J748m903r889j3074j4403j4082j2809
$$ y = [1130190, 1216866, 1296640, 1360762, 1402710, 1419516, 1412019, 1384380, 1342977, 1294927, 1246797, 1203891, 1169910, 1146755, 1134712, 1133154, 1141274, 1158175, 1182450, 1211997, 1244322, 1276913, 1307329, 1333179, 1352340, 1363456, 1366384, 1362212, 1352719, 1339663, 1324426, 1308073, 1291332, 1274276, 1256189, 1235915, 1212315, 1184455, 1151782, 1114516, 1073764, 1030969, 987301, 943770, 901647, 862193, 825918, 792463, 761354, 732634, 706798, 684439, 665972, 651333, 639844, 630700, 623752, 619540, 618479, 620346, 624637, 631072, 639592, 650229, 663174, 678698, 696841, 717547, 741320, 769317, 802415, 840446, 882636, 928445, 977548, 1029354, 1083124, 1138440, 1194965, 1251701, 1306821, 1358253, 1404063, 1442388, 1471613, 1490985, 1500923, 1502671, 1497768, 1487879, 1474805, 1460402, 1446320, 1433511]
63336A433511j1778j2138j4206j7490k1528k6229l1243l5587l8420l9831m0330
63325A144731l9750l7245l2339k5598j8131j0656l100M867J2598J7660J6705P880
63313A037622p458k5516m2286n4985o2017o2873n8529n1389m3993l7613l2111
63302E58852k6976k2142j7851j4177j1055q661p352p107p315p300o798n840m539
63289D11739l313k855l323l881l761l434l880m815m817l388j743j034q42k17P04
63274C71140J158J183J453J997K128J650J163J164J495J807J885J527P34J07M58
63259C91049J888L662N105O171P154Q258R414J0116R666Q076O483O064O638P119
63245D86863P137P264P699P870P674Q072R730J1926J3466J4137J4537J4897J4975
$$ y = [1433511, 1421733, 1409595, 1395389, 1377899, 1356371, 1330142, 1298899, 1263312, 1224892, 1185061, 1144731, 1104981, 1067736, 1035397, 1009799, 991668, 981012, 977912, 982779, 995377, 1013037, 1029742, 1037622, 1030164, 1004648, 962362, 907377, 845360, 782487, 723958, 672569, 628576, 590963, 558852, 531876, 509734, 491883, 477706, 466651, 457990, 450638, 443531, 436216, 428916, 422118, 416278, 411739, 408426, 405571, 402248, 398367, 394606, 391172, 387292, 382477, 377660, 374272, 372529, 371495, 370653, 370436, 371140, 372298, 373481, 374934, 376931, 379059, 380709, 381872, 383036, 384531, 386338, 388223, 389750, 390484, 390591, 391049, 392937, 396599, 401704, 407875, 415029, 423287, 432701, 442817, 452483, 460559, 467042, 473106, 479744, 486863, 494000, 501264, 508963, 516833, 524507, 532579, 542309, 554235, 567701, 581838, 596375, 611272, 626247]
63232F26247J4818J4940J5628J6600J7409J7886J8124J8317J8633J9139J9824
63221H17565K0640K1424K1870K1825K1623K1710K1903K1433J9841J7413J4511
63210A041758J0989O560J418l952r341j4818k0253k5146k8845l0876l1208l0356
63198H65930k8988k7303k5058k2185j9012j5796j2496r208o260l596n94L018O669
63185G05121R842J2979J6707K0607K3569K5237K6234K6936K6897K5637K3361K0530
63173I63657J7343J3954J0749P971N481L216J539O44o2j529m100p467j1394j5919
63159I84083k0741k5050k8322l0912l3397l5520l6274l5082l2493k9583k7007
63148F49702k4785k2696k0564j8275j5861j3588j1771j0418r195p763o127m669
$$ y = [626247, 641065, 656005, 671633, 688233, 705642, 723528, 741652, 759969, 778602, 797741, 817565, 838205, 859629, 881499, 903324, 924947, 946657, 968560, 989993, 1009834, 1027247, 1041758, 1052747, 1059307, 1060725, 1056773, 1047432, 1032614, 1012361, 987215, 958370, 927494, 896286, 865930, 836942, 809639, 784581, 762396, 743384, 727588, 715092, 705884, 699624, 696028, 695434, 698452, 705121, 714963, 727942, 744649, 765256, 788825, 814062, 840296, 867232, 894129, 919766, 943127, 963657, 981000, 994954, 1005703, 1013674, 1019155, 1022371, 1023910, 1024554, 1024492, 1022963, 1018863, 1011396, 1000002, 984083, 963342, 938292, 909970, 879058, 845661, 810141, 773867, 738785, 706292, 676709, 649702, 624917, 602221, 581657, 563382, 547521, 533933, 522162, 511744, 502549, 494786, 488659, 483990]
63136D83990l764l256k565j555j074k037l934n077m623l617l418l846l757k894
63122D38573k041j610j259r25r81j146l78J579L496M162L838L583L745L898L773
63107D58307L516L266L060L006L175L526M232N693P906J0218J2158J4001J6136
63094E48200J8407K0529K2620K4575K5375K3839J9900J4434Q102J065o239j2800
63082G08007j7676k0471k1288k0558j8895j6610j3565r854o360l995k532q41J728
63069E57090M709P198Q705R326R615J0254J1561J3323J5314J7629K0202K2552
63057G07478K4553K6947L0281L3842L6616L8865M1614M4746M7002M7957M8637
63046A128538M9857N1140N1876N2352N2918N3108N2537N1949N2432N4059N6058
$$ y = [483990, 480226, 476970, 474405, 472850, 471776, 469739, 465805, 460728, 456105, 452488, 449070, 445224, 441467, 438573, 436532, 434922, 433663, 432738, 431757, 430611, 430233, 431812, 435308, 439470, 443308, 446891, 450636, 454534, 458307, 461823, 465089, 468149, 471155, 474330, 477856, 482088, 487781, 495687, 505905, 518063, 532064, 548200, 566607, 587136, 609756, 634331, 659706, 683545, 703445, 717879, 725981, 727046, 720807, 708007, 690331, 669860, 648572, 628014, 609119, 592509, 578944, 569090, 562730, 558735, 556203, 555362, 557090, 561799, 568997, 577702, 587028, 596643, 606897, 618458, 631781, 647095, 664724, 684926, 707478, 732031, 758978, 789259, 823101, 859717, 898582, 940196, 984942, 1031944, 1079901, 1128538, 1178395, 1229535, 1281411, 1333763, 1386681, 1439789, 1492326, 1544275, 1596707, 1650766, 1706824]
63035A706824N7802N8848N8500N6353N3034M9367M4864L7894K7673J5287K481
63024B168927j0014k2506l5077m6894n6782o4162o9243p2422p3704p2732o9277
63013A576114o3628n6560m9015m1586l4160k6214j7699r367j926M933J2032J9299
63001A312223K5436K9204L0590L0526K9850K8724K6801K3788K0140J7092J5620
62990A589994J5311J4930J4095J3670J4163J4538J3322J0305O350J851l763j0873
62978A693893j8838k6573l3610m0196m6498n2065n6190n8551n9286n8521n6322
62967A187243n3256n0411m8278m5999m2468l8002l4000l1050k8410k5546k3035
62956G66788k1371j9901j7788j5337j3506j2602j2316j2537j3240j3809j3447
$$ y = [1706824, 1764626, 1823474, 1881974, 1938327, 1991361, 2040728, 2085592, 2123486, 2151159, 2166446, 2168927, 2158913, 2136407, 2101330, 2054436, 1997654, 1933492, 1864249, 1791827, 1718123, 1645391, 1576114, 1512486, 1455926, 1406911, 1365325, 1331165, 1304951, 1287252, 1277885, 1275959, 1280892, 1292924, 1312223, 1337659, 1366863, 1397453, 1427979, 1457829, 1486553, 1513354, 1537142, 1557282, 1574374, 1589994, 1605305, 1620235, 1634330, 1648000, 1662163, 1676701, 1690023, 1700328, 1706678, 1708529, 1704766, 1693893, 1675055, 1648482, 1614872, 1574676, 1528178, 1476113, 1419923, 1361372, 1302086, 1243565, 1187243, 1133987, 1083576, 1035298, 989299, 946831, 908829, 874829, 843779, 815369, 789823, 766788, 745417, 725516, 707728, 692391, 678885, 666283, 653967, 641430, 628190, 614381, 600934]
62945F00934j2159j0639r307q145p276o935o875o567n964n452m990m093k700j373
62931E08459m77J67O16N25j78r00j124j034j046j090p94q7P12J266J481J497J681
62914E09674K334L336M234M824N377O123O764O682N486L190J36l047n602p119
62900E42392p814q184q358p995o783m942l082j555j21J550L143L813L189J855
62886E07108O50k32j024j622j577q14K03J012J464J547J423J559K276L052K911
62871E17936J665J90q37j829l412n182n965n185l489k058j592j917k288k102j483
62856D82452j054j064j083p21k30l9m7J05L41L32K30N87J447K134K130J673J255
62839D88448R74P37P07J084J592J709J353J021J112J475J841K367L440M944O189
$$ y = [600934, 588775, 578136, 568829, 560684, 553408, 546473, 539598, 533031, 527067, 521615, 516625, 512532, 509832, 508459, 507982, 508149, 508765, 509290, 509112, 508212, 507088, 506054, 505008, 503918, 503124, 503037, 503749, 505015, 506496, 507993, 509674, 512008, 515344, 519578, 524402, 529779, 535902, 542666, 549348, 554834, 558024, 558160, 555113, 549511, 542392, 534578, 526394, 518036, 510041, 503258, 498316, 495234, 493679, 493558, 495108, 498251, 502064, 505253, 507108, 507758, 507526, 506502, 504880, 503303, 502489, 502692, 503704, 505168, 506715, 508138, 509697, 511973, 515025, 517936, 519601, 519791, 518954, 517125, 513713, 508531, 502566, 497381, 493892, 491834, 490242, 488325, 486037, 483935, 482452, 481398, 480334, 479251, 478530, 478300, 478261, 478214, 478319, 478660, 478992, 479222, 479809, 481256, 483390, 485520, 487193, 488448, 489422, 490159, 490866, 491950, 493542, 495251, 496604, 497625, 498737, 500212, 502053, 504420, 507860, 512804, 518993]
62824E18993O641O526O415O399N998M940L572K374J359L00o49j055q87p34j062
62809E59130j583j561o43Q92K598M226N587O359O429O278O721Q123J0021J1711
62795F24288J2982J4095J5224J6292J7346J8712K0575K2750K5057K7677L0844
62784H45842L4428L8235M2500M7649N3568N9614O5417P1157P6918Q2282Q6815
62773A504425R0432R2830R3046R0231Q4640P7176O8011N6461M2326K6685J0981
62762B237244m212j9098l3682m7342n9220o8718p5741q0648q3848q5366q5034
62751A594335q3220q0829p8254p4857p0076o4636n9858n5917n1695m6480m0947
62740H87566l6190l2497k9582k7294k5436k3363k0595j7603j5249j3485j1420
$$ y = [518993, 525634, 532160, 538575, 544974, 550972, 555912, 559484, 561858, 563217, 563517, 562868, 561813, 560926, 560192, 559130, 557547, 555986, 555343, 556235, 558833, 563059, 568646, 575005, 581434, 587712, 594433, 602556, 612577, 624288, 637270, 651365, 666589, 682881, 700227, 718939, 739514, 762264, 787321, 814998, 845842, 880270, 918505, 961005, 1008654, 1062222, 1121836, 1187253, 1258410, 1335328, 1417610, 1504425, 1594857, 1687687, 1780733, 1870964, 1955604, 2032780, 2100791, 2157252, 2199578, 2226263, 2237244, 2233032, 2213934, 2180252, 2132910, 2073690, 2004972, 1929231, 1848583, 1764735, 1679369, 1594335, 1511115, 1430286, 1352032, 1277175, 1207099, 1142463, 1082605, 1026688, 974993, 928513, 887566, 851376, 818879, 789297, 762003, 736567, 713204, 692609, 675006, 659757, 646272, 634852]
62729F34852q708o176m661l984l537l287l465l557k540k69K143L585M080M273
62715F08749M434M571N156O839R490J2238J4566J6762J9129K1467K3713K6363
62703G73477K9775L3493L6865L9965M3365M7278N1472N5710N9681O2822O4848
62692A298751O6215O7335O7547O5703O1616N6040M9227M0532K9676J7432M742
62681A824816q025k0538l2129m2437n1667n9640o5390o8344o9232o9057o7788
62670A270569o4971o1054n7133n3621n0087m6257m2290l8234l4063l0281k7601
62659G64977k5879k4088k1546j8640j6155j4431j3342j2558j1652j0365q971p967
62647E79383p420o984o596o537o741o664o151n727n693n460m359k710j413o74
$$ y = [634852, 626144, 619968, 615307, 611323, 607786, 604499, 601034, 597477, 594937, 594668, 596811, 600396, 604476, 608749, 613183, 617754, 622910, 629749, 639239, 651477, 666043, 682805, 701934, 723401, 747114, 773477, 803252, 836745, 873610, 913575, 956940, 1004218, 1055690, 1111400, 1171081, 1233903, 1298751, 1364966, 1432301, 1499848, 1565551, 1627167, 1683207, 1732434, 1772966, 1802642, 1820074, 1824816, 1816791, 1796253, 1764124, 1721687, 1670020, 1610380, 1544990, 1476646, 1407414, 1338357, 1270569, 1205598, 1144544, 1087411, 1033790, 983703, 937446, 895156, 856922, 822859, 792578, 764977, 739098, 715010, 693464, 674824, 658669, 644238, 630896, 618338, 606686, 596321, 587350, 579383, 571963, 564979, 558383, 551846, 545105, 538441, 532290, 526563, 520870, 515410, 511051, 508341, 506928, 506254]
62633E06254J40J286J973J315l39j637j787j357j310j677j722j139l85J90Q11
62618E00616J610K187K340K586L364M195M355M019L992M540N316O211P439Q820
62604E61590R868J0701J1943J3579J4811J5426J6417J8700K1840K4749K7179K9870
62592G76673L3364L7237M0481M2315M2718M2274M1433L9845L6694L1689K5327
62581A190050J8121J0151J600o844j4602k1741k8370l3874l7384l8919l9485m0003
62569I58700m0507m0465l9488l7602l5027l1987k8739k5702k3361k1851k0698
62558F13273j9196j7052j4483j1803r285p334o311o019n792n280m805m703m677
62545D96533m130k922j523n36j78q4L62J290K042J985J510J537K043K028J227
$$ y = [506254, 506394, 507680, 509653, 510968, 510629, 508992, 507205, 505848, 504538, 502861, 501139, 500000, 499615, 499805, 500616, 502226, 504413, 506753, 509339, 512703, 516898, 521253, 525272, 529264, 533804, 539120, 545331, 552770, 561590, 571458, 582159, 594102, 607681, 622492, 637918, 654335, 673035, 694875, 719624, 746803, 776673, 810037, 847274, 887755, 930070, 972788, 1015062, 1056495, 1096340, 1133034, 1164723, 1190050, 1208171, 1218322, 1219922, 1213078, 1198476, 1176735, 1148365, 1114491, 1077107, 1038188, 998703, 958700, 918193, 877728, 838240, 800638, 765611, 733624, 704885, 679183, 655822, 633971, 613273, 594077, 577025, 562542, 550739, 541454, 534120, 527809, 521790, 515998, 510718, 505913, 501210, 496533, 492403, 489481, 487958, 487422, 487244, 487160, 487522, 488812, 490854, 492839, 494349, 495886, 497929, 499957, 501184]
62530E01184R36K312M570N835N467M632M726O049Q037R999J1449J2332J3207J4874
62516F05609J7621K1081K4744K8303L1484L4044L6033L7694L9018L9665L9415
62505I54711L8262L6040L2333K6992K0497J3595O751P0o439j2654j8253k2782
62493A069123k5916k7754k8707k9004k8431k6627k3571j9785j6063j2922j0214
62482H20129p323l942n24K236M253O085Q095R944J1023J1145J0494R058O490K647
62468H89810j866n991r155j1769j4680j8157k1635k4382k6119k6896k6729k5754
62456F76677k4457k3367k2445k1172j9337j7363j5719j4269j2530j0384q171o116
62444D81347m134k340j268j186j418r88J67J192J555J625J786J720J132N32N56
$$ y = [501184, 502120, 504432, 509002, 514837, 520304, 524936, 529662, 535711, 543748, 553747, 565196, 577528, 590735, 605609, 623230, 644311, 669055, 697358, 728842, 762886, 798919, 836613, 875631, 915296, 954711, 992973, 1029013, 1061346, 1088338, 1108835, 1122430, 1129181, 1129251, 1122812, 1110158, 1091905, 1069123, 1043207, 1015453, 986746, 957742, 929311, 902684, 879113, 859328, 843265, 830343, 820129, 812806, 808864, 808340, 810576, 814829, 820914, 829009, 838953, 849976, 861121, 871615, 880673, 887163, 889810, 887944, 881953, 872798, 861029, 846349, 828192, 806557, 782175, 756056, 729160, 702431, 676677, 652220, 628853, 606408, 585236, 565899, 548536, 532817, 518548, 506018, 495634, 487463, 481347, 477213, 474873, 473605, 472419, 471001, 470013, 470180, 471372, 472927, 474552, 476338, 478058, 479190, 479722, 480278]
62429D80278Q75O61j00o84q89j253j915k281k073j824j928j954j468q34o29p79
62413D63203q57p33m57P6Q36J407J540J551J698J641R85n5j034j824k290j929
62397D63758m65J537L251M380M893M584L630L038L531M410M409L359K136J316
62383E07767R59J402K948M815N680N436N305N945O674O939P314Q436R924J1098
62369E90642J1976J2869J3618J4098J4914J6785J9524K2337K4939K7777L1250
62358H00729L5250L9492M3930M8739N4022N9482O4364O7841O9416O8739O5341
62347A417345N9106N0926M2107L2936K2670J1153k92j0142j8196k5234l1680l7369
62335A513330m2275m6647n0445n3140n4196n3476n1212m7861m3945l9904l6122
$$ y = [480278, 481153, 481814, 481714, 481030, 480141, 478888, 476973, 474692, 472619, 470795, 468867, 466913, 465445, 464611, 463982, 463203, 462346, 461613, 461156, 461232, 462068, 463475, 465015, 466566, 468264, 469905, 470890, 470835, 469801, 467977, 465687, 463758, 463293, 464830, 468081, 472461, 477354, 481938, 485568, 488606, 492137, 496547, 500956, 504315, 506451, 507767, 508726, 510128, 513076, 517891, 523571, 529007, 534312, 540257, 546931, 553870, 561184, 569620, 579544, 590642, 602618, 615487, 629105, 643203, 658117, 674902, 694426, 716763, 741702, 769479, 800729, 835979, 875471, 919401, 968140, 1022162, 1081644, 1146008, 1213849, 1283265, 1352004, 1417345, 1476451, 1527377, 1569484, 1602420, 1625090, 1636243, 1635951, 1625809, 1607613, 1582379, 1550699, 1513330, 1471055, 1424408, 1373963, 1320823, 1266627, 1213151, 1161939, 1114078, 1070133, 1030229, 994107]
62324I94107l3042l0867k9157k7191k4976k3335k2782k2772k2423k1533k0461
62313G15568j9432j8410j7388j6336j5113j3678j2158j0473q424o375n177m997
62301E67607m870m048l091k832k884k229q79J55M50N90J017J487J863K444L209
62286E57989L584L390L287L753M314M246L611L016K767K753K907L255L672L919
62272F06463L928L793L677L842M593N911P429Q955J0793J3301J6367J9668K3262
62259G31982K7490L2374L7502M2583M7797N3392N9113O4322O8554P1652P3233
62248A309994P2310O7886N9968M9652L8150K6046J3641J569r435j9166k7879l5718
62236A547018m2701m9020n4851n9757o2897o3941o3319o1448n8280n3817m8621
$$ y = [994107, 961065, 930198, 901041, 873850, 848874, 825539, 802757, 779985, 757562, 736029, 715568, 696136, 677726, 660338, 644002, 628889, 615211, 603053, 592580, 584156, 577781, 572604, 567607, 562737, 558689, 555598, 552766, 549882, 547653, 546774, 546929, 547379, 547969, 548986, 550473, 552336, 554780, 557989, 561573, 564963, 568250, 572003, 576317, 580563, 584174, 587190, 589957, 592710, 595617, 598872, 602544, 606463, 610391, 614184, 617861, 621703, 626296, 632207, 639636, 648591, 659384, 672685, 689052, 708720, 731982, 759472, 791846, 829348, 871931, 919728, 973120, 1032233, 1096555, 1165109, 1236761, 1309994, 1382304, 1450190, 1510158, 1559810, 1597960, 1624006, 1637647, 1639216, 1629781, 1610615, 1582736, 1547018, 1504317, 1455297, 1400446, 1340689, 1277792, 1213851, 1150532, 1089084, 1030804, 976987, 928366]
62225I28366m3423l8564l4044k9831k5849k2011j8504j5685j3520j1571r814q898
62213F56652r108r622r470q746q165p786p069o039n378n221m866l889k767j968
62199E66558j224k67M41M34K14P26K082L558M685N648O657P622Q523R563J0735
62184F25955J1706J2308J2704J3010J3031J2572J1614J0153Q174O030M422L774
62172G45453L942M684O052Q131J0776J3988J8129K3410K9364L5275M0839M5970
62160I86013N0210N2860N3575N2298M8750M2603L4308K5138J6194P778r7p117
62148A362513j3028j8220k3453k8965l4176l8253m0774m1813m1587m0128l7359
62137A004757l3402k8753k3917j8941j3497p487j351M289R173J3452J7415K1292
$$ y = [928366, 884943, 846379, 812335, 782504, 756655, 734644, 716140, 700455, 686935, 675364, 665550, 656652, 647544, 637922, 628452, 619706, 611541, 603755, 596686, 590647, 585269, 580048, 575182, 571293, 568526, 566558, 565334, 565067, 565508, 565942, 566156, 566882, 568964, 572522, 577207, 582855, 589512, 597134, 605657, 615220, 625955, 637661, 649969, 662673, 675683, 688714, 701286, 712900, 723053, 731227, 737257, 741679, 745453, 749395, 754079, 760131, 768262, 779038, 793026, 811155, 834565, 863929, 899204, 940043, 986013, 1036223, 1089083, 1142658, 1194956, 1243706, 1286309, 1320617, 1345755, 1361949, 1369727, 1369630, 1362513, 1349485, 1331265, 1307812, 1278847, 1244671, 1206418, 1165644, 1123831, 1082244, 1042116, 1004757, 971355, 942602, 918685, 899744, 886247, 878760, 877409, 881698, 890871, 904323, 921738, 943030]
62125I43030K5207K9136L2816L5940L8456M0599M2512M3783M3548M1163L6765
62114A352955L0988K4273J6755Q884J627m196q497j1570j3450j4080j3806j3246
62102A356637j2702j2104j1258r747o787j874M420J0865J6683K1667K5316K6810
62090A407926K6140K4494K3025K1790K0266J8386J6560J5074J4021J3548J3862
62079A615092J5117J7477K0823K4344K7020K8892L1033L3766L5678L5240L2804
62068A917286L0027K7737K5484K3026K1052K0165K0234K1134K3304K6939L1177
62057B187565L4611L6419L6569L5250L2530K8485K3322J7286J0578L313m557j3303
62045B428068k3311l4736m7026n8849o8871p6857q3621q9690r4342r6459r5912
$$ y = [943030, 968237, 997373, 1030189, 1066129, 1104585, 1145184, 1187696, 1231479, 1275027, 1316190, 1352955, 1383943, 1408216, 1424971, 1433855, 1435482, 1431286, 1422789, 1411219, 1397769, 1383689, 1369883, 1356637, 1343935, 1331831, 1320573, 1310826, 1304039, 1302165, 1306585, 1317450, 1334133, 1355800, 1381116, 1407926, 1434066, 1458560, 1481585, 1503375, 1523641, 1542027, 1558587, 1573661, 1587682, 1601230, 1615092, 1630209, 1647686, 1668509, 1692853, 1719873, 1748765, 1779798, 1813564, 1849242, 1884482, 1917286, 1947313, 1975050, 2000534, 2023560, 2044612, 2064777, 2085011, 2106145, 2129449, 2156388, 2187565, 2222176, 2258595, 2295164, 2330414, 2362944, 2391429, 2414751, 2432037, 2442615, 2445928, 2441371, 2428068, 2404757, 2370021, 2322995, 2264146, 2195275, 2118418, 2034797, 1945107, 1850765, 1754306, 1658394]
62034A658394r3590r0236q5954q0780p5012o8834o2195n5311m8798m3084l8056
62023I16544l3519k9608k6562k4360k2790k1619k0551j9258j7606j5756j3968
62012F70947j2501j1570j1079j0438r057o978m691k331L87L407O048P744Q637
61999F28525R203R631R757R273P841N401K448l36k863n596q612j1247j2903j3696
61985F26826j4006j3967j3730j3667j3773j3352j1952j0225r164q753q026o469
61973D89742m642l379k854k652k381j965j510j064n17K07Q63J046P29L90M15O96
61957D73124J038J586K421L142L385L508M178N371O373O798P097P977R725J2150
61943E47873J4748J6944J8607K0324K2708K5455K7620K8887K9841L0818L1159
$$ y = [1658394, 1564804, 1474568, 1388614, 1307834, 1232822, 1163988, 1101793, 1046482, 997684, 954600, 916544, 883025, 853417, 826855, 802495, 779705, 758086, 737535, 718277, 700671, 684915, 670947, 658446, 646876, 635797, 625359, 616302, 609324, 604633, 602302, 602689, 606096, 612144, 619888, 628525, 637728, 647359, 657116, 666389, 674230, 679631, 682079, 681743, 678880, 673284, 664672, 653425, 640522, 626826, 612820, 598853, 585123, 571456, 557683, 544331, 532379, 522154, 512990, 504237, 496211, 489742, 485100, 481721, 478867, 476215, 473834, 471869, 470359, 469295, 468778, 468985, 469848, 470894, 471623, 472013, 472428, 473124, 474162, 475748, 478169, 481311, 484696, 488204, 492382, 497753, 504126, 510924, 518021, 525998, 535723, 547873, 562621, 579565, 598172, 618496, 641204, 666659, 694279, 723166, 753007, 783825, 814984]
61932H14984L0171K8229K6266K4491K2365J9723J7169J5156J3253J0710P401L776
61920A033694O5l964q284j2059j4225j4528j3619j2103r858o528k330K063O316
61907I44640J0663J5208J9357K2175K3153K2504K0814J8465J5398J1278N928l49
61895A129234o882j2959j8020k1779k4359k6229k7756k8900k9514k9752k9781
61884H73303k9240k7575k5010k2631k1193k0252j8892j6899j4859j3306j2282
61873F51164j1549j0780r600p814n678l629j774R5J998L614M681N253N554N966
61859F27501P146R684J3367J7123K0055K2387K5113K8903L3528L8271M2582M6295
61847I31955M9445N1959N3525N3809N2795N0761M7830M3748L8177L1025K2381
$$ y = [814984, 845155, 873384, 899650, 924141, 946506, 966229, 983398, 998554, 1011807, 1022517, 1029918, 1033694, 1033759, 1029795, 1021511, 1009452, 995227, 980699, 967080, 954977, 945119, 938591, 936261, 938324, 944640, 955303, 970511, 989868, 1012043, 1035196, 1057700, 1078514, 1096979, 1112377, 1123655, 1129583, 1129234, 1122352, 1109393, 1091373, 1069594, 1045235, 1019006, 991250, 962350, 932836, 903084, 873303, 844063, 816488, 791478, 768847, 747654, 727402, 708510, 691611, 676752, 663446, 651164, 639615, 628835, 619235, 611421, 605743, 602114, 600340, 600435, 602433, 606047, 610728, 615981, 621535, 627501, 634647, 644331, 657698, 674821, 694876, 717263, 742376, 771279, 804807, 843078, 885660, 931955, 981400, 1033359, 1086884, 1140693, 1193488, 1244249, 1292079, 1335827, 1374004, 1405029, 1427410]
61836A427410J2493K165p077j3803j7720j9589k0086j9099j6217j1413n139J757
61824A313682Q056J2632J5420J7476J9493K0529J8789J3646O219k010j0446j9063
61812A414423k7572l5417m2179m7528n1096n2921n3721n4110n3633n1307m7146
61801H97793m2489l8572l5271l1760k7841k4121k1043j8491j6280j4463j2979
61790F14483j1478r863q599q051p762o934n541m421m143m253l973l299k913l114
61776E30139l375l129k556k268k398k502k302k134k368k760k669j877q32o7L41
61761D99243O87J248K168L416M637N253N088M795N281O656Q045Q567Q198P530
61747E70812P031O741O501O074N167L716K251J579J918K500K342J357M45M02J029
$$ y = [1427410, 1439903, 1442068, 1434991, 1421188, 1403468, 1383879, 1363793, 1344694, 1328477, 1317064, 1311925, 1313682, 1321738, 1334370, 1349790, 1367266, 1386759, 1407288, 1426077, 1439723, 1445942, 1443932, 1433486, 1414423, 1386851, 1351434, 1309255, 1261727, 1210631, 1157710, 1103989, 1049879, 996246, 944939, 897793, 855304, 816732, 781461, 749701, 721860, 697739, 676696, 658205, 641925, 627462, 614483, 603005, 593142, 584543, 576492, 568730, 561796, 556255, 551834, 547691, 543438, 539465, 536166, 533253, 530139, 526764, 523635, 521079, 518811, 516413, 513911, 511609, 509475, 507107, 504347, 501678, 499801, 498969, 498902, 499243, 499930, 501178, 503346, 506762, 511399, 516652, 521740, 526535, 531816, 538472, 546517, 555084, 563282, 570812, 577843, 584584, 591085, 597159, 602326, 606042, 608293, 609872, 611790, 614290, 616632, 617989, 618434, 618836, 619865]
61732F19865J485J328Q42M10J05pL25R97J327R94R21K310M880O936P512P566Q417
61715F66213R784J0253R286P739O453N245L513J230j125l145m684n718o287o452
61701F92305o247n835n605n790o012n650m725l939l702l581l088k581k873m097
61687F28580n447o072n928n631n687n999o158o077o088o344o415n844m893m167
61673E47830l638k710j413p04j159k047k368k257k496k988k799j687n92k19m4
61658E20709P21J825K420K382K364K597K451J496L80J70J069K197K654K479K464
61643E48378L202M489N583N995N853N489M800L337J141q77j846k074k727m238
61629E76505n623n692m560l355k776k457j799p12N55J860L151M436N883P641R349
$$ y = [619865, 621350, 622678, 623520, 623930, 624035, 624028, 624353, 625350, 626677, 627671, 628592, 630902, 635782, 642718, 650230, 657796, 666213, 675997, 686250, 695536, 703275, 709728, 714973, 718486, 719716, 718591, 715446, 710762, 705044, 698757, 692305, 686058, 680223, 674618, 668828, 662816, 657166, 652441, 648502, 644800, 641219, 638131, 635550, 632677, 628580, 623133, 617061, 611133, 605502, 599815, 593816, 587658, 581581, 575493, 569149, 562734, 556890, 551997, 547830, 544192, 541482, 540069, 539365, 538206, 536159, 533791, 531534, 529038, 526050, 523251, 521564, 520972, 520753, 520709, 521430, 523255, 525675, 528057, 530421, 533018, 535469, 536965, 537345, 537515, 538584, 540781, 543435, 545914, 548378, 551580, 556069, 561652, 567647, 573500, 578989, 583789, 587126, 588267, 587390, 585544, 583470, 580743, 576505, 570882, 565190, 560630, 557275, 554499, 552042, 550243, 549531, 550086, 551946, 555097, 559533, 565416, 573057, 582406]
61614E82406J0238R993R151Q293P163N088K073j037l465n200o666q017q869q691
61600E92460p474o001n327n774o641p072o999o977p279p675q012q462r043r302
61586D90422q810p701o518n581m763l887l124k908l429m256m669m438m152m479
61572D21707n208n399m519l166k434k759l641m288m256l569k528j593j171j287
61558C75889j523j434j035p08o49o08k55L71R73J358J499J324Q14K67J23M05O37
61541C77448N06L23O50J586K679L397L467K986K417K268K571K772K365J418K17
61526D07070j315l235m889n299m459l581l634m188m186l493k964l104l361l027
61512C56335k238j626j300p56J99R40P82r4q23r19p51r12j460j930j920j431q04
$$ y = [582406, 592644, 602637, 611788, 620081, 627244, 632332, 634405, 633368, 629903, 624703, 618037, 610020, 601151, 592460, 584986, 578985, 573658, 567884, 561243, 554171, 547172, 540195, 532916, 525241, 517229, 508767, 499724, 490422, 481612, 473911, 467393, 461812, 457049, 453162, 450038, 447130, 443701, 439445, 434776, 430338, 426186, 421707, 416499, 411100, 406581, 403415, 400981, 398222, 394581, 390293, 386037, 382468, 379940, 378347, 377176, 375889, 374366, 372932, 371897, 371189, 370540, 369932, 369677, 370048, 371021, 372379, 373878, 375202, 376016, 376283, 376406, 376811, 377448, 377954, 378277, 378927, 380513, 383192, 386589, 390056, 393042, 395459, 397727, 400298, 403070, 405435, 406853, 407070, 405755, 402520, 397631, 392332, 387873, 384292, 380658, 376470, 372284, 368791, 365827, 362723, 359362, 356335, 354097, 352471, 351171, 350415, 350614, 351554, 352336, 352242, 351419, 350500, 349749, 348837, 347377, 345447, 343527, 342096, 341292]
61495C41292n08q15j444j714j304p68r14j733k374k216j555r94o27k15J28N3l06
61478C23986k95L88J242J665J761K020K436K503K040J515J363J395J170O35O2
61463C43886l68n98n00m4M19N04L43M43R55J516J792J816J671J327R35Q48J149
61446C56094J452J466J382J484J772K180K798L510L869L798L957M813N739N740
61432D00054M858M049L721L214J989M83n98j209j698j985j654o51N58J452J783
61417D14366J617J359J595K493L395L361K217P54j71n03q06j537k659l867m896
61402D16718n640o151o541o757o460n333l589k034j420j829k746l535l724l119
61388C57840k018j246j512k574l377l094j872m45N98J015Q42M08K68O98J358J660
$$ y = [341292, 340784, 339969, 338525, 336811, 335507, 334739, 333825, 332092, 329718, 327502, 325947, 324953, 324326, 324111, 324239, 324292, 323986, 323691, 324079, 325321, 326986, 328747, 330767, 333203, 335706, 337746, 339261, 340624, 342019, 343189, 343824, 343886, 343518, 342920, 342420, 342376, 342795, 343299, 343642, 344085, 345040, 346556, 348348, 350164, 351835, 353162, 354097, 354945, 356094, 357546, 359012, 360394, 361878, 363650, 365830, 368628, 372138, 376007, 379805, 383762, 388575, 394314, 400054, 404912, 408961, 412682, 415896, 417885, 418368, 417770, 416561, 414863, 412878, 411224, 410573, 411131, 412583, 414366, 415983, 417342, 418937, 421430, 424825, 428186, 430403, 431157, 430986, 430483, 429677, 428140, 425481, 421614, 416718, 411078, 404927, 398386, 391629, 385169, 379836, 376247, 374213, 372793, 370964, 368218, 364683, 360959, 357840, 355822, 354576, 353064, 350490, 347113, 344019, 342147, 341702, 342300, 343315, 344157, 344565, 344833, 345531, 346889, 348549]
61372C48549J374P60K18nR8L24N35R34J791K842L352L054K591K640L042L256L288
61355C78643L601M262M930N575O556P863Q905R259R208R351R964J0899J1772J2167
61341D92955J1954J1468J1123J0797J0032Q831P794P289O867N800L930J752r8
61328E90494j327k091k841l929n201o115o260n779n246n188n597n784m956l155
61314E27025j437q26j244j744j605q17K81J358K187K835L637M612N189N080N049
61299E49580N982P403P889O898N196L353J008j925m461n707n996o090o016n474
61285E51640m868m875n344n522n176m700m208l304j884m21O28J250J612J897K467
61270E19192L780N794P733Q659Q270P088N950N347N172N152N335N955O954Q014
$$ y = [348549, 349923, 350683, 350901, 350896, 350994, 351318, 351853, 352787, 354578, 357420, 360772, 363826, 366417, 369057, 372099, 375355, 378643, 382244, 386506, 391436, 397011, 403567, 411430, 420335, 429594, 438802, 448153, 458117, 469016, 480788, 492955, 504909, 516377, 527500, 538297, 548329, 557160, 564954, 572243, 579110, 584910, 588840, 590592, 590494, 589167, 587076, 584235, 580306, 575105, 568990, 562730, 556951, 551705, 546517, 540920, 535136, 530180, 527025, 525588, 524762, 523518, 521774, 520169, 519352, 519633, 520991, 523178, 526013, 529650, 534262, 539451, 544531, 549580, 555562, 562965, 570854, 577752, 582948, 586301, 587309, 585384, 580923, 575216, 569220, 563130, 557114, 551640, 546772, 541897, 536553, 531031, 525855, 521155, 516947, 513643, 511759, 511338, 511966, 513216, 514828, 516725, 519192, 522972, 528766, 536499, 545158, 553428, 560516, 566466, 571813, 576985, 582137, 587472, 593427, 600381, 608395]
61256F08395R110J0516J2222J3760J4845J5648J6134J5726J4011J1408Q665O082
61244G56522L574J130j282l908o834r660j1973j3698j4673j4367j2679j0528q987
61231F52637q111p289o350n524m669l469k251j628j351m91J175K833L846M460
61217F23818M969N052M453L697L587M307N335N919N507M153K712K200K751L560
61203F82020L940L953L896L858M048M931O672Q897J1387J4407J7893K1004K3090
61190H09996K4734K6979K9820L2163L3191L3017L2011L0260K7941K5652K3927
61179A129691K2651K1324J9758J8219J6985J5927J4561J2451R562O237K827o39
61167A289554m356q389j2461j6128j9050k1199k2837k4368k6063k7926k9764l1350
$$ y = [608395, 617505, 628021, 640243, 654003, 668848, 684496, 700630, 716356, 730367, 741775, 750440, 756522, 760096, 761226, 759944, 756036, 749202, 739542, 727569, 713871, 699198, 684831, 672152, 661624, 652637, 644526, 637237, 630887, 625363, 620694, 617225, 614974, 613346, 611995, 611504, 612679, 615512, 619358, 623818, 628787, 633839, 638292, 641989, 645576, 649883, 655218, 661137, 666644, 670797, 673509, 675709, 678460, 682020, 685960, 689913, 693809, 697667, 701715, 706646, 713318, 722215, 733602, 748009, 765902, 786906, 809996, 834730, 861709, 891529, 923692, 956883, 989900, 1021911, 1052171, 1080112, 1105764, 1129691, 1152342, 1173666, 1193424, 1211643, 1228628, 1244555, 1259116, 1271567, 1281129, 1287366, 1290193, 1289554, 1285198, 1276809, 1264348, 1248220, 1229170, 1207971, 1185134, 1160766, 1134703, 1106777, 1077013, 1045663]
61155A045663l2472l2871l2336l0864k8758k6367k3837k1121j8274j5519j3022
61144G70222j0658q227n799l755k548k478l557n295o783p340p086o552n720l979
61130F90445j207J722L886N410P186R739J2840J5997J8912K1541K4114K6968L0088
61117H67641L3018L5632L8659M2768M7255N0479N1730N2040N2742N3895N4544
61106A380403N4080N2761N1042M9014M6531M3458L9638L4836K8968K2355J5566
61095A818652R015K737l534j0089j7040k4150l0886l6714m1469m5265m8068m9659
61083A523530n0191n0372n0631n0440m9039m6665m4330m2434m0353l7509l4140
61072A027426l0755k7590k4853k2818k1227j9331j6899j4486j2303r740o590l814
$$ y = [1045663, 1013191, 980320, 947984, 917120, 888362, 861995, 838158, 817037, 798763, 783244, 770222, 759564, 751337, 745538, 741783, 739235, 736757, 733200, 727905, 721122, 713782, 706696, 700144, 694424, 690445, 689238, 690960, 694846, 700256, 707442, 717181, 730021, 746018, 764930, 786471, 810585, 837553, 867641, 900659, 936291, 974950, 1017718, 1064973, 1115452, 1167182, 1219222, 1271964, 1325859, 1380403, 1434483, 1487244, 1538286, 1587300, 1633831, 1677289, 1716927, 1751763, 1780731, 1803086, 1818652, 1827667, 1830404, 1826870, 1816781, 1799741, 1775591, 1744705, 1707991, 1666522, 1621257, 1573189, 1523530, 1473339, 1422967, 1372336, 1321896, 1272857, 1226192, 1181862, 1139428, 1099075, 1061566, 1027426, 996671, 969081, 944228, 921410, 900183, 880852, 863953, 849467, 837164, 827424, 820834, 817020]
61060H17020k262j403k08J329K614L706N073O588P878R243J1205J3469J5469J7487
61046I07208K0026K2536K4116K5299K7636L1477L5505L8604M0996M3400M6239
61035A263042M9762N3820N7426N9640O0898O2376O4236O5779O7023O8540O9886
61024A942428O9991O9155O8801O9359P0393P2921P9012Q8601R9213J09611J21260
61013B860745J35427J51912J72055K00001K39002K89259L51443M28983N24296
61004E353123O36644P67732R25567J116848J338381J582576J846561K119948K355890
60995A8043270K465839K361411K011993J466969Q32585K36193j99751l86578l11534
60986B6520397o4678J88995K86100J35093k63865q39405j474854k032272k391897
$$ y = [817020, 814758, 813355, 813147, 814476, 817090, 820796, 825869, 832457, 840335, 849578, 860783, 874252, 889721, 907208, 927234, 949770, 973886, 999185, 1026821, 1058298, 1093803, 1132407, 1173403, 1216803, 1263042, 1312804, 1366624, 1424050, 1483690, 1544588, 1606964, 1671200, 1736979, 1804002, 1872542, 1942428, 2012419, 2081574, 2150375, 2219734, 2290127, 2363048, 2442060, 2530661, 2629874, 2739485, 2860745, 2996172, 3148084, 3320139, 3520140, 3759142, 4048401, 4399844, 4828827, 5353123, 5989767, 6757499, 7683066, 8799914, 10138295, 11720871, 13567432, 15687380, 18043270, 20509109, 22870520, 24882513, 26349482, 27182067, 27418260, 27218509, 26831931, 26520397, 26455719, 26644714, 26930814, 27065907, 26802042, 25962637, 24487783, 22455511, 20063614]
60977B0063614k501406k395101k159639j876874j593958j331743j101691r08973
60969F194229p50044o17702n08218m20546l51485k96095k51618k17379j91553
60960B589589j70891j53320j38373j25244j12533r9798q7703p6653o6551n7607
60950A500916n0160m4056l9278l6608l6354l6996l6500l4567l2324l0304k8199
60939A095570k6166k4765k3742k2399k1087k0795k1202k0751j8987j7379j7214
60928H61083j7887j7952j6981j5595j4404j3598j3239j3311j3592j3691j3206
60917F97627j1976j0423r377r134q947p979o494n388m873m447l995l962m370m549
60903F01713m079l287k628k255k347l064l959m169l547k999l316m245n027n410
$$ y = [20063614, 17562208, 15167107, 13007468, 11130594, 9536636, 8204893, 7103202, 6194229, 5444185, 4826483, 4318265, 3897719, 3546234, 3250139, 2998521, 2781142, 2589589, 2418698, 2265378, 2127005, 2001761, 1889228, 1789430, 1701727, 1625074, 1558523, 1500916, 1450756, 1406700, 1367422, 1330814, 1294460, 1257464, 1220964, 1186397, 1154073, 1123769, 1095570, 1069404, 1044639, 1020897, 998498, 977411, 956616, 935414, 914663, 895676, 878297, 861083, 843196, 825244, 808263, 792668, 778264, 764666, 751427, 738116, 724524, 710833, 697627, 685651, 675228, 665851, 656717, 647770, 639791, 633297, 627909, 623036, 618589, 614594, 610632, 606262, 601713, 597634, 594347, 591719, 589464, 587117, 584053, 580094, 575925, 572378, 569379, 566063, 561818, 556791, 551381]
60889E51381n637n862n978n864n521n090m821m849m994n000m905m840m625m037
60875D79358l307k811k383j613q25q29j521j612k83J628K702K784K973M105N879
60860D84245P445Q322Q541Q295P582O256M439K783K083K486L322L809L702L112
60846E56422K017L10j735l391m082m085m430n854p860r117q965q148p785p987
60832D85310q042p604p000o480n865n066m249l405k317j183o01p11r11p08k57
60817D30911K43J018K081K724K359J527J409K403L842M979N689O147O333O139
60803D77804N678N207M844M463L903L225K701K461K257J750J003M45L47N34O73
60788E17295N09j13j148k192k760k886l108l741m516n049n268n194m770m252m310
$$ y = [551381, 545744, 539882, 533904, 528040, 522519, 517429, 512608, 507759, 502765, 497765, 492860, 488020, 483395, 479358, 476051, 473240, 470857, 469244, 468419, 467590, 466069, 464457, 464174, 465802, 468504, 471288, 474261, 478366, 484245, 491690, 500012, 508553, 516848, 524430, 530686, 535125, 537908, 539991, 542477, 545799, 549608, 553310, 556422, 558439, 558749, 557014, 553623, 549541, 545456, 541026, 535172, 527312, 518195, 509230, 501082, 493297, 485310, 477268, 469664, 462664, 456184, 450319, 445253, 441004, 437599, 435282, 434099, 433498, 432787, 431876, 431168, 430911, 431154, 432172, 434253, 436977, 439336, 440863, 442272, 444675, 448517, 453496, 459185, 465332, 471665, 477804, 483482, 488689, 493533, 497996, 501899, 505124, 507825, 510286, 512543, 514293, 515296, 515741, 516088, 516622, 517295, 517804, 517691, 516543, 514351, 511591, 508705, 505597, 501856, 497340, 492291, 487023, 481829, 477059, 472807, 468497]
60773D68497n179o043n794m357k779j995j897j760j205n46k91n30q66r05o28k10
60757D33512K82P60Q56K77n97r24l98M28R45J174J449J863K347K912L458L687
60741D52031L534L392L531L627L266K609K181K141K237K255K185K031J800J604
60727D88424J497J416J410J664K028J979J388Q90J011J309R45j83j479k524l248
60712D96527l488l105k535k480l022l599l863l997m188m398m640m899m834m233
60698D43246l636l739m150l754k471j616k028k806k615j491m48P9M51Q05Q17N17
60682D17161N28J296K560L785M712N408N997O457O579O167N411M884M853M837
60668D80635M177K927J849J527J854K256K100R66j047l179m505m712m222l612
$$ y = [468497, 463318, 457275, 451481, 447124, 444345, 442350, 440453, 438693, 437488, 436942, 436651, 436121, 435255, 434350, 433722, 433512, 433794, 434554, 435410, 435687, 435090, 434166, 433768, 434196, 435141, 436315, 437764, 439627, 441974, 444886, 448344, 452031, 455565, 458957, 462488, 466115, 469381, 471990, 474171, 476312, 478549, 480804, 482989, 485020, 486820, 488424, 489921, 491337, 492747, 494411, 496439, 498418, 499806, 500696, 501707, 503016, 503961, 503778, 502299, 499775, 496527, 493039, 489934, 487399, 484919, 481897, 478298, 474435, 470438, 466250, 461852, 457212, 452313, 447479, 443246, 439610, 435871, 431721, 427967, 425496, 423880, 421852, 419046, 416431, 414940, 414492, 414571, 415022, 415827, 416644, 417161, 417689, 418985, 421545, 425330, 430042, 435450, 441447, 447904, 454483, 460650, 466061, 470945, 475798, 480635, 484812, 487739, 489588, 491115, 492969, 495225, 497325, 498291, 497244, 494065, 489560, 484848, 480626, 477014]
60654D77014l191l143l550m098m090l106j549k66K16Q0q1J96Q59J300Q78l29j435
60637D55705j599r63m29n63r67r07k44M71P21N54M01O17J293K294L349M158M543
60620D68434M480M040L455L156L443L999M089L439K678K511K744K619K020J762
60606E12869K520L891M904N092M811M573M478M263L780L289L232L742M443M882
60592E70769M983M914M663M139L494K906K064N00j498k966l527l910m797n721
60578E76013n795n036m135l253k033o36J81L11O20J668K864L517M053N367P335
60563E81041Q838R216Q911Q581Q306P904P458P037O322N038L607K888L299M479
60549F72925N810O903P658Q253R206J1031J3511J5607J6365J5843J4993J4724
$$ y = [477014, 473823, 470680, 467130, 463032, 458942, 455836, 454287, 454021, 454237, 454317, 454236, 454432, 455291, 456591, 457469, 457140, 455705, 454106, 453143, 452714, 452151, 451184, 450277, 450033, 450504, 451225, 451779, 452180, 452797, 454090, 456384, 459733, 463891, 468434, 472914, 476954, 480409, 483565, 487008, 491007, 495096, 498535, 501213, 503724, 506468, 509087, 511107, 512869, 515389, 519280, 524184, 529276, 534087, 538660, 543138, 547401, 551181, 554470, 557702, 561444, 565887, 570769, 575752, 580666, 585329, 589468, 592962, 595868, 597932, 598432, 596934, 593968, 590441, 586531, 581734, 576013, 570218, 565182, 561047, 557794, 555761, 555125, 555306, 555617, 556237, 557905, 560769, 564286, 568339, 573706, 581041, 589879, 599095, 608006, 616587, 624893, 632797, 640255, 647292, 653614, 658652, 662259, 665147, 668446, 672925, 678735, 685638, 693296, 701549, 710755, 721786, 735297, 750904, 767269, 783112, 798105, 812829]
60537H12829J5284J6331J7246J7487J6961J6121J5567J5557J6042J6901J7828
60526I94154J8141J7373J6018J5181J5191J5043J3582J0889Q072N919M325K953
60514A136841J861J139K75j668n094r308j3070j5698j7416j8689j9560j9799j9399
60501A000415j8534j7202j5311j2966j0295p125l381K73K827M025M436M302L004
60488I34468Pm332r235j4118j8396k1481k3560k5624k7926k9186k8226k5810k3714
60475F82867k2482k1242j9502j7654j5820j3637j1476j0396j0422j0112q568o676
60463E14880n594n070m293l488l412l838l855l368l177l628m199m424m333l921
60449D58280l082k179j886k253k640k701k763l005k952k185j028k07j21p15j626
$$ y = [812829, 828113, 844444, 861690, 879177, 896138, 912259, 927826, 943383, 959425, 976326, 994154, 1012295, 1029668, 1045686, 1060867, 1076058, 1091101, 1104683, 1115572, 1123644, 1129563, 1133888, 1136841, 1138702, 1139841, 1140116, 1138448, 1133354, 1124046, 1110976, 1095278, 1077862, 1059173, 1039613, 1019814, 1000415, 981881, 964679, 949368, 936402, 926107, 918982, 915601, 915874, 918701, 922726, 927162, 931464, 934468, 934475, 930143, 920908, 906790, 888394, 866913, 843353, 817729, 789803, 760617, 732391, 706581, 682867, 660385, 639143, 619641, 601987, 586167, 572530, 561054, 550658, 540236, 530124, 521556, 514880, 509286, 504216, 499923, 496435, 493023, 489185, 485330, 481962, 478785, 475157, 470958, 466534, 462201, 458280, 455198, 453019, 451133, 448880, 446240, 443539, 440776, 437771, 434819, 432634, 431606, 431399, 431278, 430563, 428937]
60434D28937k332k473k242k053j877j305m12J69J39r6k71p32j600k149j719p45
60418D09239j66j29l4L71P41R00J059J306J465J593J953K364K205J331M34K38
60402D24870O44J042J129J136J419K025K577K586J988J282Q90O38K60J62Q76J895
60386D45419J962P73n61j088j146j287j133k19P91R29N01N62J101J048J04o79
60370D47077m91K24P45J090J483J652J376R86P60M30j21l25J57O01K36m07j07
60353D55366J233K430K643K275K088K208K329K337K377K601L090L730M087L784
60339D92578L075K739L256M432N818P108P993Q067P199N833M587L645K658J169
60325E60157r36l325n496p160q277q772q499p587o487n387l916j854J38J130J105
$$ y = [428937, 426605, 424132, 421890, 419837, 417960, 416655, 416243, 416412, 416551, 416455, 416184, 415452, 413852, 411703, 409984, 409239, 409073, 408944, 408910, 409281, 410022, 410922, 411981, 413287, 414752, 416345, 418298, 420662, 422867, 424198, 424632, 424870, 425514, 426556, 427685, 428821, 430240, 432265, 434842, 437428, 439416, 440698, 441588, 442226, 442486, 442648, 443524, 445419, 447381, 448154, 447593, 446505, 445359, 444072, 442939, 442720, 443511, 444440, 444941, 445503, 446604, 447652, 447756, 447077, 446586, 446810, 447555, 448645, 450128, 451780, 453156, 454142, 454902, 455332, 455211, 454886, 455043, 455644, 455880, 455473, 455366, 456599, 459029, 461672, 463947, 466035, 468243, 470572, 472909, 475286, 477887, 480977, 484707, 488794, 492578, 495653, 498392, 501648, 506080, 511898, 519006, 526999, 535066, 542265, 548098, 552685, 556330, 558988, 560157, 559221, 555896, 550400, 543240, 534963, 526191, 517692, 510105, 503618, 498231, 494315, 492461, 492599, 493729, 494834]
60310D94834R98J542K627L848N109O503Q036R705J1520J3314J4815J5842J6052
60297F04745J4643J0995N664J21m682q857j2533j5137j6141j5911j5105j3720
60285E34082j1396q384n564l596k426j630q46l9M53L36j70n33o98j069j546j299
60269D95675j4J328J652J269J346K311L614M817N908O636O456N320L775K127J95
60254E42415j980l896n300o461p492p960p586o760o033n444m715l741k652j662
60240D70733j099j230j807k159j922j365p89k2J167K544L671M405M813M817M340
60225D86097L592K938K615K734L283L909M042L583L111L083L124K666J975J934
60211E28686K851M095M951N359N641O017O530P089P348O834N521M096L385L590
$$ y = [494834, 495832, 497374, 500001, 503849, 508958, 515461, 523497, 533202, 544722, 558036, 572851, 588693, 604745, 619388, 630383, 636047, 636168, 631486, 622629, 610096, 594959, 578818, 562907, 547802, 534082, 522686, 514302, 508738, 505142, 502716, 501086, 500240, 500201, 500654, 500990, 500820, 500287, 499589, 498520, 496974, 495675, 495661, 496989, 498641, 499910, 501256, 503567, 507181, 511998, 517906, 524542, 530998, 536318, 540093, 542220, 542415, 540435, 536539, 531239, 524778, 517286, 509326, 501740, 494980, 488947, 483503, 478788, 475047, 472395, 470733, 469634, 468404, 466597, 464438, 462516, 461151, 460362, 460340, 461507, 464051, 467722, 472127, 476940, 481757, 486097, 489689, 492627, 495242, 497976, 501259, 505168, 509210, 512793, 515904, 518987, 522111, 524777, 526752, 528686, 531537, 535632, 540583, 545942, 551583, 557600, 564130, 571219, 578567, 585401, 590922, 595018, 598403, 601993]
60197F01993M162M351L747K535J374R93J633K775L453K963J402l11j056m29Q39
60182F30424J442O30j199k963l841l759l217k796k770k998l079k671j750o59Q8
60167F00882K30R5L07J003J457Q89m72j557j734j415j218j034m43M15J015J199
60151E99619J195R98N47L50J117K599L659L825L957M910O332P523Q696J0446J2463
60136F68236J3829J4341J4508J4372J3499J2073J0754R204O051R99m157p445q808
60123G57456r396r568q851p425o270n777n228m017k523j466q78j98R66K384L377
60108G02586L328K278J022L85L86L13m05j677k930l608l555l202l134l292k874
60093F85621j469J35Q73R30J526L226N327P015Q339R620J0606J0803J0177R061
$$ y = [601993, 606155, 610506, 614253, 616788, 618162, 619155, 620788, 623563, 627016, 629979, 631381, 631070, 630014, 629585, 630424, 631866, 632496, 631297, 628334, 624493, 620734, 617517, 614721, 611951, 608953, 605874, 603203, 601453, 600794, 600882, 601112, 601207, 601514, 602517, 603974, 604863, 604391, 602834, 601100, 599685, 598467, 597433, 596990, 597405, 598420, 599619, 600814, 601812, 602359, 602709, 603826, 606425, 610084, 613909, 617866, 622776, 629108, 636631, 645327, 655773, 668236, 682065, 696406, 710914, 725286, 738785, 750858, 761612, 770816, 776867, 777866, 773709, 766264, 757456, 748060, 738492, 729641, 722216, 715946, 710169, 704941, 700924, 698401, 696935, 696057, 695859, 696825, 699209, 702586, 705914, 708192, 709214, 709599, 709985, 710298, 709893, 708216, 705286, 701678, 698123, 694921, 691787, 688495, 685621, 684152, 684287, 685160, 686090, 687616, 690842, 696169, 703184, 711523, 721143, 731749, 742552, 752729, 761790]
60079G61790P627N860L869J822k68k415m359n676o167o136o268p136q633r967
60065G23943j0503j0424j0274r999r061p471o067n574n904o575p225p522p124
60052F20220o115n066m276l440k324j264n77L1R49J985K734L334M235N433O435
60037F22294O881O738O071N081M187L657L223K477J458M74m96j704l069m254n276
60022F47742o572q349j0194j1451j1818j1599j1467j1836j2320j2034j0672q916
60010E20514p489o256m762l231k292j901j360l61P29J651K596L558M038L770L180
59995E12384K791K526K009J214N28L05O15J232J690J559Q55J57J65J139K651L766
59979E35586L612K146L12q55j240j492k051k760l337l706l798l536l098k742k337
$$ y = [761790, 769417, 775277, 779146, 780968, 780700, 778285, 773926, 768250, 762083, 755947, 749679, 742543, 733910, 723943, 713440, 703016, 692742, 682743, 673682, 666211, 660144, 654570, 648666, 642091, 634866, 627344, 620220, 614105, 609039, 604763, 601323, 598999, 597735, 597158, 597189, 598138, 600123, 602857, 606191, 610426, 615859, 622294, 629175, 635913, 641984, 647065, 651252, 654909, 658132, 660609, 662067, 662541, 662045, 660341, 657272, 653018, 647742, 641170, 632821, 622627, 611176, 599358, 587759, 576292, 564456, 552136, 540102, 529430, 520514, 513025, 506769, 502007, 498776, 496484, 494583, 493223, 492862, 493591, 495242, 497838, 501396, 505434, 509204, 512384, 515175, 517701, 519710, 520924, 521452, 521757, 522372, 523604, 525294, 526853, 527708, 527865, 528030, 529169, 531820, 535586, 539198, 541344, 541656, 540801, 539561, 538069, 536018, 533258, 529921, 526215, 522417, 518881, 515783, 513041, 510704]
59964E10704j567o39j52q4L68J593K803K929J828K20j135j790j615r67n72o64
59948E11260o45j5P36P78J11o00j175j993l020l570l285k702k500k691k867k875
59932D84947k890l034l260l459l450l087k451j854j471j119n44J88P45Q99P56
59917D60916O86J019J743K506L027L339L569L596L287K947L089L688M127M042
59903E01581L797L861M045L806L040K177J573J256J270J789K767L766M326M441
59889E43495M477M760N288N779N949N853N949O697P992R103R319Q577P454O567
59875F37259O086N729N103L966K301K58j879l755n195o457p995r762j0939j0740
59861F03980r447q169p476o737n191l152j599p51K26K008M263O291P989R755J1758
$$ y = [510704, 509137, 508498, 508346, 508262, 508630, 510223, 513026, 515955, 517783, 518003, 516868, 515078, 513463, 512496, 511924, 511260, 510615, 510600, 511336, 512114, 512225, 511625, 510450, 508457, 505437, 501867, 498582, 495880, 493380, 490689, 487822, 484947, 482057, 479023, 475763, 472304, 468854, 465767, 463316, 461462, 459991, 458872, 458328, 458516, 459261, 460160, 460916, 461602, 462621, 464364, 466870, 469897, 473236, 476805, 480401, 483688, 486635, 489724, 493412, 497539, 501581, 505378, 509239, 513284, 517090, 520130, 522307, 523880, 525136, 526406, 528195, 530962, 534728, 539054, 543495, 547972, 552732, 558020, 563799, 569748, 575601, 581550, 588247, 596239, 605342, 614661, 623238, 630692, 637259, 643345, 649074, 654177, 658143, 660444, 660702, 658823, 655068, 649873, 643416, 635421, 625659, 614720, 603980, 594533, 586364, 578888, 572151, 566960, 563808, 562209, 561458, 561684, 563692, 567955, 574246, 582235, 591990, 603748]
59846F03748J3655J4859J4753J2878R371N145J297j588l303l533k143K2J357Q64
59832F67382r96l029m451n065m853l966k977k559k858l513m191m840n426n911
59818F12747o500p511q790r671r731r264q750q086o794m870k976j780j363j363
59804E25298j420j335j003m20K27N98M11l79j543k703l598m181m426m223l626
59789D97677l137l353m168m667m066k600j192l60R1M11L92j51q35j051p07j82
59773D72102L53J097J986K474K265J899K062K608K832K628K652L153L388K723
59759E04222J730J497K080K527K296J889J880K103K177K236K600L065L159K877
59745E36338K669K774L015L163L149K915K433J897J614J662J848J965J856J413
$$ y = [603748, 617403, 632262, 647015, 659893, 669264, 674409, 675706, 674118, 670815, 667282, 665139, 665161, 666518, 667382, 666386, 663357, 658906, 653841, 648988, 645022, 642045, 639486, 636628, 633115, 628924, 624084, 618658, 612747, 606247, 598736, 589946, 580275, 570544, 561280, 552530, 544444, 537650, 532780, 529804, 528024, 526661, 525298, 523878, 522543, 521540, 521120, 521347, 521945, 522356, 521977, 520434, 517731, 514133, 509952, 505526, 501303, 497677, 494540, 491187, 487019, 482352, 478286, 475686, 474494, 474134, 474225, 474636, 475028, 474877, 474042, 472991, 472284, 472102, 472455, 473552, 475538, 478012, 480277, 482176, 484238, 486846, 489678, 492306, 494958, 498111, 501499, 504222, 505952, 507449, 509529, 512056, 514352, 516241, 518121, 520224, 522401, 524637, 527237, 530302, 533461, 536338, 539007, 541781, 544796, 547959, 551108, 554023, 556456, 558353, 559967, 561629, 563477, 565442, 567298, 568711]
59731E68711P05P4k25l10l66k66J21M28J47n99j160j208r58n82lN86O80J89k99
59712E65665k79M8K17R1k15n98q15n38J01L87p0p58r51o28k38P0L61L80j14o40
59692E61476l38Q20J797J713Q24l8n00p69r01n70L56J333J629J238Q99J075J260
59675E71304P14m72j579k347l127l903m051l428k890l107l434k754j025O85J563
59660E42149J694J538J443J631K120K488K219J334M47K24R61K492M090M757M037
59645E73624K420P22o78j664k029j919k149l240m455m624l675k498j513m63N55
59630E48414J051J262K089L569M572M482M101M212M298L620K688K536K975K647
59616E92516P66k010m398n560n378m277k927j714m64J146K960M372M944M774M329
$$ y = [568711, 569416, 569490, 569265, 568955, 568589, 568323, 568444, 568872, 569019, 568420, 567260, 566052, 565094, 564512, 564509, 565095, 565775, 565964, 565665, 565386, 565434, 565651, 565742, 565527, 564929, 564114, 563576, 563677, 564064, 563994, 563236, 562285, 561657, 561419, 561489, 561850, 562230, 562116, 561476, 561138, 561958, 563755, 565468, 566292, 566254, 565754, 564985, 564084, 563514, 563870, 565203, 566832, 568070, 568969, 570044, 571304, 572018, 571546, 569967, 567620, 564493, 560590, 556539, 553111, 550221, 547114, 543680, 540926, 539901, 540586, 542149, 543843, 545381, 546824, 548455, 550575, 553063, 555282, 556616, 557063, 557287, 558248, 560740, 564830, 569587, 573624, 576044, 576766, 576088, 574424, 572395, 570476, 568327, 565087, 560632, 556008, 552333, 549835, 548322, 547859, 548414, 549465, 550727, 552816, 556385, 560957, 565439, 569540, 573752, 578050, 581670, 584358, 586894, 589869, 592516, 593282, 591272, 586874, 581314, 575936, 571659, 568732, 567018, 566554, 567700, 570660, 575032, 579976, 584750, 589079]
59601E89079L983L626K739J010j124k819l661l812l458k681j913j837k624l761
59587E72747m809n709o214n831m666l595l132k839k289j842j848j912j659j563
59573E24839k102k727k624j965j419q67J82J243J218J58n01K43J856L214L758
59558E24506L553K978K705L191L908L790K716J819J949K584K787K566K650L336
59544E65038M246M979N510O015O725P931R901J2652J5872J8921K0994K1485K0172
59531G20441J6955J1748N201o71l467k360J271N294Q484J0745J2474J4051J5471
59518H15637J6121J5258J2920R874O554K644j936o378r831j2347j4407j6047j7063
59505H00999j7675j8169j8139j6888j4520j1990j0056q675p405n882m018k105
$$ y = [589079, 593062, 596688, 599427, 600437, 599313, 596494, 592833, 589021, 585563, 582882, 580969, 579132, 576508, 572747, 567938, 562229, 556015, 550184, 545518, 541923, 538791, 535952, 533663, 531821, 529973, 528061, 526402, 524839, 522737, 520010, 517386, 515421, 514002, 513135, 513317, 514560, 515778, 515936, 515435, 515678, 517534, 520748, 524506, 528059, 531037, 533742, 536933, 540841, 544631, 547347, 549166, 551115, 553699, 556486, 559052, 561702, 565038, 569284, 574263, 579773, 585788, 592513, 600444, 610345, 622997, 638869, 657790, 678784, 700269, 720441, 737396, 749144, 754345, 753674, 750207, 747847, 749118, 754412, 762896, 773641, 786115, 800166, 815637, 831758, 847016, 859936, 869810, 876364, 879008, 877072, 870694, 860863, 848516, 834109, 818062, 800999, 783324, 765155, 747016, 730128, 715608, 703618, 693562, 684887, 677482, 671600, 667582, 665477]
59493F65477p09M6Q22K169L509L830L271L141M185N763P047Q214R910J2154J4434
59478G43263J6518J8524K0475K2213K3533K4043K3205K0883J7577J3729R212M032
59466I57207q18l952m841l868j372K550P411J2460J7575K3259K9486L5428M0693
59453A111218M5951N1856N8123O4471P1601Q0095Q8581R4083R4027Q7016P1927
59442A918949M7930J6273j8788n1806p8670r7221j06463j06512r9372q8645p7763
59431A257912o8409o0562n3579m7043m0839l4896k9045k3084j6939j0660m325
59420H68531J916P779J3044J7867K2621K7213L0843L2829L3531L3979L4328L3000
59408A157481K7775J7794M411r744k2236l1410l6211l6235l2083k5274j7555j0380
$$ y = [665477, 664768, 664814, 665636, 667805, 671314, 675144, 678415, 681556, 685741, 691504, 698551, 706765, 716675, 728829, 743263, 759781, 778305, 798780, 820993, 844526, 868569, 891774, 912657, 930234, 943963, 953175, 957207, 956389, 952437, 947596, 943728, 942356, 944906, 952317, 964777, 982352, 1005611, 1035097, 1070525, 1111218, 1157169, 1209025, 1267148, 1331619, 1403220, 1483315, 1571896, 1665979, 1760006, 1847022, 1918949, 1966879, 1983152, 1964364, 1912558, 1833888, 1736667, 1630204, 1523692, 1424320, 1335675, 1257912, 1189503, 1128941, 1075362, 1028319, 987480, 952584, 923539, 900455, 883516, 872856, 868531, 870447, 878226, 891270, 909137, 931758, 958971, 989814, 1022643, 1056174, 1090153, 1124481, 1157481, 1185256, 1203050, 1207461, 1197717, 1175481, 1144071, 1107860, 1071625, 1039542, 1014268, 996713, 986333]
59396I86333m989k501l573q133j5507k4373l2460l7119l7058l3468k8822k4666
59384G33664k1064j7828j5224j3343j1700r917q272p126o360n686n078m445l457
59371F04164k095j054r47j378j258k7J743K912K789J859J526K845N370P660Q983
59356F33092R940J1309J3005J4650J6405J8514K0618K2315K4007K6376K9242L1709
59344H71182L3316L4310L4865L4750L3855L2346L0177K6930K2299J6399R561K121
59332A182111n588j3260k0527k6718l1079l3603l5170l6444l7070l6504l5097
59321H71051l3509l1513k8439k4584k1119j8587j6520j4510j2650j0791q495o003
59309F44331m182l122j826L00K605M459O418R192J2259J4462J5587J6398J7263
$$ y = [986333, 981344, 978843, 975270, 967137, 951630, 927257, 894797, 857678, 820620, 787152, 758330, 733664, 712600, 694772, 679548, 666205, 654505, 644588, 636316, 629190, 622830, 617144, 612066, 607621, 604164, 602069, 601015, 600068, 598690, 597432, 597405, 599148, 602060, 604849, 606708, 608234, 611079, 616449, 624109, 633092, 643032, 654341, 667346, 681996, 698401, 716915, 737533, 759848, 783855, 810231, 839473, 871182, 904498, 938808, 973673, 1008423, 1042278, 1074624, 1104801, 1131731, 1154030, 1170429, 1179990, 1182111, 1176523, 1163263, 1142736, 1116018, 1084939, 1051336, 1016166, 979722, 942652, 906148, 871051, 837542, 806029, 777590, 753006, 731887, 713300, 696780, 682270, 669620, 658829, 650334, 644331, 640149, 637027, 635201, 635501, 638106, 642565, 648983, 658175, 670434, 684896, 700483, 716881, 734144]
59296G34144J7466J5838J1629N023k693r692j4768j7822j9055j8248j5473j1961
59284F74388r303p849o561m491j782R19L338N610P866J0122J2447J4934J7549
59271G17187K0103K2388K4323K5935K7151K7595K6743K4321K0508J5774J0655
59260I62683N647J007l378p718j1889j5495j8310k0271k1172k0808j9493j7902
59248H12901j6231j4176j1832r892q485o665l715m33J872L247M985P669J0388
59235G69633J2154J3264J4627J6257J7133J6402J4212J1282Q057M538P16l195
59223H95080p040j0898j4745j8114k0470k1846k2650k2881k2018j9969j7655j6170
59211F80624j5575j4925j3406j1116q814p182o351n979n639n167m573l793k850
$$ y = [734144, 751610, 767448, 779077, 784100, 781407, 771715, 756947, 739125, 720070, 701822, 686349, 674388, 665085, 657236, 650675, 646184, 644402, 645321, 648659, 654269, 662135, 672257, 684704, 699638, 717187, 737290, 759678, 784001, 809936, 837087, 864682, 891425, 915746, 936254, 952028, 962683, 968330, 969337, 965959, 958241, 946352, 930857, 912547, 892276, 871104, 850296, 830803, 812901, 796670, 782494, 770662, 760770, 752285, 745620, 741905, 741472, 743344, 746591, 751576, 759245, 769633, 781787, 795051, 809678, 825935, 843068, 859470, 873682, 884964, 893021, 897559, 898275, 895080, 888040, 877142, 862397, 844283, 823813, 801967, 779317, 756436, 734418, 714449, 696794, 680624, 665049, 650124, 636718, 625602, 616788, 609606, 603255, 597276, 591637, 586470, 581897, 578104, 575254]
59198E75254k174k226k698k612j530k32K60o8m74n90o25n58P5J428K870L595L467
59181E73162L013K793K985L518M368N595P050Q253Q834R061R651J0959J2707J4574
59167F76523J6600J8707K0308K0927K0913K0960K1065K0536J8991J6764J4223
59156H86517J1183P312K722k068o543j0377j3368j5406j6476j6664j6255j5797
59144G94780j5810j6333j6953j7303j7363j7149j6433j5015j3145j1357r852q319
59132F19748o525m776l496k594j670q29o26r48o52J062L382M841N398O419Q524
59117F27258J0494J0931J0191R734J0130J0669J0740J0647J0831J1101J1028J0646
59105G54400J0331J0166R863R258Q595Q159P817P185O241N405M829L950K244K42
$$ y = [575254, 573080, 570854, 568156, 565544, 564014, 563782, 564042, 563974, 563500, 562910, 562285, 561727, 561802, 563230, 566100, 569695, 573162, 576175, 578968, 581953, 585471, 589839, 595434, 602484, 610737, 619571, 628632, 638283, 649242, 661949, 676523, 693123, 711830, 732138, 753065, 773978, 794938, 816003, 836539, 855530, 872294, 886517, 897700, 905012, 907734, 905666, 899123, 888746, 875378, 859972, 843496, 826832, 810577, 794780, 778970, 762637, 745684, 728381, 711018, 693869, 677436, 662421, 649276, 637919, 628067, 619748, 613223, 608447, 604951, 602357, 600687, 599858, 599232, 598284, 597632, 598694, 602076, 606917, 612315, 618734, 627258, 637752, 648683, 658874, 668608, 678738, 689407, 700147, 710794, 721625, 732726, 743754, 754400, 764731, 774897, 784760, 794018, 802613, 810772, 818589, 825774, 832015, 837420, 842249, 846199, 848443, 848685]
59091H48685q51n91K25O23M04j66r66j954l006m249o062q331j0229j1267j2028
59076G90237j3243j4595j5185j4869j4336j4006j3621j2856j1592r733p419n377
59064F43405m344m134l971l721l920m516m568l657k702k750l631m448m907n351
59050E86785n757n560m566l388k743k674k718k528k097j474n97N03J453J766J368
59035E57773Q02P52J404K316K950L235L630M678O438Q354R776J0597J1228J1989
59021F35922J2796J3521J4299J5189J5846J5859J5279J4426J3266J1350Q447M997
59009G91197J853l02j405j943k393k620j970j06K498N059P210R032J0601J1855
58995H28566J2722J3109J2944J2461J2075J1736J0741Q671O159M081K283j68l499
$$ y = [848685, 847834, 847243, 847468, 848091, 848495, 848329, 847363, 845409, 842403, 838154, 832092, 823761, 813532, 802265, 790237, 776994, 762399, 747214, 732345, 718009, 704003, 690382, 677526, 665934, 656201, 648782, 643405, 639061, 634927, 630956, 627235, 623315, 618799, 614231, 610574, 607872, 605122, 601491, 597043, 592136, 586785, 581028, 575468, 570902, 567514, 564771, 562097, 559379, 556851, 554754, 553280, 552683, 553186, 554639, 556405, 557773, 558575, 559327, 560731, 563047, 565997, 569232, 572862, 577540, 583978, 592332, 602108, 612705, 623933, 635922, 648718, 662239, 676538, 691727, 707573, 723432, 738711, 753137, 766403, 777753, 786200, 791197, 793050, 792748, 791343, 789400, 787007, 784387, 782417, 782311, 784809, 789868, 797078, 806110, 816711, 828566, 841288, 854397, 867341, 879802, 891877, 903613, 914354, 923025, 929184, 933265, 935548, 935380, 931881]
58982I31881o830r393j1407j3303j4598j4215j1846q556n849m265l056j268J082
58969H28377L145M477N575O996Q441R248R503J0018J1178J2356J2615J1640R845
58956I43414P720N307K290j375n179q601j1687j4640j6903j7531j6549j5112j3840
58943H37314j1958q757n024k005K89K613M764N622M677K326j169n755j0585j4202
58929G98150j5978j6470j6246j5404j4343j3713j3265j1959r654p590o613o059
58917F50856n048l807k855j840j96J760L353M622N935P116P880Q793J0738J3656
58903G00963J6588J8851K0468K1647K2534K3333K3937K3662K1980J9413J6993
58892I30369J5098J3572J2871J4045J7398K1855K6069K9592L2607L5027L6254
$$ y = [931881, 925051, 915658, 904251, 890948, 876350, 862135, 850289, 841733, 835884, 831619, 828563, 827295, 828377, 831522, 835999, 841574, 848570, 857011, 866259, 875762, 885780, 896958, 909314, 921929, 933569, 943414, 951134, 956441, 958731, 957356, 952177, 943576, 931889, 917249, 900346, 882815, 866266, 851154, 837314, 825356, 816599, 811575, 809570, 809859, 812472, 817236, 822858, 827535, 829861, 828692, 822937, 812352, 798150, 782172, 765702, 749456, 734052, 719709, 705996, 692731, 680772, 671118, 663528, 656915, 650856, 645808, 642001, 639146, 637306, 637110, 638870, 642223, 646845, 652780, 659896, 667776, 676569, 687307, 700963, 717551, 736402, 756870, 778517, 801051, 824384, 848321, 871983, 893963, 913376, 930369, 945467, 959039, 971910, 985955, 1003353, 1025208, 1051277, 1080869, 1113476, 1148503, 1184757]
58881A184757L5630L2855K8120K2108J5669R259K666m644j2806k1102k8299l3572
58869A230641l7112l9634m1202m1055l8699l4838l0803k7363k4472k1912j9681
58858H73870j7804j6345j5527j5443j5612j5271j4182j2849j1835j1218j0756
58847G17028j0166r133p456n502m167l996m548m968n064n297n806o078n795n438
58833F33614n527n684n176m224l875m420m836m242l164k605k470j810l50J251
58819E86482K587L898N159N738N406M912N007N409N361M760M169L924L780L348
58805F49940K490J338K23n52j037j616k409k942k711j990j633k072k782k889k123
58790F29235j064l82m5N84J877L496M880N819O309O281N905N821O440P189P056
$$ y = [1184757, 1220387, 1253242, 1281362, 1303470, 1319139, 1328398, 1331064, 1326420, 1313614, 1292512, 1264213, 1230641, 1193529, 1153895, 1112693, 1071638, 1032939, 998101, 967298, 939935, 915463, 893551, 873870, 856066, 839721, 824194, 808751, 793139, 777868, 763686, 750837, 739002, 727784, 717028, 706862, 697729, 690273, 684771, 680604, 676608, 672060, 667092, 662028, 656731, 650925, 644847, 639052, 633614, 628087, 622403, 617227, 613003, 609128, 604708, 599872, 595630, 592466, 589861, 587391, 585581, 585231, 586482, 589069, 592967, 598126, 603864, 609270, 614182, 619189, 624598, 629959, 634719, 638888, 642812, 646592, 649940, 652430, 653768, 653991, 653439, 652402, 650786, 648377, 645435, 642724, 640734, 639101, 637029, 634247, 631358, 629235, 628171, 627789, 627744, 628328, 630205, 633701, 638581, 644400, 650709, 656990, 662895, 668716, 675156, 682345, 689401]
58775F89401N838M214K672J084o00k008k953l726m490m840m354l158j772p49n35
58760F74024j211k227k886l115l242k986j538J126L782N264N643N718N954O339
58746F90645O707O835O603O402O794P537P678O932O259O522P301P609P152O275
58732G87251N274M464M360N058N876O233O417O846P146O759O017N755O148O664
58718H70268O875O703O160N604N818P147Q836R989J0801J1899J2901J2616J0687
58705I86304P958N198K238j368n643j0208j4508j7875j9991k1314k2537k3637
58693H64617k3989k3362k2163k0685j8794j6419j3834j1339r120p533o968p390
58681F83021q318r259r822r585q439o956n893n323m677l597k201n99J235L142
$$ y = [689401, 695239, 699453, 702125, 703209, 702609, 700601, 697648, 693922, 689432, 684592, 680238, 677080, 675308, 674559, 674024, 672813, 670586, 667700, 664585, 661343, 658357, 656819, 657945, 661727, 666991, 672634, 678352, 684306, 690645, 697352, 704187, 710790, 717192, 723986, 731523, 739201, 746133, 752392, 758914, 766215, 773824, 780976, 787251, 792525, 796989, 801349, 806407, 812283, 818516, 824933, 831779, 838925, 845684, 851701, 857456, 863604, 870268, 877143, 883846, 890006, 895610, 901428, 908575, 917411, 927400, 938201, 950100, 963001, 975617, 986304, 994262, 999460, 1001698, 1000330, 994687, 984479, 969971, 952096, 932105, 910791, 888254, 864617, 840628, 817266, 795103, 774418, 755624, 739205, 725371, 714032, 704912, 697379, 690411, 683021, 674703, 665444, 655622, 646037, 637598, 630642, 624749, 619426, 614749, 611152, 608951, 608352, 609587, 612729]
58667F12729M876O594Q732J1295J3698J5309J5791J5004J3094J0624Q146N650
58655G41542K884J34j852k729k823k543k034j515j400j931k938m070m938n183
58641G10604m743l933l000j775j87J222J905K202K985M474N981O736O436N133
58627G34040L300J887J554J789J440J73j167j664j060O10L293O529R516J1901
58613G72141J4017J6124J7855J8728J8648J7651J5555J2284Q257M203P20j834
58601I14349l304l806l735l555l570l748l782l512l352l848m731m894l748j920
58587H62844k09J628M230P351J0124J2203J3859J5168J5993J6468J6596J5671
58575I91926J3213J0213Q271P528O685N090L598L133L680N011P188R835J2048
$$ y = [612729, 617605, 624199, 632931, 644226, 657924, 673233, 689024, 704028, 717122, 727746, 735892, 741542, 744426, 744560, 742708, 739979, 737156, 734613, 732579, 731064, 729664, 727733, 724795, 720725, 715787, 710604, 705861, 701928, 698928, 697153, 696966, 698188, 700093, 702295, 705280, 709754, 715735, 722471, 728907, 734040, 737340, 739227, 740781, 742570, 744010, 744183, 743016, 741352, 740292, 740902, 744195, 750724, 760240, 772141, 786158, 802282, 820137, 838865, 857513, 875164, 890719, 903003, 911260, 915463, 916183, 914349, 911045, 907239, 903504, 899949, 896379, 892631, 888849, 885337, 881985, 878137, 873406, 868512, 864764, 862844, 862635, 864263, 868493, 875844, 885968, 898171, 912030, 927198, 943191, 959659, 976255, 991926, 1005139, 1015352, 1023623, 1031151, 1037836, 1042926, 1046524, 1049657, 1053337, 1058348, 1065536, 1075371, 1087419]
58562A087419J3641J5446J7800J9769K0525K0443J9992J8531J5292J0835O366
58551A266059K073k644p531j1240j2868j2886j2370j1926j1602j1350j1274j1663
58539A150778j2858j4926j7389j9406k0346k0159j9317j8389j7503j6166j3772
58528I60547j0402o897m085k100n31J035K716M416N967P211P963P982P114N552
58514I86488L745K035O40l7M14J604K386K112J438J440K382L923N822P670Q511
58499A030573P872O857P114Q697J0027R942Q783P345N804M029K107J76j728l468
58485A104130m856n926o605o338m743k371n3K244M942P535Q936R025Q658Q042
58471A122620O440L585J73l276o809r984j1835j2337j2647j3328j3592j2831j1640
$$ y = [1087419, 1101060, 1116506, 1134306, 1154075, 1174600, 1195043, 1215035, 1233566, 1248858, 1259693, 1266059, 1268132, 1265488, 1257957, 1246717, 1233849, 1220963, 1208593, 1196667, 1185065, 1173715, 1162441, 1150778, 1137920, 1122994, 1105605, 1086199, 1065853, 1045694, 1026377, 1007988, 990485, 974319, 960547, 950145, 943248, 939163, 937063, 936532, 937567, 940283, 944699, 950666, 957877, 965840, 973822, 980936, 986488, 990233, 992268, 992908, 992871, 993285, 994889, 997275, 999387, 1000825, 1002265, 1004647, 1008570, 1014392, 1022062, 1030573, 1038445, 1045302, 1052416, 1061113, 1071140, 1081082, 1089865, 1097210, 1103014, 1107043, 1109150, 1109326, 1107598, 1104130, 1099274, 1093348, 1086743, 1080405, 1075662, 1073291, 1073238, 1075482, 1080424, 1087959, 1096895, 1105920, 1114578, 1122620, 1129060, 1132645, 1132818, 1129542, 1122733, 1112749, 1100914, 1088577, 1075930, 1062602, 1049010, 1036179, 1024539]
58458A024539j0582r167o948m562k685q81J524M139N975O558N877L932J181j250
58444A017650k655l556m757o171p130p260o436m575k143j78R20J941L564N231
58430I84445O129O552P377Q692R906J0845J1945J3530J5485J7393J8605J8544
58418A129448J7301J5379J2682Q592L465j042l787n358o646p357p063o779p986
58405A140849j0432j2299j2422j1293r864q403o664m424j687J180L544N081O112
58392A079278P021P591P343O184M341K040l71k345l631m564n481o219o397n863
58378A078927m581k678p46M66R33J306J830K097K020K103K437K465K235K722M379
58363A095915O392Q096R976J2401J4450J5092J4674J4229J3970J3469J2583J1232
$$ y = [1024539, 1013957, 1004790, 997842, 993280, 990595, 989714, 991238, 995377, 1001352, 1007910, 1013787, 1017719, 1018900, 1017650, 1014995, 1011439, 1006682, 1000511, 993381, 986121, 979685, 975110, 972967, 972789, 973709, 975650, 979214, 984445, 990574, 997126, 1004503, 1013195, 1023101, 1033946, 1045891, 1059421, 1074906, 1092299, 1110904, 1129448, 1146749, 1162128, 1174810, 1183402, 1186867, 1185825, 1182038, 1176680, 1170034, 1162677, 1155614, 1148835, 1140849, 1130417, 1118118, 1105696, 1094403, 1084539, 1076136, 1069472, 1065048, 1063361, 1064541, 1068085, 1073166, 1079278, 1086299, 1093890, 1101233, 1107417, 1111758, 1113798, 1113427, 1111082, 1107451, 1102887, 1097406, 1091187, 1084790, 1078927, 1074346, 1071668, 1070922, 1071388, 1072321, 1073627, 1075457, 1077554, 1079574, 1081677, 1084114, 1086579, 1088814, 1091536, 1095915, 1102307, 1110403, 1120379, 1132780, 1147230, 1162322, 1176996, 1191225, 1205195, 1218664, 1231247, 1242479]
58351A242479Q913N487J890q22k581l708l922k906j171N96K556N084P727R661
58337A269283J0863J1969J3323J4812J6224J7160J7158J6440J5880J5684J4904
58326A433700J2916J0536Q919Q146P611P047O467N883N722O662Q448R903J0696
58313A542656J1845J3824J5547J6234J6881J8696K1230K3283K4626K5631K6323
58302A756776K6936K8251L0289L1695L1541L0518K9342K7481K4735K2440K1553
58291B061557K1081K0058J9590K1047K3601K5576K7020K8864L0719L1660L2244
58280B343017L3640L5458L6509L6962L7882L9306M0531M1675M3141M4474M5309
58269B777904M6606M9200N2180N4457N6757O0269O4441O7990P1032P4320P7560
$$ y = [1242479, 1251392, 1256879, 1258769, 1257947, 1255366, 1251658, 1247736, 1244830, 1243659, 1244255, 1246811, 1251895, 1259622, 1269283, 1280146, 1292115, 1305438, 1320250, 1336474, 1353634, 1370792, 1387232, 1403112, 1418796, 1433700, 1446616, 1457152, 1466071, 1474217, 1481828, 1488875, 1495342, 1501225, 1506947, 1513609, 1522057, 1531960, 1542656, 1554501, 1568325, 1583872, 1600106, 1616987, 1635683, 1656913, 1680196, 1704822, 1730453, 1756776, 1783712, 1811963, 1842252, 1873947, 1905488, 1936006, 1965348, 1992829, 2017564, 2040004, 2061557, 2082638, 2102696, 2122286, 2143333, 2166934, 2192510, 2219530, 2248394, 2279113, 2310773, 2343017, 2376657, 2412115, 2448624, 2485586, 2523468, 2562774, 2603305, 2644980, 2688121, 2732595, 2777904, 2824510, 2873710, 2925890, 2980347, 3037104, 3097373, 3161814, 3229804, 3300836, 3375156, 3452716]
58258C452716Q0321Q3293Q6814Q9583R0739R1544R3106R4341R4493R5579R9573
58247D452102J05196J10314J15655J23094J32192J41472J51337J62497J73520
58238E667379J83269J93709K06775K20717K33336K46486K63063K81855K99911
58229G796500L17929L38501L61181L84342M09880M40699M75445N11347N50219
58220A1586043N95947O48068P04083P66031Q38198R20430J010796J112729J232151
58211A9414476J369860J524992J703832J916560K167967K461166K808158L226206
58203C6593217L726773M320443N030457N888092O917149Q137591R581006J1285098
58195I1479826J3277418J5584384J8243838K1265148K4562803K7949027L1163293
$$ y = [3452716, 3533037, 3616330, 3703144, 3792727, 3883466, 3975010, 4068116, 4162457, 4256950, 4352529, 4452102, 4557298, 4667612, 4783267, 4906361, 5038553, 5180025, 5331362, 5493859, 5667379, 5850648, 6044357, 6251132, 6471849, 6705185, 6951671, 7214734, 7496589, 7796500, 8114429, 8452930, 8814111, 9198453, 9608333, 10049032, 10524477, 11035824, 11586043, 12181990, 12830058, 13534141, 14300172, 15138370, 16058800, 17069596, 18182325, 19414476, 20784336, 22309328, 24013160, 25929720, 28097687, 30558853, 33367011, 36593217, 40319990, 44640433, 49670890, 55558982, 62476131, 70613722, 80194728, 91479826, 104757244, 120341628, 138585466, 159850614, 184413417, 212362444, 243525737]
58188B43525737L3806177L5183867L4314807L0292556K2817160J2482083O28836
58181D13051223j1063662k1024045k8179548l2221004l3581797l3077607l1444231
58174B22459329k9110474k6289178k3171058j9997644j6999974j4324063j2019728
58167H0547210j0075841q457295p123186o030446n135322m398754l790327l285618
58159C2250421k862669k504323k200934j946100j731210j547582j391061j259545
58151A6806997j147739j048939r60293q81655q10569p43069o78490o18953n64698
58142I352592n13936m66631m24523l87790l55249l27320l05300k88140k73206
58133F010497k59620k47762k36286k23065k08650j95568j84471j73980j63803
$$ y = [243525737, 277331914, 312515781, 346830588, 377123144, 399940304, 412422387, 413051223, 401987561, 380963516, 352783968, 320562964, 286981167, 253903560, 222459329, 193348855, 167059677, 143888619, 123890975, 106891001, 92566938, 80547210, 70471369, 62014074, 54890888, 48860442, 43725120, 39326366, 35536039, 32250421, 29387752, 26883429, 24682495, 22736395, 21005185, 19457603, 18066542, 16806997, 15659258, 14610319, 13650026, 12768371, 11957802, 11214733, 10536243, 9917290, 9352592, 8838656, 8372025, 7947502, 7559712, 7204463, 6877143, 6571843, 6283703, 6010497, 5750877, 5503115, 5266829, 5043764, 4835114, 4639546, 4455075, 4281095, 4117292]
58124D117292j54950j47114j38843j30193j22578j16205j10134j04471j00037
58115B992767r6281r1957q7381q3607p9990p5149o9740o5623o2776n9713n6486
58104B164064n4456n3436n1888m9774m8438m7662m5757m2661m0276l9325l8351
58093A652040l6382l4245l2708l1458l0328k9624k8816k6855k4130k2343k2116
58082A333035k2430k2606k2924k3202k2588k1206k0189j9735j8812j7066j5413
58071A106864j4396j3600j2943j2937j3307j2911j1406r632q156o806n758n565
58059I79447n936n967n779o452q105r605j0318j0713j0995j0660r699q811q133
58046H68274p159o116n968o809p679q195q921r860j0123r447q602p998p267o556
$$ y = [4117292, 3962342, 3815228, 3676385, 3546192, 3423614, 3307409, 3197275, 3092804, 2992767, 2896486, 2804529, 2717148, 2633541, 2553551, 2478402, 2408662, 2343039, 2280263, 2220550, 2164064, 2109608, 2056172, 2004284, 1954510, 1906072, 1858410, 1812653, 1769992, 1729716, 1690391, 1652040, 1615658, 1581413, 1548705, 1517247, 1486919, 1457295, 1428479, 1401624, 1377494, 1355151, 1333035, 1310605, 1287999, 1265075, 1241873, 1219285, 1198079, 1177890, 1158155, 1139343, 1122277, 1106864, 1092468, 1078868, 1065925, 1052988, 1039681, 1026770, 1015364, 1005732, 997576, 990770, 985012, 979447, 973511, 967544, 961765, 955313, 947208, 937603, 927285, 916572, 905577, 894917, 885218, 876407, 868274, 861115, 854999, 849031, 842222, 834543, 826348, 817427, 807567, 797444, 787997, 779395, 771397, 764130, 757574]
58032G57574o696p619q181q030q192r189j0062r970r426r110q651p476n902m625
58018F44445l880l664l925m182l838l195l131l490l036j504l63q23k170k964k864
58003F01416k415j879j246p99p82r09q04n61m06k48j2P2q2j56K9J27k61j027j734
57984E88323k064k005j896k191k844l143k657k020k072k628k929l014l539m396
57970E50925m644l860k534j134K12J083R77L04P7N17R71J198J594K040J792P72
57954E50290k01p60j422k411l266l833m458m896m363l063k305k563k765k076j126
57939E10782p03m99K8O52J058J593K513L439M158N015N833N588L922J962P37j54
57923E45924j498l105m432n598o720p265p076p117q024q790q190o721n756n427
$$ y = [757574, 750878, 743259, 735078, 727048, 718856, 709667, 699605, 689635, 680209, 671099, 662448, 654972, 649070, 644445, 640565, 636901, 632976, 628794, 624956, 621761, 618630, 615140, 612104, 610600, 610237, 609414, 607244, 604280, 601416, 599001, 597122, 595876, 595077, 594295, 593386, 592582, 592021, 591615, 591367, 591355, 591427, 591345, 591189, 591218, 591345, 591084, 590057, 588323, 586259, 584254, 582358, 580167, 577323, 574180, 571523, 569503, 567431, 564803, 561874, 558860, 555321, 550925, 546281, 542421, 539887, 538753, 538965, 540048, 541025, 541329, 541406, 541923, 542894, 544092, 545686, 547726, 549518, 550290, 550089, 549329, 547907, 545496, 542230, 538397, 533939, 529043, 524680, 521617, 519312, 516749, 513984, 511908, 510782, 510079, 509580, 509608, 510260, 511318, 512911, 515424, 518863, 523021, 528036, 533869, 539457, 543379, 545341, 546078, 545924, 544426, 541321, 536889, 531291, 524571, 517306, 510230, 503113, 495089, 486299, 478109, 471388, 465632, 460205]
57909D60205m792l647k725k251j718j035p39r33j114j211j800l046m187m371l494
57894D23142k089q26j85j64l02j83J58N27R81J575K140K562K931L071K508J353
57878D37199N79P21R73K66j231k560l445m354n357n895n665m949m095l337l028
57863C95822l302l568l069j924r21l46K12R05J309J322J515K276L110L358L185
57848C99884L316L944M392L963K873K013J845J817J202K50r4K95J97j513m246
57833D20138o172o126m635l123k515k577k431j541k78N56O61M94N49P98R20P49
57817C95467L41p2r1N04J281J433O24q15k603m797p181r035r854r834r347q455
57801C37566p259o170n432m832m222l792l560l232k875l008l525l367j978l62
$$ y = [460205, 455413, 451766, 449041, 446790, 445072, 444037, 443298, 442365, 441251, 440040, 438240, 435194, 431007, 426636, 423142, 421053, 420227, 420042, 419878, 419576, 419393, 419551, 420078, 421059, 422634, 424774, 427336, 430267, 433338, 435846, 437199, 437778, 438499, 439472, 439738, 438507, 435947, 432502, 428148, 422791, 416896, 411231, 406282, 402187, 398850, 395822, 392520, 388952, 385883, 383959, 383038, 382692, 382904, 383809, 385118, 386440, 387955, 390231, 393341, 396699, 399884, 403200, 407144, 411536, 415499, 418372, 420385, 422230, 424047, 425249, 425499, 425405, 425700, 425897, 424384, 420138, 413966, 407840, 403205, 400082, 397567, 394990, 392559, 391018, 390740, 391296, 391957, 392451, 393000, 393798, 394718, 395467, 395808, 395736, 395645, 396149, 397430, 398863, 399487, 398672, 396069, 391272, 384091, 375056, 365202, 355368, 346021, 337566, 330307, 324137, 318705, 313873, 309651, 305859, 302299, 299067, 296192, 293184, 289659, 286292, 284314, 283952]
57787B83952J34m45j009r88o47j50O79J790K812L531L917L897L660L817M677N593
57771C15220N716N102M382L672K599J240J48n86j479k786m053m729m785m600m584
57756C10477m824m975m591l761l052k591j834n73M85P58O91Q19O81k74j315j201
57740B84920j33M42r4q76j087r57r00p24k33J75N0m94j050j345j181n23K18M87
57722B76695L57M40R76J563J887K080K203J962J206K34n70j077j289j323j477
57707B83867j857k032j609r45o38n10J04J054J455J091Q10J186J767K077K303
57692B88123K505K066P38n32p08j76k15j123j713p44J631M119N691O571P814J0075
57676C24122J3088J6498K0623K5866L1715L7252M2501M8204N3973N7594N6511
$$ y = [283952, 284086, 283641, 282632, 281644, 280997, 280847, 281526, 283316, 286128, 289659, 293576, 297473, 301133, 304950, 309627, 315220, 320936, 326038, 330420, 334092, 336691, 337931, 338079, 337493, 336014, 333228, 329175, 324446, 319661, 315061, 310477, 305653, 300678, 296087, 292326, 289274, 286683, 284849, 284276, 284761, 285519, 286210, 287029, 287710, 287436, 286121, 284920, 284787, 285229, 285135, 284259, 283172, 282215, 281315, 280591, 280358, 280533, 280583, 280089, 279039, 277694, 276513, 275990, 276208, 276695, 277052, 277492, 278468, 280031, 281918, 283998, 286201, 288163, 289369, 289603, 289033, 287956, 286667, 285344, 283867, 282010, 279978, 278369, 277424, 276786, 276276, 276380, 277434, 278889, 279980, 280790, 281976, 283743, 285820, 288123, 290628, 292694, 293432, 292900, 292192, 292016, 291801, 290678, 288965, 288221, 289852, 293971, 299662, 306233, 314047, 324122, 337210, 353708, 374331, 400197, 431912, 469164, 511665, 559869, 613842, 671436, 727947]
57665G27947M9365L5915J6742o027k8423m6218n7037o0844n9084n3858m7298m0701
57653D30479l4239k7827k1999j7457j4167j1498r121p209n919n137m664m284l799
57640B63159l236k850k658k309j729j436j765k168j904j100n26n06p12q87j124
57625B38249j345j184n61N2J41k97q43j098j001r04j278k128k838k823k232j694
57609B18216j435j059k00Q82J497J192J93p01p80j06N60O40L14N3p2k98o49j008
57591B17239j523k387l225l291k429j401r55r58p60j76K85J01o21j252j259o72
57575A96716l8O1m48j049j088m09N21J116J289J393J605J629J135L11l61o70p36
57558B00977n86q7O41J124J027N09K0o5M10J270J944J901J242N74K23n6m29n37
$$ y = [727947, 777312, 813227, 829969, 823942, 795519, 749301, 692264, 631420, 572336, 518478, 471180, 430479, 396240, 368413, 346414, 328957, 314790, 303292, 294171, 286962, 281043, 275906, 271242, 266958, 263159, 259923, 257073, 254415, 252106, 250377, 248941, 247176, 245008, 243104, 242004, 241478, 240972, 240260, 239373, 238249, 236904, 235720, 235159, 235211, 235352, 235055, 234212, 233114, 232113, 231209, 229931, 227803, 224965, 222142, 219910, 218216, 216781, 215722, 215522, 216404, 217901, 219093, 219286, 218585, 217805, 217699, 218259, 218899, 219213, 219266, 219194, 218896, 218247, 217239, 215716, 213329, 210104, 206813, 204384, 202983, 202028, 201070, 200310, 200134, 200419, 200520, 199899, 198647, 197388, 196716, 196678, 196739, 196291, 195242, 194154, 193745, 194266, 195382, 196671, 198064, 199669, 201298, 202433, 202744, 202383, 201713, 200977, 200391, 200304, 200945, 202069, 203096, 203605, 203625, 203560, 203970, 205240, 207184, 209085, 210327, 210901, 211124, 211068, 210639, 210102]
57540B10102n1P50J294J362J100P08L68K17Q6m13j191j466p37L65P80L48j26o7
57522B13429K36K44j11m28k38O50J860K562K225J261N78N70Q92J112J115R12O05
57505B27474N03Q11J097P21j90p72o18l14m88j000j437j811k193k225j693j190
57489B16675j410j962j721l85J083J723J578J214Q50M84L32N47P85N63jl82m65
57472B19508o56j115j413j243r64j055j285r63J01J297K018K315K544K665K339
57457B24093J540P64M92O73R25J040J100J160J138J058J081J187R86K41o03q24
57441B36051l36J83K15K7J17M52O64P81J141J664J753J115K79%M10R51J024N28
57423B47019j01k28M60J601K371K187J165m7q19q87m04K85Q70J174J087O27K08
$$ y = [210102, 210051, 210801, 212095, 213457, 214557, 215265, 215633, 215850, 215936, 215523, 214332, 212866, 212129, 212494, 213274, 213622, 213496, 213429, 213665, 213909, 213798, 213370, 213132, 213782, 215642, 218204, 220429, 221690, 222268, 222838, 223730, 224842, 225957, 226869, 227474, 227977, 228788, 229885, 230606, 230416, 229644, 229026, 228712, 228224, 227224, 225787, 223976, 221783, 219558, 217865, 216675, 215265, 213303, 211582, 211197, 212280, 214003, 215581, 216795, 217645, 218129, 218461, 219008, 219793, 220356, 220355, 219973, 219508, 218852, 217737, 216324, 215081, 214117, 213062, 211777, 210814, 210915, 212212, 214230, 216545, 219089, 221754, 224093, 225633, 226397, 226889, 227562, 228487, 229527, 230627, 231787, 232925, 233983, 235064, 236251, 237237, 237478, 236875, 236051, 235715, 235898, 236113, 236140, 236257, 236709, 237373, 238154, 239295, 240959, 242712, 243827, 244106, 244106, 244516, 245467, 246491, 247019, 246918, 246690, 247150, 248751, 251122, 253309, 254474, 254427, 253608, 252721, 252317, 252602, 253472, 254646, 255733, 256360, 256568]
57406B56568N08J664K792K824J819R40R98J533J609J002J98l75o09m34J47P85
57390B71969R13L63m15p18j61J068K340L074L264L382L706L957L821L537L569
57375C03669L833L707K830J597P53P31J424K319K824K634J997J443J270J345J447
57360C33823J557J723J825J734J586J735K267K820L002K912K976L283L433L187
57346C67863K899K973L201L105K779K775L124L173K557J782J527J817K273K728
57332D04576L175L457L505L571L806L846L349K652K364K447K317J866J686K201
57318D44818L072L642L621L147K538K160K282K823L412L865M406N310O451P337
57304D98884P520O983O187N679N655N936O383P049P786Q092P737P253P293P704
$$ y = [256568, 257076, 258740, 261532, 264356, 266175, 267115, 268113, 269646, 271255, 272257, 272455, 272080, 271471, 271037, 271184, 271969, 272882, 273245, 272830, 272112, 271951, 273019, 275359, 278433, 281697, 285079, 288785, 292742, 296563, 300100, 303669, 307502, 311209, 314039, 315636, 316389, 317120, 318544, 320863, 323687, 326321, 328318, 329761, 331031, 332376, 333823, 335380, 337103, 338928, 340662, 342248, 343983, 346250, 349070, 352072, 354984, 357960, 361243, 364676, 367863, 370762, 373735, 376936, 380041, 382820, 385595, 388719, 391892, 394449, 396231, 397758, 399575, 401848, 404576, 407751, 411208, 414713, 418284, 422090, 425936, 429285, 431937, 434301, 436748, 439065, 440931, 442617, 444818, 447890, 451532, 455153, 458300, 460838, 462998, 465280, 468103, 471515, 475380, 479786, 485096, 491547, 498884, 506404, 513387, 519574, 525253, 530908, 536844, 543227, 550276, 558062, 566154, 573891, 581144, 588437, 596141]
57290E96141P788P477P552Q510R773J0423J0324J0168J0518J1253J1872J2125
57278G13924J2201J2349J2449J2213J1757J1670J2154J2441J1611R935Q805R148
57266H50657J0447J1587J2157J2516J2869J2876J2210J1063R952R190Q718Q404
57254I82646Q328Q720R564J0473J1034J1291J1700J2634J4050J5579J6815J7584
57242A130418J8000J8248J8338J8194J8014J8199J8751J9080J8819J8449J8709
57231A333219J9604K0605K1638K3160K5248K7330K9035L0629L2283L3551L4011
57220A630313L4047L4409L5165L5598L5033L3512L1690L0332K9850L0102L0599
57209A990650L0975L1260L1782L2937L4947L7609M0265M2332M3824M5102M6240
$$ y = [596141, 603929, 611406, 618958, 627468, 637241, 647664, 657988, 668156, 678674, 689927, 701799, 713924, 726125, 738474, 750923, 763136, 774893, 786563, 798717, 811158, 822769, 832704, 841509, 850657, 861104, 872691, 884848, 897364, 910233, 923109, 935319, 946382, 956334, 965524, 974242, 982646, 990974, 999694, 1009258, 1019731, 1030765, 1042056, 1053756, 1066390, 1080440, 1096019, 1112834, 1130418, 1148418, 1166666, 1185004, 1203198, 1221212, 1239411, 1258162, 1277242, 1296061, 1314510, 1333219, 1352823, 1373428, 1395066, 1418226, 1443474, 1470804, 1499839, 1530468, 1562751, 1596302, 1630313, 1664360, 1698769, 1733934, 1769532, 1804565, 1838077, 1869767, 1900099, 1929949, 1960051, 1990650, 2021625, 2052885, 2084667, 2117604, 2152551, 2190160, 2230425, 2272757, 2316581, 2361683, 2407923]
57198B407923M7097M7885M9028N0294N0741M9918M8541M7608M7272M7047M6660
57187B940014M6197M5750M5496M5827M6887M8183M9168N0068N1519N3509N5315
57176C477933N6506N7380N8319N9181N9643N9745N9844O0115O0357O0192N9432
57165D128647N8267N7022N5639N3628N0771M7738M5541M4380M3423M1794L9502
57154D666352L7215L5432L4117L2954L1656L0076K8190K6087K3905K1663J9168
57143D986815J6114J2324P966L522l78l226n026o567q940j2427j6040j8584k0013
57130D935540k1179k2414k3143k3051k2691k2464k1726j9580j6045j1716o711
57119D724820p44N942J2445J7890K1697K3551K3820K4026K6235L1966M2031N6818
$$ y = [2407923, 2455020, 2502905, 2551933, 2602227, 2652968, 2702886, 2751427, 2799035, 2846307, 2893354, 2940014, 2986211, 3031961, 3077457, 3123284, 3170171, 3218354, 3267522, 3317590, 3369109, 3422618, 3477933, 3534439, 3591819, 3650138, 3709319, 3768962, 3828707, 3888551, 3948666, 4009023, 4069215, 4128647, 4186914, 4243936, 4299575, 4353203, 4403974, 4451712, 4497253, 4541633, 4585056, 4626850, 4666352, 4703567, 4738999, 4773116, 4806070, 4837726, 4867802, 4895992, 4922079, 4945984, 4967647, 4986815, 5002929, 5015253, 5023219, 5026741, 5026363, 5023137, 5018111, 5011544, 5002604, 4990177, 4974137, 4955553, 4935540, 4914361, 4891947, 4868804, 4845753, 4823062, 4800598, 4778872, 4759292, 4743247, 4731531, 4724820, 4724076, 4730018, 4742463, 4760353, 4782050, 4805601, 4829421, 4853447, 4879682, 4911648, 4953679, 5010497]
57107E010497P5835R7280J19210J41414J65517J93481K26996K68290L20389L86260
57097G005169M68707N71175O97256Q48382J022245J213053J411725J605642J780408
57088A6623762J923834K028146K088523K101449K064748J975308J823237J591259
57080C2220266J267408Q62239M11441m1439m65479q47714j184081j470407j701679
57071B9050555j875378j992378k055206k066719k030474j951791j838419j700064
57063A3540126j546770j387308j228768j077045r36902q11454p01888o07795n27679
57054D714517m59607m01904l53432l13064k79187k50135k24827k02665j83033
57045B046663j65408j49667j35777j23304j11825j01477r2509q4403p6231o7785
$$ y = [5010497, 5086332, 5183612, 5302822, 5444236, 5609753, 5803234, 6030230, 6298520, 6618909, 7005169, 7473876, 8045051, 8742307, 9590689, 10612934, 11825987, 13237712, 14843354, 16623762, 18547596, 20575742, 22664265, 24765714, 26830462, 28805770, 30629007, 32220266, 33487674, 34349913, 34761354, 34719915, 34254436, 33406722, 32222641, 30752234, 29050555, 27175177, 25182799, 23127593, 21060874, 19030400, 17078609, 15240190, 13540126, 11993356, 10606048, 9377280, 8300235, 7363333, 6551879, 5849991, 5242196, 4714517, 4254910, 3853006, 3499574, 3186510, 2907323, 2657188, 2432361, 2229696, 2046663, 1881255, 1731588, 1595811, 1472507, 1360682, 1259205, 1166696, 1082293, 1006062, 938277]
57035I38277n9549n1591m3242l4070k4337j4322l977O537J6792K6775L6630M5077
57023H39000M8785M4022K8817L879k7123n7609q0108r0339q9566q2407p2739o2319
57011D02293n2190m3445l6453l0625k5443k0908j6943j3235r922p536o089m917
56999A34587l737l016l024l234l083k685k400k177j663o41R19K811M534N737O747
56984A29675Q000R005Q620O524L496O8m014q491j1819j2688j1590j0025q691p290
56970I0780n639l985k413q03P36K036L363N039O853Q412R950J1948J4060J5144
56956A55481J4465J2176Q613L815j933p628j1964j4172j4435j3669j2819j2037
56944A05893j0574p835m344j278Q72K747N198Q397J1892J5176J7990K0285K1960
$$ y = [938277, 878728, 827137, 783895, 749825, 725488, 711166, 707189, 713726, 730518, 757293, 793923, 839000, 887785, 931807, 960624, 964503, 937380, 879771, 799663, 709324, 619758, 537351, 464612, 402293, 350103, 306658, 270205, 239580, 214137, 193229, 176286, 163051, 153129, 145593, 139504, 134587, 130850, 127834, 124810, 121576, 118493, 115808, 113408, 111231, 109568, 108927, 109846, 112657, 117191, 122928, 129675, 137675, 146680, 155300, 161824, 165320, 165388, 161374, 152883, 141064, 128376, 116786, 106761, 98070, 90780, 85141, 81156, 78743, 77940, 78676, 80712, 84075, 89114, 95967, 104379, 114329, 126277, 140337, 155481, 169946, 182122, 190735, 194550, 192617, 184989, 173025, 158853, 144418, 130749, 117930, 105893, 95319, 87484, 83140, 81862, 82734, 85481, 90679, 99076, 110968, 126144, 144134, 164419, 186379]
56931A86379K2575K1488J8396J3572P401Q2p849j5061k0069k2326k2322k0867
56919A61399j8692j6389j4187j1865r350p166n746m621l034j140K39R14J488K183
56905G4033K512K304K146K435K756K705K597K834L151L154L195M036N860Q089
56891A21807J0062J1505J2530J3462J4565J5609J5739J4025J0173M740j148o302
56879B36767j0026j2274j3173j2524j0241p050m088j640J051M515Q273J1701J5000
56866B06291J8743K2963K7304L1706L6263M0522M3459M4026M1322L4512K3378
56855E70489R140n693j8489k7514l2207l2981l0854k6754k1044j3922o149J122
56843C65144P388J3269J9637K6595L3685M0819M8395N6347O3529O8277O9171O4928
$$ y = [186379, 208954, 230442, 248838, 262410, 269811, 269893, 262044, 246983, 226914, 204588, 182266, 161399, 142707, 126318, 112131, 100266, 90916, 83750, 78004, 73383, 70349, 69209, 69448, 70362, 71850, 74033, 76545, 78849, 80995, 83430, 86186, 88891, 91488, 94322, 97473, 100627, 103822, 107858, 113718, 121807, 131869, 143374, 155904, 169366, 183931, 199540, 215279, 229304, 239477, 244217, 243069, 236767, 226741, 214467, 201294, 188770, 178529, 171479, 167391, 165751, 166802, 171317, 179590, 191291, 206291, 225034, 247997, 275301, 307007, 343270, 383792, 427251, 471277, 512599, 547111, 570489, 579629, 573936, 555447, 527933, 495726, 462745, 431891, 405137, 384093, 370171, 364022, 365144, 372532, 385801, 405438, 432033, 465718, 506537, 554932, 611279, 674808, 743085, 812256, 877184]
56831H77184N4107L6067J2515j2523l4795n1767o2603o7252o6343o1369n3947
56820E69274m4920l4799k4719j5922q364q63P143J4912K1740K8033L4446M0658
56808E86619M5422M7405M5416L8523K6525J0248q720k8049m4432n4668n7888n6154
56796E50247n2124m6680l9549l1425k4014j8161j3103p793k128L348Q218J2395
56784C39231J6043J9474K2640K4626K4147K0629J4437O122l875j4541k4117l1066
56772D13750l4951l6088l4863l1788k7841k4043k0732j7629j4624j2154j0630
56761A48407r860r193q198o981n939n322n114n110n043m744m321m059m002l754
56747F6767k940j758q42n22n63o35o96p95q47p53n93m67k99l0J92J55j60n10n82
$$ y = [877184, 931291, 967358, 979873, 967350, 932555, 880788, 818185, 750933, 684590, 623221, 569274, 524354, 489555, 464836, 448914, 440550, 439687, 446830, 461742, 483482, 511515, 545961, 586619, 632041, 679446, 724862, 763385, 789910, 800158, 791438, 763389, 718957, 664289, 606401, 550247, 498123, 451443, 411894, 380469, 356455, 338294, 325191, 317398, 315270, 318618, 326836, 339231, 355274, 374748, 397388, 422014, 446161, 466790, 481227, 487349, 483474, 468933, 444816, 413750, 378799, 342711, 307848, 276060, 248219, 224176, 203444, 185815, 171191, 159037, 148407, 138547, 129354, 121156, 114175, 108236, 102914, 97800, 92690, 87647, 82903, 78582, 74523, 70521, 66767, 63827, 62069, 61227, 60705, 60142, 59507, 58811, 58016, 57169, 56416, 55823, 55356, 55057, 55027, 55219, 55374, 55214, 54704, 54122]
56728E4122k19M15R31J095J058J068J131J128J103J090Q91M05k7l9K27N33J143
56711F6055K221K921K201N22l62L30J450J640R25L1q39j632j774q75L40Q26N46
56694G4526J96P3L7J54N19O94L18k2O03J994K873K413J043k23o63j53P26R50M8
56675H6106j202j603r41jN45O22L16j98l27M64J751K406J901Q64J47l1N9J87K75
56656I1340L32L69L10O0j16K42R94J241N11l38j76Q38J596J636J464J488J547
56639A03338J557J672J733J351O25P8j83m55o07j30Q96J702J862J630J129Q5j361
56622A14922k361k322j533o16J01M40K93k7L8N01O70P4r48j682j661p94M78J228
56604A06801Q97J48J76J108J907J902J543J421J432J265R81O84K97n4j9L97Q05
$$ y = [54122, 53903, 54318, 55249, 56344, 57402, 58470, 59601, 60729, 61832, 62922, 63813, 64218, 64191, 64152, 64379, 64912, 66055, 68276, 71197, 73398, 73920, 73558, 73888, 75338, 76978, 77903, 77934, 77095, 75463, 73689, 72814, 73154, 73980, 74526, 74722, 74795, 74832, 74986, 75505, 76199, 76517, 76495, 77098, 79092, 81965, 84378, 85421, 85198, 84535, 84382, 85108, 86058, 86106, 84904, 83301, 82360, 82359, 82904, 83526, 83842, 83644, 83317, 83781, 85532, 87938, 89839, 90703, 90850, 90819, 90878, 91065, 91340, 91672, 92041, 92351, 92411, 92295, 92537, 93531, 94772, 95283, 94945, 94769, 95607, 97203, 98839, 100303, 101791, 103338, 104895, 106567, 108300, 109651, 110276, 110354, 110171, 109716, 109109, 108979, 109875, 111577, 113439, 115069, 116198, 116283, 114922, 112561, 110239, 108706, 108090, 108191, 108631, 108924, 108897, 108935, 109436, 110106, 110180, 109232, 107550, 105889, 105095, 105573, 106801, 107698, 107846, 108022, 109130, 111037, 112939, 114482, 115903, 117335, 118600, 119581, 120265, 120562, 120508, 120489, 120886, 121691]
56587A21691J105J477J628J021j6m17J00P15J000J536K390K371P94r98j146L35
56571A33586J867K493K577K616K554K394K519L116L876M470M952N526O206O763
56557A85515O865O294N172L862K681J861J604J873K156J969J505J289J235P29
56543B24610l17j235j609j715j815j815j862k381l186l440k947k566k859l215
56529A93648k973k515k432k410j892j229j214j926k785l454l889l909l443k918
56515A56659k735k626k184j615j341j196p40r3K07J3k86k83J95J048J731J539
56499A48293N80l5M52J349J446O74K7J29O17Q62O57J56l46n43l36R6N41Q97R87
56480A56503O67J56j43k87o21r25n51L80Q59M94J41M50P19J14r10j297q98k95
$$ y = [121691, 122796, 124273, 125901, 126922, 126906, 126489, 126589, 127304, 128304, 129840, 132230, 134601, 135395, 134397, 133251, 133586, 135453, 137946, 140523, 143139, 145693, 148087, 150606, 153722, 157598, 162068, 167020, 172546, 178752, 185515, 192380, 198674, 203846, 207708, 210389, 212250, 213854, 215727, 217883, 219852, 221357, 222646, 223881, 224610, 224293, 223058, 221449, 219734, 217919, 216104, 214242, 211861, 208675, 205235, 202288, 199722, 196863, 193648, 190675, 188160, 185728, 183318, 181426, 180197, 178983, 177057, 174272, 170818, 166929, 163020, 159577, 156659, 153924, 151298, 149114, 147499, 146158, 144962, 144222, 144129, 144336, 144349, 144063, 143780, 143975, 145023, 146754, 148293, 148873, 148838, 149290, 150639, 152085, 152759, 152786, 152915, 153532, 154394, 155051, 155207, 154861, 154318, 153982, 154078, 154619, 155516, 156503, 157170, 157326, 157183, 156896, 156275, 155350, 154799, 155179, 156038, 156532, 156673, 157123, 157842, 157956, 157046, 155749, 154851, 154556]
56462A54556K53P94J065Q89P36J068J455J235O47M73Q43J201J148O97Ln53m58
56445A66052J41L26k63p25k22P92J466J869K295K149Q56p53j342r26n25l52J99
56428A71037J019J224O44M1j95m05o83o30k35P0K59P29J424J812J706J346Q11
56411A79974K31K25J109J942J547L04k88K59R77J086Q37O28M74N40J141J937K106
56394A95029J439M79l99j079j128k58P70R07M29N40J326J590Q64J27J64N26O32
56377B01958P10J001J164J012R83J336J743J974K208K363K063J476J271J457J344
56362B24063Q56P35J065Q69k24j137q80M2O30Q29J154J522J405P35J1l41k85q0
56344B30969n4j64J50J178K252K523K250K316K631K226J103N91J438K669L037
$$ y = [154556, 154809, 155603, 156668, 157557, 158293, 159361, 160816, 162051, 162698, 163171, 164014, 165215, 166363, 167060, 167063, 166510, 166052, 166193, 166519, 166256, 165531, 165309, 166101, 167567, 169436, 171731, 173880, 174736, 173983, 172641, 171715, 171190, 170838, 171037, 172056, 173280, 173924, 173965, 173770, 173365, 172682, 172052, 171817, 171887, 172146, 172875, 174299, 176111, 177817, 179163, 179974, 180205, 180430, 181539, 183481, 185028, 185332, 185044, 185303, 186280, 187366, 188203, 188831, 189305, 189845, 190986, 192923, 195029, 196468, 196947, 196548, 195469, 194341, 194083, 194853, 195760, 196189, 196729, 198055, 199645, 200509, 200636, 200800, 201326, 201958, 202668, 203669, 204833, 205845, 206828, 208164, 209907, 211881, 214089, 216452, 218515, 219991, 221262, 222719, 224063, 224919, 225654, 226719, 227588, 227364, 226227, 225347, 225389, 226019, 226848, 228002, 229524, 230929, 231664, 231675, 231334, 231049, 230969, 230915, 230751, 230901, 232079, 234331, 236854, 239104, 241420, 244051, 246277, 247380, 247971, 249409, 252078, 255115]
56329B55115K550J931J415Q23K21j60j61M18J593K656K581J358J91N3O48J130
56313B72362J153R14P84J102J801K183J747J158J483K586L352L433L586M162M564
56298C06370M496M428M497M147L313K719K554K117J230P33J045J536J899K799
56284C43883M327N214M593L354K776K820K830K884L356L967M346M825N764O727
56270D01666P276P831Q776R485R317Q992R810J1828J3856J5067J5806J6797J8289
56257E54796K0005K1524K2753K4083K5934K8247L0906L4420L9262M4633M8950
56246H95513N1820N4365N7310N9901O1277O1651O1397N9967N6620N1426M4732
56235A515979L6406K6391J5471M745n262j4521k3067l1098l8882m6114n1835n5284
$$ y = [255115, 257665, 259596, 261011, 261834, 262055, 261895, 261734, 262152, 263745, 266401, 268982, 270340, 270531, 270584, 271232, 272362, 273515, 274429, 275213, 276315, 278116, 280299, 282046, 283204, 284687, 287273, 290625, 294058, 297644, 301806, 306370, 310866, 315294, 319791, 323938, 327251, 329970, 332524, 334641, 335871, 336604, 337649, 339185, 341084, 343883, 348210, 353424, 358017, 361371, 364147, 366967, 369797, 372681, 376037, 380004, 384350, 389175, 394939, 401666, 408942, 416773, 425549, 435034, 444351, 453343, 463153, 474981, 488837, 503904, 519710, 536507, 554796, 574801, 596325, 619078, 643161, 669095, 697342, 728248, 762668, 801930, 846563, 895513, 947333, 1001698, 1059008, 1118909, 1180186, 1241837, 1303234, 1363201, 1419821, 1471247, 1515979, 1552385, 1578776, 1594247, 1598992, 1593730, 1579209, 1556142, 1525044, 1486162, 1440048, 1388213, 1332929]
56223A332929n6550n6305n5419n4638n3882n2149m8885m5122m2102l9397l5780
56212G92700l1624k8426k6181k3436k0092j7851j7266j6586j4475j1852j0000
56201E74911q726p533o791o511n653l874k496k521l177l407l316l069k065m38
56187E15334L55l06j011o21m9l19o48l5Q23R55R90J851K937L387L694M425M670
56170E36432L701K830L592N233N960N753N903O618P051P092P393Q010Q547R111
56156F23226R892J0593J1295J2854J5307J7201J7727J8130J9598K1387K2654K4453
56144H24317K7966L2263L5971L9873M5619N3035O0850O8926P7619Q5865R2077
56133A444381R6012R7753R5966Q9476P9668O9229N9384N0410M3584L9999L8152
$$ y = [1332929, 1276379, 1220074, 1164655, 1110017, 1056135, 1003986, 955101, 909979, 867877, 828480, 792700, 761076, 732650, 706469, 683033, 662941, 645090, 627824, 611238, 596763, 584911, 574911, 566185, 558652, 551861, 545350, 539697, 535823, 533327, 530806, 527629, 524222, 520906, 517837, 515772, 515334, 515689, 515383, 514372, 513751, 513702, 513383, 512735, 512700, 513523, 514478, 515468, 517319, 520256, 523643, 527337, 531762, 536432, 540133, 542963, 546555, 551788, 557748, 563501, 569404, 576022, 583073, 590165, 597558, 605568, 614115, 623226, 633118, 643711, 655006, 667860, 683167, 700368, 718095, 736225, 755823, 777210, 799864, 824317, 852283, 884546, 920517, 960390, 1006009, 1059044, 1119894, 1188820, 1266439, 1352304, 1444381, 1540393, 1638146, 1734112, 1823588, 1903256, 1972485, 2031869, 2082279, 2125863, 2165862, 2204014]
56122B204014L5152K9776K2345J2632N42j1782k1221k7034l1073l5235m0674m8705
56110B088737n9980p2790q4169r2357r6805r6709r1707q3328p3754o3782n3559
56099A219797m4224l6743l0231k3639j8018j4829j3169j1100q666p128o169m522
56087A001359k397p60R28L697O693Q410R295J0629J1931J2232J2682J4862J7534
56074A107095J8255J7372J7211J8098J8445J8121J8445J9327J9554J9517K0600
56063A312040K2309K3011K2968K3687K5005K5721K6307K7785K8890K7706K5317
56052A590746K4366K4810K4527K3293K2594K2352K1560K1344K3535K6923K8766
56041A854816K9234L0488L2328L2962L3186L5348L8773M0648M0870M1705M3319
$$ y = [2204014, 2239166, 2268942, 2291287, 2303919, 2304461, 2292679, 2271458, 2244424, 2213351, 2178116, 2137442, 2088737, 2028757, 1955967, 1871798, 1779441, 1682636, 1585927, 1494220, 1410892, 1337138, 1273356, 1219797, 1175573, 1138830, 1108599, 1084960, 1066942, 1052113, 1038944, 1027844, 1019178, 1012050, 1005881, 1001359, 998962, 998202, 999130, 1002827, 1009520, 1017930, 1027225, 1037854, 1049785, 1062017, 1074699, 1089561, 1107095, 1125350, 1142722, 1159933, 1178031, 1196476, 1214597, 1233042, 1252369, 1271923, 1291440, 1312040, 1334349, 1357360, 1380328, 1404015, 1429020, 1454741, 1481048, 1508833, 1537723, 1565429, 1590746, 1615112, 1639922, 1664449, 1687742, 1710336, 1732688, 1754248, 1775592, 1799127, 1826050, 1854816, 1884050, 1914538, 1946866, 1979828, 2013014, 2048362, 2087135, 2127783, 2168653, 2210358, 2253677]
56030B253677M4211M5277M8594N2695N4240N3922N5588N9737O3098O4590O6430
56019B862059O9229P1209P2489P5107P8776Q1444Q3837Q8294R3625R6627R8177
56008C770873J02012J07982J12672J16401J23021J32794J41995J49732J58703
55999D916185J69186J78835J88383K00809K15033K27290K38385K52375K68789
55990F855270K83979K99236L19135L42645L65025L87739M16679M51206M85466
55981A0206380N20205N62099O11598O63391P18973P86142Q65585R51446J045757
55972A6931576J158113J290262J436573J601158J798224K034053K306748K626126
55964C1182833L014684L486661M047704M718806N536822O526504P697358R072887
$$ y = [2253677, 2297888, 2343165, 2391759, 2444454, 2498694, 2552616, 2608204, 2667941, 2731039, 2795629, 2862059, 2931288, 3002497, 3074986, 3150093, 3228869, 3310313, 3394150, 3482444, 3576069, 3672696, 3770873, 3872885, 3980867, 4093539, 4209940, 4332961, 4465755, 4607750, 4757482, 4916185, 5085371, 5264206, 5452589, 5653398, 5868431, 6095721, 6334106, 6586481, 6855270, 7139249, 7438485, 7757620, 8100265, 8465290, 8853029, 9269708, 9720914, 10206380, 10726585, 11288684, 11900282, 12563673, 13282646, 14068788, 14934373, 15885819, 16931576, 18089689, 19379951, 20816524, 22417682, 24215906, 26249959, 28556707, 31182833, 34197517, 37684178, 41731882, 46450688, 51987510, 58514014, 66211372, 75284259]
55956G5284259J0694054J2588730J4771275J7273213K0118579K3239875K6452347
55949B00422332K9503814L2036209L3410320L2662082K8844523K1574015J1335005
55942C89788300o31161j2655777k3016381l0371053l4174658l4785279l3122281
55935B21031710l0156301k6619552k2997762j9596926j6567791j3942360j1706100
55928G9444918r837771q297195p023721n966692n097265m386272l795355l296770
55920C1743877k880449k534808k239128j980109j758102j570988j407292j259949
55912A6113052j132051j023866r27516q38817p61859o97550o39381n84299n36654
55903H971059m97613m61313m25048l93077l66934l41614l14793k90531k70634
$$ y = [75284259, 85978313, 98567043, 113338318, 130611531, 150730110, 173969985, 200422332, 229926146, 261962355, 295372675, 328034757, 356879280, 378453295, 389788300, 389157139, 376501362, 353484981, 323113928, 288939270, 254153991, 221031710, 190875409, 164255857, 141258095, 121661169, 105093378, 91151018, 79444918, 69607147, 61309952, 54286231, 48319539, 43222274, 38836002, 35040647, 31743877, 28863428, 26328620, 24089492, 22109383, 20351281, 18780293, 17373001, 16113052, 14981001, 13957135, 13029619, 12190802, 11428943, 10731393, 10092012, 9507713, 8971059, 8473446, 8012133, 7587085, 7194008, 6827074, 6485460, 6170667, 5880136, 5609502]
55894E609502k51206k30909k13928k01559j89091j74268j60939j51289j42069
55885C894244j31525j22620j16434j09521j00926r4897r3622r3807r3228r4080
55875B843584r6903r7677r4232q9657q6384q2542p6959p2172o9516o6489o1758
55864A949295n7657n5219n1927m6910m3261m2486m1694l8916l6342l5682l5042
55853A464159l3073l1678l1933l1767l0188k9454l0562l0985k9356k7965k8165
55842A129033k7697k5197k3028k2805k2329j9901j7561j7037j6401j3868j1290
55831I11919j0711j0810r784q592q372p776n832m526n622p546q269q588r908j1331
55817G94252j1585j1501j2092j2465j1835j1265j1392j0889r206q100q410q098
$$ y = [5609502, 5358296, 5127387, 4913459, 4711900, 4522809, 4348541, 4187602, 4036313, 3894244, 3762719, 3640099, 3523665, 3414144, 3313218, 3218321, 3124699, 3030892, 2937664, 2843584, 2746681, 2649004, 2554772, 2465115, 2378731, 2296189, 2219230, 2147058, 2077542, 2011053, 1949295, 1891638, 1836419, 1784492, 1737582, 1694321, 1651835, 1610141, 1571225, 1534883, 1499201, 1464159, 1431086, 1399408, 1367475, 1335708, 1305520, 1276066, 1245504, 1214519, 1185163, 1157198, 1129033, 1101336, 1076139, 1053111, 1030306, 1007977, 988076, 970515, 953478, 937077, 923209, 911919, 901208, 890398, 880614, 872022, 863650, 855874, 850042, 845516, 839894, 832348, 824079, 815491, 805583, 794252, 782667, 771166, 759074, 746609, 734774, 723509, 712117, 701228, 692022, 683922, 675512, 667414]
55805F67414n748l207k363k026o07P95O67P2O19J581J639J468K051K381J355J91
55789F66282M31J219Q60m21j521k697m653o851q656j0676j3231j5116j5554j5675
55775E73741j6348j6401j4703j2191j0120q135n820m151l653l156k165k288m285
55762D70325n959n303l634l185l492k842j572j248j851k323k754l718m544m540
55748D23360m749o263p921p915o668n908n802n233m116l400l294l330l549m064
55734C51148m178l444k754k956l418l276l009l305l670l644m023n246n964n034
55720B97227l622l383l794l254j823p98m74j85J36K47O34J621K332K036J613K065
55704B90578K605J912K68j191k377l668m494m296l955m460n052m438k917j615
$$ y = [667414, 661666, 658459, 656096, 654070, 653463, 654258, 654925, 654997, 655616, 657197, 658836, 660304, 662355, 664736, 666091, 666282, 666713, 667932, 668792, 668371, 666850, 664153, 659500, 652649, 643993, 633317, 620086, 604970, 589416, 573741, 557393, 540992, 526289, 514098, 503978, 495843, 490023, 485872, 482219, 479063, 476898, 474610, 470325, 464366, 459063, 455429, 452244, 448752, 445910, 444338, 443090, 441239, 438916, 436162, 432444, 427900, 423360, 418611, 412348, 404427, 396512, 389844, 383936, 378134, 372901, 368785, 365385, 362091, 358761, 355212, 351148, 346970, 343526, 340772, 337816, 334398, 331122, 328113, 324808, 321138, 317494, 313471, 308225, 302261, 297227, 293605, 290222, 286428, 283174, 281351, 280553, 280079, 279894, 280030, 280277, 280911, 282532, 284864, 286900, 288513, 290578, 293183, 295095, 295363, 294172, 291795, 288127, 283633, 279337, 275382, 270922, 265870, 261432, 258515, 256900]
55690B56900n88N18R75J07j003r34j61O2J44J246K724K822J592P97R82P51q78
55673B66056l058m379m235k948j536j112j605j653o02L34O3m53J78J381J654J114
55657B49199J008J348J046O1n41l97n8M00J368K448K753K271J717J284P48L30
55641B64985K70L1q65j875k520l445n085o311o023n136n139n629n185l930l091
55626B11052k737k052j356j635k357k000n75M37N35N45O11o6j399k274k440k751
55610A91538l327l283k487j961k219k690k994l284l287k488j360r58j230j151
55596A58819n44k00k72j25J63j64r18j013l45n1n82j063q23j98M72J233J702J257
55578A57348K86k4O04J330J768K414L351L905L843L715L773L738L696L970M079
$$ y = [256900, 256312, 256830, 257805, 257912, 256909, 255975, 255814, 255876, 256020, 257266, 259990, 262812, 264404, 265201, 266183, 266934, 266056, 262998, 258619, 254384, 251436, 249900, 248788, 247183, 245530, 244928, 245262, 245325, 244872, 245050, 246431, 248085, 249199, 250207, 251555, 252601, 252662, 252121, 251724, 251666, 252066, 253434, 255882, 258635, 260906, 262623, 263907, 264655, 264985, 265255, 265286, 264421, 262546, 260026, 256581, 251496, 245185, 239162, 234026, 228887, 223258, 218073, 214143, 211052, 208315, 206263, 204907, 203272, 200915, 198915, 198340, 198777, 199312, 199857, 200468, 200402, 199003, 196729, 194289, 191538, 188211, 184928, 182441, 180480, 178261, 175571, 172577, 169293, 166006, 163518, 162158, 161200, 159970, 158819, 158275, 158075, 157803, 157678, 157841, 157677, 156759, 155746, 155401, 155350, 154768, 153705, 152882, 152684, 153156, 154389, 156091, 157348, 157634, 157610, 158214, 159544, 161312, 163726, 167077, 170982, 174825, 178540, 182313, 186051, 189747, 193717, 197796]
55563A97796L129J360j16j063k228l643m393m252m018l986l595k913k861l605
55549A65612m095l740l148k799k331j640j323j488j337n18K70N19O74J066J249
55534A46971Q93M20J61j42o22q65o68m28m41n20m76l41n2L37L01m36j105q65k60
55515A41862m70j352j704j277r65j031q07l19m75j299j653j120o47p68p48j13
55499A27114M83N71O63R82P45m30j556j619r62n88p95j166j169m77O73J304P64
55482A24537j21l7P79R39K48k0N52Q24J68n07n53o55j233j422p09m3k08m02K83
55463A22420J254J486J162R10M66o14j608j422k22P93R36M85kj16K48O18L43l77
55445A26760n40J00M82k14j328j747j316n31L61J150J295N95l14q25j065j293
$$ y = [197796, 200925, 202285, 202169, 201106, 198878, 195235, 190842, 186590, 182572, 178586, 174991, 172078, 169217, 165612, 161517, 157777, 154629, 151830, 149499, 147859, 146536, 145048, 143711, 143193, 143463, 143982, 144656, 145722, 146971, 147864, 148284, 148445, 148303, 147681, 146816, 146148, 145720, 145279, 144759, 144283, 143942, 143890, 144227, 144528, 144092, 142987, 142122, 141862, 141392, 140040, 138336, 137059, 136094, 135063, 134256, 133937, 133462, 132163, 130510, 129390, 128743, 127975, 127227, 127114, 127597, 128168, 128831, 129813, 130558, 130128, 128572, 126953, 125991, 125403, 124608, 123442, 122273, 121796, 122469, 123773, 124537, 124416, 124379, 125158, 126097, 126345, 126325, 126877, 127701, 127869, 127362, 126809, 126154, 124921, 123499, 122790, 122747, 122539, 122137, 122420, 123674, 125160, 126322, 127232, 127698, 127084, 125476, 124054, 123832, 124625, 125561, 126046, 126044, 125928, 126176, 126794, 127137, 126760, 126220, 126320, 126802, 126588, 125260, 123513, 122197, 121666, 122027, 123177, 124472, 125067, 124753, 123928, 122863, 121570]
55429A21570j245p53k39o7MJ68J49r7o2L99O72L99J38M33J029J508J853J958J485
55410A29302O96M14O60M65m43j020o63l09q48j638j727j424j500j704j357o25
55394A18279j29J08K92J51m12o72j05O34P10L80K61J39l94q07l78M90Q32N20O0
55375A19959m80j214j661j310o22l67m26k26N8j77p72j018p48l30R4N04N59J69
55357A11992m2K80L60m99j493j353l35K10o1k65l6rm70p76m95l0J41O0j21l66
55337A06692m36j9O91J164J221J059P02J24k86j30K78L32R2J14M51O39N53N03
55319A13744M88J88l52o67n73k71R6M17L49k28o82l82L02N18K94L64P68P27l1
55300A15069q04j087j218j536j672j176k50N93J138J404J320Q90L85J68L12N25
$$ y = [121570, 120325, 119572, 119333, 119266, 119270, 119438, 119587, 119490, 119428, 119827, 120499, 120898, 121036, 121469, 122498, 124006, 125859, 127817, 129302, 129998, 130412, 131072, 131537, 131094, 130074, 129411, 129102, 128254, 126616, 124889, 123465, 121965, 120261, 118904, 118279, 118150, 118258, 118550, 118701, 118289, 117617, 117512, 118146, 118856, 119236, 119497, 119636, 119242, 118435, 118057, 118547, 119379, 119899, 119959, 119479, 118265, 116604, 115294, 114672, 114305, 113879, 113653, 113711, 113534, 112762, 111744, 110996, 110666, 110760, 111264, 111823, 111992, 111950, 112230, 112590, 112091, 110598, 109245, 108910, 109120, 109059, 108794, 108758, 108749, 108279, 107503, 107008, 106978, 107119, 107179, 107058, 106692, 106256, 106237, 106928, 108092, 109313, 110372, 111074, 111198, 110912, 110782, 111060, 111392, 111484, 111598, 112049, 112688, 113241, 113744, 114232, 114420, 114068, 113401, 112828, 112557, 112653, 113070, 113419, 113191, 112509, 112127, 112429, 112947, 113241, 113605, 114373, 115100, 115069, 114265, 113178, 111960, 110424, 108752, 107576, 107326, 107919, 109057, 110461, 111781, 112671, 113056, 113224, 113536, 114061]
55284A14061M11l8j67P18K251L030K198N75l91m06l30o86j108j154r48q01q13
55267A16402r51j072r31n10k28l45m60j13M09N63N06P45J046O85j68m19L70J279
55249A16808J326O69K2l75o43o12j44K62r3j025j488q97R1M87L03L76R68J266
55231A17301O20l55o28k01R2L3J83O26O86J58k58k14l09p74o84N28J710J370j71
55212A19713j304j346j011r10q01m72k11j67k6M40J088J786K398K409J351k94
55196A22643j276r39J04P76N70k88j230j667j321m67L30P09O28J82m41r57j196
55179A16160j195r52l83L25P16P04P36J015J163J012J058J598K049J866J482J562
55163A28916J836J623J040P41P80O77L11n2m55j074j601j669j555j623j436m65
$$ y = [114061, 114472, 114434, 114267, 114985, 117236, 120266, 122464, 123039, 122648, 122242, 121912, 121226, 120118, 118964, 118016, 117215, 116402, 115451, 114379, 113448, 112938, 112710, 112365, 111905, 111792, 112201, 112764, 113270, 114015, 115061, 115746, 115578, 115159, 115529, 116808, 118134, 118803, 118825, 118450, 117807, 117195, 117051, 117313, 117220, 116195, 114707, 113810, 113901, 114388, 114691, 115067, 116035, 117301, 117921, 117566, 116938, 116737, 116829, 116862, 117045, 117671, 118357, 118515, 118257, 118043, 117734, 116960, 116276, 116804, 118514, 119884, 119713, 118409, 117063, 116052, 115142, 114341, 113869, 113658, 113491, 113465, 113905, 114993, 116779, 119177, 121586, 122937, 122643, 121367, 120428, 120532, 121308, 121878, 121590, 120360, 118693, 117372, 116905, 117235, 117944, 118572, 118754, 118313, 117356, 116160, 114965, 114013, 113630, 113955, 114671, 115375, 116111, 117126, 118289, 119301, 120359, 121957, 124006, 125872, 127354, 128916, 130752, 132375, 133415, 134156, 134936, 135613, 135924, 135872, 135417, 134343, 132742, 131073, 129518, 127895, 126459, 125994]
55147A25994O68Q32J00l75j30J61O3o5j01n07j295j672j237o37n56p46o10j23
55129A19764K56J96k45o83o56k15o1o00j091n40P89J652J463P54L7o88j195r74
55111A17963k03J88j78o27n16N4Q37J800K515K260J176L88M38N25k5n24j9J114
55093A27166J656J178K98l63p05p39m24R0N06O94P62Q48R99J078P28k23j252j475
55075A30822p03K56N73L60L11P74J438J738J303K55p98j257j087p01l67n1K09
55058A33075K04l7k43k95l18m23o35r76j225q24L58J467J527P17J7k36n34j034
55040A30585j217q70m31j16K95O20K14q15j347p00M73J251J544J593J283O11J17
55023A33090J12J73j0K0N60R13L69n54q01k91J87K63K49L12K73J93L72P50R05
$$ y = [125994, 126662, 127494, 127594, 127219, 127089, 127250, 127313, 127248, 127147, 126640, 125345, 123673, 122436, 121799, 121243, 120497, 119887, 119764, 120020, 120216, 119971, 119288, 118632, 118417, 118356, 117756, 116665, 116125, 116914, 118566, 120029, 120783, 120820, 120132, 118937, 117963, 117760, 117948, 117770, 117143, 116627, 116681, 117518, 119318, 121833, 124093, 125269, 125657, 126095, 126620, 126595, 126071, 126052, 127166, 128822, 130000, 130298, 129935, 129230, 128491, 128067, 128157, 128663, 129357, 130119, 130967, 131966, 133044, 133772, 133549, 132297, 130822, 130119, 130375, 130948, 131308, 131619, 132393, 133831, 135569, 136872, 137127, 136329, 135072, 133985, 133284, 132917, 132866, 133075, 133279, 133242, 132999, 132704, 132386, 131963, 131328, 130352, 129127, 128303, 128661, 130128, 131655, 132372, 132389, 132153, 131619, 130585, 129368, 128498, 128067, 127951, 128246, 128866, 129080, 128265, 126918, 126218, 126691, 127942, 129486, 131079, 132362, 132973, 133090, 133202, 133375, 133365, 133385, 133945, 134858, 135227, 134673, 133872, 133581, 133768, 134031, 134280, 134592, 134865, 135058, 135430, 136180, 137085]
55004A37085P16M87M17M49N60P23O42P0o11o84j1P72J129J211J400J616J433P46
54986A48150rl11j02K39L87L08O8l45p81q49l92J30J80j25k64j39o6l8K86P73
54966A47100P77J02n81o29k03J62K91K38k0l72m24J3N60P50O23M97M90N85Q63
54947A50822J302J570J355P24j0o45j088j216j012o48l08j6K21L09J59k63q70
54930A50386j276r47J07J076J322J354K046L100L314K486J909K604M011N065N657
54915A82214O269O865O969O419N370L842J929Q0j411k878m636o144o524n786m891
54900A87687m580m677m579m001l154k436k058j858j562j202j096j327j530j241
54886A52386k95J111K386K706J825P35Q68K386L931M371M042L922M250M604M786
$$ y = [137085, 137801, 138288, 138705, 139154, 139714, 140437, 141079, 141149, 140538, 139854, 139843, 140615, 141744, 142955, 144355, 145971, 147404, 148150, 148141, 147830, 147728, 147967, 148354, 148662, 148730, 148385, 147604, 146755, 146363, 146493, 146673, 146548, 146284, 146145, 146079, 146041, 146327, 147100, 147877, 147979, 147398, 146769, 146566, 146728, 147019, 147257, 147237, 146865, 146441, 146454, 147014, 147764, 148387, 148884, 149374, 149959, 150822, 152124, 153694, 155049, 155773, 155763, 155118, 154030, 152814, 151802, 151154, 150846, 150830, 151051, 151360, 151519, 151256, 150386, 149110, 148163, 148270, 149346, 150668, 152022, 154068, 157168, 160482, 162968, 164877, 167481, 171492, 176557, 182214, 188483, 195348, 202317, 208736, 214106, 217948, 219877, 219957, 218546, 215668, 211032, 204888, 198364, 192578, 187687, 183107, 178430, 173851, 169850, 166696, 164260, 162202, 160344, 158782, 157580, 156484, 155157, 153627, 152386, 152091, 153202, 155588, 158294, 160119, 160854, 161722, 164108, 168039, 172410, 176452, 180374, 184624, 189228, 194014]
54871A94014M926N032M969M668L966K517L40j865l407m257m723m817m480m023
54857A92860l787l612l186k699k578k774k815k581k493k865l399l452k684j421
54843A52514l65L1o9l13o31j013j094o14r4k68q53p60K56J150J091N45K87K29
54825A50029n9m11m56l45l85l18K20R51J316J285J160Q83K41n01q14n96j53L08
54807A52355P18R20Q72Q25R54J071J039R91Q78K74q46j711j701j153o93k98K96
54790A54791P85O76J22l05m09l25r6J57Q6k32n3R50J908J898J323J227J683J939
54772A66125J816J855K261K707L149L802M422M585M594N149O081O449N947N245
54758B24187M772M123K921J385k50k063l870n068n409n337n286n226n129n177
$$ y = [194014, 198940, 203972, 208941, 213609, 217575, 220092, 220432, 218567, 215160, 210903, 206180, 201363, 196883, 192860, 189073, 185461, 182275, 179576, 176998, 174224, 171409, 168828, 166335, 163470, 160071, 156619, 153935, 152514, 152149, 152180, 152111, 151798, 151167, 150154, 149060, 148446, 148352, 148084, 147231, 146471, 146727, 147877, 148968, 149513, 149800, 150029, 149970, 149559, 149103, 148758, 148373, 148055, 148275, 149226, 150542, 151827, 152987, 153870, 154111, 153610, 152796, 152200, 152047, 152355, 153073, 153993, 154865, 155690, 156644, 157715, 158754, 159745, 160623, 160897, 160051, 158340, 156639, 155486, 154793, 154495, 154791, 155576, 156252, 156374, 156069, 155660, 155335, 155239, 155396, 155482, 155250, 155197, 156147, 158055, 159953, 161276, 162503, 164186, 166125, 167941, 169796, 172057, 174764, 177913, 181715, 186137, 190722, 195316, 200465, 206546, 212995, 218942, 224187, 228959, 233082, 236003, 237388, 237138, 235075, 231205, 226137, 220728, 215391, 210105, 204879, 199750, 194573]
54744A94573n221m707l516k337j832j895k059k107j879j056L05J387J373N46M2
54729A71617M56J175J274P86O11J290K396L312M106N098N936N942N269M820M855
54714B18943M625L625K339J235n7j860l624m748n489o185o337n513m479m274m583
54699A83618m289l238k273j741j254p89p95j158j276j170j409j851j662p70j00
54684A59843j09k42q2J2j31n1L14J90p82j712j637p58Q7N30O53M35n3l36p9L63
54664A56455L75j75r05j316j024PJ206J776J561J145J051J280J676K055J930Q88
54648A67985n00r87k47O13N46k15r33j534k148k226j164L87R17j29j634k126j318
54631A55287j06O30Q17Q33P51K78n21r77o65j36k02o72n02O86J949K091J002l64
$$ y = [194573, 189352, 184645, 181129, 178792, 176960, 175065, 173006, 170899, 169020, 167964, 168269, 169656, 171029, 171575, 171617, 172073, 173248, 174522, 175308, 175919, 177209, 179605, 182917, 187023, 192121, 198057, 203999, 209268, 214088, 218943, 223568, 227193, 229532, 230767, 230710, 228850, 225226, 220478, 214989, 208804, 202467, 196954, 192475, 188201, 183618, 179329, 176091, 173818, 172077, 170823, 170034, 169239, 168081, 166805, 165635, 164226, 162375, 160713, 159943, 159843, 159734, 159492, 159410, 159422, 159291, 159240, 159554, 159744, 158962, 157250, 155613, 154855, 154942, 155472, 156125, 156560, 156507, 156171, 156092, 156455, 156830, 156655, 155750, 154434, 153410, 153417, 154623, 156399, 157960, 159105, 160156, 161436, 163112, 165167, 167097, 167985, 167485, 166498, 166251, 166864, 167410, 167195, 166262, 164728, 162580, 160354, 159190, 159577, 160494, 160365, 158731, 156605, 155287, 155181, 155811, 156628, 157461, 158212, 158490, 157969, 156992, 156327, 156191, 155989, 155317, 154815, 155501, 157450, 159541, 160543, 160179]
54613A60179r82n84K17N37J89q2L66J096J256Q59O42P27M79k32o37k99K01K19
54595A64151j00m44r49j627j825j051J70R08R42P20N63M84M66M23R7n58j139j296
54577A59935j184j066q08k01M94P95O30L19J17O9J89M92Q78J138J034L97n54j140
54559A61534q38K0O45Q40J021J227Q82j45j064j172p74n71p12q80r08p68l80J50
54541A58107M55M33M36O02M74k14q76p14L06J537K328K305J404J25o95p56n81
54524A64676n49l24K95O47J75n05m24J64J38o72j158n97K69L02m93j103q03J30
54506A60168R12J044N62k10q95j087n26M36Q49J62r24j172m11K92K26m2K79R72
54488A60635J283J077P75N66M36O13J214J644J130q9q80n86K89R02J051J030J035
$$ y = [160179, 159197, 158613, 158830, 159367, 159556, 159474, 159840, 160936, 162192, 163051, 163693, 164420, 164899, 164667, 164030, 163731, 163932, 164151, 164051, 163607, 162658, 161031, 159206, 158155, 158325, 159233, 160175, 160895, 161458, 161942, 162408, 162831, 162928, 162370, 161231, 159935, 158751, 157685, 156877, 156676, 157170, 157965, 158595, 158914, 159031, 159100, 159289, 159781, 160659, 161797, 162831, 163228, 162674, 161534, 160696, 160716, 161361, 162201, 163222, 164449, 165331, 165186, 164122, 162950, 162176, 161605, 160893, 160013, 159105, 158337, 157957, 158107, 158562, 158995, 159431, 160033, 160507, 160293, 159417, 158703, 159009, 160546, 162874, 165179, 166583, 166708, 166013, 165257, 164676, 164127, 163803, 164098, 164745, 164920, 164415, 163991, 164155, 164293, 163621, 162463, 161866, 162135, 162437, 161944, 160841, 160038, 160168, 161080, 162124, 162686, 162476, 161581, 160494, 159968, 160404, 161253, 161415, 160491, 159319, 158908, 159200, 159426, 159384, 159663, 160635, 161918, 162995, 163770, 164336, 164772, 165385, 166599, 168243, 169373, 169284, 168404, 167818, 168107, 169009, 170060, 171090, 172125]
54471A72125J017R47Q92Q70P62M56N0j83j01J05K26M00Q51J312J158K70p10j168
54453A79279j161j035q63o05m64p14j298j850j920j196J15J108R24j52r36q37
54437A68395m45l64k88J91O89P44P64J360K075J806L55j222j841j327k10Q13J224
54420A72719J000N92K91j51q63j251p17L39R20O99J60l16p26q87n06J39L49L1
54402A71822j23K90Q23R89R68J111J240R33K31l95o18m70j11L64R43J572J999
54385A81568J841J014R3j05N65J354J422P25q5m46l78k23j20L8K50K75Q3Q7N89
54366A88547J130R84J81n12p24p81p88k77P24J167L52q26j016l02R4k64n83l24
54348A86782O2J13Q5J85L3n66r61n39K26L36l64j089j280j155j066r57o63l51
$$ y = [172125, 173142, 174089, 174981, 175851, 176613, 177069, 177119, 176936, 176835, 176940, 177166, 177566, 178417, 179729, 180887, 181157, 180447, 179279, 178118, 177083, 176220, 175615, 175151, 174437, 173139, 171289, 169369, 168173, 168288, 169396, 170320, 170168, 169232, 168395, 167950, 167586, 167298, 167489, 168178, 168922, 169686, 171046, 173121, 174927, 175282, 174060, 172219, 170892, 170682, 171495, 172719, 173719, 174311, 174602, 174451, 173588, 172337, 171620, 171959, 172879, 173578, 173738, 173422, 172696, 171809, 171303, 171442, 171791, 171822, 171699, 171989, 172812, 173801, 174769, 175880, 177120, 178053, 178284, 177889, 177271, 176801, 176690, 177054, 177997, 179569, 181568, 183409, 184423, 184516, 184411, 184976, 186330, 187752, 188477, 188392, 187946, 187568, 187345, 187225, 187263, 187513, 187788, 187871, 187958, 188547, 189677, 190661, 190842, 190330, 189606, 188825, 188037, 187760, 188484, 189651, 190003, 189177, 188161, 187859, 187953, 187689, 187106, 186782, 186844, 186957, 187042, 187227, 187260, 186694, 185733, 185194, 185420, 185756, 185392, 184303, 183023, 181868, 180802, 179845, 179182, 178831]
54330A78831k34j56J93O88Q50N27J20%Oj78m06k68J95M42J09n25q38l91P44J903
54310A81612K172J244k0m27K07R75J144Q60N75M32M70P63J032P69N8l92l54m34
54292A90686r09j079m60K12Q9l87k41L99N25j39q41j037q56m15L49J095J211P30
54274A88932L12K23J13o2J53P69J057O56K07L54P39N90j29p68q78n86k11K8L9
54255A91538p6q5M5M3k37m13K3R79J750J821J387R55O67L42L4P0L66L06l67r01
54235A98247m83N16R83P00N30Q59R32K00o17n97NL04J28p4k17n52q56o23L5M74
54215A99894M91M69O09O61M73J81j51n18o43k56L18L98j74q78j191r67k37Q16
54197A99295J761K309K694L218L592L305K447J583R53M29R1Q3K0o70j767k410
$$ y = [178831, 178597, 178441, 178634, 179322, 180172, 180699, 180819, 180819, 180825, 180647, 180241, 179973, 180168, 180610, 180719, 180194, 179356, 178965, 179709, 181612, 183784, 185028, 185008, 184581, 184788, 185763, 186907, 187767, 188342, 188774, 189244, 190007, 191039, 191808, 191866, 191474, 191120, 190686, 189777, 188698, 188238, 188450, 188539, 188152, 187911, 188310, 188835, 188696, 187855, 186818, 185962, 185547, 185896, 186991, 188202, 188932, 189244, 189467, 189580, 189518, 189671, 190440, 191497, 192153, 192360, 192714, 193453, 194043, 193914, 193146, 192268, 191682, 191471, 191499, 191538, 191462, 191377, 191422, 191465, 191228, 190815, 190838, 191817, 193567, 195388, 196775, 197730, 198397, 198739, 198773, 198843, 199209, 199515, 199148, 198247, 197764, 198280, 199263, 199963, 200493, 201352, 202284, 202484, 201867, 201270, 201275, 201579, 201707, 201633, 201416, 200864, 200008, 199385, 199420, 199894, 200385, 200854, 201463, 202124, 202597, 202778, 202627, 202109, 201466, 201210, 201528, 201926, 201752, 200874, 199683, 198716, 198479, 199295, 201056, 203365, 206059, 209277, 212869, 216174, 218621, 220204, 221157, 221586, 221677, 221760, 221780, 221110, 219343, 216933]
54181B16933k291k057k325k966l517l724l507k857j964j109m29J2Q8p1Q1P95J484
54164A92576J448Q66L65M2l43n56k34K60L08J10K39M29K1o15n11J43J50n81p39
54145A93378J73R05M89l20m31m6J19J41L66N35M05M97J169J693J225J04p36j016
54127A98650r13l06P30J290O79l44m94K27P39O05L88M39M95N30Q99J449J488Q63
54109B07414K76J43K0n39j207j391j046n19m2K22N1n87j258j483j265j009r46
54092A96834q78n16L2K28l26j269j638r02L40R44N63NJ87J007J584J441R71P60
54074A99367P97P08M61M18P11J062J227J227J015M02m57r53p74l19o3L5J25nm55
54055B04529p55n52k38k03O9J231K794L617L394K698J847Q77M12J177K586L139
$$ y = [216933, 214642, 212585, 210260, 207294, 203777, 200053, 196546, 193689, 191725, 190616, 190187, 190199, 190287, 190216, 190297, 191092, 192576, 194024, 194890, 195255, 195297, 194954, 194398, 194164, 194424, 194732, 194842, 195081, 195510, 195531, 194916, 194405, 194548, 194698, 194117, 193378, 193551, 194456, 194945, 194625, 194194, 194148, 194267, 194408, 194774, 195309, 195714, 196211, 197380, 199073, 200298, 200402, 199666, 198650, 197737, 197431, 198161, 199451, 200130, 199786, 199292, 199519, 200258, 200863, 201251, 201690, 202185, 202715, 203614, 205063, 206551, 207414, 207690, 207833, 207853, 207314, 206107, 204716, 203670, 203151, 203109, 203331, 203382, 202795, 201537, 200054, 198789, 197780, 196834, 195956, 195440, 195472, 195700, 195374, 194105, 192467, 191565, 191905, 192849, 193412, 193417, 193604, 194611, 196195, 197636, 198607, 199367, 200164, 200872, 201333, 201751, 202462, 203524, 204751, 205978, 206993, 207395, 206938, 205985, 205211, 204892, 204829, 204864, 204989, 204984, 204529, 203774, 203222, 202984, 202781, 202850, 204081, 206875, 210492, 213886, 216584, 218431, 219308, 219720, 220897, 223483, 226622]
54039B26622K462J699J577J556J261J384K339L264L288K795K550K469K146J746
54025B57158J452Q52k38j019p73jL44J62j89q59j956k648k011n10M52K25p06j726
54007B48009k503k701k271j857k106k711k968k854k731k355j356l51l54j126j386
53992B18379p44j63k60m22j30L4m68r34l54R12J455O29p27j484j504j425j536
53975B11258j439q51k22j58n05n60j36K72L96N37P11L50o53j383j131m42j69j03
53957B05772M32J226J521J372J428J621J306P07Q17J694K141J559R30J278K135
53942B25939K379J903J594K034K984L898M367M213L648L196L212L526L817M035
53928B70745M262M378M198L735L109K404J753J295Q34m2j182j573l62J895L568
$$ y = [226622, 229084, 230783, 232360, 233916, 235177, 236561, 238900, 242164, 245452, 248247, 250797, 253266, 255412, 257158, 258610, 259462, 259224, 258205, 257432, 257431, 257775, 257937, 257748, 256889, 254933, 252285, 250274, 249764, 250216, 250441, 249735, 248009, 245506, 242805, 240534, 238677, 236571, 233860, 230892, 228038, 225307, 222952, 221596, 221245, 220891, 219765, 218379, 217635, 217472, 217212, 216790, 216660, 216694, 216226, 215292, 214938, 215850, 217305, 217934, 217207, 215723, 214219, 212794, 211258, 209819, 208968, 208746, 208588, 208083, 207523, 207387, 207659, 208055, 208592, 209303, 209653, 209000, 207617, 206486, 206044, 205875, 205772, 206204, 207430, 208951, 210323, 211751, 213372, 214678, 215385, 216202, 217896, 220037, 221596, 222526, 223804, 225939, 228318, 230221, 231815, 233849, 236833, 240731, 245098, 249311, 252959, 256155, 259367, 262893, 266710, 270745, 275007, 279385, 283583, 287318, 290427, 292831, 294584, 295879, 296713, 296671, 295489, 293916, 293554, 295449, 299017]
53913B99017L667K807K280K524K855K560J770J096P44L76k40q57j146j155j222
53898C15076j585k219k933l516l868m026m022l815l475l272l289l173k696k363
53884B70824k759l405l157j919j022j408k330k542k069j858k182k319j685n02
53870B41667O47J215Q01n22j988k718k533j910j299q65o65o33n96n81q15j124
53854B28081q95p5M47J45j64M42J437J583Q32K16R6j82q24j124p01j14J52K89
53836B29641M90N64N37P20R22N34k83n82k05k57j252j972j196L20Q70K46j53N07
53818B29451J423J532R30M88O55J103J335J222J001R09R32R37R18R89J138J275
53802B46238J531K189L158L865L952L772L850M062L750K639J258L08p9k61m36
$$ y = [299017, 302684, 305491, 307771, 310295, 313150, 315710, 317480, 318576, 319320, 319696, 319456, 318599, 317453, 316298, 315076, 313491, 311272, 308339, 304823, 300955, 296929, 292907, 289092, 285617, 282345, 279056, 275883, 273187, 270824, 268065, 264660, 261503, 259584, 258562, 257154, 254824, 252282, 250213, 248355, 246173, 243854, 242169, 241667, 242314, 243529, 244330, 243808, 241820, 239102, 236569, 234659, 233360, 232495, 231830, 231197, 230601, 230020, 229205, 228081, 227186, 227111, 227558, 227703, 227539, 227981, 229418, 231001, 231833, 232049, 232145, 231963, 231139, 230015, 229314, 229200, 229352, 229641, 230131, 230695, 231232, 231952, 232874, 233408, 233125, 232543, 232338, 232081, 230829, 228857, 227661, 227981, 228851, 229097, 228944, 229451, 230874, 232406, 233336, 233824, 234479, 235582, 236917, 238139, 239140, 240049, 240981, 241918, 242836, 243825, 244963, 246238, 247769, 249958, 253116, 256981, 260933, 264705, 268555, 272617, 276367, 279006, 280264, 280572, 280493, 280232, 279796]
53787B79796l82R4P28J099J186J281J375J058J69r13j781k408k762k553j761r82
53771B73244o43l54L47R98Q05J1l18K13Q84J107J166J464J809J873J801J938K449
53754B88794L489N236P385R133J0102J0887J2353J4734J7777K1321K5288K9386
53742D55885L3330L6992L9854M0514L7385L0057J9687Q005l782j5052k5098l2835
53730F24942l7281l8258l6466l2884k8301k3418j9001j5530j2851j0533q479o901
53718C55039n831n034m345l720k988j930o74M18J210J841K322K458K224J839J489
53703C44318J272J370J880K477K671K442K225K169J940J288N36K22N61J382K293
53688C69046K855K777K086R86l11j469k000j722j128r20j251j744k075k137j846
$$ y = [279796, 279414, 279508, 280236, 281335, 282521, 283802, 285177, 286235, 286404, 285491, 283710, 281302, 278540, 275987, 274226, 273244, 272601, 272247, 272594, 273592, 274397, 274408, 274090, 274303, 275187, 276294, 277460, 278924, 280733, 282606, 284407, 286345, 288794, 292283, 297519, 304904, 314037, 324139, 335026, 347379, 362113, 379890, 401211, 426499, 455885, 489215, 526207, 566061, 606575, 643960, 674017, 693704, 701709, 697927, 682875, 657777, 624942, 587661, 549403, 512937, 480053, 451752, 428334, 409333, 393803, 380952, 370419, 361940, 355039, 349208, 344174, 339829, 336109, 333121, 331191, 330517, 330935, 332145, 333986, 336308, 338766, 340990, 342829, 344318, 345590, 346960, 348840, 351317, 353988, 356430, 358655, 360824, 362764, 364052, 364588, 364810, 365371, 366753, 369046, 371901, 374678, 376764, 377750, 377439, 375970, 373970, 372248, 371120, 370200, 368949, 367205, 365130, 362993, 361147]
53673C61147j255p68p21q77p76m43l02n37j020j662k319k622k460k321k476k269
53657C38319j040N49J222Q80N78P73Q40M67K38M47M46k20r63j001l11O79J620
53640C43523K045J547O21M77J465K501K596K195K247K722K886K574K350K644L271
53625C75664L648L244K141J315J817L465M984N613N789O010N966N286M338L632
53611D32912L231L201L822M763N027M392L915M273M580L894K913K807L209K789
53597D85728J401J68l26m98n08O1J069J595J191M15j91p72j487k000k060j987
53581D81799k164k463k557k417k280k351k631k895k841k463k121k020j888j533
53567D49175j382j881k626k748k070j272r04q35p33n24k23K35P57J061J097J196
$$ y = [361147, 359892, 359124, 358403, 357526, 356750, 356307, 356005, 355468, 354448, 352786, 350467, 347845, 345385, 343064, 340588, 338319, 337279, 337828, 339050, 339930, 340508, 341281, 342121, 342588, 342826, 343273, 343719, 343499, 342536, 341535, 341224, 341903, 343523, 345568, 347115, 347736, 348213, 349678, 352179, 354775, 356970, 359217, 361939, 364825, 367399, 369749, 372393, 375664, 379312, 382556, 384697, 386012, 387829, 391294, 396278, 401891, 407680, 413690, 419656, 424942, 429280, 432912, 436143, 439344, 443166, 447929, 452956, 457348, 461263, 465536, 470116, 474010, 476923, 479730, 482939, 485728, 487129, 487297, 486971, 486473, 485965, 486026, 487095, 488690, 489881, 490296, 490105, 489333, 487846, 485846, 483786, 481799, 479635, 477172, 474615, 472198, 469918, 467567, 464936, 462041, 459200, 456737, 454616, 452596, 450708, 449175, 447793, 445912, 443286, 440538, 438468, 437196, 436292, 435457, 434724, 434200, 433977, 434212, 434969, 436030, 437127, 438323]
53551D38323J687K455L068L215L043L050L606M588N650O742P998R181R828J0013
53537E12447J0403J1293J2192J2693J3150J4077J5436J6988J8777K0791K2799
53526F81046K5080K8534L3397L8505M2646M5893M8598M9712M7538M1962L4658
53515A117569K7082J9394J1563M382j018l958m255k220J170M723P932J0960J3739
53502A207063J5765J6908J7704J8606J9514K0243K0935K1773K2717K3612K4264
53491A429104K4383K3950K3490K3503K3661K3226K2193K1304K0864K0295J9005
53480A674978J7065J4886J2792J1090R928Q918P523N901M645L489J189k820p364
53467A762220j0796j2750j4038j5243j6258j7017j7829j8871j9876k0613k1337
$$ y = [438323, 440010, 442465, 445533, 448748, 451791, 454841, 458447, 463035, 468685, 475427, 483425, 492606, 502434, 512447, 522850, 534143, 546335, 559028, 572178, 586255, 601691, 618679, 637456, 658247, 681046, 706126, 734660, 768057, 806562, 849208, 895101, 943699, 993411, 1040949, 1082911, 1117569, 1144651, 1164045, 1175608, 1179990, 1178972, 1175014, 1170759, 1168539, 1169709, 1174432, 1182364, 1193324, 1207063, 1222828, 1239736, 1257440, 1276046, 1295560, 1315803, 1336738, 1358511, 1381228, 1404840, 1429104, 1453487, 1477437, 1500927, 1524430, 1548091, 1571317, 1593510, 1614814, 1635678, 1655973, 1674978, 1692043, 1706929, 1719721, 1730811, 1740739, 1749657, 1757180, 1763081, 1767726, 1771215, 1772404, 1769584, 1762220, 1751424, 1738674, 1724636, 1709393, 1693135, 1676118, 1658289, 1639418, 1619542, 1598929, 1577592]
53456A577592k2440k3828k4926k5312k5167k4940k4767k4499k4190k4138k4331
53445A309054k4211k3247k1456j9216j6815j4448j2320j0467q740p192o051n120
53433A139771l698j545O73K362L889N809P770R009R659J0658J2545J5080J7869
53420A229851K0547K2538K3535K4146K5283K6972K8549K9922L1685L3915L5967
53409A532910L7555L9199M1246M3359M5257M7273M9803N2805N6102N9543O2725
53398B067777O5164O6914O8401O9569O9955O9664O9409O9395O9060O8163O7217
53387B820688O6430O5217O3155O0558N7480N3226M7533M1469L6211L1587K6750
53376C370304K1711J7166J3136Q757L470k365q014j3107j7877k3144k9752l7545
$$ y = [1577592, 1555152, 1531324, 1506398, 1481086, 1455919, 1430979, 1406212, 1381713, 1357523, 1333385, 1309054, 1284843, 1261596, 1240140, 1220924, 1204109, 1189661, 1177341, 1166874, 1158134, 1150942, 1144891, 1139771, 1136073, 1134528, 1135201, 1137563, 1141452, 1147261, 1155031, 1164040, 1173699, 1184357, 1196902, 1211982, 1229851, 1250398, 1272936, 1296471, 1320617, 1345900, 1372872, 1401421, 1431343, 1463028, 1496943, 1532910, 1570465, 1609664, 1650910, 1694269, 1739526, 1786799, 1836602, 1889407, 1945509, 2005052, 2067777, 2132941, 2199855, 2268256, 2337825, 2407780, 2477444, 2546853, 2616248, 2685308, 2753471, 2820688, 2887118, 2952335, 3015490, 3076048, 3133528, 3186754, 3234287, 3275756, 3311967, 3343554, 3370304, 3392015, 3409181, 3422317, 3431074, 3434544, 3432179, 3424165, 3411058, 3393181, 3370037, 3340285, 3302740]
53364C302740m5106n1026n5276n8824o2163o4902o6649o7582o7874o7195o5145
53353B630998o1930n8278n4768n1492m8403m5756m3966m3025m2445m1996m2213
53342B096726m3675m5987m8049m9258m9818m9848m8933m6831m3987m0924l7633
53331A591783l3955l0218k7057k4815k3369k2297k1022j9244j7351j6050j5339
53320A341066j4362j2470j0010p789o265n513n349n078l720j016K133M684O416
53307A282727P616Q391R031J0346J2800J5650J7807J9390K1481K4472K7451K9413
53295A486575L0392L1155L2279L3744L5079L5688L5261L3931L1979K9514K6732
53284A842329K4141K2058J9961J6969J3007R014N804L146K43l170o529r198j1200
$$ y = [3302740, 3257634, 3206608, 3151332, 3092508, 3030345, 2965443, 2898794, 2831212, 2763338, 2696143, 2630998, 2569068, 2510790, 2456022, 2404530, 2356127, 2310371, 2266405, 2223380, 2180935, 2138939, 2096726, 2053051, 2007064, 1959015, 1909757, 1859939, 1810091, 1761158, 1714327, 1670340, 1629416, 1591783, 1557828, 1527610, 1500553, 1475738, 1452369, 1430072, 1409050, 1389806, 1372455, 1356405, 1341066, 1326704, 1314234, 1304224, 1296435, 1290170, 1284657, 1279308, 1274230, 1270510, 1269494, 1271627, 1276311, 1282727, 1290343, 1298734, 1307765, 1318111, 1330911, 1346561, 1364368, 1383758, 1405239, 1429711, 1457162, 1486575, 1516967, 1548122, 1580401, 1614145, 1649224, 1684912, 1720173, 1754104, 1786083, 1815597, 1842329, 1866470, 1888528, 1908489, 1925458, 1938465, 1947479, 1953283, 1956429, 1956672, 1953502, 1946973, 1937775, 1926575]
53271A926575j3113j5328j7653j9759k1783k4117k6660k8773l0143l1228l2546
53260A665472l3967l5088l5937l6784l7534l7895l8017l8395l9015l9120l8030
53249A255690l5902l3566l1783l0739l0055k9211k8060k6916k6059k5317k4344
53238I33738k3147k2044k1137k0097j8542j6425j4019j1659r555p756o291n344
53226G57722n129n586o408p486r001j0897j2573j3605j4416j5735j7393j8362
53214F21131j8071j7126j6373j5731j4476j2457j0469r313q930q727q395q127
53202D72936q092q127p939p473o945o664o836p288p409o641n194m011l839m474
53188C82004n071m956m053k863k165k367k914k761j776j154j900l424m317m175
$$ y = [1926575, 1913462, 1898134, 1880481, 1860722, 1838939, 1814822, 1788162, 1759389, 1729246, 1698018, 1665472, 1631505, 1596417, 1560480, 1523696, 1486162, 1448267, 1410250, 1371855, 1332840, 1293720, 1255690, 1219788, 1186222, 1154439, 1123700, 1093645, 1064434, 1036374, 1009458, 983399, 958082, 933738, 910591, 888547, 867410, 847313, 828771, 812346, 798327, 786668, 777113, 769357, 763066, 757722, 752593, 747007, 740599, 733113, 724112, 713215, 700642, 687037, 672621, 656886, 639493, 621131, 603060, 585934, 569561, 553830, 539354, 526897, 516428, 507115, 498185, 489458, 481063, 472936, 464844, 456717, 448778, 441305, 434360, 427696, 420860, 413572, 406163, 399522, 394328, 390317, 386478, 382004, 376933, 371977, 367924, 365061, 362896, 360529, 357615, 354854, 353078, 351924, 350024, 346600, 342283, 338108]
53174C38108l710l366k837j983j198o30O6Q52J041L53m81o61l27j31l06o24q11
53157C23355o76j92K22l8q44j265q01j15r1o72j211j457j544j362o88K12P37O60
53139C14230K53j35k49R4P55J154Q39J05l05oP39J367J434R45M65O08J229J464
53121C24986Q73K7l49l38m29o33o08k91J38O91J392J907J898J539J240J075R11
53104C34029Q60J077J344J402J424J676J946J866J571J463J513J386J032O26K01
53089C53416j53m3N25O52m43k114k974k712k193j894j378n30q4m04q10p46p77
53072C37338j561k557k692j953j371j503j838j778j488j457j694j796j562j177
53058C12911p93k87M20R98R98M42q0p0M07R39J200R57Pj436k489k261r06M12P52
$$ y = [338108, 334398, 331032, 328195, 326212, 325014, 324384, 324450, 325302, 326343, 326696, 326215, 325554, 325227, 325096, 324790, 324166, 323355, 322679, 322487, 322709, 322671, 321827, 320562, 319761, 319646, 319555, 318883, 317672, 316215, 314671, 313309, 312621, 312833, 313570, 314230, 314483, 314348, 314099, 314193, 314948, 316102, 316941, 317046, 316741, 316735, 317474, 318841, 320275, 321220, 321685, 322293, 323522, 324986, 325859, 325886, 325537, 325199, 324770, 324137, 323529, 323238, 323376, 324067, 325459, 327366, 329264, 330803, 332043, 333118, 334029, 334889, 335966, 337310, 338712, 340136, 341812, 343758, 345624, 347195, 348658, 350171, 351557, 352589, 353215, 353416, 353263, 353220, 353745, 354397, 353954, 351840, 348866, 346154, 343961, 342067, 340689, 340159, 340075, 339671, 338861, 338115, 337338, 335777, 333220, 330528, 328575, 327204, 325701, 323863, 322085, 320597, 319140, 317446, 315650, 314088, 312911, 312118, 311831, 312251, 313249, 314247, 314689, 314609, 314539, 314946, 315885, 317085, 318042, 318049, 316613, 314124, 311863, 310957, 311369, 312121]
53039C12121L17m3L5J33k00p27q25l40J59J17l42o82o77m48MO56R72K52j249k273
53019C06960k034j151o13m12J52J139J817J758J384J298J528J573J036J20m19
53004C14136o9O67O86k76j157q80L09J380J870K010J897J482J153J461K198K514
52988C29381K088J505J323J383J220O68j49r77j513j614j524j529j476j075n56
52973C27155m78q98j257j138o79j97J49L02M11Q86J871K687K424J098l32j126
52957C30878j345j289j062p83n95k87L39P47J69j064j627j060m79q57j544j407
52941C18734o50l49o37o08O0N03m2j216k145k419k118j405n97k33m97q33n93M0
52923C04995K54k32p71p60m82n24o84k17Q75J542J023n1m30J82R08R61M91J15
$$ y = [312121, 312438, 312395, 312430, 312563, 312363, 311636, 310811, 310471, 310630, 310747, 310405, 309723, 309046, 308598, 308602, 309258, 310230, 310482, 309233, 306960, 304926, 303775, 303162, 302750, 302902, 304041, 305858, 307616, 309000, 310298, 311826, 313399, 314435, 314555, 314136, 314067, 314734, 315420, 315144, 313987, 313107, 313416, 314796, 316666, 318676, 320573, 322055, 323208, 324669, 326867, 329381, 331469, 332974, 334297, 335680, 336900, 337568, 337419, 336442, 334929, 333315, 331791, 330262, 328786, 327711, 327155, 326677, 325779, 324522, 323384, 322705, 322508, 322657, 322959, 323370, 324256, 326127, 328814, 331238, 332336, 332004, 330878, 329533, 328244, 327182, 326399, 325804, 325517, 325856, 326603, 326772, 325708, 324081, 323021, 322542, 321685, 320141, 318734, 318084, 317735, 317098, 316490, 316550, 317053, 317011, 315795, 313650, 311231, 309113, 307708, 307111, 306878, 306381, 305548, 304955, 304995, 305249, 305017, 304246, 303486, 303004, 302480, 301796, 301579, 302454, 303996, 305019, 304968, 304538, 304720, 305628, 306589, 307080, 307195]
52905C07195O0J02J25L31Q78J459J509Q78R2l15n21j037j742j862j114k11J39
52888C05966J97N70J147J272P72J23k73m93p84j291j947k313j759l40R14J077
52872C02838M99J73K51J5o98r95j90J120J668R01n17j381j046j1O46N21K58M03
52854C04455M69k46j361j814j378q69q44r96r31p13m46n4K82K18m4J25P51J001
52836B97605L62o43j227j277j122r42p63o65o30n77o32r47j175p16L53J214J336
52819B89554R39K92n97j323j094O3R30O97K29Q61K500L873M345M537N079N732
52803C16617N911N449M450K800L45k587n142o586o953o877o782o432n453m072
52789B84688k960k445k261k012j586j045n36k60k68k67lK66Q6m75q94r39q37p34
$$ y = [307195, 307255, 307357, 307482, 307813, 308691, 310150, 311659, 312537, 312629, 312314, 311793, 310756, 309014, 307152, 306038, 305827, 305966, 306163, 306733, 307880, 309152, 309924, 310047, 309774, 309281, 308497, 307206, 305259, 302946, 301187, 300847, 301761, 302838, 303337, 303510, 303761, 303776, 303078, 302083, 301893, 303013, 304681, 305582, 305065, 303684, 302638, 302627, 303273, 303794, 304052, 304455, 304924, 304678, 303317, 301503, 300125, 299256, 298412, 297416, 296485, 295772, 295326, 295272, 295554, 295772, 295728, 295853, 296604, 297605, 297967, 297324, 296097, 294820, 293698, 292756, 291993, 291328, 290698, 290121, 289489, 288542, 287367, 286651, 287004, 288218, 289554, 290493, 290785, 290188, 288865, 287771, 287834, 288764, 289461, 289690, 290551, 293051, 296924, 301269, 305806, 310885, 316617, 322528, 327977, 332427, 335227, 335572, 332985, 327843, 321257, 314304, 307427, 300645, 294213, 288760, 284688, 281728, 279283, 277022, 275010, 273424, 272379, 271843, 271583, 271315, 271048, 271045, 271311, 271397, 270922, 270028, 269089, 268252, 267518]
52771B67518n00j26K26N66J033J439J426J033O43M33L45M99R79J375J279J103
52755B79271J549K349K467J628O49J44r0k49j56pl61j041j161n76k03l72j75Q53
52737B84519J628J128L3l59l8P5k66n52n93n27j50Q25J956K411J972J062M5q22
52719B92347j175r29o70r48j499j692j379p61J02R92J220M76m71o48j47J77j6
52702B84979l37m14j54M78J302J788J669J398J418J452J137Q27J038J536J756
52687B99873J643J358P00l61j085q75k75j37k88j13J05k94q34l71J077K268K531
52670C04922K322J987J340O77Q68J959K755K385J363O62N28O53P93P81M52k5k31
52653C24191k2M36J149K126K730K137N77p10j029r46j211j733k024j925j486o79
$$ y = [267518, 267018, 266892, 267118, 267684, 268717, 270156, 271582, 272615, 273258, 273691, 274036, 274535, 275514, 276889, 278168, 279271, 280820, 283169, 285636, 287264, 287913, 288057, 287967, 287718, 287562, 287555, 287194, 286153, 284992, 284416, 284213, 283841, 283666, 284519, 286147, 287275, 287308, 286949, 286911, 286986, 286720, 286168, 285575, 285048, 284898, 285723, 287679, 290090, 292062, 293124, 293169, 292347, 291172, 290243, 289573, 288625, 287126, 285434, 284055, 283294, 283396, 284388, 285608, 286084, 285613, 284965, 284818, 284995, 284979, 284642, 284228, 284074, 284552, 285854, 287642, 289311, 290709, 292127, 293579, 294716, 295543, 296581, 298117, 299873, 301516, 302874, 303574, 303213, 302128, 301253, 300978, 300841, 300553, 300440, 300545, 300251, 299417, 299046, 300123, 302391, 304922, 307244, 309231, 310571, 311248, 312116, 314075, 316830, 319215, 320578, 321240, 321768, 322421, 323214, 323995, 324447, 324422, 324191, 324169, 324605, 325754, 327880, 330610, 332747, 333324, 332614, 331585, 330639, 329428, 327695, 325671, 323746, 322260, 321581]
52637C21581L28J124J568J935K352K577K565K648L014L527M147M992N772N768
52623C63898M610K661N35j297k513l176l913n076n880n295l794k952l232l388
52609C31188k569j574j232q61M24J826J789L48q56p80pN19P04R04J130J185J164
52592C33302J331J666J811J489R26O67R86J488J560J097N20Q0l45p14o36n7M09
52575C45580K93L5L94J309J904J607P61K8m06p36r80q12q4P08Q44K14n12o99m22
52556C49026j27Kj6l19q70j044k21J185K028J805J212J102J542K088K434K419
52540C62246J908J045K91o9k56n98j067j381j373j099q18q39j129j135m18N91
52524C55899R92O14J75K82P61J179J388J399J300J458K140K849K733J956J764
$$ y = [321581, 321909, 323033, 324601, 326536, 328888, 331465, 334030, 336678, 339692, 343219, 347366, 352358, 358130, 363898, 368508, 371169, 371704, 370407, 367894, 364718, 360805, 355729, 349849, 344554, 340760, 337808, 334576, 331188, 328619, 327045, 325813, 324952, 325376, 327202, 328991, 329339, 328483, 327703, 327696, 328215, 328919, 329823, 330953, 332138, 333302, 334633, 336299, 338110, 339599, 340525, 341192, 342178, 343666, 345226, 346323, 346843, 346923, 346578, 345864, 345228, 345171, 345580, 345873, 345908, 346302, 347611, 349515, 351122, 351883, 351911, 351505, 350769, 349789, 348977, 348893, 349601, 350445, 350659, 350147, 349448, 349026, 348899, 348901, 348885, 348566, 347696, 346652, 346431, 347616, 349644, 351449, 352661, 353763, 355305, 357393, 359827, 362246, 364154, 365199, 365490, 365421, 365165, 364567, 363500, 362119, 360746, 359647, 358829, 357990, 356861, 355726, 355308, 355899, 356891, 357505, 357680, 357962, 358723, 359902, 361290, 362689, 363989, 365447, 367587, 370436, 373169, 375125, 376889]
52509C76889K725L802L877L349L334L701L122R79j711l455l784l344k936k811
52495C83737k772k691k743k978k955k257j305r97j400j539q58j45l54j060r83
52480C58700K64J725K329J830N77q68j788j593m55P46J349J518J716J942J863
52465C69855J502J327J616K070K318K540L165L966L956K510K17j716k648k740
52451C87938k376j934j913k555l345l538l158k840k694k218j406r92j217j296
52437C56456p05j24l48q92o69M24J417J586J069K97m39q66q04m43j30Q7L42N65
52419C56823N49L64K32K09K87P03J582K544L117L420L948M765N536O289P515R372
52403D07255J1315J2678J3180J2624J0726P483L500n07m239p674j0474j2011j1970
$$ y = [376889, 379614, 383416, 387293, 390642, 393976, 397677, 400799, 401778, 400067, 396612, 392828, 389484, 386548, 383737, 380965, 378274, 375531, 372553, 369598, 367341, 366036, 365039, 363639, 362100, 361242, 361097, 360743, 359683, 358700, 358964, 360689, 363018, 364848, 365425, 364557, 362769, 361176, 360721, 361467, 362816, 364334, 366050, 367992, 369855, 371357, 372684, 374300, 376370, 378688, 381228, 384393, 388359, 392315, 394825, 395042, 393326, 390678, 387938, 385562, 383628, 381715, 379160, 375815, 372277, 369119, 366279, 363585, 361367, 359961, 358969, 357752, 356456, 355751, 355627, 355279, 354387, 353718, 354142, 355559, 357145, 358214, 358511, 358072, 357206, 356402, 355959, 355829, 355916, 356258, 356823, 357372, 357736, 357968, 358177, 358464, 359167, 360749, 363293, 366410, 369830, 373778, 378543, 384079, 390368, 397883, 407255, 418570, 431248, 444428, 457052, 467778, 475261, 478761, 478254, 474015, 466341, 455867, 443856, 431886]
52390D31886j0715q941p071n197l470k257j754j628j387r70o94o02k58O93K055
52375C89690L347M303M963N433N793O089O315O385O163N439M031K100K38j087
52361D49202j991k738l076k601j647j049r87q68m63k37k89O3J074J836J596J112
52345D38937J680L282M644M976M717M634M939N382N692N835O203P405R438J1374
52331E19138J2368J2719J3329J4379J5322J5985J6808J7937J8855J9207J9357
52320F95404J9834K0556K0903K0274J8576J6411J4842J4590J5382J6315J6775
52309H89862J6756J6516J6316J6353J6500J6220J5202J3883J2875J2120J1180
52298A053783J0170R632R490Q906P310M900J976j432n022p963r650j0231j0066
$$ y = [431886, 421171, 412230, 405159, 399962, 396492, 394235, 392481, 390853, 389466, 388496, 387802, 387200, 386942, 387635, 389690, 393037, 397340, 402303, 407736, 413529, 419618, 425933, 432318, 438481, 443920, 447951, 450051, 450289, 449202, 447211, 444473, 441397, 438796, 437149, 436100, 435113, 434245, 433782, 433545, 433256, 433319, 434393, 436229, 437825, 438937, 440617, 443899, 448543, 453519, 458236, 462870, 467809, 473191, 478883, 484718, 490921, 498326, 507764, 519138, 531506, 544225, 557554, 571933, 587255, 603240, 620048, 637985, 656840, 676047, 695404, 715238, 735794, 756697, 776971, 795547, 811958, 826800, 841390, 856772, 873087, 889862, 906618, 923134, 939450, 955803, 972303, 988523, 1003725, 1017608, 1030483, 1042603, 1053783, 1063953, 1073585, 1083075, 1091981, 1099291, 1104191, 1106167, 1104735, 1099713, 1091750, 1082100, 1071869, 1061803]
52285A061803r213p747o219n311n193n433n340m385k647r06J28P48J894L857N936
52270A021972P507Q707R762J0461J0804J1408J2589J3656J3940J3982J4780J6191
52258A165759J7145J7228J7005J6704J5746J3964J2233J1252J0443Q886O763M997
52246A318125L755K207j72k925n357p313q786r385q822p645o911p037p385p073
52232A245276n941m592l745l727m374n144n351m557k971j387n61n82q41o76R0
52217A200917J206K417L554M379M705M755N137O224P730Q990R592R620R508R709
52203A288443J0246J0483R625P659N501M089L671M098N199O366O515N223L603
52190A370721L122L738M076L370K200J220J66j397l191m644n744o900q341r949
$$ y = [1061803, 1052590, 1044843, 1038624, 1033313, 1028120, 1022687, 1017347, 1012962, 1010315, 1009409, 1009537, 1010285, 1012179, 1016036, 1021972, 1029479, 1038186, 1047948, 1058409, 1069213, 1080621, 1093210, 1106866, 1120806, 1134788, 1149568, 1165759, 1182904, 1200132, 1217137, 1233841, 1249587, 1263551, 1275784, 1287036, 1297479, 1306365, 1313128, 1318125, 1321880, 1324087, 1323915, 1320990, 1315633, 1308320, 1299534, 1290149, 1281327, 1273682, 1266771, 1259734, 1252349, 1245276, 1239335, 1234743, 1230998, 1227271, 1222897, 1217753, 1212402, 1207845, 1204874, 1203487, 1202926, 1202344, 1201503, 1200827, 1200917, 1202123, 1204540, 1208094, 1212473, 1217178, 1221933, 1227070, 1233294, 1241024, 1250014, 1259606, 1269226, 1278734, 1288443, 1298689, 1309172, 1318797, 1326456, 1331957, 1336046, 1339717, 1343815, 1349014, 1355380, 1361895, 1367118, 1370721, 1373843, 1377581, 1381657, 1385027, 1387227, 1388447, 1388613, 1387216, 1384025, 1379381, 1373637, 1366737, 1358396, 1348447]
52176A348447j1367j2104j1958j1388j1016j0641r477p424n338l711k003K14K306
52163A254540L486L995M643N740P098Q578R861J0225R261P509N708L926K021M80
52149A337071j04N0K84M60P60R43O15j5n62j218k279l205l281k928l234m250m862
52132A314245m359k992j005J766M995P831J0096J2603J5813J9035K1503K3411
52120A422942K5385K7520K9532L1281L2646L3335L3230L2564L1486K9864K7716
52109A757501K5326K2803K0030J7269J5093J3550J2082J0539R561R506R676R201
52097A932137Q126P115O487O084N625M774L181R11j543l985o824j0290j3807j6509
52083A921482j7871j7482j4890j0365n331j274J547L770N683P024P764Q365R239
$$ y = [1348447, 1337080, 1324976, 1313018, 1301630, 1290614, 1279973, 1270496, 1263072, 1257734, 1254023, 1252020, 1252234, 1254540, 1258026, 1262021, 1266664, 1272404, 1279502, 1288080, 1297941, 1308166, 1317427, 1324936, 1330644, 1334570, 1336591, 1337071, 1336967, 1337017, 1337301, 1337761, 1338521, 1339464, 1340079, 1340064, 1339502, 1338284, 1336005, 1332800, 1329519, 1326591, 1323357, 1319107, 1314245, 1309886, 1306894, 1305889, 1307655, 1312650, 1320481, 1330577, 1343180, 1358993, 1378028, 1399531, 1422942, 1448327, 1475847, 1505379, 1536660, 1569306, 1602641, 1635871, 1668435, 1699921, 1729785, 1757501, 1782827, 1805630, 1825660, 1842929, 1858022, 1871572, 1883654, 1894193, 1903754, 1913260, 1922936, 1932137, 1940263, 1947378, 1953865, 1959949, 1965574, 1970348, 1973529, 1974440, 1972897, 1968912, 1962088, 1951798, 1937991, 1921482, 1903611, 1886129, 1871239, 1860874, 1855543, 1854269, 1855816, 1859586, 1865269, 1872293, 1880057, 1888422, 1897661]
52070A897661J0483J2054J3809J5450J6808J7984J8811J8533J6679J4048J2083
52059B064403J1218J0498Q918O601M414K909J952J066j28j701l410n010o539q233
52045B086958j0137j1997j3579j4953j6394j7963j9201j9381j8233j6370j4670
52034A914080j3256j1598r668q310q084q336q090p502p613q810j0237j0857j0527
$$ y = [1897661, 1908144, 1920198, 1934007, 1949457, 1966265, 1984249, 2003060, 2021593, 2038272, 2052320, 2064403, 2075621, 2086119, 2095037, 2101638, 2106052, 2108961, 2110913, 2111979, 2111851, 2110150, 2106740, 2101730, 2095191, 2086958, 2076821, 2064824, 2051245, 2036292, 2019898, 2001935, 1982734, 1963353, 1945120, 1928750, 1914080, 1900824, 1889226, 1879558, 1871248, 1863164, 1854828, 1846738, 1839236, 1831623, 1822813, 1812576, 1801719, 1791192]
$$ [...]
##END NTUPLES=NMR SPECTRUM
##END=
