##TITLE=AC1516_ROEFFECT0003_8201946_lysXHepDRr
##JCAMPDX= 6.0         $$ Bruker NMR JCAMP-DX V2.0
##DATA TYPE= NMR SPECTRUM
##DATA CLASS= NTUPLES
##ORIGIN= BRUKER
##OWNER= Administrator
$$ 1.72 TOPSPIN		Version 2.1
$$ 2013-09-26 19:57:16.229 -0700  Administrator@X
$$ Compression mode = diff/dup
##.OBSERVE FREQUENCY= 400.02188249412
##.OBSERVE NUCLEUS= ^1H
##.ACQUISITION MODE= SIMULTANEOUS (DQD)
##.ACQUISITION SCHEME= undefined
##.AVERAGES= 8
##.DIGITISER RES= 22
##SPECTROMETER/DATA SYSTEM= spect
##.PULSE SEQUENCE= zg30
##.SOLVENT NAME= COFFEE_meoh
##.SHIFT REFERENCE= INTERNAL, COFFEE_meoh, 1, 14.98509
##AUDIT TRAIL= $$ (NUMBER, WHEN, WHO, WHERE, PROCESS, VERSION, WHAT)
$$ ##TITLE= Audit trail, TOPSPIN		Version 2.1
$$ ##JCAMPDX= 5.01
$$ ##ORIGIN= Bruker BioSpin GmbH
$$ ##OWNER= Administrator
$$ $$ E:\/data/COFFEE/nmr/AC1516_ROEFFECT0003_8201946_lysXHepDRr/10/pdata/1/auditp.txt
$$ ##AUDIT TRAIL=  $$ (NUMBER, WHEN, WHO, WHERE, PROCESS, VERSION, WHAT)
(   1,<2013-09-26 19:57:08.880 -0700>,<Administrator>,<X>,<go>,<TOPSPIN 2.1>,
      <created by zg
	started at 2013-09-26 19:56:02.902 -0700,
	POWCHK enabled, PULCHK disabled,
       configuration hash MD5:
       C8 4E 4E 5D D3 5C D8 9E 9F 52 82 E0 59 8A DE 15
       data hash MD5: 64K
       BD 40 0A F6 9A 54 27 5F C5 E7 31 22 F5 CD 21 51>)
(   2,<2013-09-26 19:57:11.799 -0700>,<Administrator>,<X>,<proc1d>,<TOPSPIN 2.1>,
      <Start of raw data processing
       efp LB = 0 FT_mod = 6 PKNL = 1 PHC0 = 0 PHC1 = 0 SI = 32K 
       data hash MD5: 32K
       8E 51 88 B9 40 EC 73 39 5C 23 9D 41 2F 1A 60 C9>)
(   3,<2013-09-26 19:57:12.186 -0700>,<Administrator>,<X>,<proc1d>,<TOPSPIN 2.1>,
      <pk PHC0 = 95.33386 PHC1 = 0 
       data hash MD5: 32K
       FF E4 99 01 4D FE 04 3D FA 99 34 DA 93 01 65 5D>)
(   4,<2013-09-26 19:57:12.473 -0700>,<Administrator>,<X>,<proc1d>,<TOPSPIN 2.1>,
      <abs ABSG = 1 
       data hash MD5: 32K
       BF 9D FE 4C CD 51 E6 F3 55 AA 00 46 FC D9 16 B2>)
(   5,<2013-09-26 19:57:12.557 -0700>,<Administrator>,<X>,<proc1d>,<TOPSPIN 2.1>,
      <abs ABSG = 2 
       data hash MD5: 32K
       B2 3F E9 3A 86 6A B5 06 23 C0 7D F8 28 0A 96 33>)
(   6,<2013-09-26 19:57:12.641 -0700>,<Administrator>,<X>,<proc1d>,<TOPSPIN 2.1>,
      <abs ABSG = 3 
       data hash MD5: 32K
       B3 98 42 88 C0 FD E8 23 60 B4 12 F5 E0 C9 43 22>)
(   7,<2013-09-26 19:57:12.692 -0700>,<Administrator>,<X>,<proc1d>,<TOPSPIN 2.1>,
      <abs ABSG = 4 
       data hash MD5: 32K
       BF 43 31 F2 DA 0C B4 98 24 6C 88 52 E9 35 A0 1D>)
(   8,<2013-09-26 19:57:12.776 -0700>,<Administrator>,<X>,<proc1d>,<TOPSPIN 2.1>,
      <abs ABSG = 5 
       data hash MD5: 32K
       D6 6F A5 B2 51 49 EF CA 18 14 69 57 5D B6 77 27>)
$$ ##END=
$$ 
$$ $$ hash MD5
$$ $$ DD 9F E7 5E 2B A7 C7 88 02 0D 3A FC 38 17 6C 89
##$RELAX= 
##$RELAX= 
##$RELAX= 
##$RELAX= 
##$RELAX= 
##$RELAX= 
##$RELAX= 
$$ Bruker specific parameters
$$ --------------------------
##$DU= <E:\>
##$EXPNO= 10
$$ [...]
150 150 150 150 150 150 150 150
##$TP07= 0
##$TPNAME0= <>
##$TPNAME1= <>
##$TPNAME2= <>
##$TPNAME3= <>
##$TPNAME4= <>
##$TPNAME5= <>
##$TPNAME6= <>
##$TPNAME7= <>
##$TPOAL= (0..7)
0.5 0.5 0.5 0.5 0.5 0.5 0.5 0.5
##$TPOFFS= (0..7)
0 0 0 0 0 0 0 0
##$TUNHIN= 0
##$TUNHOUT= 0
##$TUNXOUT= 0
##$USERA1= <user>
##$USERA2= <user>
##$USERA3= <user>
##$USERA4= <user>
##$USERA5= <user>
##$V9= 5
##$VALIST= <valist>
##$VCLIST= <CCCCCCCCCCCCCCC>
##$VD= 0
##$VDLIST= <DDDDDDDDDDDDDDD>
##$VPLIST= <PPPPPPPPPPPPPPP>
##$VTLIST= <TTTTTTTTTTTTTTT>
##$WBST= 1024
##$WBSW= 4
##$XGAIN= (0..3)
0 0 0 0
##$XL= 0
##$YL= 0
##$YMAX_a= 615045
##$YMIN_a= -523809
##$ZGOPTNS= <>
##$ZL1= 120
##$ZL2= 120
##$ZL3= 120
##$ZL4= 120
##$ABSF1= 14.98509
##$ABSF2= -5.573092
##$ABSG= 5
##$ABSL= 3
##$ALPHA= 0
##$AQORDER= 0
##$ASSFAC= 0
##$ASSFACI= 0
##$ASSFACX= 0
##$ASSWID= 0
##$AUNMP= <proc_prof1d_extract_pilot.lims>
##$AXLEFT= 0
##$AXNAME= <>
##$AXNUC= <1H>
##$AXRIGHT= 0
##$AXTYPE= 0
##$AXUNIT= <>
##$AZFE= 0.1
##$AZFW= 0.1
##$BCFW= 0
##$BC_mod= 0
##$BYTORDP= 0
##$COROFFS= 0
##$CY= 15
##$DATMOD= 1
##$DC= 0
##$DFILT= <>
##$DTYPP= 0
##$F1P= 0
##$F2P= 0
##$FCOR= 0.5
##$FTSIZE= 32768
##$FT_mod= 6
##$GAMMA= 0
##$GB= 0
##$INTBC= 1
##$INTSCL= 1
##$ISEN= 128
##$LB= 0
##$LEV0= 0
##$LPBIN= 0
##$MAXI= 10000
##$MC2= 0
##$MEAN= 0
##$ME_mod= 0
##$MI= 0
##$NCOEF= 0
##$NC_proc= -8
##$NLEV= 6
##$NOISF1= 0
##$NOISF2= 0
##$NSP= 0
##$NTH_PI= 0
##$NZP= 0
##$OFFSET= 14.98509
##$PC= 1
##$PHC0= 95.33386
##$PHC1= 0
##$PH_mod= 1
##$PKNL= yes
##$PPARMOD= 0
##$PPDIAG= 0
##$PPIPTYP= 0
##$PPMPNUM= 2147483647
##$PPRESOL= 1
##$PSCAL= 4
##$PSIGN= 0
##$PYNMP= <proc.py>
##$REVERSE= no
##$SF= 400.02
##$SI= 32768
##$SIGF1= 0
##$SIGF2= 0
##$SINO= 400
##$SIOLD= 32768
##$SPECTYP= <>
##$SREGLST= <1H.CDCl3>
##$SSB= 0
##$STSI= 32768
##$STSR= 0
##$SW_p= 8223.68421052631
##$SYMM= 0
##$S_DEV= 0
##$TDeff= 65536
##$TDoff= 0
##$TI= <>
##$TILT= no
##$TM1= 0
##$TM2= 0
##$TOPLEV= 0
##$USERP1= <user>
##$USERP2= <user>
##$USERP3= <user>
##$USERP4= <user>
##$USERP5= <user>
##$WDW= 1
##$XDIM= 32768
##$YMAX_p= 474933708
##$YMIN_p= -705351
##$CURPLOT= <Network HP LaserJet P1505>
##$CURPRIN= <$Network HP LaserJet P1505>
##$DFORMAT= <normdp>
##$LAYOUT= <+/1D_H.xwp>
##$LFORMAT= <normlp>
##$PFORMAT= <normpl>
##$SURQMSG= 1
$$ End of Bruker specific parameters
$$ ---------------------------------
##NTUPLES= NMR SPECTRUM
##VAR_NAME=  FREQUENCY,     SPECTRUM/REAL,   SPECTRUM/IMAG
##SYMBOL=    X,             R,               I
##VAR_TYPE=  INDEPENDENT,   DEPENDENT,       DEPENDENT
##VAR_FORM=  AFFN,          ASDF,            ASDF
##VAR_DIM=   32768,         32768,           32768
##UNITS=     HZ,            ARBITRARY UNITS, ARBITRARY UNITS
##FACTOR=    0.250966925370066, 1,           1
##FIRST=     8223.43324360094, 84257,        -292170
##LAST=      0,             -139685,         -65062
##MIN=       0,             -705351,         0
##MAX=       8223.43324360094, 474933708,    0
$$ Real data points
##PAGE= N=1
##DATA TABLE= (X++(R..R)), XYDATA
$$ [...]
$$ plain form
19554 -5128 -128942 -119644 -251188 266685 -426844 -142900 -139293 57307 -192213 55929 -138699
19542 45347 150420 186811 -118323 -353648 181982 -75073 -64840 -15867 -289084 209324
19531 218816 -31349 90597 -290534 -5110 -46656 194742 -69552 -102704 136998 255586 -13891
19519 -381886 -115777 84187 -134975 -103019 -313113 9471 97644 -129038 -26733 -364998 159399
19507 116173 145132 121965 -155579 205289 -84006 -62526 71038 -104926 -171808 232157 106158
19495 -10248 -226340 -212144 -37163 68298 -21260 265520 17015 -50608 264594 -269787 261651
19483 -64426 -157435 -473051 31918 144172 66646 -372482 -3088 -202497 120358 6123 -121410
19471 187362 41192 -212296 188315 -57379 -294653 82100 -191645 15618 -31079 184098
$$ packed form
19554e128j23814R298j31544B66685d26844a42900L607E7307a92213E5929a38699
19542D5347J05073L6391a18323k35325A81982g5073J0233a5867k73217B09324
19531B18816c1349I0597b90534e110m1546A94742f9552l3152A36998J18588a3891
19519c81886a15777H4187a34975L1956k10094I471Q8173a29038b6733l38265A59399
19507A16173K8959k3167a55579B05289h4006K1480G1038a04926o6882B32157A06158
19495a0248k16092J4196c7163F8298b1260B65520A7015e0608B64594b69787B61651
19483f4426r3009l15616C1918J12254F6646c72482c088j99409A20358F123a21410
19471A87362D1192b12296A88315e7379k37274H2100a91645A5618c1079A84098
$$ plain form
19460 170891 -13525 51754 -129041 -410869 -146561 -206271 92131 -146352 -100149 44442 -202539
19448 81434 -222509 -208520 -117108 -96487 -219596 19986 -104015 72813 -191083 107455 44470
19436 -35103 -155871 -111101 125043 -90476 24184 60188 -33521 32832 -208448 -28964 -103535
19425 -103535 -17173 -66169 111671 100269 -108382 -17453 -14797 -205414 -89708 216496 202718
19414 202718 -211282 -279485 -91956 64960 -311435 -98280 -231061 123922 -134480 -125851 -151076
19403 -151076 -115954 -94339 194007 -400335 -84480 -184097 51432 -434580 158122 -148324
19392 42583 -230314 -93715 208978 -104464 -276717 -3054 -269714 302908 -222320 181871
19381 -30385 -96317 270042 -67586 -171963 -10432 -160341 -244864 167134 222636 -495829 133857
$$ packed form
19460A70891a3525E1754a29041k81828a46561n9710I2131a46352M6203D4442b02539
19448H1434b22509J3989R1412K0621j23109A9986a04015G2813a91083A07455D4470
19436c5103j20768M4770A25043i0476B4184L6004c3521C2832b08448b8964p4571
19425a03535a7173m8996A11671j1402a08382a7453K656j90617h9708B16496j3778
19414B02718b11282o8203i1956F4960c11435i8280j32781A23922a34480Q629k5225
19403a51076L5122K1615A94007d00335h4480r9617E1432d34580A58122a48324
19392D2583b30314i3715B08978a04464j72253c054k66660C02908b22320A81871
19381c0385o5932B70042f7586j04377a0432j49909q4523A67134N5502d95829A33857
$$ plain form
19369 251 -51106 -236911 -193607 -266192 -97567 -272523 -82724 193232 -174921 76702 -176843
19357 -217355 -107039 -93036 -2730 -39338 -55788 187210 88266 30810 -186 -152302 32568
19345 175216 -78053 -338392 -209681 113099 -200898 -60942 -17440 70191 -169963 -231713
19335 -231713 -72952 173067 68996 61520 43153 -227035 104483 -275119 61980 -183303 175288
19323 221534 -248236 -213350 244898 -454559 -154566 -293239 -76235 164622 -270859 215352
19312 128936 -112045 -168579 2206 84785 18847 225950 15703 -35559 -257668 -186424 32786
19300 -25833 -299984 96725 -8388 -158890 -359868 -228162 -268829 123112 72178 -24329 -314187
19289 -314187 -164517 208430 232778 -129880 37664 -179775 -57354 99325 -183970 -58420
$$ packed form
19369B51e1106j85805M3304p2585i7567j74956h2724A93232a74921G6702a76843
19357b17355a07039J4003b730l6608j6450A87210H8266C0810a86j52116C2568
19345A75216g8053k60339J28711A13099b00898f0942a7440G0191a69963o1750
19335b31713g2952A73067F8996p476j8367b27035A04483b75119F1980a83303A75288
19323B21534b48236L4886B44898d54559a54566j38673g6235A64622b70859B15352
19312A28936a12045n6534B206Q2579A8847K07103A5703c5559k22109P1244C2786
19300b5833k74151I6725h388j50502k00978J31706m0667A23112n0934b4329k89858
19289c14187J49670B08430K4348a29880C7664a79775e7354I9325a83970e8420
$$ plain form
19278 197508 157323 61592 -190341 -148368 53177 -198920 -314118 -61708 -48765 -305119 -268385
19267 -268385 -96507 -15681 -345802 -103503 115766 41632 -31527 -59710 -136265 -174278 -191868
19256 -191868 -299354 9069 257207 -291986 -179801 -406399 -262536 125569 -38774 -17610
19245 -235967 -154951 14182 -251602 55142 91490 -435287 65021 -163635 -307358 -231248 -161162
19234 -161162 -366557 -262726 -1490 201226 -137105 120856 -296656 -169022 -131770 30659
19223 157586 -100846 142555 -127409 241794 -312679 -205125 21960 -21881 154754 -406633
19212 -359264 -260676 70130 95456 75492 -42005 -287648 28643 -22320 -21658 -30430 -157784 253980
19199 -135684 108053 -239123 -45848 -300191 -76714 -397217 -133009 322473 15425 -63089
$$ packed form
19278A97508m0185F1592a90341M1973E3177a98920j15198f1708J2943k56354L6734
19267b68385i6507a5681l30121a03503A15766D1632c1527k8183p6555l8013j7590
19256a91868j07486I069K48138b91986J12185k26598J43863A25569c8774a7610
19245b35967Q1016A4182b51602E5142L6348d35287F5021a63635j43723P6110P0086
19234a61162k05395J03831a490B01226a37105A20856b96656J27634L7252C0659
19223A57586a00846A42555a27409B41794c12679J07554B1960b1881A54754d06633
19212c59264R8588G0130K5326j9964d2005k45643B8643b2320O62q772j27354B53980
19199a35684A08053b39123d5848k54343g6714l20503a33009C22473A5425f3089
$$ plain form
19188 436037 -8480 -120763 -186064 331578 -59408 47679 -430429 34498 223894 139435 263536
19177 263536 104117 -108584 -398814 -7075 79385 89098 63630 -41373 -3285 -78147 -59767
19166 -59767 -130647 -346645 -53078 -198141 46629 -144990 -493929 -55835 -60467 -213582 91590
19154 -301675 -123359 95507 -291680 144618 264572 93415 202999 -189273 -92706 -182607
19144 -182607 -116265 -223197 -143130 -73146 -134339 -106317 -197675 -292712 95770 -128638 -208114
19133 -208114 79600 8986 382869 -202554 -257848 279832 -142773 -152033 -72161 -30614 -269721
19122 -269721 -129001 -29935 -27814 260424 -212430 -353953 111740 -20412 -44115 244007
19111 152412 -31210 96886 -247288 -74049 268494 -481628 198925 189435 -69855 -110457 7746
$$ packed form
19188D36037h480j12283o5301C31578e9408D7679d30429C4498J89396q4459J24101
19177B63536A04117a08584k90230g075G9385R713k5468d1373c285p4862J8380
19166e9767p0880k15998e3078j45063D6629a44990l48939e5835m632j53115I1590
19154c01675a23359I5507b91680A44618J19954I3415J09584a89273i2706q9901
19144a82607O6342j06932Q0067O9984o1193K8022r1358r5037I5770a28638p9476
19133b08114G9600H986L73883b02554n5294B79832a42773r260g2161c0614k39107
19122b69721a29001b9935K121B60424b12430j41523A11740b0412k3703B44007
19111A52412c1210I6886b47288g4049B68494d81628A98925r490f9855m0602G746
$$ plain form
19099 -98091 98892 -218273 -95435 146329 -289720 -30807 354621 -217999 38692 -163827
19088 -634025 -98396 -168487 -122329 -44479 -467706 -167297 -149682 167887 -171133 -426861
19078 -426861 -368420 -424466 -29854 -84725 -96450 -54052 159612 -62175 105009 -164591 -103252
19067 -103252 57317 -128692 -148139 -142068 189135 -111893 60511 300668 -261746 442242
19056 -129405 154945 91085 -40113 -144372 -28734 44872 -222926 -292160 -27762 207833 -142287
19044 171690 -66775 119979 -249419 -273089 -207195 -426644 81633 92284 -184470 252581
19033 -52616 266845 -50894 -41801 61087 165663 330035 168747 -365121 -76344 37950 131831
19022 131831 120987 -514380 288477 47575 -123553 282843 98380 140305 190780 51799 290399
$$ packed form
19099i8091I8892b18273i5435A46329b89720c0807C54621b17999C8692a63827
19088f34025i8396p0091M6158d4479m23227a67297J7615A67887a71133k55728
19078d26861N8441n6046b9854n4871j1725M2398A59612f2175A05009a64591O1339
19067a03252E7317a28692j9447O071A89135a11893F0511K40157b61746D42242
19056a29405A54945o3860d0113j04259b8734D4872b22926o9234b7762B07833a42287
19044A71690f6775A19979b49419k3670O5894k19449H1633J0651a84470B52581
19033e2616B66845e0894R093F1087J04576J64372j61288c65121g6344C7950R3881
19022A31831j0844e14380B88477D7575a23553B82843I8380M1925N0475E1799K38600
$$ plain form
19011 290399 -375176 -330020 -350174 -244823 -21493 86274 116673 -35751 -121606 -79274 -25970
18999 -213457 -84645 162582 -278014 -319950 -319160 94128 153499 -201900 -48226 -142938 -73296
18988 -73296 135845 40009 -371920 -60745 -13555 351793 132741 195120 -534471 117254
18977 170439 42212 123399 -46703 -140671 1945 13883 -242830 -90821 391091 -501664 -41695
18965 -45599 -156259 -289577 -176634 1177 -62 -215253 37521 -60248 215655 -3366 -2013 34688
18952 184773 -36258 -197277 121199 90985 -111923 425013 195922 92994 211875 -153729
18941 246397 -43568 359247 233015 46692 -125077 259953 -78723 156740 -243680 -138787
18931 -138787 -86730 23798 -259877 57960 -245078 216172 -96544 -182964 73968 40490 -466570
$$ packed form
19011B90399c75176M5156k0154J05351b1493H6274L0399c5751q5855M2332b5970
18999b13457h4645A62582b78014m1936P90I4128N9371b01900d8226r4712O9642
18988g3296A35845D0009c71920f0745a3555C51793A32741O2379e34471A17254
18977A70439D2212Q1187d6703r3968A945J1938b42830i0821C91091e01664d1695
18965d5599j10660j33318J12943A177f2k15191C7521f0248B15655c366J353C4688
18952A84773c6258j61019A21199l0214a11923D25013A95922I2994J18881a53729
18941B46397d3568C59247j26232D6692a25077B59953g8723A56740b43680J04893
18931a38787N2057B3798b59877E7960b45078B16172i6544q6420G3968l3478d66570
$$ plain form
18919 -318105 -236070 217008 -104403 42611 -190188 -53182 226974 118725 -258814 335157
18908 -51291 -388895 -171364 -59133 79198 -164590 -136664 308355 137849 -228347 -239366
18898 -239366 -120293 105940 132053 -213275 -118228 135037 -67486 -129775 58887 -234793
18887 78492 120647 85526 -94651 47608 180606 -136108 353850 42348 -299547 -108241 -162725
18876 -162725 -111597 -119201 -5649 52876 -194338 -55444 82210 3081 -491367 -170125 -14976
18864 150214 -91536 -44458 25374 -117915 209161 108689 -337366 -203597 -52053 97316
18853 -115849 -15417 179069 64416 41794 263546 -176284 -74161 126347 -43157 -226255
18843 -226255 -515616 -98581 -67418 -280206 -161856 -219363 57976 -318929 -2738 -131207 -57121
$$ packed form
18919c18105Q2035B17008a04403D2611a90188e3182B26974j08249b58814C35157
18908e1291l37604a71364e9133G9198a64590K7926C08355A37849b28347j1019
18898b39366J19073A05940K6113b13275R5047A35037f7486o2289E8887b34793
18887G8492M2155l5121i4651D7608J32998a36108C53850D2348b99547a08241n4484
18876a62725N1128p604e649E2876a94338e5444H2210C081d91367a70125a4976
18864A50214i1536d4458B5374a17915B09161j00472c37366J33769e2053I7316
18853a15849a5417A79069F4416k2622K21752a76284g4161A26347d3157j83098
18843b26255k89361i8581L1163k12788J18350n7507E7976c18929b738j28469e7121
$$ plain form
18831 33211 -77382 -73310 30761 -241318 -28753 -134924 93887 -76938 -101465 -42097 -174477
18820 -174477 31593 -82220 -269060 -30109 -9533 -169236 87860 96519 -132961 69001 -22025
18808 -76252 346066 205700 -162146 -145111 -43783 79227 6296 -82821 300735 266139 94535
18796 190418 -53757 194766 67729 261027 39963 -125828 -89253 38809 -219260 164936
18785 -90210 -205323 -272691 -355246 -332368 -37684 -88742 32252 -35651 -111173 32050 -161354
18773 332544 -87800 -302834 -177849 -166746 -315279 -25767 21140 -389885 -82986 209729
18762 -524 181470 -196289 -138548 115352 58395 -324835 -154759 -70945 200934 -373988 127717
18750 -6795 124455 -66685 -176685 216217 204345 -189736 236301 -41155 -112639 -343147 12804
$$ packed form
18831C3211g7382M072C0761b41318b8753j06171I3887g6938k4527d2097j32380
18820a74477C1593h2220j86840c0109i533j59703H7860Q659a32961F9001b2025
18808g6252C46066j40366a62146J7035d3783G9227F296h2821C00735l4596I4535
18796A90418e3757A94766F7729J93298C9963a25828L6575C8809b19260A64936
18785i0210j15113o7368q2555K2878c7684n1058C2252c5651p5522C2050a61354
18773C32544h7800k15034J24985J1103j48533b5767B1140c89885h2986B09729
18762e24A81470a96289N7741A15352n6957c24835a54759g0945B00934c73988A27717
18750f795A24455f6685j10000B16217j1872a89736B36301d1155p1484k30508A2804
$$ plain form
18738 -115811 -219305 -189294 -43037 277175 -329606 -210173 -340645 -147239 102378 125344
18728 125344 1389 411558 25208 289751 -84914 40552 -62638 -59803 -187609 -76539 124044
18716 -196823 -58029 -49392 39729 71062 276530 -152246 -120570 -389469 165616 45331 -65211
18704 84974 -48015 144257 -179506 -224463 -188169 250718 -464924 100075 89557 -18294 -87131
18693 -87131 -9314 -261698 105054 -214650 100209 -242190 -405326 253090 78795 -319998
18682 108738 6699 -47011 -693497 -251505 -17743 13310 -40620 -349326 -124281 -264631 -52608
18670 -174506 241499 -365298 175501 -14710 -40478 9712 20177 312414 -127940 331492
18659 33270 -135285 56301 155138 308339 94091 -321359 -292855 270839 -133557 -498977
$$ packed form
18738a15811j03494L0011d3037B77175c29606J19433j30472a47239A02378K2966
18728A25344A389M10169B5208K64543h4914D0552f2638K835j27806g6539A24044
18716a96823e8029Q637C9729L1333K05468a52246L1676k68899A65616D5331f5211
18704H4974d8015A44257a79506m4957L6294B50718d64924A00075j0518a8294o8837
18693h7131i314k52384A05054b14650A00209b42190j63136B53090G8795c19998
18682A08738F699d7011o46486b51505a7743A3310d0620l08706a24281j40350e2608
18670a74506B41499c65298A75501a4710k5768I712J0465K92237a27940C31492
18659C3270a35285E6301R8837J53201I4091c21359K8504B70839a33557l65420
$$ plain form
18649 -498977 -183351 -208952 -232295 72678 51500 222339 233518 -30990 264414 134935 94237
18638 94237 95045 -347984 -201377 -70543 164031 -118892 -440851 -315559 190040 92258 -211888
18626 -48833 43012 -342477 -144725 -12946 6021 53933 53293 -176852 -247632 -81161 81369 -294234
18613 200266 -26871 -67884 -290797 31648 -114153 84638 170833 -154658 -55424 -249032 140341
18601 -71566 -307276 -130888 87071 -103151 -21331 -85139 -330985 -207144 -30959 288425
18590 -127061 219001 -36541 -11230 -68476 57969 321077 -17760 -663836 57012 -277890 -20821
18578 61765 -63555 82634 68496 -67405 -177125 -120021 -52201 -287403 -361512 -322110 6032
18566 -78503 -10374 -66898 -10731 -125073 5949 8144 -64939 -186802 275214 -48706 176690
$$ packed form
18649d98977a83351k5601k3343G2678k1178J70839J1179c0990B64414j29479m0698
18638I4237Q08c47984J46607g0543A64031a18892l21959J25292A90040I2258b11888
18626d8833D3012c42477a44725a2946F021M7912o40a76852p0780h1161H1369b94234
18613B00266b6871m1013k22913C1648a14153H4638Q6195a54658e5424j93608A40341
18601g1566k35710a30888H7071a03151b1331o3808k45846J23841c0959B88425
18590a27061B19001c6541a1230n7246E7969K63108a7760o46076E7012b77890b0821
18578F1765f3555H2634j4138f7405j09720N7104e2201k35202p4109L9402F032
18566g8503a0374n6524a0731j14342E949K195f4939j21863B75214d8706A76690
$$ plain form
18554 -376569 -100689 -122403 -76100 -76287 -261428 166453 103700 -130377 -112311 136247 197352
18543 197352 176451 98566 7650 133121 -309673 213058 -156909 -215545 -114064 -231999
18533 -231999 -183878 -180804 -224069 56706 87764 -299041 170121 114081 -229600 81186 -89930
18521 95533 118927 -38642 -97161 -360221 49802 43942 -295342 -77565 32356 90300 327996
18510 327996 156135 -23188 -99781 -96125 122146 -82116 -134643 10384 -332398 -122170 58256
18498 34469 -24990 -121651 118477 97256 -51557 -81170 -64508 -218349 -109809 -191986 -470086
18487 -470086 -311378 298586 -1992 -514889 84235 -292635 -259916 -426844 -306304 -30830
18476 -228285 -238671 -106331 -52103 139329 54211 136676 14385 155306 -55395 54154 -166739
$$ packed form
18554c76569a00689k1714M6303j87j85141A66453o2753a30377J8066A36247O1105
18543A97352k0901p7885G650J25471c09673B13058a56909n8636J01481j17935
18533b31999M8121L074m3265E6706L1058b99041A70121n6040b29600H1186h9930
18521I5533K3394c8642n8519k63060D9802n860b95342g7565C2356N7944K37696
18510C27996A56135b3188p6593L656A22146h2116n2527A0384c32398a22170E8256
18498C4469b4990r6661A18477k1221e1557k9613J6662j53841J08540q2177k78100
18487d70086J58708B98586a992n12897H4235b92635L2719j66928J20540c0830
18476b28285j0386a06331e2103A39329E4211Q2465A4385J40921e5395E4154a66739
$$ plain form
18464 127750 137869 -243992 47504 98002 -195580 168590 -64053 372018 -288165 272176
18453 -89210 -254666 19641 -430052 177408 -126301 154955 32492 198166 43976 159342
18443 159342 -77437 -336466 -5161 170616 114726 15095 -198573 8534 -114058 -17812 130492
18431 -285022 -88832 -16300 39473 134941 213394 76918 -234537 -142060 267852 107097 -72320
18419 -205391 171858 -124535 -248622 87196 220272 -85267 -48454 -176677 -54369 106411
18408 -118176 149189 32021 -262898 -12405 199218 -105969 70865 204762 275991 -40093
18397 182718 1524 -62952 -15704 -974 148136 -96004 -248863 54540 -5949 -1476 223760 -244279
18384 75373 -218255 79853 -132918 209384 -181169 -2526 2617 -353517 47008 -140898 -58072
$$ packed form
18464A27750J0119b43992D7504N0498a95580A68590f4053C72018b88165B72176
18453h9210j65456A9641d30052A77408a26301A54955C2492J65674D3976J15366
18443A59342g7437k59029e161A70616n5890A5095a98573H534a14058a7812A30492
18431b85022h8832a6300C9473R5468P8453G6918b34537R2477B67852A07097g2320
18419b05391A71858a24535j24087H7196J33076h5267L6813j28223e4369A06411
18408a18176A49189C2021b62898a2405A99218a05969G0865J33897P1229d0093
18397A82718A524f2952a5704i74A48136i6004j52859E4540e949a476B23760b44279
18384G5373b18255G9853a32918B09384a81169b526B617c53517D7008a40898e8072
$$ plain form
18372 345535 17631 -23333 -238151 257310 -73664 -195847 38768 -152518 100148 168490
18362 168490 -186359 -401534 54432 -276835 104865 128593 -167866 85199 -334770 37564
18351 -69470 -205031 -260131 11528 197442 -17761 122117 252709 -6854 -157862 -16332 -93394
18340 -93394 219474 8287 -150485 -365104 -378798 99361 159068 -174130 50535 -309573 -193856
18329 -193856 -170735 221723 221423 -452446 95841 -81071 -24441 -226390 86810 29496 -225524
18317 -125116 -19307 65139 51658 -177574 -240341 29568 67925 -72398 44715 76330 -45679
18305 -211107 -11937 98266 -127617 375892 -445700 133093 -105893 -171161 -302177 -14125
18294 82608 59620 -319856 40000 368232 -8342 -147094 -302130 -18801 -198429 -267716 327515
$$ packed form
18372C45535A7631b3333k14818B57310g3664j22183C8768a52518A00148O8342
18362A68490a86359k15175E4432b76835A04865K3728a67866H5199c34770C7564
18351f9470j35561n5100A1528J85914a7761A22117J30592f854j51008a6332p7062
18340i3394B19474H287a50485k14619j3694I9361N9707a74130E0535c09573J15717
18329a93856K3121B21723l00d52446I5841h1071b4441k01949H6810B9496b25524
18317a25116a9307F5139j3481a77574o2767B9568L8357g2398D4715L1615d5679
18305b11107a1937I8266a27617C75892d45700A33093a05893o5268j31016a4125
18294H2608k2988c19856D0000L28232h342j38752j55036a8801j79628o9287C27515
$$ plain form
18282 -285137 -424418 -72482 -120310 -89127 -268083 -152654 -90834 -272647 54235 5854 353328
18271 353328 -267069 -153486 11366 -300892 -29275 -149413 22459 -264316 71167 -92069
18260 224802 -180766 -123486 3551 -63381 -577358 221160 -113642 -258281 -206169 116461
18249 96567 3276 4032 -68755 -175887 -122072 -266194 77468 -115493 -94643 286986 -87541
18237 163602 -29831 330799 -252073 -46889 -360420 112448 260106 246787 -68495 234180
18226 243393 27600 70520 105400 195037 -3448 -61120 -236179 9860 -17751 49684 -73796 -143836
18214 -143836 -52321 -89243 126721 106996 207441 -32566 -116477 101333 58617 295186 76124
18202 -325673 -14372 -134115 16343 18778 -298732 303179 -160857 -32622 -1028 118682 10066
$$ packed form
18282b85137j39281g2482m7828L1183j78956J15429O1820j81813E4235E854L47474
18271C53328b67069J13583A1366c00892b9275j20138B2459b64316G1167i2069
18260B24802a80766N7280C551f3381n13977B21160a13642j44639N2112A16461
18249I6567C276P56f8755j07132N3815j44122G7468a15493K0850B86986h7541
18237A63602b9831C30799b52073d6889l13531A12448J47658j3319f8495B34180
18226B43393B7600M2920L4880Q9637c448n7672j75059I860a7751D9684g3796p0040
18214a43836e2321l6922A26721j9725J00445c2566q3911A01333m2716K36569G6124
18202c25673a4372j19743A6343K435b98732C03179a60857c2622a028A18682A0066
$$ plain form
18190 -81534 -103700 -154605 -1806 107962 -334498 81275 -277564 54261 -101076 203387 28500
18178 -280101 76084 132127 31545 -14445 -161938 -283463 19864 -208754 -217957 146682 34582
18166 56161 -141862 -195639 223760 -122419 -179174 83861 -18762 -90711 213638 123781 -152126
18154 -113841 123720 -186680 197257 218628 -312823 -38167 73343 -392648 -132145 -592332
18144 -592332 -16209 61122 -64538 275652 -61062 12479 -49959 -56136 -147792 -112333 -224623
18133 -224623 -21862 -144018 164788 51609 -148953 -22885 -99045 -65785 100866 151683 -134994
18121 51191 69338 157347 1614 183805 148846 -68235 226183 -30925 261172 -30192 -155477
18110 -155477 -357633 -17950 112602 55938 -258979 282310 -143462 93329 -3824 -346256
$$ packed form
18190h1534k2166n0905a806A07962c34498H1275b77564E4261a01076B03387B8500
18178b80101G6084N6043C1545a4445j47493j21525A9864b08754r203A46682C4582
18166E6161a41862n3777B23760a22419n6755H3861a8762p1949B13638q9857a52126
18154a13841A23720a86680A97257K1371c12823c8167G3343c92648a32145m60187
18144e92332a6209F1122f4538B75652f1062A2479d9959o177r1656L5459j12290
18133b24623b1862j22156A64788E1609a48953b2885p6160L3260A00866N0817a34994
18121E1191J8147Q8009A614J82191l4959f8235B26183c0925B61172c0192j25285
18110a55477k02156a7950A12602E5938b58979B82310a43462I3329c824l42432
$$ plain form
18100 -346256 11296 21667 91119 -446781 118751 6093 -47718 -56246 63804 -78587 81366
18088 -204856 98877 -472574 69916 -401485 -177309 -258319 41422 -212169 76529 86341 74438
18077 74438 -222197 -38378 143693 161138 -265730 10931 -204314 -133260 -261163 -153908
18067 -153908 -160496 -51262 -42635 41883 -127378 113366 -490556 -99568 -121864 -92635 -51812
18056 -51812 -42678 -37690 1475 -136070 80744 26148 -26880 236413 42660 -12518 -349519 250770
18043 134970 30294 -143049 -74706 -57826 113164 121254 -3845 -39661 189540 166986 164373
18032 164373 91916 -152042 93293 -92440 -234725 41103 44759 -249216 -105992 -143301 -8053
18020 27495 -22982 -30996 -83135 -91076 -109759 -233380 -92937 -291462 117012 -91360 -12279
$$ packed form
18100c46256A1296J0371O9452d46781A18751F093d7718q528F3804g8587H1366
18088b04856I8877d72574F9916d01485a77309q1010D1422b12169G6529R812j1903
18077G4438b22197c8378A43693J7445b65730A0931b04314P1054j27903J07255
18067a53908o588e1262Q627D1883a27378A13366d90556i9568k2296K9229M0823
18056e1812R134M988A475a36070H0744B6148b6880B36413D2660a2518l37001B50770
18043A34970C0294a43049O8343J6880A13164Q090c845l5816A89540k2554k613
18032A64373p2457a52042I3293i2440j42285D1103L656b49216a05992l7309h053
18020B7495b2982q014n2139p941j8683j23621i2937j98525A17012i1360a2279
$$ plain form
18008 -94235 -258401 180187 -6149 -195925 -113521 -333912 -49822 -282916 -177850 -237595 205389
17996 -197365 -148996 81402 241137 40071 -132245 77780 -75013 22668 -84202 -314399 15063
17984 -246158 172510 125000 -304511 -58989 181107 -69108 203336 -43829 454967 219054
17973 -163268 -322847 27401 198664 -116720 -45851 7407 78383 82486 80958 47352 15815
17961 129894 -7641 130684 -21235 41537 -49676 -14268 -164944 -241133 107590 95670 -2093
17949 105518 -4768 -15609 -319307 132762 -136738 -327863 185165 225212 163461 113596 194688
17938 194688 15127 261761 -131749 -181158 20095 158436 -29111 226072 117298 -118827
17927 -64284 -311081 -297016 121763 -146850 -558164 30824 31422 260347 -77133 -186205 -76962
$$ packed form
18008i4235j64166A80187f149j89776Q2404k20391d9822k33094J05066n9745B05389
17996a97365M8369H1402J59735D0071a32245G7780g5013B2668h4202k30197A5063
17984b46158A72510m7510c04511e8989A81107f9108B03336d3829D54967B19054
17973a63268j59579B7401J71263a16720d5851G407P0976M103j528l3606A5815
17961A29894g641A30684b1235D1537d9676a4268j50676p6189A07590j1920b093
17949A05518d768j0841l03698A32762a36738j91125A85165M0047o1751m9865Q1092
17938A94688A5127K46634a31749m9409B0095J38341b9111B26072j08774a18827
17927f4284k46797J4065A21763a46850m11314C0824N98K28925g7133j09072g6962
$$ plain form
17915 309689 41888 -179150 66690 351562 99510 -310412 116812 46854 227622 -74975
17904 122906 213582 -319570 265243 -201311 -217091 -108337 205115 -134050 154660 92390
17894 92390 -172561 -202989 42761 -94692 478373 37411 206522 -282845 -174451 -38613 247746
17882 -184909 127040 -288480 16484 -71419 -59350 -71251 -93145 -40632 218900 -187795 138370
17870 88609 -92027 -1230 -50058 89804 -18960 -4407 -106502 -134901 55225 -85547 1922 -122073
17857 218637 -26930 230305 258916 68160 -114810 43498 -204087 64455 -255237 -133974
17847 -133974 -76785 105762 208405 -203232 30985 -521705 -70197 258568 -95656 -199512
17837 -199512 -108411 -101940 184361 -44018 65708 168505 -38600 332005 -111779 53566 55446
$$ packed form
17915C09689D1888a79150F6690K84872I9510c10412A16812D6854J80768g4975
17904A22906R0676c19570B65243b01311j5780a08337B05115a34050A54660o2270
17894I2390a72561l0428D2761i4692D78373C7411J69111b82845J08394c8613B47746
17882a84909A27040b88480A6484g1419J2069j1901k1894d0632B18900a87795A38370
17870H8609i2027a230m8828H9804a8960d407j02095k8399E5225h5547A922a22073
17857B18637b6930B30305K8611F8160a14810D3498b04087F4455b55237J21263
17847a33974N7189A05762J02643b03232C0985e21705g0197B58568i5656j03856
17837a99512R1101O471A84361d4018F5708J02797c8600C32005a11779E3566J880
$$ plain form
17826 55446 -317310 -91230 155983 -189638 -14191 -102391 77455 -84540 173490 7959 -171190
17814 44377 133390 -266150 -241052 157025 145112 -147656 -123094 33348 21082 18153 -157513
17802 -82223 323864 162206 68886 316343 -53033 217070 199957 10821 -134557 -112017 23564
17790 176805 -120229 169882 -13089 109082 -46670 -200762 6224 -217969 231147 -28317
17779 -200217 -106 -242583 -178422 -126520 292574 125298 175501 226389 -280251 -175316 -279393
17768 -279393 -75018 -126340 40067 159703 -183840 204354 3550 125839 360757 -150487
17757 287591 227367 -47074 -66691 -545 13783 -92501 275027 144094 -161580 200070 -135328
17745 -51361 -148336 -33541 -128349 -21446 -64414 -330470 72063 56240 97416 79987 191016
$$ packed form
17826E5446c17310i1230A55983a89638a4191q8200G7455h4540A73490G959a71190
17814D4377Q9013b66150K5098A57025j1913a47656K4562C3348j2266k929a57513
17802h2223C23864j61658F8886K47457e3033B17070j7113A0821a34557K2540B3564
17790A76805a20229A69882a3089A09082d6670j54092F224b17969B31147b8317
17779b00217a06k42477O4161N1902B92574A25298N0203N0888b80251J04935j04077
17768b79393g5018n1322D0067J19636a83840B04354C550J22289K34918a50487
17757B87591o0224d7074j9617e45A3783i2501B75027j30933a61580B00070a35328
17745e1361r6975c3541r4808b1446m2968k66056G2063j5823M1176j7429J11029
$$ plain form
17734 191016 -172869 -163723 -87468 -63992 96109 76651 140095 -83867 215749 385634 -104059
17722 49760 347507 227223 -234836 -3013 -291668 195199 310104 156714 -68643 97182
17711 135914 174993 39238 -209334 -179950 63756 -56778 -776 46127 53723 276352 -155442
17699 -106587 195366 105234 302749 140715 95159 -255810 -152932 323297 -11083 -165739
17689 -165739 159170 -133368 -206638 -72814 118013 231526 95862 -89260 -239961 -199786
17679 -199786 41873 184695 -117434 248625 -88024 -55630 -437719 -57155 145365 255019
17669 255019 -113276 -85637 113964 -214619 -360309 -77312 180568 -156106 84167 -132428
17658 -70826 -74346 213889 13791 200242 -71892 -87457 23961 21663 215970 -62230 -91257
$$ packed form
17734A91016a72869R146P6255K3476I6109j9458O3444h3867B15749J69885a04059
17722D9760K97747j20284b34836c013k88655A95199J14905j53390f8643I7182
17711A35914L9079C9238b09334K9384F3756e6778g76D6127P596K22629a55442
17699a06587A95366r0132J97515A40715m5556b55810J02878C23297a1083j54656
17689a65739A59170a33368p3270g2814A18013J13513I5862h9260j50701M0175
17679a99786D1873J42822a17434B48625h8024L2394l82089e7155A45365J09654
17669B55019a13276K7639A13964b14619j45690g7312A80568a56106H4167a32428
17658g0826l520B13889A3791J86451g1892j5565B3961k298J94307f2230k9027
$$ plain form
17647 -91257 -159935 -312501 -326234 103269 148650 -171454 87118 12200 125767 121413 208643
17636 208643 31801 114975 -304658 -29370 -35234 -18690 -207209 324322 139601 161205 177832
17625 177832 -69257 35051 115658 120203 -326025 -155119 89317 -346002 353793 -120290 -19059
17613 144429 99562 -65870 -201552 145042 -56493 -15994 57796 183534 -113665 150765
17602 43745 41925 147346 -278551 17404 122820 244755 161726 39797 51315 268781 -137547
17590 140523 -52945 213387 25495 -106068 53145 -322929 65611 137761 201124 -114958 66414
17578 190102 162377 -105824 -242890 181783 -30144 32881 -388629 -215158 432468 75941
17567 371420 46346 -59434 -160249 55784 306146 -222274 142907 353549 -164221 -21921
$$ packed form
17647i1257o8678j52566j3733A03269M5381a71454H7118A2200J13567m354Q7230
17636B08643C1801Q3174c04658b9370n864J6544j88519C24322A39601K1604J6627
17625A77832f9257C5051Q0607M545c26025a55119H9317c46002C53793a20290a9059
17613A44429m4867f5870j35682A45042e6493a5994E7796J25738a13665A50765
17602D3745j820J05421b78551A7404J05416J21935q3029C9797J1518K17466a37547
17590A40523e2945B13387B5495a06068E3145c22929F5611P2150O3363a14958F6414
17578A90102k7725a05824j37066A81783c0144C2881c88629J73471D32468G5941
17567C71420D6346e9434j00815E5784K50362b22274A42907K10642a64221b1921
$$ plain form
17556 210772 -60500 96834 -313082 -85237 -60059 21960 -26799 228319 -95626 327465 113265
17544 48003 438950 194618 113427 393551 66411 166378 58104 -171281 199781 -2719 -99574
17533 -99574 92228 139424 -274162 92812 227327 -145876 57829 266380 227030 279917 175948
17522 175948 -84045 -24845 -144733 252459 358850 21579 42431 -81312 -24228 112914 -237398
17510 -80618 -25519 3714 75044 -27154 374082 -239182 250692 413058 6898 -272600 303058
17498 262684 344219 40907 -88338 166260 -58060 225960 292267 37572 88524 98863 89356
17487 89356 -33365 42638 -286573 113310 152465 194354 -193070 -42821 58984 55231 -111522
17475 -96312 93708 182525 133804 75269 205132 64765 274139 59683 -35781 34386 266526
$$ packed form
17556B10772f0500I6834c13082h5237K5178B1960b6799B28319i5626C27465A13265
17544D8003L90947A94618q1191K80124F6411R9967E8104a71281A99781b719r6855
17533i9574I2228M7196b74162I2812J34515a45876E7829K08551l9350N2887j03969
17522A75948h4045b4845j19888B52459J06391B1579K0852h1312b4228A12914b37398
17510h0618b5519C714P1330b7154C74082b39182B50692J62366F898b72600C03058
17498B62684Q1535D0907h8338A66260e8060B25960O6307C7572N0952J0339r507
17487H9356c3365D2638b86573A13310L9155M1889a93070d2821E8984l753a11522
17475i6312I3708Q8817m8721n8535J29863F4765K09374E9683c5781C4386K32140
$$ plain form
17464 266526 169678 -144986 70436 -385719 404538 -135586 77246 410992 75673 170897
17454 170897 -12934 121998 11505 291689 496146 404175 5770 368222 251628 157729 38244
17442 393381 390225 366447 -50612 41395 566690 280099 49476 100062 30287 3194 163857
17431 163857 316314 194687 -126576 164931 41662 1957 -54815 125139 -23625 276133
17420 40872 215906 407660 127950 135713 190446 564758 518324 -7119 106461 165924 147224
17409 147224 87655 -86448 -16630 67614 192496 282648 269615 148229 -99295 186074 -44458
17397 5203 473952 -140186 195001 110609 -80764 -17219 52392 90953 317559 197081 172266
17386 172266 130798 62808 -130879 -4772 75966 -7584 247137 -178120 -70966 124194 7494
$$ packed form
17464B66526r6848a44986G0436c85719D04538a35586G7246L33746G5673R5224
17454A70897a2934A21998A1505K80184K04457r1971E770L62452j16594r3899C8244
17442C93381l156k3778e0612D1395N25295B80099D9476N0586C0287C194J60663
17431A63857J52457j21627a26576A64931D1662A957e4815A25139b3625B76133
17420D0872J75034J91754A27950P763N4733L74312m6434g119A06461N9463j8700
17409A47224n9569h6448a6630F7614J24882R0152j3033j21386i9295A86074d4458
17397E203M68749a40186A95001q4392h0764a7219E2392L8561K26606j20478k4815
17386A72266m1468F2808a30879d772G5966g584B47137a78120g0966A24194G494
$$ plain form
17374 152013 -7088 99603 71990 2726 273660 -18736 568614 60443 380102 62445 107623
17363 107623 97419 -34647 -152052 133407 -148140 183575 44939 176758 484591 -317725
17352 -82109 277360 -205734 310630 5871 79642 399939 405936 61858 40772 421246 140354
17340 220025 91943 154215 194014 -250571 141590 125294 211895 -1830 55552 -237982 427734
17328 -135929 95266 -123712 -136371 42919 119754 -136882 87156 253813 110299 170113 114615
17317 114615 264284 -169175 61344 267441 -328836 -54906 192391 391530 468532 -127660
17306 -89390 367134 320574 181615 76398 200781 368321 106170 321588 148797 105817
17296 105817 345149 66302 -117581 270828 148127 30595 172862 -3541 407997 117752
$$ packed form
17374A52013g088I9603k7613B726K70934a8736E68614F0443L19659F2445M5178
17363A07623j0204c4647j17405A33407a48140A83575D4939J31819L07833c17725
17352h2109B77360b05734C10630E871P3771L20297N997F1858k1086L80474A40354
17340B20025I1943O2272L9799b50571A41590j6296Q6601a830E5552b37982D27734
17328a35929I5266a23712j2659D2919P6835a36882H7156J66657A10299N9814n5498
17317A14615J49669a69175F1344K06097c28836e4906A92391J99139P7002a27660
17306h9390C67134m6560j38959G6398J24383J67540A06170K15418A48797m2980
17296A05817K39332F6302a17581B70828j22701C0595J42267c541D07997A17752
$$ plain form
17285 299803 334111 157757 -59363 318745 14138 163626 175301 240151 249487 369078 199637
17274 199637 144044 163716 110721 54494 87519 164637 474198 42241 109802 172372 198139
17263 198139 13894 -184853 97525 -1143 346030 120952 308305 254309 214166 331895 396618
17252 396618 103051 204958 -95301 107875 94695 -201245 148934 13030 7779 62605 183515
17241 183515 174271 125565 366088 9751 22014 -59433 184478 89615 474901 378148 -59586
17229 82470 138250 88317 187189 551020 524952 -112147 62974 -8412 24466 10422 106948
17218 106948 328207 64771 350968 210490 169677 -13343 164818 140115 292048 80261
17207 275910 -34029 -119481 189537 186289 -111243 21539 -120202 582473 160939 261324
$$ packed form
17285B99803L4308A57757e9363C18745A4138J49488J1675O4850R336J19591j69441
17274A99637n5593J9672n2995E4494L3025P7118L09561D2241O7561O2570K5767
17263A98139A3894a84853I7525a143C46030A20952J87353n3996m0143J17729O4723
17252C96618A03051J01907i5301A07875j3180b01245A48934A3030n251N4826J20910
17241A83515r244m8706K40523I751J2263e9433A84478H9615L85286r6753e9586
17229H2470N5780m9933R8872L63831k6068a12147F2974h412B4466A0422R6526
17218A06948K21259F4771K86197j40478m0813a3343A64818k4703J51933H0261
17207B75910c4029q5452A89537l248a11243B1539a20202E82473A60939J00385
$$ plain form
17197 261324 67409 58540 141327 49512 78545 198497 -61348 68128 167879 105249 30865
17185 220240 61537 -13521 128181 -76202 111207 361643 380133 250116 82583 184048
17175 184048 240922 376037 -194000 -85798 524221 256496 15511 337531 160862 259079
17165 259079 -23378 302020 311485 20631 89915 642281 119465 160383 137067 144999 346074
17154 346074 427766 229516 162329 78095 600814 -104543 111661 545133 136380 260837
17144 260837 205752 183475 148870 198050 132466 392902 319815 275590 92074 73654 326803
17133 326803 477458 83157 200977 205256 341585 437464 72948 309846 273609 424791 399327
17122 399327 361518 88934 -89547 43325 379272 255312 336069 296934 354091 166724 135764
$$ packed form
17197B61324F7409q869Q2787D9512K9033J19952f1348F8128R9751o2630C0865
17185B20240F1537a3521A28181g6202A11207K50436J8490j30017H2583J01465
17175A84048N6874J35115a94000h5798E24221B56496A5511L22020A60862R8217
17165B59079b3378C02020R465B0631O9284N52366A19465M0918k3316P932K01075
17154C46074Q1692j98250o7187G8095N22719a04543A11661M33472A36380J24457
17144B60837n5085k2277l4605M9180o5584K60436p3087m4225I2074j8420K53149
17133C26803J50655H3157J17820M279J36329R5879G2948K36898l6237J51182k5464
17122C99327l7809H8934h9547D3325L35947j23960Q0757l9135N7157A66724l0960
$$ plain form
17111 135764 222977 261664 166587 -144335 212997 142442 4702 158412 73966 278154 321306
17100 321306 295375 324699 250727 139464 -95844 283467 371831 207641 484805 48496 321298
17089 321298 232076 454685 120081 154672 59275 603695 445103 45331 343988 741819
17079 741819 341216 382852 122109 168669 244343 327790 196355 228460 356657 381999 484110
17068 484110 342325 671037 214451 88441 395456 416559 377644 467636 186237 299410
17058 299410 369139 702725 184937 573531 158929 338732 568637 109054 292721 627296
17048 627296 85112 453617 305493 115897 468244 270669 590222 519274 691920 635569
17038 635569 420451 295442 87678 508264 208547 673630 300750 735026 582393 573230
$$ packed form
17111A35764Q7213L8687r5077a44335B12997p0555D702J53710G3966K04188M3152
17100C21306k5931K9324p3972j11263i5844B83467Q8364j64190K77164D8496K72802
17089C21298q9222K22609A20081L4591E9275N44420j58592D5331K98657L97831
17079G41819C41216M1636A22109M6560P5674Q3447j31435L2105J28197K5342J02111
17068D84110j41785L28712B14451H8441L07015K1103l8915Q9992A86237J13173
17058B99410O9729L33586A84937L88594A58929J79803K29905A09054J83667L34575
17048F27296H5112L68505j48124A15897L52347j97575L19553p0948J72646n6351
17038F35569k15118j25009H7678M20586B08547M65083C00750M34276j52633r163
$$ plain form
17028 573230 585096 675800 882914 594473 722783 490588 402062 351701 462774 302398
17018 302398 -5093 642048 817277 422504 1133294 641913 616745 420627 249743 628600
17008 628600 359814 718034 620700 723381 743839 751595 562438 503931 449796 621482 729252
16997 729252 357356 650785 588378 462097 828188 725575 576857 450603 413588 397953
16987 397953 615245 423435 580685 620068 640220 602691 724556 847207 628960 678472
16977 678472 230077 834295 553988 887542 731978 712762 333181 709091 890006 749747
16967 749747 760813 1093367 951027 593731 597609 545148 876464 721751 558939 575984
16957 575984 793391 735440 560057 905836 688327 482430 1007884 808435 811507 714988
$$ packed form
17028E73230J1866R0704K07114k88441J28310k32195q8526n0361J11073j60376
17018C02398e093F42048J75229l94773P10790m91381k5168j96118j70884L78857
17008F28600k68786L58220r7334J02681K0458P756j89157n8507n4135J71686J07770
16997G29252C57356K93429o2407j26281L66091j02613j48718j26254l7015j5635
16987C97953K17292j91810J57250L9383K0152l7529J21865J22651k18247M9512
16977F78472B30077O04218k80307L33554j55564j9216C33181L75910J80915j40259
16967G49747J1066L32554j42340l57296L878n2461L31316j54713j62812J7045
16957E75984K17407n7951j75383L45779k17509k05897N25454j99449L072r6519
$$ plain form
16947 714988 979852 756144 590258 699492 861317 1081774 840633 1102102 946169 1022250
16937 1022250 1086680 962122 1027495 1080292 926100 768487 1077418 841816 1058060 1112970
16927 1112970 1283689 1127732 1021486 1263702 1306564 1306234 1065879 893495 1169741 1354981
16917 1354981 1390641 1294098 1027940 1023718 1176112 810936 1104654 1212657 1037780 1212908
16907 1212908 1121565 1404306 1296752 1422157 1432723 1441502 1448514 1125841 1236379 1380383
16897 1380383 1553175 1244129 1464786 1498029 1553094 1276485 1364204 1431550 1685592 1561933
16887 1561933 1658698 1443318 1572882 1288552 1513914 1650681 1688936 1836484 1424929 1680333
16877 1680333 1800197 1754451 1752651 1913251 1949086 2170972 1982558 1803316 2319766 1975908
$$ packed form
16947G14988K64864k23708j65886J09234J61825K20457k41141K61469j55933P6081
16937A022250O4430j24558O5373N2797j54192j57613L08931k35602K16244N4910
16927A112970J70719j55957j06246K42216M2862l30k40355j72384K76246J85240
16917A354981L5660r6543k66158m222J52394l65176K93718J08003j74877J75128
16907A212908r1343K82741j07554J25405J0566Q779P012l22673J10538J44004
16897A380383J72792l09046K20657L3243N5065k76609Q7719O7346K54042j23659
16887A561933R6765k15380J29564k84330K25362J36767L8255J47548m11555K55404
16877A680333J19864m5746j800J60600L5835K21886j88414j79242N16450l43858
$$ plain form
16867 1975908 1955648 2240148 2151966 1800583 2007182 2238687 2481531 2177550 2082102 2195063
16857 2195063 2284983 2444743 2486449 2404619 2742087 2574126 2289848 2688862 2595180 2364411
16847 2364411 2628494 2665379 2857540 2721122 2910091 3122369 2754939 2753329 3059576 3069560
16837 3069560 3134584 3290754 3247560 3048210 3191133 2999638 3177811 3371738 3633485 3335408
16827 3335408 3526214 3782261 3921779 4044472 4075269 4372217 4227179 4507910 4277400 4228752
16817 4228752 4296547 4480394 4636792 4754431 5181482 5030949 4951103 5453848 5104139 4912410
16807 4912410 5422343 5802819 5385261 6018362 6072107 6646503 5903866 6241335 6619389 6837999
16797 6837999 6680354 7208320 7462523 7530096 7480666 7947659 8644874 8127912 8427187 8493258
$$ packed form
16867A975908k0260K84500q8182l51383K06599K31505K42844l03981r5448J12961
16857B195063Q9920J59760M1706q1830L37468j67961k84278L99014r3682k30769
16847B364411K64083L6885J92161j36418J88969K12278l67430j610L06247R984
16837C069560O5024J56170m3194j99350J42923j91495J78173J93927K61747k98077
16827C335408J90806K56047J39518J22693L0797K96948j45038K80731k30510m8648
16817D228752O7795J83847J56398J17639M27051j50533p9846N02745l49709j91729
16807D912410N09933L80476m17558O33101N3745N74396p42637L37469L78054K18610
16797F837999j57645N27966K54203O7573m9430M66993O97215n16962K99275O6071
$$ plain form
16787 8493258 9280114 9350959 9594314 9525690 9874023 10415016 10666190 10902485 10931863 11820678
16777 11820678 12060138 12117492 12954105 13352200 13585287 14348438 14828005 15110130 15739637
16768 15739637 15986678 16754616 17445001 17885669 18974194 19500562 20368171 21296915 22211295
16759 22211295 22993916 24202161 25306803 26238721 27356307 28578171 30057756 31402436
16751 31402436 33099895 34784977 36621914 38391039 40617660 42624759 45063887 47761955
16743 47761955 50540037 53396775 56934873 60137878 64320609 67858685 72465126 77454573
16735 77454573 82203134 87855371 94063989 100277767 107598174 115059698 122550763 130690183
16727 130690183 139225268 148199772 157265939 165695637 174706043 182369057 189566781 195915169
$$ packed form
16787H493258P86856P0845K43355o8624L48333N40993K51174K36295K9378Q88815
16777A1820678K39460N7354Q36613L98095K33087P63151M79567K82125O29507
16768A5739637K47041P67938O90385M40668J088525N26368Q67609R28744R14380
16759B2211295P82621J208245J104642R31918J117586J221864J479585J344680
16751C1402436J697459J685082J836937J769125K226621K007099K439128K698068
16743D7761955K778082K856738L538098L203005M182731L538076M606441M989447
16735G7454573M748561N652237O208618O213778P320407P461524P491065Q139420
16727A30690183Q535085Q974504R066167Q429698R010406P663014P197724O348388
$$ plain form
16719 195915169 201107582 204509255 206343866 206662310 205255965 201977669 197441905 191672118
16711 191672118 184281871 176580031 168317611 159048906 149866851 141058089 132194267 123753883
16703 123753883 115688446 108187482 101392829 94550075 87962354 82318033 76916195 71849049
16695 71849049 67392881 62976714 59449312 55840199 52454557 49144860 46601191 43812030
16687 43812030 41470795 39041139 36938355 35117183 33410107 31769809 30327897 28520944
16679 28520944 27165304 26157595 24951022 23638956 22759798 21947868 21216573 20323469 19615737
16670 19615737 18466232 17969239 17202899 16471604 15961376 15227159 14627245 14165362 14130957
16661 14130957 13610928 12719816 12184487 12137232 11423389 11404838 11066396 10455773 9930321 9944116
$$ packed form
16719A95915169N192413L401673J834611L18444j406345l278296m535764n769787
16711A91672118p390247p701840q262420r268705r182055q808762q863822q440384
16703A23753883q065437p500964o794653o842754o587721n644321n401838n067146
16695G1849049m456168m416167l527402l609113l385642l309697k543669k789161
16687D3812030k341235k429656k102784j821172j707076j640298j441912j806953
16679B8520944j355640j007709j206573j312066q79158q11930p31295q93104p07732
16670A9615737j149505m96993p66340p31295n10228p34217n99914m61883l4405
16661A4130957n20029q91112n35329m7255p13843j8551l38442o10623n25452J3795
$$ plain form
16651 9944116 9691338 9432908 8910834 8712345 8797218 8110897 7913217 8200032 8006293 7399998
16641 7399998 7270261 6907942 7074723 6261700 6436367 6564557 6532179 6025854 6051269 5709202
16631 5709202 5717999 5764787 5609151 5277595 4997314 4903278 4664722 4829573 4666433 4734873
16621 4734873 4352942 4362069 4096454 4155951 4211594 3795171 4268825 4012932 3892813 3734415
16611 3734415 3697513 3674715 3621434 3478057 3341920 3506037 3301479 3363800 3102935 3265463
16601 3265463 2918963 3021284 2626636 3040240 2782854 3049942 2829131 2606059 3019565
16592 3019565 2644040 2698191 2355863 2605651 2608185 2584579 2571793 2473333 2272679 2348597 2351384
16581 2351384 2289691 2007598 2190949 2210949 1982271 1945512 2117588 2401971 2016639 2103646
$$ packed form
16651I944116k52778k58430n22074j98489Q4873o86321j97680K86815j93739o06295
16641G399998j29737l62319J66781q13023J74667J28190l2378n06325K5415l42067
16631E709202Q797M6788j55636l31556k80281r4036k38556J64851j63140O8440
16621D734873l81931R127k65615N9497N5643m16423M73654k55893j20119j58398
16611C734415l6902k2798n3281j43377j36137J64117k04558O2321k60865J62528
16601C265463l46500J02321l94648M13604k57386K67088k20811k23072M13506
16592C019565l75525N4151l42328K49788K534k3606j2786r8460k00654P5918K787
16581B351384o1693k82093J83351K0000k28678l6759J72076K84383l85332Q7007
$$ plain form
16571 2103646 1880644 1788036 1904254 2082274 1677262 1503677 1904918 1657409 1849011 1460964
16561 1460964 1409731 2056311 1428315 1617500 1548564 1576075 1495544 1559006 1491513 1355263
16551 1355263 1447362 1529231 1395363 1672413 1769530 1477636 1363227 1584574 1159860 1005008
16541 1005008 1127409 1318082 1731710 1265082 1167866 1509288 902851 1322520 1347116 1506770
16531 1506770 1144624 1147703 917637 1231294 1323984 1054058 956225 1013031 1406114 800922
16521 800922 787205 922931 996960 1180932 1054469 1047011 639623 1054218 932932 851735
16511 851735 1014203 825168 687506 918717 790381 904109 1081727 805010 769681 996937
16501 996937 1132273 888053 574164 679918 794262 1040777 637620 873877 1238205 867295
$$ packed form
16571B103646k23002r2608J16218J78020m05012j73585M01241k47509J91602l88047
16561A460964n1233O46580o27996J89185o8936K7511q0531O3462o7493j36250
16551A355263R2099Q1869j33868K77050R7117k91894j14409K21347m24714j54852
16541A005008J22401J90673M13628m66628r7216L41422o06437M19669K4596J59654
16531A506770l62146L079k30066L13657R2690k69926r7833N6806L93083o05192
16521H00922j3717J35726P4029J83972j26463p458m07388M14595j21286q1197
16511H51735J62468j89035j37662K31211j28336J13728J77618k76717l5329K27256
16501I96937J35336k44220l13889J05754J14344K46515m03157K36257L64328l70910
$$ plain form
16491 867295 464603 451081 952169 878441 1101922 456601 541484 743391 938401 496504
16481 496504 567244 814222 571830 1059851 227354 984377 715168 692236 638114 346059
16471 346059 834498 733555 803675 817352 579989 542440 422103 715978 701869 709978 610083
16460 610083 639683 657990 161998 147963 414728 716844 469203 919395 388785 588263
16450 588263 781175 790875 95384 618295 715147 629069 701405 469591 325695 648925 566127
16439 566127 431643 469957 524705 441794 486274 587149 422270 594158 397277 387727 375800
16428 375800 437801 -50036 560872 366921 665800 460104 528128 242476 189485 520926
16418 520926 156926 641457 450474 665730 799852 591679 735034 597756 484641 353262
$$ packed form
16491H67295m02692j3522N01088p3728K23481D56601Q4883K01907J95010m41897
16481D96504P0740K46978k42392M88021B27354P57023k69209k2932n4122k92055
16471C46059M88439j00943P0120J3677k37363l7549j20337K93875j4109Q109r9895
16460F10083K9600J8307A61998j4035K66765L02116k47641M50192C88785J99478
16450E88263J92912R700I5384N22911R6852q6078P2336k31814j43896L23230q2798
16439E66127j34484L8314N4748q2911M4480J00875j64879J71888j96881r550j1927
16428C75800O2001e0036E60872j93951K98879k05696O8024B42476n2991L31441
16418E20926A56926M84531j90983K15256J34122k08173J43355j37278j13115j31379
$$ plain form
16408 353262 481400 70753 375250 590593 639182 641951 501738 56039 362890 271208 628317
16397 628317 534260 629820 554141 590673 430222 269641 364282 668865 477096 647333
16387 647333 432863 285083 538976 465507 584337 821731 -267830 145302 428829 206746
16376 219578 155639 490104 525245 527111 154431 465937 571439 65483 177060 574272
16366 574272 91152 48290 391886 307172 471045 69562 557937 312079 55437 254341
16356 254341 330746 2590 111365 293950 -70368 495872 219646 162486 147631 198075 224470
16345 224470 150029 713373 297101 535973 -8295 475865 236945 324853 430366 394200
16335 394200 194428 -26604 327790 319269 147612 113807 202080 133997 155006 279453 185844
$$ packed form
16408C53262J28138G0753L04497K15343M8589K769j40213E6039L06851r1682L57109
16397F28317r4057R5560p5679L6532j60451j60581R4641L04583j91769J70237
16387F47333k14470j47780K53893p3469J18830K37394b67830A45302K83527B06746
16376B19578o3939L34465L5141J866A54431L11506J05502F5483J11577L97212
16366E74272I1152m2862L43596q4714J63873F9562M88375k45858E5437J98904
16356B54341P6405B590J08775J82585g0368D95872B19646n7160j4855N0444K6395
16345B24470p4441N63344B97101K38872h295D75865B36945Q7908J05513l6166
16335C94200A94428b6604C27790q521A47612l3805Q8273o8083K1009J24447r3609
$$ plain form
16324 185844 129616 738531 53624 593321 391625 89755 265603 238812 178166 156841 118540
16313 118540 278146 108302 380660 105264 90320 202134 304939 307409 -16185 125969
16302 171078 737654 267932 82743 84457 -1030 122516 177842 413716 671100 496857 488831
16291 488831 412077 -96517 -13608 -51289 102962 243127 279342 240297 224903 307482 142445
16279 -52888 81859 2449 105503 223320 309842 241792 264781 293930 267406 367133 112951
16267 217310 20076 246682 331705 27265 126545 249930 196616 95165 13750 296159 147632
16255 114381 178674 88361 424556 169175 100915 176521 124031 413648 234363 -64467 548864
16243 49329 392304 108638 71936 15365 -77216 121033 372778 251682 225766 292694 198530
$$ packed form
16324A85844n6228O08915E3624N39697k01696H9755J75848k6791o0646k1325l8301
16313A18540J59606A08302K72358A05264j4944J11814J02805K470a6185A25969
16302A71078N66576B67932H2743J714a030A22516N5326K35874K57384j74243q026
16291D88831p6754i6517a3608l7681A02962J40165L6215l9045j5394Q2579A42445
16279e2888H1859B449J03054J17817Q6522o8050K2989K9149k6524R9727A12951
16267B17310B0076K26606Q5023B7265R9280J23385n3314I5165A3750K82409A47632
16255A14381O4293H8361L36195A69175o8260P5606n2490K89617j79285f4467E48864
16243D9329L42975A08638l6702A5365g7216A21033K51745j21096k5916O6928r4164
$$ plain form
16232 198530 76217 -34371 266683 78088 163931 44042 192976 90974 207348 268690 -140510
16220 365170 558747 344883 305217 -93569 21972 386167 258525 335825 168492 -108584
16209 -70170 210342 46384 -86092 277034 75954 130169 149338 327925 60207 122224 556467
16198 556467 61430 179676 356510 -189161 230957 -298889 136846 143639 231589 -20771
16187 191882 68773 274316 -175930 51822 365020 58994 216867 -286 -137914 347889 -203843
16175 181478 -17059 203588 74440 132455 1380 23195 142009 -89045 -32408 194241 482406
16164 482406 50025 45656 102110 193405 69157 -5640 160748 206392 161786 271259 224297
16153 224297 199796 172251 109306 82730 155443 228291 -42004 202737 -33979 134709 142788
$$ packed form
16232A98530G6217c4371B66683G8088Q5843D4042J48934I0974J16374O1342a40510
16220C65170J93577k13864l9666i3569B1972L64195j27642P7300j67333a08584
16209g0170B10342D6384h6092B77034G5954N4215J9169J78587F0207O2017M34243
16198E56467F1430J18246J76834a89161B30957b98889A36846O793Q7950b0771
16187A91882F8773K05543a75930E1822L13198E8994J57873b86j37628C47889b03843
16175A81478a7059B03588G4440N8015A380K1815J18814h9045c2408A94241K88165
16164D82406E0025m369N6454R1295F9157e640A60748M5644m4606J09473m6962
16153B24297k4501k7545o2945k6576P2713P2848d2004B02737c3979A34709Q079
$$ plain form
16142 142788 237134 584363 199588 -105364 -18110 22750 29171 26495 -392250 -70817 -156422
16131 -156422 -21731 113068 266415 138038 194037 -104156 158461 307130 270986 393113
16121 393113 -106872 49240 -69346 193387 114528 -122253 426467 14262 -262601 178002
16110 48057 -276236 97756 104801 102750 -83440 48450 17290 239072 371748 215326 383654
16099 383654 -139303 -10134 -67117 -4286 312890 -13622 135245 222889 -132607 361070 -282020
16087 -102863 -6827 40553 47819 130039 54577 195585 154805 144690 113673 -165081 73949
16075 97660 -237172 16382 -137038 -129614 -134863 -100814 32423 -86566 -143809 -11409 -124676
16064 -124676 -45170 101785 -48840 201063 -181704 -52589 -195560 192507 330921 -56976
$$ packed form
16142A42788R4346L47229A99588a05364a8110B2750O421k676c92250g0817q5605
16131a56422b1731A13068J53347j28377N5999a04156A58461J48669l6144J22127
16121C93113a06872D9240f9346A93387p8859a22253D26467A4262b62601A78002
16110D8057b76236I7756P045k051h3440D8450A7290K21782J32676j56422J68328
16099C83654a39303a0134n6983d286C12890a3622A35245Q7644a32607C61070b82020
16087a02863f827D0553P266Q2220E4577J41008m0780j0115l1017a65081G3949
16075I7660b37172A6382a37038P424n249L4049C2423h6566n7243a1409j13267
16064a24676d5170A01785d8840B01063a81704e2589j42971A92507J38414e6976
$$ plain form
16053 -96686 81471 -42679 -89942 106512 284068 -199216 -92169 26752 122831 -34178 118177
16041 -307030 -158706 114183 114844 11694 -185079 -16028 23638 -174992 68917 -50304 528655
16029 2130 -18336 -313166 -45019 -87337 -175686 -256377 -219406 -48807 191424 -59084 -109222
16018 -109222 -114746 217391 28330 12192 137976 -24376 -552000 -306867 146156 -40884 -244051
16007 -244051 -148570 -27900 -17329 -97248 147212 275170 -162533 86873 -154856 -230172 -277129
15996 -277129 86674 67671 3468 -237428 411292 -418175 16510 -218523 19082 -145180 42782
15984 -162119 68335 -157280 -135311 23203 81252 252716 129906 -31670 -70189 57480 -122414
15972 -365110 -139933 -313705 -258726 -116767 -382342 -33504 -128762 50447 15044 15380 110703
$$ packed form
16053i6686H1471d2679m7263A06512J77556a99216i2169B6752R6079c4178A18177
16041c07030J48324A14183O61A1694a85079a6028B3638a74992F8917e0304E28655
16029B130a8336k94830d5019m2318q8349q0691L6971d8807A91424e9084n0138
16018a09222n524B17391B8330A2192J25784b4376n27624K45133A46156d0884k03167
16007b44051R5481b7900J0571p9919A47212J27958a62533H6873a54856p5316m6957
15996b77129H6674j9003C468b37428D11292d18175A6510b18523A9082a45180D2782
15984a62119F8335a57280K1969B3203N8049J71464j22810c1670l8519E7480a22414
15972c65110a39933j73772N4979a16767k65575c3504r5258E0447A5044L36R5323
$$ plain form
15961 110703 -38620 62847 37794 16256 -119237 -59505 -124341 20416 31739 316695 89986
15949 -58737 191644 -46655 -211033 72201 2402 53948 86071 383331 81767 -7078 -73311
15938 -73311 59851 -308548 5554 32601 -7312 -20470 -49645 -172738 -364964 -267129 129747
15926 -56948 88317 -34337 6306 64698 -153567 -107160 -195219 -147963 -58789 -33480 -247719
15915 -247719 153530 -163621 -323934 65055 -352266 -192401 16060 -161878 20438 64402
15905 64402 -262543 -113227 -83232 54820 51444 -137946 205927 44404 -177429 80091 -22185
15893 280342 85 -26422 -157815 103277 101638 -193562 -44097 144432 249531 -38771 178144
15881 -493 74914 85952 453101 316867 -247759 -10456 -70031 -144894 -122369 129117 186326
$$ packed form
15961A10703c8620F2847k5053A6256a19237e9505o4836B0416J1323K84956H9986
15949e8737A91644d6655j64378G2201B402N1546L2123K97260H1767g078o6233
15938g3311E9851c08548E554K7047g312j3158k9175j23093j92226R7835A29747
15926e6948H8317c4337F306N8392a53567M6407q8059M7256e8789K5309k14239
15915b47719A53530a63621j60313F5055c52266J59865A6060a61878B0438M3964
15905F4402b62543a13227K9995E4820l376a37946B05927D4404a77429H0091b2185
15893B80342H5b6422j31393A03277j639a93562d4097A44432J05099c8771A78144
15881d93G4914J1038L67149j36234b47759a0456n9575p4863K2525A29117N7209
$$ plain form
15870 186326 192364 11634 110636 7968 -181149 -58146 -164450 221462 -171503 -265181 -251544
15859 -251544 -65687 94942 104508 89197 120291 -315063 -288230 -43366 -100891 -82961 -16831
15847 231001 -220959 67636 -262748 -219234 -101890 -515068 -111819 192500 -236120 189780
15836 46102 38282 16698 32844 -62986 -108969 -189777 -71613 82935 26794 -113190 -210224 210463
15823 1954 191789 -307855 7222 -64746 -153501 -223517 -14459 -39630 155297 -216165 -2191
15811 -342336 61629 -152477 465398 -233520 240620 41102 450862 83547 -327670 -144058
15800 76490 -135256 494158 99728 -142107 -82014 -108108 92859 75561 -214624 -5954 415573
15788 82381 -162188 -372876 -81270 -68667 103559 -8190 -176282 -386546 137098 10555 147566
$$ packed form
15870A86326O038A1634R9002G968a81149e8146j06304B21462a71503r3678J3637
15859b51544f5687I4942R566j5311L1094c15063K6833d3366n7525J7930a6831
15847B31001b20959F7636b62748M3514a01890m13178a11819A92500b36120A89780
15836D6102p820A6698J6146f2986m5983q0808g1613H2935B6794a13190r7034B10463
15823A954J89835c07855G222f4746q8755p0016a4459k5171A55297b16165b191
15811c42336F1629a52477D65398b33520B40620D1102M09760H3547c27670a44058
15800G6490a35256D94158I9728a42107O0093k6094I2859j7298b14624e954D15573
15788H2381a62188k10688h1270J2603A03559h190j68092k10264A37098A0555J37011
$$ plain form
15777 147566 284629 -100140 -35177 224645 -109425 -110418 202858 -277918 -286085 -169411 -280522
15766 -280522 -221099 -224300 -61164 153883 -104140 -146275 -88161 -50376 -333403 -259266 49302
15754 -211100 -103096 -88643 386207 -241064 93066 214772 -13543 -134580 158862 -574987
15743 -17791 -71277 138556 -206762 -358928 -24585 189478 -408533 -349212 -6716 -169590 -434040
15732 -434040 142840 357897 -151733 -16371 160227 -74559 106678 182514 145335 208071
15722 208071 -334917 216905 -315841 -149506 -50656 -240886 -44012 -334457 -335469 -217660
15712 -217660 34991 35042 169926 16540 -20645 -69672 -104885 -161647 -252356 -75010 51880 -215865
15699 -206783 178170 10867 60721 -210748 89957 -383689 266157 -199879 220271 -499293
$$ packed form
15777A47566J37063a00140c5177B24645a09425r93B02858b77918q167J16674j11111
15766b80522N9423l201f1164A53883a04140m2135N8114L7785k83027P4137D9302
15754b11100a03096J4453C86207b41064I3066J21706a3543j21037A58862e74987
15743a7791n3486A38556b06762j52166b4585A89478d08533N9321f716j62874k64450
15732d34040A42840K15057a51733a6371A60227g4559A06678P5836l7179O2736
15722B08071c34917B16905c15841a49506e0656j90230d4012k90445j012J17809
15712b17660C4991N1J34884A6540b0645m9027l5213n6762r0709g5010E1880b15865
15699b06783A78170A0867M9854b10748H9957c83689B66157a99879B20271d99293
$$ plain form
15688 200802 280020 199112 -214289 -16117 -236201 -244069 -88857 -18677 32334 -70871 54931
15676 -34462 -20726 281263 -104635 343977 132392 -260079 -318591 140205 1107 314798
15666 314798 191526 213825 -133261 33981 -108457 -443297 19709 83644 8206 2354 53025
15655 53025 27673 -33709 -29754 -49019 211812 -277266 -327985 -140282 -120803 43139 -116206
15643 -197322 -100676 -138618 -46438 -119985 92053 20606 56996 -90110 158028 -32446 3010
15631 3163 33155 177936 279706 26517 343171 238052 3341 238346 -122905 139140 -142213
15619 179726 129636 -96813 81236 -79598 -341772 -3415 -232233 -570531 -64473 -349644 -89542
15607 239401 -258200 93063 -144261 -172124 -94400 -349663 -121953 -240985 -135690 68631
$$ packed form
15688B00802P9218q0908b14289a6117k20084p868h8857a8677C2334g0871E4931
15676c4462J3736B81263a04635C43977A32392b60079n8512A40205A107L13691
15666C14798j23272K2299a33261C3981a08457l34840A9709O3935H206B354N0671
15655E3025k5352c3709L955j9265B11812b77266n0719a40282J9479D3139a16206
15643a97322R6646l7942d6438p3547I2053B0606L6390i0110A58028c2446C010
15631C163K9992J44781J01770B6517L16654j05119C341K35005a22905A39140a42213
15619A79726n0090i6813H1236g9598k62174c415k28818l38298f4473k85171h9542
15607B39401b58200I3063a44261k7863P7724k55263a21953j19032J05295F8631
$$ plain form
15596 -54523 -172934 290727 -428358 322007 -281777 -254284 -143241 71153 91200 -124110
15585 -118033 7324 75660 267334 -54508 -11538 100338 -57223 -220495 168296 -150377 -221980
15574 -221980 -74680 146681 -78280 221850 -66374 -144317 214416 -375981 186003 -13492
15563 -263847 -134197 -159468 -186189 320741 3265 -116179 -95434 676879 -38461 59835 -339613
15551 -348989 -15308 122968 -204990 -182418 -137063 -203704 -272544 -184739 -93616 16151 -130846
15539 -125156 244993 146270 150300 -116620 -358386 -127610 56433 112577 -201297 -188000 -3140
15527 333587 -93364 9815 -226617 429184 -122944 22793 66861 7523 -341361 61920 188978
15516 188978 -17387 -391566 -20526 -137641 -254303 268294 61135 -168406 -60738 -125047
$$ packed form
15596e4523j18411B90727d28358C22007b81777K7493J11043G1153K0047a24110
15585a18033G324O8336J91674e4508a1538A00338e7223j63272A68296a50377p1603
15574b21980g4680A46681g8280B21850f6374p7943B14416c75981A86003a3492
15563b63847J29650k5271k6721C20741C265a16179K0745F76879c8461E9835c39613
15551c48989a5308A22968b04990K2572M5355o6641o8840Q7805R1123A6151a30846
15539a25156B44993r8723M030a16620k41766a27610E6433N6144b01297J3297c140
15527C33587i3364I815b26617D29184a22944B2793M4068G523c41361F1920J27058
15516A88978a7387l74179b0526j17115j16662B68294F1135a68406f0738o4309
$$ plain form
15506 -125047 -233828 62298 -160617 -145642 181244 -136814 -64389 33117 10351 -208853
15495 -143147 -77443 -29455 -74591 -70017 -123676 60603 -21699 -300707 -70462 -138556 -65402
15483 75542 -167223 -25098 329355 -146712 -73245 153450 173041 25641 -158659 -12911 -117714
15472 -117714 -4797 42650 -213575 167521 253195 33168 -143755 -12048 55387 26311 184986
15461 184986 -31736 158478 -91254 -43209 -167235 110459 92912 145435 179666 -108337 -208985
15450 -208985 22026 -200394 -273834 -136547 89334 184584 107006 -160180 -130007 16738 280793
15439 280793 37505 -28649 82156 -136751 -3690 241787 -67735 -200080 -15167 -324110 388962
15427 -172762 -285841 -49563 -45107 -70675 -211502 -330292 358365 56562 -311815 84762 93149
$$ packed form
15506a25047j08781F2298a60617J4975A81244a36814f4389C3117A0351b08853
15495a43147O5704b9455m5136M574n3659F0603b1699k79008g0462o8094f5402
15483G5542a67223b5098C29355a46712g3245A53450J9591B5641a58659a2911j04803
15472a17714d797D2650b13575A67521Q5674C3168a43755a2048E5387B6311J58675
15461A84986c1736A58478i1254d3209j24026A10459j7547N2523L4231a08337j00648
15450b08985B2026b00394p3440a36547H9334R5250p7578a60180L0173A6738K64055
15439B80793C7505b8649H2156a36751c690B41787f7735j32345a5167l08943C88962
15427a72762j13079d9563M456k5568j40827j18790C58365E6562c11815H4762Q387
$$ plain form
15416 93149 163162 107454 -137867 -213098 -232009 -105890 -128223 261688 -168109 425372 -289233
15404 16082 -53806 37069 110960 -127436 165023 -21490 -73416 -238045 59098 231454 60242
15392 229641 -153239 312033 64521 164823 78425 -173300 55853 51557 -40898 421608 10588
15380 -103934 4765 48494 211894 -11807 -25048 78429 -222488 -30779 -64884 -219988 66005
15368 79068 36692 38804 -170474 -475371 238414 171704 15352 29184 17747 177476 219875
15357 219875 -7895 234109 -162363 17827 109004 -11090 129674 -14717 16727 35172 -186710
15345 59687 -35871 158023 -149636 -119416 -128285 -41745 -21100 110091 -160412 4799 11703
15334 11703 -97160 -4062 -19267 125814 12722 -50201 -20354 -90818 202013 29245 310109
$$ packed form
15416I3149P0013n5708a37867p5231j8911a05890k2333B61688a68109D25372b89233
15404A6082e3806C7069P3891a27436A65023b1490n1926j64629E9098J72356F0242
15392B29641a53239C12033F4521J00302G8425a73300E5853m296d0898D21608A0588
15380a03934D765M3729J63400a1807j3241G8429b22488c0779l4105j55104F6005
15368G9068C6692K112a70474l04897B38414o6710A5352J3832j1437J59729M2399
15357B19875g895B34109a62363A7827R1177a1090A29674a4717A6727J8445a86710
15345E9687c5871A58023a49636L0220q869d1745K0645A10091a60412D799O904
15334A1703i7160d062j5205A25814A2722e0201b0354p0464B02013B9245K80864
$$ plain form
15323 310109 164861 -198821 -99390 -338796 -152525 117324 46831 38948 37181 197526 -425036
15311 -250292 -154577 19879 228140 -143592 37707 -222853 -235520 -29860 -129431 -117268 3636
15299 63178 167681 -24663 62644 236380 -37746 60535 115525 -121346 188453 -35031 148588
15287 -72743 77561 -29463 308170 -66155 -294339 188804 -31329 103921 -549 36010 -2867
15275 -33050 73130 -183504 391608 64194 359505 -85146 -90446 -182593 -275805 259226 -123882
15263 -64595 -216918 -121303 219867 5343 151221 -46777 -56863 -170641 422811 -176666 181726
15251 -50978 346688 360359 395019 1730533 1213130 1193644 1713191 510373 441618 332357
15241 332357 195036 -240507 229922 -46005 -192111 71688 348728 125851 273348 -38066
$$ packed form
15323C10109j45248a98821i9390k39406a52525A17324D6831p883j767J60345d25036
15311b50292R5715A9879K08261a43592C7707b22853j2667b9860r9571J2163C636
15299F3178J04503b4663F2644J73736c7746F0535N4990a21346A88453c5031A48588
15287g2743G7561b9463C08170f6155k28184A88804c1329A03921e49C6010b867
15275c3050G3130a83504C91608F4194K95311h5146n300r2147r3212B59226a23882
15263f4595j52323R5615B19867E343J45878d6777j0086j13778D22811a76666A81726
15251e0978C46688J3671L4660J335514n17403j9486N19547E10373o8755j09261
15241C32357j37321b40507B29922d6005j46106G1688K77040A25851J47497c8066
$$ plain form
15230 90746 485558 354947 55060 -291729 -68732 -418246 -63076 -57628 86737 35826 55764
15219 55764 218530 45782 -218337 310957 177844 3753 102274 218879 273212 -95968 152931
15207 194700 -170522 99338 324535 327825 153096 -345629 -258346 -125066 66549 241572
15197 241572 -97796 -250833 -32416 206718 29804 -208484 -68270 -16635 110423 -290170
15186 8088 208493 130060 140241 -79423 -179315 211569 -45645 83857 125327 -48065 -129800
15175 -129800 345471 29873 80940 -201309 29533 -121325 -141490 91248 36962 133435 -202463
15163 -115666 51193 383832 -196044 91417 -153621 116300 250894 40607 94603 12650
15152 252730 -128683 -55062 179846 20287 72335 111476 -66948 -153817 34958 285043 -589
$$ packed form
15230I0746L94812j30611E5060b91729f8732l49514f3076N448H6737C5826J9938
15219E5764J62766D5782b18337C10957j33113C753R8521J16605N4333i5968A52931
15207A94700a70522I9338K25197L290A53096c45629Q7283a25066F6549J75023
15197B41572i7796j53037c2416B06718B9804b08484f8270a6635A10423b90170
15186H088K00405p8433J0181g9423r9892B11569d5645H3857M1470d8065q1735
15175a29800C45471B9873N1067b01309B9533a21325k0165I1248C6962R6473b02463
15163a15666E1193L32639a96044I1417a53621A16300J34594D0607N3996A2650
15152B52730a28683e5062A79846B0287N2048L9141f6948q6869C4958K50085e89
$$ plain form
15140 103449 311694 117011 -13169 -78530 538359 -52357 -119563 148182 209239 246931 195356
15129 195356 283698 354655 355410 123971 -2242 212562 -19988 -51463 45478 204460 56398
15117 307748 -42679 70047 51596 485924 193604 -129974 -94614 30289 122339 -117187 -7337
15105 101072 346195 -81754 128446 63717 -90674 -157855 112310 23191 33541 -12517 57554
15093 247805 118023 -71052 -24302 170555 -41139 90172 195715 71996 328220 -152606
15082 -138136 61914 236997 52391 441293 200210 460328 -436286 250334 -180139 193673
15071 28782 122747 13467 -82381 37641 357472 333923 -72908 269802 101548 372665 136516
15059 -1068 -232752 110130 -36617 239887 50226 -33230 184810 366928 148756 83469 111573
$$ packed form
15140A03449K08245A17011a3169o5361E38359e2357o7206A48182O1057L7692n1575
15129A95356Q8342P0957P55A23971b242B12562a9988l1475D5478J58982E6398
15117C07748d2679G0047j8451M34328A93604a29974L5360C0289R2050a17187g337
15105A01072K45123h1754A28446F3717i0674o7181A12310B3191J0350a2517E7554
15093B47805A18023g1052b4302A70555d1139I0172J05543G1996K56224a52606
15082a38136F1914J75083E2391L88902B00210K60118d36286B50334a80139A93673
15071B8782R3965A3467h2381C7641L19831k3549g2908B69802A01548K71117A36516
15059a068k31684A10130c6617B39887E0226c3230A84810J82118A48756o5287K8104
$$ plain form
15048 111573 279555 303774 113476 218990 331573 108697 160277 334669 -50479 47876
15037 179414 319497 261793 258238 59836 717493 5566 -26715 -123812 162844 340724 69283
15025 526563 17759 107898 -113984 -34610 -40024 49830 -182470 242642 230601 106496 193823
15014 193823 155326 487255 170993 8313 207687 -68371 265855 371758 177098 -23396
15003 142788 -238856 435202 95344 82388 52029 597226 323503 319505 366675 363495 84241
14991 -5112 -26351 1694 93566 221978 292755 409376 105802 -126654 -9652 231568 169500
14980 169500 422416 275515 -159427 514263 -34399 380946 482506 17690 65627 557793
14970 557793 164932 326403 36144 104187 265812 361469 -59358 397630 191361 320515
$$ packed form
15048A11573J67982K4219A13476J05514J12583A08697N1580J74392e0479D7876
15037A79414J40083n7704l555E9836O57657E566b6715r7097A62844J77880F9283
15025E26563A7759R0139a13984c4610n414D9830a82470B42642j2041A06496Q7327
15014A93823l8497L31929A70993H313J99374f8371B65855J05903A77098b3396
15003A42788b38856D35202I5344j2956l0359N45197k73723l998M7170l180H4241
14991e112k1239A694R1872J28412P0777J16621A05802a26654i652B31568o2068
14980A69500K52916j46901a59427E14263c4399C80946J01560A7690M7937M92166
14970E57793A64932J61471C6144O8043J61625R5657e9358C97630A91361J29154
$$ plain form
14960 320515 116284 385300 202606 344340 -43902 179988 349455 320385 185107 166250
14950 166250 130221 74911 96735 -78628 140986 350228 278102 400040 347246 117102 242159
14939 242159 188115 132150 251310 341648 85691 -278108 -176552 318455 119486 119413 235671
14928 235671 413604 197790 232466 -177838 171838 279953 235662 156098 36392 491421
14918 491421 248439 -180658 123960 192429 328312 227789 274415 -104217 98422 330440
14908 330440 479846 85313 342265 140425 240306 395345 388468 91522 4421 165394 230127
14897 230127 5466 -58626 246154 -7144 724691 260910 191499 507290 89265 23114 196367
14886 196367 495093 360365 232209 -7514 358776 460887 605906 438634 259841 476394
$$ packed form
14960C20515A16284K69016j82694J41734d3902A79988J69467k9070j35278j8857
14950A66250l6029n5310K1824g8628A40986K09242p2126J21938n2794A17102J25057
14939B42159n4044n5965J19160R0338H5691b78108J01556C18455A19486p3J16258
14928B35671J77933A97790L4676a77838A71838J08115m4291p9564C6392M55029
14918D91421k42982a80658A23960O8469J35883j00523M6626a04217I8422K32018
14908C30440J49406H5313K56952A40425R9881J55039o877I1522D421J60973O4733
14897B30127E466e8626B46154g144G24691B60910o9411L15791H9265B3114J73253
14886A96367K98726j34728j28156g514C58776J02111J45019j67272j78793K16553
$$ plain form
14876 476394 342931 284629 268935 81277 307592 357941 464561 199325 -126144 398643
14865 540285 226299 305779 -25356 323413 142222 472572 486897 748949 318322 295261
14855 295261 447359 579584 563066 456151 500119 621264 477118 284746 211993 190695
14845 190695 337145 259489 652582 401399 58168 412963 297275 224258 401057 586525
14835 586525 300783 374090 504161 120771 6441 457748 445493 322488 415159 420760 556879
14824 556879 536996 925128 295984 541209 420709 459588 631656 914647 315040 537355
14814 537355 460002 847550 334693 475493 181251 552337 862465 568923 438583 307546
14804 307546 218726 320468 520382 138315 365603 215386 329243 -3689 558629 268437
$$ packed form
14876D76394j33463n8302j5694H1277K26315N0349J06620A99325a26144C98643
14865E40285B26299P9480b5356C23413A42222L30350J4325K62052C18322k3061
14855B95261J52098J32225j6518j06915M3968J21145j44146j92372p2753k1298
14845A90695J46450p7656L93093k51183E8168L54795j15688p3017J76799J85468
14835E86525k85742P3307J30071A20771F441M51307j2255j23005R2671N601J36119
14824E56879j9883L88132B95984K45225j20500L8879J72068K82991C15040K22315
14814E37355p7353L87548C34693J40800A81251L71086L10128k93542j30340j31037
14804C07546q8820J01742J99914A38315K27288j50217J13857c689E58629B68437
$$ plain form
14793 77486 611993 535129 567279 452878 485677 336087 367027 593971 113334 678388
14783 678388 683848 726605 429328 695255 390674 466033 309311 548000 203419 569062
14773 569062 312408 720291 466853 702771 407795 364341 768550 537177 451331 276011
14763 276011 235177 399881 569412 371244 796727 407973 381671 626178 708874 582405
14753 582405 395765 465588 439128 787500 455952 438608 558627 414949 709446 337818
14742 380277 709171 673948 683756 470170 472058 929964 718720 729495 772077 879760 1131334
14731 1131334 843126 525601 339253 695795 515677 592173 561532 718050 232994 816195
14721 816195 722457 428827 462146 707677 547266 1003453 621643 660902 627673 638173
$$ packed form
14793G7486N34507p6864L2150j14401L2799j49590L0940K26944A13334N65054
14783F78388N460M2757k97277K65927l04581P5359j56722K38689B03419L65643
14773E69062k56654M07883k53438K35918k94976m3454M04209k31373q5846j75320
14763B76011m0834J64704J69531j98168M25483l88754k6302K44507Q2696j26469
14753E82405j86640O9823k6460L48372l31548j7344J20019j43678K94497C37818
14742C80277L28894l5223R808k13586J888M57906k11244J0775M2582J07683K51574
14731A131334k88208l17525j86348L56542j80118P6496l0641J56518B32994N83201
14721H16195r3738k93630L3319K45531j60411M56187l81810L9259l3229J0500
$$ plain form
14711 638173 653901 648354 801218 805597 860407 1106263 485025 717729 865765 862304 885812
14700 885812 807908 701277 1120501 772065 743926 868207 767744 701313 756840 843295
14690 843295 836177 825093 781635 646876 503290 747759 936832 544060 913111 575554
14680 575554 867388 457070 783487 392751 756511 625259 918446 903339 652260 846616
14670 846616 1005513 1015729 1016161 913640 879283 664392 755061 574312 732656 962182 907148
14659 907148 918632 922792 924158 782035 1000599 1234849 896143 974998 1119744 1125271 1058799
14648 1058799 1060746 1189922 1174723 992039 1278442 953578 832103 1510253 1302194 947235
14638 947235 1065906 1152397 1384978 862993 1010304 1201119 1145644 961522 1520848 870357
$$ packed form
14711F38173J5728n547J52864M379N4810K45856D85025K32704J48036l461K3508
14700H85812p7904j06631M19224l48436k8139J24281j00463o6431N5527Q6455
14690H43295p118j1084m3458j34759j43586K44469J89073l92772L69051l37557
14680E75554K91834m10318L26417l90736L63760j31252K93187j5107k51079J94356
14670H46616J58897J0216M32j02521l4357k14891R0669j80749J58344K29526n5034
14659I07148J1484M160J366j42123K18564K34250l38706P8855J44746N527o6472
14648A058799J947J29176j5199j82684K86403l24864j21475O78150k08059l54959
14638I47235J18671Q6491K32581n21985J47311J90815n5475j84122N59326o50491
$$ plain form
14628 870357 1314396 975047 1414383 1052630 1475156 1081633 1192682 1529653 1000182 1445716
14618 1445716 1378136 933429 980087 1302661 1521783 1632445 1315184 1215302 1485880 1073020
14608 1073020 1222160 1646732 1006309 1144491 1439776 1616682 1401590 1330220 1309693 1793473
14598 1793473 1135204 1625939 1280947 1345900 1623120 1564785 1534836 1150947 1404947 1455012
14588 1455012 1601888 1460403 1435294 1496639 1743166 1527605 2022140 1183427 1744254 1617019
14578 1617019 1849583 1714941 1869558 1996397 1887739 1984937 2058856 1952980 2273501 2001465
14568 2001465 2097305 1891617 2157795 2032618 1920132 2414303 2134457 2461089 2465460 2364383
14558 2364383 2549069 2429893 2948137 3034650 3506291 3729085 4278337 5315179 6236251
$$ packed form
14628H70357M44039l39349M39336l61753M22526l93523J11049L36971n29471M45534
14618A445716o7580m44707M6658L22574K19122J10662l17261r9882K70578m12860
14608A073020J49140M24572o40423J38182K95285J76906k15092p1370k0527M83780
14598A793473o58269M90735l44992O4953K77220n8335k9949l83889K54000N0065
14588A455012J46876j41485k5109O1345K46527k15561M94535q38713N60827j27235
14578A617019K32564j34642J54617J26839j08658R7198P3919j05876L20521k72036
14568B001465R5840k05688K66178j25177j12486M94171k79846L26632M371j01077
14558B364383J84686j19176N18244Q6513M71641K22794N49252J036842R21072
$$ plain form
14549 6236251 9871585 14542504 20646594 32356885 37703050 21417204 8948123 4542589
14541 4542589 2591422 2406850 2005487 2083373 2126193 1694790 1554018 1848066 1719396 1979629
14531 1979629 1969861 2051595 2301153 1890714 1830404 2041737 2404533 1948890 2038036 1652421
14521 1652421 2007012 2150124 2010842 1846380 2102166 2154804 2492776 2108961 2493299 2157464
14511 2157464 2477177 2317065 2243301 2207159 2624607 2300500 2564756 2659203 2428104 2672515
14501 2672515 2537577 2707368 2932587 2539770 2512715 2519953 2810012 3119665 2866850 2766849
14491 2766849 3062441 2987177 2981518 2975907 3317709 3369136 3189229 3061773 3242012 3351411
14481 3351411 3348085 3268548 3477044 3364636 3849011 3433261 3711744 3354723 3430119 3536120
$$ packed form
14549F236251L635334M670919O104090J1710291N346165j6285846H948123m405534
14541D542589j951167j84572m01363P7886M2820m31403j40772K94048j28670K60233
14531A979629r768Q1734K49558m10439o0310K11333L62796m55643Q9146l85615
14521A652421L54591J43112j39282j64462K55786N2638L37972l83815L84338l35835
14511B157464L19713j60112p3764l6142M17448l24107K64256R4447k31099K44411
14501B672515j34938J69791K25219l92817k7055P238K90059L09653k52815j00001
14491B766849K95592p5264n659n611L41802N1427j79907j27456J80239J09399
14481C351411l326p9537K08496j12408M84375m15750K78483l57021P5396J06001
$$ plain form
14471 3536120 3549482 3347139 3527399 3844040 3822998 3645950 4093675 4334997 3923615 3792649
14461 3792649 4246036 3980206 4592902 4286425 4376375 4637781 4244848 4559884 4340193 4518863
14451 4518863 4947278 4812157 4651461 4603319 5048408 4789101 4731354 4737445 5464708 5223931
14441 5223931 5107318 5333482 5197063 5243763 5292924 5389938 5528339 5505445 5749561 5593483
14431 5593483 5827364 5671364 6008756 6105567 6424052 6397771 6442423 6527627 6563039 6732146
14421 6732146 6998836 6904444 7128079 7008920 7179702 7523730 7492129 7708197 7863856 7387203
14411 7387203 7683007 7717790 8021668 8317948 8181260 8226861 8340277 8231645 8650564 9032754
14401 9032754 9145435 9047484 9238589 9345537 9520368 9964945 10092964 10152777 10397898 10598676
$$ packed form
14471C536120J3362k02343J80260L16641k1042j77048M47725K41322m11382j30966
14461C792649M53387k65830O12696l06477Q9950K61406l92933L15036k19691J78670
14451D518863M28415j35121j60696m8142M45089k59307n7747O091P27263k40777
14441E223931j16613K26164j36419M6700M9161R7014J38401k2894K44116j56078
14431E593483K33881j56000L37392R6811L18485k6281M4652Q5204L5412J69107
14421F732146K66690r4392K23635j19159J70782L44028l1601K16068J55659m76653
14411G387203K95804L4783L03878K96280j36688M5601J13416j08632M18919L82190
14401I032754J12681r7951J91105J06948J74831M44577J28019N9813K45121K00778
$$ plain form
14391 10598676 10511604 10661289 11166367 11287932 11316050 11571166 11857500 12027140 12466096 12411376
14381 12411376 12932687 13093122 13285113 13423485 13860860 13914358 14310662 14837646 15052749
14372 15052749 15125748 15753164 15576914 16506352 16647921 16841594 17034015 17576328 18151238
14363 18151238 18349380 18513053 19054306 19845100 20302210 20453202 20905338 21363734 21979214
14354 21979214 22281621 22716785 23259544 23853848 24750166 25247993 25802658 26456226 27181392
14345 27181392 28069496 28741167 29259510 30034274 31085202 32081380 32562530 33611825 35102919
14336 35102919 35848627 36987981 37939800 39170995 40074443 41421009 42874065 44254998
14328 44254998 45525419 47054664 48612178 50332818 52326956 53768988 56017862 57804617
$$ packed form
14391A0598676q7072J49685N05078J21565K8118K55116K86334J69640M38956n4720
14381A2411376N21311J60435J91991J38372M37375N3498L96304N26984K15103
14372A5052749P2999O27416j76250R29438J41569J93673J92421N42313N74910
14363A8151238J98142J63673N41253P90794M57110J50992M52136M58396O15480
14354B1979214L02407M35164N42759N94304Q96318M97827N54665O53568P25166
14345B7181392Q88104O71671N18343P74764J050928R96178M81150J049295J491094
14336C5102919P45708J139354R51819J231195R03448J346566J453056J380933
14328D4254998J270421J529245J557514J720640J994138J442032K248874J786755
$$ plain form
14320 57804617 60009898 62619337 64612597 67346794 69944346 72602446 75520886 78313622
14312 78313622 82062165 85431740 88966059 93105456 96984597 101230812 106273228 111349552
14304 111349552 116264646 121611779 127702300 134335500 140929867 148327019 155762047 164101395
14296 164101395 172909722 182405652 192217194 202587652 213669576 226000188 238671851
14289 238671851 252299909 266315356 281245300 297082265 312881828 329462757 346180158
14282 346180158 363121002 379844015 396587760 412720986 428083983 442410853 455479525
14275 455479525 466384331 473223667 472346481 469404123 470272028 474277827 474933708 471082413
14267 471082413 465507759 456244572 444682358 430756771 415098370 398094344 380669022
$$ packed form
14320E7804617K205281K609439J993260K734197K597552K658100K918440K792736
14312G8313622L748543L369575L534319M139397L879141M246215N042416N076324
14304A11349552M915094N347133O090521O633200O594367P397152P435028Q339348
14296A64101395Q808327R495930R811542J0370458J1081924J2330612J2671663
14289B38671851J3628058J4015447J4929944J5836965J5799563J6580929J6717401
14282C46180158J6940844J6723013J6743745J6133226J5362997J4326870J3068672
14275D55479525J0904806O839336q77186k942358Q67905M005799O55881l851295
14267D71082413n574654r263187j1562214j3925587j5658401j7004026j7425322
$$ plain form
14260 380669022 362789824 344691220 327317588 309983682 293797151 278448918 263958971
14253 263958971 249501733 235953234 222916753 210825470 199686857 189135670 179113804
14246 179113804 169889292 161089230 153154807 145584877 138322902 131763821 125261123 119055828
14238 119055828 114396339 108901696 103900676 99533782 94725038 91119198 87398614 83845454
14230 83845454 80337488 77171260 73941392 71061143 68427487 65686354 63398093 61272256
14222 61272256 58934448 56730240 55161090 53249981 51121998 49529202 48147477 46426489
14214 46426489 45457711 43922407 42566206 40988876 39740603 38670376 37898804 37265557
14206 37265557 35963676 34453122 33640957 32759253 31627156 30940099 30276877 29782004 28417192
$$ packed form
14260C80669022j7879198j8098604j7373632j7333906j6186531j5348233j4489947
14253B63958971j4457238j3548499j3036481j2091283j1138613j0551187j0021866
14246A79113804r224512q800062p934423p569930p261975o559081o502698o205295
14238A19055828m659489n494643n001020m366894m808744l605840l720584l553160
14230H3845454l507966l166228l229868k880249k633656k741133k288261k125837
14222F1272256k337808k204208j569150j911109k127983j592796j381725j720988
14214D6426489r68778j535304j356201j577330j248273j070227p71572o33247
14206C7265557j301881j510554q12165q81704j132097o87057o63222m94873j364812
$$ plain form
14197 28417192 27608896 27126268 26034356 25868474 25383579 24780541 23646381 23235373 22822707
14188 22822707 21937574 21968855 20756796 20817629 20199666 20227668 19158310 18962621 18620598
14179 18620598 18334677 17871505 17441958 17165364 16835005 16506252 16028456 15273643 15599912
14170 15599912 15079240 14957093 14736026 14482812 14329781 13770922 13649682 13134221 12774419
14161 12774419 13109463 12775593 12346104 12593162 12011544 11971979 11859945 11509216 11317515
14152 11317515 11324020 10871397 10774403 10529408 10089970 10192984 10165130 9934573 9763080 9246752
14142 9246752 9372288 9616603 9186199 8990006 9048140 8872211 8799984 8650774 8543324 8641800
14132 8641800 7938499 7952698 7683766 7963513 7956020 7648358 7497796 7638685 7273473 7195242
$$ packed form
14197B8417192q08296m82628j091912j65882m84895o03038j134160m11008m12666
14188B2822707q85133L1281j212059O0833o17963K8002j069358j95689l42023
14179A8620598k85921m63172m29547k76594l30359l28753m77796p54813L26269
14170A5599912n20672j22147k21067k53214j53031n58859j21240n15461l59802
14161A2774419L35044l33870m29489K47058n81618l9565j12034l50729j91701
14152A1317515O505m52623r6994k44995m39438J03014k7854k30557j71493n16328
14142I246752J25536K44315m30404j96193N8134j75929p2227j49210j07450R8476
14132H641800p03301J4199k68932K79747p493l07662j50562J40889l65212p8231
$$ plain form
14122 7195242 6977297 6844520 6790400 6855774 6728976 6549723 6203989 6490408 6253108 6157267
14112 6157267 6027822 6168934 5826177 5989397 5615679 5745849 5652938 5766206 5799590 5643665
14102 5643665 5465839 5421080 5417093 5021659 4815353 5472468 5072633 5214363 4755557 4735281
14092 4735281 4698532 4408800 4878287 4861649 4696665 4708636 4867624 4647557 4055748 4384539
14082 4384539 4029996 4232190 4480604 4111630 4161236 4130361 4388429 3738529 4005968 4002997
14072 4002997 3799200 4030819 3726179 3476852 3618620 3660274 3871431 3877086 3370048 3593063
14062 3593063 3514565 3414774 3869023 3693589 3314993 3819553 3735421 3429150 3453175 2937957
14052 2937957 3499106 3195440 3250191 2926735 3155817 3248951 2865397 2835394 3491768 2863210
$$ packed form
14122G195242k17945j32777n4120O5374j26798j79253l45734K86419k37300r5841
14112F157267j29445J41112l42757J63220l73718J30170r2911J13268L3384j55925
14102E643665j77826m4759l987l95434k06306O57115l99835J41730m58806k0276
14092D735281l6749k89732M69487j6638j64984J1971J58988k20067n91809L28791
14082D384539l54543K02194K48414l68974M9606l0875K58068o49900K67439k971
14072D002997k03797K31619l04640k49327J41768M1654K11157N655n07038K23015
14062C593063p8498r9791M54249j75434l78596N04560q4132l06271K4025n15218
14052B937957N61149l03666N4751l23456K29082R3134l83554l0003O56374o28558
$$ plain form
14042 2863210 2943975 3004292 3295359 2851365 3013424 3125722 2432546 2538809 2729629 2774076
14032 2774076 2502070 2747482 2732879 2463321 2622809 2932127 2374349 2149285 2677208 2363882
14022 2363882 2533238 2550470 2643128 2506479 2203592 2378137 2333235 2010300 2522754 2085328
14012 2085328 1939604 2104674 2225723 1890029 1991576 1903643 2040812 1853121 1963096 1963751
14002 1963751 1986551 2099784 1609304 1624163 2101013 1936563 1699385 1898740 2105784 2280872
13992 2280872 2267580 2640549 3598684 6193728 10677001 16091613 27561616 37626205
13984 37626205 23369954 11732952 7417379 5113057 4454601 3624367 3387601 2871476
13976 2871476 2929551 2479088 2504585 2407424 2509291 2300974 2301096 1946790 2131442 2192011 1610332
$$ packed form
14042B863210Q0765O0317K91067m43994J62059J12298o93176J06263J90820M4447
14032B774076k72006K45412j4603k69558J59488L09318n57778k25064N27923l13326
14022B363882J69356J7232R2658j36649l02887J74545m4902l22935N12454m37426
14012B085328j45724J65070J21049l35694J01547q7933J37169j87691J09975O55
14002A963751K2800J13233m90480J4859M76850j64450k37178J99355K07044J75088
13992B280872j3292L72969R58135K595044M483273N414612J1470003J0064589
13984C7626205j4256251j1637002m315573k304322o58456q30234k36766n16125
13976B871476N8075m50463K5497r7161J01867k08317J22l54306J84652O0569n81679
$$ plain form
13965 1610332 2199419 1871322 1882682 2175020 1953460 2129560 2023991 1834746 1619420 2092619
13955 2092619 1635825 1576947 1732972 1733658 1811338 1992330 1509076 1777051 1559105 1614259
13945 1614259 1654199 1508730 1726039 1687445 1506128 1317617 1642609 1238621 1457446 1652050
13935 1652050 1709827 1510656 1303219 1620228 1425126 1310300 1373367 1559870 1238063 1377991
13925 1377991 1302110 1410932 1389279 1241288 1372095 1381456 1253778 1260143 1453703 978150
13915 978150 1279714 1406617 1109101 1494782 1256067 1278840 1178417 1317374 1383032 1347498
13905 1347498 1342972 1357018 963697 1171074 1169896 1119928 924590 1341250 970587 1353044
13895 1353044 1176152 940738 838896 1108765 1060619 1066472 985164 914025 1248169 1423553
$$ packed form
13965A610332N89087l28097J1360K92338k21560J76100j05569j89245k15326M73199
13955B092619m56794n8878J56025O86P7680J80992m83254K67975k17946N5154
13945A614259L9940j45469K17309l8594j81317j88511L24992m03988K18825J94604
13935A652050N7777j99171k07437L17009j95102j14826O3067J86503l21807J39928
13925A377991p5881J08822k1653j47991J30807R361j27678O365J93560m75553
13915I78150L01564J26903k97516L85681k38715K2773j00423J38957O5658l5534
13905A347498m526J4046l93321K07377j178m9968j95338M16660l70663L82457
13895A353044j76892k35414j01842K69869m8146N853q1308p1139L34144J75384
$$ plain form
13885 1423553 1271711 1282296 958257 822566 1177957 971816 802333 1011973 967387 936821
13875 936821 1234921 988055 1083400 925368 751223 1020329 569362 932030 924291 710476
13865 710476 1305552 961453 1211056 805208 712449 942992 1321409 935351 748104 849875
13855 849875 540499 947556 588742 923055 841085 710205 934327 972367 742061 1010936
13845 1010936 763553 507336 894883 678382 494351 939238 905722 1071949 451846 593450
13835 593450 1313272 1019938 933098 1069921 663301 948973 708255 1037485 997411 776657
13825 776657 686400 867788 866437 642169 680913 756282 767695 1096248 767073 606345 890784
13814 890784 833525 613420 374545 335831 568952 967143 494030 652473 506517 636734
$$ packed form
13885A423553j51842J0585l24039j35691L55391k06141j69483K09640m4586l0566
13875I36821K98100k46866R5345j58032j74145K69106m50967L62668p739k13815
13865G10476N95076l44099K49603m05848r2759K30543L78417l86058j87247J01771
13855H49875l09376M07057l58814L34313q1970j30880K24122L8040k30306K68875
13845A010936k47383k56217L87547k16501j84031M44887l3516J66227D51846J41604
13835E93450P19822k93334q6840J36823m06620K85672k40718L29230m0074k20754
13825G76657r0257J81388j351k24268L8744P5369J1413L28553l29175j60728K84439
13814H90784n7259k20105k38875l8714K33121L98191m73113J58443j45956J30217
$$ plain form
13804 636734 571274 645659 751976 693614 622122 752270 892190 920462 746999 723310 582362
13793 582362 856834 906104 347058 771198 606916 857853 675618 563526 670144 538918
13783 538918 847894 559515 855297 795723 353379 601366 570411 529416 652040 1070134
13773 1070134 810181 412151 602912 680880 588119 430318 435695 648784 663395 430086
13763 430086 578935 387920 641659 690803 576845 787305 866606 583677 888452 367490
13752 329010 440335 581246 309773 670549 874512 220438 574510 593722 381934 631409
13742 631409 545500 726566 486099 730189 688474 558897 405734 546614 617595 406407
13732 406407 500920 444899 402887 603774 622098 440761 794683 499129 647419 303033
$$ packed form
13804F36734o5460P4385J06317n8362p1492J30148J39920K8272j73463k3689j40948
13793E82362K74472M9270C47058M24140j64282K50937j82235j12092J06618j31226
13783E38918L08976k88379K95782n9574C53379K47987l0955m0995J22624M18094
13773A070134k59953l98030J90761P7968r2761j57801N377K13089J4611k33309
13763D30086J48849j91015K53739M9144j13958K10460P9301k82929L04775C67490
13752C29010J11325J40911k71473L60776K03963B20438L54072J9212k11788K49475
13742F31409q5909J81066k40467K44090m1715j29577j53163J40880P0981k11188
13732D06407R4513n6021m2012K00887J8324j81337L53922k95554J48290C03033
$$ plain form
13721 396944 281574 398074 455534 476484 474925 671165 366286 463106 821008 396447
13710 247671 679931 375708 683929 450298 809401 625364 461155 648392 224686 635074
13700 635074 507054 631379 357606 366695 653258 541216 505789 636570 242731 478852
13690 478852 598688 430849 664290 505046 440557 388957 403301 474718 235804 344401
13680 344401 388935 548346 318768 885780 340713 861708 414540 248664 184244 396229
13670 396229 302460 373912 509584 468623 412616 72289 336919 559262 298124 537517
13660 537517 250792 788488 525015 461880 568798 152229 225146 328221 480113 823465
13650 823465 235230 176502 287641 145416 575942 -57024 548050 202321 603342 386027
$$ packed form
13721C96944j15370J16500N7460K0950j559J96240l04879R6820L57902C96447
13710B47671M32260l04223L08221k33631L59103j84037j64209J87237B24686M10388
13700F35074j28020J24325k73773R089K86563j12042l5427J30781B42731K36121
13690D78852J19836j67839K33441j59244o4489n1600J4344P1417B35804J08597
13680C44401M4534J59411k29578N67012C40713N20995D14540j65876o4420K11985
13670C96229r3769P1452J35672m0961n6007G2289K64630K22343k61138K39393
13660E37517B50792N37696k63473o3135J06918A52229P2917J03075J51892L43352
13650H23465B35230n8728J11139j42225M30526e7024E48050B02321M01021k17315
$$ plain form
13640 386027 492426 450358 468471 249498 391972 504796 56857 434039 277165 475 444124
13629 444124 577217 -79026 408872 -34245 498707 -42646 314545 447812 235744 512396
13619 512396 408546 181926 548688 210702 474651 293807 300633 419856 428324 514730
13609 514730 479365 513341 449870 310355 285259 108138 423246 33857 -137604 347504
13598 361643 411565 189479 290205 94613 370771 450496 349926 308808 223200 318009 232163
13587 232163 618715 238489 147608 494562 295594 718064 50884 -5907 478128 120813
13576 118728 8322 230187 396069 382166 166776 204297 538674 9442 248671 124707 -123697
13564 10591 454287 144519 -69695 262896 267931 421258 398125 73662 168656 127601 158538
$$ packed form
13640C86027J06399m2068J8113k18973J42474J12824E6857L77182j56874D75M43649
13629D44124J33093g9026D08872c4245D98707d2646C14545J33267k12068K76652
13619E12396j03850A81926L66762B10702K63949j80844O826J19223Q468Q6406
13609E14730l5365L3976o3471j39515k5096A08138L15108C3857a37604C47504
13598C61643M9922A89479J00726I4613K76158P9725j00570m1118q5608R4809q5846
13587B32163L86552B38489r0881L46954j98968M22470E0884e907D78128A20813
13576A18728H322K21865J65882j3903A66776L7521L34377I442K39229j23964a23697
13564A0591M43696A44519f9695B62896N035J53327k3133G3662R4994m1055L0937
$$ plain form
13553 158538 86567 273716 -80265 60232 302649 123203 409550 272862 436423 250187
13543 250187 51157 386936 359928 276852 349924 486173 627185 289404 307320 435554
13533 435554 148128 19214 212917 8330 121842 495456 249350 511256 178869 106342
13523 106342 -57374 454732 184382 -73026 385399 120226 46667 228790 15647 148619
13513 148619 77411 293096 -112215 248446 241298 278178 373585 486287 187048 351060
13503 351060 266201 281689 229629 64171 -41223 -75081 417070 177831 128826 339115 97755
13491 106347 438164 324676 383182 63532 278895 380418 173975 28072 131491 350262
13481 350262 119277 235318 416473 279802 359623 351524 118958 103788 -66185 301668
$$ packed form
13553A58538p1971J87149h0265F0232K42417A23203K86347j36688J63561j86236
13543B50187E1157L35779k7008q3076P3072J36249J41012B89404J7916J28234
13533D35554A48128A9214J93703H330J13512L73614k46106K61906A78869p2527
13523A06342e7374D54732A84382g3026C85399A20226D6667J82123A5647J32972
13513A48619p1208K15685a12215B48446p148L6880R5407J12702A87048J64012
13503C51060q4859J5488n2060F4171d1223l3858D17070A77831m9005K10289I7755
13491A06347L31817j13488N8506F3532K15363J01523A73975B8072J03419K18771
13481C50262A19277J16041J81155j36671P9821q099A18958j5170f6185C01668
$$ plain form
13470 317050 48039 416432 136691 344051 49006 333586 31367 3032 373459 98506 124673
13459 124673 -40999 368945 268349 83042 217444 231595 213727 243135 83415 290972 47977
13447 112958 224490 -210979 517800 155325 -44276 278745 225868 2779 151954 18719
13436 312194 26632 238984 169206 450969 179963 106943 3307 104811 -17780 19421 280947
13425 280947 169396 -56289 211371 333826 233926 -245877 108407 256170 42414 37841
13415 37841 71822 46211 -80550 276930 114927 56704 -212738 -63094 178288 -11870 128238
13403 427033 175232 205098 65155 33496 329098 -4087 -231720 256217 502812 -117784
13392 172966 400861 -39246 341101 71290 212776 407538 28390 283661 230171 40704
$$ packed form
13470C17050D8039L68393A36691K07360D9006K84580C1367C032L70427I8506K6167
13459A24673d0999C68945j00596H3042J34402J4151j7868K9408H3415K07557D7977
13447A12958J11532b10979E17800A55325d4276B78745n2877B779J49175A8719
13436C12194B6632K12352o9778K81763A79963p3020C307J01504a7780A9421K61526
13425B80947j11551e6289B11371J22455r9900b45877A08407J47763D2414m573
13415C7841L3981k5611h0550B76930A14927E6704b12738f3094A78288a1870A28238
13403D27033A75232K9866F5155l1659K95602d087k27633B56217K46595a17784
13392A72966K27895c9246C41101G1290J41486J94762B8390K55271n3490D0704
$$ plain form
13381 91440 -50075 110199 230962 275212 136608 105461 258608 -65186 339717 284875 226366
13370 226366 61060 -213971 -11771 455320 283098 489666 264587 -32760 374151 229057
13360 229057 81914 86368 320880 62210 362150 224625 273533 413152 301827 41615 337833
13349 337833 -21609 436058 84135 588135 -59388 232608 321813 105818 51838 330660
13339 330660 477586 367959 33412 303915 182607 104858 284512 -15399 551187 65783
13328 117791 442055 -142850 61491 269111 412182 70322 66163 55231 -129525 17340 228163
13317 228163 -88630 -36510 581327 113964 388131 431955 108601 283259 110315 291179
13307 291179 407312 234177 12416 16075 154669 278128 277985 90244 382491 123033 -15498
$$ packed form
13381I1440e0075A10199J20763M4250A36608l1147J53147f5186C39717n4842n8509
13370B26366F1060b13971a1771D55320j72222K06568k25079c2760C74151j45094
13360B29057H1914M454K34512F2210K99940j37525M8908J39619j11325D1615K96218
13349C37833b1609D36058H4135N04000e9388B32608Q9205A05818E1838K78822
13339C30660J46926j09627C3412K70503j21308p7749J79654a5399E51187F5783
13328A17791L24264a42850F1491K07620J43071G0322m159j0932a29525A7340K10823
13317B28163h8630c6510E81327A13964K74167M3824A08601J74658A10315J80864
13307B91179J16133j73135A2416L659J38594J23459j43I0244K92247A23033a5498
$$ plain form
13295 343129 -148771 390748 141485 -374 123651 -79675 299887 -74563 -107021 153539 -90134
13283 262461 186727 71146 249011 -104253 -412479 -232549 61811 93568 -58365 432231
13272 -247226 -92056 120741 -29346 146304 -449744 135249 297679 76879 -238135 -96727
13261 402156 -249822 204210 383579 -6671 36976 456474 -619 252295 -104033 51288 153476
13250 153476 96066 69220 -84946 149151 -47793 98534 281819 -65367 47715 656459 39508
13238 105164 -19468 2103 381832 226527 247071 -84228 165205 -44620 116069 -82703 136171
13226 -53171 -156230 104019 -201794 79946 364591 100516 130356 311755 333703 -95957
13215 188536 284005 -235824 95508 219944 113659 47869 -70279 156918 226370 -42438 40364
$$ packed form
13295C43129a48771C90748A41485c74A23651g9675B99887g4563l2458A53539i0134
13283B62461p5734G1146J77865a04253l08226J79930F1811L1757e8365D32231
13272b47226i2056A20741b9346A46304d49744A35249J62430G6879b38135i6727
13261D02156b49822B04210J79369f671C6976M19498f19B52295a04033E1288J02188
13250A53476n7410k6846h4946A49151d7793I8534J83285f5367D7715O08744C9508
13238A05164a9468B103L79729j55305K0544h4228A65205d4620A16069h2703A36171
13226e3171j03059A04019b01794G9946K84645A00516K9840J81399K1948i5957
13215A88536R5469b35824I5508J24436j06285D7869g0279A56918O9452d2438D0364
$$ plain form
13203 285435 -76655 148365 145817 588761 16212 -112406 6193 101307 268279 -262088 18880
13191 -45239 139547 147287 -77620 52984 203225 114300 240052 251424 302523 -580 60871 -78725
13178 -8101 179206 220138 112815 -163778 183282 -37895 -27962 120726 301102 321819 45183
13166 425739 104701 54069 54266 -306844 169799 205110 -32649 50322 176131 450073 155339
13154 398056 451405 355933 242776 46929 -100494 105718 -300861 32675 36231 358023 76003
13142 -20800 3236 16656 67474 231025 -120798 -19408 -385533 -16607 -68915 39000 -156124
13130 -97853 172986 154253 131672 -101904 57660 -75654 -105644 38037 58338 129931 -280337
13118 137524 78290 -34455 -26632 150282 -221720 288796 85952 8072 -190922 -21819 -214075
$$ packed form
13203B85435g6655A48365k548M42944A6212a12406F193R5114J66972b62088A8880
13191d5239A39547P740g7620E2984J50241q8925J25752J1372N1099e80F0871g8725
13178h101A79206M0932j07323a63778A83282c7895R933A20726J80376K0717D5183
13166D25739A04701n0632J97c06844A69799L5311c2649E0322J25809K73942A55339
13154C98056N3349r5472j13157D6929a00494A05718c00861C2675L556L21792G6003
13142b0800C236J3420N0818J63551a20798a9408l66125a6607n2308C9000a56124
13130i7853A72986j8733k2581a01904E7660g5654k9990C8037K0301P1593b80337
13118A37524n9234c4455P823A50282b21720B88796H5952H072a90922b1819j92256
$$ plain form
13107 -214075 -58948 330488 -3155 56278 -275885 -237434 199102 43120 -15739 -394859 171956
13095 -103921 134267 191085 -32292 180968 -8643 -58391 134457 93388 185132 -230813 212666
13083 -55767 165485 102832 -107904 203604 23307 105519 -285933 219607 2824 167348 12758
13071 -52020 37783 -175955 -135867 189092 -172969 159895 227048 171535 293135 81665 36856
13059 153526 85892 111769 -67075 246636 114979 77344 -177867 173629 145943 195023 3218
13047 -151547 74740 110660 132030 258518 -113054 -69928 99082 130741 356785 159813 86289
13036 86289 -115533 325227 -49787 -293292 211308 539755 208651 -152997 -171316 290836
13025 -14898 -4871 -144543 -275995 161543 477333 -102400 168917 -38449 42173 -99080 427460
$$ packed form
13107b14075e8948C30488c155E6278b75885L8451A99102D3120a5739l79120A71956
13095a03921A34267N6818c2292A80968h643m9748A34457m1069R1744b30813B12666
13083e5767A65485o2653a07904B03604B3307Q2212b85933B19607B824J64524A2758
13071e2020C7783a75955M0088A89092a72969A59895O7153n5513J21600H1665C6856
13059A53526o7634K5877f7075B46636A14979l7635a77867A73629k7686M9080C218
13047a51547G4740L5920K1370J26488a13054M3126I9082L1659K26044A59813p3524
13036H6289a15533C25227d9787k43505B11308L28447B08651a52997j8319B90836
13025a4898d871j39672j31452A61543L15790a02400A68917c8449D2173i9080D27460
$$ plain form
13013 -105597 306889 -29933 103886 40800 83011 311007 245469 235603 -165622 201986 219465
13002 219465 125002 126070 221107 168856 148131 224860 279166 203626 -18446 67487 222850
12991 222850 -72200 91842 -146668 234882 10142 -98412 305412 20029 87876 -142113 405642
12979 571710 5480 -118035 -32503 75580 30423 -205979 -23988 -225780 201462 -93330 -129537
12968 -129537 227767 270621 77829 -380713 -96509 192482 -130154 152428 -46179 -324109
12958 -324109 -175789 150252 48101 -63038 -315270 -114598 -89551 346000 -82384 -33471
12947 43105 244761 329968 133884 69337 193218 -328478 -229441 57297 264276 -238450
12936 10955 130811 217176 -116607 453678 -130210 196930 320708 10272 -84779 367977
$$ packed form
13013a05597C06889b9933A03886D0800M2211K27996o5538r866a65622B01986J7479
13002B19465r4463J068R5037n2251k0725P6729N4306p5540a8446F7487J55363
12991B22850g2200I1842a46668B34882A0142i8412C05412B0029O7847a42113D05642
12979E71710E480a18035c2503G5580C0423b05979b3988k01792B01462i3330l6207
12968a29537B27767M2854G7829c80713i6509A92482a30154A52428d6179k77930
12958c24109J48320A50252D8101f3038k52232a14598K5047C46000h2384c3471
12947D3105K01656Q5207A33884o4547J23881c28478R9037E7297K06979b38450
12936A0955J19856Q6365a16607D53678a30210A96930J23778A0272h4779C67977
$$ plain form
12925 -30160 185986 256625 116998 19902 -133518 -67590 160254 283331 36933 -283486
12914 -229557 -263277 298171 34975 -366158 440902 50634 -177431 3036 45888 52023 16462
12902 35654 66000 197451 53339 75744 308219 104074 19644 -96038 154912 51190 142091
12891 142091 242953 19117 22021 59982 86341 -66150 212436 100361 48889 308815 259935
12880 259935 51581 -113153 24481 407848 -177218 53836 138989 -52880 48805 -307084 -111615
12868 66027 106290 71630 188026 8150 -21020 -339018 -76419 -150467 93361 13724 -248938
12856 231318 149345 135944 156760 54680 -22727 74431 -66788 -93199 80419 145377 249646
12845 249646 70794 13105 67186 520077 49659 20029 -156320 -37729 33163 -127561 67000
$$ packed form
12925c0160A85986P0639A16998A9902a33518O5928A60254J23077C6933b83486
12914b29557l3720B98171C4975c66158D40902E0634a77431C036M2852O135A6462
12902C5654L0346J31451E3339K2405K32475A04074A9644i6038A54912E1190R0901
12891A42091J00862A9117K904L7961K6359f6150B12436A00361D8889K59926m8880
12880B59935E1581a13153B4481L83367a77218E3836Q5153e2880D8805c07084a11615
12868F6027M0263l4660J16396H150b1020l17998g6419p4048I3361A3724b48938
12856B31318q1973j3401K0816E4680b2727G4431f6788k6411H0419O4958J04269
12845B49646G0794A3105N4081M52891D9659B0029a56320c7729C3163a27561F7000
$$ plain form
12833 180414 99693 7098 54327 -157985 73439 28886 147250 140731 510114 -112750 98318
12821 258205 -6043 -119351 -146718 -308776 175962 152492 -50193 -11350 154249 48047 -107749
12809 -150017 5794 235120 91458 113207 115799 -6759 -170158 -195240 -252890 242454 -137448
12797 56904 152320 265561 298053 -277646 359810 50045 166937 87777 -37281 2123 478872
12786 478872 -161168 -234375 51331 -313125 38975 -331402 -96118 -75764 171138 -188235
12775 145407 -71974 -210990 59024 -249260 110033 -252955 -44962 48462 40388 41679 139479
12764 139479 143216 -54733 -235054 380679 -169919 303523 326120 -10422 -118753 -69462 247829
12752 -18769 44814 16496 145338 -244747 -176147 -100103 -75319 -21872 -32088 -78071 184703
$$ packed form
12833A80414q0721G098M7229a57985G3439B8886J18364o519L69383a12750I8318
12821B58205f043j13308k7367j62058A75962k3470e0193a1350A54249D8047a07749
12809a50017E794K29326I1458K1749K592f759j63399k5082n7650B42454a37448
12797E6904R5416J13241L2492b77646C59810E0045J16892p9160c7281B123M76749
12786D78872a61168p3207E1331c13125C8975c31402i6118K0354A71138a88235
12775A45407g1974j39016E9024b49260A10033b52955d4962D8462q074J291R7800
12764A39479L737e4733j80321C80679a69919C03523K2597a0422j08331M9291B47829
12752a8769D4814A6496J28842b44747O8600P6044K4784b1872j0216m5983A84703
$$ plain form
12740 180196 183278 -238480 193234 -411756 71093 186444 138271 -199219 -206886 -90162 274706
12728 451442 -113413 -22964 -5182 -261530 -16652 261703 73467 -185794 104502 256295
12718 256295 71261 -415872 -26810 225358 105703 428355 -100299 418454 117481 229698
12708 229698 18440 150553 -268234 171856 49844 311199 -317589 -116617 203020 -84541
12697 -40479 54605 42430 228722 131394 86674 -80201 -112681 128656 83284 353307 -89622
12685 91388 63814 -93210 -126575 -30152 -119052 105561 134503 71090 306344 254367 40625
12673 10365 -100974 68700 -321183 256051 -72153 81223 236741 13321 317489 47490 177708
12662 177708 306645 -119712 361255 80015 153681 366150 129400 286066 51823 97260
$$ packed form
12740A80196L082b38480A93234d11756G1093J15351m8173a99219p667i0162B74706
12728D51442a13413b2964e182k56348a6652B61703G3467a85794A04502J51793
12718B56295G1261d15872b6810B25358A05703L22652a00299D18454A17481J12217
12708B29698A8440J32113b68234A71856D9844K61355c17589a16617B03020h4541
12697d0479E4605j2175J86292r7328m4720h0201l2480A28656m5372K70023h9622
12685I1388k7574i3210l3365c0152q8900A05561K8942o3413K35254n1977D0625
12673A0365a00974F8700c21183B56051g2153H1223J55518A3321L04168D7490J30218
12662A77708J28937a19712C61255H0015P3666K12469A29400J56666E1823M5437
$$ plain form
12652 97260 187678 32128 248335 -65853 -110335 70868 175590 21107 269786 238242 -265021
12640 -280592 26744 94390 399652 -11183 -202235 133839 -227565 319750 -79561 207229
12629 -35400 512629 402445 188350 290759 467920 221864 44127 282266 -150917 142501
12618 76562 -73290 33938 11073 452512 325411 -115531 -102142 47099 -63401 -29647 -147661
12607 -147661 -97750 -246927 40676 9070 -40095 285299 -51176 403527 186533 -362056 -153587
12595 -230395 444639 123387 259328 84509 -247622 274356 -36239 80788 183737 -106923
12584 20380 350787 194284 41468 -199572 229501 -72426 40411 32930 81743 196600 11090
12572 9362 -74988 -58362 460622 -288173 52125 135636 -126325 -8896 170351 135244 108085
$$ packed form
12652I7260R0418C2128K16207f5853m4482G0868J04722B1107K48679l1544b65021
12640b80592B6744O7646L05262a1183j91052A33839b27565C19750g9561B07229
12629c5400E12629j10184A88350J02409J77161B21864D4127K38139a50917A42501
12618G6562g3290C3938A1073M41439j27101a15531J3389D7099f3401b9647j18014
12607a47661M9911j49177D0676I070d0095B85299e1176D03527A86533c62056a53587
12595b30395D44639A23387J35941H4509b47622B74356c6239H0788J02949a06923
12584B0380L30407j56503D1468a99572B29501g2426D0411p481M8813J14857A1090
12572I362g4988J6626D60622b88173E2125Q3511a26325h896A70351l5107k7159
$$ plain form
12561 108085 5837 50278 214789 188997 58620 262221 -28876 133038 101215 -120698 -20842
12549 -112243 84199 16647 162701 248819 -83221 111763 -35396 -196006 315985 -48369 -288304
12538 -288304 -83545 -293214 -120182 418338 68558 88627 41948 77730 -106410 119013
12527 13205 -43874 -27443 -287927 27150 176045 -111831 51495 209512 -181382 -1950 -97243
12516 -97243 286744 181164 214883 189518 266264 -116599 187633 165709 73015 -215321 62683
12504 169876 -200930 138182 85459 174681 473456 5755 -80935 28478 -40153 60289 -11549
12492 170880 35193 81529 65088 157050 60433 472504 212217 290393 250213 -248353 -60927
12480 -5555 -72121 147770 306668 -27245 413 -445116 242941 -19040 -206048 429590 -68596
$$ packed form
12561A08085E837M4441J64511k5792E8620K03601b8876A33038l1823a20698b0842
12549a12243H4199A6647J46054Q6118h3221A11763c5396j60610C15985d8369k39935
12538b88304h3545k09669a20182D18338F8558K0069D1948L5782a06410A19013
12527A3205d3874J6431k60484B7150J48895a11831E1495J58017a81382a950r5293
12516i7243B86744j05580L3719k5365P6746a16599A87633k1924G3015b15321F2683
12504A69876b00930A38182n2723Q9222K98775E755h0935B8478d0153F0289a1549
12492A70880C5193M6336j6441R1962F0433M12071B12217P8176m0180b48353f0927
12480e555o6566A47770J58898b7245D13d45116B42941a9040j87008D29590f8596
$$ plain form
12468 118439 185221 -4695 247067 -80241 -280754 386674 319710 -54760 231391 125130 9352
12456 480188 -59190 -7432 -76415 -211991 113146 -62835 108505 -21625 -51466 95979 221910
12445 221910 -226874 -7445 53641 302005 -111483 -49912 -120612 -105458 -93850 -138558 134791
12433 -99320 -81391 77672 -13641 78558 -262064 -24918 -41277 -12112 -161651 145793 109852
12422 109852 130729 93954 7730 240129 55353 124043 -117531 -236271 -191328 -198651 179551
12410 -139692 -355948 173650 142625 -52298 7705 94739 127488 267445 24556 163553 160069
12399 160069 52277 -65776 166867 -315924 -394922 26334 297963 99459 -925 -273599 -239756
12388 -239756 309338 18582 -290059 311921 158631 -42702 -82710 6354 119060 -100865
$$ packed form
12468A18439O6782d695B47067h0241k00513C86674o6964e4760B31391j06261I352
12456D80188e9190g432o8983j35576A13146f2835A08505b1625k9841I5979J25931
12445B21910b26874g445E3641K48364a11483d9912p0700J5154J1608m4708A34791
12433i9320J7929G7672a3641G8558b62064b4918j6359a2112j49539A45793l5941
12422A09852K0877l6775G730K32399E5353O8690a17531j18740M4943p323A79551
12410a39692k16256A73650l1025e2298G705Q7034L2749J39957B4556J38997l484
12399A60069E2277f5776A66867c15924p8998B6334K71629I9459i25k72674L3843
12388b39756C09338A8582b90059C11921j53290d2702m0008F354J12706a00865
$$ plain form
12377 25214 361569 -128247 145407 240929 52469 107125 -15385 -101000 -166375 22846 360263
12366 360263 211928 -162889 -99010 143394 -315224 -1840 34408 -205307 -145764 10097 9759
12355 9759 62206 28866 36233 415580 -126849 335741 22296 30952 -446575 315512 -234968
12343 49652 -173475 -151977 76314 -77403 -100146 -309006 137470 331587 -158125 129051
12332 38744 96742 -121250 10962 49094 -333166 -36139 -140817 -152657 47155 -104759 57318
12320 232161 -51301 237803 -187151 -6223 -93055 -79220 -174806 -62866 329492 -88216 24643
12308 300564 -129476 26388 79439 -271829 110564 78468 151429 -42746 -76519 27887 281080
12297 281080 103866 37332 -137022 107416 118374 -192755 31332 -10188 -98009 -234785
$$ packed form
12377B5214L36355a28247A45407R5522E2469N4656a5385q5615o5375B2846L37417
12366C60263j48335a62889O3879A43394c15224a840C4408b05307N9543A0097l38
12355I759N2447B8866P367L79347a26849C35741B2296Q656d46575C15512b34968
12343D9652a73475K1498G6314g7403k2743k08860A37470J94117a58125A29051
12332C8744N7998a21250A0962L8132c33166c6139j04678j1840D7155a04759E7318
12320B32161e1301B37803a87151f223q6832J3835r5586f2866C29492h8216B4643
12308C00564a29476B6388N3051b71829A10564l2096P2961d2746l3773B7887K53193
12297B81080A03866C7332a37022A07416J0958a92755C1332a0188q7821j36776
$$ plain form
12287 -234785 -75258 -160464 -150788 114405 -176913 159155 31957 225055 104891 90994 -145245
12275 177146 123579 -95487 -160173 -2421 44351 -29047 351172 314724 -95235 110369 41677
12263 43704 -221022 -144204 -229943 186505 47779 -59136 8991 -71166 50546 -261604 252582
12251 84395 410932 -158949 37230 232827 -141780 -86215 256480 -92589 -70877 68956 -146315
12239 104271 -51344 24957 180687 174329 202312 212720 177287 519346 -130076 124085 173420
12228 173420 166465 241648 282065 73320 67060 -116973 44592 65153 185596 120134 310790
12217 310790 23850 396630 362742 120309 253043 156544 414444 241962 283965 412527
12207 412527 33886 -33583 -136154 188411 -161267 27200 242194 51612 82462 -32400 359332
$$ packed form
12287b34785g5258q5206R676A14405a76913A59155C1957J93098A04891j3897a45245
12275A77146n3567i5487o4686b421D4351b9047C51172l6448i5235A10369D1677
12263D3704b21022P6818q5739A86505D7779e9136H991g1166E0546b61604B52582
12251H4395L26537a58949C7230J95597a41780N5565B56480i2589K1712F8956a46315
12239A04271e1344B4957J55730o358K7983J0408l5433L42059a30076A24085M9335
12228A73420o955P5183M0417G3320o260a16973D4592K0561J20443o5462J90656
12217C10790B3850L72780l3888A20309J32734r6499K57900j72482M2003J28562
12207D12527C3886c3583j02571A88411a61267B7200K14994E1612L0850c2400C59332
$$ plain form
12195 -2387 143463 17488 191444 -47171 151960 -4056 -16129 81142 232505 230511 16126
12183 174922 -9609 866 -126911 47237 292175 -194847 275294 132287 -243045 -112104 46555
12171 208434 93770 296391 144128 344020 34814 -97301 261997 187219 118497 273950
12161 273950 3345 207214 138314 15339 199820 80079 10636 227625 71438 30923 148413
12150 148413 -142781 155912 -300864 187193 -217527 -127414 59898 109470 266206 -93014
12139 118554 291978 -263377 405581 177874 201033 -34855 191137 200601 27091 -102202
12128 -59142 241671 127212 45502 -154461 208664 -134414 -166105 12994 16133 -215241 -34139
12116 -298785 -160280 -343623 40713 -3242 94039 197933 -143051 -12319 -118388 120945
$$ packed form
12195b387A43463A7488J73956d7171A51960d056j2073H1142J51363j994A6126
12183A74922i609H66a26911D7237K44938a94847B75294A32287b43045a12104D6555
12171B08434I3770K02621A44128J99892C4814i7301B61997p4778o8722J55453
12161B73950C345K03869o8900A5339J84481H0079A0636K16989G1438C0923J17490
12150A48413a42781A55912c00864A87193b17527R0113E9898M9572J56736i3014
12139A18554J73424b63377D05581A77874K3159c4855A91137R464B7091a02202
12128e9142B41671j14459D5502a54461B08664a34414l1691A2994L139b15241c4139
12116b98785J38505j83343D0713c242I4039J03894a43051a2319j06069A20945
$$ plain form
12105 67586 234961 -149487 260567 -133792 -47685 -32466 -124349 -219806 -184151 144535 33039
12093 -35034 -163506 362526 183586 -41757 18800 307240 -103422 -122864 47037 -120104
12082 -131176 108294 -26729 -58572 -151967 -198520 428969 -10274 -90268 -175340 21359 202415
12071 202415 -133220 88102 -11759 -68086 29418 287126 -74603 99441 -161335 113406 146521
12060 146521 295653 106853 69833 34667 139233 -101821 -153780 -114494 -31851 249226
12049 -224124 -96713 42399 244381 86471 38129 -259757 146444 -456533 -79270 49937 421577
12038 421577 -213312 147748 -85351 299513 -225372 -102709 -44409 256368 41229 487266
12028 487266 863720 895936 85448 -286268 -287702 33417 137630 -8199 93627 1212 383079
$$ packed form
12105F7586J67375a49487B60567a33792d7685J5219r1883r5457L5655A44535C3039
12093c5034j28472C62526j78940d1757A8800K88440a03422j9442D7037a20104
12082a31176A08294b6729l1843r3395m6553D28969a0274p9994q5072B1359J81056
12071B02415a33220H8102a1759n6327B9418K57708g4603I9441a61335A13406L3115
12060A46521J49132A06853l7020C4667J04566a01821n1959L9286c1851B49226
12049b24124i6713D2399K01982H6471C8129b59757A46444d56533g9270D9937L71640
12038D21577b13312A47748h5351B99513b25372a02709d4409B56368D1229M46037
12028D87266L76454L2216H5448b86268j434C3417J04213h199I3627A212L81867
$$ plain form
12017 383079 47234 584127 -112651 -118186 -100146 -168152 -64816 78975 -238247 -240449 281680
12005 220746 -112071 194265 33061 -32374 9070 335649 -217256 103221 -90316 55153 -37155
11993 -311265 -160092 35851 119722 -23995 117237 -155351 -113942 -46958 -20877 -222399 18200
11981 77731 -154378 327336 -305391 184399 -330713 68110 -75378 -249431 -206641 39447
11970 -231871 99359 -271994 -129351 3248 -144265 -252922 38177 -178170 -41555 -359361
11960 -359361 -354694 -311781 -185125 308985 241059 261220 37557 -303069 77486 33971 366164
11949 366164 19353 -89274 -256853 113494 240043 -160817 -75865 78361 -39297 -32001 7393
11937 -197326 54354 -165880 -300596 -152298 68104 -61590 -15258 -74864 71415 165824 -58864
$$ packed form
12017C83079D7234N36893a12651n535J8040o8006f4816G8975b38247k202B81680
12005B20746a12071A94265C3061c2374I070L26579b17256A03221i0316E5153c7155
11993c11265J51173C5851Q3871b3995A17237a55351M1409d6958b0877k01522A8200
11981G7731a54378C27336c05391A84399c30713F8110g5378j74053M2790C9447
11970b31871I9359b71994a29351C248a44265j08657C8177a78170d1555l17806
11960c59361M667M2913J26656C08985o7926K0161C7557c03069G7486C3971L32193
11949C66164A9353h9274j67579A13494J26549a60817g5865G8361c9297P296G393
11937a97326E4354a65880j34716J48298F8104f1590a5258n9606G1415R4409e8864
$$ plain form
11925 -100202 -214049 -278376 85977 -137562 -104682 -52640 -377543 177399 290382 -95228
11914 -39717 160007 -262138 -34811 331882 -178615 99407 254597 -323465 282293 316110
11904 316110 -36526 -100277 -68705 -122227 114079 -79672 10721 -72740 -23581 155395 52097
11892 -337147 -59102 121035 57760 -322927 -243695 -244519 -67099 -6823 -113191 -187896 102000
11880 -304147 178783 57314 -71303 -201410 197286 -25378 95904 -33416 -93184 -20321 95904
11868 -215461 -81067 34992 19019 148419 134091 78812 -261627 -216727 -222081 -262958 334034
11856 7895 258358 221282 122250 -2286 134041 -14339 -371620 59486 -115448 -31234 73965
11844 19849 82610 -123894 -164759 -54772 79454 -293028 -78432 6492 56641 3808 -237205
$$ packed form
11925a00202j13847o4327H5977a37562L2880N2042l24903A77399J12983i5228
11914c9717A60007b62138c4811C31882a78615I9407J55190c23465B82293L3817
11904C16110c6526o3751L1572n3522A14079g9672A0721g2740b3581A55395E2097
11892c37147e9102A21035E7760c22927P9232q24f7099f823j06368p4705A02000
11880c04147A78783E7314g1303j30107A97286b5378I5904c3416n9768b0321I5904
11868b15461h1067C4992j5973J29400j4328n5279b61627M4900n354m0877C34034
11856G895K50463l7076r9032b286A34041a4339l57281E9486a15448c1234G3965
11844A9849O2761a23894m0865e4772G9454b93028g8432F492N0149C808b37205
$$ plain form
11832 -84030 -298868 -7664 306971 151474 -77880 129954 -190547 -382720 -394855 -167894
11821 264281 -299038 -44390 62235 -121330 167410 210412 -128894 -195818 196061 249762
11811 249762 -222917 99570 554072 -86115 257799 -106359 -115620 -155135 357799 -28500 55463
11799 -138260 -173151 137496 5360 -138013 -94718 -148368 -273136 -1596 531000 -207388 426576
11787 29915 59628 156037 -16284 -120525 338802 -11839 -398267 -140603 138736 214872 -59878
11775 -74848 100251 297512 -245095 45478 -53361 116129 169338 -109753 64822 8054 -66274
11763 -176879 -93823 -232546 155368 -184414 -14476 -24942 -150246 348703 5848 -104588
11752 146871 -2380 -138198 -105192 -110095 -35750 45018 232735 -216040 146485 161792 -187755
$$ packed form
11832h4030k14838g664C06971A51474g7880A29954a90547j92173j2135a67894
11821B64281b99038d4390F2235a21330A67410M3002a28894o6924A96061N3701
11811B49762b22917I9570M54502h6115B57799a06359r261l9515C57799b8500E5463
11799a38260l4891A37496E360a38013M3295n3650j24768a596E31000b07388D26576
11787B9915K9713R6409a6284j04241C38802a1839l86428a40603A38736P6136e9878
11775g4848A00251J97261b45095D5478e3361A16129N3209a09753F4822H054f6274
11763a76879Q3056j38723A55368a84414a4476j0466j25304C48703E848a04588
11752A46871b380j35818L3006m903c5750D5018J87717b16040A46485J5307a87755
$$ plain form
11740 -294848 -165516 -25656 160850 -257999 -54312 319296 43084 84853 141683 -305779
11729 47368 200597 101960 -158445 -98580 163302 25940 -53162 -36879 173820 260692 -22041
11717 -244101 107681 -233483 192200 56723 115362 219742 364012 -249002 -266990 -213728
11707 -213728 18611 -15915 117312 -57659 -29513 186608 373532 95588 134212 -52146 -208421
11696 -208421 98843 87585 -198740 -49714 -84682 -28110 -140749 -17332 -202710 293677 -71434
11684 -71980 -251644 130436 -443606 256631 -170277 179414 -136458 116825 391262 311743
11674 311743 128079 71477 33468 78587 146765 -15738 -322014 115956 182130 102495 184895
11663 184895 -143781 293945 -139379 199473 -27017 135836 111934 165019 195603 127329
$$ packed form
11740b94848J29332b5656A60850b57999e4312C19296D3084M1769N6830c05779
11729D7368J53229r8637a58445N9865A63302B5940e3162J6283A73820Q6872b2041
11717b44101A07681b33483A92200E6723N8639J04380J44270b49002j7988N3262
11707b13728A8611a5915A17312e7659K8146A86608J86924I5588L8624e2146j56275
11696b08421I8843j1258a98740d9714l4968b8110j12639a7332j85378B93677g1434
11684g1980j79664A30436d43606B56631a70277A79414a36458A16825K74437p9519
11674C11743A28079n6602C3468M5119O8178a5738l06276A15956O6174p9635Q2400
11663A84895a43781B93945a39379A99473b7017A35836k3902N3085L0584o8274
$$ plain form
11653 127329 1773 145565 -202234 134197 -30774 202519 -211822 58989 213154 113198
11643 113198 -7116 -54147 84280 -231936 84075 -42185 -160215 -79596 166884 60571 416244
11632 416244 -113908 -41908 -251534 -82564 206989 346308 131160 -9822 275366 -65081
11621 164586 175646 -211747 208203 -247082 -844 -39986 -81604 -23761 -508377 157196 -262835
11609 127319 51609 42376 -184838 -96519 197515 -64611 -46138 153672 274869 -101018 -129729
11598 -129729 -336841 328072 -34303 55344 -43582 42623 421164 144973 81243 145102 -100420
11586 342843 -274182 179468 490182 294143 163012 338882 -63096 -72220 -158243 226395
11575 240421 79103 13013 151874 63531 28453 -217128 171697 206581 -248189 -53489 31825
$$ packed form
11653A27329A773J43792b02234A34197c0774B02519b11822E8989J54165r9956
11643A13198g116m7031H4280b31936H4075d2185j18030g9596A66884F0571L55673
11632D16244a13908d1908k09626h2564B06989J39319A31160i822B75366f5081
11621A64586J1060b11747B08203b47082h44l9142m1618b3761m84616A57196b62835
11609A27319E1609r233a84838Q8319A97515f4611J8473A53672J21197a01018k8711
11598a29729k07112C28072c4303E5344d3582D2623L78541A44973o3730O3859a00420
11586C42843b74182A79468L10714j96039j31131J75870f3096r124q6023B26395
11575B40421G9103A3013J38861F3531B8453b17128A71697L4884b48189e3489C1825
$$ plain form
11563 402133 -22125 52980 82723 190343 -181280 -111258 411027 290529 134911 290439
11553 290439 146924 -262588 126276 275084 294332 318028 150871 19006 230377 -20777
11542 -109940 -199694 1245 336182 85781 -242294 193655 83798 65329 109862 335201 -16323
11530 -109300 41035 -7370 101856 220019 208307 327093 366518 29954 209551 139836 195990
11519 195990 107667 102105 197397 -15849 230368 140641 -50373 -80609 27638 286020 278531
11508 278531 -20340 -135582 156926 -161331 200804 31955 194032 168974 8088 314372
11498 314372 77892 189324 56499 206460 217717 108388 -204877 186134 635459 -38191
11487 154884 -128619 147511 -171180 -236775 -7630 97771 -63051 128691 410260 415361 260214
$$ packed form
11563D02133b2125E2980K9743J07620a81280P0022D11027j20498A34911J55528
11553B90439j43515b62588A26276J48808J9248K3696A50871A9006K11371b0777
11542a09940q9754A245L34937H5781b42294A93655H3798j8469M4533K25339a6323
11530a09300D1035g370A01856J18163j1712J18786L9425B9954J79597o9715N6154
11519A95990q8323n562R5292a5849B30368q9727e0373l0236B7638K58382p489
11508B78531b0340j15242A56926a61331B00804C1955J62077k5058H088L06284
11498C14372G7892J11432E6499J49961J1257A08388b04877A86134M49325c8191
11487A54884a28619A47511a71180o5595g630I7771f3051A28691K81569N101j55147
$$ plain form
11476 260214 137952 -169221 -28431 181952 252856 -30925 -180057 -8872 -23482 -151673 104274
11464 42620 -109222 167621 89846 310964 305414 -3030 111460 -51563 496354 412556 4647
11452 328830 193372 512478 24006 -13343 83985 67431 35531 -54705 410337 -7337 423392
11440 -113666 328520 -106256 111524 173111 -247567 163430 86544 141379 -25777 13527
11429 92622 50043 -32318 126427 230211 98814 -144554 -336046 410996 172163 -23614
11418 156597 136805 -127788 -219487 -255329 -181156 191242 428497 -56544 -256563 -38857 -89675
11407 -89675 148024 193653 231452 -3666 -71797 43704 90440 62955 -61136 94519 -168222
11395 206624 110472 13496 224803 -372499 468383 -32988 198999 -143940 34851 19707
$$ packed form
11476B60214j22262a69221b8431A81952P0904c0925j49132h872j4610j28191A04274
11464D2620a09222A67621p7775K21118n550c030A11460e1563D96354q3798D647
11452C28830j35458L19106B4006a3343H3985j6554l1900e4705D10337g337D23392
11440a13666C28520a06256A11524O1587b47567A63430p6886N4835b5777A3527
11429I2622m2579c2318A26427J03784I8814a44554j91492D10996A72163b3614
11418A56597j9792a27788r1699l5842P4173A91242K37255e6544k00019c8857n0818
11407h9675A48024M5629L7799c666o8131D3704M6736k7485f1136I4519a68222
11395B06624r6152A3496K11307c72499D68383c2988A98999a43940C4851j5144
$$ plain form
11385 19707 183977 393481 -287525 -162107 378945 -162802 -255595 -23223 -76431 -121159
11375 -121159 41976 -212536 -288377 55799 -307872 155104 186981 -595257 -237981 90402
11364 178371 -127931 91104 242863 -256966 165348 56307 -100277 -148113 110049 247899
11354 247899 -328208 195739 -22391 119410 -141035 119385 163727 14979 347307 -325021
11343 561320 270551 -177664 -168247 -221932 -37705 207289 219733 106974 -29151 -79525 177767
11331 -14101 33846 155117 -170108 -129841 327224 13370 -195586 -365757 212390 -61989
11320 -23791 283212 -298156 96298 -279281 77438 -174355 93356 159822 -46413 -364672 -249217
11309 -249217 198154 -155779 -241274 41644 124644 -120673 -351679 344680 -63167 -199043
$$ packed form
11385A9707J64270K09504b87525J25418C78945a62802r2793b3223n3208m4728
11375a21159D1976b12536p5841E5799c07872A55104L1877e95257b37981I0402
11364A78371a27931I1104J51759b56966A65348E6307a00277m7836A10049J37850
11354B47899c28208A95739b2391A19410a41035A19385M4342A4979L32328c25021
11343E61320B70551a77664R417n3685c7705B07289J2444A06974b9151n0374A77767
11331a4101C3846J21271a70108M0267C27224A3370a95586j70171B12390f1989
11320b3791B83212b98156I6298b79281G7438a74355I3356O6466d6413l18259J15455
11309b49217A98154a55779q5495D1644Q3000a20673k31006C44680f3167j35876
$$ plain form
11299 -199043 69912 -283599 -85054 -18957 -129969 -186684 -108545 88422 -133713 132201 123521
11288 123521 -5005 -37245 23076 -166943 110927 -51854 75793 -98885 133169 66283 -80919
11276 -280131 112031 -149670 -51301 42895 -120302 217041 -246226 -259171 158305 -76931
11265 4807 -42997 -272286 -16376 -77862 67329 -147076 -384427 -31976 117298 348534 179761
11254 179761 136665 -160230 -141791 78416 -40141 189632 295720 181730 -43335 -363923
11244 -363923 -20170 42586 74196 135328 -147493 -167299 -189590 -54865 -195267 -226089 -343688
11233 -343688 -63839 55982 -13533 -3630 -72595 14534 243590 -145194 -251830 31535 -44540
11221 -110025 287180 -140386 239479 158336 -5681 -195731 -65875 232636 -253094 153470
$$ packed form
11299a99043F9912b83599h5054a8957j11012n6715P8139H8422a33713A32201q680
11288A23521e005l2240B3076a66943A10927e1854G5793i8885A33169F6283h0919
11276b80131A12031a49670e1301D2895a20302B17041b46226j2945A58305g6931
11265D807d2997k29289a6376o1486F7329a47076k37351c1976A17298K31236j68773
11254A79761m3096a60230J8439G8416d0141A89632J06088j13990d3335l20588
11244c63923b0170D2586L1610O1132a47493j9806k2291e4865j40402l0822j17599
11233c43688f3839E5982a3533c630o8965A4534K29056a45194j06636C1535d4540
11221a10025B87180a40386B39479q1143e681j90050f5875B32636b53094A53470
$$ plain form
11210 184526 147990 307898 198206 -120628 223399 36618 46140 10368 -112833 9199 -255427
11198 -140605 -90289 59624 -3854 -231367 -249596 -153989 132550 -35956 -234150 -93705 -221299
11187 -221299 -381635 136166 -22960 -74540 -121325 114788 -457213 -28201 -114599 297582
11176 -120510 319653 318131 99458 176910 236193 112135 -101774 173712 -136600 -235227 -302684
11165 -302684 -280873 -271829 180763 48674 331913 -182250 208699 107938 12679 -27120 -158555
11154 -158555 230770 -353636 26208 217855 68754 151973 -215696 -96118 -281447 180661
11143 -132193 156963 23311 -55964 119979 -184083 -37840 358087 -206512 -295615 -235129
11133 -235129 355327 -73702 112202 -90185 40585 502690 -31924 -188260 -88714 263297
$$ packed form
11210A84526l6536J59908j09692a20628B23399C6618R522A0368a12833I199b55427
11198a40605N0316E9624c854k27513j8229R5607A32550c5956j98194i3705j27594
11187b21299j60336A36166b2960n1580m6785A14788d57213b8201q6398B97582
11176a20510C19653j522I9458P7452N9283A12135a01774A73712a36600r8627o7457
11165c02684K1811R044A80763D8674K83239a82250B08699j00761A2679b7120j31435
11154a58555B30770c53636B6208J91647F8754Q3219b15696i6118j85329A80661
11143a32193A56963B3311e5964A19979a84083c7840C58087b06512q9103O0486
11133b35129C55327g3702A12202i0185D0585M62105c1924j56336h8714B63297
$$ plain form
11122 -18450 208838 439237 4986 33924 204583 156039 147578 224766 -307144 -62228 -43525
11111 -43525 85597 224456 -245608 86735 311250 29147 -151483 -175741 164446 112397 217605
11100 217605 158157 69394 159937 57567 397333 389046 544913 58133 -177326 218548 231853
11089 231853 294834 119728 21046 78348 166153 207626 455511 365799 313469 -80677 530080
11077 327685 166619 366609 164452 224306 422969 336423 387204 119978 -71016 169732
11066 574493 495534 394242 442641 411329 297447 497956 499808 468106 601903 692112 583000
11055 583000 495078 832031 383504 598372 805259 770306 909959 771811 497150 730197
11045 730197 927930 838949 785994 980807 623891 970905 875739 850345 785175 533059
$$ packed form
11122a8450B08838K30399D986K8938J70659m8544q461P7188c07144f2228J8703
11111d3525H5597J38859b45608H6735K24515B9147a51483k4258A64446n2049J05208
11100B17605n9448F9394R0543E7567L39766q287J55867E8133a77326B18548J3305
11089B31853O2981A19728B1046N7302Q7805M1473K47885q9712n2330h0677E30080
11077C27685j61066J99990A64452N9854J98663q6546N0781A19978g1016A69732
11066E74493p8959j01292M8399l1312j13882K00509J852l1702J33797R0209j09112
11055E83000q7922L36953C83504K14868K06887l4953J39653j38148k74661K33047
11045G30197J97733q8981n2955J94813l56916L47014r5166k5394o5170k52116
$$ plain form
11035 533059 196545 686720 699922 1007053 601962 840759 1032400 996085 762603 1130717
11025 1130717 825282 947200 720101 674068 572197 506252 660009 692688 631834 1001132
11015 1001132 663168 507784 594220 460407 304856 398192 758394 852043 637643 726274
11005 726274 470778 803661 640034 811880 597671 859922 637370 660116 635232 895317
10995 895317 709455 850895 851438 762981 791245 884906 982341 763957 1041996 942168 1010006
10984 1010006 1256351 922883 919150 1032743 1325449 1342219 1460365 1842850 2272371 2308320
10974 2308320 2612629 2638080 3274795 3329652 2922171 3192162 3390488 2742556 2178176 2471530
10964 2471530 2045050 1877714 1611815 1510009 1717967 1334180 1505807 1737238 1534389
$$ packed form
11035E33059A96545M90175J3202L07131m05091K38797J91641l6315k33482L68114
11025A130717l05435J21918k27099m6033j01871o5945J53757L2679o0854L69298
11015A001132l37964j55384Q6436j33813j55551R3336L60202R3649k14400Q8631
11005G26274k55496L32883j63627J71846k14209K62251k22552K2746k4884K60085
10995H95317j85862J41440N43q8457K8264R3661R7435k18384K78039r9828O7838
10984A010006K46345l33468l733J13593K92706J6770J18146L82485M29521L5949
10974B308320L04309K5451O36715N4857m07481K69991J98326o47932n64380K93354
10964B471530m26480j67336k65899j01806K07958l83787J71627K31431k02849
$$ plain form
10955 1534389 1654360 1184048 1416418 1023506 870702 521993 659600 491452 214624
10945 258089 289191 231870 335728 255371 84483 251393 68220 176325 319502 -324041
10934 50070 155567 134151 432900 313163 -23304 41023 24015 -155501 132312 304055
10924 304055 91175 222637 -122451 -47732 60328 -177368 -61556 -119126 204826 -94895 219651
10912 -113472 -176704 12721 -133267 82368 -125199 156868 395446 -6119 121974 159048 3609
10900 -9556 -86414 -325148 32849 -179621 222003 -195711 47328 156292 -167278 -86919 -427287
10889 -427287 66601 121738 242216 -4839 242569 -110630 213127 189466 -31252 -127500 104410
10877 65448 138797 8905 -195206 -201592 -218571 -395691 197854 104377 -187415 303831 109205
$$ packed form
10955A534389J19971m70312K32370l92912j52804l48709J37607j68148B14624
10945B58089L1102n7321J03858q0357H4483J66910F8220J08105J43177c24041
10934E0070J05497k1416K98749j19737b3304D1023j7008a55501A32312J71743
10924C04055I1175J31462a22451d7732F0328a77368f1556n7570B04826i4895B19651
10912a13472o3232A2721a33267H2368a25199A56868K38578f119A21974L7074C609
10900i556p6858k38734C2849a79621B22003a95711D7328J08964a67278Q0359l40368
10889d27287F6601N5137J20478d839B42569a10630B13127k3661c1252r6248A04410
10877F5448P3349H905a95206o386j6979j77120A97854r3477a87415C03831A09205
$$ plain form
10865 -11917 -33225 -300683 -365581 26412 -122740 -303226 -41229 -179488 -97743 -100514 52380
10853 -205149 -204016 374624 -29913 -234208 -17727 -241348 300066 39222 195320 197217 176454
10842 176454 -1857 103126 105109 115134 -114121 -119486 53734 191494 -3569 166155 -127184
10830 -2922 66801 -137785 -265188 45909 -3408 -81363 75868 -142206 91975 -55863 155804
10818 -72220 146729 -128639 -289141 81097 -21719 86570 55921 74676 192878 110684 156317
10807 156317 -172616 -222010 -4780 -119202 21793 140138 -132125 -12475 -52008 44126 186657
10796 186657 -66425 -3231 265174 83589 -150342 107529 218575 88822 416366 -245587
10785 -211208 219702 249456 -66021 248343 -188533 47635 -265183 23373 44703 -125180
$$ packed form
10865a1917k1308k67458o4898B6412a22740j80486d1229j38259Q1745k771E2380
10853b05149J133C74624b9913k04295a7727k23621C00066C9222J56098J897k0763
10842A76454a857A03126J983J0025a14121n365E3734J37760c569A66155a27184
10830b922F6801a37785j27403D5909c408p7955G5868a42206I1975e5863A55804
10818g2220A46729a28639j60502H1097b1719H6570l0649J8755J18202q2194M5633
10807A56317a72616m9394d780j14422B1793J18345a32125a2475l9533D4126J42531
10796A86657f6425c231B65174H3589a50342A07529J11046H8822L27544b45587
10785b11208B19702K9754f6021B48343a88533D7635b65183B3373K1330a25180
$$ plain form
10774 -286179 -69893 -112245 -325020 105487 -227354 -6259 -49995 262808 -108979 -5851 -257428
10763 -257428 31596 62610 61738 -126184 -187503 303401 -1101 64937 140569 16119 -26185 -62033
10751 -62033 -69434 56906 265743 -339410 176669 136105 -121922 58943 68495 -1578 60623
10739 -132689 -227238 11612 -122914 -124714 -189149 -214336 -142971 35763 -255003 -321648 -225816
10728 -225816 -114104 73499 -104272 -5919 -135067 105931 -296093 -247048 -146190 36049
10717 -99687 173284 -36976 223852 66508 -170582 -172012 -110229 213310 -194285 26332 -159012
10705 -22915 316341 -45357 11757 -63232 28245 7573 -1871 -400099 -169120 -109766 88301
10693 -239267 -116710 -136120 125668 -98605 85210 -424903 283218 -102108 -271473 126611
$$ packed form
10774b86179f9893m2352k12775A05487b27354f259m3736B62808a08979e851k51577
10763b57428C1596L1014q72a26184o1319C03401a101F4937P5632A6119b6185l5848
10751f2033p401E6906K08837c39410A76669m0564a21922E8943R552a578F0623
10739a32689r4549A1612a22914j800o4435k5187P1365C5763b55003o6645R5832
10728b25816J11712G3499a04272e919j29148A05931b96093M9045J00858C6049
10717i9687A73284c6976B23852F6508a70582j430O1783B13310a94285B6332a59012
10705b2915C16341d5357A1757f3232B8245G573a871l98228a69120N9354H8301
10693b39267a16710j9410A25668i8605H5210d24903B83218a02108j69365A26611
$$ plain form
10682 77991 -37430 -40755 -24743 -90365 -21877 204885 -80574 -44973 171609 -34545 -282642
10671 -282642 53160 -89641 315590 -382842 -52217 -376800 -94757 -194109 -712 -52091 138857
10659 83113 38540 16432 254896 -42947 -24536 -205411 -145570 53933 -259764 -219412 -304058
10648 -304058 -66054 -66071 134391 -88351 202692 -68713 57943 -36163 -22327 377277 -204395
10636 112371 -146127 -48347 -243127 -127645 240966 77745 68490 -254698 -230844 -34358 -100031
10625 -100031 -87494 -138787 -29231 30767 158818 158973 105288 -197884 -330948 126978 76039
10614 76039 -35096 -123558 137006 -47401 260169 -19827 14320 125058 -53864 172867 99514
10603 99514 -392050 -191073 -62392 -64629 -142039 211197 -320385 -119935 -48067 -46951 -27514
$$ packed form
10682G7991c7430l325J6012o5622b1877B04885h0574L5601A71609c4545k48097
10671b82642E3160h9641C15590c82842e2217l24583i4757r9352g12n1379A38857
10659H3113C8540A6432K38464d2947J8411j80875N9841E3933b59764M0352q4646
10648c04058f6054j7A34391h8351B02692f8713E7943c6163J3836C77277b04395
10636A12371a46127d8347j94780J15482B40966G7745r255b54698K3854c4358o5673
10625a00031J2537n1293b9231C0767J28051J55n3685a97884j33064A26978n0939
10614G6039c5096q8462A37006d7401B60169a9827A4320J10738e3864A72867p3353
10603I9514c92050a91073f2392k237p7410B11197c20385a19935d8067J116J9437
$$ plain form
10592 -27514 -11785 2997 28072 142220 -371516 -159272 -187273 -203172 188657 24753 -144441
10580 317019 -140575 -65217 -174976 148404 51045 -63271 116614 257151 101789 73348
10570 73348 -252481 185503 211225 149236 -83255 -355608 166204 -1111 -33839 100890 -57282
10558 194445 173904 -85404 -305790 -162511 -8506 92647 110549 186151 155569 91864 -137208
10546 2409 243872 -302119 -20376 -83676 -133695 -260127 232660 -317075 -231879 -154705 -164564
10535 -164564 -46673 62711 -87137 134992 53489 171020 -12934 -260179 -21821 -215134 -55609
10523 -105500 -212563 -216091 -45696 77798 93401 -34778 -14866 156947 -221257 -23749 197844
10511 242670 -208863 189174 -54606 363481 78887 -25942 -140124 -119888 -269678 -13844
$$ packed form
10592b7514a1785B997K5075J14148c71516a59272k8001j5899A88657B4753a44441
10580C17019a40575f5217j09759A48404E1045f3271A16614J40537A01789k8441
10570G3348b52481A85503K5722o1989h3255k72353A66204a111l2728A00890e7282
10558A94445k0541h5404k20386J43279h506I2647J7902P5602l0582o3705a37208
10546B409K41463c02119b0376o3300n0019j26432B32660c17075Q5196P7174r859
10535a64564d6673F2711h7137A34992E3489J17531a2934k47245b1821j93313e5609
10523a05500j07063l528d5696G7798J5603c4778a4866A56947b21257b3749A97844
10511B42670b08863A89174e4606C63481G8887b5942j14182K0236j49790a3844
$$ plain form
10500 -113563 -193900 137890 150903 -8302 -40894 -129749 24341 145119 232256 288809 171744
10489 171744 -81677 246155 -92903 151501 708 265623 170308 351242 -114618 364696 83092
10477 -67146 -46738 11077 -377326 159427 227277 532753 143561 235500 -218681 272753
10466 125058 -36052 -156384 21261 10240 103444 85732 112200 -356326 -459211 -161447 91817
10454 -32701 335143 -21183 351695 -169638 -128249 -7413 -106325 591606 194785 -38882 -670350
10443 -670350 -89774 -178940 100506 95351 -74770 2232 -204984 290233 386182 -17822 -96421
10432 -96421 -167912 -23576 261368 87004 -81991 89990 63735 -92255 102334 -150282 120745
10420 177677 20034 164704 150193 -179444 85116 350624 34709 -184695 -17915 98334 82283
$$ packed form
10500a13563q0337A37890J3013h302l2592q8855B4341J20778Q7137N6553j17065
10489A71744h1677B46155i2903A51501G08K64915r5315J80934a14618C64696H3092
10477f7146K0408A1077c77326A59427O7850L05476A43561R1939b18681B72753
10466A25058c6052j20332B1261A0240R3204j7712K6468c56326j02885a61447I1817
10454c2701C35143b1183C51695a69638M1389g413r8912E91606A94785c8882o31468
10443f70350h9774q9166A00506n155g4770B232b04984B90233R5949a7822p8599
10432i6421p1491b3576B61368H7004h1991H9990k6255i2255A02334a50282A20745
10420A77677B0034J44670j4511a79444H5116K65508C4709a84695a7915I8334j6051
$$ plain form
10409 82283 76434 146788 -19126 265676 -40206 -39428 -89608 -208390 -174280 359033 277697 -7878
10396 -22728 -174194 404905 -43212 -103623 169620 53750 216864 308548 118048 -9991 330864
10384 14638 307103 10063 -136474 203973 -2265 466027 -126709 386948 -87228 261346
10373 268600 376281 165877 129164 793177 548190 165427 435982 620742 301488 696197
10363 696197 326064 328481 386855 -158211 357178 311454 2198 -95737 578015 299525 364228
10352 364228 444907 582004 383879 446517 99962 465514 -6622 102542 408786 480133 264061
10341 264061 181418 82318 330785 189441 148943 467389 109918 202312 -268419 96648
10330 413306 -335064 148051 -19839 -16846 77360 342366 131620 32919 276187 181234 546139
$$ packed form
10409H2283n849P0354a9126B65676d0206P78n0180j18782L4110C59033q1336g878
10396b2728j51466D04905d3212o0411A69620E3750J63114R1684A18048i991C30864
10384A4638K92465A0063a36474B03973b265D66027a26709C86948h7228B61346
10373B68600J07681A65877l6713O64013k44987A65427K70555J84760C01488L94709
10363F96197C26064K417N8374a58211C57178m5724B198i5737E78015k78490O4703
10352C64228Q0679J37097j98125O2638I9962L65552f622A02542L06244P1347k16072
10341B64061q2643H2318K48467j41344m0498L18446A09918R2394b68419I6648
10330D13306c35064A48051a9839K993G7360K65006A31620C2919K43268r4953L64905
$$ plain form
10319 546139 225278 22788 -123104 265729 297226 -55750 122552 -241178 189199 -105554
10308 -215996 -42748 -136634 -148325 39380 199766 123698 31496 18493 7948 -104964 -188247
10297 -188247 91080 462256 354750 -284504 -197795 168427 14743 -81727 -116883 482828
10286 288550 -51541 -44160 -331455 -443268 -178963 15277 120493 51032 -75088 86912 228296
10275 228296 -209267 -161399 154712 248310 82052 -23220 -166195 -216204 -267453 -182605 189550
10263 141834 198208 533738 -104685 146900 259980 273780 -109470 146238 18772 75421
10253 75421 264358 -285228 -158610 -52350 -66074 37813 -594414 -17339 -105121 -45911 -423962
10242 -423962 4473 -17458 -255539 257929 -144525 -69720 169609 -156792 38922 -301419
$$ packed form
10319E46139B25278B2788a23104B65729L1497e5750A22552b41178A89199a05554
10308b15996d2748r3886j1691C9380J60386p6068C1496j3003G948a04964q3283
10297a88247I1080L71176j07506b84504Q6709A68427A4743h1727l5156D82828
10286B88550e1541P381k87295j11813a78963A5277J05216E1032g5088H6912J41384
10275B28296b09267M7868A54712R3598H2052b3220j42975n0009n1249Q4848A89550
10263A41834N6374L35530a04685A46900J13080J3800a09470A46238A8772N6649
10253G5421J88937b85228J26618e2350j3724C7813e94414a7339q7782d5911l78051
10242d23962D473a7458k38081B57929a44525f9720A69609a56792C8922c01419
$$ plain form
10231 -137269 -14135 -21883 2690 38623 18987 -95712 -198272 -60003 -299006 323477 -102739
10219 -30083 -2316 329720 -343987 276007 270174 53267 205478 -188330 64731 -99372 276449
10207 34919 -128026 4134 101881 243907 -3224 79766 -291757 74101 -271329 -98919 26863
10195 -77633 -48440 -38730 -91354 334252 -240524 59862 226888 225528 -100054 39619 -399200
10183 -270910 -90140 184580 52324 -98903 -93376 -132189 91450 -107054 -232472 -222477 -111793
10172 -111793 244150 -380499 127207 -142030 -61861 -186946 -134941 -257194 239285 -175473
10161 45133 156655 -19471 41430 -293072 -256371 28232 23405 23559 -147835 -153477 -39052 -281715
10149 -281715 24877 148002 90535 6741 -237900 -4826 -363264 -37805 -219770 226951 79487
$$ packed form
10231a37269a4135p748B690L5933A8987i5712j02560f0003k39003C23477a02739
10219c0083b316C29720c43987B76007n833E3267J52211a88330F4731i9372B76449
10207C4919a28026D134R7747J42026c224G9766b91757G4101b71329i8919B6863
10195g7633K9193R710n2624C34252b40524E9862J67026j360a00054C9619c99200
10183b70910i0140A84580E2324i8903N527l8813I1450a07054j25418R995J10684
10172a11793B44150c80499A27207a42030f1861j25085N2005j22253B39285a75473
10161D5133J11522a9471D1430b93072L6701B8232m827J54a47835n642c9052k42663
10149b81715B4877J23125n7467F741b37900d826l58438c7805j81965B26951G9487
$$ plain form
10137 244365 81106 187893 195979 -25767 -136649 152207 109130 -161599 -307021 -194510
10127 -194510 -290179 57815 58087 -104596 39473 110784 82696 -169482 -152090 278532 -187506
10115 -141364 -430382 54446 -33323 101836 -119112 -72168 -207903 -169983 -364500 -135992
10104 -322002 -221805 -21237 24549 -20530 -222370 34250 -181073 201256 9803 -184944 153367
10092 56843 226598 -198481 170441 43033 -198630 -432238 14239 110850 323887 -41970
10081 83752 -372006 100835 12305 16278 53694 173647 -99427 -103077 -51141 -121383 -10089
10069 -272774 -266982 79028 -208518 37081 -368596 21420 91392 -35461 -109215 87979 -45739
10057 276029 -294051 -252649 -127631 -446 49112 -9416 -79126 -42414 -89379 -282769 40110
$$ packed form
10137B44365H1106J06787Q086b5767j10882A52207m3077a61599j45422J12511
10127a94510r5669E7815K72a04596C9473P1311k8088a69482J7392B78532a87506
10115a41364k89018E4446c3323A01836a19112M6944j35735L7920j94517a35992
10104c22002J00197b1237B4549b0530k01840C4250a81073B01256I803a84944A53367
10092E6843J69755a98481A70441D3033a98630k33608A4239R6611K13037d1970
10081H3752c72006A00835A2305L973L7416J19953i9427l650e1141p0242a0089
10069b72774N792G9028b08518C7081c68596B1420O9972c5461p3754H7979d5739
10057B76029b94051M1402J25018d46D9112i416o9710L6712m6965j93390D0110
$$ plain form
10045 117142 -245634 -83117 -365438 49435 291368 86866 -48145 109021 -155605 8265 936
10033 59457 -66947 17568 -27129 301017 -76140 9823 -184619 -125773 55244 -361026 -16519
10021 -100920 -266121 71665 74206 170320 106477 31600 -112675 -206361 -142201 -123569 71437
10009 150572 -78820 -40884 207003 23600 -50116 -109466 -27670 77020 -190986 -136506 -64155
9997 -49654 123656 -384428 68386 -235023 -158134 151767 -5568 -376504 409046 64897 -233839
9985 -164687 -123164 203036 -239476 12604 -114345 -37353 -46085 10096 -114784 -127749 -28249
9973 317507 -215156 -369452 37951 -456002 -111668 -99250 4498 138057 -330141 156842
9962 -45528 108897 345763 -458924 -63335 -338968 111508 3836 66026 180717 -74279 -168517
$$ packed form
10045A17142b45634h3117k82321D9435K41933H6866d8145A09021a55605H265I36
10033E9457f6947A7568b7129C01017g6140I823a84619N8846E5244c61026a6519
10021a00920j65201G1665K541R6114o3843C1600a12675r3686O4160J8632G1437
10009A50572g8820L7936B07003B3600e0116n9350b7670G7020a90986N4480f4155
9997d9654A23656c84428F8386b35023P6889A51767e568l70936D09046F4897b33839
9985a64687M1523B03036b39476A2604a14345c7353q732A0096a14784j2965b8249
9973C17507b15156j54296C7951d56002a11668J2418D498J33559c30141A56842
9962d5528A08897K36866d58924f3335k75633A11508C836O2190J14691g4279r4238
$$ plain form
9951 -168517 58503 87044 -362083 -44949 251015 -230056 -153507 -103208 118317 -34950 -45690
9940 -45690 -89241 -111762 245349 -117240 -98361 -30406 194745 -98384 43681 -175880 187316
9928 41757 -40786 -87833 127401 -50384 -382039 -182577 -70225 -125989 172159 -161345 -77379
9916 -151271 -82805 96175 56969 -54574 -354859 199834 -295312 -148580 -200243 -129607 -127431
9905 -127431 -223380 -92532 -29500 -16512 -51273 444882 -428608 -177821 -15993 136520 -189779
9893 -207687 -212941 -329145 -162040 109447 6371 -323304 -50728 -320179 -67978 -15822 35094
9881 -439472 263238 -188434 199545 -140020 -142010 -114419 -97991 -185438 11492 28833 30830
9870 30830 -133964 -280273 -182644 -275052 -117151 53353 161271 74833 -211794 -14772 -136924
$$ packed form
9951a68517E8503K8541c62083d4949B51015b30056P6549N0299A18317c4950j0740
9940d5690m3551k2521B45349a17240J8879c0406A94745i8384D3681a75880A87316
9928D1757d0786m7047A27401e0384l31655a82577g0225n5764A72159a61345g7379
9916a51271O8466I6175l9206e4574l00285A99834b95312J46732n1663P0636K176
9905a27431r5949i2532b9500J2988l4761D44882d28608a77821a5993A36520a89779
9893b07687n254j16204a62040A09447F371c23304e0728k69451f7978a5822C5094
9881d39472B63238a88434A99545a40020j990K7591J6428q7447A1492J7341J997
9870C0830a33964j46309R7629r2408a17151E3353J07918G4833b11794a4772j22152
$$ plain form
9859 -136924 -308800 -91923 -375259 21991 -228095 -55106 -3958 156281 -31198 -76548 -25405
9847 -237972 232530 -85780 123920 293485 -167668 -290948 -303518 -32874 65561 100975 -179362
9835 48370 -124950 -210604 -61052 -473608 -124075 126712 -144526 -249802 194223 -1136 210871
9823 -222550 -26310 -48227 -62734 -50068 332488 -347025 -398010 150373 76572 130038 279180
9812 279180 104974 -132171 -285262 -169709 -29094 -53158 -24669 69147 -205262 -94356 -231159
9801 -231159 322062 -303374 -224383 -281074 64741 -232974 137047 151418 98681 -160026 44157
9789 -235812 -197352 127494 -304809 -200164 177682 -30686 -105398 -280189 -268722 -241227 -200326
9778 -200326 -459493 177346 108954 -141451 -47136 -135787 -309804 -72661 -194052 -21164 92989
$$ packed form
9859a36924j71876i1923k83336B1991b28095e5106c958A56281c1198m5350b5405
9847b37972B32530h5780A23920J69565a67668j23280j2570c2874F5561L5414a79362
9835D8370a24950q5654f1052m12556a24075A26712a44526j05276A94223a136B10871
9823b22550b6310k1917j4507J2666C32488c47025n0985A50373p3801N3466J49142
9812B79180A04974a32171j53091J15553b9094k4064b4669F9147b05262i4356j36803
9801b31159C22062c03374P8991n6691F4741b32974A37047J4371n2737a60026D4157
9789b35812L8460A27494c04809J04645A77682c0686p4712j74791J1467K7495M0901
9778b00326k59167A77346o8392a41451d7136q8651j74017g2661j21391b1164I2989
$$ plain form
9766 -68775 -221044 -217452 -208986 169721 -135968 -185538 -240025 -169331 -332 -103481 160314 73665
9753 -51890 -352961 -65007 144868 -132665 -50368 -54640 -430078 -29053 357944 80974 -237751
9741 -344198 -77054 -41973 232859 -328157 -99869 -157183 86943 -62471 17100 -62570 -289276
9730 -289276 -26661 64627 253985 -206793 100569 261157 69958 -35504 55894 -340093 -314142
9719 -314142 -48720 -94413 -258438 -171003 32569 -249098 -230606 -165992 -149375 -267551 1287
9707 -248445 71505 -243306 75418 -17774 -113405 -111845 -152407 -97713 -87660 -43831 79773 -81131
9694 -392830 -25553 -70386 -258228 -346573 -77740 -213300 -68531 -56450 -63069 -223046 84304
9682 -92169 285554 -116844 162656 3979 -253405 -231306 213102 -83807 -224019 -29084 12680
$$ packed form
9766f8775j52269L592Q466A69721a35968m9570n4487P0694c32j03149A60314G3665
9753e1890l01071f5007A44868a32665e0368m272l75438b9053C57944H0974b37751
9741c44198g7054L5081B32859c28157i9869n7314H6943f2471A7100f2570k26706
9730b89276b6661F4627J89358b06793A00569J60588F9958c5504E5894c40093K5951
9719c14142d8720m5693j64025Q7435C2569b49098J8492O4614J6617j18176A287
9707b48445G1505b43306G5418a7774r5631J560m0562N4694J0053M3829G9773h1131
9694c92830b5553m4833j87842q8345g7740j35560f8531J2081o619j59977H4304
9682i2169B85554a16844A62656C979b53405K2099B13102h3807j40212b9084A2680
$$ plain form
9670 355173 23479 -31874 186433 55394 81937 109326 -151787 10064 -139895 227398 -163579
9658 17884 -7277 -81816 216665 -114081 -114765 81579 -447192 -48104 96370 84764 -250211 -163209
9646 -163209 -234406 -307638 -370967 249389 -50028 200443 12158 -86860 85788 -254616 -204476
9635 -204476 170078 -97333 -58739 -227771 249442 -324515 -166292 -152812 24325 30531 -124615
9623 -67648 -75067 -232345 158408 220660 -457997 2901 -96410 93324 -145095 -180650 -39405
9611 64213 -122822 -154125 4886 259313 14908 -257976 270741 102860 -34788 93330 -206129
9599 -183622 -271234 299747 102768 65890 78942 -23546 -112371 -51131 -158624 33105 -82373
9587 -149426 -287375 -21607 -123107 -258496 74295 -59883 -232295 60744 -21991 12530 46436
$$ packed form
9670C55173B3479c1874A86433E5394K6543K7389a51787A0064a39895B27398a63579
9658A7884g277p4539B16665a14081o84H1579d47192d8104I6370j1606b50211Q7002
9646a63209p1197p3232o3329B49389e0028B00443A2158h6860H5788b54616N0140
9635b04476A70078i7333L8594j69032B49442c24515J58223J3480B4325O206a24615
9623f7648p419j57278A58408O2252d57997B901i6410I3324a45095l5555c9405
9611F4213a22822l1303D886K54427A4908b57976B70741A02860c4788I3330b06129
9599a83622q7612B99747A02768l6878J3052b3546q8825e1131j07493C3105h2373
9587a49426j37949b1607j01500j35389G4295e9883j72412F0744b1991A2530L3906
$$ plain form
9576 46436 171875 313018 -414363 -223496 -237575 -261362 -105881 49419 -180647 -256220 -105433
9564 -96975 -53663 -34844 194605 -170665 133704 163775 -397875 -14732 -234177 -86806 147942
9552 -128245 24540 -99103 27779 -78792 -207999 -77503 -193501 170220 -238918 31253 -439579
9540 -297522 278493 3304 -123891 331588 140705 -43483 365294 -286824 160668 89885
9530 89885 -187690 -114669 -26498 -216005 191686 20627 -255599 -132667 -239908 133192
9519 -270178 -145509 125384 208630 -55165 -84948 -112090 41428 -274733 360250 -166994 -57029
9507 -38857 -92096 121713 -52032 -105707 -316341 -151295 -54661 -66180 75407 18572 -214388
9495 -1205 -143343 -332164 -145541 33990 -75590 -376490 304166 20090 -107872 17584 322543
$$ packed form
9576D6436J25439J41143d14363J90867j4079k3787a05881D9419a80647p5573a05433
9564i6975M3312J8819A94605a70665A33704L0071c97875a4732k19445h6806A47942
9552a28245B4540i9103B7779g8792j29207g7503j15998A70220b38918C1253d39579
9540b97522B78493C304a23891C31588A40705d3483C65294b86824A60668p0783
9530H9885a87690P3021b6498j89507A91686B0627b55599J22932j07241A33192
9519b70178J24669A25384Q3246e5165k9783k7142D1428b74733C60250a66994e7029
9507c8857n3239A21713e2032n3675k10634a51295e4661j1519G5407A8572b14388
9495a205j42138j88821a45541C3990g5590l00900C04166B0090a07872A7584L04959
$$ plain form
9484 322543 -190377 -30188 -281716 -134897 -214901 -377369 -87201 63948 -151326 -176930 257904
9472 199283 16657 -161959 36515 -7729 -326370 31890 100214 117528 -130745 -57775 161157
9460 -237649 161702 161187 -71819 -42332 188477 -110139 81747 -66218 25548 128701 -274583
9448 -159853 -135046 153045 -204296 -71113 -187335 -272587 -196930 46206 -105028 69419 183330
9437 183330 411721 -23478 81574 -224493 166825 -149179 -326168 144267 73806 -424139
9426 2324 -78256 -207087 -240889 -422358 -71813 30285 -44391 1969 98510 195529 228943 82073
9413 -231854 -97455 286517 -149030 -75839 -93899 -338007 -105559 -240465 -181025 16724 -224081
9401 38259 255263 165528 117937 -308157 -88081 -52472 2243 -226392 -183842 -25470 -526422
$$ packed form
9484C22543a90377c0188k51528a34897q0004j62468h7201F3948a51326k5604B57904
9472A99283A6657a61959C6515g729l18641C1890O8324J7314a30745e7775A61157
9460b37649A61702n15g1819K9487A88477a10139H1747f6218B5548J03153b74583
9448a59853K4807A53045b04296g1113j16222q5252P5657D6206a05028F9419J13911
9437A83330K28391b3478H1574b24493A66825a49179j76989A44267p0461d24139
9426B324g8256j28831l3802j81469g1813C0285d4391A969R6541R7019L3414H2073
9413b31854i7455B86517a49030P3191j8060k44108a05559j34906N9440A6724b24081
9401C8259K17004q9735m7591c08157h8081L5609B243b26392M2550b5470n00952
$$ plain form
9390 -526422 167497 69559 -234856 -160150 80934 -65071 -118264 -32550 155026 170638 96344
9379 96344 -56276 -383646 -120562 139106 -84411 -1287 -6438 -169041 -203056 -184468 -86003
9367 -45582 26205 58716 -157505 60883 -8365 -179943 -247205 9426 -11822 45876 23453 -165007
9354 -42196 -208065 83634 33342 54238 -86645 -357462 -399322 -19766 85392 189105 65151
9342 -31533 -181147 160246 3262 -116588 -92125 237547 89516 27509 -340310 -213264 -48227
9330 94070 -241593 -88790 59444 186083 -244921 -175796 80337 -237725 -47227 -193210 24355
9318 312863 -28365 -170130 -127311 -254845 -121002 47488 -6974 -249906 -139400 124033 -5424
9306 -111299 299276 199895 138367 22997 74647 78999 245418 30497 113987 -243999 -305726
$$ packed form
9390e26422A67497F9559b34856P4706H0934f5071n3193c2550A55026J5612p4294
9379I6344e6276l27370a20562A39106h4411a287n151j62603l4015J8588h6003
9367d5582B6205L2511a57505F0883h365j71578o7262I426a1822D5876k2423a65007
9354d2196j65869H3634C3342K0896h6645k70817m1860a9766H5392J03713F5151
9342c1533j49614A60246C262a16588K4463B37547H9516B7509c40310J27046d8227
9330I4070b41593h8790E9444J26639b44921O9125H0337b37725d7227j45983B4355
9318C12863b8365j41765M2819j27534a21002D7488f974k42932J10506A24033e424
9306a11299B99276r9381o1528B2997N1650M352J66419C0497Q3490b43999o1727
$$ plain form
9295 -305726 -108001 -159200 7489 192057 169126 -142192 -52005 303379 -127714 -301586 -88310
9283 -165897 -442872 -68915 -90930 -152555 -144100 -80911 200952 185540 -105873 -117964 28469
9271 -339921 -107870 68466 145389 34238 48335 130196 1011 125511 66678 -284183 -226927
9260 -226927 -148687 -215131 -152375 263343 -174570 136724 182006 -174676 12773 39221 -189916
9248 342911 132751 110649 -196670 57264 216452 -249662 -274958 170253 67665 5190 86469
9237 86469 46275 166914 -122933 -348024 -165386 -213462 121733 -33378 180787 -89473 -243366
9226 -243366 196850 -50885 -74992 74509 -152210 187065 -48053 104616 -37821 -705351 -165760
9214 -240459 74176 -152081 -135349 -133416 107039 399618 -138316 -4244 -61893 -218462 170187
$$ packed form
9295c05726a08001n1199G489J84568k2931a42192e2005C03379a27714j73872h8310
9283a65897k76975f8915k2015o1625Q455O3189B00952j5412a05873j2091B8469
9271c39921a07870F8466P6923C4238J4097Q1861A011J24500n8833b84183N7256
9260b26927P8240o6444O2756B63343a74570A36724M5282a74676A2773K6448a89916
9248C42911A32751k2102a96670E7264J59188b49662k5296A70253F7665E190Q1279
9237H6469m0194J20639a22933k25091a65386m8076A21733c3378A80787h9473j53893
9226b43366A96850e0885k4107G4509a52210A87065d8053A04616c7821o67530a65760
9214b40459G4176a52081J6732J933A07039K92579a38316d244n7649j56569A70187
$$ plain form
9202 173328 -29722 72236 189376 267879 -80284 -130493 -216911 70664 -257710 -16528 27722
9190 156318 26414 -382019 16839 -165562 -421140 -287515 -127318 -179279 -99734 -454793
9180 -454793 -238781 -23581 -130557 30523 -27473 48495 98876 28887 -155468 -23647 73193
9168 29209 -248413 -119838 89217 -64053 -222609 -231798 -2136 -386402 51432 -84063 -55130
9157 -55130 231405 213556 32978 -205721 128805 -180594 -21092 -143277 -171117 -288366 197248
9145 -12108 177315 20412 -34216 402118 13671 -144083 -144234 1998 -29584 57135 -266566 -105113
9132 21032 -52768 -27185 -376458 -168334 -41528 278606 620 -88313 -293221 -415448 -235116
9121 -235116 -10534 -21367 -134954 -240636 -5939 88471 -81441 506977 -322700 -113253 59225
$$ packed form
9202A73328b9722G2236J17140P8503h0284n0209q6418G0664b57710a6528B7722
9190A56318B6414c82019A6839a65562k55578J33625a27318n1961P9545l55059
9180d54793K16012b3581j06976C0523b7473D8495N0381B8887a55468b3647G3193
9168B9209b48413a19838H9217f4053j58556r189b136l84266E1432h4063K8933
9157e5130B31405j7849C2978b05721A28805a80594b1092j22185k7840j17249A97248
9145a2108A77315B0412c4216D02118A3671a44083j51A998b9584E7135b66566a05113
9132B1032e2768K5583l49273a68334d1528B78606F20h8313k04908j22227J80332
9121b35116a0534j0833j13587j05682e939H8471h1441E06977c22700a13253E9225
$$ plain form
9109 139631 1629 -54084 -475343 139109 -148552 30049 -17935 -232301 -291675 -6708 -270756
9098 -270756 103157 17145 -29605 -121951 -176266 -160623 -28603 -31380 5981 184585 115694 -325100
9085 -171067 8056 198612 -54039 -214910 -95334 -300639 -24275 -341092 -408124 243103 -98619
9073 111058 45543 -109387 41880 -375927 36981 -107444 -167153 -116840 -156821 66093 -251103
9061 -126725 113646 166942 -117356 -161527 -240205 -332082 -149585 -340089 122794 -164624
9050 58511 -456167 -23841 86584 -110119 -217676 72246 -48045 -403568 -147697 -87391 64530
9038 56397 -107806 -223258 46415 -4238 -57689 19277 121061 -108777 186299 127701 76301
9027 76301 -313484 19249 -220734 -146279 -94890 50268 23766 -216169 -29991 -5716 -331005
$$ packed form
9109A39631A629e4084m21259A39109a48552C0049a7935k14366n9374f708k64048
9098b70756A03157A7145b9605r2346n4315J5643b8603k777E981J78604o8891c25100
9085a71067H056J90556e4039j60871i5334k05305b4275l16817o7032B43103i8619
9073A11058D5543a09387D1880c75927C6981a07444n9709N0313l9981F6093b51103
9061a26725A13646N3296a17356m4171p8678r1877a49585j90504A22794a64624
9050E8511d56167b3841H6584a10119j07557G2246d8045l55523a47697O0306F4530
9038E6397a07806j15452D6415d238n3451A9277J01784a08777A86299n8598n1400
9027G6301c13484A9249b20734P4455N1389E0268B3766b16169b9991e716l25289
$$ plain form
9016 -331005 -322504 133568 24550 -8497 228721 -98707 -166334 -95373 -217267 -63443 172253
9004 150195 34887 7866 -151428 78581 -106640 -314832 -63271 -120384 -85340 -183740 158812
8992 781 -10260 -59713 213373 -70061 -20838 -51234 10107 -59365 -57986 -459083 190478 -14636
8979 336430 255532 -82059 -355873 18822 141948 -86131 29045 139423 83648 -115550 -93643
8968 -93643 -144964 64102 -286373 203250 65658 -42416 30824 -285518 -144010 -273720 -359728
8957 -359728 7652 157872 263258 -118079 -140902 67906 -90454 160606 8662 -27086 -130634
8946 -130634 -127035 160393 -67654 -5426 -28755 -183095 115320 -229829 -180276 -344489 366348
8934 478983 253617 -106850 7542 -173640 -298708 -168931 395856 513196 935635 2346533
$$ packed form
9016c31005Q501A33568B4550h497B28721i8707o7627P0961j21894f3443A72253
9004A50195C4887G866a51428G8581a06640k08192f3271n7113L5044r8400A58812
8992G81a0260m9453B13373g0061b0838l0396A0107e9365J379m01097A90478a4636
8979C36430q0898h2059k73814A8822J23126h6131B9045J10378n5775a15550K1907
8968i3643n1321F4102b86373B03250F5658d2416C0824b85518J41508j29710q6008
8957c59728G652J50220J05386a18079k2823F7906i0454A60606H662b7086j03548
8946a30634L599A60393f7654e426k3329j54340A15320b29829M9553j64213C66348
8934D78983k25366a06850G542a73640j25068J29777C95856J17340M22439J410898
$$ plain form
8924 2346533 3964886 5974525 19094768 8840876 2184227 766134 757114 312035 505500
8915 505500 221686 -77498 217532 127864 -151087 -211455 176050 478922 42128 258522
8905 258522 11892 -245591 129117 -179317 155792 -91408 169666 24976 -1348 -15500 145994
8893 -257697 -162155 103540 -31590 115474 -137267 206230 -218026 86127 230554 -128559
8882 -86902 -128571 -58203 -429135 -4291 434539 -77467 -122377 -40224 164604 -23902 -42214
8871 -42214 70281 -93002 -46166 -154074 -79833 -136801 70401 -69941 242306 53472 -91239
8859 188460 -205019 170191 -45176 -303355 145994 92762 -81998 141305 -282192 -300295
$$ packed form
8924B346533J618353K009639J3120243H840876B184227G66134r020C12035J93465
8915E05500B21686g7498B17532q9668a51087o0368A76050L02872D2128K16394
8905B58522A1892b45591A29117a79317A55792i1408A69666B4976a348j4152A45994
8893b57697R5542A03540c1590A15474a37267B06230b18026H6127J44427a28559
8882h6902m1669e8203l70932d291D34539g7467m4910d0224A64604b3902j8312
8871d2214G0281i3002d6166j07908P4241n6968G0401f9941B42306E3472i1239
8859A88460b05019A70191d5176k58179A45994n3232h1998A41305b82192j8103
$$ [...]
##END NTUPLES=NMR SPECTRUM
##END=
