##TITLE=AC1516_ROEFFECT0003_8201946_lysXHepDRr
##JCAMPDX= 6.0         $$ Bruker NMR JCAMP-DX V2.0
##DATA TYPE= NMR SPECTRUM
##DATA CLASS= NTUPLES
##ORIGIN= BRUKER
##OWNER= Administrator
$$ 1.72 TOPSPIN		Version 2.1
$$ 2013-09-26 20:10:16.142 -0700  Administrator@X
$$ Compression mode = diff/dup
##.OBSERVE FREQUENCY= 400.02188249412
##.OBSERVE NUCLEUS= ^1H
##.ACQUISITION MODE= SIMULTANEOUS (DQD)
##.ACQUISITION SCHEME= undefined
##.AVERAGES= 64
##.DIGITISER RES= 22
##SPECTROMETER/DATA SYSTEM= spect
##.PULSE SEQUENCE= noesygpps1d.comp
##.SOLVENT NAME= COFFEE_meoh
##.SHIFT REFERENCE= INTERNAL, COFFEE_meoh, 1, 14.96071
##AUDIT TRAIL= $$ (NUMBER, WHEN, WHO, WHERE, PROCESS, VERSION, WHAT)
$$ ##TITLE= Audit trail, TOPSPIN		Version 2.1
$$ ##JCAMPDX= 5.01
$$ ##ORIGIN= Bruker BioSpin GmbH
$$ ##OWNER= Administrator
$$ $$ E:\/data/COFFEE/nmr/AC1516_ROEFFECT0003_8201946_lysXHepDRr/12/pdata/1/auditp.txt
$$ ##AUDIT TRAIL=  $$ (NUMBER, WHEN, WHO, WHERE, PROCESS, VERSION, WHAT)
(   1,<2013-09-26 20:10:10.939 -0700>,<Administrator>,<X>,<go>,<TOPSPIN 2.1>,
      <created by zg
	started at 2013-09-26 19:58:41.701 -0700,
	POWCHK enabled, PULCHK disabled,
       configuration hash MD5:
       C8 4E 4E 5D D3 5C D8 9E 9F 52 82 E0 59 8A DE 15
       data hash MD5: 64K
       67 44 0E 32 96 26 46 4A 48 77 BA 3E C0 8C B2 BD>)
(   2,<2013-09-26 20:10:14.048 -0700>,<Administrator>,<X>,<proc1d>,<TOPSPIN 2.1>,
      <Start of raw data processing
       efp LB = 0.3 FT_mod = 6 PKNL = 1 PHC0 = 0 PHC1 = 0 SI = 128K 
       data hash MD5: 128K
       1C DA 0F 53 50 10 BD 59 42 EA AD E6 A2 E5 8D 22>)
(   3,<2013-09-26 20:10:14.986 -0700>,<Administrator>,<X>,<proc1d>,<TOPSPIN 2.1>,
      <pk PHC0 = -82.771 PHC1 = 0 
       data hash MD5: 128K
       55 EE 9F 57 54 18 18 CA 8B 64 46 E5 AB 41 A1 E6>)
(   4,<2013-09-26 20:10:15.439 -0700>,<Administrator>,<X>,<proc1d>,<TOPSPIN 2.1>,
      <abs ABSG = 1 
       data hash MD5: 128K
       B0 75 34 AE 65 19 F6 C8 54 E8 3F 9F 4E F6 DF CD>)
(   5,<2013-09-26 20:10:15.595 -0700>,<Administrator>,<X>,<proc1d>,<TOPSPIN 2.1>,
      <abs ABSG = 2 
       data hash MD5: 128K
       DD F6 AF 9D C9 F7 C3 72 92 1C 27 D6 7F 46 3E 95>)
(   6,<2013-09-26 20:10:15.673 -0700>,<Administrator>,<X>,<proc1d>,<TOPSPIN 2.1>,
      <abs ABSG = 3 
       data hash MD5: 128K
       E2 67 5D 3E 8B 22 7B AC 5C D9 FA 3D A9 3C B4 2E>)
(   7,<2013-09-26 20:10:15.783 -0700>,<Administrator>,<X>,<proc1d>,<TOPSPIN 2.1>,
      <abs ABSG = 4 
       data hash MD5: 128K
       E3 FA F0 32 9F 16 BE E8 05 E3 CD BE F6 38 A1 94>)
(   8,<2013-09-26 20:10:15.955 -0700>,<Administrator>,<X>,<proc1d>,<TOPSPIN 2.1>,
      <abs ABSG = 5 
       data hash MD5: 128K
       8D CA 76 DF C6 A5 F9 88 24 DE 6E 00 7D FF B2 D9>)
$$ ##END=
$$ 
$$ $$ hash MD5
$$ $$ 61 EF D9 32 06 A4 56 D1 F0 4E 73 9B F5 03 7E BD
##$RELAX= 
##$RELAX= 
##$RELAX= 
##$RELAX= 
##$RELAX= 
##$RELAX= 
##$RELAX= 
##$RELAX= 
$$ Bruker specific parameters
$$ --------------------------
##$DU= <E:\>
##$EXPNO= 12
$$ [...]
150 150 150 150 150 150 150 150
##$TP07= 0
##$TPNAME0= <>
##$TPNAME1= <>
##$TPNAME2= <>
##$TPNAME3= <>
##$TPNAME4= <>
##$TPNAME5= <>
##$TPNAME6= <>
##$TPNAME7= <>
##$TPOAL= (0..7)
0.5 0.5 0.5 0.5 0.5 0.5 0.5 0.5
##$TPOFFS= (0..7)
0 0 0 0 0 0 0 0
##$TUNHIN= 0
##$TUNHOUT= 0
##$TUNXOUT= 0
##$USERA1= <user>
##$USERA2= <user>
##$USERA3= <user>
##$USERA4= <user>
##$USERA5= <user>
##$V9= 5
##$VALIST= <valist>
##$VCLIST= <CCCCCCCCCCCCCCC>
##$VD= 0
##$VDLIST= <DDDDDDDDDDDDDDD>
##$VPLIST= <PPPPPPPPPPPPPPP>
##$VTLIST= <TTTTTTTTTTTTTTT>
##$WBST= 1024
##$WBSW= 4
##$XGAIN= (0..3)
0 0 0 0
##$XL= 0
##$YL= 0
##$YMAX_a= 6835734
##$YMIN_a= -12800258
##$ZGOPTNS= <>
##$ZL1= 120
##$ZL2= 120
##$ZL3= 120
##$ZL4= 120
##$ABSF1= 14.96071
##$ABSF2= -5.597472
##$ABSG= 5
##$ABSL= 3
##$ALPHA= 0
##$AQORDER= 0
##$ASSFAC= 0
##$ASSFACI= 0
##$ASSFACX= 0
##$ASSWID= 0
##$AUNMP= <proc_prof1d_extract.lims>
##$AXLEFT= 0
##$AXNAME= <>
##$AXNUC= <1H>
##$AXRIGHT= 0
##$AXTYPE= 0
##$AXUNIT= <>
##$AZFE= 0.1
##$AZFW= 0.1
##$BCFW= 0
##$BC_mod= 0
##$BYTORDP= 0
##$COROFFS= 0
##$CY= 15
##$DATMOD= 1
##$DC= 0
##$DFILT= <>
##$DTYPP= 0
##$F1P= 0
##$F2P= 0
##$FCOR= 0.5
##$FTSIZE= 131072
##$FT_mod= 6
##$GAMMA= 0
##$GB= 0
##$INTBC= 1
##$INTSCL= 1
##$ISEN= 128
##$LB= 0.3
##$LEV0= 0
##$LPBIN= 0
##$MAXI= 10000
##$MC2= 0
##$MEAN= 0
##$ME_mod= 0
##$MI= 0
##$NCOEF= 0
##$NC_proc= -2
##$NLEV= 6
##$NOISF1= 0
##$NOISF2= 0
##$NSP= 0
##$NTH_PI= 0
##$NZP= 0
##$OFFSET= 14.96071
##$PC= 1
##$PHC0= -82.771
##$PHC1= 0
##$PH_mod= 1
##$PKNL= yes
##$PPARMOD= 0
##$PPDIAG= 0
##$PPIPTYP= 0
##$PPMPNUM= 2147483647
##$PPRESOL= 1
##$PSCAL= 4
##$PSIGN= 0
##$PYNMP= <proc.py>
##$REVERSE= no
##$SF= 400.020009750944
##$SI= 131072
##$SIGF1= 0
##$SIGF2= 0
##$SINO= 400
##$SIOLD= 131072
##$SPECTYP= <>
##$SREGLST= <1H.CDCl3>
##$SSB= 0
##$STSI= 131072
##$STSR= 0
##$SW_p= 8223.68421052631
##$SYMM= 0
##$S_DEV= 0
##$TDeff= 65536
##$TDoff= 0
##$TI= <>
##$TILT= no
##$TM1= 0
##$TM2= 0
##$TOPLEV= 0
##$USERP1= <user>
##$USERP2= <user>
##$USERP3= <user>
##$USERP4= <user>
##$USERP5= <user>
##$WDW= 1
##$XDIM= 131072
##$YMAX_p= 328544700
##$YMIN_p= -12850
##$CURPLOT= <Network HP LaserJet P1505>
##$CURPRIN= <$Network HP LaserJet P1505>
##$DFORMAT= <normdp>
##$LAYOUT= <+/1D_H.xwp>
##$LFORMAT= <normlp>
##$PFORMAT= <normpl>
##$SURQMSG= 1
$$ End of Bruker specific parameters
$$ ---------------------------------
##NTUPLES= NMR SPECTRUM
##VAR_NAME=  FREQUENCY,     SPECTRUM/REAL,   SPECTRUM/IMAG
##SYMBOL=    X,             R,               I
##VAR_TYPE=  INDEPENDENT,   DEPENDENT,       DEPENDENT
##VAR_FORM=  AFFN,          ASDF,            ASDF
##VAR_DIM=   131072,        131072,          131072
##UNITS=     HZ,            ARBITRARY UNITS, ARBITRARY UNITS
##FACTOR=    0.0627417313425164, 1,          1
##FIRST=     8223.62146879497, 1579,         -68393
##LAST=      0,             3247,            -68072
##MIN=       0,             -12850,          0
##MAX=       8223.62146879497, 328544700,    0
$$ Real data points
##PAGE= N=1
##DATA TABLE= (X++(R..R)), XYDATA
$$ [...]
$$ plain form
63816 568199 543707 521458 501439 483317 466526 450568 435463 421864 410450 401145 393183 385987
63804 385987 379620 374176 369231 364358 359820 356124 353061 349891 346477 343407 340796 337767 333728 329560
63790 329560 326745 325655 325354 324864 323790 321766 318251 313343 308199 304104 301404 299707 298794 298809 299656 300709
63774 300709 301292 301238 300965 301111 302068 303740 305772 308098 311131 315249 320198 325277 330038 334456 338317 340698
63758 340698 340385 336829 330623 323039 315163 307430 299858 292576 285967 280297 275419 271024 267083 263785
63744 263785 261099 258731 256614 255165 254800 255402 256545 258095 260236 262929 265755 268445 271222 274338 277572
63729 277572 280596 283733 287849 293309 299414 305149 310258 315180 320082 324489 328017 331102 334566 338661
63715 338661 342843 346395 348882 350037 349690 348089 346012 344192 342698 341072 338921 336163 332936 329642
$$ packed form
63816E68199k4492k2249k0019j8122j6791j5958j5105j3599j1414r305p962p196
63804C85987o367n444m945m873m538l696l063l170l414l070k611l029m039m168
63790C29560k815j090l01m90j074k024l515m908n144m095k700j697r13J5Q47J053
63774C00709N83n4k73J46R57J672K032K326L033M118M949N079M761M418L861K381
63758C40698l13l556o206p584p876p733p572p282o609n670m878m395l941l298
63744B63785k686k368k117j449l65O02J143J550K141K693K826K690K777L116L234
63729B77572L024L137M116N460O105N735N109M922M902M407L528L085L464M095
63715C38661M182L552K487J155l47j601k077j820j494j626k151k758l227l294
$$ plain form
63701 329642 326966 325313 324156 322447 319941 317706 317009 317943 319507 320811 321788 322884 324525 326908 329906
63686 329906 333050 335842 338161 340182 341975 343468 344744 346008 347273 348460 349877 352084 355059 357892
63672 357892 359670 360402 360791 361336 362033 362794 363798 365381 367696 370395 372590 373418 372877 371894 371346 371218 370947
63655 370947 370184 368805 366536 363223 359417 356038 353456 351375 349739 349094 349844 351726 354454 358470 364441
63640 364441 372126 380322 388136 396010 405166 416051 427573 438072 446914 454818 462718 470822 479041
63627 479041 487709 497151 506829 515698 523437 530676 537950 545157 552260 559751 568103 577369 587749 599876
63613 599876 614023 629607 646130 664117 684324 706380 729048 751614 774183 796763 819005
63602 819005 840990 863248 885522 906149 923215 935927 944496 949154 949792 946338 939053 928566 915956
$$ packed form
63701C29642k676j653j157j709k506k235o97R34J564J304R77J096J641K383K998
63686C29906L144K792K319K021J793J493J276J264J265J187J417K207K975K833
63672C57892J778P32L89N45O97P61J004J583K315K699K195Q28n41r83n48j28k71
63655C70947p63j379k269l313l806l379k582k081j636o45P50J882K728M016N971
63640C64441P685Q196P814P874R156J0885J1522J0499Q842P904P900Q104Q219
63627D79041Q668R442R678Q869P739P239P274P207P103P491Q352R266J0380J2127
63613E99876J4147J5584J6523J7987K0207K2056K2668K2566K2569K2580K2242
63602H19005K1985K2258K2274K0627J7066J2712Q569M658O38l454p285j0487j2610
$$ plain form
63589 915956 902582 889405 876450 863097 848792 833249 816161 797166 776170 753485 729654
63578 729654 705345 681484 659178 639282 622034 607213 594576 584058 575612 569029 564103 560916
63566 560916 559788 560869 563974 568911 575810 584893 596086 609164 624232 641664 661410 682684 704537
63553 704537 726609 749189 772794 797968 825315 855330 888040 922992 959783 998682 1040728
63542 1040728 1087023 1137528 1190182 1240987 1285017 1317738 1336172 1339681 1329975 1310133 1283273 1252093
63530 1252093 1219300 1187629 1158857 1133017 1109087 1086342 1064643 1043512 1021535 997007 969005
63519 969005 937792 904539 870749 837619 805630 774763 745213 717636 692589 669993 649377
63508 649377 630466 613225 597537 583181 570156 558619 548414 538979 529850 521018 512570 504235
$$ packed form
63589I15956j3374j3177j2955j3353j4305j5543j7088j8995k0996k2685k3831
63578G29654k4309k3861k2306j9896j7248j4821j2637j0518q446o583m926l187
63566E60916j128J081L105M937O899R083J1193J3078J5068J7432J9746K1274K1853
63553G04537K2072K2580K3605K5174K7347L0015L2710L4952L6791L8899M2046
63542A040728M6295N0505N2654N0805M4030L2721J8434L509r706j9842k6860l1180
63530A252093l2793l1671k8772k5840k3930k2745k1699k1131k1977k4528k8002
63519I69005l1213l3253l3790l3130l1989l0867k9550k7577k5047k2596k0616
63508F49377j8911j7241j5688j4356j3025j1537j0205r435r129q832q448q335
$$ plain form
63496 504235 495563 486498 477498 469029 461180 453804 446879 440645 435470 431659 429335 428432 428768 430083 431998
63481 431998 434084 436201 438745 442346 447237 453060 459256 465375 471042 476040 480711 485941 492304 499388
63467 499388 506342 512954 519642 526415 532480 537147 540665 543812 547024 550389 554151 558685 564015 569842
63453 569842 576021 582524 588866 594193 598325 602341 607661 614720 622906 631709 641473 652950 666517 682058
63439 682058 699329 718199 738662 760893 785288 812386 842805 877390 917169 962680 1012975
63428 1012975 1065241 1115326 1158707 1191402 1210798 1216344 1209634 1193647 1171732 1147062 1122656 1101454
63416 1101454 1086060 1078232 1078363 1085399 1097501 1113113 1131394 1151535 1171868 1190003 1203875 1212462
63404 1212462 1215529 1213119 1205565 1193757 1178955 1162211 1144041 1124593 1103975 1082331 1059617 1035404
$$ packed form
63496E04235q672r065r000q469p849p376o925o234n175l811k324r03L36J315J915
63481D31998K086K117K544L601M891N823O196O119N667M998M671N230O363P084
63467D99388O954O612O688O773O065M667L518L147L212L365L762M534N330N827
63453E69842O179O503O342N327M132M016N320P059Q186Q803R764J1477J3567J5541
63439F82058J7271J8870K0463K2231K4395K7098L0419L4585L9779M5511N0295
63428A012975N2266N0085M3381L2695J9396N546o710j5987k1915k4670k4406k1202
63416A101454j5394p828J31P036J2102J5612J8281K0141K0333J8135J3872Q587
63404A212462L067k410p554j1808j4802j6744j8170j9448k0618k1644k2714k4213
$$ plain form
63392 1035404 1008985 979844 948131 914735 880831 847289 814394 782114 750658 720789 693526
63381 693526 669511 648783 631148 616561 605043 596527 591032 588775 589702 593106 598194 605035 614457
63368 614457 626884 641775 658397 676682 696980 719393 743796 770274 799078 830286 863809
63357 863809 899556 937198 975989 1015259 1054927 1095038 1134902 1173242 1209162 1242385 1272401
63346 1272401 1298015 1317988 1331668 1338742 1338929 1332462 1320608 1305262 1288124 1270444 1253142 1236578
63334 1236578 1220320 1203611 1186043 1167378 1146938 1123801 1097774 1069638 1040273 1010082 979600
63323 979600 950116 922975 898410 875764 855118 838278 827712 824428 826698 830397 830412 822333 803874
63310 803874 775416 739321 698610 656082 614232 575246 540597 510763 485606 464911 448294
$$ packed form
63392A035404k6419k9141l1713l3396l3904l3542l2895l2280l1456k9869k7263
63381F93526k4015k0728j7635j4587j1518q516n495k257R27L404N088O841R422
63368F14457J2427J4891J6622J8285K0298K2413K4403K6478K8804L1208L3523
63357H63809L5747L7642L8791L9270L9668M0111L9864L8340L5920L3223L0016
63346A272401K5614J9973J3680P074J87o467j1854j5346j7138j7680j7302j6564
63334A236578j6258j6709j7568j8665k0440k3137k6027k8136k9365l0191l0482
63323I79600k9484k7141k4565k2646k0646j6840j0566l284K270L699J5q079j8459
63310H03874k8458l6095m0711m2528m1850l8986l4649k9834k5157k0695j6617
$$ plain form
63299 448294 434822 423289 413024 404039 396299 389313 382704 376716 371703 367421 363380 359704 356960
63286 356960 355137 353466 351497 349738 348756 348057 346455 343472 339927 337114 335671 335276 335149 334797 334493 335028
63270 335028 336859 339562 342299 344727 347116 349618 351945 353912 355904 358447 361601 365170 369286 374305
63256 374305 380142 386186 392062 398095 404736 411802 418685 425259 432184 440155 449016 457781 465537 472291
63242 472291 479009 486853 496299 506925 518021 529289 540922 553192 566304 580585 596352 613365
63230 613365 630742 647740 664402 681087 697741 714161 730760 748267 766496 784193 800477
63219 800477 815870 831364 847009 862070 876173 889462 901662 911791 918995 923177 924662 923698
63207 923698 920395 914618 905763 893160 876983 858356 838315 817125 794938 772562 751058 730946
$$ packed form
63299D48294j3472j1533j0265q985p740o986o609n988n013m282m041l676k744
63286C56960j823j671j969j759r82o99j602k983l545k813j443l95j27l52l04N35
63270C35028J831K703K737K428K389K502K327J967J992K543L154L569M116N019
63256C74305N837O044N876O033O641P066O883O574O925P971Q861Q765P756O754
63242D72291O718P844R446J0626J1096J1268J1633J2270J3112J4281J5767J7013
63230F13365J7377J6998J6662J6685J6654J6420J6599J7507J8229J7697J6284
63219H00477J5393J5494J5645J5061J4103J3289J2200J0129P204M182J485r64
63207I23698l303n777q855j2603j6177j8627k0041k1190k2187k2376k1504k0112
$$ plain form
63195 730946 712443 696219 683245 673854 667521 663693 662335 663601 667397 673525 681844 692085 703827
63182 703827 717030 732299 750233 770491 791787 812774 832671 851058 867457 881398 892703
63171 892703 901393 907416 910754 911740 910911 908477 904263 898312 891069 882651 872330 859226 843304 825136
63157 825136 804977 782699 758535 733110 706705 679302 651513 624653 599514 575891 553704
63146 553704 533740 516556 501438 487384 474646 464256 456331 449851 444079 439236 435696 433293 431596
63133 431596 430181 428494 426029 422836 419386 415923 412436 409192 406611 404597 402676 400878 399674 398958
63119 398958 397924 396303 394963 394869 396032 397879 400055 402445 404946 407662 410897 414633 418504 422547 427370
63104 427370 433263 439773 446553 453878 461811 469646 476961 484585 493584 503755 514082 524360 535397
$$ packed form
63195G30946j8503j6224j2974r391o333l828j358J266L796O128Q319J0241J1742
63182G03827J3203J5269J7934K0258K1296K0987J9897J8387J6399J3941J1305
63171H92703Q690O023L338R86q29k434m214n951p243q418j0321j3104j5922j8168
63157H25136k0159k2278k4164k5425k6405k7403k7789k6860k5139k3623k2187
63146E53704j9964j7184j5118j4054j2738j0390p925o480n772m843l540k403j697
63133D31596j415j687k465l193l450l463l487l244k581k014j921j798j204p16
63119C98958j034j621j340r4J163J847K176K390K501K716L235L736L871M043M823
63104D27370N893O510O780P325P933P835P315P624Q999J0171J0327J0278J1037
$$ plain form
63091 535397 547662 560576 573153 584628 594403 601990 607097 609329 607898 602230 592852 581232 568839
63078 568839 556747 545851 536717 529271 523300 519243 517877 519262 522696 527694 534292 542393 551625 562121
63064 562121 574680 589836 607313 626609 647497 669682 692746 716915 743316 772809 804955
63053 804955 838669 873597 910293 949249 990359 1033305 1077926 1124028 1171148 1218703 1266315
63042 1266315 1313878 1361248 1407919 1453147 1496563 1538580 1579918 1620752 1660550 1698671 1734756
63031 1734756 1768469 1799215 1826180 1848404 1864754 1874170 1876080 1870244 1856197 1833328 1801765 1762879
63019 1762879 1718606 1670505 1619638 1567043 1514001 1461926 1412253 1366332 1325246 1289697 1260086
63008 1260086 1236676 1219712 1209463 1205997 1208725 1216443 1228177 1243801 1263348 1285910 1309872 1334083
$$ packed form
63091E35397J2265J2914J2577J1475R775P587N107K232j431n668r378j1620j2393
63078E68839j2092j0896r134p446n971m057j366J385L434M998O598Q101R232J0496
63064E62121J2559J5156J7477J9296K0888K2185K3064K4169K6401K9493L2146
63053H04955L3714L4928L6696L8956M1110M2946M4621M6102M7120M7555M7612
63042A266315M7563M7370M6671M5228M3416M2017M1338M0834L9798L8121L6085
63031A734756L3713L0746K6965K2224J6350R416J910n836j4047k2869l1563l8886
63019A762879m4273m8101n0867n2595n3042n2075m9673m5921m1086l5549k9611
63008A260086k3410j6964j0249l466K728P718J1734J5624J9547K2562K3962K4211
$$ plain form
62996 1334083 1358027 1380797 1400953 1417916 1432724 1446654 1459657 1470822 1479893 1487424 1493623 1497891
62984 1497891 1499679 1499171 1496806 1492428 1485107 1473714 1457654 1437070 1412245 1382835 1348021 1307632
62972 1307632 1262735 1214874 1165145 1114437 1064166 1015949 970576 927855 887533 849884 815313
62961 815313 783879 755399 729715 706593 685610 666338 648540 632047 616604 601958 588052
62950 588052 575068 563234 552602 542977 534034 525480 517066 508624 500365 492984 487027 482105 477226
62937 477226 472086 467540 464449 462528 460825 458955 457280 456115 455416 455140 455281 455500 455333 454873 454745 455281
62921 455281 456177 457083 458010 458929 459528 459846 460694 462804 465663 467810 468483 468598 469781 472653 476351 479634
62905 479634 481942 483140 482691 479809 474554 468172 461999 456369 450998 446084 442380 440263 439356 439175 439648
$$ packed form
62996A334083K3944K2770K0156J6963J4808J3930J3003J1165R071P531O199M268
62984A497891J788n08k365m378p321j1393j6060k0584k4825k9410l4814m0389
62972A307632m4897m7861m9729n0708n0271m8217m5373m2721m0322l7649l4571
62961H15313l1434k8480k5684k3122k0983j9272j7798j6493j5443j4646j3906
62950E88052j2984j1834j0632r625q943q554q414q442q259p381n957m922m879
62937D77226n140m546l091j921j703j870j675j165o99k76J41K19j67m60j28N36
62921D55281Q96R06R27R19N99L18Q48K110K859K147O73J15J183K872L698L283
62905D79634K308J198m49k882n255o382o173n630n371m914l704k117r07j81M73
$$ plain form
62890 439648 440755 442078 443116 443877 444794 446088 447452 448366 448524 447934 446784 445413 444437 444665 446637 450128
62874 450128 454119 457278 458567 457748 455658 453901 453700 454795 455718 455316 453685 451567 449368 447158 445179
62859 445179 443704 442597 441515 440486 439767 439246 438522 437610 437053 437255 438048 439011 439836 440373 440716 441297 442509
62842 442509 444141 445568 446616 447800 449579 451776 453889 455566 456583 456788 456491 456569 457770 460007 462594
62827 462594 465067 467530 470363 473857 478060 482711 487314 491460 495125 498556 501944 505277 508455 511396
62813 511396 514000 516034 517148 517165 516508 516235 517373 520202 524289 529143 534564 540417 546537 553048 560542
62798 560542 569650 580545 592955 606586 621429 637816 656300 677400 701327 727913 756783 787626
62786 787626 820413 855448 893095 933356 975952 1021020 1069454 1122120 1178824 1238432 1299949
$$ packed form
62890D39648J107J323J038P61R17J294J364R14J58n90j150j371r76K28J972L491
62874D50128L991L159J289q19k090j757k01J095R23m02j631k118k199k210j979
62859D45179j475j107j082j029p19n21p24r12n57K02P93R63Q25N37L43N81J212
62842D42509J632J427J048J184J779K197K113J677J017K05k97P8J201K237K587
62827D62594K473K463K833L494M203M651M603M146L665L431L388L333L178K941
62813E11396K604K034J114J7o57k73J138K829M087M854N421N853O120O511P494
62798E60542R108J0895J2410J3631J4843J6387J8484K1100K3927K6586K8870L0843
62786G87626L2787L5035L7647M0261M2596M5068M8434N2666N6704N9608O1517
$$ plain form
62775 1299949 1363034 1427520 1492913 1558406 1622861 1684647 1741951 1793471 1838459 1876026 1904875
62764 1904875 1923856 1932289 1929636 1915544 1890552 1856072 1813174 1761942 1702663 1637155 1568199 1497938
62752 1497938 1427489 1357698 1289317 1222522 1157263 1094311 1035209 980816 930572 883639 840231
62741 840231 801311 767300 737651 711526 688350 667679 649003 631967 616635 603332 592207
62730 592207 583035 575419 569084 563885 559614 556020 553090 551160 550603 551552 554044 558216 564007 570768 577603
62715 577603 584301 591671 600794 612137 625510 640666 657621 676548 697625 721072 747027 775336
62703 775336 805646 837898 872573 910216 950714 993241 1036940 1081477 1126912 1173195 1219961
62692 1219961 1266586 1312322 1356496 1398751 1438885 1476179 1509016 1535502 1554444 1565451 1568180
$$ packed form
62775A299949O3085O4486O5393O5493O4455O1786N7304N1520M4988L7567K8849
62764A904875J8981Q433k653j4092k4992l4480m2898n1232n9279o5508o8956p0261
62752A497938p0449o9791o8381o6795o5259o2952n9102n4393n0244m6933m3408
62741H40231l8920l4011k9649k6125k3176k0671j8676j7036j5332j3303j1125
62730E92207r172p616o335n199m271l594k930j930n57R49K492M172N791O761O835
62715E77603O698P370R123J1343J3373J5156J6955J8927K1077K3447K5955K8309
62703G75336L0310L2252L4675L7643M0498M2527M3699M4537M5435M6283M6766
62692A219961M6625M5736M4174M2255M0134L7294L2837K6486J8942J1007K729
$$ plain form
62681 1568180 1562037 1546773 1522964 1491632 1453647 1409733 1360787 1307885 1252195 1195137 1138432
62670 1138432 1083602 1031377 981759 934565 889682 847076 807011 770343 738156 710811 687425
62659 687425 666417 646552 627516 609718 593716 579753 567664 557072 547647 539193 531571 524606
62647 524606 518113 512007 506349 501224 496616 492471 488840 485700 482573 478709 474012 469591 466835 465956
62633 465956 465870 465562 465054 464889 465198 465692 466178 466591 466713 466307 465489 464649 464092 463980 464509 465746 467346 468815
62615 468815 470180 472184 475649 480707 486730 493038 499659 507337 516675 527397 538661 550028 561799
62602 561799 574501 588480 604053 621500 640635 660883 682071 704694 729013 754449 780382
62591 780382 807078 835110 864196 893310 921748 949255 975164 998282 1017811 1033689 1045771
$$ packed form
62681A568180o143j5264k3809l1332l7985m3914m8946n2902n5690n7058n6705
62670A138432n4830n2225m9618m7194m4883m2606m0065l6668l2187k7345k3386
62659F87425k1008j9865j9036j7798j6002j3963j2089j0592r425q454p622o965
62647E24606o493o106n658n125m608m145l631l140l127l864m697m421k756q79
62633D65956q6l08n08j65L09M94M86M13J22m06q18q40n57j12N29J237J600J469
62615D68815J365K004L465N058O023O308O621P678R338J0722J1264J1367J1771
62602E61799J2702J3979J5573J7447J9135K0248K1188K2623K4319K5436K5933
62591G80382K6696K8032K9086K9114K8438K7507K5909K3118J9529J5878J2082
$$ plain form
62580 1045771 1053206 1054975 1050617 1040246 1024236 1003164 977809 949036 917897 885718 853593 821677
62568 821677 789420 756706 724360 693464 664673 638326 614635 593384 573892 555752 539319
62557 539319 525199 513505 503878 495862 488919 482480 476423 471192 467029 463399 459609 455715 452193 449048
62543 449048 445950 443182 441633 441614 442355 443021 443668 444759 446218 447603 449033 451249 454665 458924 463633
62528 463633 469058 475697 483440 491708 500337 509798 520470 532200 544906 559129 575528 594016 613897
62515 613897 634723 656592 679657 703845 729083 755324 782259 809407 836576 863698 889974
62504 889974 913719 933543 949394 962012 971586 977456 978993 976283 969861 960112 947108 930862 911679
62491 911679 890403 868337 846811 826740 808533 792308 778102 765983 756064 748338 742505 738148
$$ packed form
62580A045771P435J769m358j0371j6010k1072k5355k8773l1139l2179l2125l1916
62568H21677l2257l2714l2346l0896k8791k6347k3691k1251j9492j8140j6433
62557E39319j4120j1694r627q016o943o439o057n231m163l630l790l894l522l145
62543D49048l098k768j549j9P41O66O47J091J459J385J430K216L416M259M709
62528D63633N425O639P743Q268Q629R461J0672J1730J2706J4223J6399J8488J9881
62515F13897K0826K1869K3065K4188K5238K6241K6935K7148K7169K7122K6276
62504H89974K3745J9824J5851J2618R574N870J537k710o422r749j3004j6246j9183
62491I11679k1276k2066k1526k0071j8207j6225j4206j2119r919p726n833m357
$$ plain form
62479 738148 735188 733976 734792 737384 741082 745176 749043 752152 754123 754622 753091 748946 742259 733882 724458
62464 724458 713559 700257 684376 666638 647737 627906 607476 587225 567869 549637 532602
62453 532602 517055 503147 490452 478341 466755 456350 447885 441579 437003 433469 430530 428210 426708
62440 426708 425936 425532 425370 425738 426806 428142 429075 429413 429523 429742 430014 430123 429924 429220 427704 425375 422928
62423 422928 421335 420853 420584 419282 416702 414031 412812 413456 414944 416001 416342 416625 417373 418299 418746 418468
62407 418468 417750 416944 416215 415714 415701 416317 417497 419238 421765 425074 428525 431326 433504 435929 439137 442501
62391 442501 445020 446710 448667 451750 455637 459376 462476 465254 468367 472277 476992 482076 487043 491947
62377 491947 497431 503995 511426 519282 527803 537842 549873 563504 578159 593833 610897 629451
$$ packed form
62479G38148k960j212Q16K592L698M094L867L109J971M99j531m145o687q377r424
62464G24458j0899j3302j5881j7738j8901j9831k0430k0251j9356j8232j7035
62453E32602j5547j3908j2695j2111j1586j0405q465o306m576l534k939k320j502
62440D26708p72m04j62L68J068J336R33L38J10K19K72J09j99p04j516k329k447
62423D22928j593m82k69j302k580k671j219O44J488J057L41K83P48R26M47k78
62407D18468p18q06p29n01j3O16J180J741K527L309L451K801K178K425L208L364
62391D42501K519J690J957L083L887L739L100K778L113L910M715N084M967M904
62377D91947N484O564P431P856Q521J0039J2031J3631J4655J5674J7064J8554
$$ plain form
62365 629451 649318 670577 693700 719070 746612 776026 807240 840474 875909 913433 952823
62354 952823 994091 1037443 1082752 1129240 1175897 1222058 1267139 1309836 1348104 1380197 1405323
62343 1405323 1423077 1432792 1434105 1427779 1415259 1397436 1374386 1346179 1313293 1276241 1235574 1192398
62331 1192398 1148145 1103565 1058655 1013957 971191 931949 896240 862991 831593 802285 775332
62320 775332 750612 727962 707309 688391 670797 654272 638583 623270 608088 593582 580600
62309 580600 569220 558717 548590 539016 530262 522350 515517 510293 506821 504574 503017 501973 501054 499448
62295 499448 496910 494523 493730 494769 496595 498205 499534 501072 503108 505458 507668 509448 511113 513458
62281 513458 516969 521208 525348 529315 534070 540668 549194 558609 567522 575147 581839 588805 597129 607022
$$ packed form
62365F29451J9867K1259K3123K5370K7542K9414L1214L3234L5435L7524L9390
62354I52823M1268M3352M5309M6488M6657M6161M5081M2697L8268L2093K5126
62343A405323J7754R715J313o326j2520j7823k3050k8207l2886l7052m0667m3176
62331A192398m4253m4580m4910m4698m2766l9242l5709l3249l1398k9308k6953
62320G75332k4720k2650k0653j8918j7594j6525j5689j5313j5182j4506j2982
62309E80600j1380j0503j0127r574q754p912o833n224l472k247j557j044r19j606
62295D99448k538k387p93J039J826J610J329J538K036K350K210J780J665K345
62281E13458L511M239M140L967M755O598Q526R415Q913P625O692O966Q324R893
$$ plain form
62267 607022 618035 629927 643130 658399 676249 696808 720026 745828 774127 804898 838256
62256 838256 874380 913275 954632 998009 1043085 1089612 1137141 1184976 1232324 1278159 1320768
62245 1320768 1357858 1387503 1408816 1421432 1424811 1418669 1403885 1382099 1354333 1320741 1281836 1239051
62233 1239051 1193616 1145668 1095251 1043660 992947 944369 898088 854238 813480 776436 743237
62222 743237 713835 688289 666503 648043 632367 619008 607462 597204 587911 579452 571645 564322
62210 564322 557643 551981 547333 543157 538960 534867 531425 528947 527190 525619 523927 522304 521269 521233 522301
62195 522301 524417 527467 531211 535374 539976 545305 551415 557976 564925 572851 582280 592824 603578 614229
62181 614229 625156 636499 647764 658503 668863 679296 690096 701383 713089 724828 736210
$$ packed form
62267F07022J1013J1892J3203J5269J7850K0559K3218K5802K8299L0771L3358
62256H38256L6124L8895M1357M3377M5076M6527M7529M7835M7348M5835M2609
62245A320768L7090K9645K1313J2616L379o142j4784k1786k7766l3592l8905m2785
62233A239051m5435m7948n0417n1591n0713m8578m6281m3850m0758l7044l3199
62222G43237k9402k5546k1786j8460j5676j3359j1546j0258r293q459p807p323
62210E64322o679n662m648m176m197m093l442k478j757j571j692j623j035l6J068
62195E22301K116L050L744M163M602N329O110O561O949P926R429J0544J0754J0651
62181F14229J0927J1343J1265J0739J0360J0433J0800J1287J1706J1739J1382
$$ plain form
62170 736210 747547 759936 774397 791176 810012 830700 853225 877666 904243 933198 964401
62159 964401 997285 1031258 1065728 1099508 1130679 1157459 1178952 1194708 1204043 1206434 1202391 1193230
62147 1193230 1179916 1162631 1141568 1117620 1091988 1065419 1038052 1009828 980930 952100 924817
62136 924817 900980 882076 868581 860221 856626 857517 862388 870460 881205 894763 911602 931797 954838
62123 954838 980092 1007187 1035778 1065184 1094570 1123517 1152232 1181033 1209558 1236435 1259789
62112 1259789 1278204 1291296 1299362 1302675 1301476 1296687 1290110 1283426 1277146 1270807 1263993 1256760 1249356
62099 1249356 1242249 1236596 1234067 1235840 1242013 1252203 1266289 1284232 1305396 1328496 1352180 1375537
62087 1375537 1398221 1420347 1442107 1463254 1483063 1500999 1517275 1532566 1547485 1562721 1579387
$$ packed form
62170G36210J1337J2389J4461J6779J8836K0688K2525K4441K6577K8955L1203
62159I64401L2884L3973L4470L3780L1171K6780K1493J5756R335K391m043r161
62147A193230j3314j7285k1063k3948k5632k6569k7367k8224k8898k8830k7283
62136I24817k3837j8904j3495q360l595Q91M871Q072J0745J3558J6839K0195K3041
62123I54838K5254K7095K8591K9406K9386K8947K8715K8801K8525K6877K3354
62112A259789J8415J3092Q066L313j199m789o577o684o280o339o814p233p404
62099A249356p107n653k529J773O173J0190J4086J7943K1164K3100K3684K3357
62087A375537K2684K2126K1760K1147J9809J7936J6276J5291J4919J5236J6666
$$ plain form
62076 1579387 1598501 1619940 1642488 1665293 1688929 1714578 1742372 1771037 1799105 1825978 1851655
62065 1851655 1875988 1898666 1919710 1939486 1958272 1976248 1993941 2012179 2031395 2051238 2071057
62054 2071057 2090397 2108712 2124904 2137596 2145783 2148984 2146984 2139758 2127340 2109268 2084296 2051167
62042 2051167 2009622 1960233 1903459 1839661 1770035 1696693 1621404 1544798 1467182 1389573 1313570
62031 1313570 1240603 1171795 1108080 1049865 996770 948206 904071 864545 829419 798088 770015
62020 770015 744826 722129 701729 683861 668682 655630 643717 632438 621941 612370 603586 595572
62008 595572 588558 582625 577668 573914 571908 571747 572752 574291 576514 579901 584310 588982 593282 596983
61994 596983 599815 601232 600830 598700 595149 590240 583840 576090 567596 558974 550249 540818 530134 518375
$$ packed form
62076A579387J9114K1439K2548K2805K3636K5649K7794K8665K8068K6873K5677
62065A851655K4333K2678K1044J9776J8786J7976J7693J8238J9216J9843J9819
62054B071057J9340J8315J6192J2692Q187L201k000p226j2418j8072k4972l3129
62042B051167m1545m9389n6774o3798o9626p3342p5289p6606p7616p7609p6003
62031A313570p2967o8808o3715n8215n3095m8564m4135l9526l5126l1331k8073
62020G70015k5189k2697k0400j7868j5179j3052j1913j1279j0497r571q784q014
62008E95572p014n933m957l754k006j61J005J539K223L387M409M672M300L701
61994E96983K832J417m02k130l551m909o400p750q494q622q725r431j0684j1759
$$ plain form
61980 518375 506357 494853 484170 474435 466008 459255 453911 449050 443993 439155 435623 433784 432638
61967 432638 430800 428052 425568 424575 425101 426213 427165 427999 429180 431039 433666 437050 441180 446075 451809
61952 451809 458417 465768 473642 482000 491041 500933 511640 523175 535881 550214 566191 583320 601196
61939 601196 620021 640283 662078 684960 708346 731672 754219 775328 795095 814396 833776
61928 833776 852590 869659 884476 897231 907908 916232 922458 927327 930909 932259 930700 926820 921650
61915 921650 915484 908239 900560 893767 888834 886179 886300 889718 896143 904452 913872 924635 937140 950872
61901 950872 964494 976696 986649 993904 998178 999133 996211 988832 976950 961196 942351 920856 897060
61888 897060 871714 845872 820349 795458 771275 748028 726178 706127 687816 670639 653926
$$ packed form
61980E18375j2018j1504j0683r735q427o753n344m861n057m838l532j839j146
61967D32638j838k748k484r93N26J112R52Q34J181J859K627L384M130M895N734
61952D51809O608P351P874Q358R041R892J0707J1535J2706J4333J5977J7129J7876
61939F01196J8825K0262K1795K2882K3386K3326K2547K1109J9767J9301J9380
61928H33776J8814J7069J4817J2755J0677Q324O226M869L582J350j559l880n170
61915I21650o166p245p679o793m933k655J21L418O425Q309R420J0763J2505J3732
61901I50872J3622J2202R953P255M274R55k922p379j1882j5754j8845k1495k3796
61888H97060k5346k5842k5523k4891k4183k3247k1850k0051j8311j7177j6713
$$ plain form
61877 653926 637584 622204 608553 597032 587578 579863 573536 568449 564681 562274 561110 561288 563443
61864 563443 568155 575047 583076 591901 602432 615640 631330 648627 667273 687763 710394 734927
61852 734927 761293 789991 821454 855364 890806 926850 962922 998925 1035173 1071907 1108621
61841 1108621 1144069 1177093 1207238 1234337 1257740 1276288 1289016 1295780 1297324 1294864 1289452 1281518
61829 1281518 1271218 1259345 1247615 1237732 1230396 1225580 1223488 1224654 1229043 1235618 1242921 1249631 1254449
61816 1254449 1256051 1253543 1246573 1234648 1216752 1192111 1161060 1124698 1084028 1040001 994125 948184
61804 948184 903304 859929 818767 780966 747029 716231 687582 660940 636771 615273 596267
61793 596267 579556 564841 551586 539609 529582 522211 516886 511840 505826 499108 492610 486698 481277
$$ packed form
61877F53926j6342j5380j3651j1521r454p715o327n087l768k407j164J78K155
61864E63443M712O892Q029Q825J0531J3208J5690J7297J8646K0490K2631K4533
61852G34927K6366K8698L1463L3910L5442L6044L6072L6003L6248L6734L6714
61841A108621L5448L3024L0145K7099K3403J8548J2728O764J544k460n412p934
61829A281518j0300j1873j1730r883p336m816k092J166M389O575P303O710M818
61816A254449J602k508o970j1925j7896k4641l1051l6362m0670m4027m5876m5941
61804I48184m4880m3375m1162l7801l3937l0798k8649k6642k4169k1498j9006
61793E96267j6711j4715j3255j1977j0027p371n325n046o014o718o498n912n421
$$ plain form
61780 481277 476574 473112 470876 469011 466594 463505 460359 457677 455333 452883 450259 447893 446231 445341
61766 445341 445105 445457 446224 446960 447334 447605 448338 449645 451075 452377 453975 456461 459784 463253 466341 469314
61750 469314 472979 477843 483578 489375 494803 500115 505691 511439 516986 522183 527095 531642 535701 539534
61736 539534 543636 548068 552361 556171 559664 563078 566402 569700 573295 577218 580826 583476 585362 587256
61722 587256 589560 592070 594583 597204 600028 603028 606365 610402 615145 620026 624471 628383 631787 634267
61708 634267 635150 634158 631554 627747 623092 618033 612996 607908 602219 595727 589209 583908 580425 578374 577026
61693 577026 575885 574611 572855 570585 568292 566436 564706 562227 558565 554231 550027 546177 542283 537920
61679 537920 533014 527755 522503 517742 513811 510525 507264 503610 499803 496411 493677 491357 489151 487035
$$ packed form
61780D81277m703l462k236j865k417l089l146k682k344k450k624k366j662q90
61766D45341k36L52P67P36L74K71P33J307J430J302J598K486L323L469L088K973
61750D69314L665M864N735N797N428N312N576N748N547N197M912M547M059L833
61736E39534M102M432M293L810L493L414L324L298L595L923L608K650J886J894
61722E87256K304K510K513K621K824L000L337M037M743M881M445L912L404K480
61708F34267Q83r92k604l807m655n059n037n088n689o492o518n301l483k051j348
61693E77026j141j274j756k270k293j856j730k479l662m334m204l850l894m363
61679E37920m906n259n252m761l931l286l261l654l807l392k734k320k206k116
$$ plain form
61665 487035 485160 483697 482830 482625 482666 482102 480461 478376 477158 477506 478881 480218 481025 481678 482858 484865
61649 484865 487377 489774 491829 494072 497212 501159 504955 507846 510102 512522 515474 518778 522262 525899
61635 525899 529453 532454 534627 536045 536823 536919 536265 534919 533041 530908 528845 526981 525152 523347 522053
61620 522053 521820 522545 523635 524876 526695 529435 532793 536142 539101 541599 543632 545171 546106 546139 544973
61605 544973 542787 540304 538200 536511 534719 532334 529298 525868 522174 517900 512607 506446 500294 494909
61591 494909 490170 485499 480721 475938 470747 464371 456749 448854 441676 435371 429624 424235 418995 413536
61577 413536 407793 402314 397690 393896 390472 387046 383474 379759 376088 372621 369085 365032 360694 356951
61563 356951 354135 351482 348253 344792 341848 339466 337334 335750 335297 335756 336231 336265 336080 335798 335243 334547
$$ packed form
61665D87035j875j463q67k05M1n64j641k085j218L48J375J337Q07O53J180K007
61649D84865K512K397K055K243L140L947L796K891K256K420K952L304L484L637
61635E25899L554L001K173J418P78R6o54j346j878k133k063j864j829j805j294
61620E22053k33P25J090J241J819K740L358L349K959K498K033J539R35L3j166
61605E44973k186k483k104j689j792k385l036l430l694m274n293o161o152n385
61591D94909m739m671m778m783n191o376p622p895p178o305n747n389n240n459
61577D13536n743n479m624l794l424l426l572l715l671l467l536m053m338l743
61563C56951k816k653l229l461k944k382k132j584m53M59M75L4j85k82n55o96
$$ plain form
61547 334547 334200 334384 334871 335605 336754 338160 339512 341050 343314 346066 348320 349712 351043 353112 355752
61532 355752 358400 360839 362877 364068 364436 364846 365887 366810 366394 364471 361834 358899 355398 351280 347060
61517 347060 343104 339318 335768 332966 331192 329982 328700 327340 326363 325917 325524 324518 322630 320165 317687
61502 317687 315536 313600 311652 309849 308738 308695 309463 310348 310795 310744 310451 310022 309136 307330 304639 301878 300126
61485 300126 299849 300592 301486 301906 301643 300719 299283 297699 296467 295910 295971 296413 297116 298050 298967 299408 299103 298215
61467 298215 297108 296091 295585 296176 298002 300144 301199 300705 299630 299235 299767 300571 301207 301986 303488 305930
61451 305930 309080 312549 316026 319368 322505 325231 327196 328289 328953 329886 331396 333203 334927 336615 338682
61436 338682 341443 344842 348637 352745 357258 362099 366815 370902 374318 377465 380570 383330 385312 386477
$$ packed form
61547C34547l47J84M87P34J149J406J352J538K264K752K254J392J331K069K640
61532C55752K648K439K038J191L68M10J041R23m16j923k637k935l501m118m220
61517C47060l956l786l550k802j774j210j282j360r77m46l93j006j888k465k478
61502C17687k151j936j948j803j111m3P68Q85M47n1k93m29q86j806k691k761j752
61485C00126k77P43Q94M20k63r24j436j584j232n57O1M42P03R34R17M41l05q88
61467B98215j107j017n06N91J826K142J055m94j075l95N32Q04O36P79J502K442
61451C05930L150L469L477L342L137K726J965J093O64R33J510J807J724J688K067
61436C38682K761L399L795M108M513M841M716M087L416L147L105K760J982J165
$$ plain form
61422 386477 387057 387043 386211 384692 383240 382736 383501 385176 387156 389034 390751 392445 394159 395607 396196 395396
61406 395396 393202 390263 387404 384875 382098 378296 373431 368356 363992 360525 357456 354204 350473 346270
61392 346270 341980 338349 336015 334872 334088 332890 331215 329584 328460 327776 326922 325182 322451 319612 317982
61377 317982 318199 319721 321495 322923 324047 325085 326073 326878 327280 327164 326911 327459 329527 332676 335582 337408
61361 337408 338639 340367 343104 346609 350535 354754 359145 363568 368134 373110 378402 383559 388511 394010
61347 394010 401043 409916 420133 430937 441706 452018 461757 471167 480495 489558 497893 505350 512176
61334 512176 518463 523798 527675 530016 531108 531201 530380 528690 526206 523043 519457 515774 512020 507782 502743
61319 502743 497375 492755 489571 487533 485860 484147 482607 481655 481470 481897 482599 483334 484168 485380 487040 488826
$$ packed form
61422C86477N80j4q32j519j452n04P65J675J980J878J717J694J714J448N89q00
61406C95396k194k939k859k529k777l802m865n075m364l467l069l252l731m203
61392C46270m290l631k334j143p84j198j675j631j124o84q54j740k731k839j630
61377C17982K17J522J774J428J124J038R88Q05M02j16k53N48K068L149K906J826
61361C37408J231J728K737L505L926M219M391M423M566M976N292N157M952N499
61347C94010P033Q873J0217J0804J0769J0312R739R410R328R063Q335P457O826
61334E12176O287N335L877K341J092R3q21j690k484l163l586l683l754m238n039
61319E02743n368m620l184k038j673j713j540r52j85M27P02P35Q34J212J660J786
$$ plain form
61303 488826 490483 492306 494860 498250 502037 505952 510221 514884 519172 522054 523304 523561 523322 522333 520074
61288 520074 516436 511732 506396 500975 496142 492324 489397 486933 484675 482610 480795 479356 478502 478245 478301
61273 478301 478611 479819 482777 487553 493297 499197 505169 511484 518110 524753 531312 537921 544592 551086
61259 551086 557184 562988 568894 575372 582804 591406 601158 611684 622285 632329 641738 650863 659702
61246 659702 667429 672962 675871 676416 674842 671176 665771 659516 653128 646500 639038 630488 621246 612058
61232 612058 603594 596150 589513 583257 577335 572247 568511 566197 565083 564982 565645 566678 567987 570081 573441
61217 573441 577657 581693 585075 588394 592413 597052 601539 605396 608977 613040 617929 623272 628420 633138
61203 633138 637851 643272 649857 657548 665812 673963 681823 690261 700730 713951 729329 746007 764177
$$ packed form
61303D88826J657J823K554L390L787L915M269M663M288K882J250K57k39r89k259
61288E20074l638m704n336n421m833l818k927k464k258k065j815j439q54k57N6
61273D78301L10J208K958M776N744N900N972O315O626O643O559O609O671O494
61259E51086O098N804N906O478P432Q602R752J0526J0601J0044R409R125Q839
61246F59702P727N533K909N45j574l666n405o255o388o628p462q550r242r188
61232F12058q464p444o637o256n922n088l736k314j114j01O63J033J309K094L360
61217E73441M216M036L382L319M019M639M487L857L581M063M889N343N148M718
61203F33138M713N421O585P691Q264Q151P860Q438J0469J3221J5378J6678J8170
$$ plain form
61190 764177 784705 807662 832062 857209 883515 911394 939871 966951 991269 1012958 1032942
61179 1032942 1051776 1069234 1084727 1098038 1109683 1120375 1129976 1137257 1141040 1141425 1139480 1135837 1130099
61166 1130099 1121618 1110312 1096542 1080737 1063490 1045517 1026968 1007067 985014 961178 936888
61155 936888 912989 889192 864936 840324 815929 792180 769496 748731 730828 715961 703456
61144 703456 692648 683491 676225 670836 667009 664335 662257 660037 657138 653737 650654 648758 648391 649306
61130 649306 651165 654202 659409 667782 679251 692620 706837 722171 739779 760327 783501 808891
61118 808891 836797 867867 902245 939413 978632 1019236 1060641 1102515 1145004 1188465 1232810
61107 1232810 1277239 1320643 1362079 1400857 1436469 1468663 1497492 1523077 1545357 1564097 1578988
$$ packed form
61190G64177K0528K2957K4400K5147K6306K7879K8477K7080K4318K1689J9984
61179A032942J8834J7458J5493J3311J1645J0692R601P281L783L85j945l643n738
61166A130099q481j1306j3770j5805j7247j7973j8549j9901k2053k3836k4290
61155I36888k3899k3797k4256k4612k4395k3749k2684k0765j7903j4867j2505
61144G03456j0808r157p266n389l827k674k078k220k899l401l083j896l67R15
61130F49306J859L037N207Q373J1469J3369J4217J5334J7608K0548K3174K5390
61118H08891K7906L1070L4378L7168L9219M0604M1405M1874M2489M3461M4345
61107A232810M4429M3404M1436L8778L5612L2194K8829K5585K2280J8740J4891
$$ plain form
61096 1578988 1589579 1595280 1595625 1590471 1579767 1563336 1541255 1514364 1483910 1450614 1414437 1375460
61084 1375460 1334569 1292983 1251419 1210068 1169146 1129040 1090077 1052485 1016471 982079 949191
61073 949191 918150 890108 866078 845691 827587 811165 797181 786307 777830 770421 763737 758545
61061 758545 755487 754392 754766 756414 759441 764064 770505 778796 788605 799487 811319 824322 838737
61048 838737 854800 872971 893815 917542 943864 972358 1002762 1034924 1068797 1104620 1142873
61037 1142873 1183964 1228057 1275208 1325378 1378240 1433188 1489750 1547951 1608283 1671418 1737882
61026 1737882 1807718 1880495 1955908 2034572 2118158 2208917 2309543 2423822 2557139 2715932
61016 2715932 2906182 3131883 3394212 3691823 4022354 4384578 4780071 5213732 5693235
$$ packed form
61096A578988J0591N701L45n154j0704j6431k2081k6891l0454l3296l6177l8977
61084A375460m0891m1586m1564m1351m0922m0106l8963l7592l6014l4392l2888
61073I49191l1041k8042k4030k0387j8104j6422j3984j0874q477p409o684n192
61061G58545l058j095L74J648L027M623O441Q291R809J0882J1832J3003J4415
61048H38737J6063J8171K0844K3727K6322K8494L0404L2162L3873L5823L8253
61037A142873M1091M4093M7151N0170N2862N4948N6562N8201O0332O3135O6464
61026A737882O9836P2777P5413P8664Q3586R0759J00626J14279J33317J58793
61016B715932J90250K25701K62329K97611L30531L62224L95493M33661M79503
$$ plain form
61007 5693235 6227547 6824500 7488082 8217171 9006867 9851794 10749870 11706050 12736068
60998 12736068 13867925 15135053 16555602 18101760 19677366 21126797 22281595 23022180
60990 23022180 23317887 23226089 22863038 22370644 21886461 21507644 21251087 21036273 20716143
60981 20716143 20145409 19242707 18010438 16514412 14851873 13128891 11446320 9886449
60973 9886449 8501496 7311014 6309411 5477124 4789377 4221440 3751527 3361730 3037398
60964 3037398 2766220 2537798 2343412 2175808 2029397 1900452 1786481 1685174 1594333 1512703
60954 1512703 1440019 1375823 1318824 1267824 1222614 1183197 1148493 1116583 1086171 1057209 1030066
60943 1030066 1004682 980646 957646 935608 914642 894966 876674 859475 842824 826323 809888
$$ packed form
61007E693235N34312N96953O63582P29089P89696Q44927Q98076R56180J030018
60998A2736068J131857J267128J420549J546158J575606J449431J154798P40585
60990B3022180K95707r1798l63051m92394m84183l78817k56557k14814l20130
60981B0716143n70734r02702j232269j496026j662539j722982j682571j559871
60973I886449j384953j190482j001603q32287o87747n67937m69913l89797l24332
60964C037398k71178k28422j94386j67604j46411j28945j13971j01307r0841q1630
60954A512703p2684o4196n6999n1000m5210l9417l4704l1910l0412k8962k7143
60943A030066k5384k4036k3000k2038k0966j9676j8292j7199j6651j6501j6435
$$ plain form
60932 809888 793618 777748 762650 748567 735340 722648 710481 699081 688407 678029 667649
60921 667649 657458 647819 638779 630073 621453 612926 604780 597396 590882 584829 578612 571973 565206 558801
60907 558801 553139 548483 544891 541986 539058 535653 531909 528210 524716 521393 518312 515666 513533 511776
60893 511776 510074 507943 504885 500774 496098 491637 487812 484342 480561 476072 471123 466328 461994 457874
60879 457874 453699 449717 446352 443440 440296 436634 432964 429850 427266 425007 423308 422535 422502 422671 422920
60864 422920 423587 424808 426351 428278 431246 435817 441715 448018 453889 458964 463262 467052 470758 474684
60850 474684 478689 482164 484466 485490 485828 486167 486486 486008 484117 481114 477749 474159 469735 464058 457637
60835 457637 451502 446289 441750 436950 430962 423767 416521 410635 406408 402927 399351 395827 392928 390751
$$ packed form
60932H09888j6270j5870j5098j4083j3227j2692j2167j1400j0674j0378j0380
60921F67649j0191r639r040q706q620q527q146p384o514o053o217o639o767o405
60907E58801n662m656l592k905k928l405l744l699l494l323l081k646k133j757
60893E11776j702k131l058m111m676m461l825l470l781m489m949m795m334m120
60879D57874m175l982l365k912l144l662l670l114k584k259j699p73l3J69K49
60864D22920O67J221J543J927K968M571N898O303N871N075M298L790L706L926
60850D74684M005L475K302J024L38L39L19m78j891l003l365l590m424n677o421
60835D57637o135n213m539m800n988p195p246n886m227l481l576l524k899k177
$$ plain form
60821 390751 389003 387566 386432 385344 384152 383402 383993 386176 389344 392835 396484 400260 403867 406966 409556
60806 409556 411907 414311 417009 420115 423507 426968 430559 434600 439188 443908 448225 451943 455166 457924
60792 457924 460028 461243 461526 461164 460659 460321 459989 459316 458286 457162 455924 454129 451492 448289 445016 441931
60776 441931 439105 436592 434199 431334 427463 422644 417362 412004 406820 402237 398734 396380 394762 393456
60762 393456 392313 391268 390196 389052 388027 387404 387309 387563 387732 387473 387026 387157 388268 389674 390224 389741 389406
60745 389406 390536 393307 396908 400534 403810 406503 408399 409586 410546 411777 413450 415468 417673 419935
60731 419935 422189 424490 426923 429336 431374 432923 434441 436560 439328 442068 444125 445597 447141 449207
60717 449207 451631 453923 455632 456361 455786 453981 451573 449260 447143 444744 441734 438361 435032 431663 427800
$$ packed form
60821C90751j748j437j134j088j192p50N91K183L168L491L649L776L607L099K590
60806D09556K351K404K698L106L392L461L591M041M588M720M317L718L223K758
60792D57924K104J215K83l62n05l38l32o73j030j124j238j795k637l203l273l085
60776D41931k826k513k393k865l871m819n282n358n184m583l503k354j618j306
60762C93456j143j045j072j144j025o23r5K54J69k59m47J31J111J406N50m83l35
60745C89406J130K771L601L626L276K693J896J187R60J231J673K018K205K262
60731D19935K254K301K433K413K038J549J518K119K768K740K057J472J544K066
60717D49207K424K292J709P29n75j805k408k313k117k399l010l373l329l369l863
$$ plain form
60702 427800 423308 418639 414270 410118 405765 401206 397038 393840 391550 389587 387443 385024 382566 380406
60688 380406 378779 377631 376690 375822 375231 375169 375640 376635 378411 381116 384251 387072 389551 392429 396103 400041
60672 400041 403625 407097 411107 415625 419850 423104 425381 427052 428485 429999 431852 434123 436689 439234
60658 439234 441179 441838 440992 439161 437020 434697 431983 429037 426347 424069 421949 419962 418510 417810 417518
60643 417518 417206 416801 416309 415484 414145 412615 411519 411140 411140 410887 410028 408894 408375 409162 410988 412809 413800
60626 413800 414078 414445 415724 418306 421913 425562 428125 429331 430068 431521 434056 437057 439613 441249 442186
60611 442186 443141 444698 446732 448655 450282 452097 454493 457247 460130 463532 467835 472422 476094 478503
60597 478503 480477 482761 485099 486905 488284 489842 491832 494093 496679 499902 503618 506962 509127 510090
$$ packed form
60702D27800m492m669m369m152m353m559m168l198k290j963k144k419k458k160
60688C80406j627j148r41q68n91o2M71R95J776K705L135K821K479K878L674L938
60672D00041L584L472M010M518M225L254K277J671J433J514J853K271K566K545
60658D39234J945O59q46j831k141k323k714k946k690k278k120j987j452p00k92
60643D17518l12m05m92q25j339j530j096l79%k53q59j134n19P87J826J821R91
60626D13800K78L67J279K582L607L649K563J206P37J453K535L001K556J636R37
60611D42186R55J557K034J923J627J815K396K754K883L402M303M587L672K409
60597D78503J974K284K338J806J379J558J990K261K586L223L716L344K165R63
$$ plain form
60583 510090 510290 509840 508535 506527 504472 502778 501078 498754 495785 492799 490479 489261 489469 491193 493904
60568 493904 496580 498474 499616 500552 501858 504031 507495 512318 517972 523583 528414 532104 534680 536499
60554 536499 538051 539631 541269 543012 545061 547491 550053 552465 554763 557220 560131 563849 568779 574947
60540 574947 581716 588306 594610 601219 608661 616883 625447 633904 641870 649069 655545 661704 668011 674714
60526 674714 681965 690072 699470 710482 723219 737617 753350 769684 785713 801006 816013 831565
60514 831565 847967 864836 881880 899434 917871 936745 955000 971965 987674 1002227 1015373
60503 1015373 1026899 1036989 1045891 1053575 1059955 1065155 1069243 1071985 1073191 1073086 1072070 1070305 1067784 1064485
60489 1064485 1060028 1053418 1043600 1030219 1013503 993588 970428 944315 915965 886046 855027 823573
$$ packed form
60583E10090K00m50j305k008k055j694j700k324k969k986k320j218K08J724K711
60568D93904K676J894J142R36J306K173L464M823N654N611M831L690K576J819
60554E36499J552J580J638J743K049K430K562K412K298K457K911L718M930O168
60540E74947O769O590O304O609P442Q222Q564Q457P966P199O476O159O307O703
60526F74714P251Q107R398J1012J2737J4398J5733J6334J6029J5293J5007J5552
60514H31565J6402J6869J7044J7554J8437J8874J8255J6965J5709J4553J3146
60503A015373J1526J0090Q902P684O380N200M088K742J206j05j016j765k521l299
60489A064485m457o610r818j3381j6716j9915k3160k6113k8350k9919l1019l1454
$$ plain form
60477 823573 792631 762909 734570 707652 682517 659671 639318 621248 605082 590400 576786
60466 576786 563975 552028 541196 531492 522464 513603 505010 497322 490756 484494 477580 470286 463890
60453 463890 458962 454623 449853 444777 439984 435316 430309 425429 421744 419392 417416 415216 413147 411325
60439 411325 408908 405270 401167 397963 396103 395000 394034 392920 391318 388934 386106 383650 381938 380564
60425 380564 379119 377832 377176 377135 377215 377099 377031 377442 378367 379332 379814 379727 379426 379294 379462 379883 380497 381251 382097
60406 382097 383083 384371 386067 388078 390166 392103 393756 395129 396398 397749 399063 399872 399815 399158 398749 399383
60390 399383 401231 403850 406553 408692 409794 409774 409069 408291 407537 406310 404372 402402 401347 401226 401151 400542
60374 400542 399739 399259 399112 399217 399856 401149 402537 403427 404015 404776 405461 405452 404981 405078 406202 407709 408960 410223
$$ packed form
60477H23573l0942k9722k8339k6918k5135k2846k0353j8070j6166j4682j3614
60466E76786j2811j1947j0832r704r028q861q593p688o566o262o914p294o396
60453D63890m928m339m770n076m793m668n007m880l685k352j976k200k069j822
60439D11325k417l638m103l204j860j103r66j114j602k384k828k456j712j374
60425C80564j445j287o56m1Q0j16o8M11R25R65M82q7l01j32J68M21O14P54Q46
60406C82097R86J288J696K011K088J937J653J373J269J351J314Q09n7o57m09O34
60390C99383J848K619K703K139J102k0p05p78p54j227j938j970j055j21p5o09
60374D00542q03m80j47J05O39J293J388Q90N88P61O85rm71R7J124J507J251J263
$$ plain form
60356 410223 412049 414297 416243 417349 417642 417600 417949 419273 421586 424437 427541 431025 435024 439421 444026
60341 444026 448624 452766 456080 458922 462131 465852 469184 471401 472999 475073 478062 481595 485214 488631
60327 488631 491492 493434 494355 494232 492815 489817 485363 480003 474404 469219 464962 461756 459390 457823 457309
60312 457309 457818 458837 460141 462282 465760 470144 474651 479246 484425 490188 496063 502049 508629 515711
60298 515711 522387 528094 533308 538550 543073 544998 542744 536236 526970 516987 507517 498449 489241 480201
60284 480201 472452 466690 462464 458897 455690 453120 451404 450384 449725 449200 448885 449106 449983 451004 451368 450896
60268 450896 450286 450268 450796 451326 451615 451893 452398 453140 454181 455815 458285 461406 464608 467383 469626 471453
60252 471453 472703 472869 471622 469194 465971 461893 456663 450492 444215 438584 433821 429960 427160 425372
$$ packed form
60356D10223J826K248J946J106K93m2L49J324K313K851L104L484L999M397M605
60341D44026M598M142L314K842L209L721L332K217J598K074K989L533L619L417
60327D88631K861J942R21j23j417k998m454n360n599n185m257l206k366j567n14
60312D57309N09J019J304K141L478M384M507M595N179N763N875N986O580P082
60298E15711O676N707N214N242M523J925k254o508r266r983r470r068r208r040
60284D80201p749n762m226l567l207k570j716j020o59n25l15K21Q77J021L64m72
60268D50896o10j8N28N30K89K78N05P42J041J634K470L121L202K775K243J827
60252D71453J250J66j247k428l223m078n230o171o277n631m763l861k800j788
$$ plain form
60238 425372 424103 422894 421866 421439 421667 422231 423004 424131 425549 426874 428003 429489 431961 435367 439124
60223 439124 442899 446789 450634 453725 455647 457129 459496 463239 467643 471929 476206 480920 485864 490349
60209 490349 494179 497857 501794 505830 509697 513523 517593 521885 526076 529946 533638 537519 541828 546402
60195 546402 550819 554877 558686 562077 564275 564729 564123 563822 564136 563882 562143 559829 558747 559388 560397 560212
60179 560212 558579 556323 554243 552589 551214 549759 547774 544998 541542 537753 533976 530600 528092 526687
60165 526687 526116 525913 526042 526976 529065 532088 535450 538579 541000 542427 543217 544457 547043 550577 553622
60150 553622 555202 555748 556426 557968 560456 563877 568352 573782 579633 585228 590242 595000 600358 607019 614822
60135 614822 622888 630676 638628 647389 656641 665159 671949 676787 679622 680003 677539 672683 666691 660756
$$ packed form
60238D25372j269j209j028m27K28N64P73J127J418J325J129J486K472L406L757
60223D39124L775L890L845L091J922J482K367L743M404M286M277M714M944M485
60209D90349L830L678L937M036L867L826M070M292M191L870L692L881M309M574
60195E46402M417M058L809L391K198M54o06l01L14k54j739k314j082O41J009j85
60179E60212j633k256k080j654j375j455j985k776l456l789l777l376k508j405
60165E26687n71k03J29R34K089L023L362L129K421J427P90J240K586L534L045
60150E53622J580N46O78J542K488L421M475N430N851N595N014M758N358O661P803
60135F14822Q066P788P952Q761R252Q518O790M838K835L81k464m856n992n935
$$ plain form
60121 660756 655228 649705 643849 638069 633254 629826 627364 625322 623705 622646 621681 620120 618127 616750
60107 616750 616746 617895 619630 621697 623854 625461 626029 625930 626047 626709 627385 627434 626837 626100 625664 625596 625787 626295 627347
60088 627347 629019 631122 633604 636887 641466 647218 653435 659567 665541 671266 676300 680302 683504 686318
60074 686318 688636 689770 689048 686256 681611 675520 668341 660244 651308 641756 631996 622469 613579 605674
60060 605674 598787 592445 586147 580062 574812 570450 566253 561785 557593 554431 552235 550436 548892 547910
60046 547910 547579 547703 548290 549513 551263 553231 555378 557842 560477 563078 565956 569561 573506 576713 578761
60031 578761 580347 582067 583369 583278 581610 578857 575248 570618 565025 558826 552113 544575 535984 526428 516075
60016 516075 505230 494699 485555 478203 471978 465965 460002 454618 450206 446689 443949 442154 441436 441454
$$ packed form
60121F60756n528n523n856n780m815l428k462k042j617j059r65j561j993j377
60107F16750mJ149J735K067K157J607N68r9J17O62O76M9n97p37m36o8J91N08J052
60088F27347J672K103K482L283M579N752O217O132N974N725N034M002L202K814
60074F86318K318J134p22k792m645o091p179q097q936r552r760r527q890p905
60060F05674o887o342o298o085n250m362m197m468m192l162k196j799j544r82
60046E47910l31J24N87J223J750J968K147K464K635K601K878L605L945L207K048
60031E78761J586J720J302r1j668k753l609m630n593o199o713p538q591r556j0353
60016E16075j0845j0531r144p352o225o013n963n384m412l517k740j795p18J8
$$ plain form
60002 441454 441556 441443 441540 442587 444851 447823 450769 453481 456344 459705 463439 467205 470926 474730 478521
59987 478521 481876 484356 485789 486278 486201 486197 486817 487987 489022 489312 488928 488412 488099 487747 486739 484544 481154
59970 481154 477150 473213 469551 466008 462761 460447 459366 458949 458415 457586 456665 455618 454448 453714 453931 454491
59954 454491 454144 452671 451242 450782 450887 450819 450722 451018 451248 450524 448899 447346 446445 445879 445237 444508 443626 442234
59936 442234 440204 437830 435267 432293 428953 425911 423697 421999 420200 418354 417096 416704 416769 416830 416904 417277
59920 417277 418099 419364 420995 422742 424152 424921 425263 425793 426975 428740 430627 432288 433906 436147 439563
59905 439563 443959 448456 452333 455676 458988 462281 465014 466994 468886 471519 475030 479018 483235 487593
59891 487593 491738 495292 498528 502237 506716 511436 515889 520246 524910 529877 534913 539952 544931 549628
$$ packed form
60002D41454J02j13R7J047K264K972K946K712K863L361L734L766L721L804L791
59987D78521L355K480J433M89p7mO20J170J035K90l84n16l13l52j008k195l390
59970D81154m004l937l662l543l247k314j081m17n34q29r21j047j170p34K17N60
59954D54491l47j473j429m60J05o8r7K96K30p24j625j553r01n66o42p29q82j392
59936D42234k030k374k563k974l340l042k214j698j799j846j258l92O5O1P4L73
59920D17277Q22J265J631J747J410P69L42N30J182J765J887J661J618K241L416
59905D39563M396M497L877L343L312L293K733J980J892K633L511L988M217M358
59891D87593M145L554L236L709M479M720M453M357M664M967N036N039M979M697
$$ plain form
59877 549628 554084 558854 564301 569868 574522 577742 579617 580233 579548 577755 575134 571570 566834 561326 555930
59862 555930 550994 546099 541041 536436 532936 530353 528025 525781 524119 523632 524637 527210 531218 536340
59848 536340 542315 549180 557062 565805 574868 583472 590761 596032 599099 600404 600606 600166 599416 598731 598257
59833 598257 597521 595686 592323 587782 582706 577427 571998 566661 561930 558068 554686 551113 547190 543366
59819 543366 539876 536104 531145 524858 518039 511499 505351 499285 493157 487093 481350 476380 472765 470661
59805 470661 469334 467692 465387 463113 461693 461101 460670 460075 459711 459924 460150 459259 456776 453412 450188 447374
59789 447374 444655 442081 440240 439383 438949 438229 437147 436003 434761 433105 431150 429621 429144 429630 430505 431369
59773 431369 432217 433146 434085 434962 436011 437701 440252 443303 446237 448791 451197 453750 456478 459304 462212
$$ packed form
59877E49628M456M770N447N567M654L220J875O16o85j793k621l564m736n508n396
59862E55930m936m895n058m605l500k583k328k244j662m87J005K573M008N122
59848E36340N975O865P882Q743R063Q604P289N271L067J305K02m40p50o85m74
59833E98257p36j835l363m541n076n279n429n337m731l862l382l573l923l824
59819E43366l490l772m959o287o819o540o148o066o128o064n743m970l615k104
59805D70661j327j642k305k274j420n92m31n95l64K13K26q91k483l364l224k814
59789D47374k719k574j841q57m34p20j082j144j242j656j955j529m77M86Q75Q64
59773D31369Q48R29R39Q77J049J690K551L051K934K554K406K553K728K826K908
$$ plain form
59758 462212 465043 467355 468784 469524 470174 471104 472207 473337 474748 476905 479889 483153 485922 487827 489154
59743 489154 490499 492222 494274 496401 498371 500003 501201 502083 502950 503999 505156 506282 507417 508648 509794
59728 509794 510479 510517 510080 509448 508757 508080 507540 507197 506875 506342 505719 505551 506287 507696 508928 509253 508644 507629
59710 507629 506741 506271 506368 507028 507928 508544 508634 508436 508285 508259 508341 508699 509462 510346 510869 510954 511054 511570 512398 513171
59690 513171 513719 514112 514409 514583 514620 514452 513806 512391 510366 508481 507524 507635 508241 508666 508711 508587 508472 508274
59672 508274 507808 506989 505798 504162 501994 499357 496516 493787 491303 488962 486689 484797 483972 484729 486813
59657 486813 489298 491336 492725 493714 494496 495083 495586 496255 497204 498296 499512 501272 504135 508053 512066 514870
59641 514870 515723 514821 512915 510703 508590 506797 505458 504586 504120 504086 504581 505551 506651 507547 508344 509561 511641
$$ packed form
59758D62212K831K312J429P40O50R30J103J130J411K157K984L264K769J905J327
59743D89154J345J723K052K127J970J632J198Q82Q67J049J157J126J135J231J146
59728E09794O85L8m37o32o91o77n40l43l22n33o23j68P36J409J232L25o09j015
59710E07629q88m70R7O60R00O16R0j98j51k6Q2L58P63Q84N23Q5J00N16Q28P73
59690E13171N48L93K97J74L7j68o46j415k025j885r57J11O06M25M5j24j15j98
59672E08274m66q19j191j636k168k637k841k729k484k341k273j892q25P57K084
59657D86813K485K038J389R89P82N87N03O69R49J092J216J760K863L918M013K804
59641E14870Q53r02j906k212k113j793j339q72m66l4M95R70J100Q96P97J217K080
$$ plain form
59624 511641 514546 517881 521271 524534 527600 530463 533171 535695 537776 539063 539463 539157 538153 536074 532663
59609 532663 528450 524598 522050 521028 521341 522788 525048 527493 529484 530779 531420 531304 530150 527938 525096
59594 525096 522155 519339 516569 513734 510853 508018 505293 502644 499943 497018 493746 490217 486806 483978
59580 483978 481792 479735 477296 474678 472601 471335 470323 468957 467316 465840 464668 463767 463388 463794 464678
59565 464678 465421 465919 466551 467381 468065 468690 469986 472345 475199 477839 480450 483814 488244 493245 498059 502171
59549 502171 505460 508279 511337 515167 519715 524664 529984 535913 542528 549703 557465 566162 576251 588150
59535 588150 602163 618251 635777 653523 669867 683065 691878 696443 698401 699762 701619 704067 707082
59522 707082 711005 716279 723174 731692 741319 750861 759001 765188 769673 772625 773584 771914 767447 760542
$$ packed form
59624E11641K905L335L390L263L066K863K708K524K081J287M00l06j004k079l411
59609E32663m213l852k548j022L13J447K260K445J991J295O41j16j154k212k842
59594E25096k941k816k770k835k881k835k725k649k701k925l272l529l411k828
59580D83978k186k057k439k618k077j266j012j366j641j476j172r01l79M06Q84
59565D64678P43M98O32Q30O84O25J296K359K854K640K611L364M430N001M814M112
59549E02171L289K819L058L830M548M949N320N929O615P175P762Q697J0089J1899
59535E88150J4013J6088J7526J7746J6344J3198Q813M565J958J361J857K448L015
59522G07082L923N274O895Q518R627R542Q140O187M485K952R59j670m467o905
$$ plain form
59508 760542 751767 741623 730328 717835 704302 690535 677574 665812 654975 645031 636591 630157
59496 630157 625462 621936 619494 618454 618990 621018 624378 628810 633988 639927 647042 655392 664182 672566
59482 672566 680724 689570 699555 710505 722536 736264 751853 768557 785688 803500 822621 842961
59470 842961 863606 883462 901461 916509 928044 936843 944788 953614 964107 976521 991295 1009001
59458 1009001 1029867 1053734 1080529 1110522 1144000 1180789 1220127 1260998 1302513 1344137 1385838
59447 1385838 1428308 1472823 1520299 1569867 1618137 1659795 1688892 1699964 1689035 1654905 1600084
59436 1600084 1530187 1451905 1371103 1292191 1218309 1151443 1092426 1041173 997101 959429 927434
59425 927434 900733 879226 862638 850360 841992 837869 838668 844449 854382 867410 882827 900041 918130
$$ packed form
59508G60542q775j0144j1295j2493j3533j3767j2961j1762j0837r944q440o434
59496F30157m695l526k442j040N36K028L360M432N178N939P115Q350Q790Q384
59482F72566Q158Q846R985J0950J2031J3728J5589J6704J7131J7812J9121K0340
59470H42961K0645J9856J7999J5048J1535Q799P945Q826J0493J2414J4774J7706
59458A009001K0866K3867K6795K9993L3478L6789L9338M0871M1515M1624M1701
59447A385838M2470M4515M7476M9568M8270M1658K9097J1072j0929l4130n4821
59436A600084o9897p8282q0802p8912p3882o6866n9017n1253m4072l7672l1995
59425I27434k6701k1507j6588j2278q368m123P99N781R933J3028J5417J7214J8089
$$ plain form
59412 918130 936029 953225 970086 987332 1005020 1021801 1035029 1041698 1039619 1028187 1008519 983081
59400 983081 954937 926922 901139 879026 861514 848758 839631 831783 822501 809725 792532 771084
59388 771084 746360 719831 693164 667957 645445 626158 609865 596025 584332 574694 566729 559683
59376 559683 553055 547111 542501 539473 537714 536934 537285 539072 542167 545909 549563 552835 555971 559458 563668
59361 563668 568696 574491 581128 589012 598731 610554 624061 638397 653010 668096 684281 701998
59349 701998 721236 741765 763438 786330 810608 836142 862147 887419 911072 932852 952565
59338 952565 969554 983218 993847 1002293 1008657 1011764 1010148 1003229 991370 975153 954945 930985
59326 930985 903667 873860 843065 812945 784376 757134 730779 705688 682976 663484 647075
$$ packed form
59412I18130J7899J7196J6861J7246J7688J6781J3228O669k079j1432j9668k5438
59400I83081k8144k8015k5783k2113j7512j2756r127p848r282j2776j7193k1448
59388G71084k4724k6529k6667k5207k2512j9287j6293j3840j1693r638p965p046
59376E59683o628n944m610l028j759p80L51J787L095L742L654L272L136L487M210
59361E63668N028N795O637P884R719J1823J3507J4336J4613J5086J6185J7717
59349G01998J9238K0529K1673K2892K4278K5534K6005K5272K3653K1780J9713
59338I52565J6989J3664J0629Q446O364L107j616o919j1859j6217k0208k3960
59326I30985k7318k9807l0795l0120k8569k7242k6355k5091k2712j9492j6409
$$ plain form
59315 647075 632863 620032 608514 599030 592321 588288 586092 585195 585886 588484 592384 596424 600084 603801
59301 603801 608211 613606 620280 628800 639464 651565 663387 672874 678345 678992 675082 667673 657953 646870
59287 646870 635388 624857 616695 611607 609244 608722 609446 611406 614865 619924 626408 634005 642468 651795
59273 651795 662313 674482 688479 704002 720551 737774 755373 772766 789135 803879 816827
59262 816827 827985 837191 844069 848147 849018 846583 841165 833251 823163 811196 797960 784200 770289
59249 770289 756295 742679 730443 720372 712516 706660 702903 701331 701460 702497 704063 706336 709656
59236 709656 714308 720512 728216 736907 745872 754560 762523 769324 774847 779371 782904 784629 783514 779267
59222 779267 772178 762286 749418 734059 717378 700187 682556 664771 647996 633408 620966 609554
$$ packed form
59315F47075j4212j2831j1518r484o709m033k196q97O91K598L900M040L660L717
59301F03801M410N395O674Q520J0664J2101J1822R487N471O47l910p409r720j1083
59287F46870j1482j0531q162n088k363n22P24J960L459N059O484P597Q463R327
59273F51795J0518J2169J3997J5523J6549J7223J7599J7393J6369J4744J2948
59262H16827J1158R206O878M078Q71k435n418p914j0088j1967j3236j3760j3911
59249G70289j3994j3616j2236j0071p856n856l757j572J29J037J566K273L320
59236G09656M652O204P704Q691Q965Q688P963O801N523M524L533J725j115m247
59222G79267p089r892j2868j5359j6681j7191j7631j7785j6775j4588j2442j1412
$$ plain form
59210 609554 598217 586844 575816 565441 555921 547614 540965 536002 531947 527633 522526 517223 512706
59197 512706 509324 506821 505156 504660 505324 506417 507140 507305 507218 507200 507469 508244 509710 511974 515100 518945 523013
59180 523013 526878 530852 535729 541663 547843 553730 560168 568604 579378 591389 603399 615069 626680
59167 626680 638470 650672 663774 678188 693647 709238 724128 738036 750961 762666 772641 780415
59155 780415 785646 787938 786924 782668 775786 766934 756383 744283 731133 717637 704184 690749 677285
59142 677285 663897 650729 638059 626446 616351 607500 599039 590492 582208 574744 568236 562628 558142
59129 558142 555091 553479 553149 554137 556451 559596 562762 565673 568992 573703 580132 587640 595318 602968 611299
59114 611299 621014 631840 642683 652679 661794 670400 678746 687053 695675 704729 713749 722081 729508 736198
$$ packed form
59210F09554j1337j1373j1028j0375r520q307o649m963m055m314n107n303m517
59197E12706l382k503j665m96O64J093P23J65q7j8K69P75J466K264L126L845M068
59180E23013L865L974M877N934O180N887O438Q436J0774J2011J2010J1670J1611
59167F26680J1790J2202J3102J4414J5459J5591J4890J3908J2925J1705R975P774
59155G80415N231K292j014m256o882q852j0551j2100j3150j3496j3453j3435j3464
59142F77285j3388j3168j2670j1613j0095q851q461q547q284p464o508n608m486
59129E58142l051j612l30R88K314L145L166K911L319M711O429P508P678P650Q331
59114F11299R715J0826J0843R996R115Q606Q346Q307Q622R054R020Q332P427O690
$$ plain form
59100 736198 742210 747456 752129 756735 761537 766110 769554 771121 770710 768929 766686 764597 762718 760812
59086 760812 758710 756342 753563 750173 746037 741052 735010 727687 719084 709546 699687 690133 681152 672387
59072 672387 663101 652873 642041 631359 621312 611822 602540 593381 584895 578065 573447 570384 567365
59059 567365 563396 558794 554464 550688 547035 543199 539412 535955 532748 529548 526292 523032 519769 516544
59045 516544 513587 511231 509709 509081 509250 509919 510631 511062 511359 512130 513949 516863 520497 524633 529453 535053
59029 535053 540900 546192 550799 555581 561649 569440 578576 588360 598324 608458 619075 630329 641902
59016 641902 653363 664771 676469 688155 698665 707007 713261 718123 721908 724566 726407 728141 730158
59003 730158 732316 734613 737639 742080 748089 755323 763452 772320 781731 791313 800650 809478 817610 824737
$$ packed form
59100G36198O012N246M673M606M802M573L444J567m11j781k243k089j879j906
59086G60812k102k368k779l390m136m985o042p323q603r538r859r554q981q765
59072F72387r286j0228j0832j0682j0047r490r282r159q486o830m618l063l019
59059E67365l969m602m330l776l653l836l787l457l207l200l256l260l263l225
59045E16544k957k356j522o28J69O69P12M31K97P71J819K914L634M136M820N600
59029E35053N847N292M607M782O068P791R136R784R964J0134J0617J1254J1573
59016F41902J1461J1408J1698J1686J0510Q342O254M862L785K658J841J734K017
59003G30158K158K297L026M441O009P234Q129Q868R411R582R337Q828Q132P127
$$ plain form
58989 824737 830390 834286 836681 838113 838711 837947 835257 830789 825284 819315 812882 805703 797755 789523 781843
58974 781843 775462 770663 767375 765630 765662 767462 770538 774364 778843 784052 789759 795580 801468 807632 814020
58959 814020 820243 825972 831075 835416 838881 841510 843130 842871 839640 833265 824750 815167 804769 793425
58945 793425 781439 769495 758131 747764 739028 732529 728283 725832 724866 725320 726756 728093 728147 726172
58931 726172 721841 715093 706292 696140 685109 673146 660334 647571 636100 626418 618166 611120 605703
58918 605703 602259 600359 599277 598790 599129 600355 602403 605602 610593 617546 625785 634352 642809 651472 661118
58903 661118 672452 685676 700580 717061 735314 755228 776029 796995 818229 840026 861681
58892 861681 881788 899777 916298 931924 946464 960075 974164 990359 1008993 1029187 1049929
$$ packed form
58989H24737N653L896K395J432N98p64k690m468n505n969o433p179p948q232p680
58974G81843o381m799l288j745L2J800L076L826M479N209N707N821N888O164O388
58959H14020O223N729N103M341L465K629J620k59l231o375q515r583j0398j1344
58945G93425j1986j1944j1364j0367q736o499m246k451r66M54J436J337N4j975
58931G26172m331o748q801j0152j1031j1963j2812j2763j1471r682q252p046n417
58918F05703l444j900j082m87L39J226K048L199M991O953Q239Q567Q457Q663R646
58903F61118J1334J3224J4904J6481J8253J9914K0801K0966K1234K1797K1655
58892H61681K0107J7989J6521J5626J4540J3611J4089J6195J8634K0194K0742
$$ plain form
58881 1049929 1070384 1089587 1106698 1121392 1133316 1141324 1143995 1140894 1132677 1119997 1102889 1081320
58869 1081320 1055741 1027002 996220 964821 934189 905016 877320 851188 827138 805605 786481
58858 786481 769383 754172 740957 729588 719250 708686 697098 684942 673442 663085 653027
58847 653027 642432 631905 622870 615769 609769 604237 599570 596217 593637 590804 587320 583577 580023 576656
58833 576656 573125 569103 564663 560377 556909 554455 552780 551703 551160 550819 550174 549271 548909 549727 551373 552972
58817 552972 554246 555806 558363 561971 566066 570016 573458 576259 578445 580330 582510 585369 588511 591012
58803 591012 592307 592580 592180 591097 589281 587035 584689 582266 579906 578235 577712 577977 578447 579253 580816 582737
58787 582737 584069 584647 585344 586921 589484 593107 598000 603772 609367 614215 618688 623070 626801 629272 630700
$$ packed form
58881A049929K0455J9203J7111J4694J1924Q008K671l101q217j2680j7108k1569
58869A081320k5579k8739l0782l1399l0632k9173k7696k6132k4050k1533j9124
58858G86481j7098j5211j3215j1369j0338j0564j1588j2156j1500j0357j0058
58847F53027j0595j0527r035p101o000n532m667l353k580k833l484l743l554l367
58833E76656l531m022m440m286l468k454j675j077n43l41o45r03l62Q18J646J599
58817E52972J274J560K557L608M095L950L442K801K186J885K180K859L142K501
58803E91012J295K73m00j083j816k246k346k423k360j671n23K65M70Q06J563J921
58787E82737J332N78O97J577K563L623M893N772N595M848M473M382L731K471J428
$$ plain form
58772 630700 631680 632445 633038 633545 633573 632125 628804 624749 621620 619931 618979 618088 617202 616467 615953 615767 615895
58755 615895 616084 616405 617725 620897 625566 630475 634986 639627 644961 650689 656246 661757 667830 674632 681662
58740 681662 688388 694747 700951 707100 713144 719129 725198 731357 737423 743302 749112 754864 760275 765232
58726 765232 770244 775993 782447 788882 794812 800422 806033 811701 817464 823423 829318 834644 839549 844987
58712 844987 851455 858142 863935 868830 873545 878071 881521 883361 883882 883264 880883 875977 868509 858936 847491
58697 847491 834111 819000 802811 786132 769017 751251 733096 715592 699925 686500 674788
58686 674788 664028 653852 644271 635431 627563 620891 615395 610820 606948 603613 600402 596830 593020 589841
58672 589841 587989 587242 586951 587029 588118 590922 595659 601955 609009 616082 623054 630358 638247 646449 654656
$$ packed form
58772F30700R80P65N93N07K8j448l321m055l129j689r52q91q86p35n14j86J28
58755F15895J89L21J320L172M669M909M511M641N334N728N557N511O073O802P030
58740F81662O726O359O204O149O044N985O069O159O066N879N810N752N411M957
58726G65232N012N749O454O435N930N610N611N668N763N959N895N326M905N438
58712H44987O468O687N793M895M715M526L450J840N21o18k381m906p468r573j1445
58697H47491j3380j5111j6189j6679j7115j7766j8155j7504j5667j3425j1712
58686F74788j0760j0176r581q840p868o672n496m575l872l335l211l572l810l179
58672E89841j852p47k91P8J089K804M737O296P054P073O972P304P889Q202Q207
$$ plain form
58657 654656 662812 670562 676867 680692 681819 680628 677588 673474 669591 666999 665648 664912 664677 665176 665952
58642 665952 665922 664612 662593 660538 658477 656244 654023 652170 650987 650968 652827 656854 662432 668458 674145
58627 674145 679371 684463 689750 695085 699766 703175 705526 707725 710389 713369 716268 719188 722769 727745
58613 727745 734627 743612 754615 767283 780909 794377 806495 816668 825021 831633 835998 837748 837635
58600 837635 837117 836939 836772 836283 835825 835767 835821 835562 835158 835054 835227 835448 836191 838631 843470 850178 857654 865406
58582 865406 873727 882860 892467 902139 912085 922928 934837 947219 959223 970260 980010 988349 995459
58569 995459 1001788 1007733 1013556 1019628 1026300 1033424 1040487 1047497 1055177 1063998 1073579 1083547 1094333 1106304
58555 1106304 1118518 1129231 1137489 1143398 1146929 1147440 1144544 1138656 1130351 1119854 1107520 1094293 1081216
$$ packed form
58657F54656Q156P750O305L825J127j191l040m114l883k592j351p36k35M99P76
58642F65952l0j310k019k055k061k233k221j853j183j9J859M027N578O026N687
58627F74145N226N092N287N335M681L409K351K199K664K980K899K920L581M976
58613G27745O882Q985J1003J2668J3626J3468J2118J0173Q353O612M365J750j13
58600H37635n18j78j67m89m58n8N4k59m04j04J73K21P43K440M839O708P476P752
58582H65406Q321R133R607R672R946J0843J1909J2382J2004J1037R750Q339P110
58569I95459O329N945N823O072O672P124P063P010P680Q821R581R968J0786J1971
58555A106304J2214J0713Q258N909L531N11k896n888q305j0497j2334j3227j3077
$$ plain form
58542 1081216 1068747 1056769 1045006 1033225 1021343 1009505 997884 986331 974465 962138 949599
58531 949599 937306 925851 915868 907529 900267 893602 888167 885227 885068 886593 888709 891419 895208 900024
58517 900024 905432 911296 917675 924243 930268 935086 938342 940039 940682 941210 942511 944996 948670 953318 958493
58502 958493 963686 968780 974115 979905 985929 991983 998269 1005055 1012256 1019699 1027414 1035197 1042116 1047067
58488 1047067 1049908 1051606 1053162 1054682 1055616 1055589 1054751 1053501 1052179 1051095 1050596 1050875 1051759 1052949 1054474 1056655
58472 1056655 1059464 1062172 1063805 1063744 1061683 1057358 1050741 1042342 1032826 1022436 1011129 999221 987420
58459 987420 976275 966046 957122 950054 945063 941897 940225 939787 940119 940732 941721 943743 947022 950719 953512
58444 953512 954591 953933 951955 949194 946131 943101 940373 938321 937343 937641 939275 942315 946678 951945 957765
$$ packed form
58542A081216j2469j1978j1763j1781j1882j1838j1621j1553j1866j2327j2539
58531I49599j2293j1455r983q339p262o665n435k940j59J525K116K710L789M816
58517I00024N408N864O379O568O025M818L256J697O43N28J301K485L674M648N175
58502I58493N193N094N335N790O024O054O286O786P201P443P715P783O919M951
58488A047067K841J698J556J520R34k7q38j250j322j084m99K79Q84J190J525K181
58472A056655K809K708J633o1k061m325o617q399r516j0390j1307j1908j1801
58459I87420j1145j0229q924p068m991l166j672m38L32O13R89K022L279L697K793
58444I53512J079o58j978k761l063l030k728k052r78K98J634L040M363N267N820
$$ plain form
58429 957765 964349 972093 980776 989679 998519 1007721 1017624 1028022 1038702 1049871 1061654 1073507 1084475
58416 1084475 1093785 1101019 1105995 1108736 1109373 1108031 1104967 1100742 1095819 1090069 1083222 1075807 1069023 1063485
58402 1063485 1058657 1053812 1049022 1044915 1041917 1040134 1039636 1040500 1042755 1046462 1051592 1057765 1064356 1070877
58388 1070877 1076855 1081476 1083935 1084201 1082910 1080469 1076910 1072576 1068081 1063428 1058112 1052478 1048116 1046344
58374 1046344 1046986 1049095 1052092 1055592 1058958 1061953 1065414 1070452 1077249 1085120 1093360 1101445 1108875 1115625
58360 1115625 1122527 1130597 1140094 1150625 1161802 1173290 1184575 1195259 1205331 1214640 1222487 1228354
58348 1228354 1232714 1236539 1240276 1243895 1247608 1251875 1256863 1262522 1269052 1276710 1285319 1294530 1304473 1315648
58334 1315648 1328226 1341951 1356600 1372080 1388108 1404175 1419802 1434518 1447825 1459540 1470039
$$ packed form
58429I57765O584P744Q683Q903Q840R202R903J0398J0680J1169J1783J1853J0968
58416A084475R310P234M976K741O37j342l064m225m923n750o847p415o784n538
58402A063485m828m845m790m107k998j783m98Q64K255L707N130O173O591O521
58388A070877N978M621K459K66j291k441l559m334m495m653n316n634m362j772
58374A046344O42K109K997L500L366K995L461N038O797P871Q240Q085P430O750
58360A115625O902Q070R497J0531J1177J1488J1285J0684J0072R309P847N867
58348A228354M360L825L737L619L713M267M988N659O530P658Q609R211R943J1175
58334A315648J2578J3725J4649J5480J6028J6067J5627J4716J3307J1715J0499
$$ plain form
58323 1470039 1479852 1489181 1498000 1506261 1513752 1520222 1526034 1532243 1539589 1547894 1556955 1567438 1580185
58310 1580185 1595067 1611288 1628501 1646856 1666275 1686504 1707684 1730019 1753017 1775899 1798720
58299 1798720 1822235 1846503 1870435 1893051 1914618 1936231 1958670 1981873 2005197 2027986 2050150
58288 2050150 2072361 2095676 2120984 2148706 2178673 2210058 2241896 2274099 2307726 2343821 2382182
58277 2382182 2421664 2461403 2501310 2541641 2582709 2624978 2668967 2714946 2762889 2812612 2863787
58266 2863787 2916117 2969804 3025713 3084846 3147764 3214523 3284781 3357888 3433369 3511529 3593168
58255 3593168 3678580 3767350 3859172 3954144 4052097 4152523 4255630 4362782 4475455 4594367
58245 4594367 4719904 4852640 4993087 5141750 5299763 5468527 5648411 5838898 6040458
$$ packed form
58323A470039R813R329Q819Q261P491O470N812O209P346Q305R061J0483J2747
58310A580185J4882J6221J7213J8355J9419K0229K1180K2335K2998K2882K2821
58299A798720K3515K4268K3932K2616K1567K1613K2439K3203K3324K2789K2164
58288B050150K2211K3315K5308K7722K9967L1385L1838L2203L3627L6095L8361
58277B382182L9482L9739L9907M0331M1068M2269M3989M5979M7943M9723N1175
58266B863787N2330N3687N5909N9133O2918O6759P0258P3107P5481P8160Q1639
58255C593168Q5412Q8770R1822R4972R7953J00426J03107J07152J12673J18912
58245D594367J25537J32736J40447J48663J58013J68764J79884J90487K01560
$$ plain form
58236 6040458 6255072 6484407 6728862 6989140 7267341 7565507 7884544 8225789 8592372
58227 8592372 8987777 9414298 9874301 10371884 10911922 11498672 12136930 12833738 13597655
58218 13597655 14437664 15364605 16393107 17541209 18829981 20286136 21945372 23853401
58210 23853401 26066774 28655142 31699892 35284409 39480352 44337751 49880692 56107717
58202 56107717 62999964 70537304 78712753 87535222 97022458 107190716 118041732 129549969
58194 129549969 141664673 154336145 167550967 181352579 195845649 211194681 227597285
58187 227597285 245178757 263780216 282703636 300568866 315445071 325293009 328544700
58180 328544700 324518596 313472165 296363739 274564621 249668352 223343120 197131867
$$ packed form
58236F040458K14614K29335K44455K60278K78201K98166L19037L41245L66583
58227H592372L95405M26521M60003M97583N40038N86750O38258O96808P63917
58218A3597655Q40009R26941J028502J148102J288772J456155J659236J908029
58210B3853401K213373K588368L044750L584517M195943M857399N542941O227025
58202E6107717O892247P537340Q175449Q822469R487236J0168258J0851016J1508237
58194A29549969J2114704J2671472J3214822J3801612J4493070J5349032J6402604
58187B27597285J7581472J8601459J8923420J7865230J4876205R847938L251691
58180C28544700m026104j1046431j7108426k1799118k4896269k6325232k6211253
$$ plain form
58173 197131867 172239727 149434191 129095703 111331395 96063540 83088066 72132348
58166 72132348 62908852 55145107 48594636 43045440 38325268 34295400 30839761 27861226
58158 27861226 25282164 23040018 21080579 19356869 17831336 16474260 15260025 14166890
58150 14166890 13178476 12282134 11466291 10721092 10040050 9418464 8850979 8332376 7859254
58141 7859254 7428722 7036381 6677476 6348879 6047984 5770524 5511407 5267012 5035163
58132 5035163 4813872 4601994 4400466 4211103 4034371 3869363 3715124 3570655 3434391
58123 3434391 3305167 3183183 3068890 2961530 2859788 2763102 2671190 2583236 2498832 2418904
58113 2418904 2344290 2273984 2206109 2140032 2076351 2015395 1957082 1901701 1849484 1799740 1751595
$$ packed form
58173A97131867k4892140k2805536k0338488j7764308j5267855j2975474j0955718
58166G2132348r223496p763745o550471n549196m720172m029868l455639k978535
58158B7861226k579062k242146j959439j723710j525533j357076j214235j093135
58150A4166890r88414q96342q15843p45199o81042o21586n67485n18603m73122
58141G859254m30532l92341l58905l28597l00895k77460k59117k44395k31849
58132E035163k21291k11878k01528j89363j76732j65008j54239j44469j36264
58123C434391j29224j21984j14293j07360j01742r6686r1912q7954q4404p9928
58113B418904p4614p0306o7875o6077o3681o0956n8313n5381n2217m9744m8145
$$ plain form
58102 1751595 1705259 1661475 1620059 1580043 1540966 1503050 1466401 1431004 1397180 1365154 1334533
58091 1334533 1304975 1276947 1251013 1226889 1204030 1182522 1162463 1143094 1123583 1104187 1085659
58080 1085659 1068017 1050873 1034298 1018241 1001739 984043 966039 949171 933358 917397 901203
58069 901203 886050 872560 859905 847272 834791 822677 810578 798311 786352 775184 764788
58058 764788 755051 745977 737234 728108 718195 707717 697031 686314 675770 665689 656256 647620 640011
58045 640011 633345 627013 620557 614264 608532 603025 597145 590965 584889 578717 571973 564996 558734 553528
58031 553528 548980 544911 541434 538025 533528 527370 520092 512639 505750 499957 495284 490925 486117 481394
58017 481394 478068 476325 474819 472383 469180 465833 462346 458478 454444 450721 447634 445494 444544 444358 443848
$$ packed form
58102A751595m6336m3784m1416m0016l9077l7916l6649l5397l3824l2026l0621
58091A334533k9558k8028k5934k4124k2859k1508k0059j9369j9511j9396j8528
58080A085659j7642j7144j6575j6057j6502j7696j8004j6868j5813j5961j6194
58069I01203j5153j3490j2655j2633j2481j2114j2099j2267j1959j1168j0396
58058G64788r737r074q743r126r913j0478j0686j0717j0544j0081r433q636p609
58045F40011o666o332o456o293n732n507n880o180o076o172o744o977o262n206
58031E53528m548m069l477l409m497o158p278p453o889n793m673m359m808m723
58017D81394l326j743j506k436l203l347l487l868m034l723l087k140r50j86n10
$$ plain form
58002 443848 442324 440152 438068 436372 435113 434502 434621 435109 435493 435593 435310 434438 432998 431469 430382 429878
57986 429878 429781 429825 429708 429296 428825 428508 427939 426424 424040 421782 420449 419862 419351 418446 416872 414553 411981
57969 411981 409981 408633 406928 404034 400490 397577 395772 394412 392812 391223 390595 391529 393490 395086 395319
57954 395319 394483 393531 392709 391444 389565 387833 386865 386240 385228 383895 382904 382527 382403 382079 381355 380282 379232
57937 379232 378748 379012 379721 380803 382833 386243 390431 394229 397081 399243 400986 402175 402609 402269 401155
57922 401155 399235 396547 393102 388720 383271 377009 370438 363939 357718 351830 345962 339541 332569 326088
57908 326088 321251 318035 315457 312950 310888 309736 309356 309331 309403 309360 309026 308570 308344 308181 307397 305863 304591
57891 304591 304757 306414 308566 310213 310937 310744 309923 309036 308588 308651 309051 309763 310776 311644 311655 310485 308365
$$ packed form
58002D43848j524k172k084j696j259o11J19M88L84J00k83q72j440j529j087n04
57986D29878r7M4j17m12m71l17n69j515k384k258j333n87n11r05j574k319k572
57969D11981k000j348j705k894l544k913j805j360j600j589o28R34J961J596K33
57954C95319q36r52q22j265j879j732r68o25j012j333r91l77j24l24p24j073j050
57937C79232m84K64P09J082K030L410M188L798K852K162J743J189M34l40j114
57922D01155j920k688l445m382n449o262o571o499o221n888n868o421o972o481
57908C26088m837l216k578k507k062j152l80k5P2m3l34m56k26j63p84j534j272
57891C04591J66J657K152J647P24j93q21q87m48O3M00P12J013Q68J1j170k120
$$ plain form
57874 308365 305627 302479 299190 295983 292597 288415 283332 278108 273611 270038 267133 264779 262953 261437
57860 261437 260094 259284 259524 260854 262928 265550 268573 271450 273608 275359 277764 281387 285755 290260 294834
57845 294834 299303 302752 304282 304088 303172 302283 301701 301660 302094 302047 300330 296969 293372 290758 289031 287397
57829 287397 285407 282964 279983 276700 273982 272599 272337 272354 272243 272183 272119 271572 270466 269508 269308 269499 269257
57812 269257 268442 267683 267286 266484 264021 259285 252793 245722 239082 233119 227339 221158 214618 208343 202764
57797 202764 197669 192748 188269 184822 182522 180874 179395 177983 176650 175375 174314 173740 173637 173751 174154
57782 174154 175215 176879 178570 180213 182615 186258 190235 193250 195271 197359 200080 203049 205938 208826
57768 208826 211372 212727 212785 212623 213063 213489 212791 210910 208640 206289 203489 200177 196886 193976 191251 188517
$$ packed form
57874C08365k738l148l289l207l386m182n083n224m497l573k905k354j826j516
57860B61437j343q10K40J330K074K622L023K877K158J751K405L623M368M505M574
57845B94834M469L449J530j94r16q89n82m1M34m7j717l361l597k614j727j634
57829B87397j990k443k981l283k718j383k62J7j11o0o4n47j106r58k00J91k42
57812B69257q15p59l97q02k463m736o492p071o640n963n780o181o540o275n579
57797B02764n095m921m479l447k300j648j479j412j333j275j061n74j03J14M03
57782A74154J061J664J691J643K402L643L977L015K021K088K721K969K889K888
57768B08826K546J355N8j62M40M26o98j881k270k351k800l312l291k910k725k734
$$ plain form
57752 188517 185896 183423 180920 178615 177303 177403 178138 178233 177311 176097 175254 174599 173672 172623 171996 171864 171677
57735 171677 171039 170178 169450 168789 168012 167373 167350 167925 168501 168573 168202 167747 167439 167275 167075 166576 165708 164888 164731
57716 164731 165393 166431 167379 168098 168425 167953 166565 164863 163616 162884 162099 160909 159552 158407 157585 157073
57700 157073 156942 157215 157691 158078 158236 158247 158402 159098 160594 162751 165170 167652 170385 173580 177078 180597
57684 180597 184323 189040 195504 203736 213060 222792 232824 243563 255560 269250 284807 301944 319932
57671 319932 338219 357130 377774 401146 427540 456711 487809 518425 543970 558970 559677 545606
57659 545606 518914 482999 441804 399426 359137 322515 289860 261376 237451 217921 201898
57648 201898 188641 178036 169854 163147 156962 151221 146273 141935 137777 134104 131740 130789 130461 130260
$$ packed form
57752A88517k621k473k503k305j312J00P35R5r22j214q43o55r27j049o27j32j87
57735A71677o38q61p28o61p77o39k3N75N76P2l71m55l08j64k00m99q68q20j57
57716A64731O62J038R48P19L27m72j388j702j247p32p85j190j357j145q22n12
57700A57073j31K73M76L87J58J1J55O96J496K157K419K482K733L195L498L519
57684A80597L726M717O464Q232R324R732J0032J0739J1997J3690J5557J7137J7988
57671C19932J8287J8911K0644K3372K6394K9171L1098L0616K5545J5000P07j4071
57659E45606k6692l5915m1195m2378m0289l6622l2655k8484k3925j9530j6023
57648B01898j3257j0605q182o707o185n741m948m338m158l673k364r51l28k01
$$ plain form
57634 130260 130374 130614 130031 128246 126306 125338 125035 124417 123507 123040 122803 121598 119027 116192 114244 113117
57618 113117 112194 111437 111296 111979 113306 114886 116044 116020 114712 112967 111747 111259 111122 111013 110757 110207 109450
57601 109450 108890 108665 108273 107222 105829 104816 104253 103492 102168 100774 100017 99881 99565 98234 95779 92846
57585 92846 90178 87954 85902 83971 82523 81800 81530 81313 81053 80761 80247 79437 78705 78448 78420 77923 76588
57568 76588 74662 72595 70743 69366 68526 67950 67335 66816 66800 67369 68160 68853 69408 69805 69936 69875 69945 70353 70974
57549 70974 71605 72148 72434 72155 71199 69901 68791 68176 68089 68463 69156 69899 70398 70579 70705 71251 72593 74674
57531 74674 76935 78650 79413 79301 78671 77877 77112 76367 75541 74687 74042 73689 73372 72894 72586 72954 73867 74510
57513 74510 74342 73706 73254 73187 73456 74410 76481 79260 81533 82567 82910 83524 84508 85192 85238 84952 84501 83506
$$ packed form
57634A30260J14K40n83j785j940r68l03o18r10m67k37j205k571k835j948j127
57618A13117r23p57j41O83J327J580J158k4j308j745j220m88j37j09k56n50p57
57601A09450n60k25l92j051j393j013n63p61j324j394p57j36l16j331k455k933
57585I2846k668k224k052j931j448p23k70k17k60k92n14q10p32k57k8m97j335
57568G6588j926k067j852j377q40n76o15n19j6N69P91O93N55L97J31o1P0M08O21
57549G0974O31N43K86k79r56j298j110o15q7L74O93P43M99J81J26N46J342K081
57531G4674K261J715P63j12o30p94p65p45q26q54o45l53l17m78l08L68R13O43
57513G4510j68o36m52o7K69R54K071K779K273J034L43O14R84O84M6k86m51r95
$$ plain form
57495 83506 81780 79901 78522 77462 76006 73913 71566 69230 66879 64810 63781 64090 64978 65347 64857
57480 64857 63954 63072 62267 61510 60916 60533 60155 59535 58733 58160 58224 58913 59769 60372 60723 61014 61202 61145 61075 61456
57460 61456 62319 63136 63470 63357 62888 61898 60332 58505 56725 55097 53945 53880 54965 56324 57151 57639 58297
57443 58297 58777 58288 56948 55800 55479 55693 56126 56956 58232 59476 60256 60586 60461 59689 58574 58062 58646
57426 58646 59601 59925 59565 59053 58330 56904 55094 54133 54689 55935 56570 56281 55674 55080 54155 52714 51292
57409 51292 50519 50305 50167 50165 50870 52318 53567 53699 52902 52090 51755 51644 51383 50810 49742 48083 46352 45498
57391 45498 45904 47015 48246 49740 51722 53587 54403 54218 54133 54906 56063 56696 56639 56391 56174 55733 55081 54867
57373 54867 55650 57080 58195 58400 57860 56954 55774 54320 52888 51943 51629 51644 51613 51502 51618 52257 53320 54323
$$ packed form
57495H3506j726j879j379j060j456k093k347k336k351k069j029L09Q88L69m90
57480F4857r03q82q05p57n94l83l78o20q02n73O4O89Q56O03L51K91J88n7p0L81
57460F1456Q63Q17L34j13m69r90j566j827j780j628j152o5J085J359Q27M88O58
57443E8297M80m89j340j148l21K14M33Q30J276J244P80L30j25p72j115n12N84
57426E8646R55L24l60n12p23j426j810r61N56J246O35k89o07n94r25j441j422
57409E1292p73k14j38kP05J448J249J32p97q12l35j11k61n73j068j659j731q54
57391D5498M06J111J231J494J982J865Q16j85q5P73J157O33n7k48k17m41o52k14
57373E4867P83J430J115K05n40r06j180j454j432r45l14J5l1j11J16O39J063J003
$$ plain form
57355 54323 54851 54972 55109 55565 56359 57450 58808 60194 61164 61490 61386 61204 61095 61021 60805 60117 58757 57152
57337 57152 56132 55972 55982 55361 54084 52652 51371 50329 49711 49558 49428 48848 47941 47187 46752 46545 46672 47228
57319 47228 47807 47851 47391 46907 46528 45987 45260 44650 44281 44119 44416 45389 46534 47006 46749 46528 46788 47309 48059
57300 48059 49453 51425 53119 53954 54279 54585 54835 55094 56058 58241 61062 63440 64997 66222 67761 69944
57284 69944 72652 75299 77266 78632 80044 81633 82649 82489 81462 80141 78593 76776 74974 73130 70402
57269 70402 66184 61167 56665 53255 50720 48858 47582 46579 45716 45460 46148 47138 47472 47141 46896 47106
57253 47106 47669 48776 50820 53653 56798 60272 64325 68562 72289 75690 79578 83984 88025 91341 94593
57238 94593 98290 102152 105991 110182 114792 119138 122819 126400 130499 134889 139121 143351 147892 152455
$$ packed form
57355E4323N28J21J37M56P94J091J358J386R70L26j04j82j09p4k16o88j360j605
57337E7152j020j60J0o21j277j432j281j042o18j53j30n80r07p54m35k07J27N56
57319D7228N79M4m60m84l79n41p27o10l69j62K97R73J145M72k57k21K60N21P50
57300D8059J394J972J694Q35L25L06K50K59R64K183K821K378J557J225J539K183
57284F9944K708K647J967J366J412J589J016j60j027j321j548j817j802j844k728
57269G0402m218n017m502l410k535j862j276j003q63k56O88R90L34l31k45K10
57253D7106N63J107K044K833L145L474M053M237L727L401L888M406M041L316L252
57238I4593L697L862L839M191M610M346L681L581M099M390M232M230M541M563
$$ plain form
57224 152455 156526 160063 163268 166112 168642 171426 175087 179714 185190 191702 199357 207595 215618 223236
57210 223236 230850 238853 247538 257270 268163 279705 291226 302644 314330 326413 338685 351003
57198 351003 363289 375303 386933 398609 410868 423537 435899 447630 459040 470354 481352
57187 481352 491915 502382 513073 523864 534556 545349 556574 568194 579950 591911 604486
57176 604486 617833 631539 645060 658365 671934 686175 701064 716433 732417 749366 767446
57165 767446 786529 806414 826869 847476 867796 887789 907714 927464 946355 963870 980368
57154 980368 996770 1013756 1031527 1050135 1069674 1090259 1112093 1135426 1160170 1185846 1212425
57143 1212425 1241093 1273608 1310743 1351779 1395659 1442198 1491921 1545123 1601543 1660759 1722460
$$ packed form
57224A52455M071L537L205K844K530K784L661M627N476O512P655Q238Q023P618
57210B23236P614Q003Q685R732J0893J1542J1521J1418J1686J2083J2272J2318
57198C51003J2286J2014J1630J1676J2259J2669J2362J1731J1410J1314J0998
57187D81352J0563J0467J0691J0791J0692J0793J1225J1620J1756J1961J2575
57176F04486J3347J3706J3521J3305J3569J4241J4889J5369J5984J6949J8080
57165G67446J9083J9885K0455K0607K0320J9993J9925J9750J8891J7515J6498
57154I80368J6402J6986J7771J8608J9539K0585K1834K3333K4744K5676K6579
57143A212425K8668L2515L7135M1036M3880M6539M9723N3202N6420N9216O1701
$$ plain form
57132 1722460 1786326 1851978 1919231 1988226 2059218 2132321 2207523 2284844 2364322 2445883 2529316
57121 2529316 2614388 2700897 2788685 2877791 2968811 3063008 3161904 3266716 3378286 3497633 3626684
57110 3626684 3768823 3929176 4114600 4333300 4594224 4906360 5277923 5715250 6221662
57101 6221662 6796747 7436433 8134207 8883574 9680961 10527251 11427138 12387501 13416373
57092 13416373 14522021 15710649 16983061 18332127 19741258 21182639 22616098 23992283
57084 23992283 25261340 26382347 27327541 28080718 28634035 28985781 29137840 29091773 28845785
57075 28845785 28395396 27737086 26871294 25802741 24539736 23095770 21494291 19773631
57067 19773631 17987534 16199223 14471067 12854307 11382584 10070832 8918875 7917253
$$ packed form
57132A722460O3866O5652O7253O8995P0992P3103P5202P7321P9478Q1561Q3433
57121B529316Q5072Q6509Q7788Q9106R1020R4197R8896J04812J11570J19347J29051
57110C626684J42139J60353J85424K18700K60924L12136L71563M37327N06412
57101F221662N75085O39686O97774P49367P97387Q46290Q99887R60363J028872
57092A3416373J105648J188628J272412J349066J409131J441381J433459J376185
57084B3992283J269057J121007R45194P53177N53317L51746J52059m6067k45988
57075B8845785m50389o58310q65792j068553j263005j443966j601479j720660
57067A9773631j786097j788311j728156j616760j471723j311752j151957j001622
$$ plain form
57059 7917253 7052168 6308102 5669076 5119910 4647309 4239829 3887197 3580221 3311323
57050 3311323 3074501 2864505 2676394 2506095 2351093 2210245 2082927 1968267 1864823
57041 1864823 1770760 1684501 1605370 1533546 1469340 1412579 1362624 1318680 1280028 1246237 1217320
57030 1217320 1193530 1174838 1160842 1151407 1147413 1150627 1162369 1181473 1202824 1217969 1218298 1198997
57018 1198997 1160765 1108155 1046487 980116 912679 847776 788701 737455 694159 657525 625911
57007 625911 598107 573397 551308 531571 514157 499017 485731 473673 462569 452629 444006 436408
56995 436408 429430 423019 417332 412334 407879 404130 401442 399812 398790 398156 398379 400069 403116 406670 409884
56980 409884 412258 413223 411901 407746 401275 393742 386171 379015 372648 367611 364098 361640 359611 357820
$$ packed form
57059G917253q65085p44066o39026n49166m72601m07480l52632l06976k68898
57050C311323k36822k09996j88111j70299j55002j40848j27318j14660j03444
57041A864823r4063q6259p9131p1824o4206n6761m9955m3944l8652l3791k8917
57030A217320k3790j8692j3996r435l994L214J1742J9104K1351J5145L29j9301
57018A198997l8232n2610o1668o6371o7437o4903n9075n1246m3296l6634l1614
57007F25911k7804k4710k2089j9737j7414j5140j3286j2058j1104r940q623p598
56995D36408o978o411n687m998m455l749k688j630j022o34K23J690L047L554L214
56980D09884K374R65j322m155o471p533p571p156o367n037l513k458k029j791
$$ plain form
56966 357820 356392 355419 355103 355930 358210 361538 365134 368709 372658 377541 383678 391054 399021 406153 410945
56951 410945 412764 411704 407637 400197 389861 378265 367013 356735 347646 340355 335441 332692 331462
56938 331462 331503 332837 335190 338307 342654 348958 357050 365935 374996 384267 393191 399947 402606 400551 394323
56923 394323 384562 371724 356595 340401 324286 308971 294861 282189 271016 261330 253144 246386
56911 246386 240754 235845 231369 227159 223188 219751 217413 216470 216533 216879 217154 217576 218592 220626 223966 228507
56895 228507 233674 238981 244658 251348 259188 267627 276193 284962 294119 303577 313325 323660 334563 345099
56881 345099 353935 360395 364650 367062 367786 367018 365255 363180 361579 361362 363328 367727 374189 382133 391139
56866 391139 400997 411731 423652 437215 452708 470150 489415 510229 531998 553690 573814 590453
$$ packed form
56966C57820j428r73l16Q27K280L328L596L575L949M883O137P376P967P132M792
56951D10945J819j060m067p440j0336j1596j1252j0278r089p291m914k749j230
56938C31462M1J334K353L117M347O304Q092Q885R061R271Q924O756K659k055o228
56923C94323r761j2838j5129j6194j6115j5315j4110j2672j1173r686q186o758
56911B46386n632m909m476m210l971l437k338r43O3L46K75M22J016K034L340M541
56895B28507N167N307N677O690P840Q439Q566Q769R157R458R748J0335J0903J0536
56881C45099Q836O460M255K412P24p68j763k075j601k17J966M399O462P944R006
56866C91139R858J0734J1921J3563J5493J7442J9265K0814K1769K1692K0124J6639
$$ plain form
56854 590453 601627 606104 603917 596040 583829 569095 554247 541537 532081 526120 524128 526823 534047
56841 534047 544631 557847 574141 593900 616326 640463 666693 696075 728434 762041 794931
56830 794931 825280 850286 865928 868807 858077 835398 803592 765746 725029 684574 647205 615234
56818 615234 590189 572503 561571 556282 555487 558181 563684 571741 582219 594742 609080 625750 645395
56805 645395 667093 687753 703557 711774 711036 700716 680977 653312 620325 584822 549318 516108
56793 516108 487096 463283 444723 431031 421597 415398 411208 408429 407508 409219 413635 420033 427717
56780 427717 436494 446085 455212 461689 463597 460206 451669 438175 419895 397643 372988 347542 322518
56767 322518 299088 278557 261662 247905 236072 225311 215488 206738 199156 192834 187782 183682 179977
$$ packed form
56854E90453J1174M477k187p877j2211j4734j4848j2710r456n961j992K695P224
56841E34047J0584J3216J6294J9759K2426K4137K6230K9382L2359L3607L2890
56830G94931L0349K5006J5642K879j0730k2679l1806l7846m0717m0455l7369l1971
56818F15234k5045j7686j0932n289p95K694N503Q057J0478J2523J4338J6670J9645
56805F45395K1698K0660J5804Q217p38j0320j9739k7665l2987l5503l5504l3210
56793E16108k9012k3813j8560j3692r434o199m190k779r21J711M416O398P684
56780D27717Q777R591R127O477J908l391q537j3494j8280k2252k4655k5446k5024
56767C22518k3430k0531j6895j3757j1833j0761r823q750p582o322n052m100l705
$$ plain form
56754 179977 176239 172337 168390 164774 162040 160459 159605 158625 156936 154579 152052 150023 149008 148953 149196
56739 149196 149085 148523 147718 146712 145576 144790 144806 145358 145758 145863 146096 146573 146917 147069 147495 148293 148802 148526
56721 148526 147818 147171 146503 145759 145597 146644 148439 149998 151166 152533 154166 155422 156124 156910 158048 158779
56705 158779 158440 157551 157084 157077 156748 155729 154423 153181 151868 150445 149391 149172 149587 150029 150253 150537 151053
56688 151053 151400 150944 149620 148179 147505 147732 148225 148420 148365 148312 148150 147662 147159 147294 148194 149303 150201 151063
56670 151063 151999 152519 152240 151727 151855 152426 152306 151111 150034 150459 152332 154459 156021 157134 158116 159004 159898
56653 159898 161115 162698 164175 165095 165489 165543 165219 164525 163851 163574 163534 163387 163378 164206 165949 167658 168298 167791
56635 167791 166776 165661 164343 162808 161507 160950 161202 161975 163014 164187 165328 166291 167130 167999 168758 168910
$$ packed form
56754A79977l738l902l947l616k734j581q54r80j689k357k527k029j015n5K43
56739A49196j11n62q05j006j136p86J6N52M00J05K33M77L44J52M26P98N09k76
56721A48526p08o47o68p44j62J047J795J559J168J367J633J256P02P86J138P31
56705A58779l39q89m67pl29j019j306j242j313j423j054k19M15M42K24K84N16
56688A51053L47m56j324j441o74K27M93J95n5n3j62m88n03J35R00J109Q98Q62
56670A51063R36N20k79n13J28N71j20j195j077M25J873K127J562J113R82Q88Q94
56653A59898J217J583J477R20L94N4l24o94o74k77m0j47rQ28J743J709O40n07
56635A67791j015j115j318j535j301n57K52P73J039J173J141R63Q39Q69P59J52
$$ plain form
56619 168910 168112 166643 165188 164148 163324 162345 161207 160280 159875 159947 160253 160642 161152 161831 162540 162923 162629 161669
56601 161669 160545 159912 159990 160347 160349 159849 159407 159760 161114 162933 164445 165388 166204 167483 169247 170954 172206
56584 172206 173203 174393 175843 177245 178391 179325 179989 180144 179827 179653 180426 182490 185529 188799 191455 192981
56568 192981 193640 194390 196063 198675 201697 204765 207799 210701 213464 216581 220776 226132 231889 237223 241764
56553 241764 245211 247081 247409 247293 248068 250019 252304 254040 254950 255031 254187 252387 249837 246841 243751 241040
56537 241040 238984 237223 235091 232616 230647 229630 228731 226713 223451 219978 217174 215034 213282 211985
56523 211985 211234 210643 209707 208457 207364 206676 206219 205843 205640 205569 205166 203976 202248 200908 200723 201554 202502
56506 202502 202709 201921 200331 198200 195852 193888 192967 193214 194088 194988 195779 196499 196888 196639 196005 195634 195725 195800
$$ packed form
56619A68910p98j469j455j040q24r79j138r27m05P2L06L89N10O79P09L83k94r60
56601A61669j124o33P8L57Kn00m42L53J354J819J512R43Q16J279J764J707J252
56584A72206R97J190J450J402J146R34O64J55l17j74P73K064L039L270K656J526
56568A92981O59P50J673K612L022L068L034K902K763L117M195N356N757N334M541
56553B41764L447J870L28j16P75J951K285J736R10Q1q44j800k550k996l090k711
56537B41040k056j761k132k475j969j017q99k018l262l473k804k140j752j297
56523B11985p51n91r36j250j093o88m57l76k03p1m03j190j728j340j85Q31R48
56506B02502K07p88j590k131k348j964r21K47Q74R00P91P20L89k49o34l71R1P5
$$ plain form
56488 195800 195501 195151 195270 195875 196628 197366 198146 198958 199749 200537 201185 201329 200981 200966 202178 204466 206794 208419
56470 208419 209336 209640 209263 208499 208025 208021 207907 207347 206843 206812 206758 206073 205186 205019 205611 206216 206655 207543 208960 209863
56450 209863 209387 208133 207572 208435 210155 211616 212024 211212 209587 207876 206688 206214 206358 206969 207780 208343 208376
56433 208376 208133 208148 208509 208709 208391 208009 208421 209807 211333 212049 211952 211900 212591 213893 215171 215952 216199 216258 216676
56414 216676 217809 219398 220717 221343 221549 221789 222070 222117 221865 221409 220705 219795 219207 219526 220571 221447 221544 221046
56396 221046 220408 219822 219455 219704 220752 222084 222900 223002 223006 223598 224797 226046 226962 227804 229075 230753 232261
56379 232261 233322 234472 236341 238654 240504 241523 242259 243322 244662 245886 246813 247470 247877 248126 248374 248578
56363 248578 248535 248436 248962 250443 252217 253264 253292 252816 252351 251999 251754 251707 251810 251803 251624 251697 252557 254189 255909
$$ packed form
56488A95800k99l50J19O05P53P38P80Q12P91P88O48J44l48j5J212K288K328J625
56470B08419R17L04l77p64m74mj14n60n04l1n4o85q87j67N92O05M39Q88J417R03
56450B09863m76j254n61Q63J720J461M08q12j625j711j188m74J44O11Q11N63L3
56433B08376k43J5L61K00l18l82M12J386J526P16r7n2O91J302J278P81K47N9M18
56414B16676J133J589J319O26K06K40K81M7k52m56p04r10n88L19J045Q76R7m98
56396B21046o38n86l67K49J048J332Q16J02MN92J199J249R16Q42J271J678J508
56379B32261J061J150J869K313J850J019P36J063J340J224R27O57M07K49K48K04
56363B48578m3r9N26J481J774J047K8m76m65l52k45m7J03pj79P3Q60J632J720
$$ plain form
56344 255909 256992 257403 257771 258611 259758 260746 261565 262667 264295 266235 268353 270871 273832 276616 278436
56329 278436 279212 279682 280723 282685 285185 287309 288234 287973 287464 287723 288994 290817 292643 294161 295247 295971
56313 295971 296556 297095 297442 297577 297830 298402 298987 299287 299693 300870 302762 304650 306274 308296 311389 315393
56297 315393 319659 323811 327754 331251 334069 336445 338946 341767 344455 346477 347887 349269 351130 353494
56283 353494 356131 358996 362400 366747 372166 378321 384494 389970 394651 399363 405280 412827 421311 429828
56269 429828 438344 447571 457963 469274 481144 493654 507103 521585 537129 553980 572329 591824
56257 591824 611804 632187 653869 677962 704771 733758 764464 797088 832085 869433 908514
56246 908514 948613 989295 1030392 1071814 1113381 1154681 1195044 1233687 1269785 1302336 1330231
$$ packed form
56344B55909J083M11L68Q40J147R88Q19J102J628J940K118K518K961K784J820
56329B78436P76M70J041J962K500K124R25k61n09K59J271J823J826J518J086P24
56313B95971N85N39L47J35K53N72N85L00M06J177J892J888J624K022L093M004
56297C15393M266M152L943L497K818K376K501K821K688K022J410J382J861K364
56283C53494K637K865L404M347N419O155O173N476M681M712N917P547Q484Q517
56269D29828Q516R227J0392J1311J1870J2510J3449J4482J5544J6851J8349J9495
56257E91824J9980K0383K1682K4093K6809K8987L0706L2624L4997L7348L9081
56246I08514M0099M0682M1097M1422M1567M1300M0363L8643L6098L2551K7895
$$ plain form
56235 1330231 1352757 1369877 1381672 1387534 1386388 1377714 1361982 1339991 1312282 1279360 1242001 1201000
56223 1201000 1156927 1110578 1063445 1017332 973468 932190 893245 856254 821057 787931 757391
56212 757391 729603 704117 680383 658348 638319 620456 604606 590465 577651 565831 555038
56201 555038 545692 538026 531736 526474 522379 519606 517507 514927 511471 508084 506101 505868 506421 506411 505339
56186 505339 503949 503396 504068 505378 506645 507804 509069 510365 511510 512751 514694 517740 521851 526649 531549
56171 531549 536013 539958 543742 547538 551119 554530 558436 563304 568700 574023 579545 585981 593413 601514
56157 601514 610560 621177 633131 645473 658129 672352 689098 707814 727401 747839 770294 795925
56145 795925 825012 857005 891135 927235 966040 1008428 1054429 1103561 1156149 1213484 1276397
$$ packed form
56235A330231K2526J7120J1795N862j146q674j5732k1991k7709l2922l7359m1001
56223A201000m4073m6349m7133m6113m3864m1278l8945l6991l5197l3126l0540
56212G57391k7788k5486k3734k2035k0029j7863j5850j4141j2814j1820j0793
56201E55038r346p666o290n262m095k773k099k580l456l387j983k33N53j0j072
56186E05339j390n53O72J310J267J159J265J296J145J241J943L046M111M798M900
56171E31549M464L945L784L796L581L411L906M868N396N323N522O436P432Q101
56157F01514R046J0617J1954J2342J2656J4223J6746J8716J9587K0438K2455K5631
56145G95925K9087L1993L4130L6100L8805M2388M6001M9132N2588N7335O2913
$$ plain form
56134 1276397 1344429 1416755 1492894 1571600 1649594 1722506 1787178 1842635 1889243 1927799 1959468
56123 1959468 1985692 2007533 2025094 2037520 2043383 2041258 2030443 2011403 1985416 1953841 1917784 1878212
56111 1878212 1835823 1790535 1741349 1687026 1627134 1562616 1495556 1428526 1364041 1304295 1250830
56100 1250830 1204080 1163372 1127783 1097150 1072021 1052675 1038433 1027959 1019970 1013648 1008757 1005600
56088 1005600 1004654 1005992 1009067 1013039 1017218 1021323 1025547 1030380 1036100 1042447 1049019 1055864 1063403 1071890
56074 1071890 1081312 1091658 1102799 1114248 1125679 1137711 1151534 1167524 1184783 1202266 1219821
56063 1219821 1237842 1256380 1275095 1293802 1312781 1332639 1353943 1376679 1400038 1423112 1445807
56052 1445807 1468638 1491642 1514124 1535673 1556805 1578321 1600630 1623977 1648753 1675127 1702785
$$ packed form
56134A276397O8032P2326P6139P8706P7994P2912O4672N5457M6608L8556L1669
56123A959468K6224K1841J7561J2426N863k125j0815j9040k5987l1575l6057l9572
56111A878212m2389m5288m9186n4323n9892o4518o7060o7030o4485n9746n3465
56100A250830m6750m0708l5589l0633k5129j9346j4242j0474p989o322m891l157
56088A005600r46J338L075L972M179M105M224M833N720O347O572O845P539Q487
56074A071890R422J0346J1141J1449J1431J2032J3823J5990J7259J7483J7555
56063A219821J8021J8538J8715J8707J8979J9858K1304K2736K3359K3074K2695
56052A445807K2831K3004K2482K1549K1132K1516K2309K3347K4776K6374K7658
$$ plain form
56041 1702785 1731412 1760962 1791207 1821597 1852103 1883724 1917575 1953708 1991279 2029695 2069191
56030 2069191 2110498 2154147 2199966 2247083 2294808 2343584 2394591 2448270 2503865 2560696 2619146
56019 2619146 2679930 2743098 2808486 2876696 2948801 3025199 3105400 3188898 3275870 3367023 3463029
56008 3463029 3564105 3670090 3781027 3897599 4020629 4150351 4286788 4430724 4583484
55999 4583484 4745605 4916615 5096411 5286121 5487394 5701711 5930695 6176084 6438964
55990 6438964 6719907 7020356 7342942 7690114 8063630 8466088 8901764 9375169 9889967
55981 9889967 10450439 11063062 11735633 12475899 13292686 14198202 15208636 16343591 17626777
55972 17626777 19088137 20766276 22711013 24984826 27659791 30808925 34495697 38765532
$$ packed form
56041A702785K8627K9550L0245L0390L0506L1621L3851L6133L7571L8416L9496
56030B069191M1307M3649M5819M7117M7725M8776N1007N3679N5595N6831N8450
56019B619146O0784O3168O5388O8210P2105P6398Q0201Q3498Q6972R1153R6006
56008C463029J01076J05985J10937J16572J23030J29722J36437J43936J52760
55999D583484J62121J71010J79796J89710K01273K14317K28984K45389K62880
55990F438964K80943L00449L22586L47172L73516M02458M35676M73405N14798
55981I889967N60472O12623O72571P40266Q16787R05516J010434J134955J283186
55972A7626777J461360J678139J944737K273813K674965L149134L686772M269835
$$ plain form
55964 38765532 43640157 49116736 55176133 61799202 68981236 76735668 85087395 94059984
55956 94059984 103659060 113858375 124602167 135829855 147510259 159667758 172397165
55949 172397165 185868114 200296193 215836613 232380314 249307795 265338671 278632777
55942 278632777 287196089 289451958 284699511 273240270 256178708 235083868 211684449
55935 211684449 187635916 164329283 142752624 123453903 106610500 92148226 79850907
55928 79850907 69442116 60641834 53196709 46886463 41521201 36941252 33016519 29640501
55920 29640501 26723708 24191780 21984882 20054017 18357115 16858522 15529338 14345657
55912 14345657 13286901 12336348 11481207 10710388 10013065 9380071 8804927 8282011 7804880
$$ packed form
55964C8765532M874625N476579O059397O623069P182034P754432Q351727Q972589
55956I4059984R599076J0199315J0743792J1227688J1680404J2157499J2729407
55949A72397165J3470949J4428079J5540420J6543701J6927481J6030876J3294106
55942B78632777Q563312K255869m752447j1459241j7061562k1094840k3399419
55935B11684449k4048533k3306633k1576659j9298721j6843403j4462274j2297319
55928G9850907j0408791q800282p445125o310246n365262m579949l924733l376018
55920B9640501k916793k531928k206898j930865j696902j498593j329184j183681
55912A4345657j058756r50553q55141p70819o97323o32994n75144n22916m77131
$$ plain form
55903 7804880 7367508 6965952 6597433 6258652 5946087 5657034 5389290 5140545 4908962
55894 4908962 4693506 4492908 4305202 4129090 3964772 3812316 3669995 3535336 3407240
55885 3407240 3286134 3172554 3066565 2968041 2876421 2790228 2707461 2626398 2545824 2465093 2384594
55874 2384594 2305656 2229323 2155549 2083985 2015022 1949447 1887511 1828959 1773604 1721258 1671420
55863 1671420 1623628 1577963 1534759 1494038 1455590 1419308 1385048 1352418 1321067 1290994 1262304
55852 1262304 1234930 1208761 1183724 1159552 1135896 1112843 1090872 1070041 1049711 1029390 1009383
55841 1009383 990286 972209 954840 937953 921593 906038 891660 878462 865747 852817 839959
55830 839959 828070 817205 806376 794979 783479 772303 761032 749254 737330 725591 713600
$$ packed form
55903G804880m37372m01556l68519l38781l12565k89053k67744k48745k31583
55894D908962k15456k00598j87706j76112j64318j52456j42321j34659j28096
55885C407240j21106j13580j05989r8524r1620q6193q2767q1063q0574q0731q0499
55874B384594p8938p6333p3774p1564o8963o5575o1936n8552n5355n2346m9838
55863A671420m7792m5665m3204m0721l8448l6282l4260l2630l1351l0073k8690
55852A262304k7374k6169k5037k4172k3656k3053k1971k0831k0330k0321k0007
55841A009383j9097j8077j7369j6887j6360j5555j4378j3198j2715j2930j2858
55830H39959j1889j0865j0829j1397j1500j1176j1271j1778j1924j1739j1991
$$ plain form
55819 713600 700990 688337 676327 664695 652979 641781 632238 624448 617342 610002 602347 594798 588051
55806 588051 582957 579735 577360 574525 571214 568655 567799 568545 570340 572618 574623 575696 576123 576992 578813
55791 578813 580750 581550 580814 579053 576857 574391 571542 568259 564751 561337 557960 553902 548245 540644 531427
55776 531427 521027 509627 497458 485124 473474 463182 454431 446876 440001 433725 428525 424747 421916
55763 421916 419077 415766 412303 409068 405874 402264 398193 394157 390704 387961 385656 383440 381007 377912
55749 377912 373599 367941 361612 355488 349612 343214 335905 328441 322024 317202 313769 311344 309605 308155
55735 308155 306687 305266 304100 303085 301816 300040 297854 295477 293065 290647 288091 285159 281723 277880
55721 277880 273865 270033 266881 264716 263156 261386 259080 256673 254567 252640 250840 249683 249634 250411 251420
$$ packed form
55819G13600j2610j2653j2010j1632j1716j1198r543p790p106p340p655p549o747
55806E88051n094l222k375k835l311k559q56P46J795K278K005J073M27Q69J821
55791E78813J937Q00p36j761k196k466k849l283l508l414l377m058n657p601r217
55776E31427j0400j1400j2169j2334j1650j0292q751p555o875o276n200l778k831
55763D21916k839l311l463l235l194l610m071m036l453k743k305k216k433l095
55749C77912m313n658o329o124n876o398p309p464o417m822l433k425j739j450
55735C08155j468j421j166j015j269j776k186k377k412k418k556k932l436l843
55721B77880m015l832l152k165j560j770k306k407k106j927j800j157m9P77J009
$$ plain form
55706 251420 252524 253801 254985 255758 256252 256516 255844 253513 250006 246598 243780 241009 238018 235324 233145
55691 233145 230812 227812 224711 222450 221227 220638 220457 220721 221363 222275 223536 225079 226414 227154 227693 228852
55675 228852 230862 233058 234600 235121 234708 233665 232495 231805 231910 232557 233184 233482 233635 234036 234827 235726 236170
55658 236170 235588 233744 231091 228746 227760 228258 229484 230796 232315 234383 236710 238457 238990 238316 236909
55643 236909 235480 234682 234525 234102 232332 229056 225072 221152 217424 213691 209791 205478 200475 195046 190230
55628 190230 187095 185757 185241 184303 182424 180222 178886 178976 179795 180172 179803 179354 179293 179221 178659 177941 177778 178229
55610 178229 178563 178021 176323 173602 170344 167381 165480 164708 164421 163929 162970 161449 159119 155861 152188 149060
55594 149060 147038 145812 144754 143767 143277 143387 143487 142963 142071 141620 141875 142206 141971 141410 141430 142642 144846
$$ packed form
55706B51420J104J277J184P73M94K64o72k331l507l408k818k771k991k694k179
55691B33145k333l000l101k261j223n89j81K64O42R12J261J543J335P40N39J159
55675B28852K010K196J542N21m13j043j170o90J05O47O27K98J53M01P91Q99M44
55658B36170n82j844k653k345r86M98J226J312J519K068K327J747N33o74j407
55643B36909j429p98j57m23j770l276l984l920l728l733l900m313n003n429m816
55628A90230l135j338n16r38j879k202j336R0Q19L77l69m49o1p2n62p18j63M51
55610A78229L34n42j698k721l258k963j901p72k87m92r59j521k330l258l673l128
55594A49060k022j226j058r87m90J10J00n24q92m51K55L31k35n61K0J212K204
$$ plain form
55577 144846 147356 149683 151871 154252 156904 159387 161179 162358 163718 166069 169482 173228 176358 178300
55563 178300 179056 178986 178389 177240 175347 172780 170054 167770 165997 164088 161234 157345 153326 150271 148359
55548 148359 146731 144577 142100 140159 139158 138635 137962 137058 136284 135864 135664 135486 135446 135881 136826 137624 137330
55531 137330 135728 133817 133047 134028 136082 137963 138865 138850 138547 138465 138504 138161 137298 136506 136495 137274 138224 138825 138995
55512 138995 138785 138160 137137 135852 134391 132811 131337 130264 129609 129130 128720 128535 128684 129038 129454 129917 130384
55495 130384 130634 130348 129323 127726 126296 125988 126994 128274 128540 127645 126547 125996 125879 125866 125924 125918 125356 124029
55477 124029 122443 121171 120164 119173 118497 118693 119712 120773 121115 120547 119373 118129 117341 117240 117613 118024
55461 118024 118153 117908 117475 117361 118020 119195 119950 119645 118542 117148 115383 112973 110449 109029 109379 110931
$$ packed form
55577A44846K510K327K188K381K652K483J792J179J360K351L413L746L130J942
55563A78300P56p0n97j149j893k567k726k284j773j909k854l889m019l055j912
55548A48359j628k154k477j941j001n23o73r04p74m20k00j78m0M35R45P98k94
55531A37330j602j911p70R81K054J881R02j5l03q2L9l43q63p92j1P79R50O01J70
55512A38995k10o25j023j285j461j580j474j073o55m79m10j85J49L54M16M63M67
55495A30384K50k86j025j597j430l08J006J280K66q95j098n51j17j3N8on62j327
55477A24029j586j272j007r91o76J96J019J061L42n68j174j244p88j01L73M11
55461A18024J29k45m33j14O59J175P55l05j103j394j765k410k524j420L50J552
$$ plain form
55445 110931 112546 113474 113602 113162 112495 111956 111842 112349 113501 114998 116263 116848 116737 116137 115160 114002 113162
55428 113162 113047 113381 113509 113280 113216 113682 114355 114767 115012 115539 116473 117521 118484 119526 120933 122756 124726
55411 124726 126353 127104 126728 125530 124238 123458 123232 123160 122866 122289 121521 120592 119491 118308 117197 116245 115535
55394 115535 115248 115471 115878 115892 115336 114699 114529 114737 114746 114257 113598 113261 113356 113647 113938 114259 114648 114946 114942 114662 114384
55373 114384 114308 114368 114442 114606 114961 115380 115689 116029 116652 117409 117805 117695 117470 117338 116849 115385 112875 109768 106685
55354 106685 104424 103823 104972 106735 107690 107531 107036 106755 106438 105894 105688 106425 107764 108698 108753 108421 108394 108719
55336 108719 108884 108580 108083 107842 107905 107989 108088 108588 109556 110303 110144 109432 109245 109937 110620 110389 109553 109165 109648 110497
55316 110497 111220 111933 112837 113614 113748 113261 112726 112543 112497 112172 111632 111413 111845 112576 112929 112634 111998 111354 110672
$$ packed form
55445A10931J615R28J28m40o67n39j14N07J152J497J265N85j11o00r77j158q40
55428A13162j15L34J28k29o4M66O73M12K45N27R34J048R63J042J407J823J970
55411A24726J627P51l76j198j292p80k26p2k94n77p68r29j101j183j111r52p10
55394A15535k87K23M07J4n56o37j70K08Rm89o59l37R5K91K91L21L89K98mk80k78
55373A14384p6O0P4J64L55M19L09L40O23P57L96j10k25j32m89j464k510l107l083
55354A06685k261o01J149J763R55j59m95k81l17n44k06P37J339R34N5l32k7L25
55336A08719J65l04m97k41O3Q4R9N00R68P47j59p12j87O92O83k31q36l88M83Q49
55316A10497P23P13R04P77J34m87n35j83m6l25n40k19M32P31L53k95o36o44o82
$$ plain form
55297 110672 109859 109212 109232 109990 110943 111475 111431 111062 110683 110540 110810 111462 112210 112860 113596 114618 115541 115605 114645
55278 114645 113498 113112 113486 113809 113510 112810 112341 112501 113240 114177 114925 115480 116195 117146 117703 117209 116018 115342
55260 115342 115917 117374 119074 120924 122864 124091 123576 121305 118391 115914 114162 113086 112877 113677 115109
55245 115109 116521 117700 118939 120356 121431 121466 120409 118975 117957 117577 117575 117689 117794 117761 117513 117197 117001
55228 117001 116808 116384 115908 115852 116162 116075 115117 113927 113552 114083 114551 114195 113384 113104 113822 115061 116022 116451 116842
55209 116842 117718 118837 119368 118867 117764 116719 115885 115139 114634 114650 115015 115228 115120 114961 114952 115040 115237 115603 115804
55190 115804 115256 113986 112928 112972 113995 115167 115989 116629 117369 118132 118644 118822 118881 119159 119833 120725 121360 121365 120880
55171 120880 120510 120782 121685 122811 123878 124924 125937 126595 126645 126405 126456 126776 126661 125742 124658 124385 125070 125973
$$ packed form
55297A10672q13o47K0P58R53N32m4l69l79j43K70O52P48O50P36J022R23O4r60
55278A14645j147l86L74L23k99p00m69J60P39R37P48N55P15R51N57m94j191o76
55260A15342N75J457J700J850J940J227n15k271k914k477j752j076k09Q00J432
55245A15109J412J179J239J417J075L5j057j434j018l80kJ14J05l3k48l16j96
55228A17001j93m24m76n6L10q7r58j190l75N31M68l56q11k80P18J239R61M29L91
55209A16842Q76J119N31n01j103j045q34p46n05J6L65K13j08j59rQ8J97L66K01
55190A15804n48j270j058M4J023J172Q22O40P40P63N12J78N9K78O74Q92O35Nm85
55171A20880l70K72R03J126J067J046J013O58N0k40N1L20j15r19j084k73O85R03
$$ plain form
55153 125973 126360 126051 125169 123865 122405 121131 120173 119367 118553 117800 117287 117164 117479 118046 118406 118234 117750 117467
55135 117467 117522 117556 117271 116771 116284 115878 115622 115685 116094 116633 117239 118269 120031 122118 123563 123758 123123 122648
55117 122648 122807 123089 122755 121858 121143 120945 120744 120103 119547 119927 121199 122517 123421 124234 125233 126083 126283 125695
55099 125695 124466 122964 121911 121996 123064 124248 125163 126299 127912 129260 129615 129446 129720 130409 130634 130146
55083 130146 129729 129959 130389 130298 129674 129060 128821 128903 129085 129210 129306 129618 130271 130822 130510 129125 127354 126033 125369
55064 125369 125117 125171 125557 126017 126123 125796 125376 125123 125039 125190 125768 126641 127261 127325 127229 127468 127857 127883 127726 128214
55044 128214 129596 130976 131404 131157 131316 132272 133206 133124 131930 130309 128968 128264 128288 128926 129799 130419 130560 130447
55026 130447 130505 130922 131507 132068 132807 134091 135824 137339 138046 137965 137403 136503 135473 134898 135194 135860 135899 135081
$$ packed form
55153A25973L87l09q82j304j460j274r58q06q14p53n13j23L15N67L60j72m84k83
55135A17467N5L4k85n00m87m06k56O3M09N39O06J030J762K087J445J95o35m75
55117A22648J59K82l34q97p15j98k01o41n56L80J272J318R04Q13R99Q50K00n88
55099A25695j229j502j053Q5J068J184R15J136J613J348L55j69K74O89K25m88
55083A30146m17K30M30r1o24o14k39Q2J82J25R6L12O53N51l12j385j771j321o64
55064A25369k52N4L86M60J06l27m20k53q4J51N78Q73O20O4r6K39L89K6j57M88
55044A28214J382J380M28k47J59R56R34q2j194j621j341p04K4O38Q73O20J41j13
55026A30447N8M17N85N61P39J284J733J515P07q1n62r00j030n75K96O66L9q18
$$ plain form
55008 135081 134233 134131 134625 135093 135219 134950 134125 132681 131056 129958 129767 130371 131417 132471 133063 132928 132241
54991 132241 131418 130794 130616 131138 132447 134221 135943 137347 138493 139449 140095 140239 139821 138962 137943 137076 136554
54974 136554 136375 136442 136674 137054 137644 138542 139689 140788 141530 141859 141863 141516 140893 140509 140989 142321 143831 145017
54956 145017 145959 146755 147112 146842 146357 146226 146513 146953 147460 147999 148192 147621 146474 145432 144920 144807 144831 144928 145108
54937 145108 145320 145563 145934 146540 147431 148569 149722 150642 151540 153146 155893 159207 162035 164045 165909 168343
54921 168343 171207 173724 175349 176308 177367 179168 181728 184588 187385 190077 192602 194656 195967 196501 196150
54906 196150 194638 192103 189339 186907 184277 180523 175736 171031 167157 163826 160594 157719 155765 154878
54892 154878 154852 155542 156781 158126 159149 159963 161109 162872 164826 166146 166358 165859 165701 166744 169012 171864
$$ packed form
55008A35081q48j02M94M68J26k69q25j444j625j098j91O04J046J054N92j35o87
54991A32241q23o24j78N22J309J774J722J404J146R56O46J44m18q59j019q67n22
54974A36554j79O7K32L80N90Q98J147J099P42L29Ml47o23l84M80J332J510J186
54956A45017R42P96L57k70m85j31K87M40N07N39J93n71j147j042n12j13K4R7J80
54937A45108K12K43L71O06Q91J138J153R20Q98J606K747L314K828K010J864K434
54921A68343K864K517J625R59J059J801K560K860K797K692K525K054J311N34l51
54906A96150j512k535k764k432k630l754m787m705l874l331l232k875j954q87
54892A54878k6O90J239J345J023Q14J146J763J954J320K12m99j58J043K268K852
$$ plain form
54876 171864 174646 177066 179166 181285 183948 187381 191079 194142 196114 197234 197909 198230 198008 196950 194782
54861 194782 191567 187961 184765 182065 179114 175234 170626 166217 162931 161130 160431 159988 159216 158294 157705
54846 157705 157345 156572 155089 153286 151577 150031 148835 148386 148469 147971 146196 144071 143310 144476 146506 148102
54830 148102 148925 149275 149238 148603 147424 146265 145824 146337 147333 147974 147729 146712 145423 144348 143861 144221 145331
54813 145331 146604 147397 147635 147790 148261 148935 149353 149134 148228 146934 145741 145036 144876 145056 145349 145649 145931 146192
54795 146192 146400 146499 146488 146575 147106 148247 149759 151163 152088 152503 152690 152999 153489 153830 153761 153569 153798 154483 155141
54776 155141 155704 156974 159690 163497 167326 170564 173315 175718 177713 179546 181827 184765 187825 190495
54762 190495 192999 195871 199129 202294 205066 207524 209712 211431 212497 212854 212335 210611 207595 203731 199685
$$ packed form
54876A71864K782K420K100K119K663L433L698L063J972J120O75L21k22j058k168
54861A94782l215l606l196k700k951l880m608m409l286j801o99m43p72r22n89
54846A57705l60p73j483j803j709j546j196m49Q3m98j775k125p61J166K030J596
54830A48102Q23L50l7o35j179j159m41N13R96O41k45j017j289j075m87L60J110
54813A45331J273P93K38J55M71O74M18k19r06j294j193p05j60J80K93L00K82K61
54795A46192K08R9j1Q7N31J141J512J404R25M15J87L09M90L41o9j92K29O85O58
54776A55141N63J270K716L807L829L238K751K403J995J833K281K938L060K670
54762A90495K504K872L258L165K772K458K188J719J066L57n19j724l016l864m046
$$ plain form
54747 199685 195765 191740 187187 181996 176668 172134 169053 167135 165311 162763 159728 157161 155792 155725 156750
54732 156750 158574 160702 162570 164025 165390 166865 168215 169300 170592 172714 175617 178616 181221 183553
54718 183553 185987 188704 191690 194895 198312 201993 205875 209374 211359 210972 208491 204991 201196 197062
54704 197062 192528 188033 183965 180028 175667 170979 166876 164337 163610 163984 164273 163718 162598 161782 161593 161386
54688 161386 160373 158544 156517 154792 153473 152517 151832 151222 150581 150150 150285 150967 151727 152125 152120 151970 151849 151607
54670 151607 150865 149464 147814 146617 146132 145940 145566 145097 144963 145341 146098 147140 148461 149882 151063 151861
54654 151861 152517 153409 154674 156028 156891 156839 156071 155326 155177 155471 155512 154689 152940 150892 149613 149814 151057
54637 151057 152101 152277 152132 152432 152999 153163 152940 152967 153365 153483 152893 151965 151289 151063 151242 151711 152078 151874 151225
$$ packed form
54747A99685l920m025m553n191n328m534l081j918j824k548l035k567j369o7J025
54732A56750J824K128J868J455J365J475J350J085J292K122K903K999K605K332
54718A83553K434K717K986L205L417L681L882L499J985l87k481l500l795m134
54704A97062m534m495m068l937m361m688m103k539p27L74K89n55j120q16j89k07
54688A61386j013j829k027j725j319r56o85o10o41m31J35O82P60L98nj50j21k42
54670A51607p42j401j650j197m85j92l74m69j34L78P57J042J321J421J181P98
54654A51861O56Q92J265J354Q63n2p68p45j49K94M1q23j749k048j279K01J243
54637A51057J044J76j45L00N67J64k23K7L98J18n90r28o76k26J79M69L67k04o49
$$ plain form
54618 151225 150827 150917 150875 150337 150137 151347 153628 155341 155331 154010 152551 151642 151312 151452 151934 152392 152337 151646
54600 151646 150727 150114 149991 150170 150431 150743 151167 151626 151865 151657 151041 150331 149917 150062 150855 152230 153896 155264
54582 155264 155692 155033 153869 152973 152523 152059 151260 150425 149991 149815 149334 148359 147370 146911 146970 147128 147184 147392 148083
54563 148083 149213 150400 151403 152374 153574 154946 156168 157034 157556 157747 157586 157215 156841 156390 155676 155045 155296
54546 155296 156579 157773 157586 156005 154116 152619 151242 149680 148400 148206 149344 151357 153525 155233 156193
54531 156193 156589 156931 157576 158456 159257 159720 159746 159439 159105 158964 158821 158254 157190 156072 155429 155492 156243 157489
54513 157489 158792 159655 159972 160084 160290 160516 160572 160447 160198 159802 159314 158991 159076 159596 160376 161072 161217 160591 159597
54494 159597 158925 158760 158718 158603 158681 158983 158965 158335 157711 157882 158688 159200 158863 157966 157141 156856 157223 157784 157596 156145
$$ packed form
54618A51225l98R0m2n38k00J210K281J713j0j321j459r09l30J40M82M58n5o91
54600A51646r19o13j23J79K61L12M24M59K39k08o16p10m14J45P93J375J666J368
54582A55264M28o59j164q96m50m64p99q35m34j76m81r75r89m59N9J58N6K08O91
54563A48083J130J187J003R71J200J372J222Q66N22J91j61l71l74m51p14o31K51
54546A55296J283J194j87j581j889j497j377j562j280j94J138K013K168J708R60
54531A56193L96L42O45Q80Q01M63K6l07l34j41j43n67j064j118o43O3P51J246
54513A57489J303Q63L17J12K06K26N6j25k49l96m88l23Q5N20P80O96J45o26r94
54494A59597o72j65m2j15P8L02j8o30o24J71Q06N12l37q97q25k85L67N61j88j451
$$ plain form
54474 156145 154202 153261 153992 155637 157015 157678 157930 158179 158567 159041 159483 159870 160372 161209 162341 163432 164124
54457 164124 164245 163802 162988 162157 161565 161102 160499 159765 159201 159028 159243 159840 160820 161937 162705 162825 162428 161830
54439 161830 161222 160606 159875 158929 157925 157355 157638 158596 159630 160355 160814 161087 161080 160737 160086 159014 157449 155911
54421 155911 155360 156228 157926 159596 160989 162290 163526 164632 165805 167190 168380 168786 168539 168498 169212 170227
54405 170227 170592 169827 168180 166241 164555 163537 163465 164352 165840 167294 168129 168074 167176 165726 164333 163853 164771
54388 164771 166555 168017 168478 168306 168205 168437 168936 169688 170590 171366 172118 173521 175812 177980 178772 178347 178034
54371 178034 178495 179085 179196 179249 179824 180636 181007 180796 180264 179505 178698 178513 179464 180989 181844 181440 180346 179546
54353 179546 179619 180466 181363 181398 180382 179241 179013 179533 179711 179052 178216 177947 178110 178054 177434 176317 174949 173748
$$ packed form
54474A56145j943r41P31J645J378O63K52K49L88M74M42L87N02Q37J132J091O92
54457A64124J21m43q14q31n92m63o03p34n64j73K15N97R80J117P68J20l97n98
54439A61830o08o16p31r46j004n70K83R58J034P25M59K73pl43o51j072j565j538
54421A55911n51Q68J698J670J393J301J236J106J173J385J190M06k47m1P14J015
54405A70227L65p65j647j939j686j018p2Q87J488J454Q35n5q98j450j393m80R18
54388A64771J784J462M61j72j01K32M99P52R02P76P52J403K291K168P92m25l13
54371A78034M61N90J11N3N75Q12L71k11n32p59q07j85R51J525Q55m04j094q00
54353A79546P3Q47Q97L5j016j141k28N20J78o59q36k69J63n6o20j117j368j201
$$ plain form
54335 173748 173154 173139 173133 172726 172113 171620 171191 170716 170533 171086 172267 173550 174624 175472 175942 175749 174964 174120 173732
54316 173732 173993 174937 176485 178212 179433 179834 179873 180316 181411 182699 183590 183976 184213 184598 185057 185408 185751
54299 185751 186343 187143 187770 187979 187907 187712 187334 186821 186526 186564 186365 185299 183704 182688 182778 183253 183067 182052
54281 182052 180888 180183 179949 179907 179911 180029 180369 180948 181689 182544 183592 184893 186183 186860 186449 185033 183201 181562
54263 181562 180408 179758 179583 179876 180500 181056 181036 180253 179089 178249 178265 179228 180850 182612 184040 185112 186362
54246 186362 188248 190345 191549 191265 190094 189064 188469 187842 186894 185900 185134 184445 183645 182957 182655 182463 181738
54229 181738 180263 178523 177144 176365 176165 176552 177425 178359 178861 178773 178240 177380 176372 175718 175958 176992 178057
54212 178057 178588 178797 179214 179993 180969 182118 183488 184861 185885 186483 186767 186659 186054 185378 185497 186778 188562
$$ packed form
54335A73748n94j5om07o13m93m29m75j83N53J181J283J074Q48M70j93p85q44l88
54316A73732K61R44J548J727J221M01L9M43J095J288Q91L86K37L85M59L51L43
54299A85751N92Q00O27K09p2j95l78n13k95L8j99j066j595j016R0M75j86j015
54281A82052j164p05k34m2MJ18L40N79P41Q55J048J301J290O77m11j416j832j639
54263A81562j154o50j75K93O24N56k0p83j164q40J6R63J622J762J428J072J250
54246A86362J886K097J204k84j171j030n95o27r48r94p66o89q00o88l02j92p25
54229A81738j475j740j379p79k00L87Q73R34N02q8n33q60j008o54K40J034J065
54212A78057N31K09M17P79R76J149J370J373J024N98K84j08o05o76J19J281J784
$$ plain form
54195 188562 189824 190191 190145 190332 190918 191614 192264 193231 195044 197590 199961 201395 202213 203414 205380 207454
54179 207454 208866 209611 210120 210428 210031 208431 205613 202066 198483 195331 192614 190149 188053 186687 186048
54164 186048 185530 184481 182782 180738 178761 177363 177040 177740 178638 178906 178599 178441 178889 179791 180860 181941
54148 181941 182751 182879 182294 181539 181227 181537 182326 183434 184641 185571 185943 185818 185402 184697 183582 182190 180956
54131 180956 180262 180176 180514 180991 181286 181228 181058 181337 182408 184001 185495 186467 186824 186591 185999 185735 186598 188570
54113 188570 190538 191322 190808 189801 188985 188484 188257 188263 188164 187495 186464 186182 187584 190305 192937 194292 194241 193479
54095 193479 192808 192580 192607 192524 192281 192165 192312 192478 192440 192347 192377 192295 191739 190855 190255 190291 190647 190699 190125 189157 188392
54074 188392 188342 188974 189710 190047 190118 190472 191368 192564 193768 194981 196213 197129 197242 196439 195178 194082 193377
$$ packed form
54195A88562J262L67m6J87N86O96O50R67J813K546K371J434Q18J201J966K074
54179B07454J412P45N09L08l97j600k818l547l583l152k717k465k096j366o39
54164A86048n18j049j699k044j977j398l23P00Q98K68l07j58M48R02J069J081
54148A81941Q10J28n85p55l12L10P89J108J207R30L72j25m16p05j115j392j234
54131A80956o94q6L38M77K95n8j70K79J071J593J494R72L57k33n92k64Q63J972
54113A88570J968P84n14j007q16n01k27Or9o69j031k82J402K721K632J355n1p62
54095A93479o71k28K7q3k43j16J47J66l8r3L0q2n56q84o00L6L56N2n74r68p65
54074A88392n0O32P36L37P1L54Q96J196J204J213J232R16J13q03j261j096p05
$$ plain form
54057 193377 192772 191904 190821 190005 189985 191010 192973 195440 197821 199854 201926 204548 207393 209300 209594 209065
54041 209065 209260 210980 213860 217197 220648 224117 227474 230613 233549 236329 238942 241311 243184 244114 243788
54026 243788 242428 240693 239236 238446 238472 239154 239978 240369 240090 239263 238194 237352 237261 238016 239039 239647 239714 239374
54008 239374 238335 236124 232963 229730 226956 224431 221915 219603 217658 215880 214224 213099 212728 212607 212087
53993 212087 211163 210283 209687 209408 209623 210449 211452 211836 211154 209542 207409 205193 203330 202028 201072 200173 199492
53976 199492 199520 200377 201510 202133 201824 200723 199386 198434 198125 198185 198191 198035 197905 197937 198166 198701 199671 200958 202203
53957 202203 203079 203412 203111 202275 201356 200922 201158 201800 202601 203608 204922 206430 207988 209710 211898 214712
53941 214712 217987 221363 224486 227159 229373 231310 233312 235757 238766 242004 244969 247634 250659 254756
$$ packed form
54057A93377o05q68j083q16k0J025J963K467K381K033K072K622K845J907K94n29
54041B09065J95J720K880L337L451L469L357L139K936K780K613K369J873R30l26
54026B43788j360j735j457p90K6O82Q24L91k79q27j069q42r1P55J023O08O7l40
54008B39374j039k211l161l233k774k525k516k312j945j778j656j125l71j21n20
53993B12087r24q80n96k79K15Q26J003L84o82j612k133k216j863j302r56q99o81
53976A99492K8Q57J133O23l09j101j337r52l09O0Oj56j30L2K29N35R70J287J245
53957B02203Q76L33l01q36r19m34K36O42Q01J007J314J508J558J722K188K814
53941B14712L275L376L123K673K214J937K002K445L009L238K965K665L025M097
$$ plain form
53927 254756 259898 265297 270044 273549 275538 276029 275397 274188 272711 270992 269200 267922 267873 269379 272127
53912 272127 275279 277888 279466 280301 281067 282098 283165 283928 284295 284258 283763 282921 282026 281013 279182 275894
53896 275894 271532 267347 264318 262422 260952 259231 256976 254346 251836 249891 248404 246779 244608 242031
53882 242031 239307 236384 233271 230570 229014 228444 227813 226500 225127 224653 224949 224899 223870 222451 221508 221021
53866 221021 220381 219544 219213 219758 220449 220127 218398 215881 213439 211473 209911 208569 207435 206791 207003 208049
53850 208049 209281 209937 209853 209399 208804 208062 207574 208218 210285 212759 214286 214641 214681 215018 215432 215631 215818 216191
53832 216191 216417 216063 215251 214561 214457 215031 216084 217227 218107 218713 219279 219844 220188 220261 220251 220097 219521 218797 218840
53813 218840 220006 221390 222007 222211 223105 224862 226591 227790 228984 230775 233083 235604 238295 241031 243379
$$ packed form
53927B54756N142N399M747L505J989M91o32j209j477j719j792j278m9J506K748
53912B72127L152K609J578Q35P66J031J067P63L67l7m95q42q95j013j831l288
53896B75894m362m185l029j896j470j721k255k630k510j945j487j625k171k577
53882B42031k724k923l113k701j556n70o31j313j373m74K96n0j029j419r43m87
53866B21021o40q37l31N45O91l22j729k517k442j966j562j342j134o44K12J046
53850B08049J232O56q4m54n95p42m88O44K067K474J527L55M0L37M14J99J87L73
53832B16191K26l54q12o90j04N74J053J143Q80O06N66N65L44P3j0j54n76p24M3
53813B18840J166J384O17K04Q94J757J729J199J194J791K308K521K691K736K348
$$ plain form
53798 243379 245082 246351 247424 248331 249326 250938 253180 255216 256301 256671 257080 257828 258716 259614 260472 260984
53782 260984 260799 260040 259178 258472 257870 257359 256995 256615 255930 254877 253589 252031 250046 247803 245867 244643
53766 244643 243983 243463 242890 242336 241734 240712 239072 237414 236848 237802 239419 240572 241241 242213 243593 244595
53750 244595 245077 246197 248795 251888 253778 254326 255082 257277 260594 264062 267390 271110 275929 282188 289624
53735 289624 297539 305525 314057 323995 335544 348121 361248 375023 389653 405092 421325 438518
53723 438518 456626 475342 494700 515258 537264 559857 581340 599934 613962 621763 622102 614814
53711 614814 600800 581410 558062 532352 506157 481292 458965 439510 422698 408374 396740
53700 396740 387961 381659 377028 373396 370448 368003 365926 364295 363298 362882 362703 362459 361999 361143 359780 358169
$$ packed form
53798B43379J703J269J073R07R95J612K242K036J085L70M09P48Q88Q98Q58N12
53782B60984j85p59q62p06o02n11l64l80o85j053j288j558j985k243j936j224
53766B44643o60n20n73n54o02j022j640j658n66R54J617J153O69R72J380J002
53750B44595M82J120K598L093J890N48P56K195L317L468L328L720M819O259P436
53735B89624P915P986Q532R938J1549J2577J3127J3775J4630J5439J6233J7193
53723D38518J8108J8716J9358K0558K2006K2593K1483J8594J4028P801L39p288
53711F14814j4014j9390k3348k5710k6195k4865k2327j9455j6812j4324j1634
53700C96740q779o302m631l632k948k445k077j631r97m16j79k44m60q56j363j611
$$ plain form
53684 358169 356737 355485 354002 352155 350271 348447 346176 343109 339846 337547 336852 337362 337968 337514 335558
53669 335558 332840 330760 330033 330044 329710 328638 327172 325736 324615 323991 323566 322452 320109 317329 315644 315696
53653 315696 316789 318038 319274 320562 321571 321942 321982 322505 324021 326286 328540 330078 330767 331143 331850 332936
53637 332936 333866 334264 334345 334583 335278 336597 338644 341191 343637 345581 347313 349504 352561 356485 361081 365973
53621 365973 370631 374828 378931 383324 387617 390979 393284 395417 398259 401830 405663 409578 413666 417850
53607 417850 421949 425970 429898 433284 435599 437067 438643 440969 443704 446075 447743 448834 449444 449535 449246
53592 449246 448875 448548 448174 447782 447584 447632 447606 447072 445820 443967 441873 440024 438688 437587 436111 434035 431774
53575 431774 429726 427673 425174 422413 420072 418354 416638 414371 411866 409847 408471 407345 406334 405813
$$ packed form
53684C58169j432j252j483j847j884j824k271l067l263k299o95N10O06m54j956
53669C35558k718k080p27J1l34j072j466j436j121o24m25j114k343k780j685N2
53653C15696J093J249J236J288J009L71M0N23J516K265K254J538O89L76P07J086
53637C32936R30L98Q1K38O95J319K047K547K446J944J732K191L057L924M596M892
53621C65973M658M197M103M393M293L362K305K133K842L571L833L915M088M184
53607D17850M099M021L928L386K315J468J576K326K735K371J668J091O10R1k89
53592D49246l71l27l74l92j98M8k6n34j252j853k094j849j336j101j476k076k261
53575D31774k048k053k499k761k341j718j716k267k505k019j376j126j011n21
$$ plain form
53561 405813 405981 406414 406565 406434 406417 406734 407192 407388 406914 405604 403889 402732 402875 404249 406391 409234 412999
53544 412999 417518 422285 427230 432784 438988 445246 451269 457677 465144 473435 481905 490547 499862 510034
53530 510034 521012 533146 546865 561700 576598 591433 607350 625215 644474 664075 683812
53519 683812 704066 724791 745734 767366 790572 815354 840786 866596 894007 924331 957195
53508 957195 990851 1024075 1057128 1090839 1125403 1160391 1195500 1230818 1266569 1303020 1340624
53497 1340624 1379835 1420574 1461952 1502379 1539738 1571646 1596269 1613296 1623932 1629737 1631699 1630544
53485 1630544 1627401 1623689 1620531 1618667 1618610 1620357 1623102 1625857 1628319 1630667 1632683 1633723 1633553 1632433 1630211
53470 1630211 1626149 1619981 1612379 1603872 1593898 1581617 1567141 1551240 1534177 1515765 1496408 1477187
$$ packed form
53561D05813J68M33J51j31j7L17M58J96m74j310j715j157J43J374K142K843L765
53544D12999M519M767M945N554O204O258O023O408P467Q291Q470Q642R315J0172
53530E10034J0978J2134J3719J4835J4898J4835J5917J7865J9259J9601J9737
53519F83812K0254K0725K0943K1632K3206K4782K5432K5810K7411L0324L2864
53508I57195L3656L3224L3053L3711L4564L4988L5109L5318L5751L6451L7604
53497A340624L9211M0739M1378M0427L7359L1908K4623J7027J0636N805J962j155
53485A630544l143l712l158j864n7J747K745K755K462K348K016J040j70j120k222
53470A630211m062o168p602q507r974j2281j4476j5901j7063j8412j9357j9221
$$ plain form
53458 1477187 1458689 1440435 1421715 1402393 1382565 1361980 1340358 1318089 1296063 1274800 1254041
53447 1254041 1233216 1212117 1191117 1171003 1152674 1136753 1123265 1111681 1101410 1092244 1084276 1077536
53435 1077536 1071954 1067686 1065141 1064518 1065537 1067835 1071445 1076616 1083369 1091566 1101264 1112615 1125510 1139779
53421 1139779 1155710 1173904 1194539 1217231 1241679 1267923 1295808 1324772 1354543 1385598 1418596
53410 1418596 1453688 1490712 1529623 1570347 1612598 1656300 1701838 1749386 1798370 1848212 1899366
53399 1899366 1952868 2008925 2066639 2125188 2184605 2245148 2306472 2367801 2428619 2488777 2548050
53388 2548050 2605869 2661607 2715014 2766208 2815131 2861163 2903602 2942491 2978406 3011199 3039519
53377 3039519 3062148 3079384 3092435 3101620 3105981 3104673 3098040 3087042 3072113 3052897 3028815 2999764
$$ packed form
53458A477187j8498j8254j8720j9322j9828k0585k1622k2269k2026k1263k0759
53447A254041k0825k1099k1000k0114j8329j5921j3488j1584j0271r166p968o740
53435A077536n582m268k545o23J019K298L610N171O753Q197R698J1351J2895J4269
53421A139779J5931J8194K0635K2692K4448K6244K7885K8964K9771L1055L2998
53410A418596L5092L7024L8911M0724M2251M3702M5538M7548M8984M9842N1154
53399A899366N3502N6057N7714N8549N9417O0543O1324O1329O0818O0158N9273
53388B548050N7819N5738N3407N1194M8923M6032M2439L8889L5915L2793K8320
53377C039519K2629J7236J3051R185M361j308o633j0998j4929j9216k4082k9051
$$ plain form
53365 2999764 2966400 2929737 2890189 2847128 2799792 2748510 2694592 2638957 2581452 2521690 2460140
53354 2460140 2398135 2337080 2277806 2220477 2164964 2111388 2060203 2011590 1965031 1919879 1876154
53343 1876154 1834264 1794170 1755446 1718129 1682735 1649384 1617650 1587517 1559757 1534991 1512947
53332 1512947 1493059 1475241 1459603 1445718 1432616 1419301 1405099 1389824 1373794 1357379 1340438
53321 1340438 1322668 1304551 1287338 1271885 1258101 1245754 1235061 1226156 1218802 1213206 1210381 1210946
53309 1210946 1214139 1218748 1224557 1232122 1241598 1252627 1265037 1278822 1293704 1309554 1327040 1346941
53297 1346941 1368956 1392030 1415784 1440764 1467278 1494853 1522951 1551390 1579850 1607675 1634329
53286 1634329 1659483 1682548 1702878 1720593 1736470 1750712 1762458 1770781 1775525 1776876 1774807 1769461
$$ packed form
53365B999764l3364l6663l9548m3061m7336n1282n3918n5635n7505n9762o1550
53354B460140o2005o1055n9274n7329n5513n3576n1185m8613m6559m5152m3725
53343A876154m1890m0094l8724l7317l5394l3351l1734l0133k7760k4766k2044
53332A512947j9888j7818j5638j3885j3102j3315j4202j5275j6030j6415j6941
53321A340438j7770j8117j7213j5453j3784j2347j0693q905p354n596k825N65
53309A210946L193M609N809P565R476J1029J2410J3785J4882J5850J7486J9901
53297A346941K2015K3074K3754K4980K6514K7575K8098K8439K8460K7825K6654
53286A634329K5154K3065K0330J7715J5877J4242J1746Q323M744J351k069n346
$$ plain form
53274 1769461 1761552 1751816 1740367 1726988 1711768 1695080 1677169 1658051 1637532 1615206 1590796 1564785
53262 1564785 1538225 1511562 1483999 1454415 1422665 1389658 1356464 1323657 1291208 1258520 1224789
53251 1224789 1189828 1154534 1120294 1087964 1057541 1028575 1000630 973558 947580 922950 899384
53240 899384 876166 853055 830743 809951 790298 770552 749999 729162 709178 690777 673961
53229 673961 658522 644677 632981 623387 614637 605156 594657 584201 574453 564637 553786 542288
53217 542288 531273 520916 510389 499413 488801 479275 470621 462402 454746 447971 441940 436269 430827
53204 430827 425617 420490 415381 410576 406363 402586 398917 395399 392363 389895 387694 385514 383454 381820
53190 381820 380829 380499 380663 380969 380993 380447 379443 378488 378095 378223 378190 377238 375139 372092 368213 363439 357903
$$ packed form
53274A769461p909r736j1449j3379j5220j6688j7911j9118k0519k2326k4410k6011
53262A564785k6560k6663k7563k9584l1750l3007l3194l2807l2449l2688l3731
53251A224789l4961l5294l4240l2330l0423k8966k7945k7072k5978k4630k3566
53240H99384k3218k3111k2312k0792j9653j9746k0553k0837j9984j8401j6816
53229F73961j5439j3845j1696r594q750r481j0499j0456r748r816j0851j1498
53217E42288j1015j0357j0527j0976j0612r526q654q219p656o775o031n671n442
53204D30827n210n127n109m805m213l777l669l518l036k468k201k180k060j634
53190C81820r91l30J64L06K4n46j004r55l93J28l3r52k099l047l879m774n536
$$ plain form
53173 357903 352047 346270 340702 335425 330663 326663 323538 321267 319588 317898 315632 312872 310272 308259
53159 308259 306607 305002 303604 302733 302253 301647 300591 299149 297576 296158 295100 294280 293258 291837 290475
53144 290475 289836 290023 290585 291105 291428 291419 290977 290339 289984 290189 290921 292146 293765 295266 295975 295856 295598 295623 295483
53125 295483 294646 293525 293165 293985 295289 296041 295844 295121 294634 294889 295830 297020 298159 299330 300652 301946
53109 301946 303024 304184 305898 307991 309514 309705 308802 307699 307024 306816 306931 307372 308207 309404 310858 312451
53093 312451 313959 315057 315516 315433 315239 315472 316462 318059 319622 320383 320032 318977 317950 317323 316829 315925 314298
53076 314298 311952 308997 305637 302374 299903 298552 297909 297223 296164 295023 294192 293687 293238 292559 291440 289802
53060 289802 287844 286006 284556 283359 282242 281419 281223 281493 281644 281382 280979 280690 280282 279429 278318 277539 277471
$$ packed form
53173C57903n856n777n568n277m762m000l125k271j679j690k266k760k600k013
53159C08259j652j605j398q71m80o06j056j442j573j418j058q20j022j421j362
53144B90475o39J87N62N20L23rm42o38l55K05P32J225J619J501P09j19k58K5j40
53125B95483q37j121l60Q20J304P52j97p23m87K55R41J190J139J171J322J294
53109C01946J078J160J714K093J523J91r03j103o75k08J15M41Q35J197J454J593
53093C12451J508J098M59q3j94K33R90J597J563P61l51j055j027o27m94r04j627
53076C14298k346k955l360l263k471j351o43o86j059j141q31n05m49o79j119j638
53060B89802j958j838j450j197j117q23j96K70J51k62m03k89m08q53j111p79o8
$$ plain form
53043 277471 278051 279007 280048 280917 281581 282324 283309 284093 284026 283185 282486 282581 283069 283120 282572 281919 281375 280632 279649
53024 279649 279123 279759 281384 283137 284413 285260 285943 286577 287229 288008 288848 289495 289899 290400 291246 292177 292841 293412
53006 293412 294301 295306 295610 294802 293426 292259 291514 291109 291244 292102 293187 293700 293605 293734 294702 296212 297607
52989 297607 298646 299463 300181 300891 301750 302759 303669 304349 304952 305484 305507 304698 303492 302738 302838 303537 304412 305120
52971 305120 305280 304665 303644 303029 303327 304329 305500 306461 307069 307315 307285 307011 306342 305240 304148 303675 303822
52954 303822 303920 303504 302871 302474 302149 301331 299888 298325 297263 296935 297129 297287 296742 295222 293251 291779 291204
52937 291204 290884 289776 287564 284996 283085 282124 281610 281033 280443 280189 280387 280892 281554 282202 282519 282354 282088
52920 282088 282250 282786 283142 283087 282997 283208 283657 284359 285674 287688 289762 291185 291882 292077 291689 290695 289730 289463
$$ packed form
53043B77471N80R56J041Q69O64P43R85P84o7q41o99R5M88N1n48o53n44p43r83
53024B79649n26O36J625J753J276Q47O83O34O52P79Q40O47M04N01Q46R31O64N71
53006B93412Q89J005L04q08j376j167p45m05J35Q58J085N13r5J29R68J510J395
52989B97607J039Q17P18P10Q59J009R10O80O03N32K3q09j206p54J00O99Q75P08
52971C05120J60o15j021o15K98J002J171R61O08K46l0k74o69j102j092m73J47
52954C03822R8m16o33l97l25q18j443j563j062l28J94J58n45j520j971j472n75
52937B91204l20j108k212k568j911r61n14n77n90k54J98N05O62O48L17j65k66
52920B82088J62N36L56n5r0K11M49P02J315K014K074J423O97J95l88r94r65k67
$$ plain form
52902 289463 289429 288321 285655 282501 280277 279284 278819 278252 277559 276984 276644 276517 276598 277013 277978 279527 281274
52885 281274 282616 283302 283652 284125 284807 285395 285533 285028 283882 282290 280608 279197 278208 277498 276829 276235 276182
52868 276182 277118 278735 279969 280029 279256 278623 278502 278400 277867 277157 276808 276992 277501 278112 278682 279112 279391 279562
52850 279562 279514 279096 278553 278485 279062 279571 279099 277544 275664 274220 273386 272921 272543 272066 271417 270655 269878 269093
52832 269093 268237 267327 266538 266142 266376 267262 268485 269542 270129 270323 270359 270412 270661 271264 272035 272357 271786 270644
52814 270644 269730 269505 269895 270806 272404 274673 277089 279046 280510 282026 284171 287129 290648 294128 296814
52799 296814 298109 297799 295889 292363 287357 281561 276041 271413 267439 263687 260365 258073 256852 256029 255110
52784 255110 254287 253827 253507 253101 252971 253534 254373 254586 253966 253142 252542 251929 251200 250861 251230 251755 251766 251549 251999
$$ packed form
52902B89463l4j108k666l154k224r93m65n67o93n75l40j27Q1M15R65J549J747
52885B81274J342O86L50M73O82N88J38n05j146j592j682j411r89p10o69n94n3
52868B76182R36J617J234O0p73o33j21j02n33p10l49J84N09O11N70M30K79J71
52850B79562m8m18n43o8N77N09m72j555j880j444q34m65l78m77o49p62p77p85
52832B69093q56r10p89l96K34Q86J223J057N87J94L6N3K49O03P71L22n71j142
52814B70644r14k25L90R11J598K269K416J957J464J516K145K958L519L480K686
52799B96814J295l10j910l526n006n796n520m628l974l752l322k292j221q23r19
52784B55110q23m60l20m06j30N63Q39K13o20q24o00o13p29l39L69N25J1k17M50
$$ plain form
52765 251999 253350 254898 255999 256780 257730 258922 259903 260188 259739 259070 258845 259255 259807 259820 259093 258005 257158
52748 257158 257031 257701 258639 258951 258253 257198 256771 257155 257691 257930 258191 258913 259994 261076 262110 263200 264125
52731 264125 264518 264501 264635 265082 265195 264341 262919 262092 262406 263093 262995 261892 260557 259746 259627 260095 260963 261669
52713 261669 261425 260089 258505 257558 257255 257129 257079 257211 257192 256623 255913 255907 256543 256720 255893 255055 255559 257394 259243
52694 259243 260002 259685 258953 258348 258108 258286 258773 259352 259974 260947 262719 265322 268066 269944 270518 270311 270269 270890
52676 270890 272025 273325 274577 275698 276749 277971 279504 281013 282016 282618 283556 285308 287562 289753 291737
52661 291737 293646 295492 297320 299457 302054 304542 306101 306716 307312 308696 310706 312506 313464 313616 313542 313900
52645 313900 314868 315849 315920 314837 313445 312860 313245 313673 313249 312152 311406 311756 312989 314301 315058 315170 315018
$$ packed form
52765B51999J351J548J101P81R50J192R81K85m49o69k25M10N52J3p27j088q47
52748B57158j27O70R38L12o98j055m27L84N36K39K61P22J081J082J034J090R25
52731B64125L93j7J34M47J13q54j422q27L14O87r8j103j335q11j19M68Q68P06
52713B61669k44j336j584r47l03j26n0J32j9n69p10oO36J77q27q38N04J835J849
52694B59243P59l17p32o05k40J78M87N79O22R73J772K603K744J878N74k07m2O21
52676B70890J135J300J252J121J051J222J533J509J003O02R38J752K254K191J984
52661B91737J909J846J828K137K597K488J559O15N96J384K010J800R58J52p4L58
52645C13900R68R81P1j083j392n85L85M28m24j097p46L50J233J312P57J12j52
$$ plain form
52628 315018 315252 316470 318793 321760 324753 327479 329920 332033 333714 334887 335247 334075 330815 325902 320608
52613 320608 315976 312322 309758 308514 308382 308421 307874 307091 306985 307731 308574 308826 308501 307873 307015 306028 305306 305227
52595 305227 305688 306215 306461 306453 306426 306573 306917 307371 307875 308450 309123 309838 310503 311083 311597 312130 312857 313930 315235
52576 315235 316420 317296 318020 318677 318923 318358 317218 316308 316219 316850 317750 318655 319603 320698 321887 322914 323491
52559 323491 323617 323664 323994 324554 325044 325372 325669 325928 326025 326056 326268 326541 326380 325614 324794 324629 325332 326708 328524
52540 328524 330407 331674 331801 331099 330582 331016 332267 333541 334095 333752 332944 332307 332139 332304 332681 333403 334423
52523 334423 335185 335190 334768 334727 335219 335522 335144 334621 334882 336198 338100 340013 341634 342992 344570 347109 350710
52506 350710 354308 356621 357540 358002 358503 358477 357329 355318 352987 350380 347417 344537 342198 340062 337480
$$ packed form
52628C15018K34J218K323K967K993K726K441K113J681J173L60j172l260m913n294
52613C20608m632l654k564j244j32L9n47p83j06P46Q43K52l25o28q58r87p22p9
52595C05227M61N27K46qk7J47L44M54N04N75O73P15O65N80N14N33P27J073J305
52576C15235J185Q76P24O57K46n65j140r10q9O31R00R05R48J095J189J027N77
52559C23491J26M7L30N60M90L28K97K59R7L1K12K73j61p66q20j65P03J376J816
52540C28524J883J267J27p02n17M34J251J274N54l43q08o37j68J65L77P22J020
52523C34423P62Nm22m1M92L03l78n23K61J316J902J913J621J358J578K539L601
52506C50710L598K313R19M62N01k6j148k011k331k607k963k880k339k136k582
$$ plain form
52491 337480 334678 332621 331594 330696 329096 327156 325917 325889 326779 328005 329021 329457 329484 329905 331425 333848
52475 333848 336308 338183 339446 340233 340582 340651 340820 341353 342215 343256 344379 345503 346632 348063 350179 352901
52459 352901 355597 357728 359363 360875 362321 363403 363812 363388 362056 359980 357684 355623 353541 350628 346530
52444 346530 341992 338264 335998 334940 334481 334141 333521 332295 330578 329114 328726 329507 330712 331473 331461 330882
52428 330882 330090 329386 329104 329576 330862 332578 334197 335569 337004 338761 340609 342135 343387 344890 346967
52413 346967 349377 351749 354037 356345 358681 361279 364824 369822 375841 381889 387539 393257 399656 406867
52399 406867 414512 421683 426885 428769 427279 423605 418799 413012 406248 399063 391979 384943 378092 372439
52385 372439 368886 366878 365010 362878 361481 361788 363701 366474 369436 372126 374425 376775 379627 382529
$$ packed form
52491C37480k802k057j027q98j600j940j239k8Q90J226J016M36K7M21J520K423
52475C33848K460J875J263P87L49O9J69N33Q62J041J123J124J129J431K116K722
52459C52901K696K131J635J512J446J082M09m24j332k076k296k061k082k913m098
52444C46530m538l728k266j058m59l40o20j226j717j464l88P81J205P61j2n79
52428C30882p92p04k82M72J286J716J619J372J435J757J848J526J252J503K077
52413C46967K410K372K288K308K336K598L545M998O019O048N650N718O399P211
52399D06867P645P171N202J884j490l674m806n787o764p185p084p036o851n653
52385C72439l553k008j868k132j397L07J913K773K962K690K299K350K852K902
$$ plain form
52371 382529 384435 385181 385982 388076 391423 395142 398687 402089 405374 408289 410409 411261 410633 409012 407356
52356 407356 406149 405088 403992 403458 404092 405603 407288 409057 411244 413713 415991 418270 421444 425961 431305
52341 431305 436849 442643 449046 456015 463103 469927 476437 482996 490341 499150 509453 520701 532510
52328 532510 545032 558446 572568 587280 603011 620321 639101 658519 677721 696344 714475
52317 714475 732349 750053 767276 783452 798346 812396 826233 840011 853529 866867 880416
52306 880416 894241 907885 920957 933450 945249 955798 964703 972312 979180 985205 989924 993549 996909
52293 996909 1000186 1002355 1002350 1000275 996953 992705 987269 980754 973962 967662 962025 956986 952639 949093 946282
52278 946282 944209 943076 942980 943807 945631 948958 954170 960916 968443 976462 985348 995429 1006342 1017278
$$ packed form
52371C82529J906P46Q01K094L347L719L545L402L285K915K120Q52o28j621j656
52356D07356j207j061j096n34O34J511J685J769K187K469K278K279L174M517N344
52341D31305N544N794O403O969P088O824O510O559P345Q809J0303J1248J1809
52328E32510J2522J3414J4122J4712J5731J7310J8780J9418J9202J8623J8131
52317G14475J7874J7704J7223J6176J4894J4050J3837J3778J3518J3338J3549
52306H80416J3825J3644J3072J2493J1799J0549Q905P609O868O025M719L625L360
52293I96909L277K169nk075l322m248n436o515o792o300n637n039m347l546k811
52278I46282k073j133r6Q27J824L327N212O746P527Q019Q886J0081J0913J0936
$$ plain form
52264 1017278 1027746 1038009 1048745 1060313 1072421 1084556 1096600 1108791 1121105 1133048 1144154
52253 1144154 1154424 1164066 1173099 1181390 1188804 1195050 1199664 1202459 1203805 1204080 1203042 1200177 1195556 1189914
52239 1189914 1183885 1177602 1171058 1164487 1158245 1152616 1147775 1143642 1139746 1135582 1131197 1127064 1123332 1119633
52225 1119633 1115827 1112536 1110592 1110155 1110662 1111485 1112476 1114005 1116613 1120500 1125206 1130001 1134656 1139594 1145246
52210 1145246 1151518 1158049 1164573 1170852 1176648 1182136 1187977 1194554 1201439 1208022 1214403 1221071 1227981 1234593
52196 1234593 1240700 1246410 1251287 1254341 1255342 1255510 1256337 1258053 1259704 1260429 1260176 1259337 1258214 1256836 1254845
52181 1254845 1251516 1246301 1239553 1232436 1225906 1219896 1213628 1206665 1199454 1192825 1187034 1181511 1175710 1170110
52167 1170110 1166074 1164553 1165141 1166593 1168149 1170066 1172992 1177159 1182250 1187774 1193376 1198892 1204291 1209537
$$ packed form
52264A017278J0468J0263J0736J1568J2108J2135J2044J2191J2314J1943J1106
52253A144154J0270R642R033Q291P414O246M614K795J346K75j038k865m621n642
52239A189914o029o283o544o571o242n629m841m133l896m164m385m133l732l699
52225A119633l806l291j944m37N07Q23R91J529K608L887M706M795M655M938N652
52210A145246O272O531O524O279N796N488N841O577O885O583O381O668O910O612
52196A234593O107N710M877L054J001J68Q27J716J651P25k53q39j123j378j991
52181A254845l329n215o748p117o530o010o268o963p211o629n791n523n801n600
52167A170110m036j521N88J452J556J917K926M167N091N524N602N516N399N246
$$ plain form
52153 1209537 1214517 1219074 1223022 1226059 1227819 1228241 1227812 1227208 1226742 1226424 1226481 1227351 1228982 1230598 1231492 1231795
52137 1231795 1232066 1232340 1232111 1231263 1230552 1230974 1232926 1236212 1240652 1246407 1253781 1262951 1274003 1287039 1302143
52122 1302143 1319222 1337976 1358127 1379680 1402881 1427814 1454105 1481074 1508128 1534882 1560963
52111 1560963 1585923 1609465 1631609 1652453 1671775 1689017 1703763 1716198 1727011 1736800 1745656 1753312
52099 1753312 1759627 1764814 1769245 1773193 1776765 1779894 1782355 1783945 1784753 1785067 1784900 1783741 1781001 1776580 1770803
52084 1770803 1763954 1756172 1747834 1739757 1732881 1727851 1724929 1724216 1725930 1730470 1738025 1747932 1758645 1768821
52070 1768821 1778467 1788663 1800162 1812681 1825667 1839076 1852918 1866458 1878541 1888695 1897353 1904987
52058 1904987 1911579 1917089 1921900 1926312 1929895 1931876 1932136 1931358 1930009 1927587 1923158 1916443 1907916 1897950
$$ packed form
52153A209537M980M557L948L037J760M22m29o04m66l18N7Q70J631J616Q94L03
52137A231795K71K74k29q48p11M22J952L286M440N755P374R170J1052J3036J5104
52122A302143J7079J8754K0151K1553K3201K4933K6291K6969K7054K6754K6081
52111A560963K4960K3542K2144K0844J9322J7242J4746J2435J0813R789Q856P656
52099A753312O315N187M431L948L572L129K461J590Q08L14j67j159k740m421n777
52084A770803o849p782q338q077o876n030k922p13J714M540P555R907J0713J0176
52070A768821R646J0196J1499J2519J2986J3409J3842J3540J2083J0154Q658P634
52058A904987O592N510M811M412L583J981K60p78j349k422m429o715q527r966
$$ plain form
52044 1897950 1886370 1873062 1858580 1843740 1828827 1813663 1798363 1783478 1769352 1755827 1742860
52033 1742860 1730980 1720681 1711585 1702736 1693705 1684985 1677148 1669929 1662474 1654338 1645912 1637702 1629415
52020 1629415 1620060 1608997 1596609 1583817 1571194 1558763 1546393 1533956 1521222 1508076 1494878
52009 1494878 1482110 1469621 1456727 1443258 1429872 1416992 1403979 1389897 1374643 1358728 1342260
51998 1342260 1324805 1306069 1286041 1264651 1242057 1219288 1197817 1178236 1159953 1142398 1125834
51987 1125834 1110636 1096469 1082732 1069415 1056927 1045328 1034264 1023519 1013179 1003331 994024 985438
51975 985438 977656 970221 962256 953141 942969 932378 922115 912641 903882 895460 887427 880684 876284
$$ packed form
52044A897950j1580j3308j4482j4840j4913j5164j5300j4885j4126j3525j2967
52033A742860j1880j0299r096q849r031q720p837p219p455q136q426q210q287
52020A629415r355j1063j2388j2792j2623j2431j2370j2437j2734j3146j3198
52009A494878j2768j2489j2894j3469j3386j2880j3013j4082j5254j5915j6468
51998A342260j7455j8736k0028k1390k2594k2769k1471j9581j8283j7555j6564
51987A125834j5198j4167j3737j3317j2488j1599j1064j0745j0340r848r307q586
51975I85438p782p435p965r115j0172j0591j0263r474q759q422q033o743m400
$$ [...]
##END NTUPLES=NMR SPECTRUM
##END=
